Category,Jahr,Schweiz,ZH,BE,LU,UR,SZ,OW,NW,GL,ZG,FR,SO,BS,BL,SH,AR,AI,SG,GR,AG,TG,TI,VD,VS,NE,GE,JU
Straftaten - Total,2016,78240,16145,8356,3330,152,998,465,235,301,1027,2676,2959,3893,1433,1000,507,110,3585,1407,6761,2626,3576,7676,2789,2605,7088,705
Toetungsdelikte,2016,217,40,15,7,0,1,0,0,0,2,2,4,10,0,2,0,0,8,4,12,4,17,17,9,5,58,1
Schwere Koerperverletzung,2016,529,163,57,10,0,4,4,0,1,5,4,10,15,16,7,0,2,20,23,46,8,70,37,10,5,11,1
Einfache Koerperverletzung,2016,6736,1088,577,192,28,96,28,10,34,62,331,128,380,159,87,11,5,154,130,232,130,552,703,391,171,986,95
Taetlichkeiten,2016,10251,2253,946,321,13,88,47,33,53,182,282,603,428,178,84,47,7,338,161,656,327,155,1626,385,472,500,97
Total: Leib und Leben,2016,18848,3862,1666,557,44,195,82,61,99,268,668,776,942,371,201,63,15,612,317,1062,499,863,2345,815,660,1723,201
Diebstahl,2016,6658,1642,666,201,16,74,31,22,21,49,206,137,290,155,73,24,4,259,89,223,123,535,684,227,163,871,34
Raub,2016,1057,274,93,27,0,6,2,1,2,5,16,26,78,7,16,2,2,56,17,61,29,42,160,9,24,121,1
Sachbeschaedigung,2016,7651,1525,886,223,17,60,36,31,22,81,363,315,352,153,95,40,4,304,170,353,195,333,879,276,321,610,95
Erpressung,2016,345,69,24,9,0,3,7,1,3,3,10,11,17,3,2,1,0,13,11,14,6,39,27,13,5,37,2
Vergewaltigung,2016,495,142,67,19,3,3,2,1,2,6,15,18,22,10,5,1,0,19,9,28,15,16,25,20,12,29,6
