Index,alter,sicherheitsgefuehl,opfer
0001,20,68.582,1563
0002,25,70,3358
0003,30,73.183,2941
0004,35,73.683,2538
0005,40,73.9,2391
0006,45,74.098,3929
0007,50,73.9,2453
0008,55,72.1,1953
0009,60,71.259,1000
0010,65,71.8,700
0011,70,72.439,500
