Label, 2010, 2011, 2012, 2015, 2016
Taeter_Total gegen Leib und Leben_Prozent, 100, 93.5 , 93.3, 85.6, 87.6
Gefuehl_Total_Prozent, 100, 102.9, 101.8, 85.4, 87.6
Taeter_Total gegen Leib und Leben, 28237, 26395, 26351, 24184, 24722
Gefuehl_Total, 72.4, 74.5, 73.7, 61.8, 63.4
