%YAML 1.1
%TAG !u! tag:unity3d.com,2011:
--- !u!74 &7400000
AnimationClip:
  m_ObjectHideFlags: 0
  m_CorrespondingSourceObject: {fileID: 0}
  m_PrefabInstance: {fileID: 0}
  m_PrefabAsset: {fileID: 0}
  m_Name: New Animation
  serializedVersion: 7
  m_Legacy: 0
  m_Compressed: 0
  m_UseHighQualityCurve: 1
  m_RotationCurves: []
  m_CompressedRotationCurves: []
  m_EulerCurves: []
  m_PositionCurves: []
  m_ScaleCurves: []
  m_FloatCurves: []
  m_PPtrCurves:
  - curve:
    - time: 0
      value: {fileID: -1694548964, guid: b777ec7f71889dc498e808271c90c447, type: 3}
    - time: 0.083333336
      value: {fileID: -1463013801, guid: b777ec7f71889dc498e808271c90c447, type: 3}
    - time: 0.16666667
      value: {fileID: 2070470954, guid: b777ec7f71889dc498e808271c90c447, type: 3}
    - time: 0.25
      value: {fileID: -1196526644, guid: b777ec7f71889dc498e808271c90c447, type: 3}
    - time: 0.33333334
      value: {fileID: 459864687, guid: b777ec7f71889dc498e808271c90c447, type: 3}
    - time: 0.41666666
      value: {fileID: 1679818979, guid: b777ec7f71889dc498e808271c90c447, type: 3}
    - time: 0.5
      value: {fileID: -408965557, guid: b777ec7f71889dc498e808271c90c447, type: 3}
    - time: 0.5833333
      value: {fileID: 25879266, guid: b777ec7f71889dc498e808271c90c447, type: 3}
    - time: 0.6666667
      value: {fileID: 975922364, guid: b777ec7f71889dc498e808271c90c447, type: 3}
    - time: 0.75
      value: {fileID: -1529193575, guid: b777ec7f71889dc498e808271c90c447, type: 3}
    - time: 0.8333333
      value: {fileID: -432382566, guid: b777ec7f71889dc498e808271c90c447, type: 3}
    - time: 0.9166667
      value: {fileID: 1190535354, guid: b777ec7f71889dc498e808271c90c447, type: 3}
    - time: 1
      value: {fileID: 2017351120, guid: b777ec7f71889dc498e808271c90c447, type: 3}
    - time: 1.0833334
      value: {fileID: -962342879, guid: b777ec7f71889dc498e808271c90c447, type: 3}
    - time: 1.1666666
      value: {fileID: -1998884881, guid: b777ec7f71889dc498e808271c90c447, type: 3}
    - time: 1.25
      value: {fileID: -56823574, guid: b777ec7f71889dc498e808271c90c447, type: 3}
    - time: 1.3333334
      value: {fileID: -646190239, guid: b777ec7f71889dc498e808271c90c447, type: 3}
    - time: 1.4166666
      value: {fileID: -47376054, guid: b777ec7f71889dc498e808271c90c447, type: 3}
    - time: 1.5
      value: {fileID: -1226092654, guid: b777ec7f71889dc498e808271c90c447, type: 3}
    - time: 1.5833334
      value: {fileID: 2023475525, guid: b777ec7f71889dc498e808271c90c447, type: 3}
    - time: 1.6666666
      value: {fileID: 747999484, guid: b777ec7f71889dc498e808271c90c447, type: 3}
    - time: 1.75
      value: {fileID: -412461340, guid: b777ec7f71889dc498e808271c90c447, type: 3}
    - time: 1.8333334
      value: {fileID: 323117104, guid: b777ec7f71889dc498e808271c90c447, type: 3}
    - time: 1.9166666
      value: {fileID: 705909753, guid: b777ec7f71889dc498e808271c90c447, type: 3}
    - time: 2
      value: {fileID: -309123111, guid: b777ec7f71889dc498e808271c90c447, type: 3}
    - time: 2.0833333
      value: {fileID: 1574352573, guid: b777ec7f71889dc498e808271c90c447, type: 3}
    - time: 2.1666667
      value: {fileID: -1574371134, guid: b777ec7f71889dc498e808271c90c447, type: 3}
    - time: 2.25
      value: {fileID: -786002089, guid: b777ec7f71889dc498e808271c90c447, type: 3}
    - time: 2.3333333
      value: {fileID: 1715531, guid: b777ec7f71889dc498e808271c90c447, type: 3}
    - time: 2.4166667
      value: {fileID: -1924563455, guid: b777ec7f71889dc498e808271c90c447, type: 3}
    - time: 2.5
      value: {fileID: 2059125582, guid: b777ec7f71889dc498e808271c90c447, type: 3}
    - time: 2.5833333
      value: {fileID: 1299046654, guid: b777ec7f71889dc498e808271c90c447, type: 3}
    - time: 2.6666667
      value: {fileID: -5861557, guid: b777ec7f71889dc498e808271c90c447, type: 3}
    - time: 2.75
      value: {fileID: 352742904, guid: b777ec7f71889dc498e808271c90c447, type: 3}
    - time: 2.8333333
      value: {fileID: 356686948, guid: b777ec7f71889dc498e808271c90c447, type: 3}
    - time: 2.9166667
      value: {fileID: -153087474, guid: b777ec7f71889dc498e808271c90c447, type: 3}
    - time: 3
      value: {fileID: -1185278194, guid: b777ec7f71889dc498e808271c90c447, type: 3}
    - time: 3.0833333
      value: {fileID: -422804935, guid: b777ec7f71889dc498e808271c90c447, type: 3}
    - time: 3.1666667
      value: {fileID: -1618718600, guid: b777ec7f71889dc498e808271c90c447, type: 3}
    - time: 3.25
      value: {fileID: 611156461, guid: b777ec7f71889dc498e808271c90c447, type: 3}
    - time: 3.3333333
      value: {fileID: -409515791, guid: b777ec7f71889dc498e808271c90c447, type: 3}
    - time: 3.4166667
      value: {fileID: -1205344192, guid: b777ec7f71889dc498e808271c90c447, type: 3}
    - time: 3.5
      value: {fileID: 155343400, guid: b777ec7f71889dc498e808271c90c447, type: 3}
    - time: 3.5833333
      value: {fileID: 2146239141, guid: b777ec7f71889dc498e808271c90c447, type: 3}
    - time: 3.6666667
      value: {fileID: -2051431172, guid: b777ec7f71889dc498e808271c90c447, type: 3}
    - time: 3.75
      value: {fileID: -1427593303, guid: b777ec7f71889dc498e808271c90c447, type: 3}
    - time: 3.8333333
      value: {fileID: -1585985517, guid: b777ec7f71889dc498e808271c90c447, type: 3}
    - time: 3.9166667
      value: {fileID: -65448840, guid: b777ec7f71889dc498e808271c90c447, type: 3}
    - time: 4
      value: {fileID: -1511635275, guid: b777ec7f71889dc498e808271c90c447, type: 3}
    - time: 4.0833335
      value: {fileID: -998647615, guid: b777ec7f71889dc498e808271c90c447, type: 3}
    - time: 4.1666665
      value: {fileID: -1502879394, guid: b777ec7f71889dc498e808271c90c447, type: 3}
    - time: 4.25
      value: {fileID: -1969969908, guid: b777ec7f71889dc498e808271c90c447, type: 3}
    - time: 4.3333335
      value: {fileID: -1794980039, guid: b777ec7f71889dc498e808271c90c447, type: 3}
    - time: 4.4166665
      value: {fileID: 1559632317, guid: b777ec7f71889dc498e808271c90c447, type: 3}
    - time: 4.5
      value: {fileID: 968284553, guid: b777ec7f71889dc498e808271c90c447, type: 3}
    - time: 4.5833335
      value: {fileID: -2082128850, guid: b777ec7f71889dc498e808271c90c447, type: 3}
    - time: 4.6666665
      value: {fileID: -2016170301, guid: b777ec7f71889dc498e808271c90c447, type: 3}
    - time: 4.75
      value: {fileID: 85638805, guid: b777ec7f71889dc498e808271c90c447, type: 3}
    - time: 4.8333335
      value: {fileID: -2052425259, guid: b777ec7f71889dc498e808271c90c447, type: 3}
    - time: 4.9166665
      value: {fileID: -1975511333, guid: b777ec7f71889dc498e808271c90c447, type: 3}
    - time: 5
      value: {fileID: -697102574, guid: b777ec7f71889dc498e808271c90c447, type: 3}
    - time: 5.0833335
      value: {fileID: 1393346197, guid: b777ec7f71889dc498e808271c90c447, type: 3}
    - time: 5.1666665
      value: {fileID: -1008429493, guid: b777ec7f71889dc498e808271c90c447, type: 3}
    - time: 5.25
      value: {fileID: 81547720, guid: b777ec7f71889dc498e808271c90c447, type: 3}
    - time: 5.3333335
      value: {fileID: -472176992, guid: b777ec7f71889dc498e808271c90c447, type: 3}
    - time: 5.4166665
      value: {fileID: 612185158, guid: b777ec7f71889dc498e808271c90c447, type: 3}
    - time: 5.5
      value: {fileID: -2097607723, guid: b777ec7f71889dc498e808271c90c447, type: 3}
    - time: 5.5833335
      value: {fileID: 1786209127, guid: b777ec7f71889dc498e808271c90c447, type: 3}
    - time: 5.6666665
      value: {fileID: 751347274, guid: b777ec7f71889dc498e808271c90c447, type: 3}
    attribute: m_Sprite
    path: 
    classID: 212
    script: {fileID: 0}
  m_SampleRate: 12
  m_WrapMode: 0
  m_Bounds:
    m_Center: {x: 0, y: 0, z: 0}
    m_Extent: {x: 0, y: 0, z: 0}
  m_ClipBindingConstant:
    genericBindings:
    - serializedVersion: 2
      path: 0
      attribute: 0
      script: {fileID: 0}
      typeID: 212
      customType: 23
      isPPtrCurve: 1
      isIntCurve: 0
    pptrCurveMapping:
    - {fileID: -1694548964, guid: b777ec7f71889dc498e808271c90c447, type: 3}
    - {fileID: -1463013801, guid: b777ec7f71889dc498e808271c90c447, type: 3}
    - {fileID: 2070470954, guid: b777ec7f71889dc498e808271c90c447, type: 3}
    - {fileID: -1196526644, guid: b777ec7f71889dc498e808271c90c447, type: 3}
    - {fileID: 459864687, guid: b777ec7f71889dc498e808271c90c447, type: 3}
    - {fileID: 1679818979, guid: b777ec7f71889dc498e808271c90c447, type: 3}
    - {fileID: -408965557, guid: b777ec7f71889dc498e808271c90c447, type: 3}
    - {fileID: 25879266, guid: b777ec7f71889dc498e808271c90c447, type: 3}
    - {fileID: 975922364, guid: b777ec7f71889dc498e808271c90c447, type: 3}
    - {fileID: -1529193575, guid: b777ec7f71889dc498e808271c90c447, type: 3}
    - {fileID: -432382566, guid: b777ec7f71889dc498e808271c90c447, type: 3}
    - {fileID: 1190535354, guid: b777ec7f71889dc498e808271c90c447, type: 3}
    - {fileID: 2017351120, guid: b777ec7f71889dc498e808271c90c447, type: 3}
    - {fileID: -962342879, guid: b777ec7f71889dc498e808271c90c447, type: 3}
    - {fileID: -1998884881, guid: b777ec7f71889dc498e808271c90c447, type: 3}
    - {fileID: -56823574, guid: b777ec7f71889dc498e808271c90c447, type: 3}
    - {fileID: -646190239, guid: b777ec7f71889dc498e808271c90c447, type: 3}
    - {fileID: -47376054, guid: b777ec7f71889dc498e808271c90c447, type: 3}
    - {fileID: -1226092654, guid: b777ec7f71889dc498e808271c90c447, type: 3}
    - {fileID: 2023475525, guid: b777ec7f71889dc498e808271c90c447, type: 3}
    - {fileID: 747999484, guid: b777ec7f71889dc498e808271c90c447, type: 3}
    - {fileID: -412461340, guid: b777ec7f71889dc498e808271c90c447, type: 3}
    - {fileID: 323117104, guid: b777ec7f71889dc498e808271c90c447, type: 3}
    - {fileID: 705909753, guid: b777ec7f71889dc498e808271c90c447, type: 3}
    - {fileID: -309123111, guid: b777ec7f71889dc498e808271c90c447, type: 3}
    - {fileID: 1574352573, guid: b777ec7f71889dc498e808271c90c447, type: 3}
    - {fileID: -1574371134, guid: b777ec7f71889dc498e808271c90c447, type: 3}
    - {fileID: -786002089, guid: b777ec7f71889dc498e808271c90c447, type: 3}
    - {fileID: 1715531, guid: b777ec7f71889dc498e808271c90c447, type: 3}
    - {fileID: -1924563455, guid: b777ec7f71889dc498e808271c90c447, type: 3}
    - {fileID: 2059125582, guid: b777ec7f71889dc498e808271c90c447, type: 3}
    - {fileID: 1299046654, guid: b777ec7f71889dc498e808271c90c447, type: 3}
    - {fileID: -5861557, guid: b777ec7f71889dc498e808271c90c447, type: 3}
    - {fileID: 352742904, guid: b777ec7f71889dc498e808271c90c447, type: 3}
    - {fileID: 356686948, guid: b777ec7f71889dc498e808271c90c447, type: 3}
    - {fileID: -153087474, guid: b777ec7f71889dc498e808271c90c447, type: 3}
    - {fileID: -1185278194, guid: b777ec7f71889dc498e808271c90c447, type: 3}
    - {fileID: -422804935, guid: b777ec7f71889dc498e808271c90c447, type: 3}
    - {fileID: -1618718600, guid: b777ec7f71889dc498e808271c90c447, type: 3}
    - {fileID: 611156461, guid: b777ec7f71889dc498e808271c90c447, type: 3}
    - {fileID: -409515791, guid: b777ec7f71889dc498e808271c90c447, type: 3}
    - {fileID: -1205344192, guid: b777ec7f71889dc498e808271c90c447, type: 3}
    - {fileID: 155343400, guid: b777ec7f71889dc498e808271c90c447, type: 3}
    - {fileID: 2146239141, guid: b777ec7f71889dc498e808271c90c447, type: 3}
    - {fileID: -2051431172, guid: b777ec7f71889dc498e808271c90c447, type: 3}
    - {fileID: -1427593303, guid: b777ec7f71889dc498e808271c90c447, type: 3}
    - {fileID: -1585985517, guid: b777ec7f71889dc498e808271c90c447, type: 3}
    - {fileID: -65448840, guid: b777ec7f71889dc498e808271c90c447, type: 3}
    - {fileID: -1511635275, guid: b777ec7f71889dc498e808271c90c447, type: 3}
    - {fileID: -998647615, guid: b777ec7f71889dc498e808271c90c447, type: 3}
    - {fileID: -1502879394, guid: b777ec7f71889dc498e808271c90c447, type: 3}
    - {fileID: -1969969908, guid: b777ec7f71889dc498e808271c90c447, type: 3}
    - {fileID: -1794980039, guid: b777ec7f71889dc498e808271c90c447, type: 3}
    - {fileID: 1559632317, guid: b777ec7f71889dc498e808271c90c447, type: 3}
    - {fileID: 968284553, guid: b777ec7f71889dc498e808271c90c447, type: 3}
    - {fileID: -2082128850, guid: b777ec7f71889dc498e808271c90c447, type: 3}
    - {fileID: -2016170301, guid: b777ec7f71889dc498e808271c90c447, type: 3}
    - {fileID: 85638805, guid: b777ec7f71889dc498e808271c90c447, type: 3}
    - {fileID: -2052425259, guid: b777ec7f71889dc498e808271c90c447, type: 3}
    - {fileID: -1975511333, guid: b777ec7f71889dc498e808271c90c447, type: 3}
    - {fileID: -697102574, guid: b777ec7f71889dc498e808271c90c447, type: 3}
    - {fileID: 1393346197, guid: b777ec7f71889dc498e808271c90c447, type: 3}
    - {fileID: -1008429493, guid: b777ec7f71889dc498e808271c90c447, type: 3}
    - {fileID: 81547720, guid: b777ec7f71889dc498e808271c90c447, type: 3}
    - {fileID: -472176992, guid: b777ec7f71889dc498e808271c90c447, type: 3}
    - {fileID: 612185158, guid: b777ec7f71889dc498e808271c90c447, type: 3}
    - {fileID: -2097607723, guid: b777ec7f71889dc498e808271c90c447, type: 3}
    - {fileID: 1786209127, guid: b777ec7f71889dc498e808271c90c447, type: 3}
    - {fileID: 751347274, guid: b777ec7f71889dc498e808271c90c447, type: 3}
  m_AnimationClipSettings:
    serializedVersion: 2
    m_AdditiveReferencePoseClip: {fileID: 0}
    m_AdditiveReferencePoseTime: 0
    m_StartTime: 0
    m_StopTime: 5.75
    m_OrientationOffsetY: 0
    m_Level: 0
    m_CycleOffset: 0
    m_HasAdditiveReferencePose: 0
    m_LoopTime: 1
    m_LoopBlend: 0
    m_LoopBlendOrientation: 0
    m_LoopBlendPositionY: 0
    m_LoopBlendPositionXZ: 0
    m_KeepOriginalOrientation: 0
    m_KeepOriginalPositionY: 1
    m_KeepOriginalPositionXZ: 0
    m_HeightFromFeet: 0
    m_Mirror: 0
  m_EditorCurves: []
  m_EulerEditorCurves: []
  m_HasGenericRootTransform: 0
  m_HasMotionFloatCurves: 0
  m_Events: []
