%YAML 1.1
%TAG !u! tag:unity3d.com,2011:
--- !u!114 &11400000
MonoBehaviour:
  m_ObjectHideFlags: 32
  m_CorrespondingSourceObject: {fileID: 0}
  m_PrefabInstance: {fileID: 0}
  m_PrefabAsset: {fileID: 0}
  m_GameObject: {fileID: 0}
  m_Enabled: 1
  m_EditorHideFlags: 0
  m_Script: {fileID: 11500000, guid: eeb5e8291c3c44d44a1a07cb81e3e18b, type: 3}
  m_Name: PlayerData
  m_EditorClassIdentifier: 
  JumpStrength: 5
  ActualSpeed: 0
  NormalSpeed: 4
  SprintSpeed: 10.67
  playerController: {fileID: 0}
  playerBasicMovement: {fileID: 0}
  playerInteract: {fileID: 0}
  playerJump: {fileID: 0}
  playerCrouch: {fileID: 0}
  playerInput: {fileID: 0}
  characterController: {fileID: 0}
  animator: {fileID: 0}
