%YAML 1.1
%TAG !u! tag:unity3d.com,2011:
--- !u!114 &11400000
MonoBehaviour:
  m_ObjectHideFlags: 0
  m_CorrespondingSourceObject: {fileID: 0}
  m_PrefabInstance: {fileID: 0}
  m_PrefabAsset: {fileID: 0}
  m_GameObject: {fileID: 0}
  m_Enabled: 1
  m_EditorHideFlags: 0
  m_Script: {fileID: 11500000, guid: e93b6ff7ccf0cd84ea31a21b5ed031aa, type: 3}
  m_Name: Pistola2
  m_EditorClassIdentifier: 
  WeaponType: 1
  WeaponName: 
  Sprite: {fileID: 21300000, guid: 28d50d44fba49764bb92dd3ac5c21105, type: 3}
  ForceProjectiles: 15
  SpeedProjectiles: 8
  NumProjectiles: 200
  ShootCadence: 0.8
