Library\Bee\artifacts\mvdfrm\Unity.Burst.ref.dll_F30DFA20C0DD1968.mvfrm
Library\Bee\artifacts\mvdfrm\UnityEditor.TestRunner.ref.dll_193EC4CE382CBFB3.mvfrm
Library\Bee\artifacts\mvdfrm\UnityEditor.UI.ref.dll_4C98D3F7040CD4F5.mvfrm
Library\Bee\artifacts\mvdfrm\UnityEngine.TestRunner.ref.dll_E55D0F7C63F01D9E.mvfrm
Library\Bee\artifacts\mvdfrm\UnityEngine.UI.ref.dll_08FEAA520A2EFD60.mvfrm
Library\Bee\artifacts\mvdfrm\UnityEditor.Graphs.dll_E2C3408D8C9755F8.mvfrm
Library\Bee\artifacts\mvdfrm\UnityEditor.CoreModule.dll_2E962E95E26E11C6.mvfrm
Library\Bee\artifacts\mvdfrm\UnityEditor.DeviceSimulatorModule.dll_4CCA1007B41C10DB.mvfrm
Library\Bee\artifacts\mvdfrm\UnityEditor.DiagnosticsModule.dll_8C595AECDAC01469.mvfrm
Library\Bee\artifacts\mvdfrm\UnityEditor.dll_1F8365C08E19ACEF.mvfrm
Library\Bee\artifacts\mvdfrm\UnityEditor.GraphViewModule.dll_AF0C332582714520.mvfrm
Library\Bee\artifacts\mvdfrm\UnityEditor.PackageManagerUIModule.dll_141F595DE5FE23A2.mvfrm
Library\Bee\artifacts\mvdfrm\UnityEditor.QuickSearchModule.dll_1768DBFA339710C2.mvfrm
Library\Bee\artifacts\mvdfrm\UnityEditor.SceneTemplateModule.dll_41F86988B918DB83.mvfrm
Library\Bee\artifacts\mvdfrm\UnityEditor.TextCoreFontEngineModule.dll_CA146C2E537D6C84.mvfrm
Library\Bee\artifacts\mvdfrm\UnityEditor.TextCoreTextEngineModule.dll_11FCA29FE30125A2.mvfrm
Library\Bee\artifacts\mvdfrm\UnityEditor.UIBuilderModule.dll_0394E041F529BE54.mvfrm
Library\Bee\artifacts\mvdfrm\UnityEditor.UIElementsModule.dll_49C7785718F96742.mvfrm
Library\Bee\artifacts\mvdfrm\UnityEditor.UIElementsSamplesModule.dll_C4DB3354C295A44B.mvfrm
Library\Bee\artifacts\mvdfrm\UnityEditor.UIServiceModule.dll_3C86F1A4DE610E6E.mvfrm
Library\Bee\artifacts\mvdfrm\UnityEditor.UnityConnectModule.dll_60B4202BC465A37C.mvfrm
Library\Bee\artifacts\mvdfrm\UnityEngine.AccessibilityModule.dll_749DD51FB98F0320.mvfrm
Library\Bee\artifacts\mvdfrm\UnityEngine.AIModule.dll_79DB8432E5D2635A.mvfrm
Library\Bee\artifacts\mvdfrm\UnityEngine.AndroidJNIModule.dll_C810612A6218D618.mvfrm
Library\Bee\artifacts\mvdfrm\UnityEngine.AnimationModule.dll_7D91AF4E5CCE19C6.mvfrm
Library\Bee\artifacts\mvdfrm\UnityEngine.ARModule.dll_334E493642EFC223.mvfrm
Library\Bee\artifacts\mvdfrm\UnityEngine.AssetBundleModule.dll_5B520EEB95FDC5B4.mvfrm
Library\Bee\artifacts\mvdfrm\UnityEngine.AudioModule.dll_763D408C3B9A9938.mvfrm
Library\Bee\artifacts\mvdfrm\UnityEngine.ClothModule.dll_DD259D8715B7781C.mvfrm
Library\Bee\artifacts\mvdfrm\UnityEngine.ClusterInputModule.dll_E050954175ED7642.mvfrm
Library\Bee\artifacts\mvdfrm\UnityEngine.ClusterRendererModule.dll_5276D27923D71E5F.mvfrm
Library\Bee\artifacts\mvdfrm\UnityEngine.CoreModule.dll_51B701E88A737CF1.mvfrm
Library\Bee\artifacts\mvdfrm\UnityEngine.CrashReportingModule.dll_4E2C7D7401E31129.mvfrm
Library\Bee\artifacts\mvdfrm\UnityEngine.DirectorModule.dll_CFB4F834C5FAFF4E.mvfrm
Library\Bee\artifacts\mvdfrm\UnityEngine.dll_5227AC98EC8D39D4.mvfrm
Library\Bee\artifacts\mvdfrm\UnityEngine.DSPGraphModule.dll_D506599E385BD06F.mvfrm
Library\Bee\artifacts\mvdfrm\UnityEngine.GameCenterModule.dll_F25DAB452859C709.mvfrm
Library\Bee\artifacts\mvdfrm\UnityEngine.GIModule.dll_1217CD4081814B74.mvfrm
Library\Bee\artifacts\mvdfrm\UnityEngine.GridModule.dll_2F281DD6A2C812E8.mvfrm
Library\Bee\artifacts\mvdfrm\UnityEngine.HotReloadModule.dll_FEDA6D5438013548.mvfrm
Library\Bee\artifacts\mvdfrm\UnityEngine.ImageConversionModule.dll_BE68D029A5FBD653.mvfrm
Library\Bee\artifacts\mvdfrm\UnityEngine.IMGUIModule.dll_AE9CDFF301CC2D19.mvfrm
Library\Bee\artifacts\mvdfrm\UnityEngine.InputLegacyModule.dll_EC972A0A2DEF7BA5.mvfrm
Library\Bee\artifacts\mvdfrm\UnityEngine.InputModule.dll_DCB3083CB1D2BDDC.mvfrm
Library\Bee\artifacts\mvdfrm\UnityEngine.JSONSerializeModule.dll_D4B55E5BB8CA63AA.mvfrm
Library\Bee\artifacts\mvdfrm\UnityEngine.LocalizationModule.dll_1E9D5F940D69693B.mvfrm
Library\Bee\artifacts\mvdfrm\UnityEngine.NVIDIAModule.dll_2B4E55757326297D.mvfrm
Library\Bee\artifacts\mvdfrm\UnityEngine.ParticleSystemModule.dll_A13EC6C06FF49CB7.mvfrm
Library\Bee\artifacts\mvdfrm\UnityEngine.PerformanceReportingModule.dll_80E7133580F242B0.mvfrm
Library\Bee\artifacts\mvdfrm\UnityEngine.Physics2DModule.dll_CA379F3EFDCB115B.mvfrm
Library\Bee\artifacts\mvdfrm\UnityEngine.PhysicsModule.dll_D6C1A82254F21B09.mvfrm
Library\Bee\artifacts\mvdfrm\UnityEngine.ProfilerModule.dll_01FB316B5F54865B.mvfrm
Library\Bee\artifacts\mvdfrm\UnityEngine.RuntimeInitializeOnLoadManagerInitializerModule.dll_CF8DE1BAA53FB824.mvfrm
Library\Bee\artifacts\mvdfrm\UnityEngine.ScreenCaptureModule.dll_EE9D0BE0CD36900C.mvfrm
Library\Bee\artifacts\mvdfrm\UnityEngine.SharedInternalsModule.dll_427A0EFF1D29D1A3.mvfrm
Library\Bee\artifacts\mvdfrm\UnityEngine.SpriteMaskModule.dll_DB8A1DD549C95C83.mvfrm
Library\Bee\artifacts\mvdfrm\UnityEngine.SpriteShapeModule.dll_74B33C464B9FFDBE.mvfrm
Library\Bee\artifacts\mvdfrm\UnityEngine.StreamingModule.dll_32269C9EAC55D104.mvfrm
Library\Bee\artifacts\mvdfrm\UnityEngine.SubstanceModule.dll_0ED1B0E7F7A8CF12.mvfrm
Library\Bee\artifacts\mvdfrm\UnityEngine.SubsystemsModule.dll_4637843718114496.mvfrm
Library\Bee\artifacts\mvdfrm\UnityEngine.TerrainModule.dll_F10823912AB063F7.mvfrm
Library\Bee\artifacts\mvdfrm\UnityEngine.TerrainPhysicsModule.dll_A1B96F9389379744.mvfrm
Library\Bee\artifacts\mvdfrm\UnityEngine.TextCoreFontEngineModule.dll_4873E781667B2B4F.mvfrm
Library\Bee\artifacts\mvdfrm\UnityEngine.TextCoreTextEngineModule.dll_905C1DF2F5FEE46D.mvfrm
Library\Bee\artifacts\mvdfrm\UnityEngine.TextRenderingModule.dll_17DC7DEB846E1001.mvfrm
Library\Bee\artifacts\mvdfrm\UnityEngine.TilemapModule.dll_90048B12426D4500.mvfrm
Library\Bee\artifacts\mvdfrm\UnityEngine.TLSModule.dll_8110165CB405019D.mvfrm
Library\Bee\artifacts\mvdfrm\UnityEngine.UIElementsModule.dll_4A75E59F1B3D808D.mvfrm
Library\Bee\artifacts\mvdfrm\UnityEngine.UIElementsNativeModule.dll_5E990DF3577693C4.mvfrm
Library\Bee\artifacts\mvdfrm\UnityEngine.UIModule.dll_754F226042196906.mvfrm
Library\Bee\artifacts\mvdfrm\UnityEngine.UmbraModule.dll_F111ECA4C8C144AB.mvfrm
Library\Bee\artifacts\mvdfrm\UnityEngine.UNETModule.dll_E45D49D1D782726A.mvfrm
Library\Bee\artifacts\mvdfrm\UnityEngine.UnityAnalyticsCommonModule.dll_1C25D0799ADAE10E.mvfrm
Library\Bee\artifacts\mvdfrm\UnityEngine.UnityAnalyticsModule.dll_C0DE378A1C1BEEB3.mvfrm
Library\Bee\artifacts\mvdfrm\UnityEngine.UnityConnectModule.dll_4E13A43ABEEDA427.mvfrm
Library\Bee\artifacts\mvdfrm\UnityEngine.UnityCurlModule.dll_B0AE507FCCE20BB3.mvfrm
Library\Bee\artifacts\mvdfrm\UnityEngine.UnityTestProtocolModule.dll_809DE9471C90F9A1.mvfrm
Library\Bee\artifacts\mvdfrm\UnityEngine.UnityWebRequestAssetBundleModule.dll_49D8BE81DCBB5FC4.mvfrm
Library\Bee\artifacts\mvdfrm\UnityEngine.UnityWebRequestAudioModule.dll_F8E36714075D0D48.mvfrm
Library\Bee\artifacts\mvdfrm\UnityEngine.UnityWebRequestModule.dll_D007D7D3B0F070D2.mvfrm
Library\Bee\artifacts\mvdfrm\UnityEngine.UnityWebRequestTextureModule.dll_226EFEAB89FD9C1D.mvfrm
Library\Bee\artifacts\mvdfrm\UnityEngine.UnityWebRequestWWWModule.dll_5B1E634EE5BEA0D9.mvfrm
Library\Bee\artifacts\mvdfrm\UnityEngine.VehiclesModule.dll_4777F1B44024CEE9.mvfrm
Library\Bee\artifacts\mvdfrm\UnityEngine.VFXModule.dll_01EEAECB8A726B0A.mvfrm
Library\Bee\artifacts\mvdfrm\UnityEngine.VideoModule.dll_9B46C4F6FE2CB4DD.mvfrm
Library\Bee\artifacts\mvdfrm\UnityEngine.VirtualTexturingModule.dll_8325C2623025144F.mvfrm
Library\Bee\artifacts\mvdfrm\UnityEngine.VRModule.dll_C82148E5E3D3EE7E.mvfrm
Library\Bee\artifacts\mvdfrm\UnityEngine.WindModule.dll_C805DD111BA9FB5A.mvfrm
Library\Bee\artifacts\mvdfrm\UnityEngine.XRModule.dll_FAE00BEA6D0E3BDC.mvfrm
Library\Bee\artifacts\mvdfrm\UnityEditor.WebGL.Extensions.dll_B256BBE1E2EAF84A.mvfrm
Library\Bee\artifacts\mvdfrm\UnityEditor.WindowsStandalone.Extensions.dll_BD6FBDFED701123A.mvfrm
Library\Bee\artifacts\mvdfrm\Unity.Burst.Cecil.dll_C57321124F881E3C.mvfrm
Library\Bee\artifacts\mvdfrm\Unity.Burst.Cecil.Mdb.dll_5735D46A61F71079.mvfrm
Library\Bee\artifacts\mvdfrm\Unity.Burst.Cecil.Pdb.dll_6E884CD9E0AC11FC.mvfrm
Library\Bee\artifacts\mvdfrm\Unity.Burst.Cecil.Rocks.dll_99AF344A6E42E99C.mvfrm
Library\Bee\artifacts\mvdfrm\Unity.Burst.Unsafe.dll_CF6E3A0808E30D97.mvfrm
Library\Bee\artifacts\mvdfrm\Unity.Plastic.Antlr3.Runtime.dll_6A83A87D79299143.mvfrm
Library\Bee\artifacts\mvdfrm\Unity.Plastic.Newtonsoft.Json.dll_A959714C32BC7A42.mvfrm
Library\Bee\artifacts\mvdfrm\Unity.VisualScripting.IonicZip.dll_18E0D8DE011660FC.mvfrm
Library\Bee\artifacts\mvdfrm\Unity.VisualScripting.YamlDotNet.dll_2550D62CE902E240.mvfrm
Library\Bee\artifacts\mvdfrm\Unity.VisualScripting.TextureAssets.dll_BC6EFF80A9D04038.mvfrm
Library\Bee\artifacts\mvdfrm\Unity.VisualScripting.Antlr3.Runtime.dll_D6BDFD0E19CBF25F.mvfrm