%YAML 1.1
%TAG !u! tag:unity3d.com,2011:
--- !u!1045 &1
EditorBuildSettings:
  m_ObjectHideFlags: 0
  serializedVersion: 2
  m_Scenes:
  - enabled: 1
    path: Assets/Scenes/StartScreen.unity
    guid: a8e64312cd07dda4e8539a025dcc0653
  - enabled: 1
    path: Assets/Scenes/GameScene1.unity
    guid: c1687ce5e4d42ea4384293e8cc331094
  - enabled: 1
    path: Assets/Scenes/GameOverScreen.unity
    guid: ab5139e6a6ca8e0428f2181c51f9d28d
  - enabled: 1
    path: Assets/Scenes/GameScene2.unity
    guid: 2c06616a5e5d1d04680f79c39324b6e3
  m_configObjects: {}
