%YAML 1.1
%TAG !u! tag:unity3d.com,2011:
--- !u!1001 &755032786011075670
PrefabInstance:
  m_ObjectHideFlags: 0
  serializedVersion: 2
  m_Modification:
    m_TransformParent: {fileID: 0}
    m_Modifications:
    - target: {fileID: 1162934723168542, guid: 80936324c84277d498ccd724f0e55e94, type: 3}
      propertyPath: m_Name
      value: fireball-blue-tail-small
      objectReference: {fileID: 0}
    - target: {fileID: 4736677845459218, guid: 80936324c84277d498ccd724f0e55e94, type: 3}
      propertyPath: m_LocalPosition.x
      value: -13.02
      objectReference: {fileID: 0}
    - target: {fileID: 4736677845459218, guid: 80936324c84277d498ccd724f0e55e94, type: 3}
      propertyPath: m_LocalPosition.y
      value: -6.09
      objectReference: {fileID: 0}
    - target: {fileID: 4736677845459218, guid: 80936324c84277d498ccd724f0e55e94, type: 3}
      propertyPath: m_LocalPosition.z
      value: 0
      objectReference: {fileID: 0}
    - target: {fileID: 4736677845459218, guid: 80936324c84277d498ccd724f0e55e94, type: 3}
      propertyPath: m_LocalRotation.x
      value: 0
      objectReference: {fileID: 0}
    - target: {fileID: 4736677845459218, guid: 80936324c84277d498ccd724f0e55e94, type: 3}
      propertyPath: m_LocalRotation.y
      value: 0
      objectReference: {fileID: 0}
    - target: {fileID: 4736677845459218, guid: 80936324c84277d498ccd724f0e55e94, type: 3}
      propertyPath: m_LocalRotation.z
      value: 0
      objectReference: {fileID: 0}
    - target: {fileID: 4736677845459218, guid: 80936324c84277d498ccd724f0e55e94, type: 3}
      propertyPath: m_LocalRotation.w
      value: 1
      objectReference: {fileID: 0}
    - target: {fileID: 4736677845459218, guid: 80936324c84277d498ccd724f0e55e94, type: 3}
      propertyPath: m_RootOrder
      value: 0
      objectReference: {fileID: 0}
    - target: {fileID: 4736677845459218, guid: 80936324c84277d498ccd724f0e55e94, type: 3}
      propertyPath: m_LocalEulerAnglesHint.x
      value: 0
      objectReference: {fileID: 0}
    - target: {fileID: 4736677845459218, guid: 80936324c84277d498ccd724f0e55e94, type: 3}
      propertyPath: m_LocalEulerAnglesHint.y
      value: 0
      objectReference: {fileID: 0}
    - target: {fileID: 4736677845459218, guid: 80936324c84277d498ccd724f0e55e94, type: 3}
      propertyPath: m_LocalEulerAnglesHint.z
      value: 0
      objectReference: {fileID: 0}
    m_RemovedComponents: []
  m_SourcePrefab: {fileID: 100100000, guid: 80936324c84277d498ccd724f0e55e94, type: 3}
