Library\Bee\artifacts\mvdfrm\UnityEditor.Graphs.dll_25366F23B35C4B04.mvfrm
Library\Bee\artifacts\mvdfrm\UnityEditor.CoreModule.dll_75360913FB1312D2.mvfrm
Library\Bee\artifacts\mvdfrm\UnityEditor.DeviceSimulatorModule.dll_D2620C624A8DB18F.mvfrm
Library\Bee\artifacts\mvdfrm\UnityEditor.DiagnosticsModule.dll_F87743E5779C681D.mvfrm
Library\Bee\artifacts\mvdfrm\UnityEditor.dll_BDDD67A5C0345E23.mvfrm
Library\Bee\artifacts\mvdfrm\UnityEditor.GraphViewModule.dll_8D9D236F53622A54.mvfrm
Library\Bee\artifacts\mvdfrm\UnityEditor.PackageManagerUIModule.dll_DE59E2D747230DAE.mvfrm
Library\Bee\artifacts\mvdfrm\UnityEditor.QuickSearchModule.dll_8386C4F2D0736476.mvfrm
Library\Bee\artifacts\mvdfrm\UnityEditor.SceneTemplateModule.dll_8CBCA86E6C776DB7.mvfrm
Library\Bee\artifacts\mvdfrm\UnityEditor.TextCoreFontEngineModule.dll_5EA340CE35755010.mvfrm
Library\Bee\artifacts\mvdfrm\UnityEditor.TextCoreTextEngineModule.dll_A68B773FC4F9092E.mvfrm
Library\Bee\artifacts\mvdfrm\UnityEditor.UIBuilderModule.dll_E225D08BC61AA388.mvfrm
Library\Bee\artifacts\mvdfrm\UnityEditor.UIElementsModule.dll_A59A6B9E570E84CE.mvfrm
Library\Bee\artifacts\mvdfrm\UnityEditor.UIElementsSamplesModule.dll_DD154CC0EDE5237F.mvfrm
Library\Bee\artifacts\mvdfrm\UnityEditor.UIServiceModule.dll_1B17E1EEAF51F3A2.mvfrm
Library\Bee\artifacts\mvdfrm\UnityEditor.UnityConnectModule.dll_A0F9CC2C115F2A88.mvfrm
Library\Bee\artifacts\mvdfrm\UnityEngine.AccessibilityModule.dll_BF6214056CED9554.mvfrm
Library\Bee\artifacts\mvdfrm\UnityEngine.AIModule.dll_4F24E1E229E7BAE6.mvfrm
Library\Bee\artifacts\mvdfrm\UnityEngine.AndroidJNIModule.dll_23E35471A02DF3A4.mvfrm
Library\Bee\artifacts\mvdfrm\UnityEngine.AnimationModule.dll_5C229F982DBEFEFA.mvfrm
Library\Bee\artifacts\mvdfrm\UnityEngine.ARModule.dll_0897A6E5870519AF.mvfrm
Library\Bee\artifacts\mvdfrm\UnityEngine.AssetBundleModule.dll_C76FF7E432DA1968.mvfrm
Library\Bee\artifacts\mvdfrm\UnityEngine.AudioModule.dll_4AD5D1EBCCD1116C.mvfrm
Library\Bee\artifacts\mvdfrm\UnityEngine.ClothModule.dll_B1BE2EE6A6EDF050.mvfrm
Library\Bee\artifacts\mvdfrm\UnityEngine.ClusterInputModule.dll_20964141C2E6FD4E.mvfrm
Library\Bee\artifacts\mvdfrm\UnityEngine.ClusterRendererModule.dll_D80ECED3BA48BF13.mvfrm
Library\Bee\artifacts\mvdfrm\UnityEngine.CoreModule.dll_9856DC66A3187DFD.mvfrm
Library\Bee\artifacts\mvdfrm\UnityEngine.CrashReportingModule.dll_A558BA48921531B5.mvfrm
Library\Bee\artifacts\mvdfrm\UnityEngine.DirectorModule.dll_1A4B38E300D9E35A.mvfrm
Library\Bee\artifacts\mvdfrm\UnityEngine.dll_F081AE7E1EA7EB08.mvfrm
Library\Bee\artifacts\mvdfrm\UnityEngine.DSPGraphModule.dll_1F9C9A4C733AB47B.mvfrm
Library\Bee\artifacts\mvdfrm\UnityEngine.GameCenterModule.dll_4E309E8C666EE495.mvfrm
Library\Bee\artifacts\mvdfrm\UnityEngine.GIModule.dll_E7612AEFC596A300.mvfrm
Library\Bee\artifacts\mvdfrm\UnityEngine.GridModule.dll_75C7F854BB6D13F4.mvfrm
Library\Bee\artifacts\mvdfrm\UnityEngine.HotReloadModule.dll_DD6B5D9E08F21A7C.mvfrm
Library\Bee\artifacts\mvdfrm\UnityEngine.ImageConversionModule.dll_4400CC843C6D7707.mvfrm
Library\Bee\artifacts\mvdfrm\UnityEngine.IMGUIModule.dll_833571529302A54D.mvfrm
Library\Bee\artifacts\mvdfrm\UnityEngine.InputLegacyModule.dll_58B51302CACBCF59.mvfrm
Library\Bee\artifacts\mvdfrm\UnityEngine.InputModule.dll_B14B999C43093610.mvfrm
Library\Bee\artifacts\mvdfrm\UnityEngine.JSONSerializeModule.dll_1F799D416C28F5DE.mvfrm
Library\Bee\artifacts\mvdfrm\UnityEngine.LocalizationModule.dll_5EE30B945A62F047.mvfrm
Library\Bee\artifacts\mvdfrm\UnityEngine.ParticleSystemModule.dll_F86B03950026BD43.mvfrm
Library\Bee\artifacts\mvdfrm\UnityEngine.PerformanceReportingModule.dll_B3D2E30F16834FBC.mvfrm
Library\Bee\artifacts\mvdfrm\UnityEngine.Physics2DModule.dll_A8C88F88CEBBF68F.mvfrm
Library\Bee\artifacts\mvdfrm\UnityEngine.PhysicsModule.dll_CAF772919DD461BD.mvfrm
Library\Bee\artifacts\mvdfrm\UnityEngine.ProfilerModule.dll_4C9172199A336A67.mvfrm
Library\Bee\artifacts\mvdfrm\UnityEngine.RuntimeInitializeOnLoadManagerInitializerModule.dll_422D2D8499790558.mvfrm
Library\Bee\artifacts\mvdfrm\UnityEngine.ScreenCaptureModule.dll_39614AC680952240.mvfrm
Library\Bee\artifacts\mvdfrm\UnityEngine.SharedInternalsModule.dll_C8120B59B39B7257.mvfrm
Library\Bee\artifacts\mvdfrm\UnityEngine.SpriteMaskModule.dll_375D111C87DE7A0F.mvfrm
Library\Bee\artifacts\mvdfrm\UnityEngine.SpriteShapeModule.dll_E0D1253EE87C5172.mvfrm
Library\Bee\artifacts\mvdfrm\UnityEngine.StreamingModule.dll_10B78CE87D46B638.mvfrm
Library\Bee\artifacts\mvdfrm\UnityEngine.SubstanceModule.dll_ED62A131C899B446.mvfrm
Library\Bee\artifacts\mvdfrm\UnityEngine.SubsystemsModule.dll_A20A777E56266222.mvfrm
Library\Bee\artifacts\mvdfrm\UnityEngine.TerrainModule.dll_E53DEE007392AAAB.mvfrm
Library\Bee\artifacts\mvdfrm\UnityEngine.TerrainPhysicsModule.dll_F8E5AC681969B7D0.mvfrm
Library\Bee\artifacts\mvdfrm\UnityEngine.TextCoreFontEngineModule.dll_DD02BC2148730EDB.mvfrm
Library\Bee\artifacts\mvdfrm\UnityEngine.TextCoreTextEngineModule.dll_24EAF292D7F6C7F9.mvfrm
Library\Bee\artifacts\mvdfrm\UnityEngine.TextRenderingModule.dll_62A0BCD137CCA235.mvfrm
Library\Bee\artifacts\mvdfrm\UnityEngine.TilemapModule.dll_843A55818B4F8BB4.mvfrm
Library\Bee\artifacts\mvdfrm\UnityEngine.TLSModule.dll_1454451C95B87B51.mvfrm
Library\Bee\artifacts\mvdfrm\UnityEngine.UIElementsModule.dll_A648D8E659529E19.mvfrm
Library\Bee\artifacts\mvdfrm\UnityEngine.UIElementsNativeModule.dll_28D3976CB89B7DD0.mvfrm
Library\Bee\artifacts\mvdfrm\UnityEngine.UIModule.dll_4A98800F862EC092.mvfrm
Library\Bee\artifacts\mvdfrm\UnityEngine.UmbraModule.dll_C5AA7E0459F7BCDF.mvfrm
Library\Bee\artifacts\mvdfrm\UnityEngine.UNETModule.dll_2AFD244FF0277376.mvfrm
Library\Bee\artifacts\mvdfrm\UnityEngine.UnityAnalyticsModule.dll_180A745EAC4E0F3F.mvfrm
Library\Bee\artifacts\mvdfrm\UnityEngine.UnityConnectModule.dll_8E59503B0BE72B33.mvfrm
Library\Bee\artifacts\mvdfrm\UnityEngine.UnityCurlModule.dll_8F3F40C99DD2F0E7.mvfrm
Library\Bee\artifacts\mvdfrm\UnityEngine.UnityTestProtocolModule.dll_98D802B347E078D5.mvfrm
Library\Bee\artifacts\mvdfrm\UnityEngine.UnityWebRequestAssetBundleModule.dll_5E91E864FDF90950.mvfrm
Library\Bee\artifacts\mvdfrm\UnityEngine.UnityWebRequestAudioModule.dll_2BCF36ED9CEE1A54.mvfrm
Library\Bee\artifacts\mvdfrm\UnityEngine.UnityWebRequestModule.dll_559FD42E47621186.mvfrm
Library\Bee\artifacts\mvdfrm\UnityEngine.UnityWebRequestTextureModule.dll_476C6F2B819402A9.mvfrm
Library\Bee\artifacts\mvdfrm\UnityEngine.UnityWebRequestWWWModule.dll_EFAD37EEC7B68465.mvfrm
Library\Bee\artifacts\mvdfrm\UnityEngine.VehiclesModule.dll_920E32627B03B2F5.mvfrm
Library\Bee\artifacts\mvdfrm\UnityEngine.VFXModule.dll_9532DD8B6C25E4BE.mvfrm
Library\Bee\artifacts\mvdfrm\UnityEngine.VideoModule.dll_6FDF56568F632D11.mvfrm
Library\Bee\artifacts\mvdfrm\UnityEngine.VirtualTexturingModule.dll_4D604BDB9149FE5B.mvfrm
Library\Bee\artifacts\mvdfrm\UnityEngine.VRModule.dll_9D6AA69527E9460A.mvfrm
Library\Bee\artifacts\mvdfrm\UnityEngine.WindModule.dll_0EA5B78F344EFC66.mvfrm
Library\Bee\artifacts\mvdfrm\UnityEngine.XRModule.dll_D0296999B1239368.mvfrm
Library\Bee\artifacts\mvdfrm\Unity.Android.Gradle.dll_36570A041A4AC5BA.mvfrm
Library\Bee\artifacts\mvdfrm\Unity.Android.Types.dll_F22AD06022AF7D22.mvfrm
Library\Bee\artifacts\mvdfrm\UnityEditor.Android.Extensions.dll_71E061BB7D404A3A.mvfrm
Library\Bee\artifacts\mvdfrm\UnityEditor.LinuxStandalone.Extensions.dll_DA04A88071E7EB9E.mvfrm
Library\Bee\artifacts\mvdfrm\UnityEditor.UWP.Extensions.dll_704BB516336BFAD9.mvfrm
Library\Bee\artifacts\mvdfrm\UnityEditor.WebGL.Extensions.dll_A13677D5855D25FE.mvfrm
Library\Bee\artifacts\mvdfrm\UnityEditor.WindowsStandalone.Extensions.dll_5A10C01BA9C2CDEE.mvfrm