module gitlab.com/gitlab-de/tutorials/security-and-governance/custom-scanner-integration/fern-pattern-scanner

go 1.20

require (
	github.com/sirupsen/logrus v1.9.2
	github.com/urfave/cli/v2 v2.25.3
	gopkg.in/yaml.v2 v2.4.0
)

require (
	github.com/cpuguy83/go-md2man/v2 v2.0.2 // indirect
	github.com/russross/blackfriday/v2 v2.1.0 // indirect
	github.com/xrash/smetrics v0.0.0-20201216005158-039620a65673 // indirect
	golang.org/x/sys v0.0.0-20220715151400-c0bba94af5f8 // indirect
)
