,Date,Close,VWAP,Open,Volume,High,Low
0,2014/08/25,1670.0,1654.761,1650.0,92000,1673.0,1625.0
1,2014/08/26,1644.0,1653.731,1677.0,84400,1677.0,1641.0
2,2014/08/27,1621.0,1624.143,1636.0,70600,1669.0,1600.0
3,2014/08/28,1617.0,1613.551,1612.0,87900,1624.0,1602.0
4,2014/08/29,1602.0,1603.585,1617.0,99000,1620.0,1592.0
5,2014/09/01,1620.0,1621.247,1606.0,102800,1639.0,1579.0
6,2014/09/02,1630.0,1625.911,1619.0,87400,1637.0,1600.0
7,2014/09/03,1633.0,1634.561,1636.0,145600,1644.0,1627.0
8,2014/09/04,1682.0,1665.378,1640.0,153600,1684.0,1637.0
9,2014/09/05,1679.0,1677.563,1688.0,125300,1699.0,1661.0
10,2014/09/08,1715.0,1706.085,1698.0,147800,1719.0,1680.0
11,2014/09/09,1696.0,1705.117,1725.0,119800,1732.0,1690.0
12,2014/09/10,1700.0,1693.78,1688.0,65300,1703.0,1682.0
13,2014/09/11,1701.0,1702.892,1716.0,115700,1720.0,1687.0
14,2014/09/12,1692.0,1702.376,1707.0,123500,1713.0,1684.0
15,2014/09/16,1723.0,1719.502,1700.0,195900,1735.0,1690.0
16,2014/09/17,1704.0,1715.308,1734.0,97800,1747.0,1700.0
17,2014/09/18,1709.0,1704.61,1704.0,81600,1712.0,1693.0
18,2014/09/19,1713.0,1717.785,1707.0,233200,1732.0,1700.0
19,2014/09/22,1699.0,1705.435,1721.0,83300,1732.0,1691.0
20,2014/09/24,1658.0,1661.714,1690.0,206000,1690.0,1651.0
21,2014/09/25,1722.0,1708.812,1698.0,150800,1722.0,1690.0
22,2014/09/26,1711.0,1708.613,1700.0,97700,1722.0,1700.0
23,2014/09/29,1689.0,1695.136,1717.0,74200,1717.0,1684.0
24,2014/09/30,1648.0,1654.845,1680.0,132000,1686.0,1645.0
25,2014/10/01,1623.0,1637.594,1656.0,89500,1656.0,1622.0
26,2014/10/02,1569.0,1586.062,1620.0,153600,1620.0,1564.0
27,2014/10/03,1561.0,1567.039,1565.0,103100,1589.0,1557.0
28,2014/10/06,1598.0,1597.739,1589.0,77100,1609.0,1581.0
29,2014/10/07,1579.0,1593.769,1600.0,75300,1606.0,1579.0
30,2014/10/08,1598.0,1589.488,1555.0,178400,1605.0,1555.0
31,2014/10/09,1558.0,1580.811,1600.0,144000,1608.0,1555.0
32,2014/10/10,1577.0,1561.749,1536.0,199800,1580.0,1533.0
33,2014/10/14,1493.0,1514.764,1530.0,119800,1538.0,1492.0
34,2014/10/15,1509.0,1507.589,1506.0,128800,1525.0,1499.0
35,2014/10/16,1430.0,1443.214,1463.0,139500,1463.0,1424.0
36,2014/10/17,1397.0,1411.193,1431.0,121000,1446.0,1394.0
37,2014/10/20,1463.0,1456.431,1427.0,144300,1474.0,1425.0
38,2014/10/21,1414.0,1424.486,1460.0,121100,1463.0,1408.0
39,2014/10/22,1451.0,1438.96,1445.0,126100,1456.0,1422.0
40,2014/10/23,1407.0,1410.415,1431.0,177700,1433.0,1398.0
41,2014/10/24,1407.0,1411.844,1435.0,168000,1439.0,1399.0
42,2014/10/27,1426.0,1424.144,1421.0,98900,1432.0,1412.0
43,2014/10/28,1410.0,1413.289,1426.0,91900,1426.0,1404.0
44,2014/10/29,1458.0,1449.479,1415.0,135100,1467.0,1415.0
45,2014/10/30,1507.0,1504.003,1458.0,282000,1527.0,1458.0
46,2014/10/31,1560.0,1539.455,1522.0,215900,1567.0,1506.0
47,2014/11/04,1618.0,1624.355,1620.0,261400,1658.0,1593.0
48,2014/11/05,1629.0,1633.731,1641.0,160100,1644.0,1624.0
49,2014/11/06,1588.0,1605.542,1630.0,76600,1638.0,1586.0
50,2014/11/07,1578.0,1580.287,1588.0,108200,1599.0,1570.0
51,2014/11/10,1622.0,1624.717,1562.0,177400,1648.0,1562.0
52,2014/11/11,1605.0,1603.06,1624.0,94500,1624.0,1588.0
53,2014/11/12,1561.0,1586.011,1619.0,135700,1625.0,1558.0
54,2014/11/13,1620.0,1605.358,1569.0,101000,1622.0,1569.0
55,2014/11/14,1594.0,1601.018,1638.0,92600,1638.0,1572.0
56,2014/11/17,1546.0,1561.328,1600.0,86200,1619.0,1540.0
57,2014/11/18,1579.0,1573.15,1557.0,52100,1582.0,1557.0
58,2014/11/19,1575.0,1581.13,1585.0,61000,1598.0,1570.0
59,2014/11/20,1574.0,1585.554,1570.0,131500,1602.0,1569.0
60,2014/11/21,1634.0,1632.671,1587.0,582300,1654.0,1587.0
61,2014/11/25,1570.0,1583.756,1634.0,401500,1634.0,1562.0
62,2014/11/26,1588.0,1583.898,1573.0,148800,1595.0,1570.0
63,2014/11/27,1597.0,1595.342,1580.0,96200,1606.0,1580.0
64,2014/11/28,1608.0,1605.364,1606.0,265200,1619.0,1590.0
65,2014/12/01,1623.0,1608.539,1608.0,280700,1629.0,1592.0
66,2014/12/02,1686.0,1646.171,1626.0,553700,1689.0,1620.0
67,2014/12/03,1678.0,1710.448,1700.0,729400,1738.0,1668.0
68,2014/12/04,1733.0,1720.04,1700.0,1067600,1740.0,1680.0
69,2014/12/05,1741.0,1735.879,1736.0,757900,1755.0,1706.0
70,2014/12/08,1782.0,1778.32,1752.0,265200,1797.0,1750.0
71,2014/12/09,1784.0,1777.489,1775.0,236200,1794.0,1763.0
72,2014/12/10,1766.0,1767.201,1765.0,289000,1793.0,1750.0
73,2014/12/11,1723.0,1729.288,1732.0,264100,1750.0,1713.0
74,2014/12/12,1731.0,1740.967,1737.0,130200,1764.0,1731.0
75,2014/12/15,1695.0,1695.597,1696.0,99300,1714.0,1672.0
76,2014/12/16,1687.0,1681.96,1675.0,138400,1701.0,1666.0
77,2014/12/17,1693.0,1692.436,1666.0,130000,1706.0,1665.0
78,2014/12/18,1744.0,1751.521,1730.0,179600,1766.0,1723.0
79,2014/12/19,1779.0,1779.328,1758.0,158900,1792.0,1752.0
80,2014/12/22,1777.0,1785.068,1790.0,92900,1801.0,1770.0
81,2014/12/24,1773.0,1773.483,1781.0,95300,1783.0,1767.0
82,2014/12/25,1795.0,1803.292,1771.0,144400,1829.0,1771.0
83,2014/12/26,1783.0,1785.369,1795.0,85300,1805.0,1773.0
84,2014/12/29,1792.0,1789.082,1794.0,107400,1803.0,1772.0
85,2014/12/30,1759.0,1763.722,1785.0,64400,1785.0,1752.0
86,2015/01/05,1775.0,1769.249,1763.0,51900,1784.0,1749.0
87,2015/01/06,1723.0,1728.974,1746.0,103600,1746.0,1718.0
88,2015/01/07,1725.0,1723.313,1702.0,61900,1733.0,1702.0
89,2015/01/08,1749.0,1744.614,1728.0,58800,1754.0,1727.0
90,2015/01/09,1739.0,1753.202,1761.0,67800,1795.0,1729.0
91,2015/01/13,1720.0,1711.646,1715.0,79600,1722.0,1701.0
92,2015/01/14,1685.0,1691.161,1705.0,75100,1723.0,1679.0
93,2015/01/15,1717.0,1703.88,1684.0,64100,1724.0,1684.0
94,2015/01/16,1732.0,1725.401,1708.0,129200,1750.0,1688.0
95,2015/01/19,1772.0,1764.679,1749.0,108400,1779.0,1733.0
96,2015/01/20,1948.0,1902.967,1800.0,383900,1950.0,1789.0
97,2015/01/21,1902.0,1903.324,1929.0,288800,1930.0,1886.0
98,2015/01/22,1905.0,1889.051,1896.0,100100,1905.0,1865.0
99,2015/01/23,1929.0,1921.455,1935.0,140600,1941.0,1889.0
100,2015/01/26,1902.0,1902.252,1905.0,81900,1922.0,1888.0
101,2015/01/27,1986.0,1959.2,1920.0,197600,1988.0,1914.0
102,2015/01/28,1934.0,1934.84,1956.0,180400,1980.0,1920.0
103,2015/01/29,1911.0,1914.087,1924.0,116200,1934.0,1892.0
104,2015/01/30,1909.0,1914.636,1935.0,120300,1962.0,1896.0
105,2015/02/02,1884.0,1890.155,1909.0,71600,1916.0,1876.0
106,2015/02/03,1883.0,1882.043,1900.0,152900,1903.0,1866.0
107,2015/02/04,1900.0,1899.384,1900.0,108200,1919.0,1887.0
108,2015/02/05,1900.0,1893.57,1900.0,62100,1900.0,1874.0
109,2015/02/06,1902.0,1900.269,1924.0,94300,1925.0,1884.0
110,2015/02/09,1923.0,1936.265,1951.0,219800,1987.0,1890.0
111,2015/02/10,1915.0,1917.529,1922.0,242700,1935.0,1906.0
112,2015/02/12,1939.0,1947.916,1945.0,308400,1973.0,1915.0
113,2015/02/13,1875.0,1904.248,1945.0,165700,1951.0,1874.0
114,2015/02/16,1895.0,1909.067,1915.0,89400,1926.0,1886.0
115,2015/02/17,1886.0,1887.984,1885.0,91000,1927.0,1862.0
116,2015/02/18,1909.0,1905.27,1926.0,141800,1926.0,1876.0
117,2015/02/19,1918.0,1907.154,1915.0,227600,1926.0,1882.0
118,2015/02/20,1936.0,1931.991,1929.0,122000,1942.0,1921.0
119,2015/02/23,1925.0,1926.243,1941.0,109300,1950.0,1915.0
120,2015/02/24,1944.0,1941.266,1915.0,187000,1959.0,1915.0
121,2015/02/25,1943.0,1937.581,1944.0,107500,1951.0,1924.0
122,2015/02/26,1945.0,1945.054,1940.0,90200,1955.0,1933.0
123,2015/02/27,1923.0,1928.224,1950.0,135300,1952.0,1910.0
124,2015/03/02,1969.0,1979.419,1945.0,247500,2014.0,1931.0
125,2015/03/03,1903.0,1917.844,1969.0,151200,1976.0,1895.0
126,2015/03/04,1910.0,1894.9,1901.0,132500,1918.0,1869.0
127,2015/03/05,1884.0,1899.105,1910.0,164700,1929.0,1879.0
128,2015/03/06,1897.0,1887.766,1885.0,119500,1903.0,1871.0
129,2015/03/09,1921.0,1920.824,1900.0,147100,1940.0,1893.0
130,2015/03/10,1910.0,1918.847,1939.0,113200,1959.0,1899.0
131,2015/03/11,1918.0,1911.133,1909.0,76000,1931.0,1897.0
132,2015/03/12,1970.0,1960.319,1918.0,140400,1975.0,1916.0
133,2015/03/13,1992.0,1990.082,1980.0,150100,2004.0,1973.0
134,2015/03/16,2002.0,2004.542,1992.0,78100,2014.0,1973.0
135,2015/03/17,1971.0,1982.664,2010.0,181200,2013.0,1966.0
136,2015/03/18,2005.0,1994.945,1973.0,126500,2010.0,1963.0
137,2015/03/19,1998.0,1997.398,2000.0,144100,2008.0,1971.0
138,2015/03/20,2022.0,2026.322,2001.0,259400,2041.0,1998.0
139,2015/03/23,2006.0,2022.951,2040.0,213200,2055.0,1996.0
140,2015/03/24,2013.0,2008.473,2001.0,120400,2020.0,1988.0
141,2015/03/25,2000.0,2003.775,2009.0,81800,2029.0,1985.0
142,2015/03/26,1971.0,1975.256,1983.0,130000,1996.0,1964.0
143,2015/03/27,1940.0,1962.645,1970.0,95700,2001.0,1930.0
144,2015/03/30,1927.0,1928.151,1939.0,72900,1939.0,1912.0
145,2015/03/31,1935.0,1943.499,1954.0,86200,1972.0,1922.0
146,2015/04/01,1899.0,1905.112,1925.0,203100,1946.0,1890.0
147,2015/04/02,1982.0,1974.489,1910.0,156300,2005.0,1909.0
148,2015/04/03,1987.0,1993.599,1987.0,94000,2012.0,1980.0
149,2015/04/06,1994.0,1998.727,1987.0,321400,2011.0,1968.0
150,2015/04/07,1991.0,1995.929,1995.0,276500,2012.0,1981.0
151,2015/04/08,2005.0,2008.959,2000.0,192300,2020.0,1993.0
152,2015/04/09,2017.0,2021.402,2005.0,191000,2039.0,2005.0
153,2015/04/10,2044.0,2051.949,2029.0,209600,2076.0,2028.0
154,2015/04/13,2041.0,2054.261,2055.0,112000,2074.0,2036.0
155,2015/04/14,2055.0,2054.555,2050.0,112400,2072.0,2045.0
156,2015/04/15,2063.0,2061.967,2030.0,154400,2079.0,2029.0
157,2015/04/16,2054.0,2048.273,2060.0,81700,2064.0,2031.0
158,2015/04/17,2004.0,2018.247,2026.0,114800,2044.0,2004.0
159,2015/04/20,1989.0,1996.691,1984.0,86400,2012.0,1961.0
160,2015/04/21,2004.0,1986.846,1995.0,199900,2005.0,1961.0
161,2015/04/22,2044.0,2033.019,2015.0,150700,2050.0,1998.0
162,2015/04/23,2066.0,2071.2,2050.0,145400,2087.0,2044.0
163,2015/04/24,2034.0,2029.527,2040.0,128000,2043.0,2014.0
164,2015/04/27,2052.0,2043.85,2026.0,63800,2059.0,2019.0
165,2015/04/28,2046.0,2050.467,2055.0,84000,2062.0,2034.0
166,2015/04/30,2003.0,2001.514,2007.0,161600,2025.0,1981.0
167,2015/05/01,1987.0,1987.079,2000.0,120400,2007.0,1973.0
168,2015/05/07,2004.0,2007.949,1988.0,102300,2026.0,1981.0
169,2015/05/08,2004.0,1992.046,1991.0,193400,2019.0,1962.0
170,2015/05/11,2069.0,2063.514,2037.0,133400,2074.0,2035.0
171,2015/05/12,2077.0,2075.755,2054.0,115500,2088.0,2054.0
172,2015/05/13,2124.0,2121.16,2077.0,201800,2156.0,2072.0
173,2015/05/14,2100.0,2090.124,2104.0,160300,2124.0,2060.0
174,2015/05/15,2183.0,2187.213,2157.0,228000,2228.0,2157.0
175,2015/05/18,2194.0,2178.251,2165.0,233700,2197.0,2138.0
176,2015/05/19,2238.0,2235.19,2205.0,206800,2265.0,2204.0
177,2015/05/20,2288.0,2286.003,2259.0,255200,2308.0,2245.0
178,2015/05/21,2255.0,2277.161,2296.0,253600,2320.0,2250.0
179,2015/05/22,2394.0,2341.192,2315.0,435500,2396.0,2250.0
180,2015/05/25,2414.0,2421.706,2390.0,321000,2466.0,2390.0
181,2015/05/26,2399.0,2411.453,2419.0,279700,2448.0,2393.0
182,2015/05/27,2445.0,2436.972,2392.0,214100,2460.0,2391.0
183,2015/05/28,2435.0,2454.225,2469.0,221400,2518.0,2423.0
184,2015/05/29,2429.0,2427.773,2435.0,132900,2445.0,2409.0
185,2015/06/01,2412.0,2412.531,2425.0,102600,2426.0,2403.0
186,2015/06/02,2397.0,2399.807,2424.0,164500,2424.0,2374.0
187,2015/06/03,2367.0,2366.836,2377.0,183700,2398.0,2358.0
188,2015/06/04,2371.0,2374.641,2367.0,118300,2394.0,2344.0
189,2015/06/05,2375.0,2370.441,2365.0,150500,2385.0,2350.0
190,2015/06/08,2375.0,2392.562,2375.0,117100,2417.0,2362.0
191,2015/06/09,2297.0,2318.524,2346.0,141200,2350.0,2297.0
192,2015/06/10,2263.0,2282.564,2287.0,101900,2304.0,2262.0
193,2015/06/11,2286.0,2284.337,2263.0,102600,2304.0,2263.0
194,2015/06/12,2292.0,2286.804,2286.0,113600,2295.0,2280.0
195,2015/06/15,2275.0,2275.862,2280.0,77400,2291.0,2263.0
196,2015/06/16,2235.0,2250.993,2265.0,129400,2274.0,2235.0
197,2015/06/17,2217.0,2213.941,2234.0,142900,2243.0,2198.0
198,2015/06/18,2243.0,2252.888,2221.0,191000,2290.0,2221.0
199,2015/06/19,2338.0,2339.604,2288.0,312000,2387.0,2270.0
200,2015/06/22,2299.0,2310.363,2335.0,151100,2350.0,2287.0
201,2015/06/23,2356.0,2334.826,2280.0,142100,2364.0,2280.0
202,2015/06/24,2382.0,2384.753,2379.0,168600,2405.0,2364.0
203,2015/06/25,2350.0,2356.431,2362.0,88900,2372.0,2333.0
204,2015/06/26,2339.0,2335.848,2357.0,75600,2361.0,2312.0
205,2015/06/29,2234.0,2249.211,2249.0,85700,2272.0,2234.0
206,2015/06/30,2218.0,2223.646,2244.0,78200,2246.0,2212.0
207,2015/07/01,2245.0,2246.184,2252.0,59800,2261.0,2230.0
208,2015/07/02,2282.0,2277.058,2264.0,142300,2290.0,2248.0
209,2015/07/03,2284.0,2272.938,2277.0,69200,2291.0,2248.0
210,2015/07/06,2225.0,2230.97,2218.0,100800,2252.0,2213.0
211,2015/07/07,2252.0,2254.204,2236.0,91500,2271.0,2236.0
212,2015/07/08,2132.0,2151.85,2215.0,174500,2220.0,2130.0
213,2015/07/09,2119.0,2071.978,2053.0,192800,2120.0,2003.0
214,2015/07/10,2082.0,2089.668,2112.0,140300,2130.0,2068.0
215,2015/07/13,2100.0,2091.829,2100.0,112400,2113.0,2065.0
216,2015/07/14,2199.0,2199.701,2150.0,163900,2224.0,2150.0
217,2015/07/15,2175.0,2165.88,2181.0,74100,2187.0,2138.0
218,2015/07/16,2196.0,2182.763,2200.0,64500,2200.0,2156.0
219,2015/07/17,2178.0,2174.104,2186.0,40400,2191.0,2162.0
220,2015/07/21,2198.0,2191.232,2196.0,51400,2198.0,2175.0
221,2015/07/22,2171.0,2176.476,2184.0,72900,2188.0,2158.0
222,2015/07/23,2200.0,2198.192,2189.0,139300,2216.0,2185.0
223,2015/07/24,2188.0,2184.331,2150.0,105500,2200.0,2150.0
224,2015/07/27,2159.0,2168.705,2179.0,81800,2199.0,2158.0
225,2015/07/28,2169.0,2160.246,2121.0,111900,2187.0,2121.0
226,2015/07/29,2144.0,2143.743,2172.0,70400,2174.0,2122.0
227,2015/07/30,2165.0,2169.8,2154.0,77300,2201.0,2147.0
228,2015/07/31,2196.0,2194.581,2186.0,91200,2209.0,2158.0
229,2015/08/03,2186.0,2193.368,2214.0,45900,2217.0,2179.0
230,2015/08/04,2175.0,2167.128,2175.0,75900,2187.0,2143.0
231,2015/08/05,2141.0,2143.72,2161.0,66100,2169.0,2126.0
232,2015/08/06,2179.0,2199.723,2191.0,96500,2231.0,2169.0
233,2015/08/07,2005.0,1991.433,1939.0,267500,2056.0,1925.0
234,2015/08/10,2004.0,1996.83,2002.0,96100,2009.0,1982.0
235,2015/08/11,1991.0,2012.136,2028.0,127400,2040.0,1986.0
236,2015/08/12,1994.0,2007.372,1995.0,125300,2043.0,1988.0
237,2015/08/13,2007.0,2014.372,1994.0,100000,2054.0,1994.0
238,2015/08/14,1951.0,1954.096,1992.0,114600,1995.0,1940.0
239,2015/08/17,1927.0,1927.311,1936.0,158300,1943.0,1914.0
240,2015/08/18,1914.0,1915.201,1924.0,121600,1934.0,1902.0
241,2015/08/19,1866.0,1879.313,1902.0,118600,1917.0,1866.0
242,2015/08/20,1847.0,1856.162,1850.0,74700,1870.0,1846.0
243,2015/08/21,1722.0,1725.928,1767.0,433000,1798.0,1703.0
244,2015/08/24,1618.0,1633.77,1653.0,450500,1687.0,1600.0
245,2015/08/25,1562.0,1587.538,1578.0,338100,1638.0,1533.0
246,2015/08/26,1609.0,1579.498,1550.0,257700,1626.0,1542.0
247,2015/08/27,1605.0,1615.879,1659.0,253200,1659.0,1596.0
248,2015/08/28,1669.0,1664.837,1645.0,138900,1688.0,1632.0
249,2015/08/31,1660.0,1653.259,1669.0,132300,1681.0,1627.0
250,2015/09/01,1599.0,1616.705,1660.0,151700,1667.0,1592.0
251,2015/09/02,1601.0,1601.45,1559.0,232200,1657.0,1559.0
252,2015/09/03,1598.0,1609.765,1613.0,76200,1629.0,1592.0
253,2015/09/04,1557.0,1566.197,1611.0,98200,1614.0,1545.0
254,2015/09/07,1546.0,1545.057,1542.0,93400,1574.0,1514.0
255,2015/09/08,1536.0,1554.645,1550.0,106100,1589.0,1534.0
256,2015/09/09,1620.0,1606.922,1580.0,70500,1620.0,1580.0
257,2015/09/10,1578.0,1567.598,1580.0,112900,1595.0,1537.0
258,2015/09/11,1508.0,1515.953,1511.0,327300,1533.0,1502.0
259,2015/09/14,1525.0,1529.76,1506.0,166300,1553.0,1506.0
260,2015/09/15,1543.0,1558.505,1539.0,168000,1591.0,1536.0
261,2015/09/16,1558.0,1563.306,1558.0,73900,1580.0,1554.0
262,2015/09/17,1575.0,1577.373,1558.0,109800,1592.0,1558.0
263,2015/09/18,1548.0,1550.87,1559.0,136200,1567.0,1538.0
264,2015/09/24,1504.0,1514.582,1520.0,199900,1538.0,1497.0
265,2015/09/25,1545.0,1524.355,1530.0,129200,1545.0,1501.0
266,2015/09/28,1543.0,1540.633,1538.0,125000,1553.0,1520.0
267,2015/09/29,1486.0,1495.667,1522.0,253700,1523.0,1484.0
268,2015/09/30,1541.0,1537.789,1515.0,140900,1557.0,1506.0
269,2015/10/01,1574.0,1562.381,1550.0,127400,1583.0,1527.0
270,2015/10/02,1576.0,1565.431,1574.0,79500,1586.0,1538.0
271,2015/10/05,1600.0,1596.174,1586.0,66800,1612.0,1574.0
272,2015/10/06,1651.0,1649.679,1625.0,150600,1662.0,1625.0
273,2015/10/07,1650.0,1653.482,1654.0,198800,1672.0,1635.0
274,2015/10/08,1628.0,1632.705,1644.0,135800,1649.0,1612.0
275,2015/10/09,1676.0,1670.821,1653.0,167900,1682.0,1652.0
276,2015/10/13,1683.0,1683.166,1696.0,248600,1713.0,1675.0
277,2015/10/14,1604.0,1623.977,1650.0,256400,1653.0,1598.0
278,2015/10/15,1638.0,1629.067,1603.0,189600,1644.0,1602.0
279,2015/10/16,1616.0,1627.678,1650.0,120900,1663.0,1607.0
280,2015/10/19,1624.0,1612.982,1613.0,149200,1637.0,1585.0
281,2015/10/20,1622.0,1615.245,1617.0,77900,1627.0,1599.0
282,2015/10/21,1668.0,1652.995,1614.0,111100,1670.0,1614.0
283,2015/10/22,1654.0,1657.983,1651.0,87800,1675.0,1642.0
284,2015/10/23,1580.0,1597.877,1660.0,499000,1663.0,1577.0
285,2015/10/26,1594.0,1596.726,1604.0,198000,1605.0,1585.0
286,2015/10/27,1570.0,1583.168,1604.0,224100,1607.0,1566.0
287,2015/10/28,1577.0,1563.265,1566.0,188000,1580.0,1550.0
288,2015/10/29,1577.0,1578.372,1586.0,253000,1588.0,1567.0
289,2015/10/30,1575.0,1572.699,1575.0,154900,1587.0,1556.0
290,2015/11/02,1558.0,1557.431,1575.0,165300,1579.0,1550.0
291,2015/11/04,1613.0,1619.454,1582.0,327800,1644.0,1571.0
292,2015/11/05,1642.0,1632.101,1620.0,148200,1645.0,1613.0
293,2015/11/06,1684.0,1680.495,1646.0,208500,1695.0,1644.0
294,2015/11/09,1601.0,1602.047,1640.0,393500,1640.0,1585.0
295,2015/11/10,1606.0,1595.552,1580.0,223000,1608.0,1571.0
296,2015/11/11,1667.0,1646.268,1608.0,182400,1677.0,1598.0
297,2015/11/12,1667.0,1665.476,1660.0,94500,1679.0,1650.0
298,2015/11/13,1650.0,1651.611,1651.0,50100,1662.0,1644.0
299,2015/11/16,1640.0,1637.77,1635.0,48300,1648.0,1627.0
300,2015/11/17,1690.0,1685.301,1671.0,101100,1692.0,1646.0
301,2015/11/18,1694.0,1691.571,1697.0,86000,1698.0,1682.0
302,2015/11/19,1701.0,1696.321,1698.0,148200,1709.0,1666.0
303,2015/11/20,1735.0,1757.734,1720.0,207700,1819.0,1718.0
304,2015/11/24,1735.0,1736.453,1735.0,68500,1746.0,1731.0
305,2015/11/25,1708.0,1699.296,1725.0,205700,1732.0,1672.0
306,2015/11/26,1729.0,1752.775,1742.0,268000,1793.0,1721.0
307,2015/11/27,1700.0,1695.974,1727.0,166600,1727.0,1673.0
308,2015/11/30,1712.0,1703.101,1694.0,201800,1723.0,1693.0
309,2015/12/01,1707.0,1693.991,1692.0,155000,1709.0,1668.0
310,2015/12/02,1715.0,1713.901,1711.0,98300,1724.0,1704.0
311,2015/12/03,1725.0,1716.165,1720.0,72200,1729.0,1697.0
312,2015/12/04,1715.0,1705.105,1701.0,111500,1716.0,1692.0
313,2015/12/07,1733.0,1739.641,1749.0,63500,1755.0,1729.0
314,2015/12/08,1704.0,1711.449,1740.0,69700,1744.0,1700.0
315,2015/12/09,1670.0,1670.329,1692.0,178500,1696.0,1660.0
316,2015/12/10,1670.0,1668.227,1650.0,136300,1680.0,1650.0
317,2015/12/11,1644.0,1649.703,1651.0,189000,1667.0,1634.0
318,2015/12/14,1617.0,1599.143,1609.0,157700,1618.0,1574.0
319,2015/12/15,1574.0,1591.271,1607.0,152400,1615.0,1568.0
320,2015/12/16,1608.0,1603.359,1580.0,141400,1612.0,1580.0
321,2015/12/17,1637.0,1641.2,1643.0,158700,1659.0,1626.0
322,2015/12/18,1643.0,1659.746,1660.0,188600,1689.0,1640.0
323,2015/12/21,1616.0,1617.746,1637.0,133000,1641.0,1593.0
324,2015/12/22,1621.0,1634.983,1616.0,111000,1656.0,1611.0
325,2015/12/24,1592.0,1607.576,1622.0,56600,1631.0,1587.0
326,2015/12/25,1560.0,1569.99,1600.0,78700,1605.0,1553.0
327,2015/12/28,1600.0,1595.501,1572.0,61300,1609.0,1571.0
328,2015/12/29,1627.0,1617.026,1600.0,71900,1638.0,1591.0
329,2015/12/30,1636.0,1643.991,1651.0,52500,1661.0,1632.0
330,2016/01/04,1605.0,1627.131,1633.0,84900,1666.0,1602.0
331,2016/01/05,1605.0,1615.654,1604.0,156200,1637.0,1590.0
332,2016/01/06,1588.0,1604.698,1612.0,236000,1635.0,1577.0
333,2016/01/07,1565.0,1581.245,1573.0,162200,1610.0,1565.0
334,2016/01/08,1550.0,1558.665,1550.0,196000,1587.0,1525.0
335,2016/01/12,1467.0,1480.284,1514.0,244100,1514.0,1467.0
336,2016/01/13,1539.0,1517.569,1467.0,191000,1544.0,1467.0
337,2016/01/14,1533.0,1514.449,1499.0,187700,1541.0,1490.0
338,2016/01/15,1507.0,1520.682,1552.0,149400,1576.0,1495.0
339,2016/01/18,1486.0,1471.871,1460.0,108200,1495.0,1446.0
340,2016/01/19,1497.0,1492.067,1472.0,67500,1506.0,1472.0
341,2016/01/20,1441.0,1467.566,1496.0,119700,1507.0,1438.0
342,2016/01/21,1402.0,1445.214,1422.0,159000,1487.0,1402.0
343,2016/01/22,1483.0,1451.769,1452.0,123300,1484.0,1423.0
344,2016/01/25,1510.0,1507.746,1509.0,75100,1532.0,1488.0
345,2016/01/26,1445.0,1453.81,1471.0,67200,1508.0,1435.0
346,2016/01/27,1485.0,1475.373,1471.0,66000,1487.0,1457.0
347,2016/01/28,1457.0,1461.902,1468.0,66500,1487.0,1448.0
348,2016/01/29,1510.0,1488.787,1466.0,116200,1525.0,1457.0
349,2016/02/01,1565.0,1556.926,1536.0,139500,1569.0,1527.0
350,2016/02/02,1530.0,1532.884,1542.0,76900,1548.0,1525.0
351,2016/02/03,1473.0,1475.474,1494.0,78200,1497.0,1464.0
352,2016/02/04,1454.0,1463.013,1460.0,47300,1481.0,1453.0
353,2016/02/05,1418.0,1418.308,1430.0,167400,1450.0,1401.0
354,2016/02/08,1530.0,1495.619,1440.0,172700,1543.0,1440.0
355,2016/02/09,1390.0,1404.21,1472.0,205300,1472.0,1378.0
356,2016/02/10,1369.0,1376.873,1400.0,143400,1419.0,1350.0
357,2016/02/12,1283.0,1306.417,1339.0,180300,1349.0,1273.0
358,2016/02/15,1419.0,1381.549,1373.0,175700,1427.0,1334.0
359,2016/02/16,1439.0,1443.625,1407.0,141500,1483.0,1393.0
360,2016/02/17,1439.0,1444.876,1425.0,143800,1473.0,1425.0
361,2016/02/18,1499.0,1496.208,1469.0,123000,1513.0,1469.0
362,2016/02/19,1459.0,1458.308,1476.0,78600,1476.0,1444.0
363,2016/02/22,1504.0,1498.184,1449.0,110800,1521.0,1449.0
364,2016/02/23,1539.0,1538.268,1512.0,183100,1559.0,1512.0
365,2016/02/24,1387.0,1404.946,1487.0,568300,1487.0,1384.0
366,2016/02/25,1422.0,1411.468,1386.0,172500,1424.0,1382.0
367,2016/02/26,1442.0,1447.966,1422.0,116900,1471.0,1422.0
368,2016/02/29,1466.0,1493.375,1468.0,225500,1538.0,1461.0
369,2016/03/01,1473.0,1464.369,1464.0,130600,1486.0,1442.0
370,2016/03/02,1564.0,1549.399,1489.0,143700,1570.0,1489.0
371,2016/03/03,1607.0,1589.488,1560.0,124800,1607.0,1560.0
372,2016/03/04,1615.0,1613.244,1603.0,130600,1630.0,1591.0
373,2016/03/07,1576.0,1588.299,1630.0,150000,1633.0,1567.0
374,2016/03/08,1593.0,1583.49,1576.0,122300,1602.0,1548.0
375,2016/03/09,1558.0,1556.151,1580.0,119400,1580.0,1531.0
376,2016/03/10,1582.0,1575.425,1571.0,94700,1597.0,1551.0
377,2016/03/11,1593.0,1570.159,1552.0,127000,1603.0,1544.0
378,2016/03/14,1626.0,1618.671,1606.0,71400,1627.0,1596.0
379,2016/03/15,1621.0,1625.117,1620.0,91000,1644.0,1611.0
380,2016/03/16,1618.0,1620.751,1610.0,85800,1636.0,1602.0
381,2016/03/17,1608.0,1621.7,1618.0,115000,1651.0,1590.0
382,2016/03/18,1623.0,1621.519,1608.0,119300,1645.0,1602.0
383,2016/03/22,1657.0,1650.135,1641.0,206200,1677.0,1613.0
384,2016/03/23,1628.0,1646.435,1659.0,160100,1667.0,1619.0
385,2016/03/24,1592.0,1602.36,1628.0,84500,1628.0,1590.0
386,2016/03/25,1603.0,1600.768,1599.0,62400,1614.0,1589.0
387,2016/03/28,1618.0,1604.438,1620.0,125000,1639.0,1583.0
388,2016/03/29,1628.0,1618.189,1604.0,97500,1629.0,1591.0
389,2016/03/30,1593.0,1597.823,1630.0,183200,1632.0,1588.0
390,2016/03/31,1594.0,1603.689,1601.0,110800,1629.0,1593.0
391,2016/04/01,1512.0,1532.807,1594.0,164100,1604.0,1503.0
392,2016/04/04,1506.0,1505.137,1503.0,109100,1533.0,1488.0
393,2016/04/05,1455.0,1458.914,1492.0,245800,1493.0,1437.0
394,2016/04/06,1458.0,1455.683,1456.0,115800,1483.0,1437.0
395,2016/04/07,1470.0,1471.686,1458.0,156800,1491.0,1449.0
396,2016/04/08,1490.0,1463.985,1436.0,168800,1508.0,1419.0
397,2016/04/11,1498.0,1484.778,1494.0,85600,1503.0,1460.0
398,2016/04/12,1544.0,1533.185,1498.0,97200,1547.0,1491.0
399,2016/04/13,1613.0,1591.898,1550.0,122500,1616.0,1550.0
400,2016/04/14,1647.0,1638.739,1622.0,132200,1647.0,1622.0
401,2016/04/15,1631.0,1630.294,1613.0,116300,1644.0,1613.0
402,2016/04/18,1600.0,1596.373,1582.0,77800,1611.0,1572.0
403,2016/04/19,1667.0,1657.815,1640.0,94200,1669.0,1640.0
404,2016/04/20,1686.0,1692.177,1687.0,146300,1717.0,1679.0
405,2016/04/21,1714.0,1708.444,1713.0,127600,1717.0,1696.0
406,2016/04/22,1717.0,1695.923,1701.0,149700,1717.0,1673.0
407,2016/04/25,1717.0,1719.041,1724.0,48800,1729.0,1700.0
408,2016/04/26,1695.0,1699.037,1726.0,46400,1726.0,1680.0
409,2016/04/27,1693.0,1694.842,1701.0,78500,1703.0,1687.0
410,2016/04/28,1683.0,1701.916,1721.0,137000,1739.0,1657.0
411,2016/05/02,1620.0,1610.603,1608.0,95700,1624.0,1600.0
412,2016/05/06,1603.0,1603.444,1605.0,98100,1652.0,1591.0
413,2016/05/09,1597.0,1602.233,1603.0,40700,1623.0,1594.0
414,2016/05/10,1649.0,1633.469,1603.0,90000,1653.0,1594.0
415,2016/05/11,1658.0,1669.214,1674.0,54200,1693.0,1652.0
416,2016/05/12,1659.0,1649.347,1632.0,68400,1661.0,1625.0
417,2016/05/13,1621.0,1630.368,1659.0,68700,1672.0,1612.0
418,2016/05/16,1858.0,1851.877,1781.0,743800,1909.0,1727.0
419,2016/05/17,1925.0,1926.092,1885.0,710100,1977.0,1876.0
420,2016/05/18,1963.0,1947.338,1925.0,457700,1975.0,1906.0
421,2016/05/19,2006.0,2003.466,1950.0,346900,2029.0,1950.0
422,2016/05/20,2015.0,2040.039,1993.0,425800,2094.0,1992.0
423,2016/05/23,2039.0,2002.788,1996.0,330000,2042.0,1948.0
424,2016/05/24,2069.0,2051.262,2030.0,275600,2084.0,2007.0
425,2016/05/25,2073.0,2081.498,2100.0,288300,2105.0,2060.0
426,2016/05/26,2017.0,2029.719,2089.0,150500,2089.0,2012.0
427,2016/05/27,1991.0,1994.331,2017.0,137300,2017.0,1982.0
428,2016/05/30,2024.0,2045.64,2000.0,440900,2119.0,1992.0
429,2016/05/31,2019.0,2016.541,2022.0,133600,2035.0,2006.0
430,2016/06/01,2003.0,2010.135,2000.0,98500,2035.0,1993.0
431,2016/06/02,1968.0,1974.688,1990.0,100700,2001.0,1963.0
432,2016/06/03,1970.0,1971.867,1960.0,85400,1992.0,1960.0
433,2016/06/06,1999.0,1981.673,1954.0,219000,2002.0,1942.0
434,2016/06/07,1989.0,1984.981,2009.0,109200,2009.0,1966.0
435,2016/06/08,2040.0,2011.688,1989.0,134400,2040.0,1972.0
436,2016/06/09,2016.0,2017.655,2029.0,92100,2042.0,2004.0
437,2016/06/10,2013.0,2003.99,2002.0,131500,2017.0,1987.0
438,2016/06/13,1961.0,1969.113,1973.0,108900,1980.0,1959.0
439,2016/06/14,1922.0,1926.06,1949.0,73200,1962.0,1909.0
440,2016/06/15,1961.0,1954.932,1920.0,67400,1973.0,1917.0
441,2016/06/16,1917.0,1921.02,1955.0,127100,1960.0,1903.0
442,2016/06/17,1922.0,1922.12,1918.0,126500,1939.0,1904.0
443,2016/06/20,1978.0,1976.538,1961.0,83600,2009.0,1960.0
444,2016/06/21,1984.0,1966.606,1962.0,101200,1991.0,1932.0
445,2016/06/22,1975.0,1960.794,1973.0,84000,1977.0,1938.0
446,2016/06/23,1991.0,1977.307,1962.0,69300,1992.0,1942.0
447,2016/06/24,1870.0,1918.2,2015.0,170500,2022.0,1860.0
448,2016/06/27,1890.0,1884.432,1898.0,79100,1925.0,1859.0
449,2016/06/28,1894.0,1878.038,1860.0,96100,1907.0,1830.0
450,2016/06/29,1921.0,1918.623,1925.0,103500,1945.0,1888.0
451,2016/06/30,1940.0,1948.71,1955.0,65100,1969.0,1937.0
452,2016/07/01,1958.0,1956.986,1954.0,51200,1971.0,1932.0
453,2016/07/04,1955.0,1946.672,1947.0,68200,1962.0,1914.0
454,2016/07/05,1928.0,1926.628,1946.0,72800,1946.0,1910.0
455,2016/07/06,1893.0,1879.622,1893.0,75700,1899.0,1861.0
456,2016/07/07,1877.0,1887.001,1890.0,101600,1918.0,1868.0
457,2016/07/08,1819.0,1842.555,1875.0,101000,1891.0,1819.0
458,2016/07/11,1917.0,1904.11,1870.0,77300,1929.0,1870.0
459,2016/07/12,1955.0,1970.615,1980.0,93300,1997.0,1947.0
460,2016/07/13,1952.0,1980.895,2020.0,74300,2025.0,1946.0
461,2016/07/14,1897.0,1906.113,1952.0,198700,1952.0,1882.0
462,2016/07/15,1861.0,1874.759,1895.0,163200,1910.0,1854.0
463,2016/07/19,1905.0,1901.436,1881.0,216900,1912.0,1881.0
464,2016/07/20,1881.0,1883.26,1900.0,91000,1900.0,1866.0
465,2016/07/21,1911.0,1910.779,1921.0,89400,1925.0,1901.0
466,2016/07/22,1930.0,1925.058,1893.0,113900,1941.0,1887.0
467,2016/07/25,1912.0,1922.531,1940.0,109600,1956.0,1907.0
468,2016/07/26,1875.0,1881.648,1907.0,61700,1938.0,1867.0
469,2016/07/27,1950.0,1944.1,1915.0,127200,1973.0,1898.0
470,2016/07/28,1915.0,1925.016,1937.0,71100,1949.0,1912.0
471,2016/07/29,1918.0,1890.217,1909.0,154200,1922.0,1844.0
472,2016/08/01,1868.0,1872.355,1915.0,126200,1915.0,1860.0
473,2016/08/02,1825.0,1835.999,1850.0,132900,1857.0,1821.0
474,2016/08/03,1808.0,1804.727,1814.0,114500,1821.0,1782.0
475,2016/08/04,1849.0,1837.581,1825.0,87400,1852.0,1816.0
476,2016/08/05,1818.0,1826.152,1826.0,116500,1851.0,1814.0
477,2016/08/08,1580.0,1593.375,1720.0,625000,1732.0,1541.0
478,2016/08/09,1574.0,1557.099,1581.0,399400,1588.0,1547.0
479,2016/08/10,1592.0,1584.468,1581.0,362200,1598.0,1566.0
480,2016/08/12,1590.0,1594.582,1607.0,214000,1612.0,1582.0
481,2016/08/15,1594.0,1593.026,1604.0,106700,1608.0,1583.0
482,2016/08/16,1580.0,1601.737,1598.0,187200,1637.0,1580.0
483,2016/08/17,1577.0,1569.126,1570.0,108100,1580.0,1562.0
484,2016/08/18,1556.0,1561.332,1564.0,134800,1585.0,1550.0
485,2016/08/19,1586.0,1583.734,1555.0,75900,1596.0,1555.0
486,2016/08/22,1601.0,1596.953,1590.0,53400,1610.0,1589.0
487,2016/08/23,1580.0,1582.365,1596.0,74800,1598.0,1569.0
488,2016/08/24,1582.0,1586.952,1593.0,58200,1607.0,1578.0
489,2016/08/25,1597.0,1595.844,1587.0,78800,1605.0,1586.0
490,2016/08/26,1538.0,1542.734,1580.0,228300,1580.0,1530.0
491,2016/08/29,1573.0,1566.018,1560.0,131500,1581.0,1549.0
492,2016/08/30,1553.0,1553.332,1570.0,169500,1577.0,1546.0
493,2016/08/31,1551.0,1551.62,1569.0,252900,1570.0,1538.0
494,2016/09/01,1562.0,1555.832,1560.0,130000,1564.0,1546.0
495,2016/09/02,1547.0,1552.037,1566.0,146800,1569.0,1543.0
496,2016/09/05,1579.0,1583.306,1569.0,193900,1596.0,1567.0
497,2016/09/06,1578.0,1576.236,1585.0,183300,1588.0,1570.0
498,2016/09/07,1642.0,1618.194,1578.0,295600,1647.0,1575.0
499,2016/09/08,1643.0,1652.902,1645.0,209100,1669.0,1631.0
500,2016/09/09,1656.0,1654.248,1652.0,94300,1660.0,1650.0
501,2016/09/12,1656.0,1653.59,1639.0,208700,1672.0,1627.0
502,2016/09/13,1652.0,1655.441,1666.0,87300,1669.0,1650.0
503,2016/09/14,1619.0,1624.263,1636.0,120000,1636.0,1614.0
504,2016/09/15,1593.0,1589.109,1614.0,136300,1614.0,1575.0
505,2016/09/16,1622.0,1619.784,1607.0,71700,1629.0,1605.0
506,2016/09/20,1622.0,1625.993,1622.0,69900,1642.0,1619.0
507,2016/09/21,1649.0,1628.437,1622.0,137400,1649.0,1607.0
508,2016/09/23,1651.0,1646.031,1648.0,109400,1654.0,1625.0
509,2016/09/26,1648.0,1652.165,1652.0,101400,1659.0,1645.0
510,2016/09/27,1684.0,1658.993,1635.0,162200,1690.0,1625.0
511,2016/09/28,1666.0,1660.977,1654.0,133000,1680.0,1651.0
512,2016/09/29,1669.0,1672.868,1680.0,126300,1682.0,1663.0
513,2016/09/30,1640.0,1640.101,1646.0,130500,1651.0,1621.0
514,2016/10/03,1646.0,1647.785,1645.0,145100,1658.0,1636.0
515,2016/10/04,1655.0,1649.805,1653.0,156200,1656.0,1641.0
516,2016/10/05,1673.0,1662.559,1655.0,152600,1674.0,1645.0
517,2016/10/06,1673.0,1676.928,1682.0,104600,1703.0,1666.0
518,2016/10/07,1680.0,1675.515,1677.0,53800,1687.0,1667.0
519,2016/10/11,1684.0,1683.451,1680.0,52100,1690.0,1675.0
520,2016/10/12,1663.0,1667.547,1667.0,77500,1681.0,1659.0
521,2016/10/13,1678.0,1671.863,1669.0,80700,1679.0,1657.0
522,2016/10/14,1660.0,1660.374,1663.0,87200,1674.0,1652.0
523,2016/10/17,1677.0,1672.75,1666.0,69100,1679.0,1661.0
524,2016/10/18,1680.0,1674.633,1675.0,55000,1680.0,1667.0
525,2016/10/19,1680.0,1682.56,1689.0,65700,1689.0,1675.0
526,2016/10/20,1681.0,1680.576,1681.0,74100,1687.0,1671.0
527,2016/10/21,1676.0,1679.861,1681.0,63900,1685.0,1674.0
528,2016/10/24,1682.0,1683.581,1680.0,105900,1695.0,1668.0
529,2016/10/25,1702.0,1699.456,1695.0,76600,1705.0,1690.0
530,2016/10/26,1711.0,1713.545,1717.0,100500,1730.0,1699.0
531,2016/10/27,1701.0,1701.07,1718.0,66200,1718.0,1690.0
532,2016/10/28,1711.0,1708.321,1702.0,96100,1715.0,1693.0
533,2016/10/31,1716.0,1712.168,1715.0,66000,1716.0,1706.0
534,2016/11/01,1725.0,1716.043,1716.0,80000,1725.0,1702.0
535,2016/11/02,1711.0,1708.978,1712.0,75900,1717.0,1702.0
536,2016/11/04,1719.0,1709.0,1700.0,133400,1724.0,1692.0
537,2016/11/07,1746.0,1742.21,1735.0,108900,1750.0,1731.0
538,2016/11/08,1752.0,1752.946,1760.0,83400,1766.0,1745.0
539,2016/11/09,1672.0,1708.11,1751.0,172600,1768.0,1660.0
540,2016/11/10,1730.0,1719.678,1700.0,168100,1746.0,1695.0
541,2016/11/11,1658.0,1661.416,1690.0,437700,1696.0,1649.0
542,2016/11/14,1647.0,1661.351,1658.0,262600,1686.0,1620.0
543,2016/11/15,1679.0,1678.304,1679.0,197800,1699.0,1659.0
544,2016/11/16,1726.0,1720.627,1700.0,162100,1731.0,1700.0
545,2016/11/17,1717.0,1711.428,1711.0,97900,1719.0,1698.0
546,2016/11/18,1774.0,1764.858,1734.0,193700,1777.0,1733.0
547,2016/11/21,1773.0,1773.909,1780.0,103900,1786.0,1764.0
548,2016/11/22,1766.0,1779.965,1780.0,162700,1805.0,1761.0
549,2016/11/24,1780.0,1782.529,1792.0,52600,1793.0,1775.0
550,2016/11/25,1808.0,1804.501,1790.0,110700,1818.0,1789.0
551,2016/11/28,1819.0,1812.849,1807.0,98400,1824.0,1797.0
552,2016/11/29,1801.0,1800.924,1803.0,132100,1821.0,1792.0
553,2016/11/30,1782.0,1790.302,1803.0,80900,1808.0,1781.0
554,2016/12/01,1829.0,1829.117,1813.0,174000,1850.0,1805.0
555,2016/12/02,1810.0,1814.112,1829.0,93700,1834.0,1805.0
556,2016/12/05,1807.0,1804.742,1802.0,62000,1815.0,1793.0
557,2016/12/06,1815.0,1816.817,1820.0,83000,1832.0,1810.0
558,2016/12/07,1835.0,1831.742,1815.0,85500,1839.0,1810.0
559,2016/12/08,1852.0,1853.188,1845.0,81800,1870.0,1841.0
560,2016/12/09,1864.0,1851.845,1840.0,135800,1865.0,1840.0
561,2016/12/12,1899.0,1895.913,1888.0,140900,1910.0,1873.0
562,2016/12/13,1939.0,1919.775,1903.0,131700,1940.0,1895.0
563,2016/12/14,1943.0,1940.562,1943.0,116300,1956.0,1921.0
564,2016/12/15,1954.0,1953.576,1945.0,116800,1963.0,1945.0
565,2016/12/16,1961.0,1964.7,1975.0,99800,1975.0,1956.0
566,2016/12/19,1956.0,1952.855,1960.0,63600,1960.0,1944.0
567,2016/12/20,1962.0,1954.91,1949.0,62200,1964.0,1937.0
568,2016/12/21,1945.0,1950.253,1965.0,83500,1970.0,1939.0
569,2016/12/22,1954.0,1950.428,1945.0,52600,1961.0,1936.0
570,2016/12/26,1967.0,1968.101,1957.0,43600,1975.0,1957.0
571,2016/12/27,1974.0,1969.191,1960.0,50700,1979.0,1952.0
572,2016/12/28,2005.0,1999.615,1971.0,101300,2017.0,1967.0
573,2016/12/29,1976.0,1976.387,1995.0,89700,1995.0,1964.0
574,2016/12/30,1962.0,1957.24,1958.0,82600,1965.0,1945.0
575,2017/01/04,1994.0,1984.054,1964.0,73500,1994.0,1964.0
576,2017/01/05,1994.0,1995.081,2000.0,66500,2006.0,1989.0
577,2017/01/06,2000.0,1991.831,1983.0,84000,2003.0,1978.0
578,2017/01/10,1992.0,1990.17,1994.0,61200,2003.0,1982.0
579,2017/01/11,2010.0,2010.417,2000.0,55400,2024.0,2000.0
580,2017/01/12,1989.0,1987.376,2001.0,88500,2006.0,1971.0
581,2017/01/13,1986.0,1982.019,1977.0,47700,1989.0,1976.0
582,2017/01/16,1965.0,1968.488,1975.0,55100,1984.0,1961.0
583,2017/01/17,1934.0,1947.067,1968.0,64000,1971.0,1934.0
584,2017/01/18,1926.0,1917.909,1924.0,76800,1934.0,1903.0
585,2017/01/19,1949.0,1950.858,1950.0,77400,1965.0,1941.0
586,2017/01/20,1955.0,1953.808,1950.0,74500,1967.0,1940.0
587,2017/01/23,1938.0,1944.205,1950.0,71200,1955.0,1938.0
588,2017/01/24,1936.0,1935.129,1938.0,49500,1944.0,1928.0
589,2017/01/25,1957.0,1952.573,1940.0,73100,1962.0,1940.0
590,2017/01/26,1975.0,1973.623,1971.0,80200,1982.0,1960.0
591,2017/01/27,1982.0,1987.379,1995.0,96800,2003.0,1973.0
592,2017/01/30,1989.0,1984.9,1983.0,87200,1994.0,1970.0
593,2017/01/31,1970.0,1967.588,1980.0,72100,1980.0,1956.0
594,2017/02/01,1978.0,1972.386,1960.0,47700,1981.0,1951.0
595,2017/02/02,1951.0,1964.965,1993.0,69400,1993.0,1946.0
596,2017/02/03,1951.0,1952.732,1952.0,79400,1965.0,1935.0
597,2017/02/06,1967.0,1965.558,1961.0,47100,1975.0,1953.0
598,2017/02/07,1949.0,1952.21,1967.0,43400,1967.0,1945.0
599,2017/02/08,1966.0,1946.995,1945.0,63700,1966.0,1913.0
600,2017/02/09,1892.0,1898.082,1911.0,284800,1921.0,1885.0
601,2017/02/10,1932.0,1927.216,1921.0,120200,1940.0,1915.0
602,2017/02/13,1973.0,1962.355,1949.0,113100,1980.0,1940.0
603,2017/02/14,1993.0,2000.684,1986.0,171400,2010.0,1986.0
604,2017/02/15,2010.0,2008.236,2017.0,69000,2018.0,2000.0
605,2017/02/16,2017.0,2004.678,2019.0,131500,2022.0,1986.0
606,2017/02/17,2013.0,2008.454,2011.0,73800,2014.0,1998.0
607,2017/02/20,2018.0,2011.469,2003.0,65200,2019.0,1998.0
608,2017/02/21,2041.0,2034.705,2023.0,71200,2043.0,2014.0
609,2017/02/22,2030.0,2027.783,2043.0,123600,2043.0,2018.0
610,2017/02/23,2061.0,2050.104,2040.0,119300,2062.0,2036.0
611,2017/02/24,2053.0,2057.973,2067.0,91200,2068.0,2049.0
612,2017/02/27,2023.0,2024.256,2027.0,107200,2039.0,2016.0
613,2017/02/28,2031.0,2041.216,2023.0,86400,2058.0,2020.0
614,2017/03/01,2049.0,2038.323,2030.0,127000,2049.0,2010.0
615,2017/03/02,2055.0,2059.04,2059.0,261300,2080.0,2042.0
616,2017/03/03,2051.0,2053.042,2055.0,179600,2060.0,2038.0
617,2017/03/06,2056.0,2058.603,2053.0,96600,2072.0,2050.0
618,2017/03/07,2059.0,2059.899,2060.0,88200,2070.0,2046.0
619,2017/03/08,2066.0,2061.841,2059.0,84000,2068.0,2048.0
620,2017/03/09,2080.0,2075.352,2069.0,133700,2086.0,2060.0
621,2017/03/10,2092.0,2091.386,2100.0,193200,2106.0,2078.0
622,2017/03/13,2095.0,2099.738,2102.0,126900,2109.0,2090.0
623,2017/03/14,2096.0,2094.314,2100.0,117000,2101.0,2083.0
624,2017/03/15,2086.0,2090.196,2101.0,84500,2102.0,2085.0
625,2017/03/16,2103.0,2093.529,2085.0,121300,2103.0,2072.0
626,2017/03/17,2115.0,2108.389,2104.0,123100,2115.0,2099.0
627,2017/03/21,2105.0,2103.01,2115.0,125400,2115.0,2094.0
628,2017/03/22,2071.0,2083.495,2080.0,186800,2100.0,2069.0
629,2017/03/23,2076.0,2070.91,2069.0,103300,2080.0,2062.0
630,2017/03/24,2083.0,2079.273,2074.0,138000,2090.0,2068.0
631,2017/03/27,2068.0,2070.371,2080.0,180800,2082.0,2058.0
632,2017/03/28,2098.0,2085.193,2069.0,328100,2098.0,2067.0
633,2017/03/29,1997.0,1992.0,1974.0,233300,2010.0,1973.0
634,2017/03/30,1984.0,1997.785,1997.0,106100,2013.0,1982.0
635,2017/03/31,1962.0,1979.676,1990.0,94600,2002.0,1962.0
636,2017/04/03,1975.0,1978.891,1988.0,79700,1990.0,1967.0
637,2017/04/04,1960.0,1965.893,1975.0,142400,1983.0,1952.0
638,2017/04/05,1954.0,1956.305,1956.0,110000,1976.0,1943.0
639,2017/04/06,1913.0,1924.833,1947.0,114300,1948.0,1910.0
640,2017/04/07,1933.0,1934.481,1940.0,109400,1945.0,1919.0
641,2017/04/10,1946.0,1945.875,1959.0,69700,1961.0,1940.0
642,2017/04/11,1927.0,1930.841,1942.0,47200,1943.0,1922.0
643,2017/04/12,1891.0,1898.036,1902.0,103200,1909.0,1891.0
644,2017/04/13,1877.0,1873.626,1866.0,81200,1886.0,1858.0
645,2017/04/14,1861.0,1865.846,1856.0,64800,1877.0,1856.0
646,2017/04/17,1873.0,1870.183,1857.0,54000,1877.0,1857.0
647,2017/04/18,1884.0,1888.731,1903.0,44300,1906.0,1880.0
648,2017/04/19,1884.0,1877.272,1878.0,99800,1890.0,1863.0
649,2017/04/20,1880.0,1883.11,1880.0,62500,1894.0,1862.0
650,2017/04/21,1923.0,1915.405,1899.0,87600,1928.0,1889.0
651,2017/04/24,1937.0,1934.493,1948.0,57400,1948.0,1927.0
652,2017/04/25,1961.0,1953.103,1951.0,85800,1964.0,1934.0
653,2017/04/26,1993.0,1986.198,1986.0,96700,1994.0,1975.0
654,2017/04/27,2005.0,1998.757,1982.0,92000,2009.0,1979.0
655,2017/04/28,2001.0,2004.591,2000.0,84300,2014.0,1994.0
656,2017/05/01,2017.0,2011.623,1996.0,59100,2020.0,1996.0
657,2017/05/02,2023.0,2024.551,2015.0,77100,2031.0,2015.0
658,2017/05/08,2073.0,2067.415,2050.0,155800,2077.0,2041.0
659,2017/05/09,2067.0,2068.082,2072.0,66000,2075.0,2058.0
660,2017/05/10,2065.0,2070.39,2071.0,104900,2081.0,2063.0
661,2017/05/11,2065.0,2066.094,2065.0,78100,2073.0,2056.0
662,2017/05/12,2054.0,2048.485,2041.0,55500,2057.0,2037.0
663,2017/05/15,1994.0,2002.745,2008.0,168400,2030.0,1988.0
664,2017/05/16,1986.0,1991.555,2004.0,114300,2011.0,1978.0
665,2017/05/17,1958.0,1962.485,1968.0,80500,1974.0,1952.0
666,2017/05/18,1917.0,1926.947,1932.0,122400,1945.0,1915.0
667,2017/05/19,1909.0,1903.384,1920.0,154800,1920.0,1891.0
668,2017/05/22,1912.0,1916.942,1922.0,109700,1928.0,1907.0
669,2017/05/23,1899.0,1904.716,1923.0,92600,1924.0,1895.0
670,2017/05/24,1895.0,1900.03,1917.0,103600,1917.0,1892.0
671,2017/05/25,1930.0,1926.849,1909.0,118300,1939.0,1907.0
672,2017/05/26,1915.0,1917.562,1932.0,95400,1932.0,1911.0
673,2017/05/29,1910.0,1915.175,1916.0,73600,1923.0,1908.0
674,2017/05/30,1918.0,1913.266,1908.0,85200,1923.0,1904.0
675,2017/05/31,1914.0,1916.946,1915.0,98700,1924.0,1910.0
676,2017/06/01,1940.0,1935.463,1923.0,94200,1942.0,1922.0
677,2017/06/02,1973.0,1965.735,1949.0,116400,1974.0,1949.0
678,2017/06/05,1983.0,1979.519,1973.0,99300,1989.0,1968.0
679,2017/06/06,1959.0,1973.341,1986.0,88300,1990.0,1959.0
680,2017/06/07,1964.0,1962.603,1956.0,82100,1971.0,1953.0
681,2017/06/08,1952.0,1958.707,1964.0,78500,1971.0,1951.0
682,2017/06/09,1952.0,1950.07,1953.0,129100,1964.0,1937.0
683,2017/06/12,1955.0,1954.821,1957.0,63500,1963.0,1950.0
684,2017/06/13,1949.0,1954.799,1950.0,53200,1962.0,1949.0
685,2017/06/14,1957.0,1967.675,1970.0,118800,1984.0,1957.0
686,2017/06/15,1939.0,1950.125,1957.0,76900,1972.0,1939.0
687,2017/06/16,1933.0,1933.68,1947.0,138600,1951.0,1921.0
688,2017/06/19,1956.0,1948.631,1930.0,110800,1957.0,1930.0
689,2017/06/20,1958.0,1963.345,1968.0,99800,1971.0,1958.0
690,2017/06/21,1959.0,1959.145,1952.0,103300,1968.0,1945.0
691,2017/06/22,1967.0,1969.949,1959.0,100100,1977.0,1957.0
692,2017/06/23,1958.0,1960.528,1968.0,82400,1976.0,1952.0
693,2017/06/26,1962.0,1967.861,1970.0,87300,1984.0,1960.0
694,2017/06/27,1975.0,1971.321,1964.0,83500,1980.0,1961.0
695,2017/06/28,1963.0,1971.575,1988.0,116100,1988.0,1962.0
696,2017/06/29,1977.0,1978.352,1988.0,85000,1990.0,1971.0
697,2017/06/30,1970.0,1966.573,1971.0,102800,1975.0,1957.0
698,2017/07/03,1974.0,1980.502,1989.0,65300,1989.0,1974.0
699,2017/07/04,1980.0,1980.926,1988.0,112300,1988.0,1974.0
700,2017/07/05,2033.0,2005.064,1975.0,223500,2033.0,1965.0
701,2017/07/06,2032.0,2031.845,2040.0,123000,2042.0,2023.0
702,2017/07/07,2027.0,2028.884,2019.0,75000,2043.0,2008.0
703,2017/07/10,2026.0,2031.994,2044.0,86800,2047.0,2023.0
704,2017/07/11,2035.0,2036.83,2036.0,67200,2047.0,2032.0
705,2017/07/12,2018.0,2023.947,2030.0,58500,2038.0,2013.0
706,2017/07/13,2025.0,2025.376,2023.0,54200,2031.0,2017.0
707,2017/07/14,2032.0,2030.508,2024.0,51600,2036.0,2024.0
708,2017/07/18,2032.0,2027.512,2032.0,54700,2035.0,2018.0
709,2017/07/19,2012.0,2013.503,2022.0,75500,2025.0,2006.0
710,2017/07/20,2029.0,2027.745,2022.0,55600,2036.0,2014.0
711,2017/07/21,2037.0,2033.672,2023.0,69800,2038.0,2023.0
712,2017/07/24,2057.0,2049.482,2032.0,126700,2067.0,2032.0
713,2017/07/25,2037.0,2044.603,2067.0,46600,2068.0,2035.0
714,2017/07/26,2030.0,2031.697,2043.0,71900,2047.0,2018.0
715,2017/07/27,2036.0,2038.74,2041.0,57200,2047.0,2032.0
716,2017/07/28,2039.0,2029.384,2030.0,99400,2039.0,2016.0
717,2017/07/31,2023.0,2031.655,2039.0,56500,2045.0,2022.0
718,2017/08/01,2012.0,2018.458,2035.0,74200,2038.0,2009.0
719,2017/08/02,2040.0,2035.004,2023.0,51400,2045.0,2014.0
720,2017/08/03,2039.0,2038.634,2040.0,58400,2048.0,2032.0
721,2017/08/04,2022.0,2020.704,2043.0,113600,2043.0,2011.0
722,2017/08/07,1914.0,1904.535,1952.0,533200,1961.0,1831.0
723,2017/08/08,1938.0,1936.632,1931.0,165900,1949.0,1921.0
724,2017/08/09,1940.0,1938.15,1949.0,142400,1953.0,1926.0
725,2017/08/10,1952.0,1955.014,1947.0,105100,1972.0,1944.0
726,2017/08/14,1932.0,1938.498,1947.0,97200,1958.0,1928.0
727,2017/08/15,1944.0,1946.379,1958.0,68600,1962.0,1935.0
728,2017/08/16,1929.0,1933.805,1936.0,72200,1948.0,1927.0
729,2017/08/17,1951.0,1946.12,1930.0,48300,1953.0,1930.0
730,2017/08/18,1931.0,1933.966,1928.0,59000,1945.0,1926.0
731,2017/08/21,1962.0,1953.125,1953.0,55800,1963.0,1936.0
732,2017/08/22,1986.0,1979.324,1958.0,127600,1995.0,1951.0
733,2017/08/23,1991.0,1992.45,1997.0,98300,2009.0,1984.0
734,2017/08/24,1941.0,1952.735,1970.0,174800,1980.0,1933.0
735,2017/08/25,1999.0,1993.104,1968.0,163000,2014.0,1965.0
736,2017/08/28,2022.0,2020.607,2013.0,111600,2042.0,2011.0
737,2017/08/29,2034.0,2025.191,2020.0,96000,2034.0,2013.0
738,2017/08/30,2035.0,2039.726,2038.0,107900,2055.0,2029.0
739,2017/08/31,2034.0,2035.85,2047.0,54000,2047.0,2031.0
740,2017/09/01,2037.0,2035.125,2035.0,72700,2044.0,2027.0
741,2017/09/04,1993.0,2006.485,2040.0,81600,2042.0,1991.0
742,2017/09/05,1962.0,1974.217,1996.0,72500,2004.0,1961.0
743,2017/09/06,1972.0,1964.231,1961.0,60300,1975.0,1951.0
744,2017/09/07,1984.0,1980.23,1980.0,53500,1987.0,1970.0
745,2017/09/08,2007.0,1998.904,1990.0,115400,2010.0,1982.0
746,2017/09/11,2049.0,2044.563,2040.0,98600,2055.0,2036.0
747,2017/09/12,2075.0,2068.283,2056.0,117800,2079.0,2049.0
748,2017/09/13,2084.0,2084.974,2082.0,101700,2091.0,2080.0
749,2017/09/14,2092.0,2095.641,2090.0,133100,2109.0,2084.0
750,2017/09/15,2131.0,2123.597,2094.0,246100,2141.0,2094.0
751,2017/09/19,2123.0,2124.957,2138.0,121300,2149.0,2101.0
752,2017/09/20,2145.0,2147.761,2136.0,107700,2162.0,2127.0
753,2017/09/21,2148.0,2155.81,2145.0,82400,2167.0,2145.0
754,2017/09/22,2130.0,2141.608,2151.0,102000,2160.0,2128.0
755,2017/09/25,2143.0,2144.004,2124.0,102000,2159.0,2114.0
756,2017/09/26,2132.0,2136.083,2150.0,73800,2150.0,2126.0
757,2017/09/27,2125.0,2120.884,2106.0,73000,2131.0,2106.0
758,2017/09/28,2141.0,2148.012,2141.0,82200,2167.0,2140.0
759,2017/09/29,2124.0,2123.18,2140.0,47900,2144.0,2113.0
760,2017/10/02,2123.0,2125.832,2130.0,64100,2135.0,2119.0
761,2017/10/03,2113.0,2114.468,2138.0,63500,2138.0,2108.0
762,2017/10/04,2109.0,2108.665,2119.0,67100,2123.0,2101.0
763,2017/10/05,2101.0,2101.06,2114.0,51700,2114.0,2090.0
764,2017/10/06,2083.0,2086.648,2113.0,47100,2113.0,2079.0
765,2017/10/10,2090.0,2088.226,2083.0,57200,2094.0,2080.0
766,2017/10/11,2087.0,2092.303,2091.0,70400,2104.0,2084.0
767,2017/10/12,2096.0,2098.681,2100.0,41000,2108.0,2091.0
768,2017/10/13,2098.0,2089.925,2093.0,74500,2104.0,2073.0
769,2017/10/16,2097.0,2099.39,2101.0,64100,2108.0,2093.0
770,2017/10/17,2094.0,2097.604,2110.0,56600,2114.0,2090.0
771,2017/10/18,2091.0,2087.352,2098.0,56600,2098.0,2079.0
772,2017/10/19,2097.0,2097.564,2095.0,68800,2109.0,2091.0
773,2017/10/20,2098.0,2095.743,2092.0,62600,2104.0,2083.0
774,2017/10/23,2130.0,2125.579,2119.0,81700,2135.0,2104.0
775,2017/10/24,2151.0,2143.185,2133.0,95600,2153.0,2125.0
776,2017/10/25,2165.0,2170.564,2162.0,143700,2188.0,2162.0
777,2017/10/26,2185.0,2182.047,2174.0,77500,2188.0,2174.0
778,2017/10/27,2240.0,2220.416,2200.0,139200,2248.0,2200.0
779,2017/10/30,2251.0,2250.889,2255.0,126700,2264.0,2242.0
780,2017/10/31,2239.0,2240.748,2255.0,71000,2255.0,2232.0
781,2017/11/01,2268.0,2261.435,2249.0,83000,2271.0,2241.0
782,2017/11/02,2259.0,2261.227,2266.0,64000,2274.0,2250.0
783,2017/11/06,2257.0,2261.676,2260.0,99200,2281.0,2248.0
784,2017/11/07,2268.0,2263.325,2251.0,76900,2272.0,2246.0
785,2017/11/08,2283.0,2270.354,2270.0,92200,2284.0,2243.0
786,2017/11/09,2527.0,2574.002,2591.0,1106600,2658.0,2482.0
787,2017/11/10,2479.0,2485.982,2477.0,225800,2515.0,2466.0
788,2017/11/13,2425.0,2459.362,2456.0,344400,2491.0,2425.0
789,2017/11/14,2416.0,2429.431,2417.0,92300,2456.0,2400.0
790,2017/11/15,2304.0,2332.037,2375.0,180300,2384.0,2304.0
791,2017/11/16,2340.0,2333.47,2304.0,158900,2359.0,2286.0
792,2017/11/17,2327.0,2339.821,2345.0,118800,2365.0,2325.0
793,2017/11/20,2306.0,2305.545,2300.0,96400,2316.0,2286.0
794,2017/11/21,2302.0,2304.87,2300.0,149400,2318.0,2292.0
795,2017/11/22,2317.0,2327.161,2340.0,75400,2349.0,2313.0
796,2017/11/24,2312.0,2320.97,2343.0,66300,2344.0,2310.0
797,2017/11/27,2391.0,2393.848,2378.0,296800,2419.0,2364.0
798,2017/11/28,2375.0,2378.094,2385.0,168800,2389.0,2368.0
799,2017/11/29,2357.0,2362.575,2380.0,111100,2390.0,2350.0
800,2017/11/30,2337.0,2337.698,2357.0,202400,2359.0,2318.0
801,2017/12/01,2342.0,2343.316,2346.0,169700,2377.0,2325.0
802,2017/12/04,2345.0,2352.932,2349.0,111000,2372.0,2339.0
803,2017/12/05,2336.0,2329.906,2340.0,112800,2350.0,2315.0
804,2017/12/06,2299.0,2304.142,2328.0,131800,2331.0,2291.0
805,2017/12/07,2304.0,2304.969,2315.0,117300,2323.0,2296.0
806,2017/12/08,2304.0,2292.154,2277.0,192600,2314.0,2276.0
807,2017/12/11,2306.0,2299.327,2317.0,82800,2317.0,2287.0
808,2017/12/12,2300.0,2303.312,2310.0,63500,2313.0,2297.0
809,2017/12/13,2290.0,2303.001,2316.0,89200,2326.0,2285.0
810,2017/12/14,2313.0,2315.108,2320.0,83200,2328.0,2299.0
811,2017/12/15,2334.0,2333.06,2328.0,189600,2352.0,2312.0
812,2017/12/18,2318.0,2325.901,2353.0,75500,2354.0,2317.0
813,2017/12/19,2333.0,2324.971,2320.0,114500,2344.0,2302.0
814,2017/12/20,2323.0,2318.03,2333.0,119300,2339.0,2307.0
815,2017/12/21,2342.0,2330.908,2320.0,127600,2344.0,2306.0
816,2017/12/22,2366.0,2357.975,2345.0,105300,2367.0,2332.0
817,2017/12/25,2369.0,2367.139,2387.0,63500,2395.0,2349.0
818,2017/12/26,2361.0,2362.773,2368.0,44000,2372.0,2357.0
819,2017/12/27,2373.0,2370.349,2376.0,49300,2376.0,2364.0
820,2017/12/28,2371.0,2377.013,2375.0,92300,2387.0,2368.0
821,2017/12/29,2352.0,2359.879,2373.0,101200,2381.0,2346.0
822,2018/01/04,2399.0,2390.369,2377.0,225500,2404.0,2371.0
823,2018/01/05,2412.0,2415.26,2408.0,122000,2432.0,2406.0
824,2018/01/09,2429.0,2429.091,2445.0,143400,2445.0,2418.0
825,2018/01/10,2442.0,2449.342,2431.0,359300,2469.0,2430.0
826,2018/01/11,2455.0,2450.779,2443.0,130000,2463.0,2433.0
827,2018/01/12,2424.0,2429.71,2453.0,241700,2458.0,2413.0
828,2018/01/15,2449.0,2441.426,2433.0,136900,2453.0,2429.0
829,2018/01/16,2464.0,2456.762,2458.0,142800,2466.0,2448.0
830,2018/01/17,2459.0,2458.729,2450.0,74400,2471.0,2446.0
831,2018/01/18,2409.0,2429.284,2480.0,222400,2480.0,2407.0
832,2018/01/19,2433.0,2425.305,2421.0,60300,2434.0,2417.0
833,2018/01/22,2413.0,2413.007,2435.0,94000,2439.0,2407.0
834,2018/01/23,2416.0,2413.016,2422.0,81500,2423.0,2402.0
835,2018/01/24,2416.0,2411.73,2421.0,99400,2421.0,2398.0
836,2018/01/25,2388.0,2388.706,2398.0,112400,2401.0,2381.0
837,2018/01/26,2403.0,2404.82,2395.0,123600,2427.0,2395.0
838,2018/01/29,2437.0,2433.963,2409.0,163700,2447.0,2404.0
839,2018/01/30,2429.0,2437.863,2436.0,174600,2456.0,2425.0
840,2018/01/31,2416.0,2429.095,2435.0,150200,2451.0,2416.0
841,2018/02/01,2429.0,2420.987,2417.0,110200,2431.0,2403.0
842,2018/02/02,2416.0,2413.175,2413.0,80600,2426.0,2396.0
843,2018/02/05,2377.0,2368.459,2381.0,138800,2393.0,2352.0
844,2018/02/06,2264.0,2253.104,2288.0,211900,2294.0,2212.0
845,2018/02/07,2259.0,2309.011,2323.0,227100,2360.0,2258.0
846,2018/02/08,2193.0,2215.062,2257.0,445300,2296.0,2177.0
847,2018/02/09,2171.0,2152.984,2143.0,202000,2172.0,2131.0
848,2018/02/13,2148.0,2173.552,2212.0,131400,2217.0,2146.0
849,2018/02/14,2113.0,2123.955,2146.0,149900,2164.0,2099.0
850,2018/02/15,2123.0,2129.082,2130.0,96600,2152.0,2115.0
851,2018/02/16,2149.0,2149.939,2149.0,62100,2158.0,2134.0
852,2018/02/19,2212.0,2198.913,2181.0,61200,2212.0,2169.0
853,2018/02/20,2214.0,2205.076,2215.0,49900,2216.0,2192.0
854,2018/02/21,2225.0,2210.615,2217.0,133800,2229.0,2193.0
855,2018/02/22,2234.0,2219.481,2219.0,80900,2239.0,2196.0
856,2018/02/23,2283.0,2266.05,2244.0,121500,2286.0,2240.0
857,2018/02/26,2309.0,2297.706,2292.0,108400,2324.0,2276.0
858,2018/02/27,2312.0,2312.128,2325.0,83900,2329.0,2301.0
859,2018/02/28,2305.0,2316.866,2310.0,87500,2333.0,2304.0
860,2018/03/01,2277.0,2280.944,2300.0,72000,2300.0,2271.0
861,2018/03/02,2226.0,2231.469,2248.0,100000,2248.0,2224.0
862,2018/03/05,2205.0,2208.726,2225.0,95800,2231.0,2196.0
863,2018/03/06,2206.0,2220.63,2240.0,66700,2250.0,2204.0
864,2018/03/07,2187.0,2193.61,2192.0,62000,2214.0,2181.0
865,2018/03/08,2219.0,2220.841,2217.0,98500,2234.0,2209.0
866,2018/03/09,2233.0,2238.978,2243.0,164700,2259.0,2216.0
867,2018/03/12,2275.0,2267.914,2272.0,68600,2277.0,2249.0
868,2018/03/13,2288.0,2278.717,2287.0,54400,2288.0,2263.0
869,2018/03/14,2292.0,2295.987,2288.0,66800,2306.0,2284.0
870,2018/03/15,2305.0,2290.511,2294.0,49300,2307.0,2264.0
871,2018/03/16,2283.0,2288.504,2305.0,82500,2310.0,2278.0
872,2018/03/19,2283.0,2271.45,2280.0,75400,2297.0,2245.0
873,2018/03/20,2259.0,2255.746,2251.0,72400,2265.0,2247.0
874,2018/03/22,2271.0,2265.685,2260.0,82900,2283.0,2250.0
875,2018/03/23,2206.0,2212.479,2250.0,120100,2251.0,2196.0
876,2018/03/26,2216.0,2197.404,2216.0,108000,2217.0,2170.0
877,2018/03/27,2266.0,2255.864,2250.0,162000,2266.0,2245.0
878,2018/03/28,2193.0,2183.132,2185.0,110100,2195.0,2170.0
879,2018/03/29,2175.0,2184.343,2219.0,68600,2220.0,2156.0
880,2018/03/30,2181.0,2179.137,2179.0,76500,2196.0,2168.0
881,2018/04/02,2213.0,2214.177,2200.0,78000,2241.0,2186.0
882,2018/04/03,2198.0,2198.416,2189.0,68000,2217.0,2169.0
883,2018/04/04,2198.0,2200.61,2203.0,46900,2210.0,2188.0
884,2018/04/05,2208.0,2211.819,2215.0,69600,2224.0,2198.0
885,2018/04/06,2201.0,2207.468,2229.0,65200,2229.0,2193.0
886,2018/04/09,2195.0,2192.171,2196.0,51500,2205.0,2182.0
887,2018/04/10,2208.0,2202.616,2190.0,55400,2213.0,2181.0
888,2018/04/11,2212.0,2209.912,2204.0,55900,2218.0,2195.0
889,2018/04/12,2206.0,2213.544,2219.0,66600,2228.0,2199.0
890,2018/04/13,2228.0,2232.924,2214.0,46000,2246.0,2214.0
891,2018/04/16,2239.0,2235.982,2222.0,33100,2244.0,2216.0
892,2018/04/17,2212.0,2228.557,2243.0,66300,2252.0,2211.0
893,2018/04/18,2238.0,2236.425,2221.0,50800,2243.0,2212.0
894,2018/04/19,2235.0,2245.308,2249.0,87900,2263.0,2235.0
895,2018/04/20,2237.0,2240.457,2234.0,53400,2250.0,2225.0
896,2018/04/23,2225.0,2236.585,2239.0,48400,2254.0,2225.0
897,2018/04/24,2253.0,2249.7,2241.0,67900,2259.0,2235.0
898,2018/04/25,2253.0,2251.132,2253.0,63800,2261.0,2245.0
899,2018/04/26,2272.0,2276.366,2265.0,90400,2292.0,2265.0
900,2018/04/27,2267.0,2262.035,2285.0,57700,2285.0,2248.0
901,2018/05/01,2277.0,2270.962,2265.0,44300,2282.0,2249.0
902,2018/05/02,2277.0,2275.415,2279.0,23400,2283.0,2268.0
903,2018/05/07,2273.0,2270.319,2277.0,31700,2277.0,2251.0
904,2018/05/08,2277.0,2282.81,2275.0,71100,2299.0,2257.0
905,2018/05/09,2273.0,2277.332,2280.0,47600,2297.0,2260.0
906,2018/05/10,2274.0,2269.75,2266.0,32000,2280.0,2260.0
907,2018/05/11,2290.0,2294.622,2295.0,92500,2304.0,2282.0
908,2018/05/14,2065.0,2047.745,2100.0,449700,2126.0,2018.0
909,2018/05/15,2109.0,2111.447,2101.0,211400,2128.0,2091.0
910,2018/05/16,2116.0,2119.113,2118.0,133400,2140.0,2103.0
911,2018/05/17,2118.0,2116.458,2127.0,54800,2128.0,2107.0
912,2018/05/18,2122.0,2114.764,2140.0,61000,2140.0,2101.0
913,2018/05/21,2121.0,2111.367,2119.0,100200,2121.0,2091.0
914,2018/05/22,2123.0,2122.664,2123.0,43800,2135.0,2111.0
915,2018/05/23,2130.0,2127.416,2130.0,68600,2136.0,2116.0
916,2018/05/24,2102.0,2103.752,2130.0,85000,2133.0,2091.0
917,2018/05/25,2086.0,2097.543,2106.0,56200,2125.0,2086.0
918,2018/05/28,2055.0,2063.588,2084.0,60600,2086.0,2054.0
919,2018/05/29,2028.0,2033.804,2050.0,61800,2062.0,2021.0
920,2018/05/30,1995.0,1996.772,2018.0,82400,2018.0,1988.0
921,2018/05/31,1978.0,1978.932,1990.0,143300,1996.0,1969.0
922,2018/06/01,1982.0,1970.394,1960.0,125500,1990.0,1935.0
923,2018/06/04,1979.0,1987.724,1983.0,106800,2012.0,1971.0
924,2018/06/05,1969.0,1963.756,1965.0,107500,1979.0,1945.0
925,2018/06/06,2010.0,2002.103,1971.0,110900,2019.0,1971.0
926,2018/06/07,2021.0,2020.048,2012.0,73300,2032.0,2006.0
927,2018/06/08,2048.0,2037.623,2013.0,109000,2054.0,2013.0
928,2018/06/11,2051.0,2050.185,2049.0,54500,2059.0,2041.0
929,2018/06/12,2050.0,2054.204,2060.0,65100,2070.0,2045.0
930,2018/06/13,2034.0,2037.818,2045.0,53400,2047.0,2031.0
931,2018/06/14,2024.0,2026.161,2028.0,75100,2037.0,2016.0
932,2018/06/15,2011.0,2018.981,2045.0,64500,2045.0,2009.0
933,2018/06/18,1976.0,1979.342,2001.0,88700,2009.0,1967.0
934,2018/06/19,1948.0,1958.199,1970.0,76500,1983.0,1948.0
935,2018/06/20,1960.0,1942.631,1947.0,84100,1965.0,1920.0
936,2018/06/21,1950.0,1955.467,1962.0,45800,1982.0,1948.0
937,2018/06/22,1948.0,1939.362,1949.0,59100,1950.0,1921.0
938,2018/06/25,1911.0,1922.639,1951.0,51300,1951.0,1909.0
939,2018/06/26,1914.0,1901.922,1900.0,93600,1914.0,1882.0
940,2018/06/27,1929.0,1930.268,1914.0,73900,1942.0,1914.0
941,2018/06/28,1922.0,1914.614,1911.0,69700,1922.0,1899.0
942,2018/06/29,1942.0,1930.015,1918.0,79900,1945.0,1904.0
943,2018/07/02,1947.0,1959.979,1968.0,91500,1986.0,1945.0
944,2018/07/03,1916.0,1919.496,1953.0,94400,1953.0,1903.0
945,2018/07/04,1919.0,1914.335,1905.0,86400,1926.0,1902.0
946,2018/07/05,1909.0,1914.298,1918.0,98100,1931.0,1905.0
947,2018/07/06,1941.0,1931.876,1912.0,71500,1943.0,1912.0
948,2018/07/09,1978.0,1975.863,1965.0,115300,1989.0,1962.0
949,2018/07/10,1986.0,1991.354,1998.0,102300,2003.0,1981.0
950,2018/07/11,1974.0,1965.069,1970.0,75900,1980.0,1943.0
951,2018/07/12,1952.0,1957.485,1980.0,36500,1980.0,1948.0
952,2018/07/13,1983.0,1974.154,1965.0,56500,1983.0,1956.0
953,2018/07/17,1985.0,1990.886,1989.0,74600,2008.0,1978.0
954,2018/07/18,2012.0,2007.388,1987.0,69300,2017.0,1987.0
955,2018/07/19,2020.0,2016.544,2012.0,36400,2025.0,2003.0
956,2018/07/20,1988.0,1988.75,2020.0,76500,2020.0,1974.0
957,2018/07/23,2003.0,1996.677,1994.0,62300,2009.0,1984.0
958,2018/07/24,1990.0,1992.279,2008.0,61000,2010.0,1983.0
959,2018/07/25,1980.0,1978.089,1994.0,124000,1994.0,1968.0
960,2018/07/26,2029.0,2018.808,2006.0,108000,2030.0,2003.0
961,2018/07/27,2034.0,2033.304,2031.0,40500,2038.0,2026.0
962,2018/07/30,2035.0,2026.135,2020.0,53300,2037.0,2014.0
963,2018/07/31,2039.0,2037.665,2036.0,93700,2050.0,2015.0
964,2018/08/01,2045.0,2045.473,2043.0,69600,2051.0,2027.0
965,2018/08/02,2036.0,2047.303,2051.0,74300,2065.0,2031.0
966,2018/08/03,2028.0,2023.765,2039.0,60100,2039.0,2013.0
967,2018/08/06,2035.0,2041.656,2036.0,71400,2056.0,2025.0
968,2018/08/07,2047.0,2040.48,2020.0,42900,2052.0,2017.0
969,2018/08/08,2028.0,2032.556,2031.0,67800,2047.0,2024.0
970,2018/08/09,2030.0,2029.473,2031.0,49300,2035.0,2021.0
971,2018/08/10,1997.0,2000.91,2019.0,88000,2019.0,1990.0
972,2018/08/13,1961.0,1967.81,1997.0,73800,1997.0,1956.0
973,2018/08/14,1955.0,1950.722,1961.0,103900,1967.0,1940.0
974,2018/08/15,1958.0,1955.007,1956.0,60000,1963.0,1945.0
975,2018/08/16,1950.0,1945.665,1940.0,55800,1956.0,1928.0
976,2018/08/17,1958.0,1952.615,1951.0,74500,1959.0,1943.0
977,2018/08/20,1947.0,1953.073,1960.0,74100,1972.0,1946.0
978,2018/08/21,1941.0,1939.18,1947.0,50000,1951.0,1930.0
979,2018/08/22,1978.0,1966.298,1950.0,51300,1978.0,1943.0
980,2018/08/23,1976.0,1978.445,1980.0,42500,1988.0,1974.0
981,2018/08/24,2010.0,2002.652,1992.0,66100,2013.0,1986.0
982,2018/08/27,2041.0,2036.318,2019.0,75200,2047.0,2017.0
983,2018/08/28,2046.0,2047.678,2048.0,95000,2065.0,2034.0
984,2018/08/29,2067.0,2062.66,2050.0,92400,2069.0,2050.0
985,2018/08/30,2050.0,2054.608,2076.0,93000,2088.0,2036.0
986,2018/08/31,2057.0,2056.204,2046.0,72000,2069.0,2035.0
987,2018/09/03,2037.0,2042.119,2066.0,63800,2067.0,2022.0
988,2018/09/04,2043.0,2048.496,2061.0,122000,2069.0,2035.0
989,2018/09/05,2046.0,2050.91,2056.0,75300,2063.0,2033.0
990,2018/09/06,2040.0,2035.553,2031.0,141200,2050.0,2015.0
991,2018/09/07,2022.0,2022.337,2022.0,67700,2031.0,2016.0
992,2018/09/10,2023.0,2028.282,2020.0,62400,2040.0,2018.0
993,2018/09/11,2008.0,2006.694,2014.0,90300,2019.0,1993.0
994,2018/09/12,1963.0,1974.524,2018.0,67200,2018.0,1961.0
995,2018/09/13,1966.0,1981.607,1955.0,109100,2008.0,1955.0
996,2018/09/14,2012.0,1989.471,1968.0,106100,2013.0,1968.0
997,2018/09/18,2026.0,2018.445,2004.0,72200,2031.0,1991.0
998,2018/09/19,2032.0,2037.446,2040.0,83000,2050.0,2031.0
999,2018/09/20,2024.0,2019.648,2034.0,87300,2034.0,2006.0
1000,2018/09/21,2060.0,2057.369,2042.0,144100,2069.0,2041.0
1001,2018/09/25,2074.0,2065.023,2068.0,135700,2074.0,2052.0
1002,2018/09/26,2088.0,2080.797,2060.0,103700,2095.0,2060.0
1003,2018/09/27,2054.0,2074.513,2092.0,80000,2113.0,2053.0
1004,2018/09/28,2046.0,2051.118,2057.0,51800,2068.0,2040.0
1005,2018/10/01,2042.0,2044.854,2048.0,50700,2054.0,2038.0
1006,2018/10/02,2020.0,2023.831,2050.0,109500,2050.0,2002.0
1007,2018/10/03,1981.0,1995.22,2013.0,71900,2023.0,1981.0
1008,2018/10/04,1991.0,1987.69,1998.0,73500,2004.0,1976.0
1009,2018/10/05,1962.0,1968.425,1980.0,80400,1980.0,1962.0
1010,2018/10/09,1904.0,1921.695,1951.0,146400,1961.0,1902.0
1011,2018/10/10,1912.0,1913.946,1933.0,99200,1936.0,1900.0
1012,2018/10/11,1841.0,1833.373,1834.0,247500,1844.0,1824.0
1013,2018/10/12,1845.0,1832.329,1823.0,126400,1852.0,1804.0
1014,2018/10/15,1815.0,1824.272,1845.0,97800,1845.0,1813.0
1015,2018/10/16,1822.0,1814.783,1810.0,78400,1825.0,1801.0
1016,2018/10/17,1854.0,1847.855,1842.0,79200,1860.0,1832.0
1017,2018/10/18,1835.0,1844.018,1856.0,68700,1856.0,1833.0
1018,2018/10/19,1817.0,1812.86,1822.0,69900,1822.0,1803.0
1019,2018/10/22,1815.0,1807.687,1807.0,70200,1822.0,1792.0
1020,2018/10/23,1781.0,1790.057,1812.0,86000,1814.0,1781.0
1021,2018/10/24,1789.0,1786.467,1790.0,65100,1798.0,1774.0
1022,2018/10/25,1717.0,1726.978,1750.0,131200,1752.0,1714.0
1023,2018/10/26,1710.0,1715.601,1738.0,98600,1738.0,1696.0
1024,2018/10/29,1696.0,1705.315,1710.0,66900,1725.0,1696.0
1025,2018/10/30,1723.0,1720.267,1696.0,98400,1733.0,1695.0
1026,2018/10/31,1762.0,1755.353,1745.0,76700,1767.0,1731.0
1027,2018/11/01,1757.0,1760.885,1759.0,66000,1774.0,1753.0
1028,2018/11/02,1761.0,1754.181,1742.0,79000,1764.0,1736.0
1029,2018/11/05,1740.0,1747.229,1752.0,59900,1760.0,1737.0
1030,2018/11/06,1748.0,1741.961,1733.0,86300,1753.0,1713.0
1031,2018/11/07,1719.0,1720.059,1708.0,166800,1743.0,1682.0
1032,2018/11/08,1764.0,1762.04,1758.0,115900,1771.0,1749.0
1033,2018/11/09,1781.0,1779.684,1766.0,70600,1794.0,1766.0
1034,2018/11/12,1777.0,1774.716,1776.0,69000,1780.0,1761.0
1035,2018/11/13,1728.0,1724.882,1739.0,96000,1739.0,1709.0
1036,2018/11/14,1724.0,1729.265,1734.0,84200,1745.0,1721.0
1037,2018/11/15,1732.0,1721.825,1717.0,50200,1732.0,1715.0
1038,2018/11/16,1721.0,1723.024,1742.0,84900,1742.0,1711.0
1039,2018/11/19,1727.0,1725.053,1732.0,49300,1736.0,1718.0
1040,2018/11/20,1724.0,1716.23,1711.0,45300,1724.0,1701.0
1041,2018/11/21,1715.0,1712.433,1709.0,121400,1720.0,1700.0
1042,2018/11/22,1710.0,1708.599,1705.0,72800,1719.0,1700.0
1043,2018/11/26,1731.0,1721.587,1718.0,54900,1733.0,1709.0
1044,2018/11/27,1744.0,1739.366,1739.0,68900,1745.0,1732.0
1045,2018/11/28,1778.0,1762.999,1749.0,88400,1778.0,1744.0
1046,2018/11/29,1770.0,1775.089,1786.0,71600,1792.0,1766.0
1047,2018/11/30,1779.0,1776.328,1777.0,87300,1789.0,1758.0
1048,2018/12/03,1781.0,1779.686,1785.0,104900,1786.0,1772.0
1049,2018/12/04,1763.0,1772.634,1780.0,80100,1796.0,1762.0
1050,2018/12/05,1733.0,1736.013,1745.0,92700,1750.0,1727.0
1051,2018/12/06,1707.0,1710.616,1731.0,91600,1731.0,1701.0
1052,2018/12/07,1633.0,1657.129,1700.0,322400,1700.0,1627.0
1053,2018/12/10,1635.0,1626.787,1633.0,127400,1635.0,1615.0
1054,2018/12/11,1624.0,1624.046,1631.0,85000,1642.0,1616.0
1055,2018/12/12,1636.0,1636.733,1624.0,87200,1643.0,1624.0
1056,2018/12/13,1668.0,1664.305,1657.0,99200,1671.0,1652.0
1057,2018/12/14,1635.0,1650.444,1662.0,101500,1662.0,1635.0
1058,2018/12/17,1634.0,1632.906,1635.0,64800,1641.0,1624.0
1059,2018/12/18,1622.0,1623.439,1619.0,83200,1640.0,1602.0
1060,2018/12/19,1617.0,1616.623,1614.0,77000,1624.0,1609.0
1061,2018/12/20,1572.0,1588.762,1614.0,149700,1614.0,1570.0
1062,2018/12/21,1532.0,1534.841,1559.0,160600,1561.0,1519.0
1063,2018/12/25,1474.0,1469.301,1462.0,140000,1479.0,1454.0
1064,2018/12/26,1512.0,1503.366,1479.0,106100,1518.0,1474.0
1065,2018/12/27,1565.0,1555.517,1552.0,104800,1565.0,1542.0
1066,2018/12/28,1582.0,1575.346,1561.0,59900,1583.0,1557.0
1067,2019/01/04,1590.0,1573.319,1556.0,121100,1593.0,1533.0
1068,2019/01/07,1642.0,1642.097,1630.0,77700,1654.0,1619.0
1069,2019/01/08,1658.0,1660.087,1657.0,68700,1671.0,1647.0
1070,2019/01/09,1650.0,1649.714,1650.0,54900,1656.0,1639.0
1071,2019/01/10,1632.0,1634.046,1650.0,69200,1655.0,1625.0
1072,2019/01/11,1635.0,1630.187,1642.0,64800,1642.0,1618.0
1073,2019/01/15,1659.0,1646.543,1620.0,51600,1659.0,1613.0
1074,2019/01/16,1642.0,1646.977,1661.0,47400,1661.0,1639.0
1075,2019/01/17,1652.0,1651.259,1660.0,52600,1668.0,1641.0
1076,2019/01/18,1669.0,1666.923,1652.0,44300,1676.0,1647.0
1077,2019/01/21,1685.0,1677.675,1665.0,57900,1687.0,1665.0
1078,2019/01/22,1678.0,1679.659,1692.0,35800,1696.0,1673.0
1079,2019/01/23,1664.0,1663.277,1665.0,48700,1676.0,1648.0
1080,2019/01/24,1689.0,1681.286,1666.0,51100,1692.0,1656.0
1081,2019/01/25,1707.0,1710.65,1694.0,62800,1724.0,1690.0
1082,2019/01/28,1715.0,1716.049,1708.0,42800,1724.0,1705.0
1083,2019/01/29,1736.0,1723.919,1712.0,66900,1738.0,1705.0
1084,2019/01/30,1705.0,1714.31,1734.0,104300,1735.0,1705.0
1085,2019/01/31,1713.0,1712.277,1731.0,104000,1733.0,1703.0
1086,2019/02/01,1711.0,1716.513,1716.0,69000,1731.0,1707.0
1087,2019/02/04,1735.0,1728.613,1724.0,64400,1735.0,1714.0
1088,2019/02/05,1759.0,1755.593,1750.0,95000,1765.0,1747.0
1089,2019/02/06,1732.0,1741.193,1759.0,83400,1762.0,1729.0
1090,2019/02/07,1746.0,1737.119,1729.0,69000,1746.0,1725.0
1091,2019/02/08,1717.0,1716.251,1720.0,84800,1735.0,1702.0
1092,2019/02/12,1731.0,1701.245,1690.0,130700,1732.0,1645.0
1093,2019/02/13,1737.0,1735.109,1739.0,114400,1754.0,1721.0
1094,2019/02/14,1753.0,1753.587,1736.0,72900,1768.0,1730.0
1095,2019/02/15,1748.0,1741.168,1743.0,63600,1751.0,1728.0
1096,2019/02/18,1761.0,1761.19,1770.0,84100,1781.0,1749.0
1097,2019/02/19,1769.0,1763.113,1760.0,70900,1771.0,1750.0
1098,2019/02/20,1756.0,1759.699,1769.0,61700,1776.0,1745.0
1099,2019/02/21,1760.0,1757.507,1760.0,42400,1766.0,1749.0
1100,2019/02/22,1739.0,1737.193,1746.0,88400,1746.0,1725.0
1101,2019/02/25,1770.0,1762.402,1745.0,76600,1770.0,1737.0
1102,2019/02/26,1794.0,1791.696,1782.0,106900,1798.0,1776.0
1103,2019/02/27,1790.0,1792.844,1788.0,129800,1805.0,1781.0
1104,2019/02/28,1788.0,1786.62,1783.0,77100,1796.0,1776.0
1105,2019/03/01,1775.0,1782.481,1788.0,65500,1802.0,1774.0
1106,2019/03/04,1787.0,1780.777,1780.0,91900,1789.0,1773.0
1107,2019/03/05,1796.0,1785.395,1773.0,65400,1796.0,1773.0
1108,2019/03/06,1794.0,1796.549,1785.0,60300,1807.0,1785.0
1109,2019/03/07,1791.0,1785.807,1780.0,76500,1792.0,1777.0
1110,2019/03/08,1746.0,1761.938,1777.0,98000,1789.0,1746.0
1111,2019/03/11,1751.0,1753.14,1758.0,72400,1762.0,1746.0
1112,2019/03/12,1778.0,1776.919,1765.0,73000,1789.0,1755.0
1113,2019/03/13,1760.0,1765.627,1764.0,86400,1782.0,1753.0
1114,2019/03/14,1757.0,1759.17,1766.0,66500,1769.0,1753.0
1115,2019/03/15,1769.0,1769.665,1765.0,98300,1778.0,1763.0
1116,2019/03/18,1798.0,1785.229,1768.0,125100,1799.0,1757.0
1117,2019/03/19,1804.0,1805.644,1809.0,71100,1813.0,1795.0
1118,2019/03/20,1812.0,1807.818,1796.0,83000,1814.0,1793.0
1119,2019/03/22,1829.0,1822.533,1810.0,130100,1831.0,1805.0
1120,2019/03/25,1800.0,1797.896,1810.0,102900,1814.0,1787.0
1121,2019/03/26,1837.0,1822.3,1800.0,261300,1837.0,1793.0
1122,2019/03/27,1716.0,1720.537,1723.0,236900,1751.0,1703.0
1123,2019/03/28,1661.0,1674.182,1696.0,119500,1700.0,1660.0
1124,2019/03/29,1681.0,1682.023,1674.0,88200,1693.0,1669.0
1125,2019/04/01,1750.0,1744.947,1706.0,170100,1762.0,1706.0
1126,2019/04/02,1773.0,1768.636,1750.0,106600,1779.0,1750.0
1127,2019/04/03,1786.0,1780.865,1770.0,99400,1791.0,1765.0
1128,2019/04/04,1790.0,1795.256,1785.0,102000,1808.0,1777.0
1129,2019/04/05,1805.0,1798.905,1790.0,86400,1806.0,1790.0
1130,2019/04/08,1807.0,1803.893,1802.0,67100,1812.0,1790.0
1131,2019/04/09,1819.0,1808.355,1786.0,95800,1819.0,1786.0
1132,2019/04/10,1798.0,1796.036,1799.0,36400,1801.0,1790.0
1133,2019/04/11,1778.0,1781.004,1790.0,52200,1794.0,1774.0
1134,2019/04/12,1768.0,1769.284,1776.0,54500,1779.0,1759.0
1135,2019/04/15,1821.0,1818.68,1799.0,97300,1828.0,1799.0
1136,2019/04/16,1815.0,1812.791,1814.0,39300,1822.0,1802.0
1137,2019/04/17,1825.0,1821.974,1816.0,69200,1826.0,1812.0
1138,2019/04/18,1777.0,1788.284,1823.0,61200,1826.0,1769.0
1139,2019/04/19,1783.0,1783.241,1784.0,29900,1792.0,1779.0
1140,2019/04/22,1783.0,1777.764,1783.0,30500,1783.0,1768.0
1141,2019/04/23,1791.0,1786.64,1791.0,37500,1794.0,1772.0
1142,2019/04/24,1778.0,1782.436,1790.0,39200,1796.0,1772.0
1143,2019/04/25,1798.0,1792.157,1792.0,41500,1799.0,1774.0
1144,2019/04/26,1804.0,1797.284,1795.0,51400,1812.0,1776.0
1145,2019/05/07,1742.0,1757.817,1787.0,86400,1790.0,1740.0
1146,2019/05/08,1693.0,1699.355,1719.0,76400,1719.0,1691.0
1147,2019/05/09,1678.0,1679.175,1685.0,99800,1689.0,1663.0
1148,2019/05/10,1691.0,1695.188,1676.0,91700,1718.0,1673.0
1149,2019/05/13,1682.0,1702.632,1698.0,72500,1723.0,1682.0
1150,2019/05/14,1671.0,1667.735,1650.0,81100,1692.0,1642.0
1151,2019/05/15,1527.0,1556.827,1695.0,184100,1695.0,1516.0
1152,2019/05/16,1502.0,1490.453,1520.0,161900,1521.0,1471.0
1153,2019/05/17,1505.0,1494.011,1518.0,114200,1520.0,1462.0
1154,2019/05/20,1481.0,1482.854,1517.0,86500,1524.0,1463.0
1155,2019/05/21,1475.0,1473.609,1468.0,56800,1489.0,1461.0
1156,2019/05/22,1480.0,1487.91,1502.0,69000,1502.0,1479.0
1157,2019/05/23,1454.0,1457.619,1480.0,91300,1481.0,1448.0
1158,2019/05/24,1430.0,1425.994,1430.0,143600,1432.0,1413.0
1159,2019/05/27,1409.0,1413.979,1433.0,110600,1433.0,1406.0
1160,2019/05/28,1411.0,1416.148,1419.0,90500,1423.0,1410.0
1161,2019/05/29,1391.0,1388.203,1400.0,106300,1400.0,1372.0
1162,2019/05/30,1392.0,1384.628,1381.0,111500,1394.0,1368.0
1163,2019/05/31,1379.0,1381.457,1385.0,58900,1392.0,1376.0
1164,2019/06/03,1367.0,1365.799,1362.0,131500,1373.0,1356.0
1165,2019/06/04,1382.0,1370.694,1367.0,131100,1382.0,1362.0
1166,2019/06/05,1420.0,1415.683,1408.0,104100,1426.0,1402.0
1167,2019/06/06,1380.0,1390.859,1406.0,81300,1417.0,1380.0
1168,2019/06/07,1398.0,1390.318,1373.0,93900,1404.0,1372.0
1169,2019/06/10,1421.0,1418.27,1405.0,60300,1430.0,1405.0
1170,2019/06/11,1442.0,1439.178,1422.0,80200,1452.0,1417.0
1171,2019/06/12,1423.0,1429.241,1432.0,81500,1444.0,1420.0
1172,2019/06/13,1397.0,1398.294,1412.0,83800,1416.0,1384.0
1173,2019/06/14,1397.0,1401.176,1404.0,68900,1410.0,1391.0
1174,2019/06/17,1375.0,1383.033,1397.0,81700,1398.0,1374.0
1175,2019/06/18,1380.0,1378.49,1370.0,83100,1384.0,1368.0
1176,2019/06/19,1407.0,1408.586,1386.0,82400,1415.0,1386.0
1177,2019/06/20,1397.0,1393.534,1407.0,78500,1410.0,1383.0
1178,2019/06/21,1395.0,1394.08,1395.0,59000,1401.0,1388.0
1179,2019/06/24,1395.0,1395.311,1391.0,42100,1402.0,1389.0
1180,2019/06/25,1380.0,1386.39,1390.0,72400,1400.0,1377.0
1181,2019/06/26,1381.0,1381.743,1375.0,68000,1389.0,1372.0
1182,2019/06/27,1420.0,1411.488,1386.0,71100,1420.0,1381.0
1183,2019/06/28,1405.0,1406.022,1411.0,46000,1417.0,1402.0
1184,2019/07/01,1431.0,1422.545,1445.0,152000,1452.0,1395.0
1185,2019/07/02,1421.0,1421.679,1421.0,62000,1428.0,1412.0
1186,2019/07/03,1423.0,1423.129,1416.0,61300,1431.0,1412.0
1187,2019/07/04,1437.0,1433.57,1434.0,45600,1438.0,1422.0
1188,2019/07/05,1432.0,1427.951,1428.0,64600,1434.0,1419.0
1189,2019/07/08,1422.0,1424.188,1430.0,74400,1430.0,1415.0
1190,2019/07/09,1418.0,1417.106,1416.0,42600,1426.0,1410.0
1191,2019/07/10,1414.0,1413.339,1403.0,66300,1420.0,1402.0
1192,2019/07/11,1432.0,1427.968,1418.0,56600,1434.0,1412.0
1193,2019/07/12,1410.0,1412.894,1427.0,65100,1427.0,1408.0
1194,2019/07/16,1423.0,1420.887,1412.0,56600,1427.0,1408.0
1195,2019/07/17,1417.0,1417.72,1415.0,70800,1423.0,1411.0
1196,2019/07/18,1379.0,1388.681,1412.0,94400,1412.0,1378.0
1197,2019/07/19,1411.0,1404.144,1382.0,48100,1415.0,1378.0
1198,2019/07/22,1410.0,1414.836,1403.0,51200,1427.0,1403.0
1199,2019/07/23,1435.0,1431.153,1408.0,61400,1440.0,1408.0
1200,2019/07/24,1438.0,1437.603,1438.0,52200,1443.0,1433.0
1201,2019/07/25,1446.0,1445.19,1454.0,58500,1457.0,1436.0
1202,2019/07/26,1433.0,1428.975,1435.0,52500,1437.0,1419.0
1203,2019/07/29,1433.0,1428.943,1428.0,64900,1436.0,1418.0
1204,2019/07/30,1457.0,1451.385,1435.0,107600,1458.0,1435.0
1205,2019/07/31,1456.0,1458.344,1453.0,114700,1466.0,1449.0
1206,2019/08/01,1452.0,1450.091,1443.0,40900,1458.0,1438.0
1207,2019/08/02,1394.0,1401.9,1421.0,104800,1422.0,1390.0
1208,2019/08/05,1375.0,1367.597,1390.0,128700,1390.0,1351.0
1209,2019/08/06,1362.0,1351.029,1330.0,76000,1365.0,1321.0
1210,2019/08/07,1321.0,1328.115,1375.0,189000,1388.0,1314.0
1211,2019/08/08,1350.0,1348.947,1311.0,98200,1366.0,1311.0
1212,2019/08/09,1376.0,1376.879,1371.0,81900,1388.0,1365.0
1213,2019/08/13,1367.0,1360.047,1360.0,46600,1367.0,1344.0
1214,2019/08/14,1371.0,1369.208,1379.0,86000,1387.0,1356.0
1215,2019/08/15,1363.0,1358.481,1338.0,41800,1367.0,1338.0
1216,2019/08/16,1358.0,1363.894,1357.0,48200,1379.0,1356.0
1217,2019/08/19,1352.0,1361.562,1374.0,54100,1380.0,1352.0
1218,2019/08/20,1369.0,1365.394,1355.0,33000,1371.0,1355.0
1219,2019/08/21,1338.0,1341.674,1350.0,54000,1357.0,1335.0
1220,2019/08/22,1320.0,1322.753,1341.0,50900,1345.0,1315.0
1221,2019/08/23,1318.0,1321.525,1332.0,43400,1332.0,1311.0
