ds,yhat
2019-08-21,375.6984466968162
2019-08-22,375.79722970017184
2019-08-23,375.6448592123733
2019-08-26,376.78548550892987
2019-08-27,376.83265395758156
2019-08-28,375.9983986444546
2019-08-29,374.51540194701835
2019-08-30,372.99207881449416
2019-09-02,369.2407910710949
2019-09-03,366.7480358793615
2019-09-04,363.64882067637245
2019-09-05,360.90253704223034
2019-09-06,359.3576124280278
2019-09-09,358.2434126740631
2019-09-10,356.20491350715923
2019-09-11,353.444537888674
2019-09-12,351.08129144513435
2019-09-13,350.02665128283644
2019-09-17,355.8335964917773
2019-09-18,357.81640123219427
2019-09-19,359.70379270564126
