,Date,Close,VWAP,Open,Volume,High,Low
0,2014/08/25,842.0,839.709,835.0,82400,850.0,835.0
1,2014/08/26,824.0,828.798,840.0,108300,845.0,820.0
2,2014/08/27,828.0,828.321,824.0,71000,835.0,824.0
3,2014/08/28,836.0,836.59,821.0,230800,847.0,821.0
4,2014/08/29,892.0,869.023,827.0,1021600,895.0,816.0
5,2014/09/01,873.0,880.624,900.0,588200,910.0,861.0
6,2014/09/02,861.0,865.849,865.0,177900,876.0,859.0
7,2014/09/03,892.0,891.72,870.0,588800,909.0,862.0
8,2014/09/04,908.0,912.1,898.0,969300,930.0,890.0
9,2014/09/05,889.0,896.155,914.0,363000,915.0,885.0
10,2014/09/08,896.0,893.118,901.0,134500,901.0,885.0
11,2014/09/09,884.0,893.386,904.0,126100,905.0,884.0
12,2014/09/10,872.0,870.02,875.0,118800,877.0,865.0
13,2014/09/11,864.0,866.614,867.0,104800,873.0,864.0
14,2014/09/12,868.0,870.261,860.0,163800,888.0,859.0
15,2014/09/16,859.0,860.441,860.0,97900,864.0,857.0
16,2014/09/17,863.0,863.246,863.0,146600,875.0,855.0
17,2014/09/18,862.0,865.292,878.0,111500,878.0,860.0
18,2014/09/19,866.0,866.716,863.0,80900,875.0,861.0
19,2014/09/22,865.0,864.68,872.0,67900,872.0,862.0
20,2014/09/24,865.0,864.944,864.0,135300,867.0,862.0
21,2014/09/25,866.0,864.644,868.0,126200,869.0,862.0
22,2014/09/26,857.0,856.738,861.0,71800,861.0,845.0
23,2014/09/29,854.0,858.657,858.0,137700,871.0,852.0
24,2014/09/30,852.0,851.011,856.0,118000,856.0,848.0
25,2014/10/01,838.0,844.132,848.0,197500,853.0,838.0
26,2014/10/02,812.0,818.882,822.0,262200,826.0,812.0
27,2014/10/03,819.0,813.221,810.0,133800,822.0,806.0
28,2014/10/06,839.0,833.187,826.0,123400,845.0,822.0
29,2014/10/07,819.0,825.174,831.0,128000,835.0,816.0
30,2014/10/08,807.0,809.41,812.0,136300,816.0,804.0
31,2014/10/09,796.0,801.441,814.0,197700,816.0,796.0
32,2014/10/10,781.0,777.49,779.0,299800,794.0,770.0
33,2014/10/14,753.0,758.066,754.0,138500,769.0,749.0
34,2014/10/15,815.0,800.172,756.0,561300,828.0,756.0
35,2014/10/16,866.0,888.752,793.0,4189400,933.0,781.0
36,2014/10/17,784.0,813.213,851.0,1055100,853.0,781.0
37,2014/10/20,787.0,790.355,793.0,373400,807.0,777.0
38,2014/10/21,766.0,771.598,776.0,258200,778.0,766.0
39,2014/10/22,771.0,771.672,773.0,117600,784.0,766.0
40,2014/10/23,772.0,774.0,767.0,112800,780.0,767.0
41,2014/10/24,775.0,785.398,779.0,201900,799.0,773.0
42,2014/10/27,776.0,777.936,778.0,85600,784.0,773.0
43,2014/10/28,762.0,765.639,770.0,148100,774.0,761.0
44,2014/10/29,765.0,770.475,770.0,103500,777.0,763.0
45,2014/10/30,760.0,763.501,775.0,252000,775.0,760.0
46,2014/10/31,781.0,773.842,768.0,266400,785.0,762.0
47,2014/11/04,783.0,792.298,800.0,150900,806.0,781.0
48,2014/11/05,790.0,785.592,782.0,81800,794.0,777.0
49,2014/11/06,821.0,828.318,803.0,599700,858.0,800.0
50,2014/11/07,815.0,815.568,822.0,102500,825.0,810.0
51,2014/11/10,823.0,818.482,814.0,99400,825.0,809.0
52,2014/11/11,817.0,817.356,826.0,62300,826.0,813.0
53,2014/11/12,804.0,816.99,818.0,428400,844.0,804.0
54,2014/11/13,802.0,803.426,803.0,130700,809.0,800.0
55,2014/11/14,798.0,801.826,815.0,88100,815.0,795.0
56,2014/11/17,790.0,793.622,797.0,102300,800.0,790.0
57,2014/11/18,806.0,801.536,800.0,81500,808.0,792.0
58,2014/11/19,830.0,823.881,802.0,300700,835.0,802.0
59,2014/11/20,840.0,840.44,835.0,279700,848.0,821.0
60,2014/11/21,837.0,834.357,840.0,109600,840.0,822.0
61,2014/11/25,841.0,841.079,836.0,138900,845.0,830.0
62,2014/11/26,886.0,875.778,848.0,680300,886.0,843.0
63,2014/11/27,876.0,883.945,890.0,270400,892.0,870.0
64,2014/11/28,879.0,881.064,872.0,189200,893.0,872.0
65,2014/12/01,889.0,886.89,889.0,173400,892.0,881.0
66,2014/12/02,900.0,900.801,887.0,322700,909.0,884.0
67,2014/12/03,895.0,897.581,900.0,124900,906.0,891.0
68,2014/12/04,892.0,891.513,900.0,128300,900.0,881.0
69,2014/12/05,899.0,894.812,890.0,107300,900.0,882.0
70,2014/12/08,891.0,894.062,895.0,89100,900.0,888.0
71,2014/12/09,870.0,879.507,891.0,137600,897.0,865.0
72,2014/12/10,862.0,858.622,855.0,127400,870.0,850.0
73,2014/12/11,863.0,848.735,843.0,134000,867.0,833.0
74,2014/12/12,857.0,859.464,856.0,85000,870.0,856.0
75,2014/12/15,846.0,850.682,850.0,72100,860.0,843.0
76,2014/12/16,807.0,814.697,831.0,200700,831.0,805.0
77,2014/12/17,789.0,794.022,804.0,241000,809.0,785.0
78,2014/12/18,811.0,803.567,800.0,275200,818.0,790.0
79,2014/12/19,814.0,819.165,811.0,231500,843.0,811.0
80,2014/12/22,800.0,799.65,812.0,211300,812.0,788.0
81,2014/12/24,793.0,799.093,800.0,355300,810.0,791.0
82,2014/12/25,780.0,783.904,790.0,372900,797.0,776.0
83,2014/12/26,810.0,805.728,795.0,187200,815.0,792.0
84,2014/12/29,810.0,809.663,810.0,134500,816.0,798.0
85,2014/12/30,801.0,803.645,814.0,91600,814.0,795.0
86,2015/01/05,810.0,814.951,808.0,119700,822.0,803.0
87,2015/01/06,799.0,800.336,805.0,214600,824.0,792.0
88,2015/01/07,805.0,806.489,800.0,312600,819.0,800.0
89,2015/01/08,801.0,804.625,808.0,115400,812.0,800.0
90,2015/01/09,799.0,800.785,803.0,139700,810.0,792.0
91,2015/01/13,790.0,786.495,792.0,102200,793.0,781.0
92,2015/01/14,776.0,779.082,782.0,171900,791.0,775.0
93,2015/01/15,794.0,792.402,774.0,214500,806.0,774.0
94,2015/01/16,786.0,777.931,781.0,167400,789.0,771.0
95,2015/01/19,795.0,796.233,791.0,129400,810.0,782.0
96,2015/01/20,800.0,800.199,802.0,88000,804.0,797.0
97,2015/01/21,788.0,791.245,799.0,73800,799.0,786.0
98,2015/01/22,787.0,784.973,787.0,69500,792.0,777.0
99,2015/01/23,796.0,793.331,791.0,105100,798.0,787.0
100,2015/01/26,806.0,804.224,802.0,134400,809.0,796.0
101,2015/01/27,812.0,810.481,810.0,165800,814.0,804.0
102,2015/01/28,812.0,810.991,808.0,162300,816.0,804.0
103,2015/01/29,800.0,801.861,802.0,96200,809.0,798.0
104,2015/01/30,802.0,802.701,808.0,72200,809.0,798.0
105,2015/02/02,796.0,800.222,807.0,64000,807.0,796.0
106,2015/02/03,781.0,788.322,796.0,134600,799.0,780.0
107,2015/02/04,786.0,791.526,785.0,130400,801.0,785.0
108,2015/02/05,785.0,784.197,783.0,97800,788.0,780.0
109,2015/02/06,802.0,797.314,790.0,107600,803.0,788.0
110,2015/02/09,805.0,801.686,800.0,111900,806.0,795.0
111,2015/02/10,801.0,799.669,807.0,103900,807.0,796.0
112,2015/02/12,782.0,797.78,804.0,274400,808.0,777.0
113,2015/02/13,770.0,771.798,779.0,278100,782.0,767.0
114,2015/02/16,783.0,784.103,773.0,124700,794.0,773.0
115,2015/02/17,800.0,798.003,783.0,162200,803.0,783.0
116,2015/02/18,797.0,801.11,803.0,132000,808.0,795.0
117,2015/02/19,798.0,797.271,793.0,105200,802.0,790.0
118,2015/02/20,798.0,797.865,799.0,111300,801.0,795.0
119,2015/02/23,802.0,802.083,800.0,121300,805.0,799.0
120,2015/02/24,799.0,798.944,800.0,143100,805.0,797.0
121,2015/02/25,785.0,788.439,793.0,296700,796.0,785.0
122,2015/02/26,784.0,785.342,785.0,120900,791.0,782.0
123,2015/02/27,777.0,778.715,784.0,216200,786.0,775.0
124,2015/03/02,783.0,778.618,775.0,130700,783.0,775.0
125,2015/03/03,776.0,777.11,782.0,167800,785.0,775.0
126,2015/03/04,775.0,773.082,772.0,159900,778.0,770.0
127,2015/03/05,773.0,775.211,770.0,127800,781.0,770.0
128,2015/03/06,772.0,773.368,773.0,144200,779.0,771.0
129,2015/03/09,772.0,773.52,776.0,160200,777.0,770.0
130,2015/03/10,773.0,771.842,771.0,117800,775.0,770.0
131,2015/03/11,771.0,775.389,773.0,138100,781.0,770.0
132,2015/03/12,771.0,771.873,775.0,102100,776.0,770.0
133,2015/03/13,772.0,771.738,770.0,155600,774.0,770.0
134,2015/03/16,772.0,770.319,772.0,93000,772.0,769.0
135,2015/03/17,767.0,768.043,772.0,140600,772.0,765.0
136,2015/03/18,756.0,758.39,768.0,290200,768.0,753.0
137,2015/03/19,755.0,753.372,754.0,117600,759.0,750.0
138,2015/03/20,761.0,758.642,754.0,101300,763.0,752.0
139,2015/03/23,762.0,758.305,758.0,69800,762.0,754.0
140,2015/03/24,760.0,758.218,759.0,77100,762.0,754.0
141,2015/03/25,764.0,762.033,758.0,75200,767.0,758.0
142,2015/03/26,757.0,758.942,760.0,90900,765.0,757.0
143,2015/03/27,755.0,754.868,748.0,123300,765.0,748.0
144,2015/03/30,756.0,756.115,756.0,80600,759.0,753.0
145,2015/03/31,760.0,760.34,758.0,103200,764.0,756.0
146,2015/04/01,753.0,755.791,763.0,79100,763.0,753.0
147,2015/04/02,753.0,754.659,754.0,64300,758.0,753.0
148,2015/04/03,757.0,756.621,755.0,75900,760.0,753.0
149,2015/04/06,754.0,756.42,758.0,74000,761.0,753.0
150,2015/04/07,755.0,754.353,756.0,109800,757.0,753.0
151,2015/04/08,757.0,758.483,756.0,126200,762.0,754.0
152,2015/04/09,754.0,756.426,757.0,78500,760.0,753.0
153,2015/04/10,747.0,750.913,758.0,196700,758.0,743.0
154,2015/04/13,745.0,746.059,748.0,106000,750.0,742.0
155,2015/04/14,753.0,751.499,750.0,165200,757.0,745.0
156,2015/04/15,747.0,748.05,753.0,106600,753.0,745.0
157,2015/04/16,749.0,747.265,750.0,72400,750.0,745.0
158,2015/04/17,744.0,748.014,750.0,214600,755.0,744.0
159,2015/04/20,737.0,740.453,746.0,163900,746.0,737.0
160,2015/04/21,737.0,737.324,737.0,87800,740.0,736.0
161,2015/04/22,737.0,737.964,739.0,147800,744.0,734.0
162,2015/04/23,742.0,740.434,737.0,141000,745.0,736.0
163,2015/04/24,738.0,738.987,742.0,71200,742.0,738.0
164,2015/04/27,740.0,738.913,740.0,54300,741.0,737.0
165,2015/04/28,744.0,743.596,740.0,75700,748.0,740.0
166,2015/04/30,736.0,736.994,740.0,98900,742.0,734.0
167,2015/05/01,735.0,732.942,735.0,111100,738.0,731.0
168,2015/05/07,733.0,734.997,733.0,86700,740.0,731.0
169,2015/05/08,737.0,736.587,733.0,66300,740.0,731.0
170,2015/05/11,740.0,743.363,742.0,92800,746.0,738.0
171,2015/05/12,746.0,743.53,742.0,95900,747.0,737.0
172,2015/05/13,742.0,743.423,743.0,45200,746.0,741.0
173,2015/05/14,734.0,740.858,740.0,138300,747.0,734.0
174,2015/05/15,740.0,738.365,745.0,88400,745.0,735.0
175,2015/05/18,743.0,741.956,743.0,59500,744.0,739.0
176,2015/05/19,744.0,744.258,744.0,63300,746.0,741.0
177,2015/05/20,738.0,737.987,742.0,140000,742.0,735.0
178,2015/05/21,735.0,733.647,736.0,121700,739.0,731.0
179,2015/05/22,736.0,735.022,737.0,50000,737.0,732.0
180,2015/05/25,741.0,738.776,735.0,76600,744.0,733.0
181,2015/05/26,737.0,738.285,736.0,67300,742.0,736.0
182,2015/05/27,737.0,736.424,737.0,50900,738.0,734.0
183,2015/05/28,741.0,739.082,738.0,65500,741.0,735.0
184,2015/05/29,735.0,735.823,741.0,62600,741.0,733.0
185,2015/06/01,734.0,732.992,737.0,47400,737.0,732.0
186,2015/06/02,732.0,735.032,734.0,68000,738.0,732.0
187,2015/06/03,736.0,734.26,732.0,79900,736.0,732.0
188,2015/06/04,732.0,733.74,734.0,64500,736.0,732.0
189,2015/06/05,753.0,773.751,733.0,3450200,836.0,731.0
190,2015/06/08,754.0,748.103,746.0,270400,757.0,740.0
191,2015/06/09,735.0,743.92,754.0,235900,755.0,735.0
192,2015/06/10,734.0,736.721,738.0,90100,744.0,734.0
193,2015/06/11,735.0,734.552,737.0,104300,739.0,732.0
194,2015/06/12,736.0,733.281,732.0,96500,737.0,732.0
195,2015/06/15,733.0,733.085,732.0,67000,735.0,732.0
196,2015/06/16,727.0,729.298,733.0,156100,734.0,727.0
197,2015/06/17,725.0,726.549,728.0,105500,731.0,723.0
198,2015/06/18,723.0,724.143,727.0,91100,727.0,723.0
199,2015/06/19,723.0,723.906,724.0,56100,726.0,723.0
200,2015/06/22,725.0,723.718,725.0,93100,725.0,723.0
201,2015/06/23,728.0,724.778,727.0,74000,728.0,723.0
202,2015/06/24,727.0,727.285,728.0,70200,729.0,724.0
203,2015/06/25,723.0,723.551,724.0,102800,727.0,722.0
204,2015/06/26,721.0,722.259,723.0,73800,724.0,721.0
205,2015/06/29,702.0,707.303,715.0,158700,715.0,702.0
206,2015/06/30,705.0,702.479,700.0,82100,706.0,700.0
207,2015/07/01,710.0,707.747,706.0,55000,710.0,705.0
208,2015/07/02,710.0,709.742,712.0,49900,714.0,707.0
209,2015/07/03,712.0,710.495,710.0,50700,714.0,707.0
210,2015/07/06,701.0,703.642,707.0,98500,709.0,701.0
211,2015/07/07,703.0,706.748,711.0,49900,711.0,703.0
212,2015/07/08,693.0,698.044,705.0,117500,706.0,693.0
213,2015/07/09,670.0,660.911,681.0,204900,682.0,637.0
214,2015/07/10,667.0,669.173,670.0,75700,675.0,665.0
215,2015/07/13,678.0,676.624,672.0,43900,680.0,670.0
216,2015/07/14,695.0,694.342,682.0,79500,700.0,682.0
217,2015/07/15,698.0,695.944,698.0,44600,699.0,692.0
218,2015/07/16,694.0,692.191,694.0,48300,697.0,687.0
219,2015/07/17,696.0,694.167,694.0,30600,696.0,692.0
220,2015/07/21,713.0,704.797,698.0,100500,713.0,697.0
221,2015/07/22,704.0,705.898,711.0,33300,711.0,702.0
222,2015/07/23,705.0,705.252,712.0,35300,712.0,701.0
223,2015/07/24,702.0,704.355,703.0,23100,707.0,702.0
224,2015/07/27,698.0,699.996,705.0,47800,705.0,697.0
225,2015/07/28,691.0,692.471,691.0,48800,699.0,690.0
226,2015/07/29,690.0,692.039,696.0,28000,700.0,688.0
227,2015/07/30,696.0,693.997,692.0,31700,697.0,691.0
228,2015/07/31,695.0,692.573,695.0,32800,695.0,688.0
229,2015/08/03,695.0,694.173,693.0,13300,698.0,692.0
230,2015/08/04,702.0,695.889,692.0,67800,702.0,688.0
231,2015/08/05,688.0,687.416,685.0,68700,693.0,685.0
232,2015/08/06,688.0,689.735,689.0,44500,694.0,688.0
233,2015/08/07,687.0,687.077,688.0,49200,692.0,683.0
234,2015/08/10,688.0,688.238,686.0,33200,691.0,686.0
235,2015/08/11,690.0,693.751,691.0,103500,700.0,680.0
236,2015/08/12,684.0,684.868,682.0,34800,689.0,682.0
237,2015/08/13,680.0,681.186,684.0,37200,686.0,678.0
238,2015/08/14,678.0,677.157,680.0,30500,683.0,675.0
239,2015/08/17,680.0,677.404,678.0,40600,680.0,674.0
240,2015/08/18,688.0,684.162,684.0,28400,688.0,681.0
241,2015/08/19,680.0,680.988,682.0,17000,685.0,678.0
242,2015/08/20,678.0,679.809,683.0,28200,683.0,676.0
243,2015/08/21,660.0,666.997,673.0,91300,674.0,660.0
244,2015/08/24,590.0,618.848,630.0,141600,638.0,582.0
245,2015/08/25,565.0,552.502,520.0,198000,586.0,516.0
246,2015/08/26,575.0,567.871,570.0,56600,575.0,561.0
247,2015/08/27,586.0,588.92,578.0,76400,607.0,578.0
248,2015/08/28,607.0,601.92,596.0,70100,607.0,596.0
249,2015/08/31,617.0,614.355,617.0,50700,618.0,607.0
250,2015/09/01,581.0,594.368,616.0,72800,616.0,580.0
251,2015/09/02,576.0,573.055,570.0,114700,582.0,567.0
252,2015/09/03,576.0,578.805,580.0,24600,594.0,571.0
253,2015/09/04,559.0,563.989,577.0,75800,583.0,555.0
254,2015/09/07,554.0,550.551,551.0,40300,557.0,541.0
255,2015/09/08,545.0,555.117,551.0,55800,564.0,545.0
256,2015/09/09,570.0,562.775,555.0,52400,570.0,555.0
257,2015/09/10,567.0,567.397,569.0,74100,570.0,556.0
258,2015/09/11,569.0,559.719,555.0,75500,569.0,555.0
259,2015/09/14,563.0,567.902,566.0,27600,576.0,563.0
260,2015/09/15,566.0,567.142,563.0,24600,573.0,563.0
261,2015/09/16,567.0,567.252,569.0,22200,570.0,563.0
262,2015/09/17,569.0,568.899,570.0,38600,573.0,566.0
263,2015/09/18,566.0,566.463,570.0,18800,570.0,562.0
264,2015/09/24,541.0,549.47,557.0,74700,562.0,541.0
265,2015/09/25,555.0,547.901,540.0,98200,558.0,540.0
266,2015/09/28,553.0,552.266,559.0,36800,559.0,548.0
267,2015/09/29,524.0,532.136,545.0,100200,546.0,517.0
268,2015/09/30,528.0,525.692,521.0,41900,534.0,520.0
269,2015/10/01,540.0,537.855,536.0,37300,547.0,528.0
270,2015/10/02,545.0,543.372,539.0,40900,550.0,536.0
271,2015/10/05,547.0,549.776,547.0,70600,554.0,545.0
272,2015/10/06,550.0,550.262,553.0,71800,554.0,545.0
273,2015/10/07,559.0,554.637,550.0,76100,560.0,550.0
274,2015/10/08,569.0,566.993,561.0,71000,574.0,560.0
275,2015/10/09,588.0,580.266,565.0,87100,588.0,565.0
276,2015/10/13,609.0,601.14,591.0,122300,610.0,591.0
277,2015/10/14,591.0,592.863,597.0,43200,600.0,590.0
278,2015/10/15,600.0,593.256,590.0,30500,605.0,583.0
279,2015/10/16,601.0,600.331,596.0,75600,605.0,595.0
280,2015/10/19,590.0,593.492,603.0,41500,603.0,590.0
281,2015/10/20,585.0,585.754,594.0,38200,594.0,580.0
282,2015/10/21,600.0,593.059,583.0,59600,600.0,580.0
283,2015/10/22,598.0,599.139,598.0,33900,603.0,596.0
284,2015/10/23,605.0,603.464,603.0,44000,606.0,600.0
285,2015/10/26,603.0,604.159,604.0,48400,606.0,601.0
286,2015/10/27,595.0,598.762,603.0,51300,603.0,593.0
287,2015/10/28,600.0,596.567,590.0,18000,600.0,590.0
288,2015/10/29,601.0,600.386,601.0,38600,604.0,590.0
289,2015/10/30,598.0,601.172,599.0,44800,605.0,596.0
290,2015/11/02,594.0,593.511,592.0,22900,598.0,589.0
291,2015/11/04,593.0,594.581,594.0,35800,601.0,591.0
292,2015/11/05,594.0,594.049,593.0,24600,597.0,590.0
293,2015/11/06,598.0,595.575,593.0,28500,598.0,593.0
294,2015/11/09,603.0,601.074,597.0,37800,603.0,597.0
295,2015/11/10,602.0,601.785,597.0,21900,603.0,597.0
296,2015/11/11,605.0,603.251,602.0,43500,606.0,596.0
297,2015/11/12,597.0,603.691,605.0,48900,608.0,594.0
298,2015/11/13,596.0,590.358,594.0,34100,596.0,584.0
299,2015/11/16,601.0,598.04,596.0,24800,603.0,592.0
300,2015/11/17,611.0,610.19,601.0,98800,617.0,601.0
301,2015/11/18,614.0,616.432,617.0,55300,624.0,611.0
302,2015/11/19,616.0,617.782,617.0,42200,623.0,613.0
303,2015/11/20,620.0,616.104,613.0,30800,620.0,611.0
304,2015/11/24,625.0,622.567,623.0,83200,625.0,617.0
305,2015/11/25,622.0,621.901,625.0,39400,625.0,620.0
306,2015/11/26,622.0,621.832,622.0,49300,624.0,618.0
307,2015/11/27,629.0,629.875,629.0,121900,641.0,622.0
308,2015/11/30,625.0,624.942,624.0,103100,631.0,623.0
309,2015/12/01,624.0,624.246,625.0,72900,629.0,620.0
310,2015/12/02,618.0,619.925,626.0,55800,626.0,617.0
311,2015/12/03,615.0,611.221,613.0,73400,618.0,600.0
312,2015/12/04,609.0,606.273,601.0,49400,613.0,600.0
313,2015/12/07,608.0,612.845,613.0,81500,617.0,605.0
314,2015/12/08,598.0,601.414,608.0,44700,608.0,598.0
315,2015/12/09,598.0,596.115,593.0,51300,600.0,592.0
316,2015/12/10,585.0,588.22,588.0,92500,595.0,581.0
317,2015/12/11,600.0,586.551,580.0,77300,600.0,575.0
318,2015/12/14,587.0,581.757,580.0,51400,590.0,578.0
319,2015/12/15,570.0,578.114,593.0,50800,595.0,570.0
320,2015/12/16,578.0,576.334,571.0,40700,580.0,571.0
321,2015/12/17,585.0,582.776,577.0,62600,588.0,577.0
322,2015/12/18,570.0,574.253,576.0,52900,582.0,570.0
323,2015/12/21,578.0,589.999,589.0,208500,612.0,570.0
324,2015/12/22,573.0,572.598,572.0,111700,576.0,569.0
325,2015/12/24,555.0,563.856,573.0,189500,577.0,555.0
326,2015/12/25,544.0,549.925,554.0,191700,559.0,543.0
327,2015/12/28,583.0,572.963,552.0,116300,583.0,552.0
328,2015/12/29,575.0,573.958,576.0,47600,578.0,568.0
329,2015/12/30,584.0,583.163,583.0,51700,585.0,580.0
330,2016/01/04,572.0,576.3,577.0,44700,583.0,570.0
331,2016/01/05,573.0,575.072,572.0,25100,579.0,570.0
332,2016/01/06,567.0,568.213,571.0,38000,573.0,566.0
333,2016/01/07,555.0,560.646,567.0,69000,567.0,555.0
334,2016/01/08,549.0,551.84,549.0,38100,562.0,546.0
335,2016/01/12,534.0,540.629,549.0,96400,551.0,533.0
336,2016/01/13,539.0,538.487,534.0,37800,542.0,534.0
337,2016/01/14,534.0,529.66,534.0,65300,534.0,525.0
338,2016/01/15,519.0,525.453,541.0,50600,542.0,518.0
339,2016/01/18,508.0,503.189,502.0,68700,510.0,493.0
340,2016/01/19,516.0,517.491,520.0,46200,526.0,513.0
341,2016/01/20,502.0,511.298,526.0,61800,526.0,500.0
342,2016/01/21,481.0,498.319,497.0,70000,515.0,480.0
343,2016/01/22,516.0,504.203,502.0,46700,516.0,490.0
344,2016/01/25,526.0,521.317,519.0,51800,526.0,511.0
345,2016/01/26,504.0,507.893,512.0,38400,514.0,504.0
346,2016/01/27,516.0,511.988,514.0,25700,516.0,508.0
347,2016/01/28,516.0,514.842,511.0,27800,521.0,506.0
348,2016/01/29,527.0,518.764,517.0,42400,527.0,507.0
349,2016/02/01,538.0,531.923,533.0,54300,539.0,527.0
350,2016/02/02,533.0,533.274,534.0,30700,537.0,531.0
351,2016/02/03,514.0,516.768,532.0,28500,532.0,510.0
352,2016/02/04,506.0,507.748,507.0,30200,513.0,504.0
353,2016/02/05,495.0,497.416,501.0,47400,502.0,489.0
354,2016/02/08,497.0,489.565,480.0,47800,506.0,479.0
355,2016/02/09,472.0,480.228,492.0,71200,492.0,472.0
356,2016/02/10,442.0,455.346,475.0,51200,476.0,440.0
357,2016/02/12,418.0,402.594,378.0,171700,434.0,378.0
358,2016/02/15,447.0,436.111,424.0,74800,448.0,424.0
359,2016/02/16,446.0,450.222,446.0,56200,458.0,444.0
360,2016/02/17,438.0,443.302,446.0,29100,454.0,433.0
361,2016/02/18,460.0,460.127,460.0,44900,464.0,455.0
362,2016/02/19,447.0,447.959,449.0,39300,455.0,440.0
363,2016/02/22,453.0,451.62,451.0,26600,458.0,448.0
364,2016/02/23,453.0,459.187,454.0,39500,469.0,451.0
365,2016/02/24,438.0,443.638,444.0,97900,461.0,435.0
366,2016/02/25,450.0,449.46,441.0,39100,456.0,441.0
367,2016/02/26,454.0,455.207,457.0,40100,461.0,451.0
368,2016/02/29,446.0,458.376,455.0,201300,484.0,444.0
369,2016/03/01,444.0,444.741,449.0,58000,451.0,440.0
370,2016/03/02,452.0,451.802,452.0,54000,459.0,448.0
371,2016/03/03,457.0,452.693,453.0,66800,459.0,448.0
372,2016/03/04,457.0,456.669,455.0,67700,464.0,451.0
373,2016/03/07,468.0,462.87,460.0,102800,471.0,457.0
374,2016/03/08,464.0,465.934,470.0,58800,475.0,460.0
375,2016/03/09,454.0,453.32,459.0,31300,459.0,450.0
376,2016/03/10,453.0,454.136,458.0,69000,459.0,451.0
377,2016/03/11,455.0,453.416,451.0,78200,457.0,450.0
378,2016/03/14,463.0,459.198,460.0,89200,464.0,452.0
379,2016/03/15,463.0,463.577,465.0,24800,468.0,459.0
380,2016/03/16,456.0,457.569,461.0,40600,462.0,453.0
381,2016/03/17,458.0,461.149,461.0,67100,466.0,454.0
382,2016/03/18,453.0,455.164,460.0,32300,461.0,452.0
383,2016/03/22,461.0,460.631,461.0,35500,467.0,455.0
384,2016/03/23,458.0,459.007,462.0,30200,462.0,455.0
385,2016/03/24,449.0,452.905,460.0,82800,460.0,448.0
386,2016/03/25,445.0,446.143,450.0,92800,451.0,441.0
387,2016/03/28,446.0,444.132,450.0,76300,450.0,438.0
388,2016/03/29,453.0,451.87,454.0,54600,456.0,447.0
389,2016/03/30,446.0,449.876,452.0,27300,455.0,446.0
390,2016/03/31,440.0,444.889,448.0,45000,450.0,440.0
391,2016/04/01,425.0,432.677,445.0,88500,445.0,423.0
392,2016/04/04,426.0,426.436,424.0,35800,430.0,423.0
393,2016/04/05,409.0,415.942,424.0,44900,424.0,407.0
394,2016/04/06,400.0,403.26,404.0,51100,409.0,400.0
395,2016/04/07,399.0,400.072,401.0,41700,403.0,397.0
396,2016/04/08,405.0,401.246,392.0,70800,410.0,390.0
397,2016/04/11,406.0,401.853,406.0,25200,407.0,397.0
398,2016/04/12,410.0,409.495,408.0,48700,412.0,404.0
399,2016/04/13,423.0,417.997,416.0,71700,424.0,409.0
400,2016/04/14,440.0,433.288,428.0,69000,441.0,426.0
401,2016/04/15,438.0,435.089,437.0,79700,442.0,432.0
402,2016/04/18,426.0,430.884,440.0,49900,440.0,424.0
403,2016/04/19,437.0,436.534,437.0,21900,438.0,434.0
404,2016/04/20,440.0,441.185,438.0,57800,446.0,438.0
405,2016/04/21,449.0,447.945,446.0,51100,450.0,445.0
406,2016/04/22,454.0,450.604,445.0,45700,454.0,444.0
407,2016/04/25,455.0,452.93,455.0,25600,456.0,450.0
408,2016/04/26,448.0,447.102,454.0,35300,454.0,440.0
409,2016/04/27,446.0,450.127,448.0,50500,457.0,445.0
410,2016/04/28,441.0,450.363,454.0,61100,460.0,439.0
411,2016/05/02,429.0,432.661,431.0,87000,434.0,428.0
412,2016/05/06,428.0,429.394,431.0,21300,436.0,426.0
413,2016/05/09,434.0,433.015,433.0,19500,437.0,431.0
414,2016/05/10,443.0,441.33,437.0,28800,447.0,435.0
415,2016/05/11,447.0,445.647,445.0,16700,450.0,442.0
416,2016/05/12,440.0,444.032,443.0,40300,451.0,437.0
417,2016/05/13,434.0,437.572,449.0,46300,449.0,431.0
418,2016/05/16,429.0,431.218,435.0,31200,436.0,428.0
419,2016/05/17,434.0,431.449,431.0,15800,435.0,427.0
420,2016/05/18,433.0,434.802,437.0,21700,438.0,431.0
421,2016/05/19,432.0,431.669,435.0,16600,435.0,430.0
422,2016/05/20,431.0,429.137,430.0,43100,435.0,425.0
423,2016/05/23,428.0,428.346,431.0,19100,432.0,425.0
424,2016/05/24,425.0,424.49,427.0,25500,427.0,421.0
425,2016/05/25,424.0,423.691,427.0,59800,429.0,422.0
426,2016/05/26,425.0,426.105,430.0,21900,430.0,424.0
427,2016/05/27,424.0,424.788,425.0,17900,427.0,423.0
428,2016/05/30,428.0,426.375,426.0,38900,430.0,421.0
429,2016/05/31,434.0,432.767,429.0,36000,436.0,425.0
430,2016/06/01,433.0,435.949,435.0,25700,440.0,433.0
431,2016/06/02,426.0,428.522,432.0,18600,433.0,426.0
432,2016/06/03,424.0,424.663,424.0,28200,428.0,422.0
433,2016/06/06,419.0,416.906,418.0,33000,419.0,413.0
434,2016/06/07,421.0,420.902,422.0,8200,424.0,418.0
435,2016/06/08,424.0,426.623,423.0,24900,435.0,419.0
436,2016/06/09,422.0,425.955,423.0,15600,433.0,422.0
437,2016/06/10,424.0,425.638,427.0,37300,427.0,421.0
438,2016/06/13,407.0,412.211,419.0,38000,419.0,407.0
439,2016/06/14,405.0,405.153,407.0,45800,408.0,404.0
440,2016/06/15,405.0,406.076,404.0,14400,412.0,403.0
441,2016/06/16,396.0,400.158,406.0,50700,406.0,393.0
442,2016/06/17,398.0,398.661,396.0,49000,403.0,396.0
443,2016/06/20,403.0,401.12,398.0,45800,406.0,396.0
444,2016/06/21,408.0,404.315,400.0,33300,411.0,399.0
445,2016/06/22,404.0,402.797,405.0,31000,408.0,400.0
446,2016/06/23,405.0,401.039,400.0,94300,407.0,399.0
447,2016/06/24,375.0,387.563,410.0,165600,415.0,370.0
448,2016/06/27,387.0,384.73,383.0,87100,390.0,379.0
449,2016/06/28,387.0,384.538,383.0,24900,389.0,379.0
450,2016/06/29,390.0,390.246,391.0,60200,393.0,387.0
451,2016/06/30,390.0,392.084,395.0,19100,396.0,390.0
452,2016/07/01,388.0,389.588,392.0,33700,394.0,377.0
453,2016/07/04,390.0,389.769,389.0,24700,394.0,385.0
454,2016/07/05,401.0,396.14,390.0,84400,402.0,390.0
455,2016/07/06,394.0,393.375,394.0,51500,396.0,390.0
456,2016/07/07,445.0,450.359,416.0,1963400,474.0,415.0
457,2016/07/08,464.0,461.24,461.0,1481400,476.0,443.0
458,2016/07/11,487.0,489.31,480.0,1451300,511.0,469.0
459,2016/07/12,480.0,482.367,480.0,533500,498.0,472.0
460,2016/07/13,498.0,504.714,507.0,832400,519.0,491.0
461,2016/07/14,481.0,481.435,492.0,406800,492.0,473.0
462,2016/07/15,485.0,479.232,484.0,244100,490.0,467.0
463,2016/07/19,487.0,487.911,493.0,134200,496.0,484.0
464,2016/07/20,482.0,480.013,485.0,100900,485.0,476.0
465,2016/07/21,485.0,484.724,487.0,92000,492.0,481.0
466,2016/07/22,483.0,485.762,477.0,246400,495.0,477.0
467,2016/07/25,481.0,481.691,482.0,70300,485.0,477.0
468,2016/07/26,473.0,475.021,481.0,117000,484.0,471.0
469,2016/07/27,483.0,480.083,475.0,63800,483.0,475.0
470,2016/07/28,480.0,478.859,479.0,54500,481.0,475.0
471,2016/07/29,484.0,477.609,476.0,152600,484.0,470.0
472,2016/08/01,477.0,478.641,481.0,42900,482.0,475.0
473,2016/08/02,469.0,472.247,475.0,92900,479.0,469.0
474,2016/08/03,454.0,456.023,462.0,126100,462.0,450.0
475,2016/08/04,466.0,460.165,450.0,72300,469.0,450.0
476,2016/08/05,461.0,463.076,463.0,38400,469.0,460.0
477,2016/08/08,481.0,476.813,466.0,104400,483.0,465.0
478,2016/08/09,474.0,480.186,481.0,230200,496.0,465.0
479,2016/08/10,463.0,464.387,461.0,53200,470.0,461.0
480,2016/08/12,470.0,471.282,474.0,28700,474.0,467.0
481,2016/08/15,466.0,467.677,467.0,9900,471.0,465.0
482,2016/08/16,466.0,470.214,470.0,45400,477.0,465.0
483,2016/08/17,470.0,469.038,466.0,61400,475.0,463.0
484,2016/08/18,465.0,467.559,465.0,53300,474.0,464.0
485,2016/08/19,471.0,469.895,468.0,36300,473.0,467.0
486,2016/08/22,473.0,471.17,471.0,33600,474.0,467.0
487,2016/08/23,475.0,472.389,471.0,41100,476.0,468.0
488,2016/08/24,472.0,474.696,475.0,22700,477.0,471.0
489,2016/08/25,476.0,475.41,479.0,27300,479.0,472.0
490,2016/08/26,464.0,468.337,476.0,42700,476.0,464.0
491,2016/08/29,466.0,468.061,473.0,26100,473.0,465.0
492,2016/08/30,463.0,464.744,465.0,19500,468.0,463.0
493,2016/08/31,472.0,471.0,466.0,28600,474.0,465.0
494,2016/09/01,474.0,475.73,472.0,53000,480.0,470.0
495,2016/09/02,472.0,471.151,472.0,25900,475.0,467.0
496,2016/09/05,475.0,475.368,479.0,28300,479.0,473.0
497,2016/09/06,477.0,475.782,474.0,17400,478.0,474.0
498,2016/09/07,475.0,474.114,475.0,32400,476.0,472.0
499,2016/09/08,475.0,473.972,473.0,24700,476.0,472.0
500,2016/09/09,475.0,475.723,475.0,26700,479.0,474.0
501,2016/09/12,468.0,467.147,469.0,27300,470.0,465.0
502,2016/09/13,469.0,470.296,472.0,14200,476.0,468.0
503,2016/09/14,465.0,465.464,466.0,22000,467.0,463.0
504,2016/09/15,461.0,461.655,463.0,32500,465.0,460.0
505,2016/09/16,459.0,460.1,462.0,27000,464.0,458.0
506,2016/09/20,461.0,460.175,460.0,40000,463.0,457.0
507,2016/09/21,470.0,465.879,465.0,41300,471.0,456.0
508,2016/09/23,475.0,474.807,471.0,37300,480.0,470.0
509,2016/09/26,476.0,476.519,477.0,31800,479.0,475.0
510,2016/09/27,477.0,474.548,474.0,57700,478.0,468.0
511,2016/09/28,469.0,470.244,475.0,44600,475.0,468.0
512,2016/09/29,469.0,471.673,472.0,39700,475.0,469.0
513,2016/09/30,462.0,461.26,466.0,51500,466.0,458.0
514,2016/10/03,469.0,469.532,474.0,44400,474.0,462.0
515,2016/10/04,469.0,470.833,474.0,32400,475.0,469.0
516,2016/10/05,471.0,470.652,470.0,46600,473.0,469.0
517,2016/10/06,470.0,469.869,473.0,36000,473.0,466.0
518,2016/10/07,470.0,466.687,468.0,25200,470.0,464.0
519,2016/10/11,550.0,550.0,550.0,277700,550.0,550.0
520,2016/10/12,600.0,610.024,590.0,17092700,643.0,581.0
521,2016/10/13,593.0,590.405,592.0,7660400,617.0,561.0
522,2016/10/14,569.0,567.349,577.0,2335700,589.0,553.0
523,2016/10/17,575.0,574.194,564.0,2043000,589.0,561.0
524,2016/10/18,558.0,561.587,572.0,993500,572.0,556.0
525,2016/10/19,550.0,550.303,555.0,1145100,564.0,538.0
526,2016/10/20,560.0,556.571,555.0,510800,563.0,552.0
527,2016/10/21,562.0,564.58,562.0,724200,574.0,551.0
528,2016/10/24,559.0,559.628,562.0,242600,570.0,554.0
529,2016/10/25,559.0,568.06,559.0,561200,581.0,556.0
530,2016/10/26,565.0,566.677,561.0,292200,572.0,561.0
531,2016/10/27,565.0,571.514,574.0,470500,580.0,563.0
532,2016/10/28,564.0,563.422,569.0,242000,569.0,558.0
533,2016/10/31,573.0,574.553,567.0,378400,580.0,565.0
534,2016/11/01,564.0,562.588,573.0,256100,573.0,558.0
535,2016/11/02,557.0,557.207,557.0,187100,561.0,554.0
536,2016/11/04,551.0,549.955,555.0,213300,555.0,545.0
537,2016/11/07,562.0,559.682,555.0,147400,563.0,555.0
538,2016/11/08,563.0,563.148,565.0,173200,567.0,560.0
539,2016/11/09,526.0,538.661,567.0,351900,567.0,519.0
540,2016/11/10,550.0,551.296,557.0,144500,558.0,546.0
541,2016/11/11,546.0,550.373,550.0,96200,558.0,545.0
542,2016/11/14,578.0,571.678,551.0,338100,579.0,549.0
543,2016/11/15,583.0,577.305,580.0,136200,584.0,569.0
544,2016/11/16,578.0,576.67,586.0,196000,587.0,566.0
545,2016/11/17,580.0,577.344,579.0,146900,582.0,570.0
546,2016/11/18,590.0,584.709,584.0,167100,590.0,578.0
547,2016/11/21,606.0,601.152,590.0,389600,610.0,587.0
548,2016/11/22,627.0,618.739,603.0,498500,628.0,603.0
549,2016/11/24,625.0,628.297,637.0,388700,642.0,618.0
550,2016/11/25,621.0,624.873,628.0,253500,633.0,616.0
551,2016/11/28,628.0,623.718,617.0,276700,632.0,608.0
552,2016/11/29,656.0,660.65,624.0,1154700,699.0,623.0
553,2016/11/30,664.0,664.646,658.0,412700,673.0,654.0
554,2016/12/01,659.0,663.91,670.0,328500,674.0,657.0
555,2016/12/02,664.0,659.037,652.0,367600,669.0,646.0
556,2016/12/05,681.0,673.573,650.0,443900,686.0,650.0
557,2016/12/06,691.0,684.971,685.0,312600,691.0,678.0
558,2016/12/07,696.0,693.73,689.0,282000,699.0,685.0
559,2016/12/08,684.0,686.652,688.0,232900,698.0,680.0
560,2016/12/09,686.0,680.251,682.0,236100,688.0,670.0
561,2016/12/12,697.0,702.958,696.0,420400,717.0,691.0
562,2016/12/13,686.0,687.751,695.0,162300,698.0,682.0
563,2016/12/14,692.0,691.014,687.0,118100,695.0,683.0
564,2016/12/15,695.0,697.228,694.0,204600,707.0,685.0
565,2016/12/16,695.0,696.361,699.0,176000,700.0,689.0
566,2016/12/19,692.0,690.222,694.0,125800,699.0,682.0
567,2016/12/20,683.0,681.867,688.0,170000,689.0,675.0
568,2016/12/21,677.0,682.166,683.0,218100,692.0,676.0
569,2016/12/22,686.0,682.337,680.0,239900,692.0,670.0
570,2016/12/26,676.0,679.882,686.0,105100,686.0,676.0
571,2016/12/27,678.0,676.007,670.0,123900,684.0,670.0
572,2016/12/28,679.0,680.191,675.0,54500,684.0,675.0
573,2016/12/29,664.0,663.94,672.0,179000,675.0,655.0
574,2016/12/30,663.0,663.924,660.0,99400,669.0,656.0
575,2017/01/04,682.0,678.636,668.0,134000,688.0,664.0
576,2017/01/05,702.0,696.184,690.0,262200,703.0,686.0
577,2017/01/06,678.0,684.688,701.0,229700,701.0,674.0
578,2017/01/10,674.0,675.381,681.0,162300,684.0,669.0
579,2017/01/11,666.0,667.293,674.0,139300,677.0,664.0
580,2017/01/12,656.0,656.24,663.0,137800,666.0,651.0
581,2017/01/13,657.0,656.054,655.0,65400,660.0,651.0
582,2017/01/16,648.0,649.483,657.0,83400,658.0,642.0
583,2017/01/17,640.0,641.223,642.0,111500,648.0,637.0
584,2017/01/18,647.0,637.964,636.0,116000,647.0,627.0
585,2017/01/19,646.0,648.222,651.0,47700,658.0,644.0
586,2017/01/20,648.0,646.661,648.0,51000,650.0,643.0
587,2017/01/23,640.0,640.267,643.0,73700,645.0,630.0
588,2017/01/24,637.0,636.582,637.0,48600,641.0,634.0
589,2017/01/25,654.0,649.034,644.0,78800,655.0,643.0
590,2017/01/26,662.0,660.084,664.0,76100,664.0,655.0
591,2017/01/27,672.0,674.187,679.0,236500,681.0,666.0
592,2017/01/30,669.0,668.884,677.0,75100,677.0,665.0
593,2017/01/31,658.0,660.312,662.0,90600,663.0,657.0
594,2017/02/01,661.0,657.907,656.0,55800,662.0,650.0
595,2017/02/02,650.0,659.278,665.0,95100,673.0,649.0
596,2017/02/03,654.0,653.605,648.0,100800,658.0,648.0
597,2017/02/06,664.0,661.731,661.0,56800,665.0,658.0
598,2017/02/07,658.0,658.79,659.0,52800,662.0,656.0
599,2017/02/08,663.0,659.57,661.0,76100,663.0,654.0
600,2017/02/09,657.0,659.359,665.0,106500,665.0,655.0
601,2017/02/10,670.0,667.31,662.0,146700,670.0,659.0
602,2017/02/13,691.0,686.097,680.0,227300,692.0,680.0
603,2017/02/14,691.0,696.041,693.0,237100,702.0,690.0
604,2017/02/15,685.0,684.512,696.0,114600,696.0,675.0
605,2017/02/16,688.0,685.414,685.0,91800,694.0,679.0
606,2017/02/17,689.0,689.053,688.0,82900,694.0,682.0
607,2017/02/20,709.0,702.965,692.0,290100,709.0,690.0
608,2017/02/21,705.0,705.797,710.0,137100,710.0,702.0
609,2017/02/22,696.0,696.234,706.0,94900,706.0,692.0
610,2017/02/23,703.0,698.616,691.0,95300,705.0,691.0
611,2017/02/24,707.0,706.258,697.0,152700,710.0,697.0
612,2017/02/27,699.0,700.878,706.0,123800,706.0,696.0
613,2017/02/28,711.0,713.854,701.0,322100,721.0,698.0
614,2017/03/01,715.0,713.264,713.0,170800,717.0,706.0
615,2017/03/02,714.0,718.06,722.0,127700,722.0,713.0
616,2017/03/03,708.0,709.018,711.0,152000,716.0,704.0
617,2017/03/06,700.0,702.901,708.0,104900,709.0,698.0
618,2017/03/07,693.0,695.071,699.0,102900,702.0,692.0
619,2017/03/08,702.0,699.432,694.0,104300,706.0,692.0
620,2017/03/09,708.0,708.819,707.0,79100,711.0,705.0
621,2017/03/10,711.0,713.796,714.0,121800,718.0,708.0
622,2017/03/13,716.0,721.861,713.0,270800,730.0,711.0
623,2017/03/14,722.0,715.694,715.0,109800,724.0,707.0
624,2017/03/15,704.0,708.206,720.0,123800,720.0,701.0
625,2017/03/16,704.0,702.821,700.0,69900,710.0,696.0
626,2017/03/17,734.0,727.885,707.0,360600,734.0,707.0
627,2017/03/21,734.0,739.319,735.0,265700,747.0,732.0
628,2017/03/22,710.0,716.41,719.0,147100,731.0,709.0
629,2017/03/23,696.0,699.275,710.0,135500,712.0,692.0
630,2017/03/24,703.0,703.031,696.0,89400,708.0,695.0
631,2017/03/27,687.0,689.984,701.0,133500,701.0,687.0
632,2017/03/28,707.0,704.32,697.0,90200,709.0,697.0
633,2017/03/29,704.0,704.947,707.0,49000,711.0,700.0
634,2017/03/30,699.0,702.903,700.0,45400,709.0,699.0
635,2017/03/31,686.0,693.263,700.0,67400,701.0,686.0
636,2017/04/03,679.0,683.531,690.0,74200,690.0,678.0
637,2017/04/04,655.0,659.602,672.0,179200,674.0,650.0
638,2017/04/05,653.0,654.887,661.0,114100,665.0,648.0
639,2017/04/06,633.0,639.123,650.0,118400,653.0,632.0
640,2017/04/07,639.0,638.752,636.0,103000,646.0,633.0
641,2017/04/10,645.0,645.8,646.0,48900,649.0,641.0
642,2017/04/11,637.0,637.496,645.0,73200,645.0,634.0
643,2017/04/12,625.0,626.655,633.0,98700,634.0,623.0
644,2017/04/13,626.0,620.696,615.0,252000,646.0,609.0
645,2017/04/14,616.0,616.522,616.0,93300,626.0,611.0
646,2017/04/17,619.0,614.662,611.0,70500,622.0,610.0
647,2017/04/18,618.0,621.451,626.0,100400,630.0,614.0
648,2017/04/19,621.0,620.284,615.0,47600,625.0,615.0
649,2017/04/20,646.0,640.589,628.0,156900,651.0,627.0
650,2017/04/21,653.0,653.415,661.0,99100,662.0,647.0
651,2017/04/24,649.0,653.77,661.0,70900,666.0,649.0
652,2017/04/25,660.0,655.918,645.0,51300,662.0,645.0
653,2017/04/26,681.0,673.839,670.0,128200,682.0,665.0
654,2017/04/27,681.0,677.673,681.0,78900,681.0,671.0
655,2017/04/28,678.0,678.163,683.0,52900,683.0,674.0
656,2017/05/01,683.0,679.538,671.0,61500,684.0,671.0
657,2017/05/02,688.0,688.543,678.0,145300,694.0,678.0
658,2017/05/08,710.0,704.668,698.0,220800,713.0,688.0
659,2017/05/09,702.0,703.046,700.0,59100,706.0,700.0
660,2017/05/10,704.0,705.552,706.0,68300,709.0,703.0
661,2017/05/11,710.0,707.683,702.0,98500,714.0,701.0
662,2017/05/12,704.0,706.09,707.0,63500,713.0,702.0
663,2017/05/15,693.0,698.605,705.0,129000,709.0,680.0
664,2017/05/16,668.0,674.051,685.0,170100,692.0,667.0
665,2017/05/17,665.0,666.767,670.0,84100,672.0,663.0
666,2017/05/18,657.0,652.764,655.0,104100,657.0,645.0
667,2017/05/19,665.0,659.359,663.0,85600,668.0,652.0
668,2017/05/22,674.0,671.45,669.0,64200,676.0,667.0
669,2017/05/23,670.0,668.619,673.0,66100,673.0,663.0
670,2017/05/24,671.0,670.763,675.0,58300,675.0,668.0
671,2017/05/25,669.0,670.614,670.0,29300,675.0,669.0
672,2017/05/26,667.0,664.936,669.0,98600,669.0,662.0
673,2017/05/29,656.0,659.017,661.0,70600,665.0,655.0
674,2017/05/30,661.0,658.918,660.0,42800,664.0,654.0
675,2017/05/31,655.0,656.549,658.0,45000,661.0,654.0
676,2017/06/01,653.0,655.56,652.0,69800,662.0,652.0
677,2017/06/02,659.0,661.778,662.0,103700,670.0,655.0
678,2017/06/05,651.0,654.587,660.0,61700,660.0,650.0
679,2017/06/06,649.0,649.224,656.0,97000,656.0,646.0
680,2017/06/07,650.0,649.145,645.0,57900,651.0,645.0
681,2017/06/08,649.0,650.69,652.0,62000,656.0,647.0
682,2017/06/09,647.0,648.337,649.0,51400,653.0,646.0
683,2017/06/12,650.0,649.753,648.0,36500,653.0,646.0
684,2017/06/13,651.0,650.537,647.0,43800,656.0,647.0
685,2017/06/14,652.0,652.295,656.0,66500,657.0,649.0
686,2017/06/15,650.0,649.363,651.0,80100,654.0,646.0
687,2017/06/16,660.0,659.143,655.0,84500,664.0,653.0
688,2017/06/19,665.0,662.0,660.0,62600,667.0,655.0
689,2017/06/20,663.0,664.546,668.0,93100,668.0,659.0
690,2017/06/21,660.0,659.189,660.0,87100,664.0,657.0
691,2017/06/22,657.0,656.416,660.0,70000,663.0,654.0
692,2017/06/23,659.0,659.196,657.0,41400,662.0,656.0
693,2017/06/26,655.0,658.125,660.0,39300,660.0,654.0
694,2017/06/27,656.0,655.575,654.0,39800,658.0,654.0
695,2017/06/28,654.0,654.455,654.0,24600,656.0,653.0
696,2017/06/29,655.0,655.916,656.0,33200,658.0,654.0
697,2017/06/30,656.0,653.605,654.0,51700,656.0,651.0
698,2017/07/03,661.0,659.168,657.0,67900,663.0,655.0
699,2017/07/04,665.0,667.234,670.0,100600,673.0,663.0
700,2017/07/05,674.0,671.01,669.0,84400,674.0,666.0
701,2017/07/06,684.0,682.446,676.0,215300,691.0,674.0
702,2017/07/07,690.0,689.53,682.0,149300,696.0,676.0
703,2017/07/10,711.0,706.016,695.0,226100,713.0,692.0
704,2017/07/11,716.0,718.008,706.0,219600,723.0,706.0
705,2017/07/12,710.0,711.028,716.0,116500,716.0,699.0
706,2017/07/13,712.0,716.061,712.0,87000,721.0,710.0
707,2017/07/14,720.0,719.047,712.0,107400,725.0,711.0
708,2017/07/18,719.0,721.685,727.0,115700,727.0,717.0
709,2017/07/19,715.0,717.762,719.0,110700,727.0,710.0
710,2017/07/20,718.0,719.155,717.0,59300,723.0,713.0
711,2017/07/21,727.0,725.237,718.0,97500,729.0,718.0
712,2017/07/24,729.0,725.574,727.0,55600,729.0,720.0
713,2017/07/25,718.0,722.414,722.0,106100,727.0,718.0
714,2017/07/26,722.0,724.463,727.0,57500,728.0,720.0
715,2017/07/27,734.0,736.18,722.0,259700,745.0,720.0
716,2017/07/28,709.0,718.717,735.0,118400,736.0,707.0
717,2017/07/31,701.0,704.469,707.0,65300,714.0,701.0
718,2017/08/01,684.0,689.995,704.0,101500,706.0,677.0
719,2017/08/02,687.0,685.687,689.0,80400,692.0,678.0
720,2017/08/03,690.0,689.106,690.0,48900,694.0,685.0
721,2017/08/04,692.0,690.86,690.0,49200,697.0,685.0
722,2017/08/07,694.0,694.312,698.0,42900,699.0,691.0
723,2017/08/08,696.0,698.259,700.0,54900,704.0,694.0
724,2017/08/09,692.0,691.637,700.0,65000,700.0,687.0
725,2017/08/10,717.0,716.874,690.0,348300,735.0,676.0
726,2017/08/14,701.0,701.097,704.0,119100,710.0,691.0
727,2017/08/15,708.0,706.268,707.0,50000,713.0,702.0
728,2017/08/16,722.0,719.96,711.0,121900,729.0,710.0
729,2017/08/17,740.0,737.037,721.0,204100,747.0,716.0
730,2017/08/18,730.0,738.425,726.0,706600,775.0,703.0
731,2017/08/21,728.0,726.722,730.0,76700,734.0,719.0
732,2017/08/22,760.0,754.745,728.0,303700,763.0,728.0
733,2017/08/23,762.0,765.029,765.0,187000,769.0,760.0
734,2017/08/24,769.0,770.146,760.0,207000,776.0,760.0
735,2017/08/25,778.0,783.687,772.0,299100,793.0,767.0
736,2017/08/28,809.0,798.531,785.0,321800,810.0,780.0
737,2017/08/29,820.0,813.574,799.0,283100,823.0,795.0
738,2017/08/30,834.0,827.62,826.0,302900,836.0,819.0
739,2017/08/31,885.0,875.496,845.0,825400,895.0,843.0
740,2017/09/01,894.0,886.027,890.0,657400,904.0,852.0
741,2017/09/04,865.0,875.868,895.0,367600,897.0,858.0
742,2017/09/05,852.0,860.941,868.0,327800,887.0,831.0
743,2017/09/06,858.0,862.094,831.0,324600,881.0,831.0
744,2017/09/07,876.0,877.77,865.0,382600,894.0,859.0
745,2017/09/08,866.0,870.222,870.0,198600,880.0,862.0
746,2017/09/11,913.0,911.478,872.0,731000,925.0,872.0
747,2017/09/12,897.0,905.839,928.0,625700,937.0,881.0
748,2017/09/13,907.0,909.687,916.0,314200,917.0,900.0
749,2017/09/14,920.0,935.249,916.0,837400,955.0,913.0
750,2017/09/15,936.0,924.171,914.0,424800,942.0,907.0
751,2017/09/19,942.0,939.309,951.0,267400,958.0,927.0
752,2017/09/20,928.0,935.553,933.0,237500,947.0,928.0
753,2017/09/21,922.0,933.611,938.0,270100,949.0,920.0
754,2017/09/22,899.0,908.728,922.0,245500,934.0,896.0
755,2017/09/25,914.0,916.018,904.0,186400,922.0,904.0
756,2017/09/26,901.0,903.781,911.0,135000,918.0,900.0
757,2017/09/27,917.0,909.06,900.0,146400,918.0,892.0
758,2017/09/28,929.0,922.483,920.0,188300,930.0,913.0
759,2017/09/29,910.0,918.497,931.0,145700,935.0,909.0
760,2017/10/02,906.0,905.965,920.0,129000,920.0,899.0
761,2017/10/03,910.0,912.269,911.0,95700,919.0,906.0
762,2017/10/04,905.0,903.356,910.0,125500,911.0,899.0
763,2017/10/05,901.0,908.042,911.0,201200,916.0,900.0
764,2017/10/06,947.0,936.066,912.0,480200,953.0,908.0
765,2017/10/10,928.0,931.448,941.0,211900,943.0,925.0
766,2017/10/11,912.0,917.514,929.0,140800,933.0,912.0
767,2017/10/12,923.0,924.185,912.0,138700,934.0,912.0
768,2017/10/13,912.0,912.865,920.0,130100,922.0,905.0
769,2017/10/16,902.0,905.565,915.0,128000,915.0,897.0
770,2017/10/17,903.0,903.034,903.0,105000,912.0,894.0
771,2017/10/18,888.0,889.503,906.0,158400,906.0,881.0
772,2017/10/19,886.0,886.455,883.0,90700,892.0,881.0
773,2017/10/20,870.0,872.547,884.0,177900,884.0,866.0
774,2017/10/23,894.0,889.12,882.0,163100,899.0,879.0
775,2017/10/24,899.0,893.104,888.0,120100,904.0,877.0
776,2017/10/25,900.0,906.849,901.0,151200,915.0,898.0
777,2017/10/26,918.0,918.973,915.0,232900,928.0,903.0
778,2017/10/27,926.0,924.197,925.0,121400,928.0,920.0
779,2017/10/30,935.0,932.129,928.0,194100,938.0,924.0
780,2017/10/31,931.0,934.862,935.0,146400,938.0,931.0
781,2017/11/01,926.0,928.42,932.0,126500,937.0,923.0
782,2017/11/02,918.0,919.896,930.0,130300,932.0,909.0
783,2017/11/06,912.0,916.611,918.0,91600,923.0,912.0
784,2017/11/07,918.0,917.804,911.0,102000,922.0,911.0
785,2017/11/08,917.0,911.737,918.0,77900,919.0,904.0
786,2017/11/09,1005.0,977.303,922.0,1390900,1030.0,913.0
787,2017/11/10,960.0,957.952,980.0,1030100,989.0,927.0
788,2017/11/13,939.0,941.336,960.0,369900,962.0,933.0
789,2017/11/14,924.0,935.774,941.0,261800,952.0,924.0
790,2017/11/15,888.0,892.904,920.0,444600,921.0,871.0
791,2017/11/16,872.0,868.508,874.0,490200,878.0,858.0
792,2017/11/17,904.0,898.845,887.0,383600,913.0,878.0
793,2017/11/20,955.0,940.607,906.0,405500,962.0,901.0
794,2017/11/21,989.0,973.686,957.0,481400,992.0,949.0
795,2017/11/22,1044.0,1024.878,1000.0,807600,1047.0,999.0
796,2017/11/24,1052.0,1055.375,1042.0,487800,1070.0,1028.0
797,2017/11/27,1031.0,1035.926,1068.0,268800,1068.0,1022.0
798,2017/11/28,1038.0,1031.03,1030.0,188400,1043.0,1012.0
799,2017/11/29,1040.0,1039.761,1040.0,210500,1055.0,1027.0
800,2017/11/30,1013.0,1022.397,1041.0,160100,1042.0,1013.0
801,2017/12/01,997.0,1004.348,1012.0,165500,1022.0,995.0
802,2017/12/04,977.0,991.108,1000.0,177900,1006.0,977.0
803,2017/12/05,951.0,954.721,977.0,271300,977.0,945.0
804,2017/12/06,930.0,936.336,951.0,202300,955.0,925.0
805,2017/12/07,932.0,931.083,932.0,270700,942.0,923.0
806,2017/12/08,929.0,928.867,932.0,247900,945.0,921.0
807,2017/12/11,952.0,944.715,940.0,175800,952.0,932.0
808,2017/12/12,941.0,943.873,955.0,176600,957.0,937.0
809,2017/12/13,911.0,922.234,938.0,460500,940.0,902.0
810,2017/12/14,939.0,928.13,929.0,299400,939.0,916.0
811,2017/12/15,922.0,925.364,949.0,250600,949.0,911.0
812,2017/12/18,973.0,963.743,944.0,604900,985.0,931.0
813,2017/12/19,943.0,952.807,982.0,488500,985.0,939.0
814,2017/12/20,955.0,951.147,947.0,184900,959.0,937.0
815,2017/12/21,968.0,960.385,949.0,155900,973.0,948.0
816,2017/12/22,964.0,967.056,980.0,181600,980.0,958.0
817,2017/12/25,955.0,955.527,965.0,108300,966.0,948.0
818,2017/12/26,950.0,950.668,955.0,87700,960.0,945.0
819,2017/12/27,974.0,964.903,949.0,146900,975.0,949.0
820,2017/12/28,960.0,968.525,970.0,107500,980.0,959.0
821,2017/12/29,957.0,958.892,960.0,76600,968.0,954.0
822,2018/01/04,956.0,954.836,963.0,177700,967.0,945.0
823,2018/01/05,968.0,962.767,961.0,118200,970.0,955.0
824,2018/01/09,966.0,971.014,979.0,174500,979.0,966.0
825,2018/01/10,967.0,963.435,964.0,121700,970.0,957.0
826,2018/01/11,967.0,964.664,960.0,89900,970.0,960.0
827,2018/01/12,970.0,964.765,962.0,123200,972.0,956.0
828,2018/01/15,962.0,964.835,975.0,102000,976.0,960.0
829,2018/01/16,961.0,959.81,962.0,84300,966.0,952.0
830,2018/01/17,947.0,941.932,955.0,244100,955.0,932.0
831,2018/01/18,931.0,939.489,953.0,156800,955.0,930.0
832,2018/01/19,933.0,925.22,923.0,221400,935.0,919.0
833,2018/01/22,932.0,930.199,934.0,76300,935.0,925.0
834,2018/01/23,935.0,934.509,937.0,86900,939.0,930.0
835,2018/01/24,927.0,928.942,935.0,144800,935.0,922.0
836,2018/01/25,922.0,920.078,922.0,127600,924.0,915.0
837,2018/01/26,936.0,930.556,924.0,117400,937.0,922.0
838,2018/01/29,936.0,936.189,935.0,110600,941.0,927.0
839,2018/01/30,923.0,924.887,939.0,167500,939.0,916.0
840,2018/01/31,916.0,920.244,915.0,130600,929.0,915.0
841,2018/02/01,933.0,927.751,920.0,138400,935.0,917.0
842,2018/02/02,921.0,920.103,929.0,131500,929.0,911.0
843,2018/02/05,900.0,896.569,900.0,179200,904.0,890.0
844,2018/02/06,804.0,809.054,840.0,678300,847.0,770.0
845,2018/02/07,809.0,833.614,864.0,245300,864.0,808.0
846,2018/02/08,824.0,815.983,821.0,252300,829.0,802.0
847,2018/02/09,802.0,791.124,781.0,283300,804.0,780.0
848,2018/02/13,825.0,826.428,839.0,504700,850.0,809.0
849,2018/02/14,774.0,778.179,814.0,691300,825.0,753.0
850,2018/02/15,787.0,795.546,795.0,473000,809.0,783.0
851,2018/02/16,791.0,790.837,796.0,236400,800.0,781.0
852,2018/02/19,816.0,808.969,800.0,295800,821.0,795.0
853,2018/02/20,826.0,818.884,816.0,157500,826.0,806.0
854,2018/02/21,826.0,824.511,818.0,158300,834.0,814.0
855,2018/02/22,806.0,809.59,821.0,263100,825.0,802.0
856,2018/02/23,835.0,828.983,807.0,398600,843.0,804.0
857,2018/02/26,837.0,838.273,846.0,244000,850.0,829.0
858,2018/02/27,844.0,848.831,847.0,187100,855.0,844.0
859,2018/02/28,838.0,841.898,832.0,137400,849.0,832.0
860,2018/03/01,833.0,830.734,829.0,193400,839.0,820.0
861,2018/03/02,809.0,811.471,810.0,154900,817.0,807.0
862,2018/03/05,783.0,789.836,809.0,213700,812.0,778.0
863,2018/03/06,788.0,796.838,794.0,174200,809.0,787.0
864,2018/03/07,779.0,781.394,786.0,166200,791.0,770.0
865,2018/03/08,776.0,778.501,788.0,92400,789.0,773.0
866,2018/03/09,782.0,783.6,786.0,135700,791.0,777.0
867,2018/03/12,804.0,801.712,797.0,133900,810.0,792.0
868,2018/03/13,806.0,803.192,801.0,104900,810.0,798.0
869,2018/03/14,805.0,812.064,797.0,542400,826.0,794.0
870,2018/03/15,788.0,789.92,804.0,192500,804.0,782.0
871,2018/03/16,770.0,775.985,788.0,184300,788.0,768.0
872,2018/03/19,756.0,758.739,764.0,131400,770.0,751.0
873,2018/03/20,757.0,749.781,745.0,93200,757.0,740.0
874,2018/03/22,757.0,755.855,755.0,61400,765.0,750.0
875,2018/03/23,723.0,729.74,728.0,221100,742.0,721.0
876,2018/03/26,720.0,709.721,708.0,178200,720.0,697.0
877,2018/03/27,746.0,741.068,730.0,128100,747.0,728.0
878,2018/03/28,738.0,732.775,725.0,109300,742.0,722.0
879,2018/03/29,748.0,748.644,745.0,156500,755.0,742.0
880,2018/03/30,776.0,771.812,758.0,194800,784.0,754.0
881,2018/04/02,767.0,770.405,775.0,86100,777.0,763.0
882,2018/04/03,752.0,751.476,751.0,110400,758.0,743.0
883,2018/04/04,759.0,759.021,756.0,109300,765.0,754.0
884,2018/04/05,758.0,757.183,761.0,104200,763.0,752.0
885,2018/04/06,742.0,748.082,759.0,103700,764.0,742.0
886,2018/04/09,726.0,728.697,737.0,131500,739.0,723.0
887,2018/04/10,735.0,727.715,726.0,109100,737.0,716.0
888,2018/04/11,748.0,748.103,736.0,97300,754.0,735.0
889,2018/04/12,731.0,733.671,748.0,92800,748.0,729.0
890,2018/04/13,750.0,745.458,736.0,112200,751.0,734.0
891,2018/04/16,742.0,744.229,751.0,100000,757.0,740.0
892,2018/04/17,729.0,733.158,744.0,88400,744.0,727.0
893,2018/04/18,747.0,741.196,735.0,130600,750.0,731.0
894,2018/04/19,766.0,759.91,749.0,98800,769.0,748.0
895,2018/04/20,757.0,755.795,765.0,107200,765.0,751.0
896,2018/04/23,766.0,763.243,757.0,97000,768.0,753.0
897,2018/04/24,782.0,777.361,770.0,70900,782.0,767.0
898,2018/04/25,782.0,778.324,775.0,92500,784.0,769.0
899,2018/04/26,783.0,785.681,786.0,92700,791.0,781.0
900,2018/04/27,777.0,776.209,790.0,112900,790.0,769.0
901,2018/05/01,771.0,774.012,782.0,76400,782.0,769.0
902,2018/05/02,770.0,769.971,770.0,54400,776.0,765.0
903,2018/05/07,775.0,773.661,775.0,69900,777.0,763.0
904,2018/05/08,781.0,782.805,777.0,66000,788.0,774.0
905,2018/05/09,774.0,776.923,778.0,56900,783.0,773.0
906,2018/05/10,775.0,774.971,775.0,45400,781.0,771.0
907,2018/05/11,782.0,778.908,773.0,81700,785.0,773.0
908,2018/05/14,790.0,784.398,783.0,103000,792.0,776.0
909,2018/05/15,733.0,756.232,796.0,535300,812.0,713.0
910,2018/05/16,740.0,790.915,808.0,2109300,870.0,731.0
911,2018/05/17,729.0,730.388,740.0,681800,743.0,722.0
912,2018/05/18,747.0,744.181,733.0,211900,755.0,732.0
913,2018/05/21,766.0,760.685,753.0,223600,769.0,747.0
914,2018/05/22,780.0,779.072,769.0,216800,787.0,768.0
915,2018/05/23,762.0,769.55,777.0,154700,783.0,762.0
916,2018/05/24,746.0,749.15,762.0,142200,762.0,742.0
917,2018/05/25,743.0,745.748,740.0,204800,759.0,738.0
918,2018/05/28,734.0,739.282,747.0,118600,749.0,732.0
919,2018/05/29,722.0,722.052,733.0,176800,733.0,715.0
920,2018/05/30,706.0,706.053,707.0,154600,712.0,700.0
921,2018/05/31,703.0,701.979,713.0,204100,718.0,697.0
922,2018/06/01,699.0,700.997,703.0,114100,708.0,695.0
923,2018/06/04,701.0,703.394,706.0,114900,708.0,698.0
924,2018/06/05,697.0,698.538,704.0,126300,707.0,693.0
925,2018/06/06,701.0,702.526,697.0,112300,709.0,694.0
926,2018/06/07,710.0,710.193,702.0,104200,714.0,702.0
927,2018/06/08,714.0,714.335,706.0,112000,723.0,706.0
928,2018/06/11,705.0,708.162,712.0,90500,715.0,703.0
929,2018/06/12,702.0,707.319,711.0,122600,717.0,702.0
930,2018/06/13,698.0,699.003,704.0,127100,705.0,696.0
931,2018/06/14,693.0,693.214,696.0,137100,701.0,690.0
932,2018/06/15,691.0,691.125,695.0,116100,696.0,687.0
933,2018/06/18,665.0,670.63,687.0,205600,688.0,663.0
934,2018/06/19,656.0,659.816,662.0,151400,670.0,654.0
935,2018/06/20,654.0,644.359,653.0,192100,655.0,635.0
936,2018/06/21,648.0,650.547,653.0,110900,660.0,645.0
937,2018/06/22,638.0,634.298,642.0,125100,642.0,628.0
938,2018/06/25,624.0,628.906,635.0,116200,637.0,622.0
939,2018/06/26,626.0,618.745,614.0,150800,626.0,611.0
940,2018/06/27,621.0,620.333,622.0,105900,628.0,614.0
941,2018/06/28,620.0,619.141,620.0,83800,626.0,614.0
942,2018/06/29,622.0,620.476,621.0,67800,627.0,615.0
943,2018/07/02,610.0,617.314,622.0,109100,628.0,608.0
944,2018/07/03,593.0,600.07,610.0,218900,617.0,587.0
945,2018/07/04,581.0,583.574,587.0,187800,594.0,577.0
946,2018/07/05,571.0,577.645,578.0,149200,588.0,570.0
947,2018/07/06,589.0,584.515,573.0,130800,589.0,573.0
948,2018/07/09,594.0,588.761,586.0,112400,595.0,580.0
949,2018/07/10,604.0,604.525,602.0,166200,614.0,599.0
950,2018/07/11,587.0,590.956,605.0,166300,605.0,586.0
951,2018/07/12,584.0,583.221,586.0,127000,590.0,578.0
952,2018/07/13,592.0,588.857,586.0,92400,592.0,583.0
953,2018/07/17,598.0,597.699,598.0,99200,603.0,591.0
954,2018/07/18,604.0,602.148,601.0,98300,605.0,598.0
955,2018/07/19,607.0,605.625,602.0,92100,609.0,600.0
956,2018/07/20,599.0,599.449,605.0,114800,606.0,593.0
957,2018/07/23,604.0,599.641,592.0,102300,606.0,590.0
958,2018/07/24,636.0,624.785,605.0,251200,639.0,604.0
959,2018/07/25,634.0,632.298,630.0,146200,640.0,627.0
960,2018/07/26,639.0,634.038,636.0,136100,640.0,628.0
961,2018/07/27,640.0,635.165,636.0,107300,640.0,630.0
962,2018/07/30,640.0,637.116,638.0,99300,640.0,633.0
963,2018/07/31,632.0,631.877,637.0,135700,637.0,627.0
964,2018/08/01,636.0,629.706,630.0,133900,636.0,624.0
965,2018/08/02,615.0,619.61,633.0,249400,634.0,613.0
966,2018/08/03,620.0,616.156,620.0,91500,622.0,610.0
967,2018/08/06,623.0,623.153,617.0,83500,629.0,612.0
968,2018/08/07,624.0,622.299,620.0,89700,626.0,617.0
969,2018/08/08,625.0,625.445,619.0,81800,631.0,618.0
970,2018/08/09,631.0,627.669,624.0,132400,638.0,620.0
971,2018/08/10,618.0,621.782,629.0,132900,629.0,616.0
972,2018/08/13,601.0,603.793,615.0,142300,621.0,597.0
973,2018/08/14,610.0,606.552,602.0,62700,611.0,599.0
974,2018/08/15,598.0,599.509,610.0,61700,612.0,595.0
975,2018/08/16,594.0,589.662,595.0,111500,597.0,582.0
976,2018/08/17,599.0,597.42,594.0,59500,601.0,591.0
977,2018/08/20,596.0,599.536,603.0,44200,604.0,595.0
978,2018/08/21,580.0,583.309,594.0,108700,594.0,579.0
979,2018/08/22,591.0,587.687,578.0,83800,593.0,578.0
980,2018/08/23,585.0,585.735,588.0,60400,589.0,582.0
981,2018/08/24,583.0,583.485,586.0,46600,587.0,581.0
982,2018/08/27,601.0,596.853,590.0,73400,604.0,587.0
983,2018/08/28,602.0,606.072,605.0,56800,611.0,601.0
984,2018/08/29,613.0,611.806,601.0,50600,618.0,601.0
985,2018/08/30,617.0,615.78,619.0,47200,621.0,613.0
986,2018/08/31,604.0,608.352,611.0,57100,615.0,603.0
987,2018/09/03,588.0,592.053,601.0,82600,601.0,585.0
988,2018/09/04,581.0,582.919,590.0,73100,590.0,580.0
989,2018/09/05,580.0,580.064,579.0,69300,584.0,577.0
990,2018/09/06,575.0,576.413,580.0,101000,583.0,572.0
991,2018/09/07,568.0,567.329,571.0,78400,572.0,564.0
992,2018/09/10,569.0,570.38,567.0,53200,574.0,566.0
993,2018/09/11,564.0,563.862,570.0,72200,570.0,561.0
994,2018/09/12,554.0,555.339,563.0,109500,563.0,550.0
995,2018/09/13,555.0,554.888,551.0,78300,561.0,551.0
996,2018/09/14,564.0,562.599,556.0,100400,570.0,556.0
997,2018/09/18,567.0,564.177,561.0,78400,570.0,556.0
998,2018/09/19,575.0,577.7,577.0,114800,582.0,574.0
999,2018/09/20,575.0,575.275,578.0,60800,581.0,573.0
1000,2018/09/21,598.0,592.025,579.0,170700,601.0,577.0
1001,2018/09/25,604.0,597.453,600.0,126900,605.0,587.0
1002,2018/09/26,600.0,597.14,601.0,69400,603.0,591.0
1003,2018/09/27,587.0,588.717,590.0,108500,594.0,585.0
1004,2018/09/28,590.0,592.297,590.0,64900,600.0,588.0
1005,2018/10/01,589.0,590.355,592.0,54900,594.0,586.0
1006,2018/10/02,586.0,592.201,593.0,79800,599.0,586.0
1007,2018/10/03,573.0,577.153,585.0,152500,588.0,570.0
1008,2018/10/04,571.0,574.493,577.0,88500,585.0,569.0
1009,2018/10/05,564.0,567.179,570.0,82700,574.0,563.0
1010,2018/10/09,555.0,555.868,565.0,109100,565.0,552.0
1011,2018/10/10,555.0,553.699,555.0,95400,560.0,550.0
1012,2018/10/11,541.0,539.87,541.0,163300,547.0,535.0
1013,2018/10/12,549.0,547.615,541.0,106200,553.0,539.0
1014,2018/10/15,534.0,538.928,550.0,92000,551.0,534.0
1015,2018/10/16,539.0,536.09,535.0,66500,541.0,532.0
1016,2018/10/17,549.0,546.968,545.0,55500,550.0,542.0
1017,2018/10/18,541.0,542.438,551.0,87600,551.0,539.0
1018,2018/10/19,540.0,538.352,538.0,63900,544.0,535.0
1019,2018/10/22,544.0,540.141,538.0,63700,546.0,534.0
1020,2018/10/23,536.0,537.649,541.0,69300,541.0,536.0
1021,2018/10/24,540.0,538.42,539.0,78100,543.0,536.0
1022,2018/10/25,521.0,524.121,530.0,138200,530.0,519.0
1023,2018/10/26,516.0,520.949,530.0,148200,531.0,513.0
1024,2018/10/29,516.0,517.604,520.0,115600,522.0,514.0
1025,2018/10/30,532.0,525.409,513.0,152800,532.0,512.0
1026,2018/10/31,541.0,536.27,534.0,74000,541.0,529.0
1027,2018/11/01,541.0,540.707,539.0,96000,545.0,536.0
1028,2018/11/02,549.0,545.242,541.0,106500,550.0,538.0
1029,2018/11/05,544.0,545.388,548.0,64700,549.0,541.0
1030,2018/11/06,544.0,546.417,544.0,53900,552.0,541.0
1031,2018/11/07,540.0,546.109,544.0,69800,554.0,538.0
1032,2018/11/08,546.0,548.501,548.0,46500,553.0,546.0
1033,2018/11/09,546.0,545.513,544.0,54400,551.0,542.0
1034,2018/11/12,533.0,537.198,547.0,67100,547.0,525.0
1035,2018/11/13,520.0,522.476,525.0,89700,528.0,518.0
1036,2018/11/14,518.0,520.598,520.0,45300,525.0,518.0
1037,2018/11/15,521.0,519.359,516.0,65400,524.0,516.0
1038,2018/11/16,510.0,514.811,521.0,92400,524.0,510.0
1039,2018/11/19,511.0,511.136,510.0,47200,516.0,508.0
1040,2018/11/20,507.0,507.243,510.0,47400,510.0,505.0
1041,2018/11/21,508.0,503.35,502.0,80800,508.0,498.0
1042,2018/11/22,505.0,502.91,505.0,34500,507.0,500.0
1043,2018/11/26,505.0,506.73,507.0,60800,510.0,503.0
1044,2018/11/27,510.0,507.689,505.0,58900,511.0,502.0
1045,2018/11/28,508.0,509.441,510.0,56700,514.0,506.0
1046,2018/11/29,509.0,510.588,513.0,38800,513.0,508.0
1047,2018/11/30,512.0,510.482,509.0,36900,512.0,508.0
1048,2018/12/03,511.0,511.988,512.0,77500,515.0,509.0
1049,2018/12/04,505.0,506.077,508.0,73100,511.0,504.0
1050,2018/12/05,499.0,497.623,501.0,100100,502.0,492.0
1051,2018/12/06,498.0,495.559,497.0,77300,499.0,493.0
1052,2018/12/07,489.0,492.166,495.0,69300,499.0,489.0
1053,2018/12/10,478.0,480.607,485.0,93800,485.0,475.0
1054,2018/12/11,472.0,474.108,478.0,110900,479.0,471.0
1055,2018/12/12,478.0,478.874,472.0,92600,485.0,472.0
1056,2018/12/13,482.0,482.553,484.0,47600,485.0,480.0
1057,2018/12/14,480.0,481.383,482.0,86000,485.0,478.0
1058,2018/12/17,468.0,472.524,477.0,83200,480.0,467.0
1059,2018/12/18,463.0,463.142,461.0,117100,469.0,460.0
1060,2018/12/19,464.0,461.649,460.0,110300,466.0,456.0
1061,2018/12/20,446.0,452.828,457.0,120700,461.0,445.0
1062,2018/12/21,420.0,425.965,440.0,200900,440.0,418.0
1063,2018/12/25,395.0,395.749,396.0,292600,400.0,390.0
1064,2018/12/26,407.0,403.022,402.0,152700,409.0,397.0
1065,2018/12/27,446.0,437.601,434.0,152400,447.0,427.0
1066,2018/12/28,447.0,446.104,441.0,58900,450.0,441.0
1067,2019/01/04,442.0,437.851,437.0,79300,443.0,430.0
1068,2019/01/07,449.0,452.653,452.0,77000,458.0,448.0
1069,2019/01/08,451.0,451.454,449.0,57100,454.0,449.0
1070,2019/01/09,447.0,448.143,452.0,48200,454.0,445.0
1071,2019/01/10,451.0,448.25,447.0,41600,451.0,445.0
1072,2019/01/11,453.0,450.576,452.0,48600,454.0,448.0
1073,2019/01/15,456.0,455.321,453.0,53600,458.0,450.0
1074,2019/01/16,453.0,458.38,460.0,73400,464.0,453.0
1075,2019/01/17,447.0,449.183,456.0,67800,456.0,445.0
1076,2019/01/18,446.0,448.059,453.0,51200,453.0,445.0
1077,2019/01/21,455.0,452.995,450.0,36900,456.0,450.0
1078,2019/01/22,451.0,451.22,456.0,54200,456.0,449.0
1079,2019/01/23,449.0,448.82,448.0,21100,452.0,446.0
1080,2019/01/24,453.0,449.531,448.0,36700,454.0,445.0
1081,2019/01/25,461.0,459.949,453.0,41300,464.0,453.0
1082,2019/01/28,463.0,464.903,466.0,61600,466.0,463.0
1083,2019/01/29,464.0,463.56,466.0,35000,466.0,461.0
1084,2019/01/30,455.0,457.874,460.0,45200,463.0,455.0
1085,2019/01/31,456.0,457.257,459.0,37300,461.0,455.0
1086,2019/02/01,447.0,450.397,455.0,44100,456.0,446.0
1087,2019/02/04,456.0,452.914,449.0,28000,456.0,447.0
1088,2019/02/05,456.0,458.2,458.0,34500,462.0,455.0
1089,2019/02/06,459.0,458.112,461.0,25900,461.0,456.0
1090,2019/02/07,455.0,453.796,458.0,43100,458.0,451.0
1091,2019/02/08,443.0,446.123,450.0,86100,450.0,441.0
1092,2019/02/12,453.0,448.945,442.0,34800,454.0,442.0
1093,2019/02/13,452.0,451.491,452.0,34400,454.0,449.0
1094,2019/02/14,426.0,438.226,451.0,154300,457.0,426.0
1095,2019/02/15,426.0,426.06,426.0,66700,430.0,424.0
1096,2019/02/18,438.0,431.636,433.0,83200,438.0,424.0
1097,2019/02/19,435.0,435.949,438.0,40900,438.0,433.0
1098,2019/02/20,436.0,435.569,435.0,23900,439.0,433.0
1099,2019/02/21,435.0,435.306,439.0,33700,439.0,433.0
1100,2019/02/22,432.0,431.3,434.0,38700,434.0,429.0
1101,2019/02/25,438.0,435.537,435.0,33700,438.0,433.0
1102,2019/02/26,435.0,436.223,439.0,36400,439.0,432.0
1103,2019/02/27,436.0,435.127,435.0,30700,436.0,433.0
1104,2019/02/28,439.0,437.085,435.0,73000,441.0,434.0
1105,2019/03/01,436.0,438.607,439.0,67100,443.0,435.0
1106,2019/03/04,434.0,434.87,437.0,32200,438.0,433.0
1107,2019/03/05,434.0,432.606,433.0,39800,435.0,431.0
1108,2019/03/06,432.0,433.619,435.0,25200,437.0,432.0
1109,2019/03/07,430.0,430.261,432.0,64100,432.0,428.0
1110,2019/03/08,416.0,420.415,426.0,95500,426.0,415.0
1111,2019/03/11,415.0,413.718,418.0,51700,418.0,411.0
1112,2019/03/12,425.0,423.327,419.0,62000,426.0,418.0
1113,2019/03/13,422.0,423.0,423.0,30500,426.0,421.0
1114,2019/03/14,422.0,424.028,423.0,28900,429.0,421.0
1115,2019/03/15,429.0,428.997,422.0,72900,436.0,421.0
1116,2019/03/18,438.0,439.276,434.0,110000,445.0,433.0
1117,2019/03/19,433.0,436.079,443.0,73600,443.0,433.0
1118,2019/03/20,436.0,435.542,433.0,41900,438.0,432.0
1119,2019/03/22,442.0,439.006,439.0,32300,442.0,435.0
1120,2019/03/25,435.0,433.156,436.0,50500,436.0,431.0
1121,2019/03/26,441.0,438.605,437.0,81800,441.0,434.0
1122,2019/03/27,439.0,434.764,432.0,45700,440.0,430.0
1123,2019/03/28,428.0,429.253,435.0,63700,435.0,426.0
1124,2019/03/29,435.0,430.634,428.0,58800,436.0,425.0
1125,2019/04/01,443.0,442.617,435.0,67700,445.0,435.0
1126,2019/04/02,444.0,444.217,448.0,39700,448.0,441.0
1127,2019/04/03,442.0,441.163,443.0,50400,443.0,438.0
1128,2019/04/04,443.0,444.107,441.0,36300,447.0,440.0
1129,2019/04/05,449.0,447.132,443.0,41000,449.0,443.0
1130,2019/04/08,443.0,444.065,448.0,41300,448.0,441.0
1131,2019/04/09,444.0,442.717,443.0,24000,445.0,441.0
1132,2019/04/10,439.0,438.91,444.0,36800,444.0,436.0
1133,2019/04/11,434.0,434.541,438.0,24400,438.0,432.0
1134,2019/04/12,431.0,430.486,432.0,50400,434.0,427.0
1135,2019/04/15,462.0,454.678,435.0,351100,466.0,434.0
1136,2019/04/16,459.0,459.319,465.0,117000,466.0,453.0
1137,2019/04/17,462.0,459.732,459.0,54900,462.0,454.0
1138,2019/04/18,458.0,459.198,463.0,75300,465.0,454.0
1139,2019/04/19,451.0,453.851,457.0,60900,458.0,450.0
1140,2019/04/22,446.0,446.362,449.0,37000,449.0,444.0
1141,2019/04/23,443.0,441.452,445.0,43800,445.0,436.0
1142,2019/04/24,458.0,456.274,453.0,142400,462.0,451.0
1143,2019/04/25,478.0,468.855,463.0,209700,479.0,455.0
1144,2019/04/26,476.0,470.105,473.0,129700,478.0,464.0
1145,2019/05/07,462.0,466.914,475.0,81300,476.0,461.0
1146,2019/05/08,453.0,453.362,460.0,95400,460.0,449.0
1147,2019/05/09,433.0,440.76,452.0,149300,452.0,432.0
1148,2019/05/10,435.0,434.005,432.0,63200,439.0,431.0
1149,2019/05/13,427.0,429.965,435.0,51300,435.0,423.0
1150,2019/05/14,429.0,424.697,420.0,98700,436.0,414.0
1151,2019/05/15,395.0,398.663,433.0,321000,433.0,386.0
1152,2019/05/16,391.0,393.634,399.0,119800,400.0,390.0
1153,2019/05/17,395.0,394.252,395.0,70600,398.0,391.0
1154,2019/05/20,394.0,396.136,401.0,58200,403.0,392.0
1155,2019/05/21,391.0,390.672,392.0,57700,394.0,388.0
1156,2019/05/22,393.0,392.221,394.0,37600,395.0,390.0
1157,2019/05/23,393.0,390.667,393.0,37800,394.0,388.0
1158,2019/05/24,393.0,390.807,389.0,45500,394.0,387.0
1159,2019/05/27,395.0,394.499,395.0,36700,396.0,392.0
1160,2019/05/28,390.0,392.094,396.0,32100,396.0,390.0
1161,2019/05/29,384.0,385.5,389.0,55200,389.0,383.0
1162,2019/05/30,384.0,379.339,382.0,90200,384.0,372.0
1163,2019/05/31,377.0,377.825,384.0,60500,384.0,375.0
1164,2019/06/03,370.0,369.271,370.0,81600,373.0,364.0
1165,2019/06/04,385.0,378.308,368.0,72200,385.0,368.0
1166,2019/06/05,394.0,392.602,387.0,60500,397.0,387.0
1167,2019/06/06,389.0,391.438,393.0,27600,395.0,389.0
1168,2019/06/07,391.0,390.531,389.0,23900,393.0,387.0
1169,2019/06/10,394.0,395.69,393.0,49100,399.0,393.0
1170,2019/06/11,404.0,400.396,395.0,76800,405.0,393.0
1171,2019/06/12,410.0,407.499,402.0,87100,412.0,401.0
1172,2019/06/13,399.0,401.429,408.0,100700,408.0,398.0
1173,2019/06/14,402.0,403.049,400.0,63400,406.0,400.0
1174,2019/06/17,397.0,400.199,404.0,44700,405.0,396.0
1175,2019/06/18,401.0,400.016,397.0,62800,403.0,396.0
1176,2019/06/19,420.0,413.734,405.0,79000,421.0,405.0
1177,2019/06/20,422.0,421.018,421.0,38300,424.0,418.0
1178,2019/06/21,418.0,419.879,422.0,34000,422.0,418.0
1179,2019/06/24,428.0,424.26,422.0,48900,428.0,417.0
1180,2019/06/25,430.0,430.122,427.0,61400,433.0,424.0
1181,2019/06/26,425.0,427.703,427.0,53900,434.0,425.0
1182,2019/06/27,427.0,428.57,427.0,21400,432.0,426.0
1183,2019/06/28,418.0,421.988,424.0,43200,427.0,418.0
1184,2019/07/01,432.0,427.982,425.0,60900,432.0,424.0
1185,2019/07/02,428.0,425.663,432.0,48900,432.0,420.0
1186,2019/07/03,433.0,429.627,428.0,32200,433.0,424.0
1187,2019/07/04,442.0,439.193,435.0,59500,444.0,435.0
1188,2019/07/05,449.0,446.9,445.0,46900,450.0,444.0
1189,2019/07/08,441.0,442.867,449.0,35300,449.0,440.0
1190,2019/07/09,439.0,439.748,440.0,25400,444.0,438.0
1191,2019/07/10,433.0,434.207,437.0,35800,438.0,433.0
1192,2019/07/11,444.0,441.428,436.0,34600,446.0,433.0
1193,2019/07/12,437.0,439.145,446.0,27600,446.0,437.0
1194,2019/07/16,438.0,436.343,435.0,24200,440.0,433.0
1195,2019/07/17,433.0,434.168,435.0,36900,438.0,432.0
1196,2019/07/18,418.0,424.06,430.0,63000,431.0,418.0
1197,2019/07/19,423.0,421.801,416.0,27600,427.0,416.0
1198,2019/07/22,426.0,424.15,420.0,14700,427.0,420.0
1199,2019/07/23,427.0,427.994,424.0,16600,429.0,424.0
1200,2019/07/24,425.0,426.723,429.0,29200,431.0,423.0
1201,2019/07/25,432.0,428.208,427.0,24100,433.0,422.0
1202,2019/07/26,430.0,432.334,436.0,42500,436.0,425.0
1203,2019/07/29,425.0,426.168,427.0,9500,428.0,425.0
1204,2019/07/30,430.0,428.395,426.0,20500,430.0,425.0
1205,2019/07/31,427.0,425.884,425.0,15500,428.0,424.0
1206,2019/08/01,425.0,425.04,427.0,12500,427.0,424.0
1207,2019/08/02,408.0,411.062,421.0,52900,421.0,406.0
1208,2019/08/05,393.0,394.442,403.0,55600,403.0,390.0
1209,2019/08/06,401.0,394.528,390.0,69200,401.0,385.0
1210,2019/08/07,396.0,398.771,405.0,42000,405.0,395.0
1211,2019/08/08,396.0,397.996,399.0,26800,402.0,395.0
1212,2019/08/09,402.0,398.637,400.0,27800,402.0,393.0
1213,2019/08/13,396.0,393.907,395.0,34400,397.0,390.0
1214,2019/08/14,386.0,394.72,402.0,107600,405.0,385.0
1215,2019/08/15,394.0,383.358,378.0,56200,394.0,375.0
1216,2019/08/16,393.0,393.267,396.0,20600,396.0,388.0
1217,2019/08/19,400.0,397.91,399.0,23400,400.0,393.0
1218,2019/08/20,400.0,400.694,403.0,21600,403.0,398.0
1219,2019/08/21,393.0,394.966,394.0,23700,398.0,393.0
1220,2019/08/22,393.0,395.469,396.0,12800,399.0,393.0
1221,2019/08/23,394.0,392.784,393.0,19900,394.0,391.0
