,Date,Close,VWAP,Open,Volume,High,Low
0,2014/08/25,1870.0,1868.716,1862.5,59200,1875.0,1857.5
1,2014/08/26,1882.5,1878.799,1870.0,117400,1887.5,1867.5
2,2014/08/27,1857.5,1860.778,1877.5,84800,1877.5,1852.5
3,2014/08/28,1865.0,1859.665,1857.5,73200,1865.0,1850.0
4,2014/08/29,1842.5,1840.201,1850.0,92000,1852.5,1827.5
5,2014/09/01,1852.5,1843.685,1852.5,61600,1852.5,1830.0
6,2014/09/02,1872.5,1864.503,1855.0,95600,1872.5,1850.0
7,2014/09/03,1857.5,1859.066,1872.5,79800,1875.0,1852.5
8,2014/09/04,1842.5,1848.476,1857.5,109600,1862.5,1837.5
9,2014/09/05,1852.5,1849.563,1850.0,73200,1855.0,1842.5
10,2014/09/08,1877.5,1874.036,1857.5,166400,1885.0,1857.5
11,2014/09/09,1900.0,1897.008,1885.0,217600,1912.5,1875.0
12,2014/09/10,1917.5,1911.58,1905.0,219000,1930.0,1887.5
13,2014/09/11,1835.0,1839.438,1840.0,587800,1870.0,1817.5
14,2014/09/12,1847.5,1837.57,1820.0,378600,1852.5,1820.0
15,2014/09/16,1845.0,1846.691,1855.0,110000,1857.5,1837.5
16,2014/09/17,1817.5,1830.775,1845.0,140600,1850.0,1817.5
17,2014/09/18,1807.5,1814.484,1815.0,131800,1827.5,1807.5
18,2014/09/19,1825.0,1815.391,1817.5,131800,1825.0,1807.5
19,2014/09/22,1817.5,1815.829,1827.5,83200,1830.0,1810.0
20,2014/09/24,1810.0,1811.137,1817.5,212000,1820.0,1805.0
21,2014/09/25,1825.0,1816.194,1812.5,130200,1825.0,1807.5
22,2014/09/26,1807.5,1810.816,1817.5,139800,1822.5,1802.5
23,2014/09/29,1805.0,1803.678,1805.0,176600,1810.0,1800.0
24,2014/09/30,1795.0,1801.313,1802.5,158000,1815.0,1795.0
25,2014/10/01,1822.5,1812.577,1805.0,200400,1825.0,1795.0
26,2014/10/02,1805.0,1805.588,1807.5,160800,1817.5,1797.5
27,2014/10/03,1822.5,1813.576,1802.5,96200,1822.5,1800.0
28,2014/10/06,1822.5,1825.552,1825.0,96000,1832.5,1820.0
29,2014/10/07,1845.0,1838.268,1835.0,183000,1845.0,1830.0
30,2014/10/08,1822.5,1823.235,1827.5,108800,1832.5,1815.0
31,2014/10/09,1787.5,1798.466,1817.5,183200,1820.0,1785.0
32,2014/10/10,1797.5,1786.484,1775.0,169200,1802.5,1760.0
33,2014/10/14,1772.5,1773.216,1775.0,157800,1795.0,1767.5
34,2014/10/15,1782.5,1779.813,1785.0,141800,1787.5,1772.5
35,2014/10/16,1775.0,1778.447,1770.0,124600,1790.0,1765.0
36,2014/10/17,1722.5,1741.781,1760.0,217000,1765.0,1720.0
37,2014/10/20,1782.5,1787.962,1765.0,327000,1810.0,1755.0
38,2014/10/21,1775.0,1783.725,1795.0,139200,1805.0,1765.0
39,2014/10/22,1690.0,1701.548,1780.0,864200,1787.5,1650.0
40,2014/10/23,1695.0,1694.245,1697.5,232400,1702.5,1675.0
41,2014/10/24,1702.5,1704.072,1712.5,121800,1712.5,1697.5
42,2014/10/27,1710.0,1711.011,1720.0,174600,1722.5,1702.5
43,2014/10/28,1705.0,1706.634,1710.0,230800,1720.0,1692.5
44,2014/10/29,1710.0,1710.393,1715.0,95400,1722.5,1700.0
45,2014/10/30,1720.0,1722.471,1717.5,104600,1730.0,1710.0
46,2014/10/31,1762.5,1752.104,1737.5,193000,1767.5,1737.5
47,2014/11/04,1752.5,1768.121,1797.5,215000,1800.0,1752.5
48,2014/11/05,1762.5,1763.574,1755.0,134600,1772.5,1755.0
49,2014/11/06,1755.0,1763.82,1770.0,117800,1775.0,1752.5
50,2014/11/07,1752.5,1759.148,1760.0,117400,1770.0,1752.5
51,2014/11/10,1760.0,1758.367,1752.5,74400,1765.0,1752.5
52,2014/11/11,1752.5,1751.814,1755.0,158200,1760.0,1747.5
53,2014/11/12,1750.0,1751.668,1755.0,184400,1765.0,1742.5
54,2014/11/13,1775.0,1767.855,1752.5,131000,1777.5,1752.5
55,2014/11/14,1772.5,1772.863,1780.0,137800,1780.0,1765.0
56,2014/11/17,1752.5,1762.73,1785.0,165400,1785.0,1750.0
57,2014/11/18,1762.5,1759.965,1755.0,142800,1767.5,1752.5
58,2014/11/19,1762.5,1765.798,1770.0,94000,1775.0,1760.0
59,2014/11/20,1760.0,1764.575,1775.0,131800,1775.0,1757.5
60,2014/11/21,1762.5,1761.096,1767.5,116800,1767.5,1755.0
61,2014/11/25,1767.5,1768.998,1775.0,86800,1775.0,1762.5
62,2014/11/26,1792.5,1790.8,1775.0,196800,1802.5,1770.0
63,2014/11/27,1792.5,1797.659,1800.0,78800,1805.0,1790.0
64,2014/11/28,1785.0,1789.371,1802.5,139200,1802.5,1780.0
65,2014/12/01,1800.0,1795.527,1790.0,113000,1802.5,1787.5
66,2014/12/02,1835.0,1817.742,1800.0,215200,1835.0,1800.0
67,2014/12/03,1830.0,1836.596,1847.5,203600,1850.0,1825.0
68,2014/12/04,1860.0,1853.302,1847.5,232000,1867.5,1837.5
69,2014/12/05,1850.0,1851.259,1860.0,167200,1860.0,1845.0
70,2014/12/08,1870.0,1871.737,1865.0,258200,1885.0,1857.5
71,2014/12/09,1847.5,1858.306,1870.0,209000,1877.5,1847.5
72,2014/12/10,1842.5,1847.172,1845.0,189000,1860.0,1832.5
73,2014/12/11,1822.5,1809.637,1812.5,500800,1855.0,1780.0
74,2014/12/12,1955.0,1924.75,1885.0,1375600,1965.0,1872.5
75,2014/12/15,1955.0,1955.367,1950.0,385600,1967.5,1937.5
76,2014/12/16,1955.0,1954.612,1947.5,365800,1965.0,1935.0
77,2014/12/17,1955.0,1954.107,1952.5,281200,1965.0,1947.5
78,2014/12/18,1962.5,1969.02,1955.0,339200,1985.0,1955.0
79,2014/12/19,1995.0,1988.379,1980.0,253200,2000.0,1977.5
80,2014/12/22,1990.0,1985.016,2000.0,161400,2000.0,1977.5
81,2014/12/24,2012.5,2003.898,1995.0,268200,2012.5,1990.0
82,2014/12/25,2022.5,2024.903,2015.0,287400,2037.5,2015.0
83,2014/12/26,2035.0,2034.666,2037.5,127400,2040.0,2027.5
84,2014/12/29,2055.0,2050.416,2042.5,274000,2062.5,2035.0
85,2014/12/30,2055.0,2046.994,2055.0,240200,2062.5,2030.0
86,2015/01/05,2040.0,2041.49,2037.5,174800,2050.0,2032.5
87,2015/01/06,2015.0,2022.728,2030.0,252000,2040.0,2007.5
88,2015/01/07,2007.5,2010.734,2002.5,178600,2022.5,2000.0
89,2015/01/08,2002.5,2012.705,2012.5,241000,2030.0,2002.5
90,2015/01/09,2025.0,2022.17,2012.5,231600,2030.0,2007.5
91,2015/01/13,2035.0,2022.302,2012.5,197000,2037.5,2007.5
92,2015/01/14,2025.0,2032.484,2032.5,217800,2045.0,2017.5
93,2015/01/15,2032.5,2026.987,2025.0,217400,2040.0,2015.0
94,2015/01/16,2027.5,2021.085,2025.0,224400,2032.5,2010.0
95,2015/01/19,2020.0,2021.963,2022.5,173200,2027.5,2015.0
96,2015/01/20,2085.0,2067.575,2045.0,617400,2085.0,2040.0
97,2015/01/21,2060.0,2058.04,2075.0,317800,2075.0,2045.0
98,2015/01/22,2037.5,2039.707,2057.5,240400,2065.0,2027.5
99,2015/01/23,2070.0,2065.594,2047.5,436800,2077.5,2045.0
100,2015/01/26,2047.5,2051.676,2055.0,416800,2070.0,2042.5
101,2015/01/27,2027.5,2034.353,2045.0,998600,2047.5,2025.0
102,2015/01/28,1985.0,2001.463,2000.0,1048600,2022.5,1985.0
103,2015/01/29,1990.0,1984.239,1975.0,422600,2005.0,1952.5
104,2015/01/30,2025.0,2021.895,2007.5,379600,2030.0,2005.0
105,2015/02/02,2017.5,2013.627,2015.0,181400,2020.0,2007.5
106,2015/02/03,1972.5,1986.731,2017.5,213200,2017.5,1967.5
107,2015/02/04,1975.0,1980.874,1975.0,178000,1995.0,1972.5
108,2015/02/05,1955.0,1956.56,1965.0,120200,1967.5,1950.0
109,2015/02/06,1952.5,1945.357,1950.0,159800,1957.5,1935.0
110,2015/02/09,1925.0,1926.911,1952.5,288800,1955.0,1912.5
111,2015/02/10,1920.0,1907.052,1917.5,263400,1922.5,1892.5
112,2015/02/12,1970.0,1960.243,1930.0,283600,1975.0,1930.0
113,2015/02/13,1975.0,1965.933,1962.5,181200,1975.0,1955.0
114,2015/02/16,2002.5,1991.21,1985.0,204200,2002.5,1975.0
115,2015/02/17,2020.0,2009.264,1995.0,207200,2022.5,1985.0
116,2015/02/18,2045.0,2049.809,2045.0,530200,2072.5,2032.5
117,2015/02/19,2057.5,2053.557,2040.0,290000,2065.0,2035.0
118,2015/02/20,2062.5,2056.479,2055.0,197400,2067.5,2037.5
119,2015/02/23,2067.5,2062.457,2050.0,151600,2070.0,2047.5
120,2015/02/24,2067.5,2061.314,2052.5,93600,2067.5,2052.5
121,2015/02/25,2075.0,2066.062,2065.0,163400,2075.0,2055.0
122,2015/02/26,2077.5,2074.645,2075.0,115400,2080.0,2065.0
123,2015/02/27,2055.0,2056.518,2067.5,159800,2072.5,2042.5
124,2015/03/02,2040.0,2042.606,2050.0,122200,2062.5,2035.0
125,2015/03/03,2037.5,2030.857,2025.0,100400,2040.0,2020.0
126,2015/03/04,2037.5,2037.525,2037.5,79200,2042.5,2030.0
127,2015/03/05,2050.0,2044.523,2025.0,135200,2055.0,2025.0
128,2015/03/06,2037.5,2039.154,2047.5,138800,2050.0,2027.5
129,2015/03/09,2020.0,2025.719,2025.0,126600,2037.5,2012.5
130,2015/03/10,2052.5,2049.16,2022.5,213000,2062.5,2022.5
131,2015/03/11,2112.5,2100.492,2002.5,815600,2155.0,2002.5
132,2015/03/12,2170.0,2151.661,2115.0,382600,2172.5,2115.0
133,2015/03/13,2222.5,2203.529,2175.0,431800,2235.0,2165.0
134,2015/03/16,2237.5,2219.67,2217.5,234600,2245.0,2187.5
135,2015/03/17,2262.5,2254.228,2237.5,249400,2275.0,2225.0
136,2015/03/18,2340.0,2310.338,2272.5,365800,2340.0,2272.5
137,2015/03/19,2355.0,2360.037,2367.5,521200,2422.5,2305.0
138,2015/03/20,2285.0,2296.435,2320.0,290200,2345.0,2272.5
139,2015/03/23,2232.5,2237.277,2260.0,231200,2262.5,2210.0
140,2015/03/24,2220.0,2215.78,2210.0,266600,2230.0,2192.5
141,2015/03/25,2195.0,2193.922,2202.5,151200,2210.0,2185.0
142,2015/03/26,2152.5,2154.88,2175.0,232600,2185.0,2140.0
143,2015/03/27,2095.0,2105.096,2122.5,275800,2135.0,2085.0
144,2015/03/30,2105.0,2099.813,2090.0,229400,2125.0,2067.5
145,2015/03/31,2097.5,2102.419,2105.0,254200,2130.0,2090.0
146,2015/04/01,2065.0,2077.744,2092.5,225200,2100.0,2062.5
147,2015/04/02,2080.0,2077.279,2065.0,190000,2087.5,2065.0
148,2015/04/03,2170.0,2147.455,2095.0,289200,2172.5,2090.0
149,2015/04/06,2182.5,2184.819,2167.5,220600,2212.5,2165.0
150,2015/04/07,2230.0,2214.02,2217.5,276000,2230.0,2175.0
151,2015/04/08,2235.0,2230.973,2245.0,177800,2250.0,2217.5
152,2015/04/09,2230.0,2222.161,2235.0,150200,2240.0,2205.0
153,2015/04/10,2250.0,2223.424,2215.0,221400,2250.0,2205.0
154,2015/04/13,2247.5,2235.748,2237.5,195200,2247.5,2212.5
155,2015/04/14,2300.0,2264.294,2242.5,247200,2300.0,2225.0
156,2015/04/15,2280.0,2260.935,2270.0,318600,2290.0,2225.0
157,2015/04/16,2165.0,2171.158,2272.5,703200,2272.5,2127.5
158,2015/04/17,2212.5,2193.798,2167.5,356600,2217.5,2165.0
159,2015/04/20,2180.0,2193.007,2202.5,162800,2215.0,2172.5
160,2015/04/21,2215.0,2206.475,2182.5,122000,2215.0,2180.0
161,2015/04/22,2250.0,2229.988,2217.5,215000,2250.0,2202.5
162,2015/04/23,2215.0,2227.262,2250.0,184600,2257.5,2205.0
163,2015/04/24,2267.5,2257.566,2215.0,297600,2290.0,2210.0
164,2015/04/27,2242.5,2253.693,2267.5,100600,2272.5,2240.0
165,2015/04/28,2260.0,2267.894,2247.5,174000,2285.0,2247.5
166,2015/04/30,2250.0,2248.091,2255.0,191200,2265.0,2232.5
167,2015/05/01,2182.5,2195.601,2235.0,255400,2237.5,2177.5
168,2015/05/07,2140.0,2151.71,2177.5,244200,2190.0,2135.0
169,2015/05/08,2142.5,2141.23,2137.5,139800,2155.0,2125.0
170,2015/05/11,2130.0,2141.498,2152.5,122800,2160.0,2130.0
171,2015/05/12,2135.0,2135.48,2142.5,154200,2145.0,2125.0
172,2015/05/13,2150.0,2142.875,2137.5,92000,2152.5,2130.0
173,2015/05/14,2127.5,2136.363,2145.0,97600,2150.0,2127.5
174,2015/05/15,2162.5,2158.631,2142.5,125600,2172.5,2132.5
175,2015/05/18,2157.5,2159.678,2160.0,108600,2170.0,2152.5
176,2015/05/19,2200.0,2199.5,2167.5,229800,2212.5,2162.5
177,2015/05/20,2210.0,2211.302,2215.0,100600,2222.5,2202.5
178,2015/05/21,2232.5,2226.645,2220.0,93600,2240.0,2212.5
179,2015/05/22,2225.0,2230.189,2240.0,100800,2247.5,2220.0
180,2015/05/25,2222.5,2224.817,2227.5,106800,2237.5,2217.5
181,2015/05/26,2207.5,2214.148,2212.5,98600,2225.0,2207.5
182,2015/05/27,2217.5,2218.945,2222.5,111800,2225.0,2212.5
183,2015/05/28,2220.0,2218.35,2220.0,121800,2227.5,2210.0
184,2015/05/29,2220.0,2218.792,2225.0,142400,2230.0,2205.0
185,2015/06/01,2245.0,2241.154,2222.5,117000,2250.0,2220.0
186,2015/06/02,2275.0,2266.732,2247.5,197800,2295.0,2232.5
187,2015/06/03,2237.5,2252.541,2285.0,170600,2290.0,2235.0
188,2015/06/04,2210.0,2220.737,2237.5,248400,2242.5,2210.0
189,2015/06/05,2200.0,2201.196,2205.0,148800,2207.5,2195.0
190,2015/06/08,2175.0,2184.949,2205.0,334600,2210.0,2172.5
191,2015/06/09,2157.5,2171.408,2177.5,303200,2195.0,2147.5
192,2015/06/10,2140.0,2146.887,2175.0,297600,2175.0,2130.0
193,2015/06/11,2022.5,2020.243,2020.0,1283400,2070.0,1967.5
194,2015/06/12,1987.5,1989.29,2012.5,892800,2020.0,1975.0
195,2015/06/15,1947.5,1957.104,1992.5,533400,1992.5,1945.0
196,2015/06/16,1930.0,1943.787,1945.0,362600,1962.5,1930.0
197,2015/06/17,1915.0,1917.16,1930.0,412200,1935.0,1907.5
198,2015/06/18,1920.0,1909.055,1910.0,417600,1922.5,1892.5
199,2015/06/19,2000.0,1995.167,1990.0,747200,2020.0,1967.5
200,2015/06/22,2030.0,2028.492,2000.0,568400,2060.0,2000.0
201,2015/06/23,2037.5,2036.398,2052.5,359200,2055.0,2025.0
202,2015/06/24,2077.5,2065.74,2050.0,367400,2080.0,2045.0
203,2015/06/25,2110.0,2108.06,2082.5,393000,2122.5,2077.5
204,2015/06/26,2147.5,2146.342,2120.0,411000,2165.0,2120.0
205,2015/06/29,2110.0,2113.793,2100.0,410600,2140.0,2085.0
206,2015/06/30,2147.5,2143.161,2110.0,314600,2160.0,2102.5
207,2015/07/01,2235.0,2211.912,2162.5,485600,2240.0,2162.5
208,2015/07/02,2297.5,2295.705,2255.0,625600,2327.5,2255.0
209,2015/07/03,2290.0,2284.717,2287.5,257800,2297.5,2270.0
210,2015/07/06,2267.5,2271.673,2267.5,327000,2295.0,2255.0
211,2015/07/07,2272.5,2281.34,2270.0,279800,2295.0,2270.0
212,2015/07/08,2222.5,2239.938,2277.5,361200,2280.0,2215.0
213,2015/07/09,2200.0,2156.189,2132.5,461200,2217.5,2100.0
214,2015/07/10,2200.0,2206.857,2200.0,252600,2245.0,2180.0
215,2015/07/13,2222.5,2207.665,2207.5,314800,2235.0,2180.0
216,2015/07/14,2275.0,2270.139,2255.0,249000,2280.0,2250.0
217,2015/07/15,2305.0,2301.998,2280.0,275600,2320.0,2272.5
218,2015/07/16,2280.0,2300.054,2320.0,361200,2332.5,2270.0
219,2015/07/17,2322.5,2305.005,2305.0,190800,2322.5,2285.0
220,2015/07/21,2332.5,2332.583,2317.5,180600,2340.0,2315.0
221,2015/07/22,2330.0,2328.749,2327.5,179400,2342.5,2310.0
222,2015/07/23,2365.0,2359.109,2340.0,258000,2380.0,2337.5
223,2015/07/24,2350.0,2355.843,2365.0,151200,2377.5,2345.0
224,2015/07/27,2317.5,2329.105,2350.0,266000,2350.0,2312.5
225,2015/07/28,2332.5,2332.345,2300.0,550400,2360.0,2290.0
226,2015/07/29,2340.0,2318.866,2293.0,355700,2349.0,2293.0
227,2015/07/30,2268.0,2294.848,2350.0,365700,2367.0,2266.0
228,2015/07/31,2273.0,2268.156,2295.0,211700,2295.0,2241.0
229,2015/08/03,2273.0,2262.656,2250.0,130600,2286.0,2250.0
230,2015/08/04,2349.0,2332.709,2273.0,256500,2360.0,2273.0
231,2015/08/05,2393.0,2399.605,2360.0,369800,2420.0,2360.0
232,2015/08/06,2389.0,2411.721,2420.0,204100,2432.0,2388.0
233,2015/08/07,2367.0,2366.513,2389.0,129700,2399.0,2351.0
234,2015/08/10,2464.0,2443.664,2368.0,320300,2490.0,2365.0
235,2015/08/11,2400.0,2425.252,2490.0,222700,2495.0,2388.0
236,2015/08/12,2334.0,2351.72,2388.0,151900,2393.0,2330.0
237,2015/08/13,2354.0,2332.096,2334.0,213200,2373.0,2287.0
238,2015/08/14,2371.0,2370.314,2338.0,109200,2390.0,2331.0
239,2015/08/17,2422.0,2395.123,2368.0,150700,2424.0,2360.0
240,2015/08/18,2410.0,2412.217,2426.0,159700,2447.0,2388.0
241,2015/08/19,2318.0,2337.77,2382.0,212800,2390.0,2311.0
242,2015/08/20,2281.0,2298.111,2312.0,118900,2338.0,2275.0
243,2015/08/21,2249.0,2248.787,2230.0,176200,2278.0,2230.0
244,2015/08/24,2129.0,2167.173,2199.0,234400,2237.0,2127.0
245,2015/08/25,2090.0,2103.259,2013.0,306100,2200.0,2000.0
246,2015/08/26,2159.0,2148.884,2118.0,172500,2170.0,2118.0
247,2015/08/27,2188.0,2209.786,2219.0,148900,2243.0,2181.0
248,2015/08/28,2197.0,2196.77,2239.0,168100,2239.0,2179.0
249,2015/08/31,2177.0,2177.702,2197.0,156500,2208.0,2159.0
250,2015/09/01,2100.0,2135.638,2160.0,159800,2169.0,2100.0
251,2015/09/02,2100.0,2093.085,2050.0,168900,2160.0,2035.0
252,2015/09/03,2148.0,2140.259,2110.0,105000,2172.0,2101.0
253,2015/09/04,2082.0,2086.085,2147.0,161700,2150.0,2053.0
254,2015/09/07,2028.0,2043.674,2062.0,150800,2085.0,2023.0
255,2015/09/08,1983.0,1999.763,2033.0,172400,2044.0,1980.0
256,2015/09/09,2016.0,2008.169,2025.0,316400,2042.0,1991.0
257,2015/09/10,2105.0,2072.956,2010.0,263400,2105.0,2001.0
258,2015/09/11,2189.0,2193.599,2160.0,624500,2233.0,2152.0
259,2015/09/14,2230.0,2232.952,2199.0,276400,2259.0,2190.0
260,2015/09/15,2167.0,2216.336,2247.0,337400,2293.0,2155.0
261,2015/09/16,2180.0,2168.379,2170.0,205900,2196.0,2120.0
262,2015/09/17,2231.0,2217.728,2187.0,127200,2242.0,2175.0
263,2015/09/18,2189.0,2186.847,2194.0,162400,2215.0,2157.0
264,2015/09/24,2192.0,2214.527,2181.0,269600,2252.0,2170.0
265,2015/09/25,2251.0,2233.458,2202.0,237300,2264.0,2197.0
266,2015/09/28,2287.0,2272.766,2271.0,139100,2290.0,2226.0
267,2015/09/29,2208.0,2219.593,2265.0,157400,2265.0,2192.0
268,2015/09/30,2251.0,2257.335,2222.0,139900,2277.0,2222.0
269,2015/10/01,2237.0,2232.875,2266.0,167000,2266.0,2205.0
270,2015/10/02,2229.0,2233.817,2228.0,259400,2276.0,2207.0
271,2015/10/05,2334.0,2319.292,2288.0,247300,2335.0,2279.0
272,2015/10/06,2329.0,2332.936,2350.0,172600,2363.0,2310.0
273,2015/10/07,2348.0,2358.685,2324.0,212100,2393.0,2324.0
274,2015/10/08,2301.0,2313.086,2348.0,252000,2350.0,2292.0
275,2015/10/09,2271.0,2281.52,2308.0,185400,2318.0,2262.0
276,2015/10/13,2269.0,2282.118,2276.0,247400,2315.0,2265.0
277,2015/10/14,2274.0,2277.387,2260.0,102500,2299.0,2255.0
278,2015/10/15,2285.0,2269.346,2263.0,125000,2285.0,2252.0
279,2015/10/16,2302.0,2307.141,2299.0,161100,2330.0,2282.0
280,2015/10/19,2278.0,2285.841,2300.0,171300,2317.0,2270.0
281,2015/10/20,2252.0,2249.094,2272.0,273800,2279.0,2225.0
282,2015/10/21,2270.0,2260.691,2257.0,209100,2284.0,2233.0
283,2015/10/22,2278.0,2289.318,2268.0,178600,2309.0,2266.0
284,2015/10/23,2264.0,2269.978,2290.0,329500,2290.0,2250.0
285,2015/10/26,2236.0,2250.284,2282.0,212500,2283.0,2230.0
286,2015/10/27,2244.0,2261.302,2241.0,253100,2296.0,2234.0
287,2015/10/28,2150.0,2174.645,2244.0,574000,2256.0,2136.0
288,2015/10/29,2170.0,2177.641,2175.0,323800,2201.0,2159.0
289,2015/10/30,2186.0,2180.884,2181.0,290500,2211.0,2159.0
290,2015/11/02,2180.0,2174.293,2183.0,196000,2187.0,2159.0
291,2015/11/04,2185.0,2196.178,2215.0,198200,2234.0,2178.0
292,2015/11/05,2219.0,2218.446,2196.0,195400,2237.0,2184.0
293,2015/11/06,2239.0,2237.393,2230.0,164300,2256.0,2223.0
294,2015/11/09,2243.0,2249.498,2242.0,196000,2263.0,2240.0
295,2015/11/10,2283.0,2269.311,2240.0,202100,2286.0,2229.0
296,2015/11/11,2324.0,2313.621,2285.0,197200,2330.0,2280.0
297,2015/11/12,2308.0,2317.651,2326.0,160600,2344.0,2306.0
298,2015/11/13,2304.0,2306.339,2300.0,125700,2316.0,2291.0
299,2015/11/16,2307.0,2298.636,2280.0,121800,2319.0,2266.0
300,2015/11/17,2303.0,2305.537,2321.0,118900,2321.0,2297.0
301,2015/11/18,2305.0,2311.076,2316.0,115900,2328.0,2299.0
302,2015/11/19,2303.0,2300.646,2316.0,149400,2316.0,2284.0
303,2015/11/20,2326.0,2321.37,2300.0,147700,2337.0,2295.0
304,2015/11/24,2358.0,2354.881,2334.0,164100,2365.0,2330.0
305,2015/11/25,2365.0,2364.657,2365.0,116900,2376.0,2346.0
306,2015/11/26,2406.0,2403.051,2375.0,230200,2419.0,2375.0
307,2015/11/27,2414.0,2417.591,2419.0,193400,2437.0,2404.0
308,2015/11/30,2451.0,2441.979,2420.0,222700,2456.0,2410.0
309,2015/12/01,2425.0,2422.681,2435.0,242700,2449.0,2401.0
310,2015/12/02,2390.0,2398.5,2426.0,187900,2426.0,2388.0
311,2015/12/03,2429.0,2415.263,2390.0,186600,2436.0,2388.0
312,2015/12/04,2395.0,2394.071,2399.0,200600,2410.0,2372.0
313,2015/12/07,2427.0,2433.176,2420.0,157100,2449.0,2411.0
314,2015/12/08,2402.0,2413.589,2420.0,120100,2435.0,2402.0
315,2015/12/09,2417.0,2408.819,2411.0,275900,2427.0,2391.0
316,2015/12/10,2363.0,2372.761,2391.0,249400,2402.0,2350.0
317,2015/12/11,2134.0,2166.605,2213.0,1637600,2235.0,2120.0
318,2015/12/14,2053.0,2045.628,2109.0,945300,2110.0,2018.0
319,2015/12/15,1989.0,2012.155,2080.0,862000,2088.0,1981.0
320,2015/12/16,2027.0,2012.379,2063.0,615900,2063.0,1975.0
321,2015/12/17,2032.0,2044.484,2062.0,374700,2079.0,2025.0
322,2015/12/18,2013.0,2027.278,2025.0,290700,2051.0,2012.0
323,2015/12/21,2018.0,2017.658,2010.0,282700,2038.0,2002.0
324,2015/12/22,2004.0,2007.743,2019.0,243600,2026.0,2000.0
325,2015/12/24,2005.0,2008.331,2024.0,216100,2032.0,2001.0
326,2015/12/25,2017.0,2013.856,2005.0,217300,2030.0,2002.0
327,2015/12/28,2039.0,2030.774,2038.0,221700,2044.0,2009.0
328,2015/12/29,2089.0,2083.071,2050.0,274800,2108.0,2042.0
329,2015/12/30,2094.0,2091.395,2115.0,210900,2119.0,2074.0
330,2016/01/04,2063.0,2072.898,2090.0,250300,2100.0,2052.0
331,2016/01/05,2068.0,2072.493,2063.0,197100,2092.0,2057.0
332,2016/01/06,2070.0,2071.164,2085.0,183700,2093.0,2057.0
333,2016/01/07,2062.0,2064.119,2062.0,176500,2085.0,2055.0
334,2016/01/08,2058.0,2059.94,2060.0,165300,2079.0,2042.0
335,2016/01/12,2014.0,2033.078,2058.0,308700,2062.0,2014.0
336,2016/01/13,2092.0,2074.306,2036.0,312500,2092.0,2036.0
337,2016/01/14,2067.0,2058.698,2070.0,222500,2078.0,2039.0
338,2016/01/15,2059.0,2067.447,2081.0,168100,2088.0,2050.0
339,2016/01/18,2042.0,2029.262,2030.0,171500,2045.0,2014.0
340,2016/01/19,2004.0,2013.826,2029.0,254400,2034.0,2001.0
341,2016/01/20,1958.0,1991.245,2004.0,371900,2007.0,1958.0
342,2016/01/21,1949.0,1957.061,1950.0,226800,1974.0,1949.0
343,2016/01/22,1998.0,1979.983,1986.0,253500,1999.0,1963.0
344,2016/01/25,2067.0,2048.474,2020.0,383900,2071.0,2011.0
345,2016/01/26,2019.0,2042.609,2058.0,689100,2058.0,2016.0
346,2016/01/27,1989.0,1996.523,2009.0,465700,2012.0,1962.0
347,2016/01/28,2005.0,2003.727,1978.0,275600,2014.0,1975.0
348,2016/01/29,2026.0,2008.134,2004.0,270100,2027.0,1982.0
349,2016/02/01,2057.0,2049.579,2036.0,297200,2059.0,2028.0
350,2016/02/02,2032.0,2032.785,2026.0,155100,2050.0,2011.0
351,2016/02/03,1987.0,1984.736,2002.0,165500,2009.0,1974.0
352,2016/02/04,1914.0,1935.57,1975.0,225300,1986.0,1906.0
353,2016/02/05,1919.0,1905.333,1902.0,174500,1928.0,1875.0
354,2016/02/08,1956.0,1942.783,1919.0,135800,1971.0,1918.0
355,2016/02/09,1864.0,1888.185,1910.0,203600,1928.0,1859.0
356,2016/02/10,1803.0,1820.424,1869.0,217700,1901.0,1780.0
357,2016/02/12,1689.0,1713.119,1740.0,211400,1758.0,1677.0
358,2016/02/15,1823.0,1799.15,1784.0,131600,1834.0,1746.0
359,2016/02/16,1856.0,1865.176,1821.0,127200,1898.0,1821.0
360,2016/02/17,1826.0,1832.324,1845.0,104100,1878.0,1803.0
361,2016/02/18,1789.0,1802.756,1843.0,237200,1854.0,1778.0
362,2016/02/19,1792.0,1785.009,1788.0,119800,1803.0,1765.0
363,2016/02/22,1841.0,1823.702,1800.0,130300,1843.0,1794.0
364,2016/02/23,1819.0,1822.552,1845.0,90100,1845.0,1806.0
365,2016/02/24,1839.0,1837.413,1810.0,90500,1856.0,1810.0
366,2016/02/25,1869.0,1859.713,1830.0,97400,1874.0,1825.0
367,2016/02/26,1842.0,1846.584,1873.0,94300,1875.0,1824.0
368,2016/02/29,1850.0,1857.246,1857.0,82900,1883.0,1838.0
369,2016/03/01,1879.0,1871.111,1866.0,98700,1888.0,1846.0
370,2016/03/02,1884.0,1884.736,1899.0,160700,1899.0,1867.0
371,2016/03/03,1898.0,1894.099,1899.0,70000,1909.0,1881.0
372,2016/03/04,1951.0,1932.756,1898.0,108600,1956.0,1884.0
373,2016/03/07,1931.0,1932.167,1953.0,81100,1953.0,1917.0
374,2016/03/08,1947.0,1926.474,1938.0,114700,1952.0,1886.0
375,2016/03/09,1942.0,1946.736,1939.0,221100,1964.0,1935.0
376,2016/03/10,1928.0,1924.609,1921.0,227100,1959.0,1901.0
377,2016/03/11,2095.0,2075.559,2045.0,983900,2110.0,2006.0
378,2016/03/14,2170.0,2154.198,2106.0,582900,2177.0,2106.0
379,2016/03/15,2208.0,2204.432,2170.0,382000,2224.0,2163.0
380,2016/03/16,2277.0,2259.352,2207.0,450100,2277.0,2200.0
381,2016/03/17,2290.0,2293.104,2268.0,314600,2317.0,2264.0
382,2016/03/18,2261.0,2259.07,2272.0,329500,2276.0,2239.0
383,2016/03/22,2337.0,2310.094,2269.0,359700,2337.0,2269.0
384,2016/03/23,2332.0,2330.895,2329.0,179100,2342.0,2303.0
385,2016/03/24,2342.0,2343.207,2331.0,208300,2355.0,2315.0
386,2016/03/25,2331.0,2337.765,2346.0,120700,2350.0,2323.0
387,2016/03/28,2328.0,2316.066,2330.0,170700,2350.0,2296.0
388,2016/03/29,2358.0,2355.655,2328.0,210100,2370.0,2327.0
389,2016/03/30,2388.0,2390.792,2390.0,323300,2410.0,2348.0
390,2016/03/31,2305.0,2336.897,2400.0,195200,2400.0,2305.0
391,2016/04/01,2264.0,2278.699,2270.0,252300,2301.0,2244.0
392,2016/04/04,2287.0,2291.754,2270.0,245600,2327.0,2253.0
393,2016/04/05,2236.0,2255.08,2286.0,135500,2303.0,2233.0
394,2016/04/06,2249.0,2238.814,2225.0,171700,2266.0,2210.0
395,2016/04/07,2243.0,2233.368,2235.0,175100,2256.0,2196.0
396,2016/04/08,2253.0,2231.18,2210.0,296300,2283.0,2175.0
397,2016/04/11,2243.0,2230.139,2251.0,91900,2259.0,2210.0
398,2016/04/12,2233.0,2231.878,2220.0,120900,2257.0,2201.0
399,2016/04/13,2286.0,2283.498,2249.0,96300,2298.0,2249.0
400,2016/04/14,2287.0,2292.4,2318.0,118500,2321.0,2273.0
401,2016/04/15,2260.0,2247.952,2260.0,106700,2275.0,2216.0
402,2016/04/18,2206.0,2211.694,2200.0,163300,2235.0,2191.0
403,2016/04/19,2288.0,2275.839,2235.0,125200,2291.0,2216.0
404,2016/04/20,2259.0,2279.307,2286.0,120300,2317.0,2252.0
405,2016/04/21,2263.0,2271.71,2290.0,102000,2294.0,2255.0
406,2016/04/22,2271.0,2259.211,2267.0,121300,2273.0,2240.0
407,2016/04/25,2283.0,2276.042,2261.0,137100,2289.0,2238.0
408,2016/04/26,2226.0,2243.056,2282.0,163900,2299.0,2215.0
409,2016/04/27,2225.0,2229.422,2231.0,81700,2262.0,2217.0
410,2016/04/28,2224.0,2244.595,2245.0,124300,2283.0,2220.0
411,2016/05/02,2151.0,2152.359,2175.0,140300,2175.0,2137.0
412,2016/05/06,2133.0,2139.165,2158.0,204000,2175.0,2109.0
413,2016/05/09,2137.0,2139.061,2139.0,94100,2153.0,2125.0
414,2016/05/10,2183.0,2168.506,2136.0,117700,2184.0,2136.0
415,2016/05/11,2187.0,2183.709,2195.0,78300,2203.0,2170.0
416,2016/05/12,2168.0,2162.838,2170.0,61700,2177.0,2150.0
417,2016/05/13,2167.0,2171.693,2168.0,72400,2185.0,2149.0
418,2016/05/16,2189.0,2197.522,2160.0,75300,2215.0,2160.0
419,2016/05/17,2199.0,2197.155,2194.0,53700,2211.0,2179.0
420,2016/05/18,2200.0,2200.019,2191.0,68900,2218.0,2184.0
421,2016/05/19,2255.0,2251.076,2218.0,143900,2262.0,2216.0
422,2016/05/20,2310.0,2299.722,2255.0,181800,2316.0,2239.0
423,2016/05/23,2292.0,2282.404,2295.0,100400,2295.0,2264.0
424,2016/05/24,2272.0,2276.898,2288.0,68800,2288.0,2269.0
425,2016/05/25,2317.0,2309.01,2293.0,125100,2325.0,2278.0
426,2016/05/26,2302.0,2315.525,2315.0,112400,2331.0,2296.0
427,2016/05/27,2279.0,2288.667,2305.0,64500,2305.0,2276.0
428,2016/05/30,2295.0,2290.376,2269.0,117100,2304.0,2269.0
429,2016/05/31,2314.0,2304.019,2282.0,98600,2314.0,2276.0
430,2016/06/01,2317.0,2317.831,2286.0,95700,2336.0,2286.0
431,2016/06/02,2320.0,2318.538,2308.0,102300,2333.0,2290.0
432,2016/06/03,2362.0,2349.823,2319.0,157700,2366.0,2319.0
433,2016/06/06,2346.0,2334.372,2319.0,80400,2354.0,2306.0
434,2016/06/07,2355.0,2360.578,2357.0,73700,2371.0,2349.0
435,2016/06/08,2370.0,2363.239,2365.0,46100,2370.0,2347.0
436,2016/06/09,2390.0,2384.816,2370.0,91200,2394.0,2365.0
437,2016/06/10,2389.0,2394.403,2395.0,158500,2400.0,2373.0
438,2016/06/13,2246.0,2258.895,2341.0,406100,2341.0,2245.0
439,2016/06/14,2187.0,2191.294,2240.0,156600,2241.0,2172.0
440,2016/06/15,2243.0,2230.125,2199.0,179500,2259.0,2191.0
441,2016/06/16,2194.0,2225.455,2269.0,115500,2280.0,2193.0
442,2016/06/17,2201.0,2206.672,2221.0,106100,2248.0,2193.0
443,2016/06/20,2192.0,2194.658,2201.0,141400,2210.0,2182.0
444,2016/06/21,2240.0,2222.831,2200.0,63400,2248.0,2186.0
445,2016/06/22,2217.0,2215.124,2218.0,58800,2237.0,2200.0
446,2016/06/23,2246.0,2237.226,2217.0,97300,2251.0,2210.0
447,2016/06/24,2098.0,2140.858,2246.0,157100,2257.0,2064.0
448,2016/06/27,2186.0,2169.346,2115.0,101300,2191.0,2115.0
449,2016/06/28,2227.0,2208.566,2196.0,108000,2244.0,2165.0
450,2016/06/29,2233.0,2234.906,2250.0,78400,2252.0,2217.0
451,2016/06/30,2243.0,2250.41,2250.0,73400,2266.0,2233.0
452,2016/07/01,2280.0,2276.301,2300.0,181700,2301.0,2237.0
453,2016/07/04,2327.0,2322.816,2320.0,207600,2340.0,2313.0
454,2016/07/05,2356.0,2336.356,2320.0,95600,2359.0,2319.0
455,2016/07/06,2373.0,2369.689,2370.0,210500,2392.0,2348.0
456,2016/07/07,2323.0,2332.591,2347.0,83700,2359.0,2313.0
457,2016/07/08,2281.0,2311.778,2350.0,90000,2352.0,2281.0
458,2016/07/11,2353.0,2352.282,2329.0,118900,2371.0,2309.0
459,2016/07/12,2580.0,2541.232,2459.0,701000,2601.0,2459.0
460,2016/07/13,2589.0,2578.619,2594.0,274700,2600.0,2541.0
461,2016/07/14,2589.0,2598.813,2594.0,307000,2618.0,2581.0
462,2016/07/15,2546.0,2558.321,2588.0,195800,2592.0,2532.0
463,2016/07/19,2546.0,2544.805,2543.0,173700,2559.0,2533.0
464,2016/07/20,2549.0,2532.049,2524.0,154500,2550.0,2486.0
465,2016/07/21,2506.0,2523.516,2540.0,164400,2540.0,2502.0
466,2016/07/22,2500.0,2486.321,2481.0,92900,2503.0,2468.0
467,2016/07/25,2536.0,2526.091,2500.0,227300,2548.0,2488.0
468,2016/07/26,2515.0,2521.398,2529.0,446800,2535.0,2505.0
469,2016/07/27,2510.0,2508.342,2494.0,257500,2530.0,2487.0
470,2016/07/28,2488.0,2487.278,2490.0,185500,2500.0,2470.0
471,2016/07/29,2532.0,2505.439,2488.0,188700,2534.0,2466.0
472,2016/08/01,2511.0,2515.818,2530.0,85800,2530.0,2504.0
473,2016/08/02,2519.0,2511.791,2500.0,104900,2530.0,2480.0
474,2016/08/03,2507.0,2516.957,2490.0,149800,2547.0,2479.0
475,2016/08/04,2459.0,2467.097,2515.0,115000,2518.0,2442.0
476,2016/08/05,2421.0,2444.552,2455.0,122200,2484.0,2414.0
477,2016/08/08,2417.0,2415.153,2433.0,52200,2449.0,2396.0
478,2016/08/09,2497.0,2469.673,2417.0,60500,2497.0,2417.0
479,2016/08/10,2538.0,2520.882,2481.0,118200,2543.0,2481.0
480,2016/08/12,2571.0,2561.502,2550.0,101500,2575.0,2525.0
481,2016/08/15,2576.0,2573.253,2552.0,52100,2580.0,2544.0
482,2016/08/16,2515.0,2518.876,2545.0,105400,2547.0,2499.0
483,2016/08/17,2524.0,2513.831,2515.0,49100,2531.0,2496.0
484,2016/08/18,2487.0,2495.669,2501.0,59800,2515.0,2482.0
485,2016/08/19,2450.0,2457.251,2491.0,70100,2495.0,2445.0
486,2016/08/22,2465.0,2460.364,2442.0,66500,2475.0,2441.0
487,2016/08/23,2480.0,2474.418,2465.0,58900,2492.0,2460.0
488,2016/08/24,2539.0,2519.542,2490.0,68600,2541.0,2489.0
489,2016/08/25,2622.0,2603.603,2539.0,221400,2636.0,2531.0
490,2016/08/26,2582.0,2594.104,2622.0,97100,2622.0,2578.0
491,2016/08/29,2607.0,2606.562,2590.0,110000,2627.0,2580.0
492,2016/08/30,2610.0,2600.702,2596.0,85300,2610.0,2580.0
493,2016/08/31,2635.0,2624.331,2609.0,96100,2635.0,2606.0
494,2016/09/01,2677.0,2663.284,2639.0,144900,2683.0,2637.0
495,2016/09/02,2660.0,2679.932,2683.0,122300,2721.0,2643.0
496,2016/09/05,2673.0,2676.118,2684.0,43300,2686.0,2668.0
497,2016/09/06,2708.0,2691.336,2665.0,93600,2715.0,2660.0
498,2016/09/07,2720.0,2705.229,2677.0,92500,2724.0,2655.0
499,2016/09/08,2730.0,2709.473,2711.0,154800,2732.0,2674.0
500,2016/09/09,2709.0,2726.723,2740.0,100900,2757.0,2704.0
501,2016/09/12,2690.0,2695.168,2689.0,67900,2710.0,2665.0
502,2016/09/13,2655.0,2559.035,2490.0,677000,2679.0,2419.0
503,2016/09/14,2707.0,2675.298,2605.0,190100,2724.0,2600.0
504,2016/09/15,2723.0,2722.76,2704.0,127000,2741.0,2690.0
505,2016/09/16,2749.0,2732.307,2724.0,204600,2749.0,2708.0
506,2016/09/20,2700.0,2709.347,2709.0,206500,2728.0,2692.0
507,2016/09/21,2747.0,2719.139,2721.0,149800,2747.0,2683.0
508,2016/09/23,2766.0,2761.376,2750.0,182400,2775.0,2735.0
509,2016/09/26,2803.0,2795.074,2770.0,157900,2812.0,2753.0
510,2016/09/27,2833.0,2812.362,2791.0,130300,2833.0,2773.0
511,2016/09/28,2939.0,2925.678,2852.0,273900,2975.0,2852.0
512,2016/09/29,2908.0,2921.223,2940.0,251600,2951.0,2894.0
513,2016/09/30,2898.0,2896.668,2870.0,143300,2920.0,2863.0
514,2016/10/03,2946.0,2939.129,2910.0,101000,2953.0,2910.0
515,2016/10/04,2978.0,2967.777,2942.0,121500,2982.0,2938.0
516,2016/10/05,2958.0,2964.159,2985.0,77600,2985.0,2951.0
517,2016/10/06,2956.0,2946.083,2950.0,68500,2959.0,2918.0
518,2016/10/07,2943.0,2942.679,2938.0,80100,2962.0,2927.0
519,2016/10/11,3010.0,2992.547,2956.0,149000,3020.0,2956.0
520,2016/10/12,2991.0,2997.693,2979.0,125200,3020.0,2974.0
521,2016/10/13,2999.0,2992.978,2995.0,75900,3005.0,2976.0
522,2016/10/14,3010.0,3014.518,3000.0,126000,3035.0,2997.0
523,2016/10/17,3050.0,3039.449,3010.0,129800,3060.0,3010.0
524,2016/10/18,3080.0,3063.829,3050.0,98600,3090.0,3045.0
525,2016/10/19,3130.0,3120.052,3095.0,153600,3140.0,3075.0
526,2016/10/20,3015.0,3037.232,3100.0,201600,3130.0,2991.0
527,2016/10/21,3015.0,3014.993,3015.0,68300,3025.0,3000.0
528,2016/10/24,3010.0,3007.838,3010.0,68300,3030.0,2997.0
529,2016/10/25,3005.0,3005.221,3010.0,72500,3020.0,2999.0
530,2016/10/26,3005.0,3000.46,3000.0,84500,3015.0,2991.0
531,2016/10/27,3015.0,3018.229,3025.0,48000,3025.0,3000.0
532,2016/10/28,3020.0,3009.958,2999.0,105800,3030.0,2996.0
533,2016/10/31,3010.0,3014.092,3005.0,80400,3040.0,3005.0
534,2016/11/01,2961.0,2964.333,2995.0,200500,2998.0,2924.0
535,2016/11/02,2924.0,2917.145,2923.0,100600,2930.0,2905.0
536,2016/11/04,2893.0,2888.903,2890.0,112800,2915.0,2872.0
537,2016/11/07,2917.0,2908.974,2900.0,83800,2937.0,2889.0
538,2016/11/08,2904.0,2900.533,2920.0,56300,2926.0,2883.0
539,2016/11/09,2845.0,2849.938,2906.0,128500,2939.0,2785.0
540,2016/11/10,2969.0,2954.273,2929.0,120200,2979.0,2915.0
541,2016/11/11,2885.0,2897.605,2955.0,114100,2962.0,2870.0
542,2016/11/14,2857.0,2862.877,2883.0,127900,2910.0,2847.0
543,2016/11/15,2840.0,2842.775,2855.0,85600,2880.0,2830.0
544,2016/11/16,2831.0,2828.455,2860.0,181200,2860.0,2801.0
545,2016/11/17,2842.0,2832.53,2812.0,103000,2844.0,2805.0
546,2016/11/18,2869.0,2861.297,2854.0,137200,2872.0,2848.0
547,2016/11/21,2936.0,2918.778,2869.0,173300,2943.0,2869.0
548,2016/11/22,2949.0,2947.679,2942.0,109700,2965.0,2922.0
549,2016/11/24,2914.0,2937.52,2985.0,101900,2999.0,2910.0
550,2016/11/25,2898.0,2885.341,2898.0,197600,2909.0,2860.0
551,2016/11/28,2948.0,2926.416,2898.0,153800,2954.0,2881.0
552,2016/11/29,2954.0,2949.905,2937.0,93800,2965.0,2926.0
553,2016/11/30,2960.0,2955.375,2954.0,87700,2966.0,2944.0
554,2016/12/01,2929.0,2949.067,2973.0,98400,2973.0,2927.0
555,2016/12/02,2860.0,2879.276,2903.0,149500,2905.0,2857.0
556,2016/12/05,2857.0,2845.901,2850.0,110500,2869.0,2832.0
557,2016/12/06,2834.0,2841.705,2871.0,103800,2874.0,2830.0
558,2016/12/07,2850.0,2845.288,2837.0,79200,2855.0,2831.0
559,2016/12/08,2877.0,2878.383,2885.0,76000,2897.0,2862.0
560,2016/12/09,2888.0,2873.771,2861.0,103900,2889.0,2854.0
561,2016/12/12,2879.0,2885.034,2899.0,96300,2899.0,2871.0
562,2016/12/13,3200.0,3159.483,3200.0,598700,3240.0,3060.0
563,2016/12/14,3210.0,3205.499,3200.0,225300,3240.0,3170.0
564,2016/12/15,3215.0,3199.663,3200.0,136400,3215.0,3180.0
565,2016/12/16,3215.0,3206.635,3215.0,159300,3225.0,3190.0
566,2016/12/19,3345.0,3302.202,3230.0,284700,3345.0,3230.0
567,2016/12/20,3350.0,3351.503,3325.0,151000,3380.0,3320.0
568,2016/12/21,3295.0,3321.85,3370.0,129700,3370.0,3285.0
569,2016/12/22,3280.0,3276.373,3250.0,143100,3310.0,3250.0
570,2016/12/26,3310.0,3312.23,3290.0,178900,3340.0,3285.0
571,2016/12/27,3290.0,3295.301,3295.0,118100,3330.0,3275.0
572,2016/12/28,3300.0,3290.227,3265.0,262000,3325.0,3265.0
573,2016/12/29,3275.0,3291.308,3300.0,194900,3310.0,3260.0
574,2016/12/30,3290.0,3299.001,3310.0,123100,3315.0,3280.0
575,2017/01/04,3380.0,3351.167,3290.0,355300,3415.0,3290.0
576,2017/01/05,3380.0,3383.729,3375.0,157400,3410.0,3360.0
577,2017/01/06,3420.0,3417.434,3400.0,224900,3440.0,3395.0
578,2017/01/10,3375.0,3401.563,3420.0,254000,3430.0,3365.0
579,2017/01/11,3330.0,3344.4,3360.0,177400,3375.0,3330.0
580,2017/01/12,3285.0,3292.634,3305.0,229100,3315.0,3270.0
581,2017/01/13,3355.0,3328.859,3285.0,156900,3355.0,3285.0
582,2017/01/16,3310.0,3318.914,3345.0,131700,3345.0,3300.0
583,2017/01/17,3275.0,3291.387,3300.0,152100,3315.0,3270.0
584,2017/01/18,3295.0,3309.937,3345.0,181300,3355.0,3280.0
585,2017/01/19,3270.0,3283.743,3295.0,184500,3310.0,3265.0
586,2017/01/20,3280.0,3278.376,3270.0,166200,3300.0,3265.0
587,2017/01/23,3290.0,3282.717,3260.0,211100,3315.0,3260.0
588,2017/01/24,3280.0,3282.535,3275.0,217400,3305.0,3265.0
589,2017/01/25,3305.0,3301.516,3305.0,251000,3310.0,3285.0
590,2017/01/26,3225.0,3258.224,3275.0,960600,3290.0,3225.0
591,2017/01/27,3245.0,3210.167,3200.0,946100,3270.0,3165.0
592,2017/01/30,3265.0,3255.635,3250.0,162200,3275.0,3235.0
593,2017/01/31,3255.0,3251.991,3240.0,136100,3265.0,3235.0
594,2017/02/01,3245.0,3230.593,3235.0,117200,3245.0,3210.0
595,2017/02/02,3265.0,3282.957,3260.0,266000,3300.0,3255.0
596,2017/02/03,3235.0,3249.2,3270.0,80600,3275.0,3230.0
597,2017/02/06,3230.0,3237.479,3260.0,71800,3265.0,3225.0
598,2017/02/07,3220.0,3219.027,3220.0,78600,3230.0,3205.0
599,2017/02/08,3240.0,3229.766,3245.0,59900,3245.0,3210.0
600,2017/02/09,3225.0,3222.26,3225.0,77000,3235.0,3210.0
601,2017/02/10,3210.0,3206.779,3230.0,118600,3235.0,3185.0
602,2017/02/13,3260.0,3251.423,3210.0,192500,3270.0,3205.0
603,2017/02/14,3265.0,3267.483,3275.0,157100,3280.0,3250.0
604,2017/02/15,3325.0,3319.44,3300.0,278500,3340.0,3285.0
605,2017/02/16,3115.0,3158.804,3305.0,455700,3315.0,3105.0
606,2017/02/17,3075.0,3060.495,3050.0,390100,3110.0,3010.0
607,2017/02/20,3115.0,3086.689,3070.0,135600,3120.0,3045.0
608,2017/02/21,3115.0,3121.0,3140.0,137500,3150.0,3095.0
609,2017/02/22,3160.0,3151.901,3155.0,118900,3160.0,3130.0
610,2017/02/23,3180.0,3174.011,3160.0,96100,3190.0,3150.0
611,2017/02/24,3250.0,3235.168,3155.0,205900,3265.0,3155.0
612,2017/02/27,3270.0,3263.68,3270.0,118600,3285.0,3230.0
613,2017/02/28,3295.0,3310.973,3280.0,192700,3335.0,3275.0
614,2017/03/01,3325.0,3315.82,3315.0,125000,3340.0,3285.0
615,2017/03/02,3340.0,3332.647,3335.0,92000,3345.0,3315.0
616,2017/03/03,3340.0,3354.006,3335.0,149400,3380.0,3330.0
617,2017/03/06,3330.0,3323.842,3315.0,98900,3350.0,3310.0
618,2017/03/07,3340.0,3339.183,3320.0,99700,3350.0,3320.0
619,2017/03/08,3340.0,3336.826,3345.0,66800,3345.0,3320.0
620,2017/03/09,3295.0,3288.691,3345.0,213200,3345.0,3245.0
621,2017/03/10,3305.0,3292.147,3290.0,188200,3315.0,3270.0
622,2017/03/13,3330.0,3331.881,3320.0,234400,3350.0,3305.0
623,2017/03/14,3605.0,3531.3,3420.0,787100,3605.0,3415.0
624,2017/03/15,3595.0,3603.844,3590.0,241000,3640.0,3580.0
625,2017/03/16,3545.0,3544.832,3525.0,243800,3585.0,3515.0
626,2017/03/17,3495.0,3499.237,3535.0,152600,3550.0,3470.0
627,2017/03/21,3505.0,3503.179,3460.0,116400,3530.0,3460.0
628,2017/03/22,3435.0,3459.478,3450.0,117800,3500.0,3435.0
629,2017/03/23,3405.0,3410.758,3435.0,77800,3445.0,3390.0
630,2017/03/24,3410.0,3414.14,3405.0,129100,3445.0,3390.0
631,2017/03/27,3410.0,3421.488,3430.0,125700,3450.0,3400.0
632,2017/03/28,3435.0,3435.692,3445.0,93200,3465.0,3420.0
633,2017/03/29,3450.0,3453.705,3440.0,112700,3480.0,3435.0
634,2017/03/30,3370.0,3380.964,3430.0,112600,3430.0,3340.0
635,2017/03/31,3305.0,3328.121,3340.0,106700,3360.0,3305.0
636,2017/04/03,3345.0,3349.323,3325.0,90100,3375.0,3315.0
637,2017/04/04,3325.0,3330.374,3310.0,96200,3360.0,3305.0
638,2017/04/05,3300.0,3314.928,3320.0,69700,3350.0,3290.0
639,2017/04/06,3210.0,3235.029,3310.0,87800,3310.0,3205.0
640,2017/04/07,3260.0,3264.258,3260.0,111800,3290.0,3230.0
641,2017/04/10,3230.0,3221.027,3240.0,134400,3270.0,3200.0
642,2017/04/11,3245.0,3251.894,3230.0,113000,3285.0,3225.0
643,2017/04/12,3190.0,3191.587,3225.0,115600,3225.0,3165.0
644,2017/04/13,3255.0,3248.493,3215.0,140000,3275.0,3215.0
645,2017/04/14,3185.0,3208.384,3235.0,81700,3250.0,3180.0
646,2017/04/17,3225.0,3204.336,3170.0,67000,3225.0,3170.0
647,2017/04/18,3205.0,3203.969,3230.0,81000,3235.0,3190.0
648,2017/04/19,3230.0,3246.07,3200.0,94400,3275.0,3200.0
649,2017/04/20,3200.0,3214.542,3270.0,101600,3270.0,3190.0
650,2017/04/21,3200.0,3193.136,3210.0,70800,3215.0,3175.0
651,2017/04/24,3200.0,3203.676,3230.0,71000,3230.0,3190.0
652,2017/04/25,3210.0,3218.783,3210.0,91200,3240.0,3195.0
653,2017/04/26,3225.0,3224.645,3220.0,86000,3245.0,3210.0
654,2017/04/27,3230.0,3236.519,3220.0,66500,3260.0,3220.0
655,2017/04/28,3270.0,3290.275,3285.0,148900,3335.0,3260.0
656,2017/05/01,3270.0,3262.874,3270.0,64900,3280.0,3250.0
657,2017/05/02,3315.0,3332.617,3320.0,134900,3360.0,3310.0
658,2017/05/08,3455.0,3429.365,3385.0,152700,3460.0,3375.0
659,2017/05/09,3415.0,3432.226,3440.0,85600,3460.0,3415.0
660,2017/05/10,3385.0,3398.609,3430.0,98100,3435.0,3385.0
661,2017/05/11,3365.0,3379.723,3390.0,72300,3415.0,3360.0
662,2017/05/12,3365.0,3361.438,3375.0,73000,3375.0,3340.0
663,2017/05/15,3375.0,3372.46,3350.0,74000,3395.0,3350.0
664,2017/05/16,3400.0,3404.695,3395.0,75400,3420.0,3390.0
665,2017/05/17,3465.0,3441.83,3405.0,109300,3465.0,3390.0
666,2017/05/18,3460.0,3432.715,3435.0,146400,3465.0,3385.0
667,2017/05/19,3430.0,3438.496,3450.0,77800,3460.0,3420.0
668,2017/05/22,3400.0,3397.185,3430.0,94300,3430.0,3375.0
669,2017/05/23,3495.0,3471.362,3420.0,114900,3495.0,3410.0
670,2017/05/24,3490.0,3498.796,3505.0,54400,3525.0,3480.0
671,2017/05/25,3495.0,3493.037,3490.0,53500,3505.0,3480.0
672,2017/05/26,3460.0,3466.956,3480.0,47300,3485.0,3455.0
673,2017/05/29,3480.0,3479.479,3460.0,45100,3490.0,3460.0
674,2017/05/30,3535.0,3508.283,3455.0,89400,3535.0,3455.0
675,2017/05/31,3605.0,3592.081,3535.0,163900,3610.0,3530.0
676,2017/06/01,3665.0,3638.295,3565.0,108200,3665.0,3565.0
677,2017/06/02,3665.0,3685.536,3695.0,138900,3725.0,3660.0
678,2017/06/05,3755.0,3735.163,3645.0,125900,3785.0,3620.0
679,2017/06/06,3745.0,3751.184,3715.0,100500,3775.0,3715.0
680,2017/06/07,3765.0,3759.731,3745.0,80000,3780.0,3740.0
681,2017/06/08,3740.0,3759.763,3770.0,93000,3785.0,3740.0
682,2017/06/09,3755.0,3752.258,3715.0,153900,3790.0,3700.0
683,2017/06/12,3650.0,3654.794,3715.0,174700,3715.0,3630.0
684,2017/06/13,3880.0,3879.283,3800.0,344700,3970.0,3780.0
685,2017/06/14,3885.0,3926.02,3950.0,215600,3985.0,3880.0
686,2017/06/15,3970.0,3935.605,3920.0,219900,3980.0,3845.0
687,2017/06/16,4060.0,4038.666,3970.0,234200,4070.0,3970.0
688,2017/06/19,4125.0,4094.903,4060.0,143600,4125.0,4040.0
689,2017/06/20,4130.0,4124.926,4150.0,169300,4160.0,4090.0
690,2017/06/21,4145.0,4149.831,4130.0,171700,4180.0,4100.0
691,2017/06/22,4155.0,4172.361,4185.0,82600,4195.0,4155.0
692,2017/06/23,4090.0,4104.06,4150.0,101600,4155.0,4080.0
693,2017/06/26,4200.0,4164.782,4095.0,87300,4200.0,4090.0
694,2017/06/27,4240.0,4234.511,4250.0,157400,4310.0,4200.0
695,2017/06/28,4180.0,4198.743,4245.0,160300,4245.0,4175.0
696,2017/06/29,4215.0,4180.785,4175.0,142700,4215.0,4140.0
697,2017/06/30,4240.0,4204.742,4200.0,141600,4240.0,4150.0
698,2017/07/03,4165.0,4190.186,4250.0,172200,4270.0,4155.0
699,2017/07/04,4135.0,4148.952,4210.0,142600,4215.0,4115.0
700,2017/07/05,4115.0,4102.475,4090.0,98400,4125.0,4075.0
701,2017/07/06,4180.0,4166.438,4120.0,101500,4185.0,4120.0
702,2017/07/07,4125.0,4122.142,4125.0,115100,4160.0,4100.0
703,2017/07/10,4105.0,4108.144,4100.0,109900,4135.0,4090.0
704,2017/07/11,4070.0,4075.057,4080.0,96700,4095.0,4060.0
705,2017/07/12,4035.0,4052.753,4080.0,129700,4095.0,4020.0
706,2017/07/13,4030.0,4021.931,4035.0,98900,4055.0,4000.0
707,2017/07/14,3980.0,4004.265,4050.0,125800,4050.0,3975.0
708,2017/07/18,3985.0,3969.789,3980.0,132400,3990.0,3940.0
709,2017/07/19,4035.0,4025.605,3995.0,90900,4045.0,3995.0
710,2017/07/20,4030.0,4040.534,4030.0,84200,4070.0,4025.0
711,2017/07/21,4015.0,4003.374,4000.0,89800,4020.0,3985.0
712,2017/07/24,4105.0,4062.354,4000.0,144000,4110.0,4000.0
713,2017/07/25,4105.0,4144.903,4120.0,169600,4195.0,4090.0
714,2017/07/26,4205.0,4212.594,4195.0,421500,4250.0,4175.0
715,2017/07/27,4030.0,4059.262,4120.0,277700,4120.0,4025.0
716,2017/07/28,3980.0,3968.243,4000.0,167900,4005.0,3930.0
717,2017/07/31,3970.0,3964.941,3955.0,117700,3990.0,3940.0
718,2017/08/01,4040.0,4005.897,3980.0,123200,4045.0,3950.0
719,2017/08/02,4085.0,4065.991,4050.0,87800,4090.0,4020.0
720,2017/08/03,4130.0,4117.463,4100.0,109200,4140.0,4085.0
721,2017/08/04,4135.0,4127.272,4085.0,68000,4145.0,4075.0
722,2017/08/07,4165.0,4150.0,4150.0,78500,4170.0,4125.0
723,2017/08/08,4175.0,4164.38,4165.0,58900,4180.0,4145.0
724,2017/08/09,4100.0,4112.354,4165.0,89000,4165.0,4085.0
725,2017/08/10,4235.0,4206.969,4110.0,142200,4235.0,4110.0
726,2017/08/14,4250.0,4247.103,4230.0,146200,4290.0,4170.0
727,2017/08/15,4235.0,4231.902,4245.0,96500,4265.0,4200.0
728,2017/08/16,4285.0,4279.323,4265.0,104900,4300.0,4255.0
729,2017/08/17,4320.0,4313.524,4285.0,74500,4335.0,4265.0
730,2017/08/18,4245.0,4254.957,4250.0,57500,4280.0,4220.0
731,2017/08/21,4170.0,4180.854,4245.0,134100,4245.0,4140.0
732,2017/08/22,4190.0,4184.309,4155.0,64400,4205.0,4145.0
733,2017/08/23,4170.0,4175.252,4215.0,87200,4215.0,4155.0
734,2017/08/24,4305.0,4278.308,4200.0,104600,4310.0,4200.0
735,2017/08/25,4310.0,4300.199,4280.0,55400,4320.0,4275.0
736,2017/08/28,4260.0,4284.1,4310.0,86700,4335.0,4260.0
737,2017/08/29,4315.0,4296.474,4255.0,78700,4330.0,4225.0
738,2017/08/30,4390.0,4395.225,4360.0,102100,4425.0,4360.0
739,2017/08/31,4320.0,4334.957,4380.0,92000,4380.0,4315.0
740,2017/09/01,4470.0,4439.388,4400.0,194500,4475.0,4385.0
741,2017/09/04,4395.0,4413.704,4460.0,79500,4465.0,4390.0
742,2017/09/05,4285.0,4304.628,4390.0,85900,4390.0,4270.0
743,2017/09/06,4295.0,4295.499,4250.0,89200,4325.0,4225.0
744,2017/09/07,4305.0,4315.352,4320.0,68200,4355.0,4285.0
745,2017/09/08,4345.0,4321.985,4280.0,115600,4360.0,4270.0
746,2017/09/11,4365.0,4397.756,4450.0,169800,4465.0,4360.0
747,2017/09/12,3940.0,3983.194,4060.0,826800,4070.0,3925.0
748,2017/09/13,3905.0,3914.943,3965.0,324700,3975.0,3900.0
749,2017/09/14,3900.0,3864.135,3920.0,455400,3925.0,3800.0
750,2017/09/15,3830.0,3831.382,3880.0,293000,3885.0,3805.0
751,2017/09/19,3850.0,3819.948,3855.0,209800,3855.0,3790.0
752,2017/09/20,3800.0,3827.088,3850.0,145100,3860.0,3800.0
753,2017/09/21,3975.0,3947.791,3870.0,380100,3980.0,3865.0
754,2017/09/22,3900.0,3926.051,3975.0,243600,3995.0,3885.0
755,2017/09/25,3885.0,3881.943,3920.0,138700,3920.0,3860.0
756,2017/09/26,3905.0,3905.988,3925.0,193400,3955.0,3880.0
757,2017/09/27,3905.0,3891.125,3910.0,106700,3910.0,3870.0
758,2017/09/28,3970.0,3947.103,3920.0,134600,3970.0,3910.0
759,2017/09/29,3965.0,3985.968,3975.0,197800,4025.0,3960.0
760,2017/10/02,3955.0,3974.231,3970.0,108600,4000.0,3950.0
761,2017/10/03,3915.0,3925.046,3970.0,109500,3970.0,3905.0
762,2017/10/04,4000.0,3990.362,3985.0,156300,4020.0,3960.0
763,2017/10/05,3955.0,3959.764,3975.0,107900,4000.0,3940.0
764,2017/10/06,3915.0,3919.403,3975.0,137400,3975.0,3900.0
765,2017/10/10,3980.0,3960.157,3905.0,92100,3980.0,3905.0
766,2017/10/11,4030.0,4008.64,3960.0,115400,4030.0,3960.0
767,2017/10/12,4130.0,4117.862,4065.0,211900,4145.0,4065.0
768,2017/10/13,4160.0,4167.468,4150.0,147500,4195.0,4140.0
769,2017/10/16,4200.0,4206.747,4200.0,115600,4230.0,4185.0
770,2017/10/17,4170.0,4167.007,4180.0,108100,4190.0,4150.0
771,2017/10/18,4190.0,4184.774,4155.0,99700,4205.0,4155.0
772,2017/10/19,4140.0,4159.383,4190.0,87500,4190.0,4140.0
773,2017/10/20,4130.0,4144.499,4135.0,105800,4175.0,4120.0
774,2017/10/23,4150.0,4136.345,4130.0,77300,4155.0,4095.0
775,2017/10/24,4150.0,4158.634,4130.0,101000,4185.0,4130.0
776,2017/10/25,4160.0,4161.689,4170.0,112500,4190.0,4135.0
777,2017/10/26,4150.0,4191.015,4180.0,103900,4250.0,4150.0
778,2017/10/27,4165.0,4174.84,4180.0,71700,4215.0,4160.0
779,2017/10/30,4145.0,4133.949,4150.0,135600,4155.0,4105.0
780,2017/10/31,4170.0,4157.013,4140.0,87200,4180.0,4110.0
781,2017/11/01,4225.0,4225.264,4190.0,122900,4250.0,4185.0
782,2017/11/02,4225.0,4237.994,4255.0,70300,4270.0,4220.0
783,2017/11/06,4215.0,4221.898,4240.0,64000,4245.0,4205.0
784,2017/11/07,4250.0,4212.589,4160.0,95800,4250.0,4155.0
785,2017/11/08,4240.0,4237.995,4240.0,75300,4265.0,4220.0
786,2017/11/09,4225.0,4264.162,4245.0,177100,4320.0,4200.0
787,2017/11/10,4230.0,4197.687,4180.0,76300,4230.0,4165.0
788,2017/11/13,4205.0,4214.94,4250.0,74900,4255.0,4200.0
789,2017/11/14,4215.0,4229.401,4235.0,81000,4255.0,4205.0
790,2017/11/15,4135.0,4162.476,4205.0,93300,4220.0,4130.0
791,2017/11/16,4280.0,4242.55,4130.0,135900,4305.0,4120.0
792,2017/11/17,4260.0,4300.51,4340.0,100100,4355.0,4255.0
793,2017/11/20,4265.0,4248.215,4240.0,88500,4280.0,4210.0
794,2017/11/21,4305.0,4303.968,4285.0,75100,4325.0,4275.0
795,2017/11/22,4440.0,4450.468,4395.0,266300,4500.0,4385.0
796,2017/11/24,4550.0,4502.379,4440.0,177000,4555.0,4410.0
797,2017/11/27,4530.0,4541.312,4580.0,82300,4580.0,4510.0
798,2017/11/28,4605.0,4577.938,4570.0,77100,4605.0,4520.0
799,2017/11/29,4705.0,4677.19,4625.0,119200,4705.0,4625.0
800,2017/11/30,4715.0,4688.018,4740.0,127900,4740.0,4615.0
801,2017/12/01,4765.0,4747.909,4705.0,106400,4780.0,4705.0
802,2017/12/04,4720.0,4761.06,4775.0,92900,4815.0,4720.0
803,2017/12/05,4760.0,4736.381,4710.0,70600,4770.0,4700.0
804,2017/12/06,4735.0,4766.456,4780.0,107800,4830.0,4725.0
805,2017/12/07,4840.0,4813.742,4740.0,88600,4850.0,4740.0
806,2017/12/08,4865.0,4844.513,4815.0,160300,4880.0,4815.0
807,2017/12/11,4845.0,4834.894,4835.0,118200,4855.0,4805.0
808,2017/12/12,5550.0,5525.978,5460.0,794400,5550.0,5400.0
809,2017/12/13,5580.0,5599.895,5550.0,720700,5850.0,5450.0
810,2017/12/14,5580.0,5541.009,5530.0,170500,5580.0,5510.0
811,2017/12/15,5540.0,5535.666,5580.0,159900,5580.0,5510.0
812,2017/12/18,5560.0,5556.111,5500.0,203400,5630.0,5460.0
813,2017/12/19,5610.0,5593.386,5530.0,114300,5650.0,5500.0
814,2017/12/20,5620.0,5626.658,5620.0,112500,5670.0,5560.0
815,2017/12/21,5650.0,5623.907,5600.0,84200,5670.0,5580.0
816,2017/12/22,5680.0,5661.585,5650.0,75100,5680.0,5620.0
817,2017/12/25,5750.0,5732.542,5670.0,90100,5800.0,5660.0
818,2017/12/26,5740.0,5761.493,5780.0,100500,5790.0,5720.0
819,2017/12/27,5840.0,5758.724,5670.0,221800,5840.0,5670.0
820,2017/12/28,5680.0,5751.832,5810.0,207400,5830.0,5670.0
821,2017/12/29,5750.0,5708.061,5680.0,158800,5760.0,5640.0
822,2018/01/04,5750.0,5734.034,5760.0,203500,5760.0,5680.0
823,2018/01/05,5760.0,5764.284,5770.0,166900,5780.0,5730.0
824,2018/01/09,5810.0,5811.273,5790.0,186900,5860.0,5790.0
825,2018/01/10,5860.0,5831.335,5850.0,176000,5870.0,5780.0
826,2018/01/11,5850.0,5845.481,5860.0,111300,5870.0,5820.0
827,2018/01/12,5840.0,5853.408,5870.0,111800,5870.0,5830.0
828,2018/01/15,5920.0,5893.051,5870.0,172400,5950.0,5860.0
829,2018/01/16,6050.0,6021.005,5920.0,186100,6100.0,5920.0
830,2018/01/17,6090.0,6089.431,6050.0,200500,6150.0,6050.0
831,2018/01/18,5960.0,6037.749,6150.0,212800,6160.0,5950.0
832,2018/01/19,5930.0,5943.602,5940.0,181300,6000.0,5920.0
833,2018/01/22,5860.0,5909.798,5960.0,317200,5960.0,5830.0
834,2018/01/23,5960.0,5884.808,5860.0,493100,5980.0,5860.0
835,2018/01/24,5920.0,5897.876,5880.0,394100,5960.0,5880.0
836,2018/01/25,5860.0,5892.412,5900.0,398900,5910.0,5860.0
837,2018/01/26,5860.0,5868.713,5850.0,502000,5940.0,5850.0
838,2018/01/29,5800.0,5884.649,5910.0,701300,5920.0,5800.0
839,2018/01/30,5780.0,5797.13,5790.0,160300,5850.0,5760.0
840,2018/01/31,5800.0,5803.16,5800.0,159500,5850.0,5750.0
841,2018/02/01,5910.0,5874.924,5850.0,158600,5920.0,5810.0
842,2018/02/02,6000.0,5950.224,5920.0,138600,6000.0,5860.0
843,2018/02/05,5850.0,5881.601,5910.0,112400,5960.0,5850.0
844,2018/02/06,5440.0,5478.013,5600.0,214400,5620.0,5340.0
845,2018/02/07,5520.0,5648.424,5640.0,171900,5800.0,5520.0
846,2018/02/08,5670.0,5656.305,5610.0,139100,5720.0,5570.0
847,2018/02/09,5600.0,5533.479,5480.0,126200,5620.0,5420.0
848,2018/02/13,5700.0,5706.484,5680.0,137100,5780.0,5630.0
849,2018/02/14,5670.0,5661.744,5710.0,96900,5750.0,5590.0
850,2018/02/15,5640.0,5647.828,5700.0,87000,5710.0,5590.0
851,2018/02/16,5910.0,5845.914,5690.0,141700,5920.0,5670.0
852,2018/02/19,5980.0,5967.617,5950.0,98200,6010.0,5910.0
853,2018/02/20,6020.0,5972.516,5960.0,108500,6030.0,5900.0
854,2018/02/21,6060.0,6026.81,5980.0,118500,6070.0,5960.0
855,2018/02/22,6080.0,6044.773,6010.0,125300,6090.0,5950.0
856,2018/02/23,6040.0,6006.7,6070.0,138200,6070.0,5930.0
857,2018/02/26,6080.0,6065.694,6020.0,99400,6100.0,6010.0
858,2018/02/27,6080.0,6077.173,6100.0,85600,6120.0,6050.0
859,2018/02/28,6190.0,6188.874,6070.0,190100,6270.0,6050.0
860,2018/03/01,5890.0,5944.711,6150.0,193600,6150.0,5880.0
861,2018/03/02,5920.0,5909.822,5780.0,162800,6000.0,5780.0
862,2018/03/05,5830.0,5859.85,5870.0,93600,5960.0,5800.0
863,2018/03/06,6090.0,6047.25,5930.0,146900,6120.0,5880.0
864,2018/03/07,6030.0,6023.47,6050.0,139200,6100.0,5980.0
865,2018/03/08,5860.0,5850.012,5940.0,165500,5950.0,5800.0
866,2018/03/09,5830.0,5874.844,5870.0,156700,5980.0,5800.0
867,2018/03/12,5860.0,5830.492,5880.0,154600,5920.0,5760.0
868,2018/03/13,5360.0,5363.976,5300.0,955200,5510.0,5130.0
869,2018/03/14,5300.0,5302.316,5260.0,425300,5390.0,5220.0
870,2018/03/15,5450.0,5356.171,5260.0,408700,5480.0,5180.0
871,2018/03/16,5220.0,5252.241,5380.0,712200,5390.0,5210.0
872,2018/03/19,5080.0,5103.01,5180.0,318600,5180.0,5040.0
873,2018/03/20,5000.0,4976.569,5070.0,297600,5080.0,4915.0
874,2018/03/22,5080.0,5063.512,4980.0,113200,5110.0,4980.0
875,2018/03/23,4920.0,4951.687,4920.0,217500,5020.0,4910.0
876,2018/03/26,4995.0,4937.284,4890.0,151500,4995.0,4865.0
877,2018/03/27,5070.0,5064.56,5040.0,141000,5100.0,5030.0
878,2018/03/28,5220.0,5190.943,5070.0,211100,5250.0,5060.0
879,2018/03/29,5270.0,5248.868,5230.0,121000,5280.0,5200.0
880,2018/03/30,5300.0,5272.464,5270.0,138800,5330.0,5190.0
881,2018/04/02,5250.0,5279.832,5300.0,89300,5330.0,5250.0
882,2018/04/03,5420.0,5376.711,5200.0,209800,5450.0,5190.0
883,2018/04/04,5460.0,5423.049,5420.0,171200,5480.0,5330.0
884,2018/04/05,5610.0,5559.453,5490.0,237800,5640.0,5450.0
885,2018/04/06,5670.0,5661.168,5660.0,242300,5710.0,5580.0
886,2018/04/09,5740.0,5719.371,5670.0,251300,5760.0,5640.0
887,2018/04/10,5510.0,5655.897,5770.0,226400,5830.0,5510.0
888,2018/04/11,5250.0,5334.963,5510.0,245400,5520.0,5250.0
889,2018/04/12,5480.0,5441.665,5250.0,239600,5490.0,5250.0
890,2018/04/13,5320.0,5328.393,5460.0,204700,5460.0,5260.0
891,2018/04/16,5310.0,5311.26,5310.0,165900,5360.0,5260.0
892,2018/04/17,5340.0,5330.041,5340.0,98500,5360.0,5270.0
893,2018/04/18,5360.0,5369.296,5300.0,130700,5430.0,5300.0
894,2018/04/19,5160.0,5198.032,5310.0,197700,5340.0,5120.0
895,2018/04/20,5170.0,5183.815,5160.0,99600,5230.0,5160.0
896,2018/04/23,5180.0,5177.934,5230.0,94400,5230.0,5120.0
897,2018/04/24,5230.0,5213.638,5220.0,75600,5240.0,5180.0
898,2018/04/25,5140.0,5159.772,5180.0,113900,5210.0,5130.0
899,2018/04/26,5190.0,5154.348,5210.0,404300,5210.0,5050.0
900,2018/04/27,5270.0,5240.398,5190.0,110500,5270.0,5170.0
901,2018/05/01,5340.0,5309.613,5310.0,98300,5360.0,5240.0
902,2018/05/02,5430.0,5384.006,5390.0,129300,5450.0,5320.0
903,2018/05/07,5660.0,5605.567,5470.0,173000,5670.0,5450.0
904,2018/05/08,5650.0,5662.551,5680.0,166600,5730.0,5610.0
905,2018/05/09,5650.0,5661.181,5690.0,88900,5710.0,5630.0
906,2018/05/10,5660.0,5628.764,5660.0,63100,5670.0,5580.0
907,2018/05/11,5660.0,5662.054,5640.0,81300,5710.0,5630.0
908,2018/05/14,5800.0,5793.086,5760.0,103700,5850.0,5750.0
909,2018/05/15,5790.0,5791.376,5810.0,67600,5820.0,5750.0
910,2018/05/16,5910.0,5897.414,5810.0,183300,5940.0,5800.0
911,2018/05/17,5890.0,5893.447,5890.0,61500,5930.0,5860.0
912,2018/05/18,6030.0,5987.059,5940.0,116300,6030.0,5920.0
913,2018/05/21,6040.0,6043.167,6000.0,85900,6090.0,6000.0
914,2018/05/22,6000.0,5990.074,6000.0,67700,6020.0,5960.0
915,2018/05/23,6060.0,6039.347,6000.0,124000,6080.0,5970.0
916,2018/05/24,6080.0,6083.088,6060.0,107500,6130.0,6050.0
917,2018/05/25,6170.0,6125.607,6040.0,135900,6180.0,6010.0
918,2018/05/28,6100.0,6105.843,6120.0,83000,6150.0,6070.0
919,2018/05/29,6150.0,6136.914,6100.0,84900,6170.0,6070.0
920,2018/05/30,6030.0,6073.448,6080.0,99200,6140.0,6020.0
921,2018/05/31,6190.0,6168.718,6060.0,142000,6220.0,6050.0
922,2018/06/01,6150.0,6232.406,6200.0,240200,6370.0,6150.0
923,2018/06/04,6120.0,6144.32,6200.0,122700,6240.0,6080.0
924,2018/06/05,6300.0,6234.045,6180.0,133500,6300.0,6130.0
925,2018/06/06,6210.0,6212.205,6330.0,110200,6330.0,6160.0
926,2018/06/07,6230.0,6194.658,6210.0,65700,6240.0,6140.0
927,2018/06/08,6310.0,6275.609,6220.0,119100,6340.0,6220.0
928,2018/06/11,6220.0,6205.101,6220.0,143700,6260.0,6130.0
929,2018/06/12,5230.0,5264.464,5370.0,1070800,5380.0,5220.0
930,2018/06/13,5330.0,5296.991,5220.0,839700,5470.0,5150.0
931,2018/06/14,5010.0,5057.387,5270.0,696500,5270.0,4980.0
932,2018/06/15,4990.0,4965.835,5000.0,453800,5010.0,4910.0
933,2018/06/18,5030.0,5012.429,4995.0,167800,5050.0,4970.0
934,2018/06/19,4785.0,4836.843,5020.0,514200,5030.0,4740.0
935,2018/06/20,4890.0,4877.286,4815.0,248700,4915.0,4805.0
936,2018/06/21,5100.0,5108.142,4920.0,441000,5200.0,4920.0
937,2018/06/22,5150.0,5130.473,5060.0,209200,5180.0,5060.0
938,2018/06/25,5100.0,5153.392,5170.0,197800,5200.0,5100.0
939,2018/06/26,5180.0,5119.856,5050.0,229100,5180.0,5040.0
940,2018/06/27,5200.0,5210.102,5200.0,157300,5280.0,5160.0
941,2018/06/28,5150.0,5137.736,5150.0,198300,5200.0,5080.0
942,2018/06/29,5270.0,5204.337,5100.0,258000,5290.0,5100.0
943,2018/07/02,5110.0,5181.081,5310.0,188800,5320.0,5100.0
944,2018/07/03,5140.0,5137.073,5100.0,188600,5240.0,5100.0
945,2018/07/04,5250.0,5206.957,5120.0,135700,5250.0,5120.0
946,2018/07/05,5140.0,5168.455,5270.0,135300,5270.0,5110.0
947,2018/07/06,5040.0,5039.628,5180.0,317100,5190.0,4970.0
948,2018/07/09,5120.0,5095.953,4985.0,180400,5160.0,4970.0
949,2018/07/10,5030.0,5057.052,5130.0,205200,5150.0,5010.0
950,2018/07/11,5010.0,4988.198,5000.0,163400,5030.0,4940.0
951,2018/07/12,5110.0,5082.05,5040.0,112200,5120.0,5020.0
952,2018/07/13,5160.0,5156.183,5080.0,149600,5210.0,5070.0
953,2018/07/17,5220.0,5200.751,5190.0,103900,5230.0,5160.0
954,2018/07/18,5080.0,5133.199,5240.0,131000,5250.0,5070.0
955,2018/07/19,5030.0,5082.194,5100.0,175900,5200.0,5020.0
956,2018/07/20,5020.0,5010.531,5030.0,114900,5080.0,4965.0
957,2018/07/23,4985.0,5003.999,5040.0,104900,5050.0,4960.0
958,2018/07/24,4980.0,4982.276,5050.0,121500,5050.0,4955.0
959,2018/07/25,5000.0,4969.76,4980.0,110300,5010.0,4920.0
960,2018/07/26,5120.0,5088.682,5050.0,269400,5130.0,5020.0
961,2018/07/27,5060.0,5020.522,5050.0,157100,5060.0,4955.0
962,2018/07/30,5030.0,4994.603,5040.0,149700,5040.0,4950.0
963,2018/07/31,4955.0,4968.088,4985.0,128400,5020.0,4950.0
964,2018/08/01,4960.0,4956.534,4970.0,94500,5000.0,4925.0
965,2018/08/02,4935.0,4951.032,4925.0,114400,4990.0,4915.0
966,2018/08/03,4905.0,4935.687,4965.0,94600,4990.0,4905.0
967,2018/08/06,4915.0,4934.751,4905.0,98500,4995.0,4900.0
968,2018/08/07,4880.0,4855.994,4875.0,79500,4890.0,4810.0
969,2018/08/08,4840.0,4874.475,4865.0,82800,4910.0,4840.0
970,2018/08/09,4895.0,4886.418,4845.0,74400,4920.0,4820.0
971,2018/08/10,4855.0,4883.447,4890.0,61800,4925.0,4850.0
972,2018/08/13,4710.0,4758.148,4810.0,89100,4840.0,4705.0
973,2018/08/14,4750.0,4735.93,4720.0,61300,4760.0,4710.0
974,2018/08/15,4645.0,4673.077,4710.0,98000,4735.0,4635.0
975,2018/08/16,4400.0,4429.31,4500.0,198600,4505.0,4380.0
976,2018/08/17,4530.0,4511.744,4430.0,90600,4550.0,4430.0
977,2018/08/20,4560.0,4560.497,4530.0,82500,4595.0,4530.0
978,2018/08/21,4475.0,4474.71,4490.0,137800,4535.0,4430.0
979,2018/08/22,4680.0,4669.605,4545.0,187400,4725.0,4545.0
980,2018/08/23,4710.0,4690.812,4670.0,129900,4715.0,4610.0
981,2018/08/24,4650.0,4670.611,4725.0,117000,4735.0,4640.0
982,2018/08/27,4715.0,4704.022,4710.0,91500,4730.0,4670.0
983,2018/08/28,4715.0,4683.666,4740.0,110200,4740.0,4625.0
984,2018/08/29,4825.0,4795.306,4730.0,112900,4840.0,4720.0
985,2018/08/30,4635.0,4654.908,4765.0,255200,4765.0,4600.0
986,2018/08/31,4780.0,4737.682,4635.0,172800,4795.0,4630.0
987,2018/09/03,4755.0,4764.296,4785.0,65300,4805.0,4745.0
988,2018/09/04,4875.0,4861.809,4750.0,187400,4915.0,4745.0
989,2018/09/05,4800.0,4814.466,4855.0,108600,4910.0,4760.0
990,2018/09/06,4805.0,4799.369,4750.0,95900,4840.0,4715.0
991,2018/09/07,4840.0,4829.374,4795.0,99800,4870.0,4785.0
992,2018/09/10,4780.0,4796.363,4800.0,123600,4850.0,4770.0
993,2018/09/11,4810.0,4823.669,4780.0,172100,4915.0,4750.0
994,2018/09/12,4110.0,4142.777,4250.0,469400,4250.0,4110.0
995,2018/09/13,3865.0,3808.035,3830.0,913800,3955.0,3715.0
996,2018/09/14,3840.0,3867.912,3900.0,374700,3930.0,3815.0
997,2018/09/18,3900.0,3881.764,3840.0,206600,3930.0,3805.0
998,2018/09/19,3985.0,3983.093,4000.0,224200,4025.0,3935.0
999,2018/09/20,4040.0,4038.122,4015.0,170700,4085.0,3950.0
1000,2018/09/21,3955.0,3974.833,4040.0,286700,4040.0,3955.0
1001,2018/09/25,4065.0,4061.09,3970.0,211400,4125.0,3970.0
1002,2018/09/26,4185.0,4149.358,4080.0,154300,4195.0,4080.0
1003,2018/09/27,4180.0,4198.369,4195.0,144700,4255.0,4155.0
1004,2018/09/28,4205.0,4210.986,4215.0,123700,4265.0,4195.0
1005,2018/10/01,4185.0,4214.005,4220.0,158800,4265.0,4180.0
1006,2018/10/02,4110.0,4139.563,4180.0,178400,4190.0,4105.0
1007,2018/10/03,4070.0,4095.336,4110.0,147400,4170.0,4055.0
1008,2018/10/04,4020.0,4029.254,4060.0,119300,4085.0,4000.0
1009,2018/10/05,4030.0,4037.027,4015.0,162800,4080.0,3975.0
1010,2018/10/09,3775.0,3818.955,3925.0,288000,3955.0,3770.0
1011,2018/10/10,3740.0,3761.886,3810.0,238400,3855.0,3710.0
1012,2018/10/11,3655.0,3625.328,3550.0,273300,3695.0,3530.0
1013,2018/10/12,3685.0,3655.16,3660.0,215900,3700.0,3610.0
1014,2018/10/15,3590.0,3631.496,3710.0,176200,3720.0,3590.0
1015,2018/10/16,3530.0,3550.958,3590.0,259400,3620.0,3510.0
1016,2018/10/17,3660.0,3655.399,3600.0,261700,3695.0,3600.0
1017,2018/10/18,3685.0,3691.74,3660.0,381100,3740.0,3645.0
1018,2018/10/19,3700.0,3679.906,3615.0,373800,3725.0,3615.0
1019,2018/10/22,3865.0,3810.252,3675.0,315700,3880.0,3675.0
1020,2018/10/23,3800.0,3790.751,3820.0,280400,3835.0,3725.0
1021,2018/10/24,4500.0,4500.0,4500.0,52400,4500.0,4500.0
1022,2018/10/25,5200.0,5200.0,5200.0,58400,5200.0,5200.0
1023,2018/10/26,5880.0,5875.095,5880.0,3014100,5890.0,5870.0
1024,2018/10/29,5860.0,5867.259,5880.0,1621100,5880.0,5850.0
1025,2018/10/30,5840.0,5851.713,5860.0,1242300,5870.0,5840.0
1026,2018/10/31,5860.0,5846.171,5850.0,1251300,5860.0,5840.0
1027,2018/11/01,5850.0,5849.405,5850.0,433300,5860.0,5840.0
1028,2018/11/02,5850.0,5851.277,5850.0,468300,5860.0,5850.0
1029,2018/11/05,5860.0,5855.624,5850.0,452900,5860.0,5850.0
1030,2018/11/06,5860.0,5858.541,5860.0,449700,5870.0,5850.0
1031,2018/11/07,5860.0,5861.783,5860.0,347700,5870.0,5850.0
1032,2018/11/08,5860.0,5864.934,5870.0,227200,5870.0,5860.0
1033,2018/11/09,5860.0,5865.72,5870.0,191100,5870.0,5860.0
1034,2018/11/12,5860.0,5865.486,5870.0,179000,5870.0,5860.0
1035,2018/11/13,5870.0,5866.748,5870.0,179900,5870.0,5860.0
1036,2018/11/14,5870.0,5867.722,5860.0,237500,5870.0,5860.0
1037,2018/11/15,5870.0,5868.792,5870.0,441100,5870.0,5860.0
1038,2018/11/16,5870.0,5867.442,5860.0,146200,5870.0,5860.0
1039,2018/11/19,5870.0,5865.598,5860.0,113800,5870.0,5860.0
1040,2018/11/20,5860.0,5865.382,5870.0,213300,5870.0,5860.0
1041,2018/11/21,5860.0,5861.138,5860.0,86100,5870.0,5860.0
1042,2018/11/22,5870.0,5863.624,5860.0,136300,5870.0,5860.0
1043,2018/11/26,5870.0,5863.306,5860.0,96800,5870.0,5860.0
1044,2018/11/27,5870.0,5868.65,5870.0,159200,5870.0,5860.0
1045,2018/11/28,5870.0,5865.108,5860.0,106900,5870.0,5860.0
1046,2018/11/29,5870.0,5867.769,5860.0,119200,5870.0,5860.0
1047,2018/11/30,5860.0,5866.77,5860.0,315200,5870.0,5860.0
1048,2018/12/03,5870.0,5874.275,5870.0,932500,5890.0,5860.0
1049,2018/12/04,5870.0,5875.987,5880.0,91700,5880.0,5870.0
1050,2018/12/05,5880.0,5873.943,5870.0,66700,5880.0,5870.0
1051,2018/12/06,5870.0,5870.172,5870.0,198100,5880.0,5870.0
1052,2018/12/07,5870.0,5871.466,5870.0,472600,5880.0,5870.0
1053,2018/12/10,5870.0,5870.208,5870.0,196700,5880.0,5870.0
1054,2018/12/11,5870.0,5870.857,5870.0,170300,5880.0,5870.0
1055,2018/12/12,5870.0,5871.045,5870.0,126300,5880.0,5870.0
1056,2018/12/13,5870.0,5870.329,5870.0,136900,5880.0,5870.0
1057,2018/12/14,5870.0,5875.884,5880.0,170300,5880.0,5870.0
1058,2018/12/17,5870.0,5871.755,5870.0,283200,5880.0,5870.0
1059,2018/12/18,5870.0,5874.653,5880.0,306700,5880.0,5870.0
1060,2018/12/19,5870.0,5876.042,5880.0,231400,5880.0,5870.0
1061,2018/12/20,5870.0,5877.838,5880.0,321900,5890.0,5870.0
1062,2018/12/21,5870.0,5871.339,5870.0,227800,5880.0,5870.0
1063,2018/12/25,5870.0,5872.251,5870.0,160400,5880.0,5870.0
1064,2018/12/26,5870.0,5871.861,5870.0,112300,5880.0,5870.0
1065,2018/12/27,5880.0,5876.818,5880.0,130100,5880.0,5870.0
1066,2018/12/28,5880.0,5881.655,5880.0,261000,5890.0,5870.0
1067,2019/01/04,5880.0,5882.91,5880.0,196900,5890.0,5880.0
1068,2019/01/07,5880.0,5884.714,5890.0,169300,5890.0,5880.0
1069,2019/01/08,5860.0,5864.898,5860.0,167200,5880.0,5860.0
1070,2019/01/09,5870.0,5870.135,5860.0,162700,5880.0,5860.0
1071,2019/01/10,5870.0,5872.221,5870.0,136900,5890.0,5870.0
1072,2019/01/11,5870.0,5870.867,5870.0,36900,5880.0,5870.0
1073,2019/01/15,5900.0,5887.758,5880.0,153900,5900.0,5880.0
1074,2019/01/16,5890.0,5889.511,5890.0,100100,5900.0,5880.0
1075,2019/01/17,5880.0,5882.984,5880.0,42900,5890.0,5880.0
1076,2019/01/18,5890.0,5885.823,5880.0,57700,5890.0,5880.0
1077,2019/01/21,5880.0,5880.409,5880.0,51300,5890.0,5880.0
1078,2019/01/22,5880.0,5880.442,5880.0,74700,5890.0,5880.0
1079,2019/01/23,5880.0,5880.863,5880.0,59100,5890.0,5880.0
1080,2019/01/24,5880.0,5881.411,5880.0,102800,5890.0,5880.0
1081,2019/01/25,5880.0,5881.6,5880.0,55000,5890.0,5880.0
1082,2019/01/28,5880.0,5881.027,5880.0,253100,5890.0,5880.0
1083,2019/01/29,5890.0,5881.862,5880.0,372100,5890.0,5880.0
1084,2019/01/30,5880.0,5880.613,5880.0,742600,5890.0,5880.0
1085,2019/01/31,5880.0,5881.3,5880.0,257800,5890.0,5880.0
1086,2019/02/01,5880.0,5882.68,5880.0,38800,5890.0,5880.0
1087,2019/02/04,5890.0,5885.243,5880.0,20600,5890.0,5880.0
1088,2019/02/05,5870.0,5878.256,5880.0,428200,5890.0,5870.0
1089,2019/02/06,5880.0,5881.404,5880.0,104700,5890.0,5880.0
1090,2019/02/07,5880.0,5881.145,5880.0,62900,5890.0,5880.0
1091,2019/02/08,5880.0,5880.169,5880.0,35500,5890.0,5880.0
1092,2019/02/12,5880.0,5883.532,5880.0,55500,5890.0,5880.0
1093,2019/02/13,5880.0,5881.149,5880.0,23500,5890.0,5880.0
1094,2019/02/14,5880.0,5882.93,5880.0,15700,5890.0,5880.0
1095,2019/02/15,5880.0,5882.88,5880.0,12500,5890.0,5880.0
1096,2019/02/18,5880.0,5883.396,5880.0,26800,5890.0,5880.0
1097,2019/02/19,5880.0,5883.827,5890.0,8100,5890.0,5880.0
1098,2019/02/20,5880.0,5881.802,5890.0,94900,5890.0,5880.0
1099,2019/02/21,5880.0,5880.61,5880.0,223000,5890.0,5880.0
1100,2019/02/22,5880.0,5879.967,5880.0,243700,5890.0,5870.0
1101,2019/02/25,5880.0,5883.776,5890.0,19600,5890.0,5880.0
1102,2019/02/26,5890.0,5888.093,5880.0,21500,5890.0,5880.0
1103,2019/02/27,5880.0,5881.69,5880.0,121300,5890.0,5880.0
1104,2019/02/28,5880.0,5883.855,5890.0,34500,5890.0,5880.0
1105,2019/03/01,5880.0,5880.53,5880.0,54700,5890.0,5880.0
1106,2019/03/04,5880.0,5880.765,5880.0,39200,5890.0,5880.0
1107,2019/03/05,5880.0,5880.038,5880.0,53300,5890.0,5880.0
1108,2019/03/06,5880.0,5881.798,5880.0,17800,5890.0,5880.0
1109,2019/03/07,5880.0,5882.136,5880.0,22000,5890.0,5880.0
1110,2019/03/08,5880.0,5886.054,5880.0,56000,5890.0,5880.0
1111,2019/03/11,5880.0,5882.529,5880.0,26100,5890.0,5880.0
1112,2019/03/12,5880.0,5881.809,5880.0,18800,5890.0,5880.0
1113,2019/03/13,5880.0,5882.031,5880.0,12800,5890.0,5880.0
1114,2019/03/14,5880.0,5880.462,5880.0,23800,5890.0,5880.0
1115,2019/03/15,5880.0,5881.232,5880.0,55200,5890.0,5880.0
1116,2019/03/18,5880.0,5880.412,5880.0,17000,5890.0,5880.0
1117,2019/03/19,5880.0,5880.411,5880.0,7300,5890.0,5880.0
1118,2019/03/20,5890.0,5887.162,5880.0,14800,5890.0,5880.0
1119,2019/03/22,5880.0,5882.266,5880.0,12800,5890.0,5880.0
1120,2019/03/25,5880.0,5881.524,5880.0,16400,5890.0,5880.0
1121,2019/03/26,5890.0,5888.385,5880.0,16100,5890.0,5880.0
1122,2019/03/27,5880.0,5883.022,5880.0,13900,5890.0,5880.0
1123,2019/03/28,5880.0,5881.49,5880.0,108700,5890.0,5880.0
1124,2019/03/29,5880.0,5880.979,5880.0,86800,5890.0,5880.0
1125,2019/04/01,5880.0,5882.002,5880.0,111400,5890.0,5880.0
1126,2019/04/02,5880.0,5881.024,5880.0,49800,5890.0,5880.0
1127,2019/04/03,5900.0,5888.939,5880.0,46200,5900.0,5880.0
1128,2019/04/04,5890.0,5886.667,5880.0,16200,5900.0,5880.0
1129,2019/04/05,5880.0,5883.2,5880.0,42500,5890.0,5880.0
1130,2019/04/08,5880.0,5880.217,5880.0,13800,5890.0,5880.0
1131,2019/04/09,5880.0,5880.787,5880.0,17800,5890.0,5880.0
1132,2019/04/10,5880.0,5880.332,5880.0,30100,5890.0,5880.0
1133,2019/04/11,5880.0,5883.188,5880.0,22900,5890.0,5880.0
1134,2019/04/12,5890.0,5889.01,5880.0,39400,5900.0,5880.0
1135,2019/04/15,5900.0,5890.721,5890.0,43000,5900.0,5880.0
1136,2019/04/16,5880.0,5881.515,5880.0,9900,5890.0,5880.0
1137,2019/04/17,5900.0,5887.065,5880.0,18400,5900.0,5880.0
1138,2019/04/18,5900.0,5890.385,5890.0,28600,5900.0,5880.0
1139,2019/04/19,5890.0,5891.949,5890.0,23600,5900.0,5890.0
