,Date,Close,VWAP,Open,Volume,High,Low
0,2014/08/25,274.5,272.5,272.0,1800,274.5,272.0
1,2014/08/26,272.5,273.0,274.0,1400,274.0,272.5
2,2014/08/27,270.5,267.208,272.5,7200,272.5,266.0
3,2014/08/28,272.5,272.188,272.0,1600,272.5,272.0
4,2014/08/29,269.0,270.625,272.0,800,272.0,269.0
5,2014/09/01,278.0,273.929,270.0,5600,279.5,269.5
6,2014/09/02,276.0,274.548,277.5,10400,277.5,270.5
7,2014/09/03,282.0,282.124,280.0,18600,285.0,279.5
8,2014/09/04,280.5,282.158,282.0,3800,285.0,280.5
9,2014/09/05,281.0,283.053,284.0,7600,285.0,281.0
10,2014/09/08,290.0,287.917,282.0,1200,290.0,282.0
11,2014/09/09,290.0,289.469,290.0,3200,290.0,286.0
12,2014/09/10,288.0,287.389,290.0,1800,290.0,285.5
13,2014/09/11,288.0,286.22,284.5,5000,288.0,284.5
14,2014/09/12,284.5,286.25,288.0,400,288.0,284.5
15,2014/09/16,280.0,281.382,284.5,3400,284.5,280.0
16,2014/09/17,277.0,278.286,280.0,1400,280.0,277.0
17,2014/09/18,277.5,278.115,278.5,5200,278.5,277.5
18,2014/09/19,284.5,282.065,280.0,4600,284.5,280.0
19,2014/09/22,289.5,287.94,289.5,13400,290.0,284.5
20,2014/09/24,282.5,287.088,288.5,3400,289.0,282.5
21,2014/09/25,281.5,283.611,282.5,1800,287.5,281.5
22,2014/09/26,284.5,281.0,280.0,2400,284.5,279.0
23,2014/09/29,280.5,284.281,285.5,3200,286.0,280.5
24,2014/09/30,280.5,283.778,284.5,1800,285.0,280.5
25,2014/10/01,280.0,281.0,280.0,3000,282.5,280.0
26,2014/10/02,275.0,271.696,270.5,4600,275.0,270.0
27,2014/10/03,275.5,276.5,275.0,1400,280.0,275.0
28,2014/10/06,280.0,276.0,273.5,1200,280.0,273.5
29,2014/10/07,281.0,282.857,281.0,1400,287.5,281.0
30,2014/10/08,279.0,274.556,274.0,1800,279.0,274.0
31,2014/10/09,276.0,281.444,285.0,1800,285.0,276.0
32,2014/10/10,277.5,275.357,276.0,5600,277.5,272.5
33,2014/10/14,279.0,273.181,270.0,7200,279.5,270.0
34,2014/10/15,283.0,280.5,280.0,600,283.0,278.5
35,2014/10/16,275.0,277.86,283.0,5000,283.0,275.0
36,2014/10/17,277.0,273.875,277.0,3200,277.0,270.0
37,2014/10/20,279.5,278.086,280.0,5800,282.5,272.0
38,2014/10/21,285.0,285.103,284.5,23200,286.5,280.5
39,2014/10/22,288.0,286.55,285.0,4000,289.5,283.5
40,2014/10/23,287.5,287.5,288.5,2600,288.5,287.0
41,2014/10/24,286.0,288.316,287.0,3800,289.5,286.0
42,2014/10/27,284.0,286.722,288.0,1800,288.0,284.0
43,2014/10/28,281.5,281.5,281.5,600,281.5,281.5
44,2014/10/29,274.5,274.648,281.5,5400,281.5,271.5
45,2014/10/30,277.0,277.0,277.0,400,277.0,277.0
46,2014/10/31,279.5,277.429,277.5,1400,279.5,275.0
47,2014/11/04,263.0,268.514,280.0,28000,280.0,262.0
48,2014/11/05,270.0,268.543,268.0,7000,270.0,267.5
49,2014/11/06,263.0,266.495,263.5,22000,271.0,263.0
50,2014/11/07,261.5,262.548,263.5,10400,264.5,261.5
51,2014/11/10,264.5,263.076,261.5,13200,267.5,260.0
52,2014/11/11,262.5,262.602,263.0,9800,266.5,260.0
53,2014/11/12,262.5,262.144,260.5,10400,265.0,260.0
54,2014/11/13,264.5,263.667,262.5,3000,265.0,262.5
55,2014/11/14,260.5,262.472,263.5,3600,263.5,260.5
56,2014/11/17,257.5,260.0,262.0,9600,263.0,257.5
57,2014/11/18,260.0,259.5,257.5,7200,262.0,257.5
58,2014/11/19,257.5,259.181,259.5,9400,261.5,257.5
59,2014/11/20,257.0,258.593,258.5,11800,261.5,255.0
60,2014/11/21,254.5,255.277,255.0,22400,258.0,254.5
61,2014/11/25,257.0,256.464,257.5,8400,258.0,254.5
62,2014/11/26,257.0,257.658,258.0,3800,258.0,257.0
63,2014/11/27,257.0,254.921,254.0,11400,258.0,254.0
64,2014/11/28,258.0,258.321,258.0,5600,259.0,257.5
65,2014/12/01,257.5,257.789,257.5,11400,259.0,257.5
66,2014/12/02,258.5,257.469,258.5,6400,258.5,256.5
67,2014/12/03,261.5,259.144,259.0,11800,261.5,256.5
68,2014/12/04,269.5,266.697,262.5,12200,269.5,262.5
69,2014/12/05,282.5,274.811,269.0,32200,283.5,268.0
70,2014/12/08,273.5,281.216,286.0,21800,290.0,273.0
71,2014/12/09,270.0,270.784,270.0,20400,280.0,267.5
72,2014/12/10,268.0,266.716,266.5,13400,268.0,266.5
73,2014/12/11,274.5,271.875,273.0,10400,274.5,267.5
74,2014/12/12,270.5,271.741,274.5,5400,274.5,269.0
75,2014/12/15,272.5,274.68,274.5,5000,277.5,272.5
76,2014/12/16,268.5,270.879,270.5,6600,274.5,267.5
77,2014/12/17,270.5,270.025,273.0,4000,273.0,268.5
78,2014/12/18,270.5,272.167,276.0,7200,276.0,270.5
79,2014/12/19,275.0,273.966,275.5,8800,276.0,269.5
80,2014/12/22,272.5,274.929,277.0,11200,277.0,272.0
81,2014/12/24,280.0,275.224,275.0,17400,280.0,273.5
82,2014/12/25,270.5,275.298,279.0,10400,280.5,270.5
83,2014/12/26,276.0,276.343,276.5,10200,280.0,275.0
84,2014/12/29,277.0,278.754,282.0,11400,282.0,277.0
85,2014/12/30,278.0,279.058,279.0,29400,283.5,277.0
86,2015/01/05,280.0,279.827,279.5,5200,280.5,279.0
87,2015/01/06,280.0,279.9,280.5,3000,280.5,279.5
88,2015/01/07,282.5,281.063,280.0,1600,282.5,280.0
89,2015/01/08,284.5,284.34,284.0,14400,286.5,283.0
90,2015/01/09,283.0,283.923,285.5,5200,286.5,281.0
91,2015/01/13,282.5,280.768,283.5,5600,283.5,280.0
92,2015/01/14,277.5,279.808,282.5,7800,282.5,277.5
93,2015/01/15,279.0,278.167,278.5,1800,279.0,277.5
94,2015/01/16,275.0,274.95,275.0,8000,276.5,273.5
95,2015/01/19,276.0,275.423,275.0,5200,277.5,275.0
96,2015/01/20,280.0,278.848,279.0,4600,280.0,278.0
97,2015/01/21,291.0,289.122,280.0,57200,296.5,279.0
98,2015/01/22,290.0,289.25,295.0,10800,295.0,282.5
99,2015/01/23,317.5,308.771,315.0,182600,317.5,300.5
100,2015/01/26,301.0,306.227,307.5,34800,310.0,301.0
101,2015/01/27,292.0,291.855,304.5,39200,304.5,283.5
102,2015/01/28,297.5,293.574,290.0,5400,298.5,290.0
103,2015/01/29,299.5,295.795,293.0,8800,299.5,291.0
104,2015/01/30,294.0,295.6,299.5,2000,299.5,293.5
105,2015/02/02,286.5,289.018,291.5,11200,292.0,286.0
106,2015/02/03,286.0,287.457,291.0,4600,295.0,285.5
107,2015/02/04,289.5,288.556,286.0,3600,292.5,286.0
108,2015/02/05,289.0,285.907,291.0,5400,291.0,285.0
109,2015/02/06,290.0,289.25,287.0,2800,292.0,287.0
110,2015/02/09,268.0,266.902,270.0,61200,271.5,262.5
111,2015/02/10,271.5,269.72,270.0,13200,271.5,268.0
112,2015/02/12,272.0,271.21,270.0,6200,272.5,270.0
113,2015/02/13,271.0,270.233,270.0,6000,272.5,270.0
114,2015/02/16,271.5,270.721,271.0,8600,271.5,270.0
115,2015/02/17,271.0,268.73,272.5,12600,272.5,263.0
116,2015/02/18,268.5,269.87,270.5,10800,271.0,268.5
117,2015/02/19,270.0,269.534,270.0,8800,270.0,268.5
118,2015/02/20,273.5,271.705,271.0,7800,273.5,270.0
119,2015/02/23,274.5,274.297,273.5,14800,276.0,273.5
120,2015/02/24,276.0,275.412,276.5,3400,276.5,274.0
121,2015/02/25,276.0,277.082,278.0,11000,278.5,274.5
122,2015/02/26,279.5,277.077,277.0,10400,280.0,274.0
123,2015/02/27,275.0,277.165,280.5,17600,281.0,272.5
124,2015/03/02,276.0,276.524,276.5,12400,279.5,274.5
125,2015/03/03,278.5,277.557,277.0,7000,279.0,277.0
126,2015/03/04,276.5,275.963,277.5,13400,278.0,274.5
127,2015/03/05,277.5,277.585,278.0,8200,278.0,276.5
128,2015/03/06,278.0,278.194,277.5,3600,279.0,277.5
129,2015/03/09,279.5,278.885,279.5,5200,279.5,278.0
130,2015/03/10,280.5,279.158,281.0,11400,281.0,277.5
131,2015/03/11,282.0,280.833,281.0,6600,282.0,279.0
132,2015/03/12,282.5,280.605,280.5,3800,282.5,279.5
133,2015/03/13,279.0,279.929,282.5,9800,282.5,278.0
134,2015/03/16,278.0,278.362,278.0,5800,281.0,277.5
135,2015/03/17,280.5,279.313,278.0,3200,280.5,278.0
136,2015/03/18,281.5,279.944,279.5,5400,281.5,279.0
137,2015/03/19,280.5,281.119,281.5,4200,282.0,280.5
138,2015/03/20,282.5,282.017,282.0,6000,282.5,281.0
139,2015/03/23,283.0,281.534,282.5,17800,283.0,279.5
140,2015/03/24,283.0,282.571,282.5,4200,283.5,281.5
141,2015/03/25,283.5,282.783,282.5,9200,283.5,282.5
142,2015/03/26,285.0,284.056,284.0,82800,285.0,282.0
143,2015/03/27,272.0,274.18,275.0,27200,276.5,270.5
144,2015/03/30,269.5,269.906,270.0,6400,271.5,267.0
145,2015/03/31,267.0,267.75,269.5,4000,269.5,267.0
146,2015/04/01,266.0,265.587,267.0,4600,267.0,264.5
147,2015/04/02,266.5,266.625,266.0,2400,267.5,265.5
148,2015/04/03,267.0,268.091,269.0,6600,269.0,266.5
149,2015/04/06,265.0,265.957,268.0,9200,268.5,264.0
150,2015/04/07,270.0,267.586,265.0,16200,271.0,265.0
151,2015/04/08,268.5,270.583,271.0,2400,272.0,268.5
152,2015/04/09,276.0,272.875,269.0,6400,276.0,269.0
153,2015/04/10,273.5,273.367,276.0,3000,276.0,272.5
154,2015/04/13,271.0,270.769,270.5,2600,271.0,270.5
155,2015/04/14,270.5,270.25,270.5,2400,270.5,270.0
156,2015/04/15,269.5,269.433,270.5,3000,270.5,268.5
157,2015/04/16,269.0,268.286,269.0,2800,269.0,267.0
158,2015/04/17,268.0,268.857,269.5,1400,269.5,268.0
159,2015/04/20,271.0,269.22,268.0,5000,271.0,268.0
160,2015/04/21,270.5,271.468,271.5,6200,271.5,270.5
161,2015/04/22,272.5,270.182,267.5,2200,273.0,267.5
162,2015/04/23,270.0,270.625,271.5,800,271.5,270.0
163,2015/04/24,270.0,270.375,271.0,800,271.0,270.0
164,2015/04/27,274.0,271.042,270.0,2400,274.0,270.0
165,2015/04/28,271.0,271.857,274.0,2800,274.0,271.0
166,2015/04/30,276.0,274.946,271.0,20400,277.5,271.0
167,2015/05/01,277.5,276.649,276.5,9400,277.5,276.0
168,2015/05/07,276.0,277.019,277.5,5400,278.0,276.0
169,2015/05/08,274.5,274.5,274.5,3600,274.5,274.5
170,2015/05/11,275.0,274.969,274.5,3200,275.5,274.5
171,2015/05/12,274.5,274.536,274.5,2800,275.0,274.5
172,2015/05/13,275.5,274.861,275.0,3600,275.5,274.5
173,2015/05/14,275.5,275.438,275.0,1600,275.5,275.0
174,2015/05/15,276.0,273.679,275.0,10600,276.0,272.5
175,2015/05/18,270.0,272.5,275.0,3000,275.0,270.0
176,2015/05/19,270.5,271.682,271.5,2200,272.5,270.5
177,2015/05/20,273.0,274.83,270.5,18800,279.5,269.0
178,2015/05/21,273.0,276.633,278.0,19600,280.0,273.0
179,2015/05/22,278.0,277.344,274.0,9600,279.5,274.0
180,2015/05/25,275.5,276.826,278.5,4600,279.0,275.0
181,2015/05/26,276.0,280.442,277.5,13800,285.0,275.0
182,2015/05/27,275.0,276.125,276.5,2400,277.0,275.0
183,2015/05/28,275.0,275.909,277.5,2200,277.5,275.0
184,2015/05/29,273.5,273.833,273.5,3600,278.0,273.0
185,2015/06/01,275.5,271.808,270.5,5200,275.5,270.5
186,2015/06/02,276.5,275.813,276.0,1600,277.0,273.5
187,2015/06/03,276.0,276.0,276.0,600,276.0,276.0
188,2015/06/04,275.0,276.0,276.0,1400,276.5,275.0
189,2015/06/05,276.5,275.563,275.0,1600,276.5,275.0
190,2015/06/08,270.0,274.069,276.5,5800,276.5,270.0
191,2015/06/09,271.5,271.438,271.0,1600,271.5,271.0
192,2015/06/10,271.0,270.75,271.0,3600,271.0,270.0
193,2015/06/11,275.0,275.667,276.0,4800,276.0,273.0
194,2015/06/12,273.5,274.5,275.0,2400,275.0,273.5
195,2015/06/15,268.5,267.377,272.0,13000,272.0,265.0
196,2015/06/16,267.0,267.982,268.5,5400,270.5,266.5
197,2015/06/17,267.5,267.667,268.0,1800,269.0,267.0
198,2015/06/18,268.0,267.895,268.0,3800,269.5,266.5
199,2015/06/19,268.5,266.058,267.0,8600,268.5,265.0
200,2015/06/22,271.5,273.373,273.5,14200,273.5,271.5
201,2015/06/23,271.5,271.5,271.5,400,271.5,271.5
202,2015/06/24,270.0,267.789,271.5,3800,271.5,265.0
203,2015/06/25,267.5,266.579,270.0,3800,270.0,265.0
204,2015/06/26,267.5,267.15,266.5,2000,268.5,266.5
205,2015/06/29,265.5,265.547,265.0,6400,267.5,265.0
206,2015/06/30,265.0,265.278,265.0,3600,266.5,265.0
207,2015/07/01,267.5,266.167,265.5,3000,267.5,265.5
208,2015/07/02,266.0,265.146,265.0,4800,266.0,264.5
209,2015/07/03,272.0,269.167,267.0,6000,272.0,267.0
210,2015/07/06,272.0,270.922,272.0,6400,272.0,269.0
211,2015/07/07,270.0,270.857,272.0,2800,272.0,269.0
212,2015/07/08,268.5,269.278,270.0,1800,270.0,268.5
213,2015/07/09,264.0,263.138,265.5,15200,265.5,260.5
214,2015/07/10,266.5,263.929,264.0,1400,266.5,262.5
215,2015/07/13,263.0,263.444,268.5,3600,268.5,260.5
216,2015/07/14,265.5,264.5,263.5,3200,266.0,263.5
217,2015/07/15,262.5,264.5,265.0,5000,267.5,262.5
218,2015/07/16,266.5,264.636,264.0,2200,266.5,264.0
219,2015/07/17,269.0,267.605,266.5,3800,269.0,266.5
220,2015/07/21,269.5,271.219,270.0,12800,280.0,266.0
221,2015/07/22,268.5,268.462,267.5,2600,269.0,267.5
222,2015/07/23,264.5,264.145,263.5,15200,267.5,263.5
223,2015/07/24,265.5,265.875,266.0,800,266.0,265.5
224,2015/07/27,268.0,266.862,266.0,5800,269.5,265.5
225,2015/07/28,264.0,263.278,266.0,7200,266.0,262.0
226,2015/07/29,263.5,264.063,264.5,3200,264.5,263.5
227,2015/07/30,265.0,264.333,264.5,2400,265.0,264.0
228,2015/07/31,266.0,265.857,265.5,1400,266.5,265.5
229,2015/08/03,265.5,263.885,266.0,7800,266.0,262.5
230,2015/08/04,265.5,264.773,263.0,4400,266.0,263.0
231,2015/08/05,267.0,265.154,264.5,2600,267.0,264.5
232,2015/08/06,264.0,268.734,269.5,9400,271.0,264.0
233,2015/08/07,264.0,264.125,264.0,3200,266.0,263.0
234,2015/08/10,263.0,264.026,265.0,3800,268.5,263.0
235,2015/08/11,263.5,264.321,264.0,2800,266.5,263.5
236,2015/08/12,264.0,262.933,263.0,3000,264.0,262.5
237,2015/08/13,262.0,262.1,262.0,1000,262.5,262.0
238,2015/08/14,257.5,258.698,262.0,18200,262.0,257.0
239,2015/08/17,256.0,257.167,258.0,11400,258.0,255.0
240,2015/08/18,259.5,258.125,256.5,1600,259.5,256.5
241,2015/08/19,259.0,259.722,259.0,1800,261.5,259.0
242,2015/08/20,259.0,259.694,260.5,3600,261.0,259.0
243,2015/08/21,259.0,260.636,262.5,8800,262.5,255.0
244,2015/08/24,240.0,248.696,255.0,16800,256.0,239.5
245,2015/08/25,220.0,213.122,204.0,39400,233.0,204.0
246,2015/08/26,229.0,221.873,223.0,14200,232.0,217.0
247,2015/08/27,225.5,232.264,235.5,11000,235.5,225.5
248,2015/08/28,245.0,238.95,233.5,6000,247.0,233.5
249,2015/08/31,244.5,244.825,245.0,4000,246.5,242.5
250,2015/09/01,237.5,242.209,248.0,8600,248.0,236.0
251,2015/09/02,234.0,229.93,229.0,8600,238.5,222.5
252,2015/09/03,233.5,234.514,237.5,7200,237.5,233.5
253,2015/09/04,226.0,228.567,230.5,3000,233.0,226.0
254,2015/09/07,216.0,219.308,225.0,13000,225.0,213.0
255,2015/09/08,216.5,217.842,215.0,3800,221.0,215.0
256,2015/09/09,225.5,222.038,219.0,2600,225.5,219.0
257,2015/09/10,225.0,224.92,224.0,5000,226.5,224.0
258,2015/09/11,230.0,228.395,227.0,3800,231.0,227.0
259,2015/09/14,231.5,232.938,234.0,3200,234.5,231.5
260,2015/09/15,232.0,232.25,232.5,400,232.5,232.0
261,2015/09/16,234.0,235.4,232.5,2000,238.0,232.5
262,2015/09/17,235.5,234.75,236.5,2000,236.5,233.5
263,2015/09/18,232.0,233.0,233.5,2600,233.5,232.0
264,2015/09/24,239.0,236.625,236.5,6400,239.0,236.0
265,2015/09/25,232.5,234.875,235.0,800,236.5,232.5
266,2015/09/28,233.5,232.167,231.5,600,233.5,231.5
267,2015/09/29,230.0,229.111,233.5,3600,233.5,226.0
268,2015/09/30,231.5,232.667,234.0,1800,234.0,231.5
269,2015/10/01,232.0,232.0,232.0,600,232.0,232.0
270,2015/10/02,236.0,235.0,234.0,800,236.0,234.0
271,2015/10/05,234.0,234.364,237.5,4400,237.5,231.5
272,2015/10/06,235.0,235.0,235.0,1200,236.0,234.0
273,2015/10/07,236.5,236.306,238.0,6200,238.5,235.5
274,2015/10/08,237.0,237.563,238.0,1600,239.0,236.0
275,2015/10/09,239.5,238.722,237.0,1800,239.5,237.0
276,2015/10/13,240.5,240.125,240.0,800,240.5,240.0
277,2015/10/14,241.5,241.214,240.5,1400,241.5,240.5
278,2015/10/15,241.5,241.5,241.5,1000,241.5,241.5
279,2015/10/16,245.0,244.154,244.0,2600,245.0,244.0
280,2015/10/19,239.0,240.361,245.5,14400,247.0,239.0
281,2015/10/20,244.0,239.917,237.5,3600,244.0,237.5
282,2015/10/21,246.5,246.958,247.0,4800,247.0,246.5
283,2015/10/22,246.0,260.15,247.0,64600,275.0,237.5
284,2015/10/23,244.5,244.389,246.5,7200,246.5,242.0
285,2015/10/26,248.5,249.263,247.5,7600,252.5,247.5
286,2015/10/27,243.0,244.633,248.0,3000,248.0,243.0
287,2015/10/28,245.0,245.167,245.5,1200,245.5,244.5
288,2015/10/29,248.0,254.994,249.0,32600,261.5,245.5
289,2015/10/30,247.0,248.032,248.0,6200,250.5,244.5
290,2015/11/02,244.0,245.763,247.0,3800,247.0,244.0
291,2015/11/04,242.0,242.667,244.0,3600,244.0,242.0
292,2015/11/05,248.0,244.28,242.5,5000,250.0,242.5
293,2015/11/06,245.0,244.9,245.0,3000,245.0,244.0
294,2015/11/09,247.5,247.295,249.0,4400,249.0,246.0
295,2015/11/10,247.0,247.825,247.0,8000,250.0,246.0
296,2015/11/11,249.0,249.769,248.0,5200,252.5,248.0
297,2015/11/12,249.0,251.225,249.0,4000,252.5,248.0
298,2015/11/13,249.5,248.625,249.0,4800,250.0,247.5
299,2015/11/16,249.5,248.917,249.0,3600,251.0,247.5
300,2015/11/17,249.0,249.917,250.5,2400,250.5,249.0
301,2015/11/18,249.0,249.972,250.0,3600,251.5,249.0
302,2015/11/19,251.5,249.636,249.0,2200,251.5,248.5
303,2015/11/20,251.5,251.075,251.0,4000,251.5,250.0
304,2015/11/24,253.0,251.631,251.5,8400,253.0,250.5
305,2015/11/25,253.0,252.767,252.5,3000,254.0,252.0
306,2015/11/26,252.5,253.0,254.0,800,254.0,252.5
307,2015/11/27,253.5,253.15,253.0,2000,254.0,252.0
308,2015/11/30,258.0,256.897,257.5,5800,259.0,255.0
309,2015/12/01,258.5,258.028,258.5,3600,258.5,257.0
310,2015/12/02,258.5,258.029,259.0,3400,259.0,256.0
311,2015/12/03,259.0,259.0,258.0,3200,260.0,258.0
312,2015/12/04,258.5,258.652,259.0,4600,259.0,258.5
313,2015/12/07,260.0,259.955,260.0,2200,260.0,259.5
314,2015/12/08,259.5,258.903,260.5,6200,261.5,257.5
315,2015/12/09,257.0,255.587,256.0,9200,257.0,254.0
316,2015/12/10,258.0,257.429,258.5,1400,258.5,256.5
317,2015/12/11,260.0,262.512,263.0,8600,263.5,260.0
318,2015/12/14,254.0,256.183,257.0,8200,257.5,253.0
319,2015/12/15,252.5,253.458,254.5,2400,254.5,252.5
320,2015/12/16,256.0,254.867,254.5,3000,256.0,254.0
321,2015/12/17,256.0,255.794,256.0,3400,256.0,255.5
322,2015/12/18,281.5,292.322,256.5,559400,306.0,256.5
323,2015/12/21,266.0,272.565,276.5,124200,291.0,266.0
324,2015/12/22,266.5,271.185,268.0,26000,278.0,266.5
325,2015/12/24,262.5,264.647,268.0,22400,268.5,262.5
326,2015/12/25,253.0,257.421,262.5,20200,262.5,253.0
327,2015/12/28,250.5,251.727,254.0,15000,255.0,249.5
328,2015/12/29,252.5,252.75,252.0,6000,254.5,251.0
329,2015/12/30,255.0,253.943,255.5,7000,255.5,252.5
330,2016/01/04,274.0,274.02,280.0,29800,280.0,268.0
331,2016/01/05,272.0,271.158,274.0,7600,274.0,266.5
332,2016/01/06,270.5,273.417,272.5,4800,276.0,270.5
333,2016/01/07,263.5,264.783,266.0,4600,266.0,263.0
334,2016/01/08,266.5,264.403,263.5,6200,266.5,263.5
335,2016/01/12,260.0,260.125,265.0,7200,265.0,256.0
336,2016/01/13,261.5,259.01,259.0,9800,262.0,258.0
337,2016/01/14,252.5,254.942,260.0,8600,260.0,251.5
338,2016/01/15,252.0,253.982,254.0,5600,255.5,252.0
339,2016/01/18,248.5,244.99,245.5,10000,249.0,241.5
340,2016/01/19,250.0,249.99,247.5,9600,252.5,247.5
341,2016/01/20,248.0,249.417,250.5,7200,252.5,246.5
342,2016/01/21,231.5,240.653,241.5,17000,244.0,231.5
343,2016/01/22,238.5,235.574,232.0,5400,242.5,232.0
344,2016/01/25,251.5,247.382,242.5,3400,251.5,242.5
345,2016/01/26,245.0,245.85,246.5,2000,247.0,244.5
346,2016/01/27,256.5,252.364,248.0,4400,256.5,248.0
347,2016/01/28,248.0,246.083,255.0,9600,255.0,243.5
348,2016/01/29,255.0,250.158,250.0,3800,255.0,247.5
349,2016/02/01,257.5,257.969,258.0,3200,259.0,256.5
350,2016/02/02,258.5,257.955,257.5,2200,259.0,257.0
351,2016/02/03,253.0,254.583,256.0,2400,256.0,253.0
352,2016/02/04,257.0,256.96,258.0,5000,258.0,254.0
353,2016/02/05,251.5,252.106,252.0,6600,255.0,250.5
354,2016/02/08,248.0,248.222,249.0,3600,249.0,245.0
355,2016/02/09,240.0,242.221,244.5,6800,244.5,240.0
356,2016/02/10,232.5,233.373,236.0,11800,238.0,230.0
357,2016/02/12,217.5,221.24,224.5,15000,226.5,211.0
358,2016/02/15,231.5,230.816,233.0,3800,233.0,228.0
359,2016/02/16,242.0,240.292,235.0,2400,244.0,235.0
360,2016/02/17,244.0,242.7,242.0,2000,245.0,241.5
361,2016/02/18,246.5,245.833,245.0,10800,250.0,242.0
362,2016/02/19,263.5,277.76,286.0,209400,286.5,261.0
363,2016/02/22,269.5,269.996,268.5,24200,275.0,264.0
364,2016/02/23,257.5,259.846,271.0,18200,271.0,252.5
365,2016/02/24,256.5,258.379,255.0,13200,265.0,253.5
366,2016/02/25,259.0,256.727,257.0,6600,259.0,255.5
367,2016/02/26,259.5,259.552,259.0,15400,261.0,258.5
368,2016/02/29,253.0,255.029,257.5,17000,258.5,252.5
369,2016/03/01,253.5,253.063,252.5,8000,254.5,252.5
370,2016/03/02,246.0,246.833,246.5,61200,248.5,246.0
371,2016/03/03,242.5,242.534,241.5,58800,244.5,241.5
372,2016/03/04,245.5,244.246,243.0,23600,246.0,243.0
373,2016/03/07,243.5,244.727,247.5,51600,247.5,243.5
374,2016/03/08,251.5,248.523,247.5,231200,252.0,244.5
375,2016/03/09,247.0,247.343,248.5,34400,249.5,244.5
376,2016/03/10,244.5,245.908,246.0,29200,247.5,244.5
377,2016/03/11,245.5,245.121,245.0,17400,246.0,244.5
378,2016/03/14,247.0,246.921,246.5,30200,248.0,246.0
379,2016/03/15,248.5,247.368,247.0,18200,248.5,246.5
380,2016/03/16,248.5,249.508,248.5,37000,251.5,248.0
381,2016/03/17,248.5,248.25,249.5,16000,249.5,246.0
382,2016/03/18,246.5,246.791,247.0,15800,248.5,246.0
383,2016/03/22,251.0,251.857,247.5,113400,258.5,247.0
384,2016/03/23,248.0,249.17,249.5,41200,251.0,247.5
385,2016/03/24,256.5,256.372,248.5,132400,266.5,248.5
386,2016/03/25,258.0,256.807,255.0,21200,259.5,255.0
387,2016/03/28,256.0,257.426,259.5,109800,260.0,254.0
388,2016/03/29,276.5,273.681,255.5,407400,289.0,255.5
389,2016/03/30,276.0,274.298,274.0,90800,280.0,270.0
390,2016/03/31,273.0,275.952,277.5,45400,278.5,271.5
391,2016/04/01,263.5,265.906,270.0,39400,270.5,262.5
392,2016/04/04,260.5,263.411,261.0,20200,269.5,260.0
393,2016/04/05,244.5,251.316,260.0,47200,262.0,244.0
394,2016/04/06,234.5,234.562,233.5,35600,237.5,233.0
395,2016/04/07,240.5,238.717,233.5,21200,247.5,233.5
396,2016/04/08,235.5,235.047,233.5,25400,237.5,230.5
397,2016/04/11,236.5,236.575,237.5,8000,238.0,235.5
398,2016/04/12,239.5,238.929,238.0,5600,241.0,237.5
399,2016/04/13,244.5,243.058,240.0,10400,245.5,240.0
400,2016/04/14,244.5,243.797,244.5,21200,245.0,242.5
401,2016/04/15,246.5,246.443,243.5,17600,249.0,243.0
402,2016/04/18,244.5,241.804,243.5,15800,244.5,237.5
403,2016/04/19,246.0,245.578,244.0,12800,247.0,244.0
404,2016/04/20,245.0,245.149,246.0,9400,247.5,243.5
405,2016/04/21,246.0,244.784,245.0,19000,246.5,243.0
406,2016/04/22,249.5,251.303,248.5,52400,257.5,245.5
407,2016/04/25,249.0,249.903,252.0,7200,252.0,247.0
408,2016/04/26,242.5,243.173,248.5,15000,248.5,237.5
409,2016/04/27,241.5,239.281,240.0,11400,242.0,236.0
410,2016/04/28,240.0,242.967,244.0,18200,246.5,239.5
411,2016/05/02,236.5,234.019,236.5,25800,238.0,231.5
412,2016/05/06,238.5,237.179,236.5,8400,240.5,234.0
413,2016/05/09,242.0,241.837,240.0,8600,243.5,239.5
414,2016/05/10,247.5,245.375,243.0,8000,247.5,242.5
415,2016/05/11,249.0,250.077,251.5,19400,252.0,247.0
416,2016/05/12,248.5,248.015,245.0,20000,251.5,245.0
417,2016/05/13,253.5,249.904,250.0,28000,253.5,242.5
418,2016/05/16,246.0,248.368,251.0,17400,254.0,243.0
419,2016/05/17,243.0,242.741,242.0,5400,243.5,242.0
420,2016/05/18,245.0,245.708,242.0,15400,250.0,241.0
421,2016/05/19,249.0,250.0,245.0,27600,256.5,245.0
422,2016/05/20,249.0,248.265,247.0,6800,250.0,247.0
423,2016/05/23,248.5,250.473,252.0,14800,252.0,248.0
424,2016/05/24,248.5,248.581,249.5,12400,250.5,247.5
425,2016/05/25,249.5,248.056,248.5,3600,249.5,246.5
426,2016/05/26,246.5,247.35,247.5,2000,248.0,246.5
427,2016/05/27,247.5,249.092,247.5,15200,253.0,247.0
428,2016/05/30,249.5,249.071,247.0,4200,250.0,247.0
429,2016/05/31,247.0,251.362,253.5,64400,258.5,244.5
430,2016/06/01,251.0,250.267,247.0,20600,252.5,247.0
431,2016/06/02,249.5,249.517,250.5,12000,250.5,248.0
432,2016/06/03,249.5,249.389,250.0,5400,250.0,248.0
433,2016/06/06,248.5,249.294,248.0,17000,251.5,247.5
434,2016/06/07,247.0,247.883,248.0,6000,248.5,247.0
435,2016/06/08,249.0,247.638,246.5,5800,249.0,246.5
436,2016/06/09,258.5,255.028,252.0,49800,260.0,250.0
437,2016/06/10,265.0,272.311,259.5,215000,284.0,259.0
438,2016/06/13,249.0,255.272,265.0,141600,265.0,247.0
439,2016/06/14,242.5,244.023,246.5,31000,249.5,240.5
440,2016/06/15,243.0,239.183,235.5,67600,251.0,231.5
441,2016/06/16,235.0,239.521,244.5,43200,247.0,235.0
442,2016/06/17,235.5,237.07,236.5,31400,240.0,235.5
443,2016/06/20,249.0,244.96,238.0,27200,249.5,238.0
444,2016/06/21,257.5,252.859,250.0,41800,257.5,249.5
445,2016/06/22,260.0,258.447,258.5,24600,260.0,257.0
446,2016/06/23,259.5,259.173,258.0,10400,261.0,256.5
447,2016/06/24,233.0,242.232,259.5,45600,259.5,233.0
448,2016/06/27,238.0,233.706,232.5,31000,238.0,230.5
449,2016/06/28,238.5,234.972,236.0,10600,238.5,231.5
450,2016/06/29,242.5,244.319,242.5,16000,247.0,242.5
451,2016/06/30,249.5,248.43,243.5,11400,252.0,243.5
452,2016/07/01,250.0,249.727,248.5,6600,250.0,248.5
453,2016/07/04,249.5,251.317,249.5,12600,255.0,249.5
454,2016/07/05,247.5,248.983,250.0,6000,250.0,247.0
455,2016/07/06,241.5,243.466,245.5,20400,246.5,241.5
456,2016/07/07,239.0,239.813,240.5,13400,241.5,238.5
457,2016/07/08,237.5,238.3,238.0,11000,240.0,237.5
458,2016/07/11,242.0,240.013,238.0,8000,242.0,238.0
459,2016/07/12,243.0,243.728,243.5,11400,245.5,242.5
460,2016/07/13,244.0,244.852,244.5,12800,247.5,243.5
461,2016/07/14,248.0,248.027,244.5,11200,250.0,244.5
462,2016/07/15,249.0,249.42,249.0,5000,250.0,249.0
463,2016/07/19,243.5,248.312,250.0,52000,261.5,243.0
464,2016/07/20,263.0,258.428,255.0,73600,267.0,251.0
465,2016/07/21,250.0,257.362,266.5,48400,266.5,250.0
466,2016/07/22,250.0,250.684,254.0,27200,254.0,246.0
467,2016/07/25,248.5,249.064,249.0,9400,250.0,248.0
468,2016/07/26,247.5,248.22,249.5,5000,249.5,247.5
469,2016/07/27,287.5,283.074,259.5,1006200,287.5,258.0
470,2016/07/28,260.5,267.675,273.0,361600,285.5,257.5
471,2016/07/29,259.5,252.979,257.0,58200,259.5,249.5
472,2016/08/01,254.0,251.567,258.5,55200,258.5,246.5
473,2016/08/02,256.0,256.596,254.5,32200,263.0,254.5
474,2016/08/03,250.5,252.117,249.5,26600,255.0,249.5
475,2016/08/04,257.5,255.473,250.5,37200,261.5,250.0
476,2016/08/05,257.5,260.951,262.5,61800,268.0,257.5
477,2016/08/08,255.5,257.072,257.0,13800,261.0,255.5
478,2016/08/09,259.5,257.56,254.0,11600,259.5,254.0
479,2016/08/10,259.0,258.618,260.5,11000,260.5,256.0
480,2016/08/12,265.0,259.492,259.0,24800,266.0,253.5
481,2016/08/15,235.5,236.474,237.0,291200,240.0,233.0
482,2016/08/16,238.5,237.817,238.0,42600,239.0,236.5
483,2016/08/17,236.0,236.891,237.5,18400,238.5,236.0
484,2016/08/18,236.0,235.616,235.5,11200,236.5,235.5
485,2016/08/19,234.0,233.794,236.5,28600,236.5,232.0
486,2016/08/22,234.0,234.619,237.0,19400,237.0,233.0
487,2016/08/23,235.0,234.979,235.0,9400,235.5,234.0
488,2016/08/24,233.5,233.744,234.0,8600,236.0,233.0
489,2016/08/25,229.5,230.765,233.5,32400,234.0,228.0
490,2016/08/26,230.0,229.314,228.0,21000,232.5,227.5
491,2016/08/29,231.0,230.403,230.5,6200,231.0,230.0
492,2016/08/30,236.5,233.892,229.0,164800,242.5,225.5
493,2016/08/31,229.0,229.475,233.0,52400,233.0,227.0
494,2016/09/01,229.0,228.647,228.5,18400,229.5,226.5
495,2016/09/02,229.0,229.675,229.0,4000,231.0,229.0
496,2016/09/05,228.5,229.31,230.5,17400,230.5,227.5
497,2016/09/06,227.5,227.829,228.0,30400,230.0,227.0
498,2016/09/07,227.5,227.716,227.5,7400,228.5,227.5
499,2016/09/08,227.0,227.333,227.5,14400,228.0,227.0
500,2016/09/09,228.0,227.857,227.0,11200,229.5,227.0
501,2016/09/12,226.5,227.129,226.5,19400,228.5,226.5
502,2016/09/13,227.0,228.073,226.5,37000,230.5,226.5
503,2016/09/14,226.0,225.85,225.5,12000,226.5,225.5
504,2016/09/15,226.0,226.643,227.5,7000,227.5,226.0
505,2016/09/16,227.5,228.518,226.5,11000,229.5,226.5
506,2016/09/20,231.0,229.638,228.0,15200,231.5,228.0
507,2016/09/21,229.5,231.2,232.0,15000,232.0,229.5
508,2016/09/23,229.0,229.37,229.5,10800,230.5,228.5
509,2016/09/26,227.5,228.453,229.5,6400,229.5,227.5
510,2016/09/27,228.0,227.36,227.5,8600,228.0,227.0
511,2016/09/28,229.0,226.796,228.5,15200,229.0,225.0
512,2016/09/29,229.5,228.208,228.0,9600,229.5,227.5
513,2016/09/30,230.5,228.893,229.0,8400,230.5,227.5
514,2016/10/03,231.5,231.148,231.0,14200,232.0,230.0
515,2016/10/04,233.0,232.057,231.5,12200,233.0,230.5
516,2016/10/05,233.0,233.433,233.5,6000,234.5,232.5
517,2016/10/06,235.5,238.045,233.0,48400,242.5,233.0
518,2016/10/07,237.5,236.514,236.0,21000,239.5,234.5
519,2016/10/11,238.0,238.144,238.0,13200,239.0,237.5
520,2016/10/12,238.0,238.125,238.0,8000,238.5,237.5
521,2016/10/13,237.0,237.344,238.0,12200,238.0,235.5
522,2016/10/14,237.0,236.697,237.0,7600,239.0,235.0
523,2016/10/17,238.0,237.333,237.0,3600,238.0,236.5
524,2016/10/18,239.5,239.183,238.5,10400,240.0,238.0
525,2016/10/19,240.0,239.781,239.5,3200,240.5,238.5
526,2016/10/20,247.5,245.261,241.0,46000,250.0,238.0
527,2016/10/21,242.0,244.955,249.0,24200,249.0,241.5
528,2016/10/24,242.5,242.493,242.0,14200,245.0,241.0
529,2016/10/25,239.0,240.835,243.0,17600,244.5,239.0
530,2016/10/26,241.0,239.955,239.0,4400,242.0,239.0
531,2016/10/27,240.0,239.52,239.0,5000,241.0,239.0
532,2016/10/28,240.5,240.5,241.0,2000,241.0,239.5
533,2016/10/31,242.0,242.743,240.5,14000,245.5,240.5
534,2016/11/01,243.0,243.273,242.0,17200,244.0,242.0
535,2016/11/02,241.0,240.665,241.0,16400,242.0,240.0
536,2016/11/04,230.5,228.931,234.5,65200,234.5,223.5
537,2016/11/07,228.0,228.133,230.0,27800,230.0,225.0
538,2016/11/08,229.0,228.636,228.0,4400,229.5,228.0
539,2016/11/09,224.5,226.103,228.5,23400,229.0,223.5
540,2016/11/10,228.5,228.613,226.5,14200,230.0,226.5
541,2016/11/11,228.5,230.734,231.5,9400,232.5,228.5
542,2016/11/14,230.0,230.125,228.5,8000,232.0,228.5
543,2016/11/15,229.0,229.474,230.0,7800,230.0,228.0
544,2016/11/16,231.5,231.477,231.5,4400,231.5,231.0
545,2016/11/17,232.0,231.762,231.5,4200,232.5,231.0
546,2016/11/18,233.0,232.87,233.0,10800,233.5,232.0
547,2016/11/21,234.0,233.555,234.0,16400,234.0,232.5
548,2016/11/22,241.0,237.011,234.0,17800,242.5,232.5
549,2016/11/24,238.0,238.561,241.5,8200,241.5,236.5
550,2016/11/25,236.5,236.363,237.0,10200,238.5,234.0
551,2016/11/28,233.5,233.825,236.5,29200,236.5,229.0
552,2016/11/29,232.5,232.349,233.5,14600,233.5,230.5
553,2016/11/30,234.0,232.944,231.5,5400,234.0,231.5
554,2016/12/01,234.5,235.664,235.5,11000,237.0,234.5
555,2016/12/02,233.0,232.984,232.5,6200,234.0,232.5
556,2016/12/05,235.0,234.121,233.5,5800,235.0,233.0
557,2016/12/06,234.0,234.653,235.0,12400,236.5,233.0
558,2016/12/07,235.0,235.286,234.5,11200,236.5,234.5
559,2016/12/08,236.0,235.743,235.5,14800,237.0,235.0
560,2016/12/09,237.5,237.333,237.5,6600,238.0,236.5
561,2016/12/12,239.0,239.448,239.5,21200,240.0,238.0
562,2016/12/13,238.0,236.92,238.0,20000,238.5,235.5
563,2016/12/14,237.5,236.458,239.0,23600,239.0,235.0
564,2016/12/15,259.5,256.286,238.0,154800,271.5,238.0
565,2016/12/16,262.0,269.592,254.5,278600,280.0,252.0
566,2016/12/19,256.0,257.853,258.5,83200,263.0,251.5
567,2016/12/20,245.5,247.864,255.0,56800,255.0,240.5
568,2016/12/21,242.0,243.488,247.0,32200,247.0,240.5
569,2016/12/22,237.0,236.98,241.0,80200,241.0,233.0
570,2016/12/26,241.0,238.865,237.0,17000,241.0,236.5
571,2016/12/27,243.0,242.528,241.5,21800,243.0,240.5
572,2016/12/28,243.0,242.72,241.5,5000,243.5,241.5
573,2016/12/29,243.0,243.127,242.5,15000,245.0,242.5
574,2016/12/30,242.5,241.632,243.0,14400,243.0,240.0
575,2017/01/04,247.0,245.139,244.5,15800,247.5,243.5
576,2017/01/05,249.0,246.72,247.5,18200,252.0,244.0
577,2017/01/06,249.0,250.179,249.0,14000,253.0,249.0
578,2017/01/10,251.0,251.313,251.5,16000,254.0,249.5
579,2017/01/11,257.0,258.457,256.0,60400,265.5,255.0
580,2017/01/12,253.5,255.593,256.5,19400,257.5,253.5
581,2017/01/13,254.0,254.795,253.5,8800,256.5,253.5
582,2017/01/16,251.5,254.269,254.0,26400,256.0,251.0
583,2017/01/17,250.5,251.896,251.0,9600,255.0,250.5
584,2017/01/18,253.5,250.025,250.0,24000,254.5,245.5
585,2017/01/19,252.5,255.049,253.5,12200,258.5,252.5
586,2017/01/20,254.0,255.054,254.5,7400,258.5,252.5
587,2017/01/23,253.0,255.646,258.5,30200,258.5,252.5
588,2017/01/24,252.5,251.78,252.5,11800,254.5,250.0
589,2017/01/25,254.0,253.368,252.5,10600,254.5,252.5
590,2017/01/26,252.0,254.385,256.5,17400,256.5,252.0
591,2017/01/27,267.5,260.849,255.5,59400,267.5,255.5
592,2017/01/30,317.5,313.823,269.0,1966800,317.5,265.5
593,2017/01/31,333.5,344.299,297.5,11446600,367.5,297.0
594,2017/02/01,330.0,349.274,343.5,11532400,377.5,318.0
595,2017/02/02,312.5,316.069,317.5,1362200,323.0,310.5
596,2017/02/03,313.0,313.379,310.0,458800,325.0,309.0
597,2017/02/06,303.5,310.095,312.5,449800,317.0,303.5
598,2017/02/07,300.0,298.161,300.0,178800,302.0,294.5
599,2017/02/08,262.0,265.626,270.0,734000,272.5,259.0
600,2017/02/09,256.0,260.156,262.5,245000,263.5,255.5
601,2017/02/10,254.0,254.862,255.5,151000,260.0,252.5
602,2017/02/13,256.0,258.45,257.0,272400,266.0,253.5
603,2017/02/14,254.0,253.241,253.5,101800,255.0,251.5
604,2017/02/15,252.5,253.291,253.5,86800,259.0,251.0
605,2017/02/16,252.5,253.248,253.5,48400,256.0,252.5
606,2017/02/17,258.0,256.262,253.0,73600,260.5,252.5
607,2017/02/20,258.5,257.586,255.5,59600,260.0,255.5
608,2017/02/21,257.5,257.9,259.0,38000,259.5,256.5
609,2017/02/22,256.5,258.012,257.5,51000,260.0,256.5
610,2017/02/23,261.5,258.194,258.0,76800,262.5,255.0
611,2017/02/24,260.0,263.513,258.5,54800,271.0,258.5
612,2017/02/27,263.5,263.163,263.0,19600,265.5,260.5
613,2017/02/28,265.0,264.827,266.0,30000,266.5,264.0
614,2017/03/01,265.0,263.713,265.0,31400,266.5,261.0
615,2017/03/02,265.5,265.815,265.5,25400,267.0,265.0
616,2017/03/03,266.5,265.889,265.5,18000,267.0,265.5
617,2017/03/06,270.0,269.093,269.0,15000,270.0,267.5
618,2017/03/07,266.5,269.191,271.5,27200,271.5,266.5
619,2017/03/08,266.0,266.686,266.5,10200,267.5,266.0
620,2017/03/09,266.5,266.849,266.0,8600,268.5,266.0
621,2017/03/10,268.5,275.946,270.0,198600,288.5,267.5
622,2017/03/13,268.5,271.339,273.5,58200,274.0,268.5
623,2017/03/14,266.5,267.841,268.5,34000,269.0,266.5
624,2017/03/15,263.0,264.839,266.0,37800,266.5,263.0
625,2017/03/16,265.0,265.479,263.5,14200,267.5,263.5
626,2017/03/17,265.5,266.29,264.5,30000,271.5,263.5
627,2017/03/21,268.0,266.644,265.5,23000,268.5,264.5
628,2017/03/22,269.0,266.681,266.5,36400,269.5,264.0
629,2017/03/23,269.5,269.099,269.5,16200,270.0,268.0
630,2017/03/24,270.0,269.593,269.5,36600,272.5,267.5
631,2017/03/27,270.5,270.74,270.5,41200,271.5,269.0
632,2017/03/28,272.5,270.812,268.5,72400,273.5,268.5
633,2017/03/29,257.0,256.307,255.5,76000,259.0,253.5
634,2017/03/30,256.5,258.767,257.5,31800,262.5,256.0
635,2017/03/31,254.0,258.506,260.0,52800,263.5,253.5
636,2017/04/03,246.5,248.634,253.0,48400,253.0,243.5
637,2017/04/04,240.5,243.546,245.0,23800,246.0,240.5
638,2017/04/05,246.0,245.416,242.5,15400,250.5,242.5
639,2017/04/06,241.0,241.082,247.0,25600,247.0,239.5
640,2017/04/07,235.5,238.896,239.5,38600,244.5,235.0
641,2017/04/10,242.0,239.242,235.0,18600,245.0,235.0
642,2017/04/11,241.0,242.824,244.0,10800,244.0,241.0
643,2017/04/12,238.5,238.013,240.0,8000,240.0,236.5
644,2017/04/13,239.0,237.828,237.0,6400,239.5,237.0
645,2017/04/14,236.5,244.358,236.5,48600,254.5,236.5
646,2017/04/17,238.5,236.907,236.5,10800,240.5,235.5
647,2017/04/18,241.5,241.518,241.5,5600,242.0,240.0
648,2017/04/19,242.0,241.325,239.5,8000,244.0,239.5
649,2017/04/20,245.0,244.5,244.5,5000,245.0,243.5
650,2017/04/21,248.0,248.543,249.0,7000,249.0,247.0
651,2017/04/24,247.5,246.328,248.0,6400,248.0,245.0
652,2017/04/25,246.5,248.014,247.0,7000,250.0,245.5
653,2017/04/26,247.0,248.207,246.5,5800,251.5,246.5
654,2017/04/27,246.5,247.47,248.5,6600,248.5,246.5
655,2017/04/28,246.0,246.596,247.0,5200,250.0,245.5
656,2017/05/01,247.0,246.3,247.5,6000,248.5,245.0
657,2017/05/02,242.5,244.809,247.0,19400,249.5,239.5
658,2017/05/08,242.5,242.34,243.5,18800,245.0,240.5
659,2017/05/09,242.0,241.307,242.5,21800,244.0,240.0
660,2017/05/10,243.0,242.15,242.0,12000,244.0,241.5
661,2017/05/11,240.5,242.058,244.0,13800,244.0,240.5
662,2017/05/12,242.5,245.158,244.0,37400,251.5,242.0
663,2017/05/15,243.5,243.935,246.5,61400,249.0,239.5
664,2017/05/16,245.0,244.385,246.0,21800,247.0,241.5
665,2017/05/17,248.0,246.724,246.0,15600,248.0,245.0
666,2017/05/18,245.5,244.205,244.0,8800,245.5,243.5
667,2017/05/19,247.0,245.9,246.0,4000,247.5,245.0
668,2017/05/22,249.5,248.74,248.0,15400,250.5,248.0
669,2017/05/23,248.0,248.533,249.5,12200,249.5,247.5
670,2017/05/24,247.0,250.8,248.5,41000,258.0,246.0
671,2017/05/25,249.0,247.785,249.0,11600,249.5,247.0
672,2017/05/26,249.5,249.737,249.5,11800,252.5,247.5
673,2017/05/29,250.0,248.535,249.5,5800,250.5,247.5
674,2017/05/30,251.0,250.261,249.0,4600,251.0,249.0
675,2017/05/31,249.0,249.152,250.0,4600,250.0,248.5
676,2017/06/01,250.0,249.154,248.5,2600,250.5,248.5
677,2017/06/02,248.5,248.519,249.0,10600,250.0,247.5
678,2017/06/05,251.5,251.259,250.0,11200,253.0,250.0
679,2017/06/06,250.0,249.571,249.5,2800,250.0,249.5
680,2017/06/07,254.5,256.135,260.0,68400,260.0,249.0
681,2017/06/08,262.0,273.622,256.0,822000,295.0,253.0
682,2017/06/09,274.0,267.998,264.5,290000,281.0,260.0
683,2017/06/12,263.0,268.382,274.0,71800,274.0,263.0
684,2017/06/13,256.5,255.643,261.0,50200,261.0,250.5
685,2017/06/14,252.5,253.419,254.0,49200,255.0,252.0
686,2017/06/15,253.5,254.129,253.5,20200,255.5,253.0
687,2017/06/16,256.0,255.21,253.5,16200,257.0,253.5
688,2017/06/19,272.0,266.902,258.0,97200,274.0,258.0
689,2017/06/20,322.0,313.1,270.0,664800,322.0,268.5
690,2017/06/21,285.0,298.529,312.0,1142800,313.5,285.0
691,2017/06/22,294.0,302.164,288.5,1243000,324.0,280.5
692,2017/06/23,300.0,292.737,289.0,242600,300.0,287.0
693,2017/06/26,307.0,301.789,295.0,169800,309.5,289.5
694,2017/06/27,302.0,303.585,311.0,71400,311.0,298.0
695,2017/06/28,280.5,290.573,302.0,153400,302.5,279.5
696,2017/06/29,286.0,283.594,281.5,80600,290.0,281.5
697,2017/06/30,281.0,282.381,284.0,29400,284.5,280.5
698,2017/07/03,290.0,283.59,283.0,36800,290.5,278.5
699,2017/07/04,277.0,280.348,286.0,75800,290.5,275.0
700,2017/07/05,280.0,281.287,283.5,40800,284.0,278.5
701,2017/07/06,281.5,279.333,279.0,12000,281.5,279.0
702,2017/07/07,281.0,283.619,285.0,57800,290.5,279.5
703,2017/07/10,282.5,282.282,281.0,24800,285.0,280.5
704,2017/07/11,298.0,302.24,290.0,513400,319.5,288.5
705,2017/07/12,292.5,293.988,298.5,76200,298.5,291.0
706,2017/07/13,290.0,289.386,290.0,24600,292.0,286.5
707,2017/07/14,285.0,286.739,290.5,36400,291.0,285.0
708,2017/07/18,282.5,284.286,287.0,22400,287.0,282.5
709,2017/07/19,282.0,282.329,282.0,15800,284.0,281.0
710,2017/07/20,287.0,286.628,287.0,25800,288.5,284.5
711,2017/07/21,286.5,285.008,284.5,13000,287.0,284.5
712,2017/07/24,284.0,284.364,286.0,17600,286.0,283.0
713,2017/07/25,285.0,285.589,282.5,22400,287.5,282.5
714,2017/07/26,290.0,287.394,285.5,23600,290.0,285.5
715,2017/07/27,285.0,287.704,290.0,25000,290.5,285.0
716,2017/07/28,284.5,285.271,285.5,14400,287.5,283.5
717,2017/07/31,278.0,279.784,282.5,31000,283.0,276.0
718,2017/08/01,270.5,272.469,274.0,28600,277.0,269.5
719,2017/08/02,274.0,272.94,272.5,56600,281.5,269.0
720,2017/08/03,274.0,273.477,274.0,13000,275.0,271.5
721,2017/08/04,283.0,277.828,271.0,23800,283.0,271.0
722,2017/08/07,281.0,280.39,281.0,8200,282.5,278.5
723,2017/08/08,280.0,280.614,280.0,4400,283.5,279.0
724,2017/08/09,280.5,278.436,278.5,9400,282.5,277.0
725,2017/08/10,281.0,280.771,279.5,24400,286.0,276.5
726,2017/08/14,271.5,270.552,275.0,32800,278.0,264.5
727,2017/08/15,282.0,274.257,271.5,30000,282.0,267.0
728,2017/08/16,278.5,278.543,282.0,7000,282.0,276.0
729,2017/08/17,279.0,279.63,279.5,5400,281.5,277.5
730,2017/08/18,275.0,276.515,277.5,13400,279.0,274.5
731,2017/08/21,285.0,294.864,281.5,534200,312.0,279.5
732,2017/08/22,311.5,306.397,285.0,664600,318.0,282.0
733,2017/08/23,303.5,297.365,309.0,340600,309.0,289.5
734,2017/08/24,296.5,297.575,296.5,74200,301.5,295.0
735,2017/08/25,290.0,291.977,294.0,64200,294.5,288.5
736,2017/08/28,294.0,291.53,288.5,63600,295.5,287.0
737,2017/08/29,297.5,293.863,289.5,83800,298.0,286.5
738,2017/08/30,298.0,298.317,297.5,30600,300.0,295.0
739,2017/08/31,312.5,310.637,298.0,346800,330.0,298.0
740,2017/09/01,324.0,318.583,315.5,189000,324.0,312.5
741,2017/09/04,340.5,341.649,324.0,975600,362.5,315.5
742,2017/09/05,304.5,323.199,336.5,504200,340.5,303.5
743,2017/09/06,309.5,302.443,301.5,172400,310.0,294.0
744,2017/09/07,307.5,307.967,314.5,116600,317.5,302.0
745,2017/09/08,303.5,304.338,307.5,52400,309.0,300.5
746,2017/09/11,314.5,311.449,309.5,155000,316.5,308.0
747,2017/09/12,315.5,315.3,317.5,75400,317.5,313.0
748,2017/09/13,330.0,320.457,315.5,150600,331.0,310.5
749,2017/09/14,312.5,321.586,335.0,284200,336.5,308.5
750,2017/09/15,315.0,313.679,309.0,75800,320.0,308.0
751,2017/09/19,325.5,320.43,319.5,139600,328.5,315.0
752,2017/09/20,327.5,328.152,325.0,151200,335.5,321.5
753,2017/09/21,327.0,327.707,330.5,85600,331.5,324.0
754,2017/09/22,321.5,319.458,326.0,80800,326.0,315.0
755,2017/09/25,319.0,319.301,317.0,85000,323.0,317.0
756,2017/09/26,320.0,320.974,316.5,65000,326.0,316.5
757,2017/09/27,332.5,328.859,318.0,65200,332.5,318.0
758,2017/09/28,325.5,330.611,330.5,91800,338.5,325.0
759,2017/09/29,322.0,325.169,326.0,44400,330.0,321.0
760,2017/10/02,317.5,319.527,322.0,75400,324.5,314.0
761,2017/10/03,314.0,316.468,314.5,46200,320.0,314.0
762,2017/10/04,304.5,308.009,313.5,79000,313.5,302.5
763,2017/10/05,302.5,304.225,302.5,38600,306.5,302.5
764,2017/10/06,297.5,298.784,300.5,79600,302.5,295.0
765,2017/10/10,303.0,300.527,296.0,25800,303.0,296.0
766,2017/10/11,301.0,303.397,304.5,28200,310.0,300.0
767,2017/10/12,310.5,306.542,302.0,86400,310.5,302.0
768,2017/10/13,309.0,307.028,311.5,32000,312.0,305.0
769,2017/10/16,309.0,316.916,313.0,227200,328.5,309.0
770,2017/10/17,313.0,312.479,309.5,38000,316.0,309.5
771,2017/10/18,307.0,310.269,313.0,24200,313.5,305.5
772,2017/10/19,307.0,307.044,307.0,18200,309.5,305.5
773,2017/10/20,299.0,301.608,306.5,55600,306.5,298.5
774,2017/10/23,305.0,304.075,302.0,26600,307.0,301.5
775,2017/10/24,312.0,311.366,310.0,46200,316.0,304.5
776,2017/10/25,312.5,311.163,310.0,30600,314.0,309.5
777,2017/10/26,318.5,313.41,310.5,64400,320.0,308.5
778,2017/10/27,317.5,317.694,319.0,44400,322.5,314.5
779,2017/10/30,320.0,318.318,317.0,44600,322.5,314.0
780,2017/10/31,324.5,320.827,319.5,40400,324.5,314.5
781,2017/11/01,322.0,321.826,322.5,53400,324.5,319.0
782,2017/11/02,315.5,317.111,320.5,21600,320.5,314.0
783,2017/11/06,309.5,309.765,310.5,56200,313.5,305.0
784,2017/11/07,308.5,303.241,306.5,57600,309.0,297.5
785,2017/11/08,358.5,358.5,358.5,101600,358.5,358.5
786,2017/11/09,395.0,406.569,403.5,3163800,430.0,376.0
787,2017/11/10,410.0,406.788,390.5,1465400,422.5,381.0
788,2017/11/13,405.0,414.216,411.0,889400,433.5,394.5
789,2017/11/14,409.0,406.793,401.5,273800,417.5,396.0
790,2017/11/15,422.0,414.776,412.5,456400,426.0,400.5
791,2017/11/16,417.0,416.538,414.5,240600,423.5,411.0
792,2017/11/17,435.0,426.873,418.5,316600,439.0,418.0
793,2017/11/20,439.5,444.399,427.5,481600,464.5,427.5
794,2017/11/21,449.5,435.625,436.5,188600,449.5,420.5
795,2017/11/22,505.0,493.385,464.5,1143400,519.5,458.0
796,2017/11/24,495.5,500.279,500.0,461200,519.0,488.0
797,2017/11/27,474.0,497.961,488.0,459800,543.5,474.0
798,2017/11/28,483.0,474.174,463.5,194200,487.5,461.5
799,2017/11/29,488.5,494.188,476.0,265600,512.5,476.0
800,2017/11/30,516.5,500.079,488.0,168000,519.5,480.5
801,2017/12/01,552.0,533.361,514.0,280400,565.0,508.5
802,2017/12/04,487.0,520.143,555.5,330600,558.0,486.5
803,2017/12/05,462.5,463.15,464.5,394000,483.0,450.0
804,2017/12/06,450.0,452.926,460.0,289200,471.5,432.0
805,2017/12/07,458.5,463.16,450.5,156600,472.0,450.5
806,2017/12/08,463.0,456.018,461.0,95800,464.0,448.0
807,2017/12/11,468.5,466.027,467.0,84200,471.0,460.5
808,2017/12/12,478.0,483.49,461.0,321000,499.5,461.0
809,2017/12/13,468.0,467.816,470.5,109000,477.0,462.5
810,2017/12/14,483.5,477.261,468.5,52400,484.5,468.5
811,2017/12/15,455.5,470.225,485.0,123800,488.5,455.0
812,2017/12/18,446.0,449.892,460.5,192400,467.5,439.5
813,2017/12/19,450.5,446.981,442.0,56800,453.0,442.0
814,2017/12/20,482.5,468.847,452.5,168000,484.5,450.5
815,2017/12/21,490.0,482.593,478.0,146800,490.5,472.5
816,2017/12/22,483.0,482.714,490.0,71400,490.5,474.0
817,2017/12/25,476.5,480.015,481.0,32400,487.5,476.0
818,2017/12/26,482.5,483.669,476.0,117400,492.0,471.0
819,2017/12/27,487.5,487.281,481.5,56600,495.0,481.0
820,2017/12/28,484.0,483.06,485.0,70400,490.5,475.0
821,2017/12/29,482.5,480.364,481.5,40400,485.0,475.5
822,2018/01/04,475.0,474.751,482.5,79200,485.0,465.5
823,2018/01/05,479.5,476.536,475.0,30600,482.0,471.5
824,2018/01/09,510.0,502.641,484.0,134800,516.0,482.5
825,2018/01/10,509.5,514.164,512.0,74400,525.5,504.5
826,2018/01/11,502.5,505.746,503.0,70000,515.5,495.0
827,2018/01/12,494.5,495.695,500.0,49200,502.0,490.0
828,2018/01/15,500.5,499.604,492.0,49200,505.0,492.0
829,2018/01/16,495.0,492.807,500.5,48200,500.5,487.5
830,2018/01/17,516.0,503.6,494.5,65200,517.5,487.0
831,2018/01/18,499.0,510.515,516.0,85400,534.0,490.5
832,2018/01/19,532.0,520.309,501.0,113800,542.0,501.0
833,2018/01/22,592.0,578.313,547.0,398000,615.0,547.0
834,2018/01/23,582.5,581.518,592.5,125000,592.5,566.5
835,2018/01/24,570.0,575.788,588.0,87600,589.0,563.5
836,2018/01/25,621.0,604.866,570.5,260000,628.5,561.5
837,2018/01/26,641.0,641.435,640.0,321800,665.0,625.0
838,2018/01/29,618.5,632.318,656.0,156800,659.5,609.5
839,2018/01/30,601.5,603.108,608.5,133800,617.5,592.5
840,2018/01/31,588.5,602.44,590.0,93800,640.5,581.0
841,2018/02/01,580.0,583.694,590.5,104600,604.0,570.0
842,2018/02/02,575.0,577.417,580.0,80800,588.5,565.0
843,2018/02/05,589.0,570.627,553.5,102200,590.0,550.5
844,2018/02/06,523.5,524.754,544.0,212600,561.5,480.0
845,2018/02/07,522.5,559.619,598.5,158000,598.5,505.0
846,2018/02/08,565.5,548.048,515.0,131400,566.5,515.0
847,2018/02/09,621.0,600.934,550.5,497600,635.0,550.5
848,2018/02/13,620.5,616.502,627.0,188000,643.0,592.0
849,2018/02/14,556.5,582.618,620.0,193800,640.0,540.5
850,2018/02/15,603.0,590.459,569.0,120800,614.0,569.0
851,2018/02/16,664.0,650.169,603.5,356200,672.0,603.5
852,2018/02/19,721.0,704.261,700.0,265200,724.0,681.0
853,2018/02/20,788.5,759.621,717.0,330800,792.5,717.0
854,2018/02/21,706.5,723.364,748.5,533800,754.0,702.5
855,2018/02/22,712.5,694.874,699.0,189600,720.5,677.0
856,2018/02/23,710.0,701.129,697.5,111200,714.0,686.0
857,2018/02/26,730.0,727.251,712.5,230800,741.0,712.0
858,2018/02/27,730.0,741.735,759.0,421800,765.0,708.5
859,2018/02/28,721.0,718.576,715.0,165000,745.0,699.0
860,2018/03/01,707.0,712.983,708.0,109000,724.0,702.0
861,2018/03/02,699.5,693.281,687.5,110800,710.0,681.5
862,2018/03/05,649.5,669.369,706.0,133600,709.0,646.0
863,2018/03/06,695.0,678.598,662.0,65000,698.5,661.5
864,2018/03/07,669.5,675.958,680.5,56800,694.5,660.5
865,2018/03/08,690.5,684.016,670.5,63600,697.5,670.5
866,2018/03/09,698.0,695.147,691.5,62000,703.5,680.5
867,2018/03/12,673.5,688.188,706.0,107200,713.5,660.5
868,2018/03/13,670.5,665.493,663.5,56600,682.0,657.0
869,2018/03/14,660.5,655.692,658.0,67200,665.0,651.5
870,2018/03/15,640.0,639.967,654.0,115200,655.0,618.5
871,2018/03/16,638.5,637.527,650.0,62400,650.0,627.5
872,2018/03/19,619.5,620.956,638.0,77200,638.0,605.5
873,2018/03/20,617.0,607.463,605.5,54000,619.0,600.0
874,2018/03/22,645.0,630.033,620.0,42600,645.0,614.5
875,2018/03/23,598.5,600.581,600.0,91600,613.5,593.5
876,2018/03/26,591.5,576.561,585.0,73800,591.5,562.0
877,2018/03/27,576.0,592.345,598.5,110600,605.5,576.0
878,2018/03/28,597.5,584.129,564.5,55000,597.5,562.5
879,2018/03/29,597.5,596.727,600.0,19400,604.0,587.0
880,2018/03/30,611.0,608.33,601.5,66000,619.0,595.5
881,2018/04/02,591.0,597.207,601.5,74400,610.5,589.0
882,2018/04/03,577.5,575.724,586.0,60200,590.0,570.0
883,2018/04/04,574.0,572.575,580.5,40000,580.5,566.0
884,2018/04/05,594.0,586.993,574.0,60400,600.0,568.0
885,2018/04/06,585.0,591.242,594.0,50800,598.0,584.0
886,2018/04/09,568.5,568.966,575.5,53600,579.0,565.0
887,2018/04/10,562.5,562.274,567.5,32800,568.5,555.0
888,2018/04/11,541.5,546.355,557.0,68400,557.0,540.0
889,2018/04/12,554.5,541.257,533.5,54000,557.0,532.0
890,2018/04/13,541.5,545.159,557.0,40200,559.5,537.0
891,2018/04/16,508.0,514.346,538.0,114600,538.0,495.0
892,2018/04/17,511.0,501.124,499.0,82000,512.5,490.5
893,2018/04/18,517.0,513.101,508.5,30800,517.5,507.0
894,2018/04/19,509.0,519.741,522.0,63200,537.5,508.5
895,2018/04/20,511.5,507.788,504.0,22200,517.0,501.5
896,2018/04/23,531.0,527.286,511.5,59000,535.0,511.5
897,2018/04/24,514.0,521.097,534.0,51400,534.0,510.5
898,2018/04/25,519.0,515.468,511.0,15600,521.0,509.0
899,2018/04/26,544.5,538.975,541.0,107200,549.0,530.5
900,2018/04/27,537.0,546.094,550.0,111200,557.5,535.5
901,2018/05/01,519.0,524.954,535.0,37200,535.0,518.5
902,2018/05/02,545.0,533.742,522.5,38800,545.0,522.5
903,2018/05/07,570.0,558.773,549.0,85600,572.0,545.5
904,2018/05/08,568.5,570.899,570.0,51400,577.5,565.0
905,2018/05/09,551.0,557.988,564.0,40000,564.0,551.0
906,2018/05/10,535.0,539.989,550.5,43600,550.5,533.5
907,2018/05/11,547.0,542.223,531.5,80200,555.5,526.0
908,2018/05/14,585.5,570.538,577.0,173800,591.5,550.5
909,2018/05/15,567.0,574.186,583.5,53800,583.5,563.0
910,2018/05/16,525.0,535.01,552.0,93400,552.0,524.0
911,2018/05/17,553.0,540.693,530.5,63800,562.0,522.5
912,2018/05/18,556.5,556.798,554.0,53400,567.5,545.5
913,2018/05/21,552.5,557.114,560.0,38600,565.5,550.0
914,2018/05/22,547.0,545.303,547.5,26400,549.0,541.0
915,2018/05/23,548.0,549.937,542.5,41000,564.0,542.5
916,2018/05/24,577.5,581.119,586.5,178800,588.5,571.0
917,2018/05/25,602.0,588.681,577.5,105000,602.0,577.5
918,2018/05/28,635.5,626.677,602.5,168200,645.0,602.5
919,2018/05/29,602.0,616.976,638.5,106200,639.0,600.0
920,2018/05/30,598.0,593.372,587.0,66200,613.5,571.0
921,2018/05/31,610.0,616.019,608.0,80400,633.5,598.0
922,2018/06/01,615.0,613.357,608.0,54400,625.0,600.0
923,2018/06/04,606.5,608.681,615.0,48200,620.0,601.5
924,2018/06/05,600.5,608.032,610.5,53400,620.0,600.0
925,2018/06/06,575.0,582.723,594.5,61800,594.5,569.0
926,2018/06/07,590.5,583.041,572.5,41800,591.0,572.5
927,2018/06/08,582.0,580.922,582.0,42400,587.0,573.0
928,2018/06/11,600.0,591.781,581.0,53800,610.5,579.0
929,2018/06/12,601.0,606.266,602.0,48200,614.5,597.0
930,2018/06/13,586.5,594.989,596.0,27800,604.0,586.5
931,2018/06/14,565.0,570.128,579.0,52200,581.0,564.0
932,2018/06/15,544.5,549.092,560.5,71600,562.5,537.5
933,2018/06/18,516.0,520.501,538.5,72400,538.5,512.5
934,2018/06/19,501.5,510.038,510.5,66600,524.0,501.0
935,2018/06/20,522.0,509.987,499.0,79600,542.5,490.0
936,2018/06/21,526.0,565.726,549.5,462400,600.5,526.0
937,2018/06/22,541.0,548.87,526.0,123800,567.5,522.0
938,2018/06/25,509.5,519.806,536.0,61800,536.0,507.5
939,2018/06/26,507.5,503.73,499.5,56000,514.0,496.0
940,2018/06/27,504.0,507.546,513.5,21800,513.5,503.0
941,2018/06/28,499.0,495.576,500.5,60800,502.5,489.5
942,2018/06/29,498.5,493.775,496.5,28000,499.0,490.5
943,2018/07/02,490.5,498.02,500.5,35600,505.0,490.5
944,2018/07/03,479.5,479.675,490.5,78200,498.0,469.0
945,2018/07/04,467.5,471.028,476.0,40000,477.5,465.5
946,2018/07/05,459.0,460.101,462.5,73400,467.5,451.0
947,2018/07/06,479.5,471.646,465.0,53600,484.0,460.5
948,2018/07/09,475.5,476.972,480.0,28600,481.5,473.0
949,2018/07/10,486.0,484.273,482.0,26000,488.0,477.0
950,2018/07/11,473.0,474.807,481.5,25400,484.0,470.0
951,2018/07/12,480.0,475.862,474.0,24600,483.5,469.5
952,2018/07/13,480.0,486.729,483.5,23600,491.0,480.0
953,2018/07/17,472.0,476.693,487.5,26400,487.5,470.0
954,2018/07/18,480.0,476.835,470.0,18200,482.0,470.0
955,2018/07/19,485.0,480.431,476.5,20400,485.0,476.5
956,2018/07/20,477.5,480.58,480.0,13800,486.5,477.5
957,2018/07/23,475.5,477.626,484.0,22200,484.0,472.0
958,2018/07/24,480.0,482.061,477.0,11400,488.5,475.5
959,2018/07/25,484.0,483.658,487.5,18400,487.5,480.0
960,2018/07/26,502.0,497.71,491.5,63400,512.5,486.0
961,2018/07/27,505.0,508.395,503.5,40000,518.0,501.0
962,2018/07/30,485.5,492.337,505.5,31800,513.5,480.5
963,2018/07/31,482.0,481.639,485.5,16600,485.5,478.0
964,2018/08/01,483.5,482.302,484.5,11600,485.0,480.0
965,2018/08/02,477.5,479.978,483.5,23200,485.0,474.0
966,2018/08/03,469.5,471.705,481.5,35600,481.5,468.5
967,2018/08/06,470.0,470.9,469.5,17000,474.5,468.5
968,2018/08/07,473.0,472.514,475.0,14800,475.5,470.5
969,2018/08/08,488.0,488.126,473.5,70400,502.5,473.0
970,2018/08/09,533.5,529.512,524.0,240000,559.5,505.5
971,2018/08/10,534.5,545.42,530.0,105800,565.0,527.5
972,2018/08/13,516.0,520.829,525.0,62000,527.5,515.0
973,2018/08/14,537.5,538.405,522.5,72600,549.5,522.0
974,2018/08/15,543.5,545.641,536.0,41200,555.5,533.0
975,2018/08/16,555.5,543.863,539.0,67000,558.5,530.0
976,2018/08/17,580.0,563.678,555.0,118800,588.5,545.5
977,2018/08/20,579.0,578.501,588.5,68400,594.0,563.5
978,2018/08/21,549.0,553.426,572.0,79400,574.0,542.0
979,2018/08/22,559.5,553.314,540.0,26400,561.5,540.0
980,2018/08/23,564.5,559.572,561.5,29000,564.5,552.0
981,2018/08/24,562.0,561.074,558.5,17600,566.5,554.5
982,2018/08/27,600.0,579.783,550.5,109800,604.5,550.5
983,2018/08/28,587.0,592.306,600.0,38200,602.0,582.5
984,2018/08/29,589.5,590.23,586.5,14800,597.5,583.0
985,2018/08/30,584.0,581.264,587.5,42400,588.0,575.0
986,2018/08/31,579.5,577.475,570.0,23800,584.5,570.0
987,2018/09/03,556.0,562.018,573.5,32600,574.0,555.5
988,2018/09/04,559.0,559.759,556.0,39800,566.5,552.5
989,2018/09/05,545.5,549.947,563.0,32000,563.5,542.0
990,2018/09/06,525.0,529.199,535.5,54400,535.5,524.5
991,2018/09/07,518.0,516.695,524.5,23600,524.5,513.0
992,2018/09/10,519.5,517.805,517.5,8200,519.5,514.5
993,2018/09/11,521.0,516.731,518.0,26400,521.0,513.0
994,2018/09/12,522.0,526.655,524.0,25800,536.0,522.0
995,2018/09/13,526.5,525.244,522.5,18000,529.0,522.5
996,2018/09/14,546.0,542.515,528.0,53600,554.5,528.0
997,2018/09/18,561.0,555.678,542.0,45600,567.5,541.0
998,2018/09/19,552.5,562.898,561.0,28400,570.5,552.0
999,2018/09/20,557.0,548.529,553.0,13600,557.0,545.0
1000,2018/09/21,556.0,556.756,554.0,26200,566.0,552.0
1001,2018/09/25,552.5,553.878,555.5,9000,558.0,551.5
1002,2018/09/26,570.0,565.248,552.0,32600,570.0,552.0
1003,2018/09/27,559.0,561.004,571.5,23200,571.5,557.5
1004,2018/09/28,561.5,560.781,559.5,11400,562.5,557.5
1005,2018/10/01,563.5,563.416,567.5,19000,567.5,561.0
1006,2018/10/02,555.0,558.554,563.5,37200,564.5,553.0
1007,2018/10/03,543.0,541.561,553.5,52200,553.5,532.0
1008,2018/10/04,543.0,543.618,542.0,6800,546.5,541.0
1009,2018/10/05,555.0,549.299,541.0,27800,561.0,539.5
1010,2018/10/09,576.0,563.259,553.5,73400,581.5,548.0
1011,2018/10/10,592.5,588.346,582.5,90200,606.0,569.0
1012,2018/10/11,576.0,554.664,541.0,112400,579.0,541.0
1013,2018/10/12,611.0,585.967,570.0,57200,611.0,555.5
1014,2018/10/15,607.0,611.26,623.0,58000,623.5,598.0
1015,2018/10/16,613.0,617.14,605.0,58600,630.0,602.0
1016,2018/10/17,615.0,621.213,626.0,32400,626.0,615.0
1017,2018/10/18,644.5,630.336,616.0,73600,650.0,610.5
1018,2018/10/19,659.5,650.943,631.0,67200,663.5,627.5
1019,2018/10/22,683.0,668.794,664.0,41800,684.0,655.5
1020,2018/10/23,668.0,674.933,689.5,170400,697.5,642.5
1021,2018/10/24,675.0,670.287,655.5,82600,695.0,641.0
1022,2018/10/25,698.5,680.112,638.0,187000,708.0,636.5
1023,2018/10/26,660.0,667.557,707.0,238800,730.0,622.0
1024,2018/10/29,654.0,636.482,658.0,176600,659.5,610.0
1025,2018/10/30,705.0,681.248,646.0,138000,708.5,638.0
1026,2018/10/31,745.0,743.049,704.0,236800,758.5,704.0
1027,2018/11/01,734.5,735.437,737.0,162200,759.5,711.0
1028,2018/11/02,742.5,738.559,733.5,94600,750.0,721.5
1029,2018/11/05,703.0,711.514,709.5,130600,734.5,700.0
1030,2018/11/06,710.0,705.129,698.5,77000,729.5,690.5
1031,2018/11/07,716.5,707.544,704.0,54200,722.0,693.5
1032,2018/11/08,767.5,758.138,731.5,210200,793.5,722.0
1033,2018/11/09,784.0,801.259,806.5,406000,825.0,773.5
1034,2018/11/12,836.5,834.48,767.5,386600,859.0,767.0
1035,2018/11/13,900.0,874.48,832.0,423400,915.0,815.5
1036,2018/11/14,887.5,885.798,895.0,230800,904.5,862.0
1037,2018/11/15,861.0,862.226,870.0,221400,888.0,835.0
1038,2018/11/16,784.5,815.761,876.5,367800,876.5,784.0
1039,2018/11/19,838.0,812.849,784.5,309800,841.0,783.0
1040,2018/11/20,835.0,827.538,815.0,111000,854.5,808.0
1041,2018/11/21,843.5,830.063,819.0,131200,845.0,801.5
1042,2018/11/22,850.0,839.308,843.5,141600,853.5,818.5
1043,2018/11/26,848.0,852.018,867.5,198200,888.0,830.5
1044,2018/11/27,844.5,838.164,852.0,166800,859.0,820.5
1045,2018/11/28,846.0,839.586,850.0,134200,853.5,821.0
1046,2018/11/29,903.0,894.153,854.5,457800,925.0,845.0
1047,2018/11/30,941.0,918.034,916.0,255600,942.0,891.5
1048,2018/12/03,993.0,978.2,950.0,336800,994.5,945.5
1049,2018/12/04,965.0,966.024,980.0,212400,991.0,951.5
1050,2018/12/05,998.0,992.836,950.0,398800,1013.5,937.5
1051,2018/12/06,980.0,966.259,980.5,364800,1002.5,930.0
1052,2018/12/07,1000.0,997.972,999.0,203800,1016.0,972.5
1053,2018/12/10,947.5,958.153,984.5,301800,989.5,937.5
1054,2018/12/11,948.5,957.905,967.5,247800,982.5,940.0
1055,2018/12/12,948.5,920.618,952.0,500800,952.0,881.0
1056,2018/12/13,922.5,938.718,952.5,365600,975.0,914.0
1057,2018/12/14,905.0,912.006,937.5,222400,944.0,890.0
1058,2018/12/17,809.0,838.095,885.0,438800,897.0,808.0
1059,2018/12/18,795.0,791.22,777.0,364200,824.5,771.0
1060,2018/12/19,754.0,773.944,779.0,322400,802.5,752.5
1061,2018/12/20,728.0,736.739,754.0,328000,765.0,715.0
1062,2018/12/21,690.5,687.185,722.5,459400,728.0,655.5
1063,2018/12/25,724.5,701.111,690.0,394400,733.0,664.0
1064,2018/12/26,767.0,767.133,733.0,553600,796.5,728.5
1065,2018/12/27,798.5,796.617,807.0,455600,813.0,775.0
1066,2018/12/28,730.0,748.784,783.5,341400,794.0,716.5
1067,2019/01/04,724.0,707.697,716.5,236600,741.5,682.5
1068,2019/01/07,766.0,756.339,750.5,353400,784.5,726.0
1069,2019/01/08,826.5,826.398,806.0,608000,847.5,790.0
1070,2019/01/09,818.5,825.148,843.0,504200,855.0,805.5
1071,2019/01/10,785.5,795.932,802.0,248800,810.5,783.0
1072,2019/01/11,826.0,823.69,799.5,356800,838.0,799.5
1073,2019/01/15,844.0,836.079,825.0,313400,859.5,810.0
1074,2019/01/16,924.0,893.182,850.5,878800,932.5,844.5
1075,2019/01/17,917.5,920.237,930.0,620600,938.0,900.0
1076,2019/01/18,901.5,914.955,930.0,315400,930.0,900.0
1077,2019/01/21,892.0,921.724,922.5,511000,960.0,892.0
1078,2019/01/22,915.5,895.04,890.0,334200,924.5,861.5
1079,2019/01/23,920.0,910.68,900.0,192400,922.5,890.0
1080,2019/01/24,939.0,936.104,911.0,309400,957.0,910.0
1081,2019/01/25,976.5,969.438,948.0,333000,983.0,940.0
1082,2019/01/28,930.5,953.6,965.0,319000,990.0,927.0
1083,2019/01/29,910.0,902.52,918.0,274600,918.0,882.5
1084,2019/01/30,875.5,893.607,901.5,336400,921.0,867.5
1085,2019/01/31,848.0,866.18,881.0,284000,895.0,843.5
1086,2019/02/01,789.0,810.213,851.5,506800,855.0,787.5
1087,2019/02/04,854.0,828.754,790.0,395400,861.5,777.5
1088,2019/02/05,847.5,860.786,862.5,304200,877.0,845.5
1089,2019/02/06,865.5,847.253,852.0,250800,868.0,825.5
1090,2019/02/07,840.0,846.545,865.5,233800,877.5,832.5
1091,2019/02/08,812.5,797.833,825.5,388200,825.5,770.0
1092,2019/02/12,812.0,744.147,731.5,873200,812.0,707.5
1093,2019/02/13,780.5,773.129,793.0,504600,793.0,755.5
1094,2019/02/14,745.0,760.779,788.5,371000,789.5,745.0
1095,2019/02/15,722.0,725.95,734.5,357400,742.0,715.5
1096,2019/02/18,725.0,726.994,737.0,242600,744.0,713.5
1097,2019/02/19,740.5,732.005,724.5,256600,741.5,720.5
1098,2019/02/20,763.5,763.611,741.5,385600,778.5,739.5
1099,2019/02/21,747.5,751.173,763.5,277200,764.5,736.5
1100,2019/02/22,755.5,740.373,752.5,471800,757.5,722.5
1101,2019/02/25,756.5,762.495,772.5,396600,784.0,745.0
1102,2019/02/26,733.0,743.918,756.5,305800,765.5,730.5
1103,2019/02/27,761.5,751.976,735.0,290000,767.0,725.5
1104,2019/02/28,729.0,742.097,762.0,296800,762.0,728.5
1105,2019/03/01,754.0,749.525,744.0,431000,760.0,739.5
1106,2019/03/04,751.0,749.762,755.0,152200,757.5,741.5
1107,2019/03/05,753.0,751.457,747.0,114800,757.5,745.0
1108,2019/03/06,771.5,763.728,753.0,208800,775.0,749.0
1109,2019/03/07,787.5,772.17,764.0,174600,787.5,755.5
1110,2019/03/08,742.5,755.768,767.5,444600,792.0,735.5
1111,2019/03/11,725.0,721.584,737.0,266000,746.5,700.0
1112,2019/03/12,716.0,721.577,728.5,168400,735.0,716.0
1113,2019/03/13,722.5,715.137,708.5,104000,725.5,708.0
1114,2019/03/14,730.0,720.546,721.0,102400,731.5,710.5
1115,2019/03/15,739.0,733.657,726.5,77800,744.0,723.0
1116,2019/03/18,762.0,755.109,754.5,158400,762.0,742.5
1117,2019/03/19,751.5,753.63,764.5,89800,764.5,745.5
1118,2019/03/20,745.0,754.802,747.5,194200,771.0,745.0
1119,2019/03/22,742.0,738.728,750.0,147200,757.0,725.5
1120,2019/03/25,739.0,724.885,715.5,167400,744.0,703.5
1121,2019/03/26,721.5,728.286,738.0,147800,742.5,720.5
1122,2019/03/27,781.0,765.006,732.0,299300,786.0,726.0
1123,2019/03/28,757.0,761.841,766.0,113000,776.0,752.0
1124,2019/03/29,739.0,747.177,758.0,99800,766.0,737.0
1125,2019/04/01,739.0,737.187,745.0,104900,751.0,726.0
1126,2019/04/02,754.0,748.225,746.0,187000,760.0,732.0
1127,2019/04/03,768.0,771.34,756.0,287000,787.0,748.0
1128,2019/04/04,750.0,775.768,778.0,476200,812.0,747.0
1129,2019/04/05,758.0,754.203,753.0,154200,768.0,744.0
1130,2019/04/08,754.0,759.02,772.0,159200,774.0,745.0
1131,2019/04/09,722.0,731.715,746.0,244300,751.0,715.0
1132,2019/04/10,722.0,722.477,716.0,144100,737.0,706.0
1133,2019/04/11,717.0,718.877,725.0,118500,734.0,712.0
1134,2019/04/12,719.0,718.375,720.0,108700,729.0,711.0
1135,2019/04/15,729.0,724.074,721.0,58200,734.0,715.0
1136,2019/04/16,732.0,732.92,729.0,80700,740.0,726.0
1137,2019/04/17,738.0,729.655,730.0,87200,739.0,721.0
1138,2019/04/18,713.0,721.256,739.0,110900,741.0,713.0
1139,2019/04/19,718.0,719.213,716.0,62900,727.0,713.0
1140,2019/04/22,705.0,708.204,715.0,121400,720.0,701.0
1141,2019/04/23,689.0,690.839,691.0,133900,701.0,681.0
1142,2019/04/24,680.0,682.848,683.0,65900,687.0,680.0
1143,2019/04/25,678.0,675.603,680.0,110700,694.0,661.0
1144,2019/04/26,671.0,667.545,681.0,84200,681.0,658.0
1145,2019/05/07,686.0,681.326,671.0,73100,693.0,665.0
1146,2019/05/08,674.0,673.217,672.0,29000,680.0,667.0
1147,2019/05/09,661.0,661.007,672.0,92800,673.0,654.0
1148,2019/05/10,647.0,651.209,656.0,226100,680.0,631.0
1149,2019/05/13,635.0,637.142,639.0,121700,655.0,621.0
1150,2019/05/14,614.0,606.352,601.0,188700,622.0,594.0
1151,2019/05/15,644.0,638.587,614.0,185600,666.0,613.0
1152,2019/05/16,619.0,623.706,634.0,85000,642.0,609.0
1153,2019/05/17,635.0,623.93,609.0,92500,640.0,607.0
1154,2019/05/20,676.0,662.793,649.0,97000,679.0,645.0
1155,2019/05/21,670.0,676.222,690.0,104900,690.0,657.0
1156,2019/05/22,663.0,669.34,670.0,57000,683.0,659.0
1157,2019/05/23,651.0,650.38,654.0,86300,663.0,641.0
1158,2019/05/24,652.0,654.949,642.0,48500,668.0,642.0
1159,2019/05/27,648.0,652.72,652.0,64300,668.0,647.0
1160,2019/05/28,667.0,658.78,645.0,104100,668.0,645.0
1161,2019/05/29,665.0,668.846,668.0,216900,680.0,657.0
1162,2019/05/30,635.0,644.373,658.0,126300,662.0,633.0
1163,2019/05/31,620.0,625.544,632.0,104500,640.0,614.0
1164,2019/06/03,561.0,585.415,604.0,220800,615.0,561.0
1165,2019/06/04,532.0,541.471,568.0,321600,576.0,525.0
1166,2019/06/05,563.0,567.364,541.0,295500,594.0,537.0
1167,2019/06/06,558.0,562.392,560.0,84600,577.0,549.0
1168,2019/06/07,573.0,571.589,561.0,72200,585.0,556.0
1169,2019/06/10,582.0,578.951,573.0,83200,591.0,564.0
1170,2019/06/11,609.0,594.322,573.0,81300,609.0,573.0
1171,2019/06/12,599.0,603.176,613.0,88600,614.0,595.0
1172,2019/06/13,604.0,603.48,596.0,53700,614.0,592.0
1173,2019/06/14,628.0,616.882,602.0,62500,628.0,598.0
1174,2019/06/17,609.0,617.713,639.0,112800,641.0,605.0
1175,2019/06/18,589.0,596.038,607.0,83400,616.0,583.0
1176,2019/06/19,595.0,598.613,595.0,48800,606.0,593.0
1177,2019/06/20,620.0,613.681,600.0,75900,623.0,596.0
1178,2019/06/21,603.0,611.94,628.0,52000,628.0,600.0
1179,2019/06/24,588.0,592.271,598.0,39100,604.0,584.0
1180,2019/06/25,566.0,572.884,583.0,46500,592.0,562.0
1181,2019/06/26,573.0,568.991,561.0,45800,576.0,558.0
1182,2019/06/27,586.0,578.096,574.0,32200,586.0,573.0
1183,2019/06/28,580.0,583.217,589.0,23100,590.0,578.0
1184,2019/07/01,599.0,601.454,600.0,56000,609.0,593.0
1185,2019/07/02,601.0,599.048,603.0,47600,604.0,590.0
1186,2019/07/03,609.0,602.756,599.0,37300,609.0,596.0
1187,2019/07/04,627.0,618.403,609.0,48400,627.0,608.0
1188,2019/07/05,631.0,630.739,636.0,56000,637.0,624.0
1189,2019/07/08,618.0,624.943,629.0,40400,631.0,618.0
1190,2019/07/09,607.0,612.253,611.0,17400,619.0,605.0
1191,2019/07/10,628.0,619.257,606.0,55200,632.0,597.0
1192,2019/07/11,634.0,630.431,634.0,29700,635.0,624.0
1193,2019/07/12,620.0,627.344,632.0,38700,632.0,617.0
1194,2019/07/16,627.0,618.118,617.0,55300,627.0,608.0
1195,2019/07/17,636.0,628.166,625.0,56600,639.0,615.0
1196,2019/07/18,635.0,638.124,630.0,68500,644.0,629.0
1197,2019/07/19,648.0,645.121,640.0,57000,653.0,638.0
1198,2019/07/22,646.0,645.253,650.0,36000,650.0,637.0
1199,2019/07/23,669.0,656.494,644.0,111300,669.0,644.0
1200,2019/07/24,658.0,664.759,670.0,57200,672.0,658.0
1201,2019/07/25,678.0,669.281,665.0,67000,680.0,658.0
1202,2019/07/26,690.0,682.509,671.0,110700,692.0,664.0
1203,2019/07/29,700.0,700.134,692.0,82200,706.0,692.0
1204,2019/07/30,699.0,696.304,695.0,51600,704.0,687.0
1205,2019/07/31,680.0,685.828,690.0,59900,691.0,680.0
1206,2019/08/01,695.0,688.373,680.0,52300,696.0,680.0
1207,2019/08/02,692.0,680.313,680.0,54600,693.0,671.0
1208,2019/08/05,665.0,662.692,682.0,66600,683.0,647.0
1209,2019/08/06,657.0,642.77,625.0,105700,668.0,625.0
1210,2019/08/07,635.0,649.266,657.0,41000,662.0,635.0
1211,2019/08/08,641.0,631.639,639.0,53800,644.0,621.0
1212,2019/08/09,580.0,565.493,561.0,288500,590.0,545.0
1213,2019/08/13,577.0,576.22,565.0,86100,602.0,560.0
1214,2019/08/14,572.0,575.962,580.0,36700,592.0,568.0
1215,2019/08/15,562.0,562.883,560.0,40200,574.0,555.0
1216,2019/08/16,578.0,575.752,560.0,47600,590.0,560.0
1217,2019/08/19,569.0,570.394,576.0,35500,576.0,566.0
1218,2019/08/20,569.0,568.615,570.0,49100,579.0,554.0
1219,2019/08/21,586.0,576.415,569.0,33500,587.0,566.0
1220,2019/08/22,572.0,578.694,586.0,40200,593.0,570.0
1221,2019/08/23,582.0,572.716,569.0,43000,587.0,561.0
