,Date,Close,VWAP,Open,Volume,High,Low
0,2014/08/25,555.0,558.002,549.0,181800,574.0,542.0
1,2014/08/26,556.0,556.458,560.0,47600,560.0,554.0
2,2014/08/27,557.0,558.486,556.0,110300,567.0,550.0
3,2014/08/28,550.0,549.431,551.0,68400,552.0,547.0
4,2014/08/29,553.0,548.209,554.0,91300,557.0,544.0
5,2014/09/01,560.0,556.998,559.0,78900,563.0,554.0
6,2014/09/02,554.0,557.821,562.0,42000,562.0,554.0
7,2014/09/03,552.0,550.843,552.0,42000,555.0,545.0
8,2014/09/04,546.0,550.149,551.0,37700,555.0,546.0
9,2014/09/05,541.0,542.767,546.0,74200,547.0,541.0
10,2014/09/08,544.0,543.538,542.0,34000,549.0,540.0
11,2014/09/09,545.0,547.545,550.0,72300,551.0,543.0
12,2014/09/10,541.0,541.331,546.0,47200,546.0,538.0
13,2014/09/11,548.0,546.718,540.0,48200,553.0,538.0
14,2014/09/12,547.0,547.538,549.0,55400,552.0,545.0
15,2014/09/16,547.0,556.554,560.0,190900,566.0,547.0
16,2014/09/17,549.0,548.807,550.0,40400,553.0,545.0
17,2014/09/18,554.0,551.713,548.0,57900,557.0,547.0
18,2014/09/19,594.0,593.172,604.0,2489600,616.0,572.0
19,2014/09/22,581.0,588.89,604.0,448200,605.0,578.0
20,2014/09/24,559.0,563.956,572.0,246000,572.0,557.0
21,2014/09/25,563.0,569.264,579.0,268800,580.0,560.0
22,2014/09/26,554.0,558.302,556.0,154200,566.0,554.0
23,2014/09/29,547.0,551.008,553.0,154400,558.0,547.0
24,2014/09/30,547.0,547.374,546.0,188100,553.0,545.0
25,2014/10/01,536.0,547.727,557.0,231100,559.0,535.0
26,2014/10/02,515.0,517.129,518.0,294800,524.0,513.0
27,2014/10/03,541.0,531.812,517.0,148600,555.0,512.0
28,2014/10/06,535.0,536.47,541.0,48300,544.0,529.0
29,2014/10/07,527.0,530.89,532.0,47100,536.0,527.0
30,2014/10/08,518.0,518.296,518.0,57500,523.0,515.0
31,2014/10/09,506.0,513.507,517.0,105200,523.0,502.0
32,2014/10/10,481.0,487.612,487.0,323800,499.0,480.0
33,2014/10/14,471.0,475.947,472.0,205100,480.0,467.0
34,2014/10/15,470.0,465.525,471.0,256200,480.0,461.0
35,2014/10/16,461.0,462.328,452.0,179100,473.0,450.0
36,2014/10/17,447.0,451.129,464.0,226700,471.0,442.0
37,2014/10/20,475.0,465.661,459.0,70700,476.0,457.0
38,2014/10/21,464.0,463.085,472.0,62100,472.0,457.0
39,2014/10/22,471.0,467.412,467.0,42500,472.0,460.0
40,2014/10/23,481.0,483.969,475.0,169400,494.0,473.0
41,2014/10/24,478.0,481.111,482.0,64800,491.0,477.0
42,2014/10/27,479.0,477.26,481.0,30800,482.0,471.0
43,2014/10/28,482.0,474.756,471.0,46800,482.0,470.0
44,2014/10/29,480.0,479.744,482.0,33600,485.0,474.0
45,2014/10/30,490.0,507.815,520.0,708600,528.0,488.0
46,2014/10/31,479.0,480.903,492.0,174900,495.0,475.0
47,2014/11/04,480.0,483.261,485.0,106700,489.0,480.0
48,2014/11/05,489.0,484.946,480.0,70100,490.0,477.0
49,2014/11/06,483.0,489.157,490.0,71500,497.0,483.0
50,2014/11/07,494.0,489.862,485.0,50600,494.0,484.0
51,2014/11/10,494.0,492.413,496.0,30300,496.0,490.0
52,2014/11/11,488.0,489.838,496.0,52500,496.0,487.0
53,2014/11/12,485.0,487.813,491.0,52800,492.0,485.0
54,2014/11/13,485.0,481.935,487.0,87100,487.0,476.0
55,2014/11/14,484.0,487.521,493.0,63700,495.0,482.0
56,2014/11/17,474.0,484.911,480.0,172500,515.0,474.0
57,2014/11/18,475.0,476.395,473.0,66100,480.0,473.0
58,2014/11/19,472.0,474.243,479.0,76600,479.0,471.0
59,2014/11/20,468.0,471.672,475.0,64700,476.0,468.0
60,2014/11/21,472.0,469.948,468.0,55900,474.0,466.0
61,2014/11/25,480.0,478.739,476.0,151800,487.0,470.0
62,2014/11/26,492.0,487.005,483.0,149000,493.0,478.0
63,2014/11/27,485.0,491.559,494.0,93900,497.0,485.0
64,2014/11/28,483.0,487.834,496.0,109900,496.0,482.0
65,2014/12/01,490.0,486.481,483.0,113900,492.0,482.0
66,2014/12/02,485.0,488.628,490.0,108200,494.0,482.0
67,2014/12/03,477.0,481.952,485.0,127200,488.0,476.0
68,2014/12/04,474.0,475.889,475.0,61100,484.0,473.0
69,2014/12/05,477.0,477.262,480.0,142200,482.0,472.0
70,2014/12/08,472.0,474.404,472.0,79000,480.0,471.0
71,2014/12/09,468.0,470.147,471.0,55800,473.0,468.0
72,2014/12/10,465.0,464.928,461.0,73600,470.0,460.0
73,2014/12/11,463.0,460.619,460.0,72100,463.0,458.0
74,2014/12/12,462.0,462.41,463.0,55100,465.0,461.0
75,2014/12/15,458.0,458.619,459.0,70800,462.0,456.0
76,2014/12/16,448.0,451.525,454.0,96100,460.0,447.0
77,2014/12/17,443.0,442.393,440.0,215500,447.0,439.0
78,2014/12/18,443.0,446.648,444.0,106600,449.0,443.0
79,2014/12/19,453.0,465.667,448.0,512100,500.0,440.0
80,2014/12/22,444.0,444.79,449.0,138700,450.0,441.0
81,2014/12/24,434.0,439.418,441.0,165600,445.0,434.0
82,2014/12/25,421.0,426.752,431.0,345100,436.0,417.0
83,2014/12/26,432.0,440.111,445.0,315900,454.0,430.0
84,2014/12/29,441.0,439.596,441.0,104200,441.0,436.0
85,2014/12/30,440.0,443.2,447.0,79700,447.0,439.0
86,2015/01/05,451.0,445.696,446.0,95200,452.0,440.0
87,2015/01/06,443.0,445.17,447.0,33500,448.0,442.0
88,2015/01/07,441.0,444.038,447.0,44300,448.0,441.0
89,2015/01/08,443.0,441.454,442.0,58800,444.0,440.0
90,2015/01/09,440.0,439.865,441.0,49500,443.0,438.0
91,2015/01/13,440.0,440.046,438.0,56900,443.0,437.0
92,2015/01/14,438.0,437.769,438.0,56800,440.0,435.0
93,2015/01/15,439.0,435.173,435.0,47400,439.0,433.0
94,2015/01/16,426.0,428.576,431.0,77100,434.0,424.0
95,2015/01/19,430.0,428.18,426.0,77200,435.0,423.0
96,2015/01/20,425.0,426.441,432.0,62800,432.0,424.0
97,2015/01/21,427.0,425.27,424.0,168300,430.0,424.0
98,2015/01/22,428.0,426.439,428.0,26400,430.0,423.0
99,2015/01/23,424.0,424.821,429.0,45900,429.0,423.0
100,2015/01/26,422.0,422.561,422.0,41900,425.0,420.0
101,2015/01/27,420.0,421.871,422.0,32600,424.0,420.0
102,2015/01/28,428.0,423.533,420.0,48400,428.0,420.0
103,2015/01/29,420.0,422.128,425.0,34500,425.0,420.0
104,2015/01/30,423.0,421.494,420.0,50200,425.0,420.0
105,2015/02/02,421.0,422.656,423.0,24700,428.0,420.0
106,2015/02/03,413.0,417.63,422.0,103200,424.0,408.0
107,2015/02/04,412.0,412.347,415.0,37800,415.0,410.0
108,2015/02/05,404.0,407.686,409.0,56700,410.0,404.0
109,2015/02/06,405.0,402.551,402.0,65500,405.0,400.0
110,2015/02/09,401.0,402.808,405.0,46300,408.0,400.0
111,2015/02/10,410.0,407.867,404.0,30800,414.0,403.0
112,2015/02/12,432.0,426.825,429.0,317600,437.0,412.0
113,2015/02/13,418.0,419.102,424.0,32300,430.0,415.0
114,2015/02/16,394.0,397.539,405.0,235500,408.0,389.0
115,2015/02/17,395.0,397.838,396.0,57400,401.0,395.0
116,2015/02/18,396.0,396.97,398.0,32900,399.0,395.0
117,2015/02/19,405.0,405.55,408.0,79400,410.0,400.0
118,2015/02/20,404.0,404.817,407.0,34900,407.0,403.0
119,2015/02/23,404.0,406.59,407.0,37600,409.0,404.0
120,2015/02/24,408.0,408.449,408.0,44500,412.0,405.0
121,2015/02/25,402.0,404.151,409.0,54200,410.0,400.0
122,2015/02/26,401.0,401.962,403.0,36700,407.0,400.0
123,2015/02/27,401.0,401.724,402.0,29300,406.0,399.0
124,2015/03/02,402.0,401.9,402.0,21900,404.0,400.0
125,2015/03/03,403.0,400.939,402.0,67400,405.0,398.0
126,2015/03/04,408.0,404.881,405.0,67100,410.0,400.0
127,2015/03/05,409.0,419.513,405.0,329600,435.0,405.0
128,2015/03/06,407.0,405.687,406.0,60700,409.0,403.0
129,2015/03/09,414.0,419.213,416.0,238600,429.0,410.0
130,2015/03/10,410.0,411.718,413.0,61600,416.0,409.0
131,2015/03/11,408.0,408.931,409.0,33300,410.0,407.0
132,2015/03/12,408.0,408.505,408.0,27900,411.0,407.0
133,2015/03/13,408.0,410.912,411.0,28500,414.0,408.0
134,2015/03/16,400.0,402.538,409.0,70300,409.0,400.0
135,2015/03/17,396.0,397.228,401.0,103300,404.0,394.0
136,2015/03/18,393.0,393.738,394.0,47000,397.0,392.0
137,2015/03/19,391.0,391.429,392.0,54800,393.0,390.0
138,2015/03/20,396.0,392.472,390.0,53800,397.0,387.0
139,2015/03/23,402.0,402.015,396.0,53000,406.0,396.0
140,2015/03/24,404.0,402.986,405.0,35100,405.0,401.0
141,2015/03/25,405.0,402.129,406.0,30200,406.0,398.0
142,2015/03/26,402.0,400.344,402.0,25000,402.0,397.0
143,2015/03/27,405.0,406.002,404.0,67200,410.0,400.0
144,2015/03/30,409.0,409.422,410.0,44800,412.0,406.0
145,2015/03/31,401.0,406.149,410.0,31500,410.0,401.0
146,2015/04/01,402.0,403.461,403.0,26700,407.0,401.0
147,2015/04/02,405.0,405.544,405.0,14900,407.0,402.0
148,2015/04/03,405.0,404.597,408.0,13900,408.0,402.0
149,2015/04/06,407.0,406.361,409.0,14700,409.0,404.0
150,2015/04/07,407.0,406.176,405.0,16500,409.0,404.0
151,2015/04/08,408.0,412.983,404.0,125500,424.0,404.0
152,2015/04/09,409.0,409.008,407.0,24100,413.0,406.0
153,2015/04/10,411.0,410.283,411.0,19100,412.0,407.0
154,2015/04/13,411.0,411.045,411.0,38000,413.0,408.0
155,2015/04/14,415.0,413.991,411.0,23100,416.0,410.0
156,2015/04/15,420.0,417.581,415.0,44100,420.0,412.0
157,2015/04/16,421.0,420.334,422.0,38300,423.0,415.0
158,2015/04/17,421.0,419.614,420.0,64800,425.0,412.0
159,2015/04/20,418.0,420.726,422.0,31400,423.0,418.0
160,2015/04/21,414.0,415.764,418.0,25000,418.0,414.0
161,2015/04/22,418.0,414.376,414.0,25300,419.0,411.0
162,2015/04/23,417.0,417.506,415.0,17800,420.0,415.0
163,2015/04/24,417.0,418.989,419.0,44900,421.0,417.0
164,2015/04/27,413.0,414.242,416.0,20700,419.0,411.0
165,2015/04/28,413.0,410.899,414.0,21800,414.0,409.0
166,2015/04/30,408.0,406.456,408.0,52900,413.0,401.0
167,2015/05/01,402.0,401.678,403.0,48100,406.0,400.0
168,2015/05/07,401.0,400.968,400.0,9400,403.0,400.0
169,2015/05/08,412.0,405.73,400.0,33300,412.0,399.0
170,2015/05/11,406.0,407.165,412.0,21200,412.0,404.0
171,2015/05/12,403.0,404.727,404.0,11000,408.0,402.0
172,2015/05/13,401.0,401.812,402.0,42000,404.0,400.0
173,2015/05/14,401.0,400.363,400.0,21500,403.0,398.0
174,2015/05/15,402.0,401.564,403.0,11000,403.0,400.0
175,2015/05/18,403.0,400.924,401.0,15800,403.0,399.0
176,2015/05/19,410.0,405.341,401.0,49800,410.0,399.0
177,2015/05/20,411.0,413.553,416.0,92700,417.0,408.0
178,2015/05/21,412.0,408.498,411.0,49800,414.0,402.0
179,2015/05/22,416.0,411.208,413.0,31700,416.0,408.0
180,2015/05/25,420.0,419.82,418.0,110300,423.0,415.0
181,2015/05/26,411.0,414.062,418.0,64700,418.0,410.0
182,2015/05/27,432.0,451.754,451.0,1530900,478.0,425.0
183,2015/05/28,417.0,422.607,428.0,165000,434.0,417.0
184,2015/05/29,418.0,421.328,418.0,161500,435.0,414.0
185,2015/06/01,420.0,417.175,414.0,58900,421.0,414.0
186,2015/06/02,421.0,426.525,427.0,125200,435.0,420.0
187,2015/06/03,429.0,421.962,420.0,66400,429.0,416.0
188,2015/06/04,426.0,425.711,429.0,37300,432.0,421.0
189,2015/06/05,424.0,422.814,426.0,20400,426.0,421.0
190,2015/06/08,421.0,420.076,425.0,56700,425.0,418.0
191,2015/06/09,416.0,416.952,417.0,44000,418.0,416.0
192,2015/06/10,414.0,415.13,415.0,28400,418.0,413.0
193,2015/06/11,418.0,416.218,415.0,17000,420.0,414.0
194,2015/06/12,428.0,428.125,421.0,261500,439.0,420.0
195,2015/06/15,435.0,435.615,445.0,164300,445.0,425.0
196,2015/06/16,420.0,423.559,429.0,66000,430.0,420.0
197,2015/06/17,417.0,419.835,421.0,26600,425.0,417.0
198,2015/06/18,414.0,415.373,417.0,57100,420.0,412.0
199,2015/06/19,410.0,411.281,413.0,43000,413.0,410.0
200,2015/06/22,415.0,414.69,410.0,29700,419.0,410.0
201,2015/06/23,414.0,415.558,418.0,28500,419.0,413.0
202,2015/06/24,414.0,413.578,415.0,38600,415.0,411.0
203,2015/06/25,429.0,434.509,438.0,410600,441.0,427.0
204,2015/06/26,509.0,492.932,485.0,1929300,509.0,464.0
205,2015/06/29,609.0,609.0,609.0,275300,609.0,609.0
206,2015/06/30,709.0,700.48,685.0,4181500,709.0,683.0
207,2015/07/01,685.0,692.881,694.0,9560900,774.0,594.0
208,2015/07/02,586.0,621.868,645.0,3234300,698.0,585.0
209,2015/07/03,547.0,553.11,590.0,2203300,590.0,528.0
210,2015/07/06,537.0,543.721,546.0,1127800,565.0,528.0
211,2015/07/07,533.0,558.285,543.0,2191600,595.0,528.0
212,2015/07/08,494.0,506.096,525.0,910800,534.0,488.0
213,2015/07/09,496.0,483.944,488.0,993400,513.0,451.0
214,2015/07/10,481.0,497.797,483.0,502300,519.0,478.0
215,2015/07/13,506.0,506.667,497.0,669600,520.0,491.0
216,2015/07/14,506.0,506.179,499.0,634900,523.0,496.0
217,2015/07/15,540.0,549.267,505.0,2448400,584.0,504.0
218,2015/07/16,526.0,526.893,550.0,724300,551.0,515.0
219,2015/07/17,514.0,513.473,516.0,397800,525.0,506.0
220,2015/07/21,519.0,516.849,524.0,273300,524.0,507.0
221,2015/07/22,509.0,510.111,511.0,223200,516.0,507.0
222,2015/07/23,563.0,548.974,510.0,1141400,582.0,509.0
223,2015/07/24,538.0,542.918,550.0,475500,555.0,530.0
224,2015/07/27,522.0,525.478,532.0,218800,538.0,517.0
225,2015/07/28,530.0,534.402,508.0,710500,575.0,499.0
226,2015/07/29,518.0,522.119,530.0,158400,532.0,518.0
227,2015/07/30,524.0,529.12,536.0,204900,542.0,520.0
228,2015/07/31,520.0,521.309,524.0,125300,528.0,517.0
229,2015/08/03,548.0,558.003,549.0,1683500,584.0,533.0
230,2015/08/04,531.0,534.345,538.0,241700,546.0,527.0
231,2015/08/05,519.0,521.457,526.0,198200,527.0,516.0
232,2015/08/06,520.0,516.31,524.0,183300,527.0,511.0
233,2015/08/07,510.0,512.957,513.0,111900,521.0,510.0
234,2015/08/10,510.0,507.706,507.0,118500,518.0,504.0
235,2015/08/11,515.0,509.141,510.0,125200,516.0,504.0
236,2015/08/12,506.0,508.479,511.0,79900,516.0,505.0
237,2015/08/13,506.0,503.569,502.0,105100,510.0,501.0
238,2015/08/14,505.0,505.077,506.0,76400,510.0,501.0
239,2015/08/17,504.0,502.617,502.0,93800,508.0,496.0
240,2015/08/18,518.0,516.581,502.0,128500,526.0,500.0
241,2015/08/19,618.0,588.393,578.0,6126000,618.0,558.0
242,2015/08/20,612.0,638.343,668.0,12962700,688.0,580.0
243,2015/08/21,561.0,586.049,587.0,2284000,627.0,553.0
244,2015/08/24,472.0,509.796,526.0,1245600,548.0,468.0
245,2015/08/25,463.0,473.945,453.0,1079400,520.0,430.0
246,2015/08/26,496.0,485.034,471.0,382200,499.0,471.0
247,2015/08/27,478.0,473.644,464.0,980600,492.0,464.0
248,2015/08/28,488.0,488.947,484.0,353300,497.0,481.0
249,2015/08/31,568.0,568.0,568.0,112600,568.0,568.0
250,2015/09/01,525.0,569.284,576.0,3366600,602.0,512.0
251,2015/09/02,519.0,523.038,505.0,752100,545.0,504.0
252,2015/09/03,511.0,522.373,530.0,344300,537.0,510.0
253,2015/09/04,482.0,487.431,502.0,512800,506.0,469.0
254,2015/09/07,472.0,477.073,474.0,221800,499.0,462.0
255,2015/09/08,461.0,465.931,480.0,316500,481.0,453.0
256,2015/09/09,482.0,475.815,471.0,240500,485.0,464.0
257,2015/09/10,483.0,472.337,469.0,133300,483.0,466.0
258,2015/09/11,494.0,493.65,480.0,205600,501.0,475.0
259,2015/09/14,508.0,509.935,499.0,333800,534.0,495.0
260,2015/09/15,499.0,507.86,515.0,181700,522.0,499.0
261,2015/09/16,502.0,498.164,503.0,167500,506.0,489.0
262,2015/09/17,495.0,496.078,500.0,92500,503.0,490.0
263,2015/09/18,500.0,496.276,495.0,78200,501.0,492.0
264,2015/09/24,476.0,481.371,490.0,161600,490.0,473.0
265,2015/09/25,490.0,471.7,470.0,384500,498.0,455.0
266,2015/09/28,478.0,477.53,484.0,178600,484.0,472.0
267,2015/09/29,454.0,456.55,475.0,380000,478.0,448.0
268,2015/09/30,442.0,439.53,450.0,407600,450.0,432.0
269,2015/10/01,437.0,431.737,437.0,261400,442.0,421.0
270,2015/10/02,427.0,426.567,427.0,192700,433.0,422.0
271,2015/10/05,427.0,424.747,425.0,495200,430.0,421.0
272,2015/10/06,431.0,432.743,435.0,329300,438.0,427.0
273,2015/10/07,425.0,427.326,434.0,248600,435.0,424.0
274,2015/10/08,422.0,426.142,430.0,306200,431.0,422.0
275,2015/10/09,414.0,417.177,422.0,300200,422.0,412.0
276,2015/10/13,422.0,419.536,419.0,243700,424.0,417.0
277,2015/10/14,414.0,416.018,422.0,182200,425.0,412.0
278,2015/10/15,413.0,410.939,409.0,127800,415.0,406.0
279,2015/10/16,410.0,409.045,416.0,314000,416.0,406.0
280,2015/10/19,405.0,407.572,411.0,137600,411.0,405.0
281,2015/10/20,417.0,409.093,406.0,200300,418.0,405.0
282,2015/10/21,413.0,415.968,420.0,179600,420.0,412.0
283,2015/10/22,408.0,409.873,414.0,177300,414.0,406.0
284,2015/10/23,411.0,410.061,410.0,135300,412.0,408.0
285,2015/10/26,409.0,411.297,411.0,164400,415.0,409.0
286,2015/10/27,415.0,424.778,433.0,698700,439.0,414.0
287,2015/10/28,407.0,410.009,413.0,205000,414.0,407.0
288,2015/10/29,413.0,410.972,409.0,104400,414.0,408.0
289,2015/10/30,408.0,408.347,412.0,169600,412.0,406.0
290,2015/11/02,409.0,409.598,409.0,114200,414.0,407.0
291,2015/11/04,406.0,407.866,409.0,196100,411.0,404.0
292,2015/11/05,399.0,400.738,405.0,243800,406.0,398.0
293,2015/11/06,402.0,397.727,395.0,230700,408.0,395.0
294,2015/11/09,399.0,399.809,402.0,111700,402.0,398.0
295,2015/11/10,398.0,398.464,395.0,134600,401.0,395.0
296,2015/11/11,400.0,400.01,399.0,367900,406.0,395.0
297,2015/11/12,406.0,405.809,401.0,182100,411.0,398.0
298,2015/11/13,379.0,372.595,368.0,561300,381.0,360.0
299,2015/11/16,380.0,382.305,372.0,166800,388.0,371.0
300,2015/11/17,377.0,380.235,383.0,158000,385.0,377.0
301,2015/11/18,381.0,378.006,375.0,144100,383.0,375.0
302,2015/11/19,387.0,384.942,385.0,401800,388.0,383.0
303,2015/11/20,395.0,388.766,387.0,152800,395.0,384.0
304,2015/11/24,400.0,398.612,398.0,154900,403.0,396.0
305,2015/11/25,400.0,400.184,401.0,144300,403.0,399.0
306,2015/11/26,406.0,406.813,403.0,310000,413.0,400.0
307,2015/11/27,400.0,402.344,406.0,148600,410.0,400.0
308,2015/11/30,396.0,398.354,406.0,206000,406.0,394.0
309,2015/12/01,390.0,393.154,393.0,285200,400.0,389.0
310,2015/12/02,394.0,391.22,384.0,211100,397.0,383.0
311,2015/12/03,387.0,388.64,387.0,173200,395.0,385.0
312,2015/12/04,385.0,386.063,386.0,147700,390.0,383.0
313,2015/12/07,383.0,385.749,386.0,125000,388.0,383.0
314,2015/12/08,372.0,374.019,382.0,552700,384.0,367.0
315,2015/12/09,363.0,364.784,368.0,306000,370.0,360.0
316,2015/12/10,375.0,367.202,360.0,275200,375.0,357.0
317,2015/12/11,362.0,366.357,372.0,198800,374.0,362.0
318,2015/12/14,358.0,354.928,354.0,311900,362.0,352.0
319,2015/12/15,335.0,342.302,355.0,670500,358.0,335.0
320,2015/12/16,415.0,401.546,380.0,2497300,415.0,370.0
321,2015/12/17,382.0,402.36,402.0,5187200,438.0,376.0
322,2015/12/18,359.0,366.309,373.0,732500,379.0,359.0
323,2015/12/21,343.0,344.095,349.0,405100,349.0,340.0
324,2015/12/22,345.0,340.5,340.0,325700,345.0,338.0
325,2015/12/24,335.0,357.348,377.0,939700,379.0,335.0
326,2015/12/25,318.0,320.985,327.0,660100,327.0,316.0
327,2015/12/28,344.0,332.368,318.0,313400,345.0,318.0
328,2015/12/29,338.0,336.38,336.0,165700,341.0,333.0
329,2015/12/30,336.0,336.083,336.0,186000,339.0,333.0
330,2016/01/04,341.0,339.334,335.0,149900,347.0,331.0
331,2016/01/05,338.0,336.648,335.0,189600,344.0,328.0
332,2016/01/06,338.0,342.885,352.0,174100,352.0,335.0
333,2016/01/07,335.0,338.57,337.0,99900,345.0,333.0
334,2016/01/08,334.0,335.251,330.0,122900,341.0,329.0
335,2016/01/12,313.0,321.716,334.0,244000,337.0,311.0
336,2016/01/13,327.0,324.403,323.0,102100,330.0,320.0
337,2016/01/14,318.0,313.647,320.0,145200,321.0,309.0
338,2016/01/15,305.0,310.985,319.0,203200,324.0,303.0
339,2016/01/18,295.0,290.872,287.0,187800,300.0,285.0
340,2016/01/19,297.0,295.103,292.0,133400,302.0,291.0
341,2016/01/20,285.0,288.922,301.0,261700,301.0,283.0
342,2016/01/21,270.0,274.741,274.0,386800,297.0,265.0
343,2016/01/22,283.0,276.588,276.0,236500,283.0,271.0
344,2016/01/25,282.0,280.075,278.0,207600,287.0,273.0
345,2016/01/26,362.0,351.692,274.0,1952300,362.0,273.0
346,2016/01/27,333.0,366.215,402.0,2951000,404.0,323.0
347,2016/01/28,340.0,340.019,325.0,668200,362.0,321.0
348,2016/01/29,321.0,324.568,343.0,452000,344.0,313.0
349,2016/02/01,336.0,327.171,313.0,395000,340.0,311.0
350,2016/02/02,354.0,356.704,342.0,1020500,380.0,335.0
351,2016/02/03,335.0,339.538,344.0,273600,350.0,333.0
352,2016/02/04,316.0,324.834,333.0,261200,337.0,316.0
353,2016/02/05,316.0,313.257,310.0,254500,331.0,303.0
354,2016/02/08,323.0,315.309,308.0,117100,324.0,307.0
355,2016/02/09,299.0,302.916,307.0,226500,309.0,297.0
356,2016/02/10,282.0,289.475,304.0,298100,307.0,280.0
357,2016/02/12,249.0,255.306,260.0,512200,268.0,240.0
358,2016/02/15,255.0,256.611,257.0,257700,264.0,251.0
359,2016/02/16,279.0,276.534,256.0,281100,290.0,256.0
360,2016/02/17,276.0,277.965,277.0,169700,288.0,269.0
361,2016/02/18,300.0,333.427,327.0,3644600,356.0,298.0
362,2016/02/19,343.0,349.789,364.0,5636300,371.0,330.0
363,2016/02/22,332.0,331.165,333.0,580800,340.0,325.0
364,2016/02/23,330.0,327.329,332.0,329900,335.0,316.0
365,2016/02/24,339.0,347.95,352.0,1047200,359.0,334.0
366,2016/02/25,323.0,327.152,339.0,341700,339.0,321.0
367,2016/02/26,320.0,320.423,320.0,147500,325.0,317.0
368,2016/02/29,326.0,323.395,319.0,159800,327.0,317.0
369,2016/03/01,327.0,322.857,322.0,167700,330.0,315.0
370,2016/03/02,332.0,333.508,330.0,242900,341.0,328.0
371,2016/03/03,342.0,337.71,329.0,252200,343.0,328.0
372,2016/03/04,358.0,350.439,343.0,383100,360.0,342.0
373,2016/03/07,369.0,366.619,372.0,452600,373.0,359.0
374,2016/03/08,355.0,359.695,375.0,429300,377.0,344.0
375,2016/03/09,346.0,346.013,349.0,186600,350.0,343.0
376,2016/03/10,358.0,350.761,354.0,194500,358.0,344.0
377,2016/03/11,390.0,383.685,362.0,1264400,405.0,360.0
378,2016/03/14,387.0,389.828,394.0,353400,396.0,384.0
379,2016/03/15,383.0,386.13,387.0,249400,394.0,379.0
380,2016/03/16,392.0,385.36,379.0,284500,393.0,375.0
381,2016/03/17,383.0,387.918,392.0,282600,394.0,377.0
382,2016/03/18,385.0,377.467,377.0,218100,387.0,371.0
383,2016/03/22,401.0,416.881,400.0,2829400,438.0,392.0
384,2016/03/23,392.0,401.142,407.0,662000,410.0,391.0
385,2016/03/24,381.0,381.484,390.0,552200,394.0,372.0
386,2016/03/25,376.0,379.646,376.0,240200,387.0,375.0
387,2016/03/28,366.0,368.001,370.0,191900,372.0,364.0
388,2016/03/29,375.0,372.003,370.0,193800,378.0,365.0
389,2016/03/30,387.0,388.852,375.0,474100,402.0,375.0
390,2016/03/31,392.0,389.753,395.0,174200,395.0,384.0
391,2016/04/01,381.0,383.916,392.0,300000,395.0,377.0
392,2016/04/04,399.0,396.036,386.0,519700,405.0,380.0
393,2016/04/05,425.0,440.266,442.0,6030600,462.0,417.0
394,2016/04/06,397.0,396.086,415.0,894900,415.0,376.0
395,2016/04/07,422.0,414.337,397.0,673800,423.0,397.0
396,2016/04/08,429.0,420.961,414.0,625100,434.0,410.0
397,2016/04/11,447.0,437.098,441.0,714100,447.0,422.0
398,2016/04/12,423.0,437.688,443.0,776000,459.0,418.0
399,2016/04/13,429.0,426.784,421.0,372500,437.0,419.0
400,2016/04/14,429.0,432.961,430.0,412500,439.0,428.0
401,2016/04/15,456.0,446.192,427.0,1096500,459.0,425.0
402,2016/04/18,481.0,476.938,449.0,2218900,505.0,443.0
403,2016/04/19,517.0,519.708,491.0,3703100,548.0,484.0
404,2016/04/20,471.0,497.748,540.0,1897200,542.0,448.0
405,2016/04/21,498.0,505.458,515.0,2061300,525.0,486.0
406,2016/04/22,578.0,556.487,491.0,1686400,578.0,468.0
407,2016/04/25,560.0,601.781,548.0,11321500,654.0,537.0
408,2016/04/26,518.0,554.166,562.0,3630600,605.0,500.0
409,2016/04/27,498.0,499.077,513.0,1176800,520.0,480.0
410,2016/04/28,470.0,470.169,486.0,1013000,489.0,451.0
411,2016/05/02,464.0,472.01,461.0,718600,486.0,459.0
412,2016/05/06,457.0,460.537,472.0,396900,474.0,454.0
413,2016/05/09,477.0,467.388,462.0,373500,481.0,456.0
414,2016/05/10,474.0,472.45,471.0,253800,481.0,466.0
415,2016/05/11,475.0,481.343,475.0,398100,492.0,473.0
416,2016/05/12,481.0,484.229,485.0,303000,490.0,478.0
417,2016/05/13,502.0,506.588,497.0,1289200,530.0,494.0
418,2016/05/16,447.0,467.752,484.0,772800,490.0,444.0
419,2016/05/17,451.0,444.272,431.0,334400,458.0,429.0
420,2016/05/18,430.0,450.272,466.0,758900,486.0,424.0
421,2016/05/19,429.0,436.795,446.0,409000,449.0,423.0
422,2016/05/20,437.0,434.17,424.0,226600,443.0,421.0
423,2016/05/23,451.0,445.978,445.0,225300,452.0,438.0
424,2016/05/24,455.0,461.075,469.0,285200,469.0,453.0
425,2016/05/25,470.0,491.83,455.0,1885900,513.0,451.0
426,2016/05/26,472.0,471.404,476.0,414100,491.0,461.0
427,2016/05/27,460.0,465.243,468.0,207200,475.0,460.0
428,2016/05/30,471.0,461.124,459.0,296000,472.0,451.0
429,2016/05/31,461.0,462.003,463.0,180300,469.0,459.0
430,2016/06/01,469.0,468.749,464.0,221800,477.0,455.0
431,2016/06/02,454.0,457.035,465.0,212900,472.0,440.0
432,2016/06/03,466.0,460.989,447.0,242600,470.0,447.0
433,2016/06/06,466.0,461.424,452.0,105600,470.0,452.0
434,2016/06/07,478.0,475.586,470.0,281200,483.0,466.0
435,2016/06/08,478.0,478.007,479.0,198100,482.0,472.0
436,2016/06/09,477.0,480.442,474.0,247800,490.0,473.0
437,2016/06/10,476.0,475.524,476.0,171900,480.0,472.0
438,2016/06/13,448.0,455.191,470.0,211500,470.0,447.0
439,2016/06/14,398.0,411.28,435.0,470700,437.0,397.0
440,2016/06/15,409.0,399.885,393.0,232200,414.0,389.0
441,2016/06/16,368.0,379.024,400.0,378600,405.0,365.0
442,2016/06/17,366.0,372.33,389.0,202300,389.0,365.0
443,2016/06/20,384.0,381.327,374.0,270800,396.0,370.0
444,2016/06/21,377.0,376.509,374.0,231700,387.0,371.0
445,2016/06/22,377.0,375.322,380.0,171300,383.0,367.0
446,2016/06/23,388.0,380.102,379.0,181700,390.0,372.0
447,2016/06/24,350.0,348.582,390.0,755300,395.0,308.0
448,2016/06/27,362.0,356.0,342.0,211000,366.0,342.0
449,2016/06/28,371.0,361.737,354.0,122200,374.0,353.0
450,2016/06/29,384.0,383.44,375.0,220100,397.0,371.0
451,2016/06/30,387.0,387.287,391.0,165400,394.0,381.0
452,2016/07/01,406.0,397.108,388.0,221800,407.0,388.0
453,2016/07/04,429.0,419.694,414.0,266200,432.0,408.0
454,2016/07/05,419.0,416.948,431.0,201400,439.0,409.0
455,2016/07/06,399.0,397.139,395.0,163800,406.0,390.0
456,2016/07/07,389.0,395.232,400.0,114400,407.0,385.0
457,2016/07/08,380.0,386.838,400.0,381000,403.0,373.0
458,2016/07/11,382.0,383.217,382.0,109500,390.0,377.0
459,2016/07/12,389.0,390.052,386.0,128000,393.0,386.0
460,2016/07/13,394.0,390.746,396.0,115500,396.0,388.0
461,2016/07/14,389.0,391.787,392.0,129200,395.0,388.0
462,2016/07/15,382.0,380.551,388.0,197900,388.0,376.0
463,2016/07/19,372.0,373.96,371.0,132400,381.0,371.0
464,2016/07/20,373.0,373.896,370.0,53000,378.0,370.0
465,2016/07/21,375.0,372.633,377.0,98200,377.0,368.0
466,2016/07/22,376.0,370.961,369.0,55800,376.0,368.0
467,2016/07/25,369.0,369.091,372.0,126600,375.0,364.0
468,2016/07/26,378.0,388.401,386.0,934700,413.0,371.0
469,2016/07/27,370.0,372.246,375.0,154300,378.0,369.0
470,2016/07/28,361.0,364.226,370.0,82800,370.0,361.0
471,2016/07/29,367.0,360.446,362.0,150300,367.0,353.0
472,2016/08/01,373.0,372.433,367.0,128300,381.0,363.0
473,2016/08/02,374.0,376.889,375.0,93300,382.0,370.0
474,2016/08/03,369.0,370.399,371.0,79500,375.0,366.0
475,2016/08/04,370.0,369.903,368.0,53500,376.0,366.0
476,2016/08/05,366.0,370.572,369.0,76800,377.0,366.0
477,2016/08/08,374.0,374.165,366.0,199500,388.0,364.0
478,2016/08/09,370.0,372.73,374.0,66400,382.0,369.0
479,2016/08/10,374.0,371.761,374.0,30500,374.0,369.0
480,2016/08/12,379.0,376.036,373.0,70100,380.0,369.0
481,2016/08/15,381.0,381.32,382.0,61800,384.0,374.0
482,2016/08/16,376.0,382.241,383.0,107900,388.0,376.0
483,2016/08/17,380.0,379.393,375.0,69800,381.0,375.0
484,2016/08/18,381.0,379.499,381.0,48700,382.0,377.0
485,2016/08/19,385.0,383.986,383.0,64300,387.0,380.0
486,2016/08/22,389.0,386.951,387.0,73200,390.0,383.0
487,2016/08/23,391.0,390.565,388.0,127900,394.0,386.0
488,2016/08/24,396.0,395.419,387.0,287200,408.0,386.0
489,2016/08/25,398.0,396.957,398.0,60300,400.0,394.0
490,2016/08/26,398.0,396.177,398.0,54900,399.0,394.0
491,2016/08/29,398.0,397.426,398.0,91800,401.0,390.0
492,2016/08/30,397.0,398.239,400.0,46400,401.0,395.0
493,2016/08/31,404.0,398.957,397.0,78200,404.0,394.0
494,2016/09/01,433.0,426.255,402.0,540100,440.0,400.0
495,2016/09/02,412.0,414.907,433.0,316800,439.0,396.0
496,2016/09/05,420.0,415.442,412.0,87100,422.0,408.0
497,2016/09/06,433.0,425.735,420.0,166200,433.0,418.0
498,2016/09/07,444.0,437.132,430.0,215700,446.0,424.0
499,2016/09/08,444.0,440.952,442.0,193200,447.0,435.0
500,2016/09/09,455.0,450.622,448.0,285400,457.0,440.0
501,2016/09/12,448.0,449.802,450.0,207200,455.0,446.0
502,2016/09/13,439.0,444.235,448.0,187400,455.0,435.0
503,2016/09/14,419.0,424.261,427.0,239600,434.0,415.0
504,2016/09/15,414.0,416.426,414.0,89900,421.0,413.0
505,2016/09/16,427.0,420.099,412.0,95000,428.0,410.0
506,2016/09/20,419.0,424.041,419.0,228400,436.0,413.0
507,2016/09/21,418.0,416.51,417.0,87900,422.0,412.0
508,2016/09/23,439.0,451.414,420.0,1884800,476.0,419.0
509,2016/09/26,426.0,432.516,439.0,465500,446.0,423.0
510,2016/09/27,425.0,422.471,421.0,135800,428.0,417.0
511,2016/09/28,419.0,419.967,424.0,176200,425.0,413.0
512,2016/09/29,422.0,419.985,419.0,138900,425.0,413.0
513,2016/09/30,418.0,419.679,417.0,184000,427.0,413.0
514,2016/10/03,423.0,419.917,415.0,205900,428.0,415.0
515,2016/10/04,420.0,425.77,429.0,186800,433.0,420.0
516,2016/10/05,418.0,417.203,420.0,153100,421.0,415.0
517,2016/10/06,426.0,434.108,436.0,1953100,450.0,422.0
518,2016/10/07,420.0,420.972,421.0,205100,428.0,418.0
519,2016/10/11,416.0,416.181,418.0,132400,419.0,414.0
520,2016/10/12,407.0,409.744,413.0,111700,414.0,407.0
521,2016/10/13,405.0,404.038,405.0,86500,406.0,401.0
522,2016/10/14,401.0,402.614,405.0,79200,405.0,401.0
523,2016/10/17,400.0,399.295,401.0,96500,403.0,396.0
524,2016/10/18,403.0,398.976,400.0,131100,403.0,396.0
525,2016/10/19,406.0,406.808,400.0,268900,413.0,400.0
526,2016/10/20,403.0,404.404,404.0,140000,409.0,402.0
527,2016/10/21,399.0,401.384,401.0,118500,405.0,399.0
528,2016/10/24,397.0,397.007,399.0,182800,400.0,394.0
529,2016/10/25,397.0,395.166,394.0,210300,402.0,391.0
530,2016/10/26,399.0,397.661,395.0,114300,402.0,393.0
531,2016/10/27,398.0,398.429,398.0,68600,402.0,396.0
532,2016/10/28,400.0,398.714,396.0,63200,401.0,396.0
533,2016/10/31,398.0,399.9,401.0,48000,402.0,398.0
534,2016/11/01,397.0,398.028,399.0,39800,400.0,397.0
535,2016/11/02,387.0,387.945,397.0,204500,397.0,384.0
536,2016/11/04,378.0,380.477,382.0,121900,385.0,378.0
537,2016/11/07,366.0,362.173,363.0,246400,367.0,358.0
538,2016/11/08,361.0,362.865,367.0,120900,368.0,359.0
539,2016/11/09,332.0,335.238,363.0,475800,363.0,315.0
540,2016/11/10,358.0,356.786,359.0,131600,361.0,350.0
541,2016/11/11,360.0,357.431,365.0,151700,365.0,351.0
542,2016/11/14,362.0,365.081,356.0,98300,371.0,356.0
543,2016/11/15,372.0,368.444,362.0,76200,372.0,362.0
544,2016/11/16,377.0,375.432,370.0,140200,380.0,370.0
545,2016/11/17,380.0,379.754,375.0,149200,383.0,373.0
546,2016/11/18,381.0,379.517,379.0,123400,383.0,376.0
547,2016/11/21,382.0,382.934,382.0,164700,387.0,378.0
548,2016/11/22,383.0,381.151,380.0,113500,386.0,380.0
549,2016/11/24,379.0,380.134,382.0,108500,384.0,378.0
550,2016/11/25,376.0,375.095,373.0,106900,379.0,373.0
551,2016/11/28,376.0,377.228,374.0,123400,382.0,373.0
552,2016/11/29,376.0,378.525,376.0,221000,384.0,376.0
553,2016/11/30,377.0,378.392,377.0,58100,380.0,376.0
554,2016/12/01,378.0,378.732,379.0,61600,381.0,377.0
555,2016/12/02,379.0,378.773,379.0,110000,381.0,375.0
556,2016/12/05,379.0,378.47,379.0,88100,381.0,376.0
557,2016/12/06,376.0,378.664,378.0,162000,381.0,376.0
558,2016/12/07,376.0,377.375,376.0,145800,380.0,376.0
559,2016/12/08,374.0,375.675,377.0,117700,378.0,373.0
560,2016/12/09,382.0,377.962,374.0,146500,382.0,371.0
561,2016/12/12,389.0,384.442,382.0,251200,395.0,377.0
562,2016/12/13,407.0,397.751,386.0,315600,407.0,382.0
563,2016/12/14,412.0,407.958,405.0,180100,412.0,403.0
564,2016/12/15,407.0,407.458,413.0,112700,413.0,401.0
565,2016/12/16,415.0,411.36,405.0,232200,416.0,404.0
566,2016/12/19,413.0,410.83,412.0,171200,416.0,406.0
567,2016/12/20,414.0,414.421,415.0,104500,418.0,412.0
568,2016/12/21,401.0,408.781,415.0,167800,415.0,401.0
569,2016/12/22,396.0,397.53,401.0,146500,404.0,391.0
570,2016/12/26,403.0,397.558,395.0,101800,404.0,392.0
571,2016/12/27,409.0,407.444,400.0,252500,415.0,395.0
572,2016/12/28,404.0,404.461,408.0,127000,408.0,400.0
573,2016/12/29,397.0,397.619,404.0,133200,404.0,395.0
574,2016/12/30,396.0,396.908,393.0,87700,400.0,393.0
575,2017/01/04,402.0,398.411,398.0,76900,402.0,395.0
576,2017/01/05,409.0,405.694,400.0,100100,410.0,400.0
577,2017/01/06,403.0,404.24,412.0,173300,412.0,401.0
578,2017/01/10,409.0,408.931,406.0,182300,412.0,405.0
579,2017/01/11,411.0,411.824,412.0,106300,416.0,408.0
580,2017/01/12,401.0,404.679,408.0,108700,411.0,401.0
581,2017/01/13,416.0,411.813,403.0,151600,417.0,403.0
582,2017/01/16,425.0,424.174,424.0,320200,431.0,418.0
583,2017/01/17,418.0,416.985,423.0,146500,423.0,412.0
584,2017/01/18,433.0,425.453,420.0,240800,433.0,418.0
585,2017/01/19,427.0,432.73,435.0,280600,442.0,424.0
586,2017/01/20,426.0,423.414,431.0,124800,432.0,418.0
587,2017/01/23,426.0,423.704,424.0,107500,430.0,417.0
588,2017/01/24,421.0,422.105,422.0,55200,425.0,420.0
589,2017/01/25,442.0,436.066,432.0,412000,443.0,426.0
590,2017/01/26,432.0,438.638,444.0,360200,446.0,431.0
591,2017/01/27,446.0,439.102,429.0,253200,447.0,427.0
592,2017/01/30,446.0,450.272,446.0,204100,458.0,446.0
593,2017/01/31,448.0,445.451,443.0,124300,449.0,443.0
594,2017/02/01,453.0,449.634,448.0,192900,455.0,441.0
595,2017/02/02,452.0,453.144,453.0,165300,457.0,448.0
596,2017/02/03,467.0,459.81,453.0,286800,472.0,452.0
597,2017/02/06,472.0,467.48,460.0,243800,478.0,460.0
598,2017/02/07,462.0,467.062,471.0,194400,473.0,462.0
599,2017/02/08,446.0,443.642,460.0,420900,460.0,432.0
600,2017/02/09,447.0,451.48,451.0,100800,456.0,447.0
601,2017/02/10,455.0,451.604,449.0,265700,460.0,442.0
602,2017/02/13,432.0,436.354,444.0,291500,445.0,430.0
603,2017/02/14,418.0,422.803,435.0,315700,439.0,415.0
604,2017/02/15,414.0,415.967,418.0,156700,422.0,413.0
605,2017/02/16,417.0,417.952,416.0,98100,423.0,414.0
606,2017/02/17,416.0,416.562,423.0,67300,423.0,414.0
607,2017/02/20,403.0,407.289,414.0,246800,416.0,402.0
608,2017/02/21,410.0,403.176,403.0,300700,415.0,397.0
609,2017/02/22,407.0,408.014,410.0,230000,412.0,404.0
610,2017/02/23,408.0,408.818,410.0,86400,413.0,406.0
611,2017/02/24,408.0,408.616,408.0,65100,411.0,407.0
612,2017/02/27,406.0,407.24,411.0,146400,412.0,403.0
613,2017/02/28,410.0,410.2,408.0,70900,413.0,407.0
614,2017/03/01,407.0,408.842,410.0,144600,414.0,405.0
615,2017/03/02,413.0,415.57,410.0,223500,424.0,409.0
616,2017/03/03,422.0,419.156,416.0,130400,424.0,415.0
617,2017/03/06,412.0,415.092,420.0,152900,420.0,411.0
618,2017/03/07,412.0,411.741,411.0,62900,414.0,409.0
619,2017/03/08,411.0,411.755,412.0,54300,413.0,411.0
620,2017/03/09,411.0,409.877,412.0,66600,413.0,408.0
621,2017/03/10,410.0,410.92,411.0,67800,413.0,410.0
622,2017/03/13,407.0,409.124,413.0,104700,413.0,407.0
623,2017/03/14,410.0,408.775,407.0,63500,412.0,407.0
624,2017/03/15,403.0,405.275,407.0,131700,410.0,402.0
625,2017/03/16,407.0,404.679,403.0,61300,408.0,402.0
626,2017/03/17,410.0,407.179,409.0,103500,411.0,405.0
627,2017/03/21,427.0,418.231,410.0,292700,428.0,405.0
628,2017/03/22,413.0,416.911,414.0,184700,424.0,413.0
629,2017/03/23,411.0,412.963,416.0,99300,419.0,409.0
630,2017/03/24,412.0,410.832,412.0,53000,414.0,407.0
631,2017/03/27,416.0,416.562,413.0,153100,421.0,410.0
632,2017/03/28,422.0,421.101,415.0,293400,423.0,415.0
633,2017/03/29,444.0,434.985,424.0,341800,445.0,424.0
634,2017/03/30,442.0,441.283,441.0,189400,448.0,435.0
635,2017/03/31,450.0,448.824,445.0,229300,455.0,441.0
636,2017/04/03,451.0,447.815,445.0,226900,453.0,445.0
637,2017/04/04,435.0,439.009,450.0,344500,451.0,425.0
638,2017/04/05,444.0,435.045,429.0,215300,447.0,427.0
639,2017/04/06,433.0,434.384,441.0,151900,442.0,429.0
640,2017/04/07,433.0,433.167,430.0,210800,444.0,425.0
641,2017/04/10,444.0,440.548,439.0,155500,445.0,435.0
642,2017/04/11,452.0,448.163,439.0,257100,455.0,438.0
643,2017/04/12,437.0,438.8,452.0,273400,452.0,432.0
644,2017/04/13,440.0,431.659,429.0,180500,442.0,425.0
645,2017/04/14,441.0,440.194,437.0,164200,447.0,433.0
646,2017/04/17,465.0,459.145,437.0,655900,470.0,436.0
647,2017/04/18,470.0,468.132,469.0,269400,474.0,462.0
648,2017/04/19,470.0,471.663,464.0,239200,477.0,463.0
649,2017/04/20,459.0,462.089,466.0,154500,472.0,455.0
650,2017/04/21,500.0,483.08,459.0,512600,500.0,458.0
651,2017/04/24,464.0,477.924,496.0,544400,496.0,455.0
652,2017/04/25,475.0,470.832,469.0,236000,478.0,462.0
653,2017/04/26,540.0,527.841,504.0,2436300,553.0,490.0
654,2017/04/27,581.0,591.365,542.0,4554600,626.0,528.0
655,2017/04/28,553.0,568.304,591.0,1643000,597.0,540.0
656,2017/05/01,573.0,595.099,560.0,2036600,624.0,560.0
657,2017/05/02,574.0,568.903,566.0,610400,580.0,560.0
658,2017/05/08,582.0,580.863,585.0,839200,595.0,567.0
659,2017/05/09,623.0,614.031,575.0,1846900,635.0,575.0
660,2017/05/10,617.0,616.834,616.0,1029300,637.0,596.0
661,2017/05/11,618.0,650.581,626.0,2983900,692.0,614.0
662,2017/05/12,649.0,637.972,614.0,1155000,655.0,612.0
663,2017/05/15,749.0,713.879,656.0,2413000,749.0,656.0
664,2017/05/16,741.0,749.843,764.0,3376400,803.0,712.0
665,2017/05/17,760.0,807.035,816.0,5360400,859.0,726.0
666,2017/05/18,796.0,767.691,724.0,2588500,808.0,723.0
667,2017/05/19,810.0,810.256,808.0,1869400,832.0,788.0
668,2017/05/22,816.0,821.797,820.0,1678900,849.0,798.0
669,2017/05/23,806.0,781.831,801.0,1666700,818.0,752.0
670,2017/05/24,956.0,927.388,910.0,2175600,956.0,896.0
671,2017/05/25,1105.0,1074.584,1029.0,5384800,1106.0,1013.0
672,2017/05/26,1000.0,1008.376,1045.0,2889500,1056.0,973.0
673,2017/05/29,1050.0,1086.536,1037.0,2183000,1169.0,1015.0
674,2017/05/30,1065.0,1067.317,1053.0,1477600,1120.0,1017.0
675,2017/05/31,1014.0,1015.713,1052.0,991000,1059.0,992.0
676,2017/06/01,1004.0,1028.744,1071.0,1388300,1084.0,988.0
677,2017/06/02,1019.0,966.975,984.0,2666400,1055.0,885.0
678,2017/06/05,1055.0,1030.02,974.0,1054900,1066.0,973.0
679,2017/06/06,1047.0,1048.756,1025.0,807800,1077.0,1009.0
680,2017/06/07,1064.0,1057.817,1030.0,737800,1093.0,1027.0
681,2017/06/08,1283.0,1270.775,1076.0,4976100,1364.0,1067.0
682,2017/06/09,1249.0,1227.28,1223.0,1912500,1300.0,1177.0
683,2017/06/12,1200.0,1245.625,1300.0,1368700,1321.0,1196.0
684,2017/06/13,1330.0,1375.923,1403.0,5833200,1468.0,1282.0
685,2017/06/14,1220.0,1261.817,1300.0,1884800,1335.0,1200.0
686,2017/06/15,1232.0,1192.691,1171.0,1368900,1256.0,1140.0
687,2017/06/16,1202.0,1199.608,1210.0,603800,1229.0,1180.0
688,2017/06/19,1196.0,1197.594,1200.0,694300,1235.0,1174.0
689,2017/06/20,1201.0,1220.41,1245.0,1110000,1272.0,1196.0
690,2017/06/21,1203.0,1198.114,1190.0,547600,1218.0,1171.0
691,2017/06/22,1234.0,1227.412,1198.0,753900,1250.0,1198.0
692,2017/06/23,1070.0,1100.664,1254.0,2748200,1256.0,983.0
693,2017/06/26,1092.0,1092.021,1109.0,1040800,1139.0,1061.0
694,2017/06/27,1063.0,1049.277,1100.0,1031200,1103.0,1010.0
695,2017/06/28,1021.0,1026.161,1029.0,733800,1066.0,1001.0
696,2017/06/29,1046.0,1026.239,1011.0,650900,1048.0,1002.0
697,2017/06/30,1036.0,1024.172,1016.0,495500,1044.0,1015.0
698,2017/07/03,1147.0,1137.99,1064.0,1768700,1204.0,1054.0
699,2017/07/04,1260.0,1292.385,1216.0,6293400,1435.0,1181.0
700,2017/07/05,1175.0,1202.509,1250.0,2396100,1255.0,1162.0
701,2017/07/06,1090.0,1116.054,1153.0,1572400,1160.0,1081.0
702,2017/07/07,1166.0,1130.288,1060.0,1499600,1200.0,1057.0
703,2017/07/10,1301.0,1316.577,1376.0,5281200,1380.0,1253.0
704,2017/07/11,1577.0,1498.884,1320.0,12344500,1597.0,1291.0
705,2017/07/12,1579.0,1590.959,1609.0,6092100,1666.0,1504.0
706,2017/07/13,1530.0,1526.932,1529.0,1676200,1571.0,1501.0
707,2017/07/14,1660.0,1634.6,1541.0,5664300,1730.0,1515.0
708,2017/07/18,1664.0,1713.589,1693.0,4491500,1786.0,1660.0
709,2017/07/19,1640.0,1623.07,1652.0,1638500,1659.0,1580.0
710,2017/07/20,1676.0,1682.878,1651.0,1638900,1720.0,1651.0
711,2017/07/21,1675.0,1677.509,1676.0,807200,1712.0,1644.0
712,2017/07/24,1716.0,1727.176,1699.0,1807300,1780.0,1650.0
713,2017/07/25,1745.0,1727.686,1681.0,970400,1755.0,1681.0
714,2017/07/26,1855.0,1837.154,1755.0,3521000,1908.0,1736.0
715,2017/07/27,1765.0,1795.974,1837.0,1775600,1850.0,1751.0
716,2017/07/28,1665.0,1700.339,1781.0,2334600,1819.0,1606.0
717,2017/07/31,1667.0,1625.393,1638.0,1632600,1685.0,1570.0
718,2017/08/01,1566.0,1592.764,1651.0,1569300,1651.0,1537.0
719,2017/08/02,1550.0,1572.195,1521.0,1494800,1628.0,1512.0
720,2017/08/03,1419.0,1452.647,1546.0,2158200,1565.0,1381.0
721,2017/08/04,1401.0,1405.924,1389.0,1494900,1467.0,1355.0
722,2017/08/07,1357.0,1394.36,1411.0,1171500,1457.0,1340.0
723,2017/08/08,1260.0,1270.877,1313.0,2288100,1329.0,1222.0
724,2017/08/09,1267.0,1287.225,1300.0,4434900,1372.0,1195.0
725,2017/08/10,1201.0,1260.074,1357.0,2802000,1357.0,1185.0
726,2017/08/14,1215.0,1169.92,1141.0,2364500,1233.0,1093.0
727,2017/08/15,1325.0,1305.745,1226.0,3120900,1398.0,1226.0
728,2017/08/16,1293.0,1322.543,1340.0,2026600,1367.0,1271.0
729,2017/08/17,1294.0,1300.938,1308.0,1372500,1339.0,1275.0
730,2017/08/18,1240.0,1260.58,1250.0,1361000,1307.0,1232.0
731,2017/08/21,1289.0,1273.449,1252.0,1578700,1329.0,1216.0
732,2017/08/22,1260.0,1287.605,1290.0,1431300,1336.0,1236.0
733,2017/08/23,1336.0,1298.831,1272.0,1326400,1336.0,1250.0
734,2017/08/24,1300.0,1316.155,1350.0,1445100,1358.0,1293.0
735,2017/08/25,1318.0,1308.863,1299.0,642000,1326.0,1291.0
736,2017/08/28,1319.0,1354.627,1336.0,1856900,1412.0,1307.0
737,2017/08/29,1309.0,1286.007,1289.0,970800,1317.0,1256.0
738,2017/08/30,1306.0,1298.443,1319.0,1665200,1350.0,1256.0
739,2017/08/31,1333.0,1321.277,1316.0,779300,1345.0,1292.0
740,2017/09/01,1440.0,1399.626,1326.0,1919000,1440.0,1326.0
741,2017/09/04,1270.0,1344.894,1415.0,3783400,1435.0,1263.0
742,2017/09/05,1040.0,1093.409,1261.0,5947000,1284.0,998.0
743,2017/09/06,1050.0,1031.501,996.0,3285800,1101.0,967.0
744,2017/09/07,1004.0,1038.073,1060.0,2069800,1116.0,999.0
745,2017/09/08,1015.0,1006.434,1004.0,1304700,1026.0,994.0
746,2017/09/11,1044.0,1059.637,1075.0,1014400,1090.0,1034.0
747,2017/09/12,1128.0,1096.406,1070.0,1372700,1130.0,1052.0
748,2017/09/13,1130.0,1147.045,1115.0,1330600,1179.0,1115.0
749,2017/09/14,1059.0,1075.169,1122.0,1200000,1130.0,1032.0
750,2017/09/15,1086.0,1066.812,1032.0,735800,1093.0,1027.0
751,2017/09/19,1121.0,1118.155,1125.0,738500,1149.0,1096.0
752,2017/09/20,1116.0,1112.623,1108.0,519900,1135.0,1090.0
753,2017/09/21,1200.0,1164.421,1130.0,1341400,1200.0,1114.0
754,2017/09/22,1132.0,1149.797,1200.0,1686300,1200.0,1102.0
755,2017/09/25,1160.0,1169.915,1145.0,953200,1216.0,1130.0
756,2017/09/26,1109.0,1124.039,1147.0,739400,1156.0,1098.0
757,2017/09/27,1130.0,1115.575,1123.0,799800,1148.0,1076.0
758,2017/09/28,1116.0,1128.282,1128.0,540100,1161.0,1108.0
759,2017/09/29,1157.0,1139.334,1108.0,780800,1164.0,1102.0
760,2017/10/02,1164.0,1161.257,1160.0,594200,1185.0,1142.0
761,2017/10/03,1186.0,1180.454,1184.0,681500,1193.0,1156.0
762,2017/10/04,1131.0,1147.786,1172.0,716900,1187.0,1125.0
763,2017/10/05,1085.0,1121.009,1150.0,1068900,1168.0,1080.0
764,2017/10/06,1103.0,1083.878,1081.0,667300,1106.0,1059.0
765,2017/10/10,1097.0,1086.29,1081.0,433900,1107.0,1070.0
766,2017/10/11,1073.0,1090.183,1097.0,586900,1122.0,1070.0
767,2017/10/12,1090.0,1094.207,1070.0,913600,1122.0,1065.0
768,2017/10/13,1055.0,1063.705,1085.0,696300,1090.0,1046.0
769,2017/10/16,1098.0,1117.777,1115.0,3364800,1195.0,1067.0
770,2017/10/17,1091.0,1114.925,1128.0,1874700,1159.0,1078.0
771,2017/10/18,1073.0,1081.155,1102.0,719200,1105.0,1065.0
772,2017/10/19,1067.0,1062.124,1060.0,550800,1077.0,1051.0
773,2017/10/20,1046.0,1051.481,1063.0,434100,1068.0,1045.0
774,2017/10/23,1075.0,1064.378,1040.0,579400,1088.0,1035.0
775,2017/10/24,1075.0,1074.869,1081.0,374200,1092.0,1061.0
776,2017/10/25,1053.0,1056.93,1068.0,355000,1073.0,1045.0
777,2017/10/26,1065.0,1046.493,1044.0,522100,1065.0,1028.0
778,2017/10/27,1105.0,1089.146,1053.0,1088600,1107.0,1053.0
779,2017/10/30,1100.0,1115.513,1115.0,671300,1143.0,1090.0
780,2017/10/31,1118.0,1099.804,1090.0,507200,1122.0,1076.0
781,2017/11/01,1105.0,1113.638,1116.0,236300,1122.0,1104.0
782,2017/11/02,1124.0,1119.904,1105.0,440900,1133.0,1096.0
783,2017/11/06,1221.0,1189.035,1145.0,1542900,1240.0,1121.0
784,2017/11/07,1179.0,1177.85,1205.0,947700,1214.0,1143.0
785,2017/11/08,1147.0,1158.012,1170.0,632500,1188.0,1135.0
786,2017/11/09,1111.0,1126.52,1148.0,706700,1170.0,1080.0
787,2017/11/10,1114.0,1111.414,1086.0,516200,1141.0,1080.0
788,2017/11/13,1121.0,1144.682,1140.0,852600,1203.0,1112.0
789,2017/11/14,1091.0,1101.064,1112.0,525800,1130.0,1081.0
790,2017/11/15,1055.0,1065.952,1094.0,787900,1099.0,1034.0
791,2017/11/16,1100.0,1073.347,1038.0,496100,1100.0,1035.0
792,2017/11/17,1112.0,1110.268,1100.0,592600,1125.0,1087.0
793,2017/11/20,1103.0,1107.513,1100.0,471200,1130.0,1088.0
794,2017/11/21,1116.0,1110.585,1105.0,443200,1129.0,1091.0
795,2017/11/22,1127.0,1139.658,1122.0,551900,1165.0,1117.0
796,2017/11/24,1109.0,1122.672,1130.0,421100,1140.0,1108.0
797,2017/11/27,1143.0,1136.156,1122.0,500900,1154.0,1114.0
798,2017/11/28,1109.0,1116.254,1143.0,592500,1145.0,1105.0
799,2017/11/29,1119.0,1120.484,1111.0,462300,1132.0,1107.0
800,2017/11/30,1094.0,1097.401,1120.0,639500,1134.0,1077.0
801,2017/12/01,1085.0,1086.161,1103.0,381900,1105.0,1077.0
802,2017/12/04,1048.0,1058.099,1084.0,955100,1090.0,1040.0
803,2017/12/05,1000.0,1013.164,1040.0,1259500,1059.0,995.0
804,2017/12/06,967.0,982.664,996.0,1037300,1010.0,963.0
805,2017/12/07,995.0,983.019,962.0,600100,1009.0,962.0
806,2017/12/08,1011.0,1009.999,990.0,451000,1031.0,987.0
807,2017/12/11,1047.0,1035.833,1009.0,487600,1050.0,1009.0
808,2017/12/12,1024.0,1026.31,1030.0,573800,1055.0,1005.0
809,2017/12/13,1000.0,1002.372,1021.0,648300,1026.0,994.0
810,2017/12/14,1021.0,1009.454,1002.0,494500,1021.0,997.0
811,2017/12/15,1321.0,1217.116,1021.0,22406100,1321.0,1003.0
812,2017/12/18,1531.0,1499.541,1400.0,21226300,1608.0,1373.0
813,2017/12/19,1358.0,1420.019,1461.0,7464100,1500.0,1338.0
814,2017/12/20,1658.0,1519.958,1400.0,9777300,1658.0,1371.0
815,2017/12/21,1600.0,1651.077,1738.0,17174100,1755.0,1572.0
816,2017/12/22,1586.0,1658.824,1600.0,12142900,1749.0,1550.0
817,2017/12/25,1557.0,1561.769,1547.0,2976300,1612.0,1512.0
818,2017/12/26,1691.0,1794.652,1726.0,12759600,1932.0,1660.0
819,2017/12/27,1801.0,1800.254,1681.0,8559200,1895.0,1680.0
820,2017/12/28,1950.0,1902.215,1838.0,6474100,1988.0,1800.0
821,2017/12/29,2350.0,2260.503,2158.0,9180400,2350.0,2153.0
822,2018/01/04,2242.0,2573.191,2550.0,12862500,2819.0,2201.0
823,2018/01/05,2541.0,2460.428,2340.0,12668900,2629.0,2300.0
824,2018/01/09,2721.0,2757.425,2791.0,7226700,2890.0,2640.0
825,2018/01/10,2611.0,2642.797,2646.0,3582400,2752.0,2544.0
826,2018/01/11,2667.0,2627.784,2555.0,3399100,2710.0,2552.0
827,2018/01/12,3050.0,2961.111,2850.0,8531500,3170.0,2783.0
828,2018/01/15,2985.0,3000.179,3050.0,3220100,3100.0,2933.0
829,2018/01/16,2738.0,2789.963,2901.0,3349500,2950.0,2672.0
830,2018/01/17,2611.0,2690.448,2670.0,2523000,2843.0,2580.0
831,2018/01/18,2611.0,2554.629,2550.0,3025500,2675.0,2455.0
832,2018/01/19,2889.0,2767.238,2652.0,3283500,2889.0,2610.0
833,2018/01/22,3140.0,3142.158,2899.0,5400100,3320.0,2899.0
834,2018/01/23,3005.0,3086.344,3055.0,2976600,3250.0,2958.0
835,2018/01/24,2917.0,2976.365,3065.0,2227600,3150.0,2850.0
836,2018/01/25,2980.0,3005.22,2941.0,1816400,3085.0,2898.0
837,2018/01/26,2885.0,2948.626,3040.0,1780900,3065.0,2873.0
838,2018/01/29,2671.0,2731.198,2800.0,1771300,2845.0,2638.0
839,2018/01/30,2842.0,2874.305,2930.0,4262000,3010.0,2718.0
840,2018/01/31,2756.0,2801.493,2750.0,1650400,2895.0,2730.0
841,2018/02/01,2764.0,2719.266,2799.0,1605700,2799.0,2675.0
842,2018/02/02,2793.0,2747.305,2786.0,1264400,2813.0,2660.0
843,2018/02/05,2804.0,2807.337,2658.0,2810400,2933.0,2655.0
844,2018/02/06,2496.0,2506.696,2650.0,4338000,2742.0,2304.0
845,2018/02/07,2685.0,2861.09,2796.0,5757400,2996.0,2680.0
846,2018/02/08,3185.0,2979.312,2828.0,6324500,3185.0,2802.0
847,2018/02/09,3025.0,2980.646,2999.0,6909000,3115.0,2840.0
848,2018/02/13,2325.0,2411.692,2501.0,6317700,2577.0,2325.0
849,2018/02/14,1825.0,1947.479,2100.0,8318700,2127.0,1825.0
850,2018/02/15,1810.0,1809.4,1800.0,13344900,1891.0,1715.0
851,2018/02/16,1691.0,1772.035,1849.0,7244600,1865.0,1681.0
852,2018/02/19,2091.0,1907.933,1715.0,14592900,2091.0,1711.0
853,2018/02/20,1950.0,2003.009,2061.0,9623400,2105.0,1911.0
854,2018/02/21,2150.0,2139.559,1950.0,21340300,2275.0,1946.0
855,2018/02/22,2186.0,2188.275,2140.0,11039700,2249.0,2125.0
856,2018/02/23,2190.0,2208.951,2240.0,7473400,2269.0,2140.0
857,2018/02/26,2156.0,2200.746,2220.0,3604400,2250.0,2156.0
858,2018/02/27,2083.0,2083.395,2168.0,4230800,2177.0,2008.0
859,2018/02/28,2170.0,2188.604,2152.0,6076100,2244.0,2135.0
860,2018/03/01,2103.0,2110.66,2100.0,2629400,2160.0,2074.0
861,2018/03/02,2077.0,2104.664,2060.0,2996300,2183.0,2005.0
862,2018/03/05,1892.0,1990.545,2056.0,2846900,2121.0,1890.0
863,2018/03/06,2056.0,2038.67,2000.0,2550300,2089.0,1950.0
864,2018/03/07,1961.0,1987.795,2019.0,1762200,2055.0,1945.0
865,2018/03/08,1985.0,1979.59,2010.0,1312000,2014.0,1953.0
866,2018/03/09,2007.0,2017.569,2005.0,2206800,2070.0,1970.0
867,2018/03/12,1989.0,1983.184,2032.0,1309300,2039.0,1952.0
868,2018/03/13,2015.0,2044.259,2029.0,2939300,2092.0,2001.0
869,2018/03/14,2001.0,1992.405,1999.0,1425800,2028.0,1969.0
870,2018/03/15,1945.0,1957.029,1996.0,1520900,2006.0,1938.0
871,2018/03/16,1926.0,1911.506,1944.0,1121800,1948.0,1885.0
872,2018/03/19,1819.0,1833.976,1906.0,1245000,1919.0,1768.0
873,2018/03/20,1842.0,1821.185,1739.0,1112700,1886.0,1731.0
874,2018/03/22,1852.0,1820.901,1820.0,986700,1863.0,1785.0
875,2018/03/23,1746.0,1779.731,1756.0,1155800,1817.0,1736.0
876,2018/03/26,1789.0,1732.684,1722.0,1635200,1808.0,1647.0
877,2018/03/27,1776.0,1817.188,1900.0,2078600,1901.0,1757.0
878,2018/03/28,1800.0,1795.516,1749.0,954400,1832.0,1740.0
879,2018/03/29,1836.0,1826.426,1815.0,1246700,1871.0,1771.0
880,2018/03/30,1808.0,1798.353,1850.0,1108900,1851.0,1774.0
881,2018/04/02,1832.0,1860.144,1820.0,781600,1906.0,1802.0
882,2018/04/03,1812.0,1795.109,1792.0,929600,1824.0,1772.0
883,2018/04/04,1712.0,1743.554,1823.0,1376300,1834.0,1712.0
884,2018/04/05,1769.0,1753.285,1750.0,946800,1789.0,1700.0
885,2018/04/06,1772.0,1762.753,1746.0,962500,1804.0,1717.0
886,2018/04/09,1780.0,1768.009,1732.0,712600,1801.0,1725.0
887,2018/04/10,1794.0,1785.08,1764.0,613200,1813.0,1739.0
888,2018/04/11,1710.0,1750.445,1781.0,1619200,1831.0,1701.0
889,2018/04/12,1635.0,1661.777,1711.0,1134000,1716.0,1618.0
890,2018/04/13,1661.0,1657.781,1640.0,639200,1682.0,1620.0
891,2018/04/16,1620.0,1628.95,1650.0,642600,1693.0,1596.0
892,2018/04/17,1671.0,1657.244,1642.0,1201300,1709.0,1605.0
893,2018/04/18,1621.0,1639.813,1670.0,816500,1677.0,1611.0
894,2018/04/19,1600.0,1598.758,1630.0,710000,1637.0,1575.0
895,2018/04/20,1617.0,1615.756,1600.0,527900,1647.0,1583.0
896,2018/04/23,1650.0,1625.791,1617.0,573500,1657.0,1585.0
897,2018/04/24,1629.0,1663.761,1664.0,1082200,1730.0,1623.0
898,2018/04/25,1673.0,1659.972,1623.0,550200,1697.0,1619.0
899,2018/04/26,1610.0,1622.3,1673.0,821100,1679.0,1600.0
900,2018/04/27,1599.0,1603.75,1623.0,444400,1627.0,1589.0
901,2018/05/01,1568.0,1568.101,1584.0,585800,1598.0,1547.0
902,2018/05/02,1597.0,1583.237,1557.0,328200,1608.0,1555.0
903,2018/05/07,1542.0,1553.682,1571.0,465400,1589.0,1536.0
904,2018/05/08,1590.0,1573.715,1536.0,724000,1614.0,1520.0
905,2018/05/09,1557.0,1555.755,1566.0,472200,1576.0,1533.0
906,2018/05/10,1576.0,1577.111,1555.0,397500,1594.0,1554.0
907,2018/05/11,1534.0,1535.058,1547.0,682200,1564.0,1506.0
908,2018/05/14,1599.0,1618.874,1550.0,1264700,1685.0,1535.0
909,2018/05/15,1530.0,1562.878,1629.0,940300,1639.0,1519.0
910,2018/05/16,1445.0,1469.426,1514.0,1034300,1521.0,1437.0
911,2018/05/17,1460.0,1450.536,1430.0,525600,1477.0,1418.0
912,2018/05/18,1448.0,1427.858,1430.0,851600,1456.0,1401.0
913,2018/05/21,1450.0,1460.403,1431.0,534100,1485.0,1430.0
914,2018/05/22,1460.0,1485.383,1455.0,1386100,1540.0,1426.0
915,2018/05/23,1417.0,1444.341,1443.0,808300,1481.0,1414.0
916,2018/05/24,1352.0,1376.031,1424.0,1237000,1436.0,1348.0
917,2018/05/25,1344.0,1359.263,1340.0,924100,1400.0,1328.0
918,2018/05/28,1342.0,1353.427,1350.0,680800,1384.0,1326.0
919,2018/05/29,1383.0,1349.438,1388.0,967600,1389.0,1313.0
920,2018/05/30,1306.0,1323.11,1342.0,795400,1357.0,1302.0
921,2018/05/31,1360.0,1355.065,1310.0,1409600,1403.0,1308.0
922,2018/06/01,1320.0,1331.889,1343.0,719500,1373.0,1308.0
923,2018/06/04,1240.0,1258.327,1330.0,1297900,1330.0,1223.0
924,2018/06/05,1216.0,1235.658,1235.0,872200,1272.0,1210.0
925,2018/06/06,1188.0,1200.682,1222.0,934600,1234.0,1172.0
926,2018/06/07,1260.0,1248.685,1215.0,1056900,1283.0,1203.0
927,2018/06/08,1492.0,1468.048,1275.0,8196600,1560.0,1266.0
928,2018/06/11,1437.0,1435.215,1481.0,2384500,1492.0,1391.0
929,2018/06/12,1447.0,1433.464,1426.0,1138600,1466.0,1400.0
930,2018/06/13,1612.0,1592.909,1520.0,6141800,1653.0,1519.0
931,2018/06/14,1632.0,1632.718,1588.0,3163200,1682.0,1561.0
932,2018/06/15,1585.0,1597.53,1605.0,1067200,1645.0,1567.0
933,2018/06/18,1452.0,1469.005,1484.0,1327400,1521.0,1428.0
934,2018/06/19,1328.0,1374.471,1442.0,1494000,1445.0,1325.0
935,2018/06/20,1376.0,1338.622,1314.0,925500,1385.0,1304.0
936,2018/06/21,1400.0,1400.365,1400.0,879100,1443.0,1359.0
937,2018/06/22,1369.0,1364.769,1367.0,378000,1387.0,1342.0
938,2018/06/25,1308.0,1333.144,1385.0,507800,1396.0,1290.0
939,2018/06/26,1315.0,1294.351,1288.0,385000,1326.0,1251.0
940,2018/06/27,1304.0,1306.158,1300.0,304400,1328.0,1286.0
941,2018/06/28,1272.0,1284.455,1294.0,424100,1317.0,1267.0
942,2018/06/29,1353.0,1311.016,1283.0,538900,1353.0,1270.0
943,2018/07/02,1299.0,1318.655,1342.0,441000,1355.0,1290.0
944,2018/07/03,1231.0,1268.645,1284.0,889000,1353.0,1215.0
945,2018/07/04,1152.0,1181.121,1240.0,1326300,1255.0,1148.0
946,2018/07/05,1060.0,1102.341,1152.0,1675400,1164.0,1046.0
947,2018/07/06,1360.0,1357.029,1360.0,869500,1360.0,1330.0
948,2018/07/09,1625.0,1595.857,1619.0,7579000,1660.0,1520.0
949,2018/07/10,1595.0,1618.225,1585.0,5707300,1687.0,1545.0
950,2018/07/11,1596.0,1601.924,1585.0,2594800,1659.0,1552.0
951,2018/07/12,1695.0,1736.597,1657.0,7083900,1814.0,1640.0
952,2018/07/13,1622.0,1684.709,1720.0,3036600,1767.0,1604.0
953,2018/07/17,1475.0,1527.613,1600.0,2107800,1611.0,1475.0
954,2018/07/18,1466.0,1477.356,1505.0,1596000,1522.0,1441.0
955,2018/07/19,1423.0,1444.075,1471.0,792400,1485.0,1418.0
956,2018/07/20,1552.0,1578.527,1611.0,4466200,1635.0,1531.0
957,2018/07/23,1465.0,1493.325,1530.0,1183800,1538.0,1465.0
958,2018/07/24,1479.0,1453.757,1442.0,996700,1479.0,1416.0
959,2018/07/25,1453.0,1452.88,1478.0,737200,1478.0,1435.0
960,2018/07/26,1433.0,1420.8,1436.0,910200,1446.0,1398.0
961,2018/07/27,1408.0,1425.565,1426.0,802700,1451.0,1402.0
962,2018/07/30,1281.0,1325.512,1380.0,1626000,1382.0,1277.0
963,2018/07/31,1292.0,1295.985,1297.0,1140100,1326.0,1264.0
964,2018/08/01,1319.0,1307.787,1302.0,514400,1328.0,1289.0
965,2018/08/02,1293.0,1308.717,1300.0,508600,1325.0,1293.0
966,2018/08/03,1249.0,1273.276,1300.0,558600,1319.0,1241.0
967,2018/08/06,1279.0,1248.703,1234.0,714500,1286.0,1205.0
968,2018/08/07,1264.0,1288.434,1276.0,351900,1316.0,1262.0
969,2018/08/08,1284.0,1270.265,1264.0,497400,1294.0,1237.0
970,2018/08/09,1269.0,1273.813,1284.0,492300,1310.0,1247.0
971,2018/08/10,1269.0,1262.022,1259.0,464300,1283.0,1241.0
972,2018/08/13,1272.0,1283.097,1250.0,739300,1322.0,1247.0
973,2018/08/14,1360.0,1328.349,1272.0,762200,1372.0,1272.0
974,2018/08/15,1349.0,1369.164,1390.0,565600,1395.0,1330.0
975,2018/08/16,1315.0,1310.97,1342.0,566800,1342.0,1276.0
976,2018/08/17,1399.0,1390.081,1333.0,949900,1431.0,1329.0
977,2018/08/20,1365.0,1395.607,1390.0,489800,1437.0,1365.0
978,2018/08/21,1348.0,1350.114,1341.0,416300,1380.0,1323.0
979,2018/08/22,1408.0,1395.511,1337.0,656500,1421.0,1337.0
980,2018/08/23,1435.0,1439.452,1438.0,653800,1465.0,1410.0
981,2018/08/24,1453.0,1453.376,1438.0,418100,1473.0,1435.0
982,2018/08/27,1519.0,1514.042,1470.0,941400,1544.0,1464.0
983,2018/08/28,1531.0,1530.352,1542.0,774300,1568.0,1477.0
984,2018/08/29,1559.0,1558.264,1550.0,618200,1576.0,1529.0
985,2018/08/30,1571.0,1580.813,1589.0,550300,1601.0,1553.0
986,2018/08/31,1570.0,1554.203,1554.0,477800,1574.0,1531.0
987,2018/09/03,1598.0,1617.211,1609.0,700200,1654.0,1584.0
988,2018/09/04,1606.0,1603.808,1592.0,578900,1624.0,1571.0
989,2018/09/05,1604.0,1608.965,1609.0,400600,1626.0,1594.0
990,2018/09/06,1535.0,1556.718,1591.0,790400,1597.0,1516.0
991,2018/09/07,1558.0,1515.575,1515.0,471800,1558.0,1475.0
992,2018/09/10,1567.0,1554.143,1537.0,273700,1574.0,1527.0
993,2018/09/11,1539.0,1560.896,1568.0,244600,1590.0,1538.0
994,2018/09/12,1491.0,1511.156,1516.0,423600,1550.0,1486.0
995,2018/09/13,1505.0,1494.006,1477.0,326800,1518.0,1472.0
996,2018/09/14,1545.0,1526.619,1514.0,264200,1545.0,1502.0
997,2018/09/18,1571.0,1563.133,1530.0,387000,1593.0,1530.0
998,2018/09/19,1550.0,1567.804,1550.0,466800,1604.0,1542.0
999,2018/09/20,1567.0,1588.854,1586.0,1007500,1634.0,1552.0
1000,2018/09/21,1597.0,1585.449,1567.0,377100,1600.0,1561.0
1001,2018/09/25,1600.0,1605.107,1618.0,255600,1618.0,1593.0
1002,2018/09/26,1680.0,1659.077,1607.0,1114600,1697.0,1605.0
1003,2018/09/27,1650.0,1675.652,1685.0,649200,1715.0,1642.0
1004,2018/09/28,1665.0,1670.043,1660.0,281400,1686.0,1655.0
1005,2018/10/01,1671.0,1682.647,1675.0,410700,1710.0,1660.0
1006,2018/10/02,1650.0,1680.83,1690.0,552400,1712.0,1648.0
1007,2018/10/03,1512.0,1537.781,1640.0,1456200,1647.0,1443.0
1008,2018/10/04,1433.0,1460.949,1538.0,1112100,1555.0,1418.0
1009,2018/10/05,1389.0,1404.592,1413.0,632000,1443.0,1380.0
1010,2018/10/09,1336.0,1357.505,1362.0,394600,1385.0,1335.0
1011,2018/10/10,1327.0,1334.359,1345.0,509100,1377.0,1301.0
1012,2018/10/11,1239.0,1239.446,1220.0,984200,1285.0,1219.0
1013,2018/10/12,1306.0,1271.517,1239.0,570500,1320.0,1226.0
1014,2018/10/15,1177.0,1197.705,1200.0,1654200,1246.0,1168.0
1015,2018/10/16,1208.0,1199.361,1200.0,397600,1215.0,1185.0
1016,2018/10/17,1226.0,1238.875,1245.0,438100,1266.0,1215.0
1017,2018/10/18,1196.0,1201.351,1219.0,416900,1219.0,1183.0
1018,2018/10/19,1206.0,1182.648,1170.0,361600,1206.0,1162.0
1019,2018/10/22,1205.0,1197.077,1197.0,272900,1219.0,1177.0
1020,2018/10/23,1193.0,1214.292,1183.0,272700,1238.0,1183.0
1021,2018/10/24,1203.0,1201.264,1223.0,188900,1223.0,1188.0
1022,2018/10/25,1080.0,1111.245,1130.0,864800,1178.0,1078.0
1023,2018/10/26,1026.0,1037.888,1103.0,1251000,1104.0,997.0
1024,2018/10/29,1029.0,1028.966,1060.0,788200,1070.0,1000.0
1025,2018/10/30,1089.0,1061.308,1010.0,554300,1107.0,1005.0
1026,2018/10/31,1140.0,1113.227,1100.0,499100,1140.0,1083.0
1027,2018/11/01,1118.0,1118.167,1110.0,321600,1137.0,1097.0
1028,2018/11/02,1155.0,1152.122,1148.0,393500,1175.0,1138.0
1029,2018/11/05,1175.0,1174.195,1144.0,376700,1195.0,1143.0
1030,2018/11/06,1185.0,1205.171,1205.0,803800,1236.0,1177.0
1031,2018/11/07,1170.0,1179.657,1190.0,495000,1204.0,1166.0
1032,2018/11/08,1175.0,1188.83,1199.0,305600,1211.0,1173.0
1033,2018/11/09,1193.0,1193.63,1163.0,440900,1229.0,1159.0
1034,2018/11/12,1099.0,1127.087,1170.0,860800,1180.0,1080.0
1035,2018/11/13,1087.0,1064.57,1031.0,557000,1113.0,1028.0
1036,2018/11/14,1055.0,1083.867,1074.0,388600,1129.0,1052.0
1037,2018/11/15,1093.0,1081.495,1055.0,275900,1100.0,1055.0
1038,2018/11/16,1059.0,1087.59,1102.0,364500,1125.0,1056.0
1039,2018/11/19,1125.0,1112.219,1061.0,455400,1141.0,1061.0
1040,2018/11/20,1100.0,1126.407,1138.0,518800,1162.0,1090.0
1041,2018/11/21,1098.0,1102.674,1070.0,280900,1130.0,1070.0
1042,2018/11/22,1124.0,1120.321,1119.0,327200,1143.0,1102.0
1043,2018/11/26,1124.0,1128.146,1124.0,339400,1147.0,1106.0
1044,2018/11/27,1123.0,1133.126,1145.0,417600,1158.0,1116.0
1045,2018/11/28,1237.0,1211.327,1140.0,1458800,1268.0,1129.0
1046,2018/11/29,1224.0,1237.907,1250.0,692900,1267.0,1213.0
1047,2018/11/30,1192.0,1199.191,1215.0,392200,1224.0,1184.0
1048,2018/12/03,1268.0,1274.314,1282.0,972200,1310.0,1245.0
1049,2018/12/04,1230.0,1264.441,1270.0,634000,1307.0,1229.0
1050,2018/12/05,1225.0,1201.87,1183.0,477400,1234.0,1175.0
1051,2018/12/06,1162.0,1182.64,1230.0,593300,1230.0,1157.0
1052,2018/12/07,1132.0,1152.781,1180.0,392500,1192.0,1126.0
1053,2018/12/10,1045.0,1068.758,1102.0,654100,1114.0,1045.0
1054,2018/12/11,1037.0,1053.607,1071.0,502900,1096.0,1030.0
1055,2018/12/12,1102.0,1080.538,1052.0,439600,1102.0,1047.0
1056,2018/12/13,1104.0,1112.336,1129.0,318400,1134.0,1096.0
1057,2018/12/14,1142.0,1164.628,1104.0,1642900,1270.0,1067.0
1058,2018/12/17,1037.0,1056.553,1106.0,1084500,1113.0,1034.0
1059,2018/12/18,955.0,987.126,1001.0,1179200,1008.0,955.0
1060,2018/12/19,950.0,949.802,945.0,855400,977.0,928.0
1061,2018/12/20,871.0,903.828,935.0,1684400,976.0,853.0
1062,2018/12/21,829.0,831.503,856.0,1514700,875.0,792.0
1063,2018/12/25,814.0,826.297,799.0,2173000,876.0,785.0
1064,2018/12/26,843.0,842.248,856.0,946500,870.0,815.0
1065,2018/12/27,927.0,908.742,899.0,1049000,943.0,870.0
1066,2018/12/28,1077.0,1034.146,900.0,2369100,1077.0,897.0
1067,2019/01/04,1203.0,1172.066,1150.0,3823100,1263.0,1066.0
1068,2019/01/07,1215.0,1230.635,1245.0,1202100,1263.0,1196.0
1069,2019/01/08,1276.0,1260.638,1220.0,1233400,1284.0,1215.0
1070,2019/01/09,1286.0,1279.718,1271.0,1060200,1306.0,1231.0
1071,2019/01/10,1199.0,1230.806,1261.0,841800,1277.0,1195.0
1072,2019/01/11,1235.0,1242.367,1218.0,716700,1274.0,1213.0
1073,2019/01/15,1227.0,1229.232,1205.0,435800,1250.0,1198.0
1074,2019/01/16,1226.0,1232.694,1240.0,356700,1252.0,1221.0
1075,2019/01/17,1259.0,1243.226,1235.0,532700,1264.0,1222.0
1076,2019/01/18,1334.0,1318.058,1256.0,1060500,1339.0,1253.0
1077,2019/01/21,1200.0,1279.283,1342.0,1385500,1348.0,1198.0
1078,2019/01/22,1202.0,1249.444,1220.0,2036900,1335.0,1142.0
1079,2019/01/23,1160.0,1176.137,1199.0,836300,1207.0,1155.0
1080,2019/01/24,1460.0,1372.792,1250.0,5965300,1460.0,1221.0
1081,2019/01/25,1377.0,1398.897,1430.0,2892100,1444.0,1368.0
1082,2019/01/28,1287.0,1317.239,1357.0,1392500,1368.0,1275.0
1083,2019/01/29,1235.0,1239.121,1288.0,1337100,1297.0,1213.0
1084,2019/01/30,1074.0,1114.254,1149.0,2296800,1164.0,1069.0
1085,2019/01/31,1112.0,1102.86,1100.0,1326900,1142.0,1074.0
1086,2019/02/01,1087.0,1095.739,1112.0,671000,1125.0,1081.0
1087,2019/02/04,1273.0,1260.106,1237.0,4871000,1335.0,1198.0
1088,2019/02/05,1271.0,1251.522,1251.0,1312100,1284.0,1221.0
1089,2019/02/06,1250.0,1248.82,1251.0,713300,1275.0,1228.0
1090,2019/02/07,1228.0,1265.369,1273.0,1465700,1305.0,1224.0
1091,2019/02/08,1278.0,1255.418,1209.0,1363700,1290.0,1204.0
1092,2019/02/12,1406.0,1494.476,1450.0,7027900,1577.0,1388.0
1093,2019/02/13,1706.0,1585.792,1400.0,5009600,1706.0,1387.0
1094,2019/02/14,1719.0,1771.628,1711.0,12850100,1924.0,1603.0
1095,2019/02/15,1761.0,1760.755,1685.0,4492600,1811.0,1685.0
1096,2019/02/18,1683.0,1709.902,1750.0,2327500,1772.0,1658.0
1097,2019/02/19,1646.0,1672.051,1660.0,1802700,1717.0,1620.0
1098,2019/02/20,1668.0,1663.282,1665.0,1662900,1710.0,1613.0
1099,2019/02/21,1649.0,1674.283,1720.0,1335800,1724.0,1640.0
1100,2019/02/22,1685.0,1658.195,1631.0,1238700,1685.0,1626.0
1101,2019/02/25,1742.0,1722.719,1703.0,2399100,1770.0,1671.0
1102,2019/02/26,1689.0,1809.461,1745.0,7084700,1934.0,1665.0
1103,2019/02/27,2089.0,2027.03,1950.0,3791100,2089.0,1935.0
1104,2019/02/28,1941.0,2020.484,2170.0,7815600,2210.0,1870.0
1105,2019/03/01,1954.0,2027.976,2041.0,5392600,2113.0,1932.0
1106,2019/03/04,1964.0,1959.401,1970.0,2153900,2004.0,1909.0
1107,2019/03/05,1978.0,1941.844,1945.0,1697700,1985.0,1886.0
1108,2019/03/06,1930.0,1948.211,1991.0,1345900,2018.0,1912.0
1109,2019/03/07,1995.0,1986.249,1897.0,3482700,2051.0,1887.0
1110,2019/03/08,1922.0,1939.104,1955.0,2359300,1995.0,1904.0
1111,2019/03/11,1891.0,1861.127,1886.0,2587700,1925.0,1800.0
1112,2019/03/12,2014.0,2059.05,1948.0,7549800,2176.0,1945.0
1113,2019/03/13,2029.0,2013.592,1987.0,2822700,2069.0,1969.0
1114,2019/03/14,2005.0,2021.524,2050.0,1081100,2064.0,1999.0
1115,2019/03/15,1942.0,1986.358,2001.0,1496600,2032.0,1934.0
1116,2019/03/18,1998.0,2009.173,1982.0,1910800,2042.0,1960.0
1117,2019/03/19,1930.0,1943.63,1992.0,1502100,2017.0,1902.0
1118,2019/03/20,1838.0,1873.402,1911.0,1408200,1932.0,1837.0
1119,2019/03/22,1742.0,1775.966,1801.0,1690400,1843.0,1720.0
1120,2019/03/25,1750.0,1720.35,1672.0,1335300,1789.0,1662.0
1121,2019/03/26,1697.0,1716.781,1780.0,1027600,1781.0,1685.0
1122,2019/03/27,1731.0,1714.759,1697.0,808400,1741.0,1675.0
1123,2019/03/28,1726.0,1748.132,1771.0,1252500,1825.0,1706.0
1124,2019/03/29,1721.0,1721.929,1750.0,525800,1757.0,1700.0
1125,2019/04/01,1695.0,1705.405,1729.0,530300,1736.0,1689.0
1126,2019/04/02,1587.0,1593.857,1678.0,1475000,1681.0,1525.0
1127,2019/04/03,1575.0,1598.552,1598.0,901500,1640.0,1565.0
1128,2019/04/04,1603.0,1594.208,1587.0,792400,1630.0,1547.0
1129,2019/04/05,1643.0,1642.934,1595.0,1210800,1671.0,1595.0
1130,2019/04/08,1614.0,1623.069,1612.0,940600,1687.0,1590.0
1131,2019/04/09,1602.0,1608.203,1645.0,794400,1659.0,1572.0
1132,2019/04/10,1623.0,1622.606,1619.0,784800,1653.0,1603.0
1133,2019/04/11,1601.0,1604.329,1634.0,714200,1644.0,1565.0
1134,2019/04/12,1593.0,1628.955,1593.0,2824800,1742.0,1548.0
1135,2019/04/15,1601.0,1567.488,1577.0,753000,1601.0,1533.0
1136,2019/04/16,1583.0,1598.857,1600.0,544000,1623.0,1576.0
1137,2019/04/17,1604.0,1589.234,1578.0,698200,1619.0,1558.0
1138,2019/04/18,1550.0,1623.177,1680.0,2411900,1717.0,1545.0
1139,2019/04/19,1584.0,1557.008,1535.0,830100,1588.0,1517.0
1140,2019/04/22,1533.0,1555.995,1584.0,629100,1592.0,1533.0
1141,2019/04/23,1545.0,1532.733,1515.0,608600,1568.0,1492.0
1142,2019/04/24,1515.0,1573.862,1585.0,1727000,1633.0,1513.0
1143,2019/04/25,1569.0,1546.362,1525.0,627300,1586.0,1519.0
1144,2019/04/26,1594.0,1572.287,1549.0,631600,1604.0,1535.0
1145,2019/05/07,1673.0,1683.292,1634.0,1894000,1735.0,1626.0
1146,2019/05/08,1581.0,1608.769,1639.0,837500,1654.0,1581.0
1147,2019/05/09,1510.0,1524.794,1600.0,1130600,1600.0,1484.0
1148,2019/05/10,1510.0,1511.363,1514.0,628700,1543.0,1484.0
1149,2019/05/13,1463.0,1463.631,1510.0,754200,1512.0,1432.0
1150,2019/05/14,1445.0,1434.66,1400.0,800800,1467.0,1392.0
1151,2019/05/15,1554.0,1508.142,1465.0,737500,1557.0,1448.0
1152,2019/05/16,1575.0,1550.283,1520.0,523200,1578.0,1507.0
1153,2019/05/17,1614.0,1593.836,1586.0,526000,1621.0,1567.0
1154,2019/05/20,1543.0,1580.636,1628.0,619100,1645.0,1540.0
1155,2019/05/21,1582.0,1561.925,1526.0,409500,1587.0,1522.0
1156,2019/05/22,1606.0,1591.113,1583.0,450800,1606.0,1561.0
1157,2019/05/23,1616.0,1599.284,1590.0,584300,1627.0,1565.0
1158,2019/05/24,1572.0,1580.259,1582.0,506200,1607.0,1561.0
1159,2019/05/27,1568.0,1564.405,1567.0,282500,1584.0,1547.0
1160,2019/05/28,1628.0,1606.948,1565.0,618200,1632.0,1553.0
1161,2019/05/29,1567.0,1573.55,1595.0,498800,1602.0,1559.0
1162,2019/05/30,1525.0,1525.459,1561.0,638900,1562.0,1500.0
1163,2019/05/31,1529.0,1528.141,1529.0,292400,1544.0,1507.0
1164,2019/06/03,1462.0,1481.096,1495.0,572200,1531.0,1453.0
1165,2019/06/04,1517.0,1490.906,1456.0,271600,1517.0,1456.0
1166,2019/06/05,1515.0,1521.907,1541.0,533600,1558.0,1501.0
1167,2019/06/06,1506.0,1512.4,1508.0,243200,1532.0,1495.0
1168,2019/06/07,1504.0,1512.741,1516.0,278900,1532.0,1498.0
1169,2019/06/10,1496.0,1510.636,1495.0,413300,1541.0,1485.0
1170,2019/06/11,1470.0,1479.425,1499.0,324800,1502.0,1466.0
1171,2019/06/12,1428.0,1452.988,1462.0,420800,1478.0,1425.0
1172,2019/06/13,1367.0,1390.736,1411.0,502800,1418.0,1367.0
1173,2019/06/14,1401.0,1388.031,1350.0,491900,1409.0,1350.0
1174,2019/06/17,1368.0,1381.159,1394.0,280100,1410.0,1358.0
1175,2019/06/18,1318.0,1339.503,1358.0,578800,1374.0,1311.0
1176,2019/06/19,1369.0,1356.588,1350.0,345900,1370.0,1335.0
1177,2019/06/20,1402.0,1388.02,1380.0,335400,1412.0,1361.0
1178,2019/06/21,1369.0,1383.559,1402.0,257700,1404.0,1365.0
1179,2019/06/24,1358.0,1361.207,1348.0,228500,1377.0,1343.0
1180,2019/06/25,1356.0,1367.975,1366.0,347200,1386.0,1344.0
1181,2019/06/26,1370.0,1363.814,1356.0,206900,1377.0,1339.0
1182,2019/06/27,1393.0,1411.876,1360.0,733600,1475.0,1355.0
1183,2019/06/28,1400.0,1397.121,1390.0,448700,1420.0,1373.0
1184,2019/07/01,1414.0,1415.047,1407.0,378000,1435.0,1395.0
1185,2019/07/02,1464.0,1464.411,1474.0,1110300,1510.0,1435.0
1186,2019/07/03,1424.0,1425.62,1453.0,680800,1468.0,1394.0
1187,2019/07/04,1441.0,1425.368,1435.0,419700,1446.0,1408.0
1188,2019/07/05,1487.0,1464.959,1439.0,514100,1489.0,1435.0
1189,2019/07/08,1457.0,1467.804,1490.0,514800,1505.0,1446.0
1190,2019/07/09,1460.0,1453.807,1458.0,320200,1470.0,1435.0
1191,2019/07/10,1487.0,1491.449,1470.0,575400,1515.0,1462.0
1192,2019/07/11,1499.0,1497.029,1498.0,291700,1510.0,1482.0
1193,2019/07/12,1452.0,1465.887,1495.0,347200,1499.0,1451.0
1194,2019/07/16,1480.0,1469.624,1472.0,366400,1481.0,1454.0
1195,2019/07/17,1451.0,1452.212,1476.0,344500,1481.0,1431.0
1196,2019/07/18,1396.0,1405.716,1439.0,443600,1440.0,1381.0
1197,2019/07/19,1449.0,1433.443,1403.0,405600,1457.0,1400.0
1198,2019/07/22,1422.0,1425.328,1436.0,215500,1441.0,1415.0
1199,2019/07/23,1433.0,1422.797,1420.0,139900,1433.0,1407.0
1200,2019/07/24,1413.0,1433.493,1450.0,386600,1459.0,1410.0
1201,2019/07/25,1417.0,1408.876,1406.0,186300,1421.0,1398.0
1202,2019/07/26,1405.0,1406.515,1403.0,134600,1423.0,1400.0
1203,2019/07/29,1399.0,1405.918,1423.0,135600,1423.0,1395.0
1204,2019/07/30,1405.0,1398.425,1399.0,142700,1407.0,1390.0
1205,2019/07/31,1400.0,1395.671,1399.0,112500,1406.0,1388.0
1206,2019/08/01,1416.0,1398.508,1392.0,197100,1417.0,1379.0
1207,2019/08/02,1376.0,1386.137,1395.0,258300,1402.0,1376.0
1208,2019/08/05,1303.0,1302.87,1362.0,860300,1371.0,1260.0
1209,2019/08/06,1248.0,1243.051,1220.0,546100,1272.0,1218.0
1210,2019/08/07,1237.0,1258.313,1278.0,324200,1293.0,1237.0
1211,2019/08/08,1252.0,1232.772,1240.0,271600,1256.0,1206.0
1212,2019/08/09,1244.0,1256.022,1254.0,253900,1274.0,1240.0
1213,2019/08/13,1315.0,1297.094,1218.0,575700,1340.0,1212.0
1214,2019/08/14,1298.0,1301.671,1320.0,398700,1341.0,1272.0
1215,2019/08/15,1287.0,1276.353,1251.0,361000,1318.0,1241.0
1216,2019/08/16,1308.0,1291.115,1279.0,591300,1309.0,1270.0
1217,2019/08/19,1313.0,1299.681,1306.0,303000,1316.0,1286.0
1218,2019/08/20,1399.0,1371.648,1317.0,753400,1403.0,1307.0
1219,2019/08/21,1402.0,1414.906,1406.0,430200,1448.0,1395.0
1220,2019/08/22,1427.0,1421.735,1432.0,351200,1440.0,1409.0
1221,2019/08/23,1427.0,1420.241,1415.0,213800,1435.0,1401.0
