ds,yhat
2019-08-14,687.5760317656868
2019-08-15,692.4374568199344
2019-08-16,694.165557221614
2019-08-19,671.5665902312537
2019-08-20,666.8273067300768
2019-08-21,668.0672386266541
2019-08-22,672.3210817551595
2019-08-23,673.8385373091979
2019-08-26,634.8221370919954
2019-08-27,618.8306415120873
2019-08-28,610.2226367110591
2019-08-29,608.868208005029
2019-08-30,609.5168598972876
2019-09-02,565.6010312014284
2019-09-03,536.4946845274142
2019-09-04,509.58430033899936
2019-09-05,489.12158560970994
2019-09-06,474.6483135002874
2019-09-09,425.27811193949947
2019-09-10,401.8396406831752
2019-09-11,380.9823705901969
2019-09-12,367.5015342895576
