,Date,Close,VWAP,Open,Volume,High,Low
0,2014/08/25,1993.0,1995.32,2010.0,16900,2010.0,1987.0
1,2014/08/26,1967.0,1975.652,1997.0,31000,1997.0,1966.0
2,2014/08/27,1968.0,1968.296,1970.0,19600,1984.0,1963.0
3,2014/08/28,1967.0,1962.878,1970.0,18800,1970.0,1958.0
4,2014/08/29,1966.0,1962.399,1959.0,41100,2000.0,1951.0
5,2014/09/01,1970.0,1976.132,1999.0,22000,1999.0,1965.0
6,2014/09/02,1985.0,1980.905,1984.0,24300,1986.0,1969.0
7,2014/09/03,1979.0,1981.385,1989.0,19500,1989.0,1978.0
8,2014/09/04,1970.0,1971.032,1978.0,19000,1980.0,1965.0
9,2014/09/05,1968.0,1971.766,1987.0,18800,1987.0,1967.0
10,2014/09/08,1972.0,1976.427,1995.0,16400,1995.0,1969.0
11,2014/09/09,1969.0,1967.886,1986.0,15800,1986.0,1963.0
12,2014/09/10,1991.0,1983.187,1970.0,26200,1991.0,1970.0
13,2014/09/11,1977.0,1979.713,1995.0,22300,1995.0,1974.0
14,2014/09/12,1975.0,1982.351,1986.0,47300,1986.0,1971.0
15,2014/09/16,1972.0,1978.271,1990.0,26200,1990.0,1972.0
16,2014/09/17,1967.0,1972.034,1972.0,17700,1980.0,1967.0
17,2014/09/18,1980.0,1977.459,1972.0,32500,1982.0,1971.0
18,2014/09/19,1991.0,1983.977,1974.0,42700,1991.0,1969.0
19,2014/09/22,1984.0,1987.435,1993.0,14500,1993.0,1983.0
20,2014/09/24,1989.0,1985.97,1980.0,23300,1991.0,1980.0
21,2014/09/25,2030.0,2006.859,1994.0,65100,2030.0,1988.0
22,2014/09/26,1988.0,1994.546,2000.0,27100,2002.0,1980.0
23,2014/09/29,1993.0,1995.112,2000.0,18800,2000.0,1990.0
24,2014/09/30,1980.0,1981.244,1993.0,46800,1998.0,1970.0
25,2014/10/01,1981.0,1984.687,1978.0,14700,1994.0,1978.0
26,2014/10/02,1951.0,1960.839,1975.0,40300,1975.0,1951.0
27,2014/10/03,1953.0,1956.379,1950.0,28800,1963.0,1950.0
28,2014/10/06,1962.0,1964.833,1975.0,17400,1975.0,1961.0
29,2014/10/07,1961.0,1967.36,1962.0,31700,1977.0,1961.0
30,2014/10/08,1956.0,1960.791,1965.0,32500,1969.0,1955.0
31,2014/10/09,1956.0,1957.821,1961.0,44700,1965.0,1950.0
32,2014/10/10,1926.0,1935.458,1947.0,38000,1947.0,1921.0
33,2014/10/14,1902.0,1914.617,1920.0,39400,1925.0,1902.0
34,2014/10/15,1920.0,1920.189,1912.0,50400,1931.0,1906.0
35,2014/10/16,1881.0,1894.779,1901.0,48300,1919.0,1877.0
36,2014/10/17,1855.0,1867.967,1891.0,38900,1894.0,1855.0
37,2014/10/20,1905.0,1887.233,1860.0,34400,1905.0,1860.0
38,2014/10/21,1921.0,1908.717,1923.0,45500,1926.0,1888.0
39,2014/10/22,1958.0,1946.38,1928.0,28400,1959.0,1928.0
40,2014/10/23,1942.0,1944.863,1950.0,23400,1951.0,1940.0
41,2014/10/24,1980.0,1967.599,1962.0,39100,1980.0,1952.0
42,2014/10/27,2012.0,1998.785,1980.0,61300,2018.0,1979.0
43,2014/10/28,2035.0,2024.268,2012.0,57400,2036.0,2011.0
44,2014/10/29,2026.0,2033.565,2039.0,51300,2046.0,2013.0
45,2014/10/30,2019.0,2018.88,2026.0,74900,2033.0,1985.0
46,2014/10/31,2038.0,2039.963,2040.0,135100,2054.0,2013.0
47,2014/11/04,2022.0,2031.301,2040.0,73100,2060.0,2012.0
48,2014/11/05,2003.0,2012.641,2020.0,84300,2038.0,2001.0
49,2014/11/06,1996.0,2004.888,2000.0,44700,2022.0,1991.0
50,2014/11/07,2002.0,2001.273,1999.0,43200,2009.0,1995.0
51,2014/11/10,1992.0,1993.131,1996.0,40600,2004.0,1988.0
52,2014/11/11,2000.0,1998.415,1993.0,32500,2004.0,1991.0
53,2014/11/12,1996.0,1999.0,2000.0,40300,2012.0,1993.0
54,2014/11/13,2019.0,2015.164,2004.0,50100,2025.0,1996.0
55,2014/11/14,2029.0,2029.697,2040.0,42600,2040.0,2008.0
56,2014/11/17,1997.0,2001.09,2007.0,38000,2017.0,1992.0
57,2014/11/18,2000.0,2000.316,2001.0,60200,2019.0,1992.0
58,2014/11/19,1997.0,2000.009,1995.0,64300,2011.0,1995.0
59,2014/11/20,1991.0,1991.124,1994.0,42900,1997.0,1986.0
60,2014/11/21,2005.0,1992.316,1997.0,74300,2006.0,1980.0
61,2014/11/25,1990.0,1991.568,2018.0,85900,2018.0,1975.0
62,2014/11/26,1983.0,1985.68,1983.0,38800,1992.0,1983.0
63,2014/11/27,1979.0,1982.271,1981.0,39500,1990.0,1978.0
64,2014/11/28,2001.0,1997.181,1990.0,48200,2007.0,1990.0
65,2014/12/01,1989.0,1993.545,1992.0,62800,2010.0,1988.0
66,2014/12/02,1995.0,1991.475,1991.0,62300,1998.0,1987.0
67,2014/12/03,1991.0,1992.852,1991.0,50700,1999.0,1988.0
68,2014/12/04,1997.0,1999.95,1996.0,79400,2009.0,1994.0
69,2014/12/05,1994.0,1991.465,2001.0,51600,2001.0,1986.0
70,2014/12/08,1994.0,1989.495,1991.0,54600,1996.0,1984.0
71,2014/12/09,1983.0,1985.05,1985.0,47900,1991.0,1979.0
72,2014/12/10,1987.0,1988.269,1981.0,72100,1995.0,1975.0
73,2014/12/11,1981.0,1985.833,1977.0,58600,1998.0,1977.0
74,2014/12/12,1946.0,1952.056,1953.0,145300,1958.0,1946.0
75,2014/12/15,1944.0,1948.419,1946.0,80600,1961.0,1937.0
76,2014/12/16,1912.0,1922.864,1938.0,100000,1952.0,1905.0
77,2014/12/17,1915.0,1914.478,1921.0,86200,1939.0,1905.0
78,2014/12/18,1947.0,1947.66,1941.0,53200,1955.0,1937.0
79,2014/12/19,1948.0,1953.65,1962.0,71400,1971.0,1942.0
80,2014/12/22,1965.0,1955.441,1952.0,35800,1965.0,1949.0
81,2014/12/24,1989.0,1976.843,1969.0,59100,1989.0,1960.0
82,2014/12/25,1989.0,1981.798,1989.0,34600,1991.0,1971.0
83,2014/12/26,1988.0,1981.912,1992.0,36300,1992.0,1971.0
84,2014/12/29,2001.0,1998.028,1988.0,49900,2006.0,1988.0
85,2014/12/30,2001.0,2001.973,2004.0,36300,2007.0,1995.0
86,2015/01/05,1998.0,2003.237,2000.0,46500,2013.0,1991.0
87,2015/01/06,1988.0,1982.935,1992.0,58600,1992.0,1973.0
88,2015/01/07,1983.0,1981.874,1980.0,26200,1988.0,1973.0
89,2015/01/08,2000.0,1997.109,1981.0,41400,2005.0,1981.0
90,2015/01/09,1995.0,1994.421,1999.0,32800,2002.0,1988.0
91,2015/01/13,2014.0,2000.593,2000.0,43000,2015.0,1982.0
92,2015/01/14,2014.0,2012.08,2003.0,51500,2024.0,2000.0
93,2015/01/15,2048.0,2041.974,2020.0,72900,2056.0,2020.0
94,2015/01/16,2023.0,2019.862,2020.0,55900,2038.0,2006.0
95,2015/01/19,2033.0,2030.375,2024.0,38400,2047.0,2017.0
96,2015/01/20,2057.0,2049.126,2033.0,42200,2058.0,2025.0
97,2015/01/21,2075.0,2068.507,2056.0,44000,2080.0,2051.0
98,2015/01/22,2059.0,2057.211,2076.0,25100,2076.0,2050.0
99,2015/01/23,2078.0,2070.578,2079.0,36000,2079.0,2058.0
100,2015/01/26,2080.0,2076.238,2061.0,17200,2080.0,2061.0
101,2015/01/27,2118.0,2098.679,2082.0,70700,2118.0,2071.0
102,2015/01/28,2161.0,2143.503,2115.0,91000,2170.0,2101.0
103,2015/01/29,2149.0,2156.453,2150.0,48800,2165.0,2140.0
104,2015/01/30,2167.0,2170.208,2160.0,80400,2180.0,2160.0
105,2015/02/02,2165.0,2171.886,2172.0,64900,2189.0,2150.0
106,2015/02/03,2220.0,2224.676,2160.0,174600,2269.0,2148.0
107,2015/02/04,2242.0,2237.584,2220.0,87100,2265.0,2200.0
108,2015/02/05,2278.0,2267.01,2223.0,100800,2294.0,2200.0
109,2015/02/06,2271.0,2275.468,2285.0,57300,2299.0,2263.0
110,2015/02/09,2284.0,2266.955,2236.0,59400,2290.0,2223.0
111,2015/02/10,2294.0,2290.046,2263.0,47500,2300.0,2263.0
112,2015/02/12,2309.0,2312.701,2300.0,80600,2329.0,2297.0
113,2015/02/13,2308.0,2317.554,2310.0,78500,2333.0,2303.0
114,2015/02/16,2347.0,2346.181,2310.0,71700,2359.0,2310.0
115,2015/02/17,2394.0,2382.357,2348.0,75700,2398.0,2347.0
116,2015/02/18,2443.0,2438.563,2400.0,110700,2465.0,2400.0
117,2015/02/19,2450.0,2447.994,2449.0,99700,2467.0,2419.0
118,2015/02/20,2420.0,2425.734,2450.0,84600,2458.0,2415.0
119,2015/02/23,2402.0,2396.183,2422.0,102800,2443.0,2368.0
120,2015/02/24,2404.0,2403.055,2400.0,68600,2416.0,2385.0
121,2015/02/25,2444.0,2435.527,2410.0,82600,2450.0,2405.0
122,2015/02/26,2521.0,2489.639,2444.0,137600,2528.0,2436.0
123,2015/02/27,2452.0,2478.123,2545.0,113800,2545.0,2435.0
124,2015/03/02,2455.0,2462.906,2462.0,35100,2482.0,2455.0
125,2015/03/03,2439.0,2444.38,2456.0,31600,2463.0,2432.0
126,2015/03/04,2434.0,2435.695,2439.0,49900,2455.0,2425.0
127,2015/03/05,2461.0,2456.818,2434.0,35800,2467.0,2433.0
128,2015/03/06,2479.0,2470.871,2453.0,29500,2479.0,2453.0
129,2015/03/09,2485.0,2487.561,2472.0,56700,2502.0,2452.0
130,2015/03/10,2402.0,2434.671,2500.0,99700,2500.0,2401.0
131,2015/03/11,2381.0,2376.915,2396.0,114900,2398.0,2352.0
132,2015/03/12,2426.0,2408.013,2380.0,54000,2429.0,2380.0
133,2015/03/13,2410.0,2423.237,2433.0,81200,2435.0,2408.0
134,2015/03/16,2371.0,2380.036,2405.0,65900,2408.0,2365.0
135,2015/03/17,2363.0,2365.54,2372.0,63500,2389.0,2352.0
136,2015/03/18,2341.0,2335.186,2356.0,97600,2365.0,2314.0
137,2015/03/19,2334.0,2333.82,2346.0,65400,2363.0,2322.0
138,2015/03/20,2316.0,2316.272,2333.0,82800,2334.0,2302.0
139,2015/03/23,2330.0,2324.377,2316.0,64400,2339.0,2312.0
140,2015/03/24,2349.0,2339.227,2330.0,70000,2354.0,2319.0
141,2015/03/25,2335.0,2336.699,2355.0,76400,2364.0,2325.0
142,2015/03/26,2322.0,2322.96,2330.0,102500,2334.0,2310.0
143,2015/03/27,2242.0,2253.432,2224.0,122400,2291.0,2221.0
144,2015/03/30,2235.0,2243.647,2242.0,47600,2260.0,2231.0
145,2015/03/31,2237.0,2246.864,2250.0,76900,2268.0,2229.0
146,2015/04/01,2213.0,2216.397,2230.0,62000,2230.0,2200.0
147,2015/04/02,2225.0,2228.239,2225.0,63600,2238.0,2220.0
148,2015/04/03,2220.0,2219.967,2225.0,42300,2232.0,2210.0
149,2015/04/06,2169.0,2180.656,2200.0,87800,2208.0,2163.0
150,2015/04/07,2177.0,2168.796,2170.0,94700,2179.0,2155.0
151,2015/04/08,2194.0,2195.84,2179.0,112300,2211.0,2179.0
152,2015/04/09,2188.0,2194.897,2199.0,65800,2208.0,2182.0
153,2015/04/10,2168.0,2178.306,2186.0,62800,2199.0,2166.0
154,2015/04/13,2135.0,2143.738,2150.0,69900,2171.0,2131.0
155,2015/04/14,2174.0,2166.416,2139.0,100400,2188.0,2135.0
156,2015/04/15,2135.0,2150.104,2159.0,75700,2176.0,2135.0
157,2015/04/16,2156.0,2149.192,2140.0,54200,2163.0,2137.0
158,2015/04/17,2188.0,2177.115,2140.0,94000,2200.0,2138.0
159,2015/04/20,2164.0,2176.604,2186.0,77500,2210.0,2155.0
160,2015/04/21,2189.0,2178.998,2164.0,51700,2191.0,2158.0
161,2015/04/22,2168.0,2169.753,2189.0,51900,2189.0,2160.0
162,2015/04/23,2174.0,2173.407,2169.0,35900,2185.0,2162.0
163,2015/04/24,2174.0,2170.47,2176.0,43600,2186.0,2160.0
164,2015/04/27,2167.0,2148.985,2136.0,157000,2172.0,2115.0
165,2015/04/28,2170.0,2170.823,2151.0,59400,2178.0,2151.0
166,2015/04/30,2150.0,2154.367,2170.0,75200,2178.0,2140.0
167,2015/05/01,2130.0,2135.43,2144.0,63500,2156.0,2123.0
168,2015/05/07,2107.0,2117.118,2123.0,67200,2138.0,2107.0
169,2015/05/08,2122.0,2110.884,2100.0,95400,2134.0,2087.0
170,2015/05/11,2200.0,2190.086,2122.0,123200,2223.0,2119.0
171,2015/05/12,2204.0,2205.861,2200.0,87300,2234.0,2183.0
172,2015/05/13,2200.0,2203.226,2200.0,41600,2229.0,2181.0
173,2015/05/14,2198.0,2198.525,2199.0,38300,2206.0,2187.0
174,2015/05/15,2226.0,2222.592,2215.0,43100,2239.0,2206.0
175,2015/05/18,2238.0,2227.577,2239.0,35700,2239.0,2210.0
176,2015/05/19,2273.0,2267.278,2238.0,68400,2280.0,2238.0
177,2015/05/20,2230.0,2231.941,2228.0,91000,2253.0,2223.0
178,2015/05/21,2252.0,2245.687,2230.0,67500,2256.0,2228.0
179,2015/05/22,2255.0,2259.527,2259.0,69800,2276.0,2240.0
180,2015/05/25,2266.0,2270.756,2275.0,51300,2290.0,2256.0
181,2015/05/26,2332.0,2322.291,2279.0,107400,2345.0,2278.0
182,2015/05/27,2418.0,2391.113,2348.0,233900,2422.0,2329.0
183,2015/05/28,2347.0,2358.279,2370.0,78600,2393.0,2343.0
184,2015/05/29,2378.0,2386.566,2347.0,96500,2413.0,2347.0
185,2015/06/01,2373.0,2362.456,2377.0,38600,2377.0,2349.0
186,2015/06/02,2398.0,2386.719,2373.0,75000,2404.0,2351.0
187,2015/06/03,2414.0,2402.622,2405.0,68300,2416.0,2372.0
188,2015/06/04,2411.0,2398.098,2395.0,63600,2414.0,2380.0
189,2015/06/05,2424.0,2415.474,2381.0,73600,2433.0,2372.0
190,2015/06/08,2402.0,2407.235,2404.0,46900,2426.0,2395.0
191,2015/06/09,2452.0,2458.895,2399.0,134300,2478.0,2399.0
192,2015/06/10,2436.0,2437.32,2440.0,61300,2450.0,2413.0
193,2015/06/11,2477.0,2470.162,2435.0,64400,2487.0,2435.0
194,2015/06/12,2500.0,2497.762,2487.0,121100,2518.0,2477.0
195,2015/06/15,2444.0,2449.413,2499.0,57900,2499.0,2429.0
196,2015/06/16,2412.0,2427.125,2432.0,68100,2460.0,2411.0
197,2015/06/17,2478.0,2465.256,2429.0,83700,2480.0,2428.0
198,2015/06/18,2468.0,2475.21,2470.0,44300,2495.0,2463.0
199,2015/06/19,2486.0,2478.608,2470.0,79800,2497.0,2461.0
200,2015/06/22,2545.0,2533.271,2486.0,99500,2565.0,2485.0
201,2015/06/23,2547.0,2548.322,2558.0,89500,2575.0,2517.0
202,2015/06/24,2576.0,2565.88,2557.0,64000,2579.0,2549.0
203,2015/06/25,2572.0,2573.92,2553.0,56100,2590.0,2540.0
204,2015/06/26,2553.0,2568.554,2572.0,55100,2594.0,2550.0
205,2015/06/29,2513.0,2505.389,2478.0,91500,2534.0,2478.0
206,2015/06/30,2509.0,2513.178,2497.0,65600,2532.0,2497.0
207,2015/07/01,2446.0,2470.042,2509.0,90100,2509.0,2441.0
208,2015/07/02,2479.0,2482.406,2474.0,50500,2498.0,2468.0
209,2015/07/03,2424.0,2445.2,2479.0,96900,2493.0,2423.0
210,2015/07/06,2407.0,2404.971,2402.0,151500,2446.0,2381.0
211,2015/07/07,2493.0,2492.794,2432.0,112500,2513.0,2427.0
212,2015/07/08,2426.0,2446.127,2475.0,38700,2489.0,2421.0
213,2015/07/09,2380.0,2369.698,2350.0,98800,2392.0,2320.0
214,2015/07/10,2384.0,2401.45,2380.0,41800,2430.0,2375.0
215,2015/07/13,2463.0,2457.244,2386.0,54600,2495.0,2384.0
216,2015/07/14,2498.0,2492.973,2500.0,55600,2517.0,2471.0
217,2015/07/15,2514.0,2524.882,2517.0,57700,2549.0,2500.0
218,2015/07/16,2502.0,2506.917,2530.0,49500,2530.0,2494.0
219,2015/07/17,2522.0,2520.058,2497.0,27500,2544.0,2497.0
220,2015/07/21,2522.0,2523.061,2525.0,22900,2535.0,2513.0
221,2015/07/22,2517.0,2521.966,2515.0,35600,2542.0,2508.0
222,2015/07/23,2535.0,2525.004,2517.0,24000,2539.0,2500.0
223,2015/07/24,2508.0,2515.525,2530.0,22100,2530.0,2505.0
224,2015/07/27,2463.0,2470.15,2490.0,48100,2501.0,2445.0
225,2015/07/28,2456.0,2450.6,2442.0,50700,2471.0,2427.0
226,2015/07/29,2501.0,2472.824,2427.0,50600,2504.0,2427.0
227,2015/07/30,2466.0,2463.732,2451.0,47700,2484.0,2440.0
228,2015/07/31,2477.0,2467.968,2471.0,41000,2481.0,2452.0
229,2015/08/03,2482.0,2475.922,2462.0,33200,2490.0,2461.0
230,2015/08/04,2374.0,2388.989,2462.0,83600,2465.0,2362.0
231,2015/08/05,2398.0,2377.274,2365.0,66800,2415.0,2335.0
232,2015/08/06,2416.0,2424.638,2407.0,57500,2448.0,2390.0
233,2015/08/07,2381.0,2385.736,2406.0,54200,2408.0,2373.0
234,2015/08/10,2413.0,2401.549,2381.0,37000,2415.0,2376.0
235,2015/08/11,2395.0,2394.981,2424.0,48400,2437.0,2375.0
236,2015/08/12,2361.0,2364.546,2395.0,42100,2409.0,2342.0
237,2015/08/13,2318.0,2318.364,2350.0,61500,2364.0,2302.0
238,2015/08/14,2371.0,2360.12,2318.0,52700,2382.0,2311.0
239,2015/08/17,2393.0,2387.006,2385.0,34500,2395.0,2370.0
240,2015/08/18,2402.0,2394.915,2399.0,41100,2408.0,2378.0
241,2015/08/19,2344.0,2357.266,2400.0,29700,2400.0,2341.0
242,2015/08/20,2319.0,2329.944,2341.0,30400,2354.0,2317.0
243,2015/08/21,2259.0,2277.675,2301.0,46400,2306.0,2259.0
244,2015/08/24,2151.0,2185.861,2236.0,78300,2238.0,2145.0
245,2015/08/25,2056.0,2085.172,2070.0,101300,2150.0,2050.0
246,2015/08/26,2076.0,2083.127,2106.0,121600,2106.0,2051.0
247,2015/08/27,2142.0,2146.222,2119.0,50100,2178.0,2118.0
248,2015/08/28,2245.0,2219.712,2219.0,47500,2246.0,2184.0
249,2015/08/31,2200.0,2199.515,2240.0,50100,2244.0,2180.0
250,2015/09/01,2152.0,2186.89,2229.0,64400,2238.0,2151.0
251,2015/09/02,2125.0,2145.67,2120.0,38800,2184.0,2110.0
252,2015/09/03,2136.0,2151.127,2126.0,31400,2170.0,2126.0
253,2015/09/04,2124.0,2137.965,2166.0,40400,2166.0,2109.0
254,2015/09/07,2192.0,2176.496,2155.0,66500,2209.0,2125.0
255,2015/09/08,2115.0,2123.951,2176.0,40500,2183.0,2088.0
256,2015/09/09,2156.0,2121.875,2120.0,68200,2161.0,2085.0
257,2015/09/10,2100.0,2099.262,2116.0,49600,2116.0,2083.0
258,2015/09/11,2130.0,2112.546,2097.0,74600,2142.0,2097.0
259,2015/09/14,2140.0,2153.476,2144.0,69400,2176.0,2135.0
260,2015/09/15,2212.0,2216.164,2167.0,86500,2245.0,2167.0
261,2015/09/16,2234.0,2223.556,2237.0,63800,2242.0,2191.0
262,2015/09/17,2216.0,2215.131,2227.0,53500,2230.0,2201.0
263,2015/09/18,2206.0,2218.212,2216.0,50500,2244.0,2202.0
264,2015/09/24,2145.0,2165.558,2175.0,51600,2203.0,2145.0
265,2015/09/25,2175.0,2165.679,2142.0,66000,2180.0,2140.0
266,2015/09/28,2178.0,2181.202,2176.0,53100,2199.0,2165.0
267,2015/09/29,2165.0,2156.302,2158.0,86300,2172.0,2132.0
268,2015/09/30,2156.0,2160.816,2169.0,72800,2183.0,2142.0
269,2015/10/01,2159.0,2153.996,2167.0,72900,2178.0,2122.0
270,2015/10/02,2169.0,2171.414,2159.0,77600,2211.0,2154.0
271,2015/10/05,2235.0,2229.325,2211.0,53900,2244.0,2195.0
272,2015/10/06,2314.0,2314.566,2272.0,76800,2335.0,2272.0
273,2015/10/07,2331.0,2318.481,2322.0,55100,2340.0,2299.0
274,2015/10/08,2267.0,2285.846,2320.0,97800,2331.0,2258.0
275,2015/10/09,2311.0,2299.729,2300.0,47300,2311.0,2276.0
276,2015/10/13,2310.0,2308.046,2305.0,66000,2327.0,2286.0
277,2015/10/14,2360.0,2348.907,2330.0,110100,2364.0,2322.0
278,2015/10/15,2433.0,2437.092,2361.0,217600,2482.0,2361.0
279,2015/10/16,2354.0,2379.446,2456.0,142700,2460.0,2340.0
280,2015/10/19,2331.0,2332.122,2355.0,109800,2380.0,2312.0
281,2015/10/20,2311.0,2304.201,2340.0,90000,2353.0,2281.0
282,2015/10/21,2323.0,2306.539,2301.0,74800,2323.0,2289.0
283,2015/10/22,2345.0,2332.195,2302.0,91200,2351.0,2286.0
284,2015/10/23,2383.0,2379.74,2389.0,92700,2399.0,2363.0
285,2015/10/26,2383.0,2387.854,2400.0,59000,2409.0,2370.0
286,2015/10/27,2367.0,2366.77,2387.0,59600,2387.0,2358.0
287,2015/10/28,2345.0,2340.809,2357.0,72100,2357.0,2330.0
288,2015/10/29,2330.0,2327.347,2345.0,221400,2347.0,2311.0
289,2015/10/30,2366.0,2360.529,2346.0,138900,2373.0,2340.0
290,2015/11/02,2311.0,2308.871,2343.0,94800,2343.0,2290.0
291,2015/11/04,2233.0,2257.883,2345.0,156900,2349.0,2228.0
292,2015/11/05,2219.0,2232.168,2250.0,112900,2264.0,2216.0
293,2015/11/06,2180.0,2184.312,2205.0,161900,2217.0,2170.0
294,2015/11/09,2191.0,2190.973,2210.0,123600,2210.0,2180.0
295,2015/11/10,2270.0,2256.745,2200.0,215600,2292.0,2192.0
296,2015/11/11,2328.0,2310.39,2270.0,119100,2332.0,2269.0
297,2015/11/12,2346.0,2346.254,2316.0,96700,2361.0,2310.0
298,2015/11/13,2365.0,2352.704,2325.0,78400,2374.0,2320.0
299,2015/11/16,2340.0,2334.647,2315.0,62600,2353.0,2310.0
300,2015/11/17,2389.0,2382.789,2350.0,97300,2396.0,2350.0
301,2015/11/18,2346.0,2344.503,2389.0,115800,2389.0,2316.0
302,2015/11/19,2355.0,2350.394,2375.0,94100,2375.0,2333.0
303,2015/11/20,2373.0,2362.389,2340.0,75600,2380.0,2334.0
304,2015/11/24,2342.0,2346.112,2359.0,44600,2379.0,2335.0
305,2015/11/25,2320.0,2323.79,2342.0,38100,2349.0,2316.0
306,2015/11/26,2324.0,2320.066,2315.0,48400,2329.0,2310.0
307,2015/11/27,2305.0,2310.953,2318.0,44800,2327.0,2302.0
308,2015/11/30,2334.0,2329.963,2312.0,67800,2342.0,2307.0
309,2015/12/01,2338.0,2330.909,2323.0,70500,2343.0,2313.0
310,2015/12/02,2338.0,2335.931,2338.0,43300,2351.0,2320.0
311,2015/12/03,2363.0,2348.495,2328.0,53900,2363.0,2318.0
312,2015/12/04,2321.0,2325.294,2321.0,85300,2342.0,2315.0
313,2015/12/07,2316.0,2321.9,2330.0,63900,2344.0,2313.0
314,2015/12/08,2306.0,2309.829,2310.0,39700,2327.0,2303.0
315,2015/12/09,2265.0,2276.414,2300.0,76900,2324.0,2258.0
316,2015/12/10,2265.0,2251.738,2250.0,59600,2275.0,2221.0
317,2015/12/11,2259.0,2249.659,2235.0,86100,2280.0,2235.0
318,2015/12/14,2290.0,2275.846,2238.0,52000,2292.0,2238.0
319,2015/12/15,2251.0,2267.638,2289.0,50300,2306.0,2241.0
320,2015/12/16,2304.0,2293.361,2290.0,60900,2306.0,2266.0
321,2015/12/17,2388.0,2371.277,2330.0,106200,2388.0,2326.0
322,2015/12/18,2361.0,2377.945,2382.0,89400,2411.0,2361.0
323,2015/12/21,2347.0,2335.388,2356.0,50800,2383.0,2299.0
324,2015/12/22,2335.0,2345.055,2347.0,31100,2360.0,2330.0
325,2015/12/24,2325.0,2327.468,2323.0,48300,2343.0,2313.0
326,2015/12/25,2321.0,2325.72,2309.0,24300,2345.0,2309.0
327,2015/12/28,2307.0,2307.335,2321.0,72300,2350.0,2293.0
328,2015/12/29,2328.0,2325.663,2308.0,49900,2343.0,2302.0
329,2015/12/30,2330.0,2330.075,2342.0,57500,2345.0,2315.0
330,2016/01/04,2321.0,2349.821,2346.0,73900,2384.0,2318.0
331,2016/01/05,2315.0,2316.316,2321.0,64500,2343.0,2286.0
332,2016/01/06,2246.0,2260.702,2315.0,106400,2315.0,2235.0
333,2016/01/07,2242.0,2253.616,2250.0,95300,2293.0,2231.0
334,2016/01/08,2205.0,2222.13,2231.0,67100,2256.0,2201.0
335,2016/01/12,2150.0,2171.58,2187.0,70500,2203.0,2150.0
336,2016/01/13,2190.0,2183.544,2166.0,69800,2205.0,2151.0
337,2016/01/14,2187.0,2165.943,2155.0,75800,2188.0,2144.0
338,2016/01/15,2178.0,2181.137,2199.0,54700,2218.0,2162.0
339,2016/01/18,2161.0,2156.049,2160.0,48800,2178.0,2135.0
340,2016/01/19,2136.0,2145.383,2162.0,44600,2179.0,2124.0
341,2016/01/20,2094.0,2110.134,2126.0,70800,2155.0,2089.0
342,2016/01/21,2055.0,2083.855,2098.0,73700,2110.0,2054.0
343,2016/01/22,2175.0,2131.367,2091.0,82100,2177.0,2072.0
344,2016/01/25,2254.0,2239.898,2192.0,51800,2265.0,2192.0
345,2016/01/26,2237.0,2238.336,2201.0,77500,2267.0,2200.0
346,2016/01/27,2278.0,2269.55,2290.0,65500,2298.0,2246.0
347,2016/01/28,2247.0,2248.976,2245.0,70100,2272.0,2231.0
348,2016/01/29,2298.0,2281.009,2283.0,94000,2302.0,2240.0
349,2016/02/01,2346.0,2338.998,2305.0,62100,2355.0,2305.0
350,2016/02/02,2347.0,2339.831,2302.0,37300,2356.0,2302.0
351,2016/02/03,2225.0,2230.501,2200.0,210100,2266.0,2200.0
352,2016/02/04,2188.0,2192.034,2201.0,110600,2228.0,2173.0
353,2016/02/05,2200.0,2185.754,2174.0,62600,2206.0,2162.0
354,2016/02/08,2238.0,2220.338,2200.0,44700,2249.0,2179.0
355,2016/02/09,2197.0,2199.148,2190.0,74800,2227.0,2173.0
356,2016/02/10,2139.0,2151.172,2197.0,103100,2211.0,2113.0
357,2016/02/12,2028.0,2056.614,2095.0,91500,2116.0,2025.0
358,2016/02/15,2045.0,2052.456,2095.0,153700,2110.0,2032.0
359,2016/02/16,2015.0,2040.813,2040.0,104800,2073.0,2015.0
360,2016/02/17,2027.0,2021.281,2049.0,74000,2049.0,2003.0
361,2016/02/18,2053.0,2056.722,2053.0,64100,2073.0,2034.0
362,2016/02/19,2030.0,2022.357,2057.0,64400,2057.0,2000.0
363,2016/02/22,2023.0,2017.522,2013.0,109700,2043.0,1993.0
364,2016/02/23,1985.0,1990.357,2023.0,109500,2023.0,1973.0
365,2016/02/24,2019.0,2015.98,1990.0,97000,2039.0,1990.0
366,2016/02/25,2042.0,2037.898,2004.0,70600,2057.0,2004.0
367,2016/02/26,2036.0,2036.822,2042.0,51600,2064.0,2022.0
368,2016/02/29,2030.0,2057.223,2064.0,87000,2088.0,2030.0
369,2016/03/01,1991.0,1993.405,2020.0,109000,2020.0,1983.0
370,2016/03/02,1999.0,2007.145,2010.0,89100,2023.0,1993.0
371,2016/03/03,2006.0,1998.911,2000.0,91400,2008.0,1991.0
372,2016/03/04,2041.0,2029.721,2006.0,101000,2043.0,1996.0
373,2016/03/07,2084.0,2084.832,2043.0,129700,2114.0,2022.0
374,2016/03/08,2069.0,2075.679,2084.0,103500,2098.0,2052.0
375,2016/03/09,2083.0,2077.566,2063.0,69600,2091.0,2063.0
376,2016/03/10,2113.0,2117.854,2100.0,91100,2131.0,2099.0
377,2016/03/11,2157.0,2137.753,2096.0,97500,2168.0,2096.0
378,2016/03/14,2150.0,2151.764,2173.0,67800,2180.0,2144.0
379,2016/03/15,2134.0,2137.37,2145.0,88700,2155.0,2123.0
380,2016/03/16,2134.0,2135.385,2123.0,74800,2158.0,2117.0
381,2016/03/17,2085.0,2097.489,2135.0,148400,2136.0,2072.0
382,2016/03/18,2050.0,2042.359,2074.0,251900,2078.0,2021.0
383,2016/03/22,2077.0,2067.127,2058.0,135500,2085.0,2042.0
384,2016/03/23,2148.0,2130.341,2085.0,109200,2148.0,2085.0
385,2016/03/24,2190.0,2188.921,2150.0,133600,2205.0,2150.0
386,2016/03/25,2203.0,2198.739,2195.0,95400,2208.0,2186.0
387,2016/03/28,2258.0,2232.806,2202.0,186000,2258.0,2202.0
388,2016/03/29,2234.0,2225.788,2224.0,161000,2247.0,2202.0
389,2016/03/30,2212.0,2215.581,2234.0,139000,2234.0,2202.0
390,2016/03/31,2226.0,2221.616,2221.0,177500,2243.0,2199.0
391,2016/04/01,2181.0,2187.532,2212.0,188900,2220.0,2165.0
392,2016/04/04,2180.0,2178.227,2175.0,99500,2203.0,2160.0
393,2016/04/05,2128.0,2135.408,2168.0,82200,2168.0,2119.0
394,2016/04/06,2114.0,2112.14,2131.0,86000,2132.0,2100.0
395,2016/04/07,2101.0,2095.434,2108.0,98600,2135.0,2071.0
396,2016/04/08,2134.0,2101.554,2070.0,133100,2149.0,2059.0
397,2016/04/11,2106.0,2106.856,2122.0,56200,2132.0,2093.0
398,2016/04/12,2092.0,2096.026,2089.0,61200,2113.0,2089.0
399,2016/04/13,2089.0,2087.121,2091.0,59300,2103.0,2071.0
400,2016/04/14,2120.0,2098.023,2104.0,65000,2120.0,2070.0
401,2016/04/15,2093.0,2090.331,2090.0,52200,2103.0,2079.0
402,2016/04/18,2043.0,2045.75,2060.0,60800,2060.0,2026.0
403,2016/04/19,2079.0,2074.092,2085.0,72800,2089.0,2061.0
404,2016/04/20,2073.0,2076.034,2090.0,56500,2092.0,2063.0
405,2016/04/21,2092.0,2080.928,2089.0,89400,2094.0,2069.0
406,2016/04/22,2139.0,2118.185,2076.0,105700,2142.0,2069.0
407,2016/04/25,2093.0,2109.012,2143.0,81700,2145.0,2087.0
408,2016/04/26,2088.0,2086.86,2093.0,84800,2105.0,2066.0
409,2016/04/27,2143.0,2129.422,2105.0,111000,2147.0,2105.0
410,2016/04/28,2128.0,2159.411,2165.0,140200,2193.0,2125.0
411,2016/05/02,2065.0,2059.313,2078.0,71000,2078.0,2044.0
412,2016/05/06,2061.0,2052.908,2077.0,55500,2079.0,2039.0
413,2016/05/09,2072.0,2075.1,2089.0,32900,2099.0,2066.0
414,2016/05/10,2108.0,2100.511,2082.0,78500,2117.0,2075.0
415,2016/05/11,2122.0,2116.983,2120.0,65700,2123.0,2111.0
416,2016/05/12,2092.0,2085.897,2095.0,81800,2104.0,2074.0
417,2016/05/13,2050.0,2054.856,2073.0,78700,2073.0,2041.0
418,2016/05/16,1941.0,1956.996,2035.0,218500,2037.0,1936.0
419,2016/05/17,1972.0,1958.594,1966.0,107700,1973.0,1941.0
420,2016/05/18,1965.0,1962.425,1980.0,85400,1990.0,1950.0
421,2016/05/19,1943.0,1948.91,1978.0,71100,1979.0,1939.0
422,2016/05/20,1957.0,1952.082,1959.0,60700,1961.0,1942.0
423,2016/05/23,1944.0,1938.815,1957.0,70800,1957.0,1927.0
424,2016/05/24,1933.0,1939.926,1944.0,40600,1949.0,1932.0
425,2016/05/25,1987.0,1977.531,1957.0,70000,1989.0,1954.0
426,2016/05/26,1990.0,2002.298,2000.0,66800,2018.0,1983.0
427,2016/05/27,1995.0,1995.097,2000.0,61800,2013.0,1983.0
428,2016/05/30,2013.0,2005.019,2004.0,25800,2014.0,1991.0
429,2016/05/31,2035.0,2030.862,2012.0,95500,2044.0,2008.0
430,2016/06/01,2011.0,2016.135,2012.0,35500,2034.0,2001.0
431,2016/06/02,1980.0,1992.356,2000.0,59000,2021.0,1980.0
432,2016/06/03,2024.0,2010.465,1980.0,65100,2028.0,1978.0
433,2016/06/06,2026.0,2025.44,2020.0,59800,2044.0,2001.0
434,2016/06/07,2010.0,2010.971,2035.0,44300,2035.0,1997.0
435,2016/06/08,2032.0,2014.31,2005.0,98600,2032.0,1996.0
436,2016/06/09,2020.0,2018.494,2023.0,49400,2029.0,2000.0
437,2016/06/10,2027.0,2025.47,2032.0,62400,2032.0,2010.0
438,2016/06/13,2006.0,2010.083,2002.0,70000,2022.0,1998.0
439,2016/06/14,1967.0,1980.623,1996.0,68400,2008.0,1965.0
440,2016/06/15,1963.0,1965.756,1965.0,78300,1986.0,1951.0
441,2016/06/16,1918.0,1931.241,1955.0,81200,1978.0,1917.0
442,2016/06/17,1916.0,1938.799,1947.0,78200,1963.0,1916.0
443,2016/06/20,1973.0,1978.222,1956.0,103100,2003.0,1939.0
444,2016/06/21,1979.0,1974.261,1973.0,72300,1990.0,1957.0
445,2016/06/22,1968.0,1962.371,1979.0,47200,1983.0,1947.0
446,2016/06/23,1952.0,1952.081,1968.0,27100,1968.0,1945.0
447,2016/06/24,1845.0,1877.626,1954.0,94900,1964.0,1834.0
448,2016/06/27,1900.0,1894.458,1864.0,72300,1922.0,1862.0
449,2016/06/28,1921.0,1908.025,1890.0,59900,1931.0,1872.0
450,2016/06/29,1901.0,1902.67,1933.0,78200,1934.0,1890.0
451,2016/06/30,1883.0,1887.088,1902.0,87100,1919.0,1874.0
452,2016/07/01,1913.0,1908.793,1899.0,37200,1919.0,1893.0
453,2016/07/04,1921.0,1911.076,1910.0,33100,1921.0,1899.0
454,2016/07/05,1928.0,1925.443,1925.0,58200,1935.0,1906.0
455,2016/07/06,1909.0,1897.903,1908.0,57500,1909.0,1884.0
456,2016/07/07,1895.0,1898.431,1912.0,51800,1923.0,1885.0
457,2016/07/08,1845.0,1863.721,1893.0,74200,1893.0,1845.0
458,2016/07/11,1872.0,1870.432,1848.0,67100,1885.0,1846.0
459,2016/07/12,1928.0,1929.534,1876.0,116700,1951.0,1876.0
460,2016/07/13,1938.0,1941.484,1948.0,66300,1964.0,1929.0
461,2016/07/14,1962.0,1962.43,1938.0,47400,1976.0,1936.0
462,2016/07/15,1921.0,1939.868,1975.0,48400,1975.0,1916.0
463,2016/07/19,1918.0,1911.787,1931.0,54500,1931.0,1901.0
464,2016/07/20,1910.0,1902.407,1908.0,43200,1913.0,1893.0
465,2016/07/21,1911.0,1909.546,1925.0,42500,1925.0,1900.0
466,2016/07/22,1905.0,1896.291,1912.0,50200,1912.0,1888.0
467,2016/07/25,1913.0,1911.006,1903.0,51800,1919.0,1889.0
468,2016/07/26,1883.0,1888.704,1913.0,82000,1916.0,1879.0
469,2016/07/27,1900.0,1900.338,1897.0,62400,1913.0,1885.0
470,2016/07/28,1890.0,1887.291,1910.0,50100,1910.0,1878.0
471,2016/07/29,1909.0,1888.944,1887.0,44300,1909.0,1874.0
472,2016/08/01,1880.0,1873.626,1890.0,75100,1891.0,1861.0
473,2016/08/02,1885.0,1885.651,1880.0,35000,1894.0,1877.0
474,2016/08/03,1790.0,1811.489,1862.0,211000,1876.0,1790.0
475,2016/08/04,1790.0,1778.195,1799.0,110000,1800.0,1760.0
476,2016/08/05,1831.0,1812.87,1790.0,84800,1835.0,1783.0
477,2016/08/08,1824.0,1822.479,1832.0,42600,1846.0,1810.0
478,2016/08/09,1828.0,1830.131,1823.0,52700,1844.0,1820.0
479,2016/08/10,1839.0,1842.989,1842.0,62700,1857.0,1829.0
480,2016/08/12,1896.0,1877.806,1856.0,88700,1897.0,1845.0
481,2016/08/15,1872.0,1874.0,1897.0,28900,1898.0,1865.0
482,2016/08/16,1816.0,1831.355,1867.0,73200,1867.0,1816.0
483,2016/08/17,1810.0,1807.054,1815.0,72600,1815.0,1801.0
484,2016/08/18,1802.0,1804.58,1810.0,42600,1813.0,1801.0
485,2016/08/19,1780.0,1787.75,1800.0,75700,1801.0,1777.0
486,2016/08/22,1777.0,1776.095,1784.0,52700,1785.0,1771.0
487,2016/08/23,1788.0,1785.593,1780.0,55500,1798.0,1775.0
488,2016/08/24,1786.0,1786.202,1800.0,43000,1800.0,1778.0
489,2016/08/25,1796.0,1794.484,1786.0,34700,1799.0,1786.0
490,2016/08/26,1777.0,1781.568,1796.0,48600,1796.0,1776.0
491,2016/08/29,1790.0,1789.773,1794.0,37800,1801.0,1782.0
492,2016/08/30,1785.0,1788.793,1790.0,35200,1795.0,1782.0
493,2016/08/31,1768.0,1767.809,1785.0,118400,1787.0,1761.0
494,2016/09/01,1829.0,1811.191,1785.0,105400,1830.0,1780.0
495,2016/09/02,1805.0,1811.802,1822.0,34400,1831.0,1804.0
496,2016/09/05,1840.0,1841.918,1818.0,70500,1857.0,1816.0
497,2016/09/06,1852.0,1852.604,1838.0,52300,1860.0,1837.0
498,2016/09/07,1842.0,1843.822,1850.0,39800,1851.0,1837.0
499,2016/09/08,1819.0,1823.791,1843.0,55400,1845.0,1812.0
500,2016/09/09,1820.0,1822.361,1816.0,61500,1831.0,1816.0
501,2016/09/12,1820.0,1815.42,1818.0,57900,1825.0,1801.0
502,2016/09/13,1806.0,1811.8,1822.0,46600,1830.0,1805.0
503,2016/09/14,1800.0,1802.7,1806.0,38600,1811.0,1800.0
504,2016/09/15,1794.0,1791.429,1800.0,64300,1800.0,1782.0
505,2016/09/16,1781.0,1786.357,1794.0,58500,1802.0,1781.0
506,2016/09/20,1794.0,1791.762,1783.0,79700,1804.0,1772.0
507,2016/09/21,1824.0,1808.436,1803.0,64900,1824.0,1789.0
508,2016/09/23,1848.0,1836.9,1829.0,57700,1848.0,1819.0
509,2016/09/26,1850.0,1853.062,1848.0,41700,1862.0,1838.0
510,2016/09/27,1844.0,1827.96,1830.0,70700,1844.0,1812.0
511,2016/09/28,1831.0,1825.961,1848.0,73600,1851.0,1804.0
512,2016/09/29,1828.0,1838.714,1844.0,61500,1859.0,1825.0
513,2016/09/30,1816.0,1822.444,1818.0,44400,1838.0,1815.0
514,2016/10/03,1841.0,1847.821,1848.0,45300,1857.0,1837.0
515,2016/10/04,1854.0,1853.894,1859.0,51000,1860.0,1841.0
516,2016/10/05,1867.0,1866.471,1861.0,52700,1873.0,1850.0
517,2016/10/06,1874.0,1875.785,1875.0,46400,1885.0,1861.0
518,2016/10/07,1855.0,1854.813,1860.0,38500,1866.0,1846.0
519,2016/10/11,1866.0,1862.708,1857.0,38000,1869.0,1848.0
520,2016/10/12,1856.0,1862.494,1863.0,35400,1872.0,1853.0
521,2016/10/13,1869.0,1865.929,1855.0,49600,1874.0,1855.0
522,2016/10/14,1872.0,1870.761,1871.0,49000,1879.0,1861.0
523,2016/10/17,1871.0,1866.922,1872.0,52200,1872.0,1861.0
524,2016/10/18,1899.0,1892.323,1875.0,65600,1899.0,1874.0
525,2016/10/19,1907.0,1903.115,1899.0,46900,1908.0,1895.0
526,2016/10/20,1919.0,1922.531,1910.0,86300,1939.0,1910.0
527,2016/10/21,1943.0,1936.845,1927.0,52800,1944.0,1920.0
528,2016/10/24,1967.0,1957.44,1945.0,63700,1967.0,1943.0
529,2016/10/25,1957.0,1964.978,1967.0,97900,1981.0,1957.0
530,2016/10/26,1934.0,1926.254,1952.0,123800,1952.0,1901.0
531,2016/10/27,1943.0,1943.825,1934.0,56600,1956.0,1934.0
532,2016/10/28,1949.0,1945.595,1948.0,64000,1962.0,1931.0
533,2016/10/31,2044.0,2012.174,1960.0,161300,2044.0,1960.0
534,2016/11/01,2070.0,2054.876,2044.0,118700,2071.0,2028.0
535,2016/11/02,2049.0,2046.653,2069.0,81800,2069.0,2036.0
536,2016/11/04,2030.0,2020.278,2040.0,71900,2040.0,1992.0
537,2016/11/07,2001.0,2009.186,2042.0,86000,2042.0,1992.0
538,2016/11/08,2007.0,2006.774,2002.0,44300,2018.0,1999.0
539,2016/11/09,1939.0,1971.552,2018.0,81200,2030.0,1925.0
540,2016/11/10,1971.0,1974.171,1976.0,109000,2007.0,1958.0
541,2016/11/11,1941.0,1945.216,1980.0,96800,1994.0,1929.0
542,2016/11/14,1986.0,1981.46,1973.0,61500,1989.0,1960.0
543,2016/11/15,2012.0,2011.201,2000.0,94000,2024.0,1993.0
544,2016/11/16,2001.0,1999.398,2003.0,55300,2013.0,1991.0
545,2016/11/17,1980.0,1978.614,2000.0,61700,2000.0,1960.0
546,2016/11/18,1969.0,1973.051,2000.0,60600,2000.0,1962.0
547,2016/11/21,1975.0,1978.699,1980.0,45800,1987.0,1972.0
548,2016/11/22,1969.0,1975.596,1989.0,52200,1992.0,1969.0
549,2016/11/24,1971.0,1975.891,1995.0,56600,1995.0,1967.0
550,2016/11/25,1973.0,1974.377,1981.0,58300,1983.0,1968.0
551,2016/11/28,1995.0,1987.718,1983.0,62400,1997.0,1976.0
552,2016/11/29,1989.0,1988.315,1995.0,61300,2006.0,1981.0
553,2016/11/30,2009.0,2007.906,1991.0,78000,2018.0,1984.0
554,2016/12/01,2010.0,2020.9,2024.0,61900,2034.0,2008.0
555,2016/12/02,1998.0,1996.438,2009.0,57500,2009.0,1983.0
556,2016/12/05,1988.0,1988.725,2000.0,57900,2001.0,1977.0
557,2016/12/06,2002.0,2001.965,2000.0,67700,2009.0,1995.0
558,2016/12/07,2009.0,2003.405,2002.0,49900,2009.0,1994.0
559,2016/12/08,2009.0,2003.542,2010.0,66200,2016.0,1995.0
560,2016/12/09,1988.0,1988.736,1994.0,119400,2001.0,1981.0
561,2016/12/12,2027.0,2010.689,1998.0,104700,2027.0,1995.0
562,2016/12/13,2124.0,2094.148,2030.0,170000,2136.0,2030.0
563,2016/12/14,2104.0,2116.049,2130.0,103100,2155.0,2095.0
564,2016/12/15,2103.0,2105.218,2100.0,52300,2118.0,2093.0
565,2016/12/16,2119.0,2122.841,2114.0,59900,2132.0,2104.0
566,2016/12/19,2134.0,2134.263,2118.0,79000,2148.0,2113.0
567,2016/12/20,2166.0,2149.338,2130.0,109500,2168.0,2126.0
568,2016/12/21,2127.0,2145.495,2166.0,40800,2168.0,2123.0
569,2016/12/22,2130.0,2120.879,2123.0,32100,2130.0,2107.0
570,2016/12/26,2154.0,2147.68,2123.0,45900,2163.0,2123.0
571,2016/12/27,2156.0,2160.481,2153.0,37000,2170.0,2153.0
572,2016/12/28,2149.0,2147.067,2156.0,34400,2156.0,2134.0
573,2016/12/29,2117.0,2114.155,2125.0,69200,2128.0,2102.0
574,2016/12/30,2109.0,2101.603,2100.0,65800,2113.0,2071.0
575,2017/01/04,2143.0,2134.326,2105.0,77300,2147.0,2101.0
576,2017/01/05,2128.0,2122.854,2135.0,89200,2135.0,2111.0
577,2017/01/06,2139.0,2134.152,2121.0,59100,2145.0,2120.0
578,2017/01/10,2120.0,2121.868,2138.0,55400,2138.0,2107.0
579,2017/01/11,2109.0,2120.729,2144.0,79700,2151.0,2105.0
580,2017/01/12,2094.0,2089.247,2110.0,91500,2110.0,2068.0
581,2017/01/13,2077.0,2079.353,2061.0,50100,2093.0,2061.0
582,2017/01/16,2049.0,2054.979,2076.0,51900,2077.0,2039.0
583,2017/01/17,2024.0,2029.433,2039.0,56800,2045.0,2023.0
584,2017/01/18,2030.0,2023.954,2022.0,47600,2037.0,2014.0
585,2017/01/19,2076.0,2067.176,2030.0,57500,2095.0,2030.0
586,2017/01/20,2053.0,2047.629,2043.0,58000,2056.0,2031.0
587,2017/01/23,2011.0,2020.505,2056.0,69700,2056.0,2011.0
588,2017/01/24,2012.0,2012.73,2011.0,70000,2022.0,2004.0
589,2017/01/25,2020.0,2019.496,2034.0,36100,2040.0,2012.0
590,2017/01/26,2034.0,2035.922,2048.0,51000,2049.0,2026.0
591,2017/01/27,2028.0,2027.211,2039.0,64900,2041.0,2021.0
592,2017/01/30,2051.0,2043.737,2044.0,51300,2069.0,2027.0
593,2017/01/31,2043.0,2043.911,2036.0,75600,2056.0,2036.0
594,2017/02/01,2046.0,2042.55,2038.0,78200,2057.0,2031.0
595,2017/02/02,2043.0,2047.27,2060.0,46700,2070.0,2035.0
596,2017/02/03,2110.0,2102.693,2034.0,156400,2129.0,2033.0
597,2017/02/06,2126.0,2134.208,2110.0,108200,2157.0,2105.0
598,2017/02/07,2131.0,2130.104,2126.0,82600,2147.0,2109.0
599,2017/02/08,2137.0,2126.885,2134.0,52800,2137.0,2110.0
600,2017/02/09,2130.0,2127.338,2135.0,45600,2135.0,2112.0
601,2017/02/10,2153.0,2148.749,2142.0,66900,2160.0,2136.0
602,2017/02/13,2179.0,2170.167,2156.0,78500,2187.0,2152.0
603,2017/02/14,2160.0,2177.076,2180.0,91600,2194.0,2160.0
604,2017/02/15,2153.0,2150.092,2156.0,78000,2164.0,2142.0
605,2017/02/16,2162.0,2161.173,2159.0,85400,2175.0,2150.0
606,2017/02/17,2167.0,2151.291,2154.0,89100,2167.0,2137.0
607,2017/02/20,2136.0,2133.682,2159.0,75800,2159.0,2121.0
608,2017/02/21,2149.0,2142.451,2137.0,30800,2154.0,2128.0
609,2017/02/22,2164.0,2160.984,2151.0,50600,2170.0,2146.0
610,2017/02/23,2186.0,2181.253,2164.0,45900,2187.0,2164.0
611,2017/02/24,2185.0,2188.417,2179.0,43600,2197.0,2174.0
612,2017/02/27,2165.0,2165.881,2173.0,42800,2179.0,2151.0
613,2017/02/28,2173.0,2183.321,2179.0,70200,2195.0,2173.0
614,2017/03/01,2178.0,2167.465,2172.0,54800,2178.0,2156.0
615,2017/03/02,2217.0,2209.227,2198.0,76200,2219.0,2197.0
616,2017/03/03,2208.0,2205.198,2217.0,49600,2217.0,2197.0
617,2017/03/06,2194.0,2196.135,2208.0,39300,2208.0,2189.0
618,2017/03/07,2190.0,2192.067,2191.0,35700,2196.0,2185.0
619,2017/03/08,2184.0,2181.77,2190.0,46000,2193.0,2177.0
620,2017/03/09,2165.0,2170.391,2184.0,54000,2185.0,2162.0
621,2017/03/10,2210.0,2204.666,2203.0,73400,2210.0,2186.0
622,2017/03/13,2214.0,2209.099,2210.0,36200,2214.0,2200.0
623,2017/03/14,2208.0,2216.465,2214.0,76400,2227.0,2205.0
624,2017/03/15,2188.0,2189.316,2200.0,60100,2201.0,2181.0
625,2017/03/16,2176.0,2172.441,2183.0,70500,2183.0,2161.0
626,2017/03/17,2156.0,2153.016,2165.0,115700,2168.0,2141.0
627,2017/03/21,2166.0,2165.003,2167.0,78400,2173.0,2146.0
628,2017/03/22,2132.0,2137.131,2152.0,116800,2152.0,2123.0
629,2017/03/23,2125.0,2125.36,2130.0,107300,2140.0,2118.0
630,2017/03/24,2126.0,2122.232,2120.0,120800,2128.0,2115.0
631,2017/03/27,2103.0,2111.685,2120.0,121100,2122.0,2102.0
632,2017/03/28,2128.0,2122.015,2111.0,197400,2138.0,2110.0
633,2017/03/29,2063.0,2063.892,2081.0,133900,2090.0,2048.0
634,2017/03/30,2055.0,2056.724,2055.0,49300,2063.0,2051.0
635,2017/03/31,2007.0,2028.337,2055.0,69500,2055.0,2007.0
636,2017/04/03,2047.0,2052.277,2032.0,92200,2069.0,2028.0
637,2017/04/04,2055.0,2055.172,2054.0,89700,2070.0,2038.0
638,2017/04/05,2092.0,2084.991,2055.0,100200,2098.0,2046.0
639,2017/04/06,2042.0,2055.449,2092.0,65900,2094.0,2041.0
640,2017/04/07,2133.0,2115.375,2076.0,192200,2140.0,2071.0
641,2017/04/10,2096.0,2096.949,2133.0,106800,2141.0,2070.0
642,2017/04/11,2053.0,2054.428,2058.0,78900,2065.0,2047.0
643,2017/04/12,2048.0,2043.305,2049.0,62900,2054.0,2028.0
644,2017/04/13,2034.0,2036.21,2040.0,51500,2044.0,2030.0
645,2017/04/14,2010.0,2017.982,2033.0,45000,2035.0,2007.0
646,2017/04/17,2034.0,2034.265,2010.0,35800,2042.0,2010.0
647,2017/04/18,2030.0,2030.588,2044.0,41000,2047.0,2022.0
648,2017/04/19,2018.0,2018.252,2019.0,76500,2030.0,2009.0
649,2017/04/20,2030.0,2021.28,2040.0,50800,2040.0,2006.0
650,2017/04/21,2048.0,2041.934,2039.0,52900,2053.0,2027.0
651,2017/04/24,2067.0,2062.058,2048.0,70800,2075.0,2045.0
652,2017/04/25,2087.0,2079.589,2065.0,53000,2091.0,2055.0
653,2017/04/26,2108.0,2100.385,2087.0,59700,2109.0,2083.0
654,2017/04/27,2108.0,2106.482,2087.0,46900,2117.0,2087.0
655,2017/04/28,2092.0,2091.185,2108.0,30800,2108.0,2081.0
656,2017/05/01,2086.0,2085.905,2071.0,31400,2092.0,2071.0
657,2017/05/02,2103.0,2108.838,2100.0,51200,2122.0,2092.0
658,2017/05/08,2165.0,2150.612,2123.0,114800,2165.0,2120.0
659,2017/05/09,2170.0,2169.849,2162.0,83500,2182.0,2153.0
660,2017/05/10,2170.0,2166.053,2168.0,49500,2177.0,2159.0
661,2017/05/11,2170.0,2166.445,2170.0,40900,2172.0,2158.0
662,2017/05/12,2157.0,2152.385,2166.0,40000,2166.0,2140.0
663,2017/05/15,2038.0,2049.465,2065.0,193300,2088.0,2034.0
664,2017/05/16,2052.0,2051.858,2050.0,87500,2064.0,2042.0
665,2017/05/17,2061.0,2052.578,2052.0,96400,2063.0,2035.0
666,2017/05/18,2039.0,2030.681,2034.0,83100,2041.0,2016.0
667,2017/05/19,2032.0,2029.447,2044.0,70700,2045.0,2022.0
668,2017/05/22,2047.0,2046.092,2024.0,77100,2061.0,2018.0
669,2017/05/23,2048.0,2049.084,2045.0,63500,2062.0,2035.0
670,2017/05/24,2051.0,2053.783,2063.0,32700,2065.0,2046.0
671,2017/05/25,2040.0,2045.333,2046.0,35700,2055.0,2040.0
672,2017/05/26,2026.0,2032.41,2050.0,40500,2050.0,2026.0
673,2017/05/29,2023.0,2031.383,2045.0,31600,2045.0,2023.0
674,2017/05/30,2005.0,2007.623,2020.0,99300,2023.0,2001.0
675,2017/05/31,2007.0,2006.012,2005.0,74700,2017.0,2000.0
676,2017/06/01,2027.0,2018.85,2005.0,54800,2027.0,2004.0
677,2017/06/02,2040.0,2037.064,2034.0,56700,2045.0,2021.0
678,2017/06/05,2047.0,2044.503,2040.0,46900,2057.0,2032.0
679,2017/06/06,2039.0,2042.444,2057.0,64800,2062.0,2033.0
680,2017/06/07,2039.0,2032.592,2030.0,65900,2039.0,2023.0
681,2017/06/08,2013.0,2021.148,2041.0,121600,2041.0,2010.0
682,2017/06/09,2021.0,2029.828,2022.0,124300,2047.0,2014.0
683,2017/06/12,2018.0,2022.41,2020.0,60800,2035.0,2012.0
684,2017/06/13,2012.0,2015.725,2015.0,64100,2027.0,2011.0
685,2017/06/14,1997.0,2001.334,2012.0,149700,2020.0,1995.0
686,2017/06/15,1986.0,1991.064,2001.0,158300,2009.0,1981.0
687,2017/06/16,1998.0,1997.917,1991.0,81900,2006.0,1988.0
688,2017/06/19,2000.0,2001.283,2001.0,55800,2013.0,1995.0
689,2017/06/20,1998.0,1999.034,2004.0,88700,2008.0,1993.0
690,2017/06/21,1989.0,1991.638,1996.0,115000,2000.0,1988.0
691,2017/06/22,1956.0,1969.164,1989.0,193500,1989.0,1955.0
692,2017/06/23,1969.0,1963.853,1969.0,105400,1970.0,1956.0
693,2017/06/26,1978.0,1977.546,1979.0,82200,1982.0,1968.0
694,2017/06/27,1982.0,1980.339,1981.0,70000,1990.0,1973.0
695,2017/06/28,1973.0,1974.999,1984.0,66500,1985.0,1970.0
696,2017/06/29,1984.0,1974.79,1970.0,90600,1984.0,1967.0
697,2017/06/30,1975.0,1969.583,1977.0,103600,1979.0,1961.0
698,2017/07/03,1985.0,1985.45,1976.0,98700,1995.0,1973.0
699,2017/07/04,1985.0,1983.215,1995.0,73100,1995.0,1976.0
700,2017/07/05,1995.0,1981.961,1985.0,82300,1995.0,1972.0
701,2017/07/06,1989.0,1991.408,1982.0,84400,2003.0,1978.0
702,2017/07/07,1967.0,1973.22,1982.0,77000,1985.0,1966.0
703,2017/07/10,1969.0,1971.3,1985.0,54400,1985.0,1965.0
704,2017/07/11,1977.0,1971.149,1976.0,70500,1979.0,1963.0
705,2017/07/12,1976.0,1973.095,1973.0,56700,1979.0,1967.0
706,2017/07/13,1960.0,1962.894,1980.0,124800,1980.0,1955.0
707,2017/07/14,1962.0,1960.635,1965.0,79900,1968.0,1953.0
708,2017/07/18,1965.0,1959.306,1961.0,127000,1965.0,1954.0
709,2017/07/19,1960.0,1955.893,1965.0,116200,1965.0,1951.0
710,2017/07/20,1961.0,1959.234,1960.0,76400,1964.0,1954.0
711,2017/07/21,1956.0,1955.726,1958.0,72000,1959.0,1952.0
712,2017/07/24,1955.0,1949.713,1955.0,117600,1955.0,1945.0
713,2017/07/25,1955.0,1952.739,1950.0,70600,1961.0,1945.0
714,2017/07/26,1953.0,1948.004,1950.0,98000,1954.0,1941.0
715,2017/07/27,1964.0,1964.334,1955.0,164500,1979.0,1947.0
716,2017/07/28,1981.0,1975.697,1969.0,91700,1981.0,1965.0
717,2017/07/31,1967.0,1973.646,1981.0,73800,1982.0,1965.0
718,2017/08/01,1980.0,1974.947,1967.0,85200,1982.0,1961.0
719,2017/08/02,1972.0,1973.862,1984.0,65000,1984.0,1967.0
720,2017/08/03,1941.0,1940.375,1965.0,222700,1971.0,1923.0
721,2017/08/04,1925.0,1928.375,1942.0,153600,1943.0,1921.0
722,2017/08/07,1931.0,1924.984,1926.0,115800,1931.0,1917.0
723,2017/08/08,1930.0,1928.166,1931.0,66100,1936.0,1922.0
724,2017/08/09,1922.0,1918.45,1925.0,93400,1928.0,1911.0
725,2017/08/10,1927.0,1923.933,1920.0,78700,1928.0,1918.0
726,2017/08/14,1902.0,1905.96,1919.0,134000,1924.0,1902.0
727,2017/08/15,1901.0,1901.455,1914.0,154000,1914.0,1896.0
728,2017/08/16,1912.0,1913.098,1904.0,78900,1920.0,1904.0
729,2017/08/17,1925.0,1921.85,1920.0,75400,1926.0,1913.0
730,2017/08/18,1928.0,1924.098,1922.0,104900,1930.0,1917.0
731,2017/08/21,1945.0,1946.793,1930.0,148600,1961.0,1930.0
732,2017/08/22,1951.0,1950.676,1956.0,102300,1958.0,1942.0
733,2017/08/23,1946.0,1954.361,1962.0,69600,1968.0,1946.0
734,2017/08/24,1935.0,1937.673,1944.0,52300,1944.0,1934.0
735,2017/08/25,1935.0,1935.114,1936.0,41400,1943.0,1930.0
736,2017/08/28,1951.0,1948.58,1947.0,63300,1954.0,1940.0
737,2017/08/29,1952.0,1949.827,1950.0,45200,1959.0,1941.0
738,2017/08/30,1976.0,1970.669,1958.0,108000,1982.0,1955.0
739,2017/08/31,1969.0,1974.17,1979.0,75200,1980.0,1967.0
740,2017/09/01,1964.0,1964.359,1978.0,65700,1978.0,1957.0
741,2017/09/04,1944.0,1951.907,1968.0,54800,1970.0,1942.0
742,2017/09/05,1922.0,1930.506,1944.0,69900,1944.0,1921.0
743,2017/09/06,1912.0,1911.543,1910.0,64700,1916.0,1906.0
744,2017/09/07,1919.0,1917.934,1919.0,61700,1924.0,1912.0
745,2017/09/08,1912.0,1914.48,1919.0,74200,1931.0,1906.0
746,2017/09/11,1920.0,1919.16,1912.0,50500,1927.0,1910.0
747,2017/09/12,1932.0,1930.53,1932.0,46800,1935.0,1923.0
748,2017/09/13,1948.0,1944.101,1941.0,50400,1949.0,1934.0
749,2017/09/14,1941.0,1946.549,1945.0,55600,1952.0,1941.0
750,2017/09/15,1931.0,1926.994,1940.0,79800,1941.0,1918.0
751,2017/09/19,1942.0,1939.162,1940.0,91200,1944.0,1933.0
752,2017/09/20,1946.0,1944.324,1942.0,70600,1950.0,1939.0
753,2017/09/21,1969.0,1967.301,1950.0,86200,1976.0,1946.0
754,2017/09/22,1960.0,1963.995,1972.0,56900,1976.0,1956.0
755,2017/09/25,1970.0,1965.901,1961.0,62700,1974.0,1957.0
756,2017/09/26,1977.0,1975.016,1972.0,68900,1978.0,1966.0
757,2017/09/27,1965.0,1967.733,1975.0,47900,1979.0,1961.0
758,2017/09/28,1963.0,1959.418,1973.0,76400,1973.0,1952.0
759,2017/09/29,1959.0,1962.795,1962.0,70300,1971.0,1957.0
760,2017/10/02,1963.0,1963.939,1966.0,58700,1969.0,1956.0
761,2017/10/03,1968.0,1968.503,1968.0,65600,1973.0,1962.0
762,2017/10/04,1932.0,1928.561,1967.0,282200,1967.0,1915.0
763,2017/10/05,1957.0,1949.651,1936.0,138700,1958.0,1936.0
764,2017/10/06,1950.0,1948.692,1955.0,58100,1955.0,1942.0
765,2017/10/10,1950.0,1948.784,1950.0,56500,1953.0,1944.0
766,2017/10/11,1932.0,1935.213,1938.0,115900,1948.0,1927.0
767,2017/10/12,1941.0,1939.573,1936.0,81200,1946.0,1933.0
768,2017/10/13,1951.0,1948.258,1943.0,123100,1956.0,1938.0
769,2017/10/16,1961.0,1961.575,1954.0,111700,1966.0,1951.0
770,2017/10/17,1982.0,1975.01,1967.0,149900,1985.0,1962.0
771,2017/10/18,1990.0,1984.457,1985.0,102600,1991.0,1979.0
772,2017/10/19,2005.0,1998.933,1994.0,114000,2008.0,1987.0
773,2017/10/20,2010.0,2007.607,2000.0,100300,2017.0,1995.0
774,2017/10/23,2024.0,2020.401,2020.0,85700,2029.0,2012.0
775,2017/10/24,2028.0,2027.342,2023.0,77500,2033.0,2022.0
776,2017/10/25,2006.0,2013.653,2020.0,78700,2026.0,2003.0
777,2017/10/26,1998.0,2002.42,1995.0,62200,2014.0,1991.0
778,2017/10/27,1992.0,1992.939,2015.0,98500,2015.0,1986.0
779,2017/10/30,1984.0,1982.686,1990.0,123100,1991.0,1977.0
780,2017/10/31,1978.0,1974.059,1987.0,105900,1987.0,1964.0
781,2017/11/01,1990.0,1987.047,1992.0,96000,1996.0,1982.0
782,2017/11/02,2006.0,1999.229,2000.0,98000,2008.0,1991.0
783,2017/11/06,1994.0,2003.695,2010.0,127700,2027.0,1987.0
784,2017/11/07,1975.0,1973.92,1988.0,130200,1988.0,1964.0
785,2017/11/08,1977.0,1974.866,1975.0,77000,1984.0,1967.0
786,2017/11/09,1991.0,1989.914,1985.0,123600,2000.0,1978.0
787,2017/11/10,2013.0,2005.761,1982.0,154200,2019.0,1980.0
788,2017/11/13,1992.0,1997.018,2007.0,66800,2007.0,1992.0
789,2017/11/14,1974.0,1981.181,1993.0,98900,1993.0,1974.0
790,2017/11/15,1933.0,1949.985,1974.0,234700,1979.0,1931.0
791,2017/11/16,1941.0,1937.248,1933.0,118500,1951.0,1923.0
792,2017/11/17,1949.0,1950.957,1949.0,106500,1958.0,1942.0
793,2017/11/20,1982.0,1975.922,1957.0,101500,1987.0,1955.0
794,2017/11/21,2001.0,1995.758,1981.0,81300,2007.0,1975.0
795,2017/11/22,1996.0,2000.844,2000.0,66000,2011.0,1995.0
796,2017/11/24,2000.0,1991.747,1982.0,56200,2002.0,1975.0
797,2017/11/27,2004.0,2003.99,2000.0,57900,2008.0,1997.0
798,2017/11/28,2011.0,2010.342,2008.0,62000,2014.0,2004.0
799,2017/11/29,2018.0,2015.279,2007.0,47000,2020.0,2000.0
800,2017/11/30,2018.0,2017.378,2015.0,92500,2026.0,2009.0
801,2017/12/01,2006.0,2012.431,2010.0,64800,2023.0,2006.0
802,2017/12/04,2008.0,2012.711,2000.0,73600,2021.0,2000.0
803,2017/12/05,2034.0,2024.55,2015.0,88800,2035.0,2010.0
804,2017/12/06,2027.0,2032.545,2031.0,80400,2043.0,2022.0
805,2017/12/07,2044.0,2042.835,2030.0,71100,2048.0,2028.0
806,2017/12/08,2038.0,2025.057,2009.0,64700,2039.0,2008.0
807,2017/12/11,2052.0,2041.473,2037.0,81900,2053.0,2020.0
808,2017/12/12,2041.0,2041.939,2049.0,62400,2052.0,2031.0
809,2017/12/13,2025.0,2029.589,2039.0,42100,2039.0,2024.0
810,2017/12/14,2040.0,2034.287,2030.0,49900,2040.0,2025.0
811,2017/12/15,2034.0,2031.366,2036.0,61700,2040.0,2021.0
812,2017/12/18,2018.0,2022.61,2045.0,65100,2045.0,2015.0
813,2017/12/19,2012.0,2015.774,2018.0,61000,2024.0,2011.0
814,2017/12/20,2013.0,2008.683,2012.0,42900,2014.0,2001.0
815,2017/12/21,2011.0,2006.175,2008.0,55300,2011.0,2002.0
816,2017/12/22,2012.0,2007.41,2010.0,54600,2015.0,2001.0
817,2017/12/25,2022.0,2016.204,2010.0,46200,2023.0,2009.0
818,2017/12/26,2021.0,2019.469,2020.0,36900,2023.0,2016.0
819,2017/12/27,2030.0,2025.43,2024.0,41600,2030.0,2017.0
820,2017/12/28,2049.0,2042.983,2040.0,69600,2049.0,2028.0
821,2017/12/29,2051.0,2047.917,2049.0,54400,2053.0,2042.0
822,2018/01/04,2075.0,2063.436,2055.0,93600,2075.0,2049.0
823,2018/01/05,2079.0,2076.522,2077.0,55200,2080.0,2071.0
824,2018/01/09,2087.0,2088.405,2085.0,88600,2094.0,2082.0
825,2018/01/10,2068.0,2075.441,2088.0,57100,2088.0,2066.0
826,2018/01/11,2052.0,2046.678,2056.0,68600,2056.0,2036.0
827,2018/01/12,2039.0,2045.771,2050.0,92600,2063.0,2038.0
828,2018/01/15,2075.0,2063.583,2042.0,114500,2080.0,2042.0
829,2018/01/16,2068.0,2070.83,2070.0,30000,2079.0,2065.0
830,2018/01/17,2065.0,2063.918,2065.0,54700,2072.0,2057.0
831,2018/01/18,2021.0,2038.863,2062.0,182900,2063.0,2020.0
832,2018/01/19,2026.0,2023.343,2021.0,65300,2028.0,2020.0
833,2018/01/22,2029.0,2023.344,2025.0,48000,2029.0,2017.0
834,2018/01/23,2041.0,2038.102,2035.0,43000,2044.0,2032.0
835,2018/01/24,2050.0,2045.998,2037.0,48000,2054.0,2037.0
836,2018/01/25,2066.0,2062.358,2051.0,65900,2070.0,2051.0
837,2018/01/26,2069.0,2074.746,2076.0,62500,2080.0,2069.0
838,2018/01/29,2076.0,2077.355,2072.0,103800,2083.0,2072.0
839,2018/01/30,2049.0,2048.148,2075.0,145700,2075.0,2042.0
840,2018/01/31,2015.0,2025.286,2048.0,132700,2054.0,2013.0
841,2018/02/01,2039.0,2024.172,2016.0,91900,2039.0,2011.0
842,2018/02/02,2050.0,2041.674,2038.0,62900,2051.0,2031.0
843,2018/02/05,2002.0,1999.609,2015.0,281000,2041.0,1976.0
844,2018/02/06,1994.0,1979.243,1975.0,187800,2006.0,1955.0
845,2018/02/07,1995.0,2013.371,2002.0,153500,2032.0,1995.0
846,2018/02/08,2008.0,2006.457,2000.0,75700,2018.0,1992.0
847,2018/02/09,1973.0,1959.964,1985.0,182400,1987.0,1944.0
848,2018/02/13,1979.0,1983.263,1975.0,80000,1997.0,1971.0
849,2018/02/14,1999.0,1993.431,1982.0,86000,2012.0,1976.0
850,2018/02/15,1983.0,1988.13,1991.0,58500,2003.0,1982.0
851,2018/02/16,2042.0,2031.094,2000.0,96900,2047.0,1993.0
852,2018/02/19,2080.0,2068.866,2048.0,143200,2080.0,2041.0
853,2018/02/20,2065.0,2062.449,2075.0,67500,2075.0,2052.0
854,2018/02/21,2084.0,2090.504,2070.0,233300,2115.0,2061.0
855,2018/02/22,2061.0,2065.435,2079.0,61100,2079.0,2055.0
856,2018/02/23,2089.0,2087.727,2075.0,45000,2094.0,2075.0
857,2018/02/26,2108.0,2103.685,2090.0,58800,2113.0,2086.0
858,2018/02/27,2108.0,2108.361,2111.0,41500,2118.0,2103.0
859,2018/02/28,2114.0,2123.26,2120.0,88600,2132.0,2112.0
860,2018/03/01,2079.0,2097.419,2114.0,83700,2120.0,2076.0
861,2018/03/02,2059.0,2057.182,2058.0,62800,2062.0,2051.0
862,2018/03/05,2059.0,2060.614,2058.0,55200,2074.0,2052.0
863,2018/03/06,2054.0,2062.432,2064.0,47900,2077.0,2052.0
864,2018/03/07,2055.0,2055.023,2050.0,52600,2068.0,2047.0
865,2018/03/08,2042.0,2050.099,2061.0,44600,2061.0,2041.0
866,2018/03/09,2042.0,2052.879,2067.0,84100,2077.0,2033.0
867,2018/03/12,2055.0,2047.377,2060.0,68400,2060.0,2037.0
868,2018/03/13,2071.0,2059.76,2053.0,77200,2071.0,2041.0
869,2018/03/14,2062.0,2057.91,2055.0,51000,2066.0,2049.0
870,2018/03/15,2060.0,2050.856,2056.0,123800,2060.0,2034.0
871,2018/03/16,2059.0,2052.351,2060.0,71600,2065.0,2038.0
872,2018/03/19,2024.0,2023.795,2038.0,102100,2041.0,2013.0
873,2018/03/20,2006.0,2001.395,2011.0,105400,2012.0,1993.0
874,2018/03/22,2006.0,2005.314,2007.0,108200,2020.0,1997.0
875,2018/03/23,1985.0,1986.778,1995.0,119500,1996.0,1978.0
876,2018/03/26,2021.0,1994.674,1981.0,106500,2021.0,1977.0
877,2018/03/27,2063.0,2048.914,2023.0,168100,2063.0,2022.0
878,2018/03/28,2015.0,1999.327,1978.0,92900,2017.0,1978.0
879,2018/03/29,2035.0,2028.979,2015.0,58000,2037.0,2013.0
880,2018/03/30,2025.0,2024.254,2030.0,48400,2036.0,2014.0
881,2018/04/02,2023.0,2027.299,2028.0,57900,2036.0,2016.0
882,2018/04/03,2037.0,2030.012,2008.0,84500,2047.0,1997.0
883,2018/04/04,2061.0,2052.761,2038.0,143500,2067.0,2036.0
884,2018/04/05,2056.0,2062.972,2067.0,108800,2071.0,2055.0
885,2018/04/06,2071.0,2073.874,2056.0,128200,2084.0,2053.0
886,2018/04/09,2079.0,2075.488,2065.0,66000,2083.0,2061.0
887,2018/04/10,2060.0,2073.235,2080.0,62100,2087.0,2058.0
888,2018/04/11,2053.0,2053.314,2059.0,56000,2063.0,2044.0
889,2018/04/12,2045.0,2043.18,2053.0,50600,2059.0,2029.0
890,2018/04/13,2034.0,2037.699,2048.0,66100,2054.0,2030.0
891,2018/04/16,2043.0,2035.189,2036.0,48200,2045.0,2023.0
892,2018/04/17,2023.0,2027.086,2026.0,59400,2041.0,2020.0
893,2018/04/18,2017.0,2019.791,2025.0,64200,2032.0,2010.0
894,2018/04/19,2009.0,2006.006,2010.0,123500,2018.0,2000.0
895,2018/04/20,1994.0,1997.012,2009.0,83200,2017.0,1989.0
896,2018/04/23,1964.0,1971.735,1991.0,131000,1991.0,1962.0
897,2018/04/24,1967.0,1961.546,1971.0,140200,1979.0,1945.0
898,2018/04/25,1947.0,1950.48,1960.0,130900,1968.0,1942.0
899,2018/04/26,1937.0,1935.762,1957.0,185200,1957.0,1922.0
900,2018/04/27,1932.0,1931.456,1950.0,132000,1953.0,1922.0
901,2018/05/01,1916.0,1917.648,1935.0,189700,1935.0,1908.0
902,2018/05/02,1913.0,1916.017,1920.0,104000,1926.0,1911.0
903,2018/05/07,1938.0,1932.453,1915.0,98000,1945.0,1915.0
904,2018/05/08,1953.0,1950.568,1945.0,92200,1956.0,1939.0
905,2018/05/09,1989.0,1998.377,1993.0,185800,2022.0,1988.0
906,2018/05/10,1953.0,1955.724,1988.0,101100,1988.0,1947.0
907,2018/05/11,1941.0,1939.887,1953.0,132400,1953.0,1931.0
908,2018/05/14,2026.0,2000.487,1940.0,278800,2026.0,1935.0
909,2018/05/15,2092.0,2077.073,2024.0,233500,2107.0,2020.0
910,2018/05/16,2105.0,2105.13,2090.0,198600,2117.0,2090.0
911,2018/05/17,2144.0,2137.032,2110.0,193500,2150.0,2110.0
912,2018/05/18,2141.0,2139.219,2146.0,90900,2148.0,2123.0
913,2018/05/21,2089.0,2103.506,2141.0,88300,2142.0,2083.0
914,2018/05/22,2078.0,2082.967,2082.0,57900,2093.0,2074.0
915,2018/05/23,2061.0,2062.96,2075.0,56800,2081.0,2050.0
916,2018/05/24,2062.0,2070.615,2065.0,49300,2092.0,2057.0
917,2018/05/25,2060.0,2060.884,2050.0,47500,2071.0,2047.0
918,2018/05/28,2070.0,2071.263,2094.0,57000,2095.0,2058.0
919,2018/05/29,2043.0,2040.706,2051.0,53400,2054.0,2030.0
920,2018/05/30,2009.0,2009.762,2022.0,71900,2027.0,2001.0
921,2018/05/31,2033.0,2027.036,2015.0,62000,2034.0,2009.0
922,2018/06/01,2022.0,2028.302,2033.0,50000,2042.0,2020.0
923,2018/06/04,2042.0,2040.4,2032.0,39300,2048.0,2032.0
924,2018/06/05,2031.0,2028.279,2042.0,30500,2045.0,2020.0
925,2018/06/06,2028.0,2018.892,2027.0,49800,2030.0,2004.0
926,2018/06/07,2027.0,2022.289,2034.0,48500,2039.0,2012.0
927,2018/06/08,2021.0,2018.419,2019.0,56800,2025.0,2008.0
928,2018/06/11,2012.0,2017.742,2023.0,35600,2032.0,2010.0
929,2018/06/12,2017.0,2010.457,2008.0,55800,2019.0,2002.0
930,2018/06/13,1995.0,1995.721,2002.0,73200,2008.0,1990.0
931,2018/06/14,1995.0,1992.871,1995.0,43500,1998.0,1987.0
932,2018/06/15,1994.0,1991.176,1992.0,60800,1998.0,1983.0
933,2018/06/18,1957.0,1962.589,1982.0,83300,1986.0,1953.0
934,2018/06/19,1930.0,1935.196,1950.0,112700,1950.0,1927.0
935,2018/06/20,1976.0,1961.003,1949.0,58500,1977.0,1937.0
936,2018/06/21,1960.0,1963.17,1973.0,53000,1976.0,1953.0
937,2018/06/22,1942.0,1944.613,1955.0,107100,1961.0,1932.0
938,2018/06/25,1926.0,1929.257,1942.0,79700,1944.0,1922.0
939,2018/06/26,1953.0,1942.968,1945.0,60100,1953.0,1927.0
940,2018/06/27,1968.0,1970.034,1975.0,78800,1980.0,1960.0
941,2018/06/28,1928.0,1938.516,1968.0,141600,1970.0,1922.0
942,2018/06/29,1977.0,1953.469,1928.0,245000,1996.0,1912.0
943,2018/07/02,1914.0,1926.999,1965.0,168900,1967.0,1911.0
944,2018/07/03,1981.0,1962.796,1952.0,153300,1981.0,1933.0
945,2018/07/04,2017.0,2005.199,1979.0,117900,2021.0,1973.0
946,2018/07/05,2003.0,2015.749,2017.0,90400,2037.0,1998.0
947,2018/07/06,1992.0,2009.342,2009.0,125500,2037.0,1987.0
948,2018/07/09,1966.0,1969.755,1981.0,66200,1983.0,1953.0
949,2018/07/10,1952.0,1956.645,1952.0,53500,1969.0,1952.0
950,2018/07/11,1940.0,1940.508,1948.0,66300,1949.0,1931.0
951,2018/07/12,1930.0,1935.873,1960.0,54300,1961.0,1928.0
952,2018/07/13,1940.0,1933.342,1932.0,69100,1941.0,1925.0
953,2018/07/17,1973.0,1963.229,1940.0,78700,1978.0,1940.0
954,2018/07/18,1966.0,1973.319,1980.0,68000,1989.0,1958.0
955,2018/07/19,1971.0,1967.543,1966.0,48800,1974.0,1960.0
956,2018/07/20,1980.0,1977.793,1973.0,51200,1985.0,1968.0
957,2018/07/23,1985.0,1987.569,1975.0,45000,1994.0,1973.0
958,2018/07/24,2006.0,2003.531,1999.0,50100,2010.0,1991.0
959,2018/07/25,1994.0,1998.267,2005.0,37500,2006.0,1991.0
960,2018/07/26,2004.0,2002.551,2005.0,51200,2009.0,1994.0
961,2018/07/27,2010.0,2008.602,2018.0,56300,2018.0,1995.0
962,2018/07/30,2005.0,1999.574,2000.0,52100,2007.0,1987.0
963,2018/07/31,1986.0,1988.332,2000.0,150600,2000.0,1980.0
964,2018/08/01,1972.0,1980.4,1996.0,121400,1996.0,1971.0
965,2018/08/02,1968.0,1973.898,1970.0,111300,1986.0,1966.0
966,2018/08/03,1900.0,1909.319,1950.0,441500,1950.0,1896.0
967,2018/08/06,1904.0,1907.728,1912.0,91900,1921.0,1901.0
968,2018/08/07,1933.0,1923.276,1906.0,141500,1943.0,1901.0
969,2018/08/08,1925.0,1927.274,1926.0,51800,1935.0,1922.0
970,2018/08/09,1916.0,1917.059,1920.0,43800,1926.0,1911.0
971,2018/08/10,1913.0,1916.099,1919.0,65400,1927.0,1910.0
972,2018/08/13,1891.0,1896.741,1908.0,160400,1911.0,1891.0
973,2018/08/14,1911.0,1906.173,1897.0,110900,1914.0,1894.0
974,2018/08/15,1910.0,1918.037,1911.0,59600,1926.0,1909.0
975,2018/08/16,1918.0,1919.409,1910.0,108800,1928.0,1906.0
976,2018/08/17,1919.0,1920.148,1910.0,52000,1931.0,1906.0
977,2018/08/20,1905.0,1907.854,1912.0,56100,1915.0,1904.0
978,2018/08/21,1907.0,1911.911,1905.0,62800,1925.0,1897.0
979,2018/08/22,1919.0,1916.488,1907.0,49000,1920.0,1903.0
980,2018/08/23,1919.0,1920.552,1917.0,49300,1924.0,1915.0
981,2018/08/24,1911.0,1918.098,1925.0,60300,1931.0,1911.0
982,2018/08/27,1914.0,1916.451,1915.0,36400,1922.0,1913.0
983,2018/08/28,1910.0,1912.488,1922.0,75800,1922.0,1907.0
984,2018/08/29,1911.0,1914.621,1910.0,37700,1921.0,1910.0
985,2018/08/30,1916.0,1915.068,1921.0,64500,1921.0,1911.0
986,2018/08/31,1907.0,1911.359,1917.0,64300,1917.0,1907.0
987,2018/09/03,1949.0,1953.915,1930.0,252900,1978.0,1926.0
988,2018/09/04,1925.0,1933.81,1951.0,53600,1954.0,1924.0
989,2018/09/05,1906.0,1909.521,1920.0,102500,1920.0,1906.0
990,2018/09/06,1912.0,1912.13,1906.0,99500,1928.0,1903.0
991,2018/09/07,1909.0,1908.079,1909.0,55600,1916.0,1902.0
992,2018/09/10,1909.0,1910.335,1913.0,57600,1917.0,1907.0
993,2018/09/11,1911.0,1914.912,1919.0,60100,1926.0,1908.0
994,2018/09/12,1907.0,1904.532,1907.0,95600,1909.0,1900.0
995,2018/09/13,1908.0,1908.797,1907.0,91700,1922.0,1901.0
996,2018/09/14,1922.0,1920.231,1908.0,134300,1933.0,1908.0
997,2018/09/18,1941.0,1938.705,1928.0,61300,1948.0,1924.0
998,2018/09/19,1939.0,1939.096,1943.0,67800,1944.0,1933.0
999,2018/09/20,1935.0,1934.266,1937.0,53700,1944.0,1928.0
1000,2018/09/21,1952.0,1949.396,1944.0,75100,1954.0,1938.0
1001,2018/09/25,1971.0,1966.33,1958.0,119800,1974.0,1953.0
1002,2018/09/26,1961.0,1954.629,1958.0,52500,1963.0,1941.0
1003,2018/09/27,1936.0,1942.851,1960.0,51700,1961.0,1932.0
1004,2018/09/28,1941.0,1947.557,1970.0,49200,1970.0,1937.0
1005,2018/10/01,1957.0,1953.486,1943.0,59100,1961.0,1936.0
1006,2018/10/02,1953.0,1954.049,1960.0,44600,1963.0,1946.0
1007,2018/10/03,1949.0,1963.149,1960.0,77400,1977.0,1949.0
1008,2018/10/04,1948.0,1947.384,1953.0,51100,1953.0,1938.0
1009,2018/10/05,1947.0,1948.786,1948.0,43500,1955.0,1940.0
1010,2018/10/09,1939.0,1943.461,1947.0,72200,1957.0,1938.0
1011,2018/10/10,1943.0,1946.419,1946.0,53500,1955.0,1938.0
1012,2018/10/11,1928.0,1923.42,1927.0,113700,1931.0,1915.0
1013,2018/10/12,1917.0,1918.754,1915.0,91900,1930.0,1913.0
1014,2018/10/15,1900.0,1908.34,1921.0,123600,1926.0,1900.0
1015,2018/10/16,1903.0,1899.211,1900.0,108100,1909.0,1892.0
1016,2018/10/17,1935.0,1926.987,1912.0,63000,1936.0,1908.0
1017,2018/10/18,1936.0,1934.982,1922.0,50900,1944.0,1916.0
1018,2018/10/19,1933.0,1930.058,1920.0,48600,1936.0,1920.0
1019,2018/10/22,1941.0,1939.05,1933.0,41700,1949.0,1927.0
1020,2018/10/23,1912.0,1921.349,1941.0,61700,1941.0,1912.0
1021,2018/10/24,1925.0,1923.857,1916.0,49800,1933.0,1914.0
1022,2018/10/25,1901.0,1902.155,1910.0,100800,1911.0,1896.0
1023,2018/10/26,1911.0,1911.361,1918.0,80000,1919.0,1904.0
1024,2018/10/29,1928.0,1923.468,1900.0,146700,1939.0,1892.0
1025,2018/10/30,1915.0,1913.245,1928.0,119000,1929.0,1906.0
1026,2018/10/31,1927.0,1931.191,1917.0,94300,1940.0,1911.0
1027,2018/11/01,1906.0,1910.865,1912.0,212500,1932.0,1899.0
1028,2018/11/02,1923.0,1920.159,1910.0,86900,1931.0,1906.0
1029,2018/11/05,2011.0,2003.427,1950.0,378400,2034.0,1950.0
1030,2018/11/06,2063.0,2057.08,2015.0,285000,2086.0,2015.0
1031,2018/11/07,2034.0,2051.205,2054.0,105000,2079.0,2027.0
1032,2018/11/08,2062.0,2055.272,2035.0,101000,2068.0,2035.0
1033,2018/11/09,2070.0,2067.919,2062.0,122600,2079.0,2049.0
1034,2018/11/12,2058.0,2070.653,2070.0,142200,2094.0,2052.0
1035,2018/11/13,2007.0,2012.622,2025.0,98300,2030.0,2004.0
1036,2018/11/14,1989.0,1995.846,2007.0,87700,2015.0,1984.0
1037,2018/11/15,2009.0,2007.834,1989.0,74100,2024.0,1989.0
1038,2018/11/16,2010.0,2002.848,2004.0,77500,2016.0,1984.0
1039,2018/11/19,2011.0,2008.391,2005.0,66000,2016.0,1996.0
1040,2018/11/20,2020.0,2014.929,2011.0,85800,2025.0,2001.0
1041,2018/11/21,2004.0,2004.416,2007.0,67000,2018.0,1997.0
1042,2018/11/22,2020.0,2005.666,2003.0,75100,2021.0,1988.0
1043,2018/11/26,2005.0,2006.016,2029.0,48900,2029.0,1996.0
1044,2018/11/27,2009.0,2006.893,2014.0,64700,2014.0,1998.0
1045,2018/11/28,2027.0,2027.885,2030.0,104900,2047.0,2017.0
1046,2018/11/29,2026.0,2032.617,2038.0,90100,2042.0,2023.0
1047,2018/11/30,2019.0,2016.413,2035.0,68600,2035.0,2009.0
1048,2018/12/03,2017.0,2012.16,2019.0,85100,2031.0,2002.0
1049,2018/12/04,1994.0,2002.293,2006.0,84200,2022.0,1994.0
1050,2018/12/05,1999.0,1989.024,1975.0,66800,2002.0,1965.0
1051,2018/12/06,1998.0,1989.727,2000.0,71300,2002.0,1974.0
1052,2018/12/07,2017.0,2009.98,1985.0,169100,2022.0,1984.0
1053,2018/12/10,2014.0,2004.504,2000.0,87100,2016.0,1987.0
1054,2018/12/11,1997.0,2007.402,2020.0,90400,2033.0,1992.0
1055,2018/12/12,2007.0,2001.624,2003.0,82700,2011.0,1991.0
1056,2018/12/13,2001.0,2002.83,2012.0,95200,2012.0,1997.0
1057,2018/12/14,2000.0,2004.553,2010.0,109500,2020.0,1993.0
1058,2018/12/17,2009.0,1994.342,2000.0,86100,2012.0,1981.0
1059,2018/12/18,1980.0,1987.633,2001.0,93100,2007.0,1980.0
1060,2018/12/19,1968.0,1968.379,1991.0,54100,1991.0,1957.0
1061,2018/12/20,1941.0,1934.853,1941.0,112000,1947.0,1916.0
1062,2018/12/21,1894.0,1894.639,1920.0,181200,1924.0,1878.0
1063,2018/12/25,1845.0,1836.975,1854.0,157600,1854.0,1821.0
1064,2018/12/26,1866.0,1862.51,1844.0,103900,1899.0,1844.0
1065,2018/12/27,1907.0,1898.654,1906.0,127300,1918.0,1863.0
1066,2018/12/28,1926.0,1924.231,1947.0,88700,1947.0,1901.0
1067,2019/01/04,1932.0,1925.563,1920.0,100500,1940.0,1902.0
1068,2019/01/07,1970.0,1966.351,1972.0,137800,1988.0,1953.0
1069,2019/01/08,1954.0,1961.171,1972.0,63800,1976.0,1949.0
1070,2019/01/09,1972.0,1967.741,1954.0,75200,1980.0,1950.0
1071,2019/01/10,1985.0,1974.338,1972.0,68100,1986.0,1953.0
1072,2019/01/11,1972.0,1973.886,1988.0,95200,1989.0,1963.0
1073,2019/01/15,1972.0,1965.643,1962.0,60300,1972.0,1956.0
1074,2019/01/16,1977.0,1972.396,1981.0,53800,1981.0,1960.0
1075,2019/01/17,1980.0,1979.03,1980.0,57500,1990.0,1970.0
1076,2019/01/18,1981.0,1984.855,1984.0,51000,1992.0,1980.0
1077,2019/01/21,1970.0,1972.887,1981.0,62100,1981.0,1965.0
1078,2019/01/22,1986.0,1996.682,1993.0,91800,2024.0,1982.0
1079,2019/01/23,1990.0,1985.996,1973.0,72700,1994.0,1967.0
1080,2019/01/24,2012.0,2004.896,1998.0,75300,2013.0,1991.0
1081,2019/01/25,1998.0,2003.08,2012.0,59700,2018.0,1994.0
1082,2019/01/28,1991.0,1995.881,2018.0,49700,2018.0,1988.0
1083,2019/01/29,1999.0,1997.477,1999.0,65000,2001.0,1988.0
1084,2019/01/30,1971.0,1975.192,2001.0,92400,2001.0,1964.0
1085,2019/01/31,1983.0,1980.912,1992.0,53200,1996.0,1968.0
1086,2019/02/01,1970.0,1975.643,1993.0,41400,1993.0,1967.0
1087,2019/02/04,1982.0,1985.141,1989.0,60300,1995.0,1977.0
1088,2019/02/05,2015.0,2005.061,2000.0,127300,2020.0,1986.0
1089,2019/02/06,1966.0,1979.431,2003.0,159100,2005.0,1964.0
1090,2019/02/07,1958.0,1960.383,1962.0,116600,1986.0,1945.0
1091,2019/02/08,1936.0,1942.211,1950.0,101300,1952.0,1936.0
1092,2019/02/12,1958.0,1951.223,1938.0,74900,1958.0,1936.0
1093,2019/02/13,1926.0,1931.336,1948.0,121900,1949.0,1920.0
1094,2019/02/14,1919.0,1918.872,1921.0,74900,1926.0,1912.0
1095,2019/02/15,1919.0,1908.26,1912.0,109300,1924.0,1900.0
1096,2019/02/18,1935.0,1936.781,1936.0,94300,1959.0,1925.0
1097,2019/02/19,1945.0,1938.198,1934.0,85200,1948.0,1924.0
1098,2019/02/20,1947.0,1947.32,1945.0,66600,1954.0,1936.0
1099,2019/02/21,1953.0,1947.461,1947.0,54200,1954.0,1938.0
1100,2019/02/22,1949.0,1943.702,1949.0,45900,1953.0,1934.0
1101,2019/02/25,1956.0,1952.482,1940.0,55200,1959.0,1940.0
1102,2019/02/26,1962.0,1960.943,1956.0,53000,1972.0,1952.0
1103,2019/02/27,1973.0,1971.206,1974.0,55000,1975.0,1966.0
1104,2019/02/28,1983.0,1982.66,1983.0,79600,1991.0,1972.0
1105,2019/03/01,1979.0,1980.931,1983.0,46200,1988.0,1977.0
1106,2019/03/04,1969.0,1972.559,1987.0,55500,1989.0,1966.0
1107,2019/03/05,1990.0,1978.302,1965.0,71600,1990.0,1959.0
1108,2019/03/06,1978.0,1983.32,1989.0,70600,1995.0,1978.0
1109,2019/03/07,1966.0,1966.99,1968.0,79400,1974.0,1961.0
1110,2019/03/08,1958.0,1959.252,1956.0,84800,1969.0,1952.0
1111,2019/03/11,1960.0,1958.423,1958.0,42300,1965.0,1953.0
1112,2019/03/12,1980.0,1973.49,1970.0,54300,1980.0,1964.0
1113,2019/03/13,1970.0,1975.008,1975.0,62900,1984.0,1969.0
1114,2019/03/14,1966.0,1970.778,1974.0,60400,1979.0,1966.0
1115,2019/03/15,1972.0,1973.763,1970.0,63200,1980.0,1968.0
1116,2019/03/18,1992.0,1986.663,1980.0,66200,1995.0,1977.0
1117,2019/03/19,1996.0,1994.393,1994.0,45000,1999.0,1987.0
1118,2019/03/20,1999.0,1995.924,1994.0,51600,1999.0,1992.0
1119,2019/03/22,2002.0,2000.816,1999.0,81900,2004.0,1993.0
1120,2019/03/25,1969.0,1975.307,1993.0,144000,1993.0,1967.0
1121,2019/03/26,2002.0,1995.266,1984.0,152200,2004.0,1975.0
1122,2019/03/27,1954.0,1945.941,1941.0,98500,1956.0,1936.0
1123,2019/03/28,1919.0,1932.074,1961.0,102600,1965.0,1916.0
1124,2019/03/29,1918.0,1917.575,1919.0,39100,1923.0,1911.0
1125,2019/04/01,1940.0,1936.57,1924.0,81900,1945.0,1920.0
1126,2019/04/02,1939.0,1941.325,1955.0,49900,1961.0,1932.0
1127,2019/04/03,1945.0,1936.126,1933.0,55000,1945.0,1921.0
1128,2019/04/04,1952.0,1949.812,1945.0,42100,1956.0,1935.0
1129,2019/04/05,1955.0,1952.883,1951.0,58800,1957.0,1950.0
1130,2019/04/08,1938.0,1941.06,1945.0,51400,1950.0,1933.0
1131,2019/04/09,1929.0,1928.183,1941.0,75600,1942.0,1921.0
1132,2019/04/10,1907.0,1909.839,1919.0,71500,1921.0,1905.0
1133,2019/04/11,1913.0,1912.324,1920.0,85000,1921.0,1904.0
1134,2019/04/12,1910.0,1912.876,1926.0,53300,1926.0,1907.0
1135,2019/04/15,1926.0,1925.657,1925.0,56800,1931.0,1917.0
1136,2019/04/16,1919.0,1924.007,1930.0,29300,1933.0,1919.0
1137,2019/04/17,1918.0,1916.016,1917.0,44400,1920.0,1910.0
1138,2019/04/18,1904.0,1905.249,1910.0,83300,1911.0,1902.0
1139,2019/04/19,1913.0,1910.701,1913.0,25400,1917.0,1906.0
1140,2019/04/22,1924.0,1918.761,1913.0,38100,1925.0,1908.0
1141,2019/04/23,1923.0,1925.259,1926.0,37800,1932.0,1918.0
1142,2019/04/24,1909.0,1913.93,1925.0,31500,1926.0,1909.0
1143,2019/04/25,1919.0,1915.744,1910.0,39500,1924.0,1906.0
1144,2019/04/26,1914.0,1918.672,1932.0,34700,1932.0,1910.0
1145,2019/05/07,1909.0,1911.293,1914.0,37500,1918.0,1906.0
1146,2019/05/08,1897.0,1897.836,1903.0,89600,1905.0,1893.0
1147,2019/05/09,1874.0,1882.193,1895.0,118800,1895.0,1874.0
1148,2019/05/10,1857.0,1863.885,1874.0,105200,1876.0,1856.0
1149,2019/05/13,1829.0,1816.32,1851.0,202600,1851.0,1778.0
1150,2019/05/14,1835.0,1818.138,1801.0,104300,1837.0,1800.0
1151,2019/05/15,1818.0,1818.438,1841.0,87900,1843.0,1808.0
1152,2019/05/16,1810.0,1808.332,1821.0,59600,1821.0,1802.0
1153,2019/05/17,1829.0,1824.042,1822.0,66300,1831.0,1813.0
1154,2019/05/20,1833.0,1831.949,1829.0,33600,1838.0,1824.0
1155,2019/05/21,1838.0,1833.591,1827.0,62800,1841.0,1826.0
1156,2019/05/22,1839.0,1840.478,1838.0,40800,1846.0,1832.0
1157,2019/05/23,1848.0,1845.779,1838.0,47100,1852.0,1836.0
1158,2019/05/24,1849.0,1851.575,1840.0,53700,1862.0,1840.0
1159,2019/05/27,1834.0,1843.253,1850.0,32400,1857.0,1833.0
1160,2019/05/28,1813.0,1819.507,1840.0,77000,1840.0,1811.0
1161,2019/05/29,1812.0,1808.89,1808.0,47400,1822.0,1800.0
1162,2019/05/30,1797.0,1797.115,1802.0,56600,1805.0,1792.0
1163,2019/05/31,1788.0,1789.344,1795.0,53800,1798.0,1784.0
1164,2019/06/03,1784.0,1785.0,1781.0,52500,1798.0,1776.0
1165,2019/06/04,1791.0,1784.52,1785.0,50000,1793.0,1777.0
1166,2019/06/05,1794.0,1793.002,1805.0,56900,1808.0,1782.0
1167,2019/06/06,1792.0,1790.59,1794.0,35400,1798.0,1785.0
1168,2019/06/07,1783.0,1787.619,1799.0,76900,1802.0,1778.0
1169,2019/06/10,1815.0,1808.951,1791.0,47100,1820.0,1791.0
1170,2019/06/11,1815.0,1818.974,1818.0,50500,1829.0,1808.0
1171,2019/06/12,1809.0,1812.285,1815.0,30900,1819.0,1808.0
1172,2019/06/13,1800.0,1799.565,1807.0,43900,1812.0,1793.0
1173,2019/06/14,1816.0,1809.756,1798.0,55400,1820.0,1791.0
1174,2019/06/17,1816.0,1818.015,1809.0,39500,1824.0,1805.0
1175,2019/06/18,1787.0,1795.344,1814.0,78700,1818.0,1786.0
1176,2019/06/19,1800.0,1793.494,1789.0,46400,1800.0,1785.0
1177,2019/06/20,1788.0,1794.206,1795.0,46100,1804.0,1788.0
1178,2019/06/21,1827.0,1816.923,1787.0,140500,1834.0,1781.0
1179,2019/06/24,1824.0,1824.788,1827.0,40100,1837.0,1815.0
1180,2019/06/25,1836.0,1834.231,1828.0,38900,1843.0,1826.0
1181,2019/06/26,1840.0,1843.758,1840.0,38400,1852.0,1833.0
1182,2019/06/27,1819.0,1817.629,1833.0,38000,1833.0,1812.0
1183,2019/06/28,1817.0,1823.986,1845.0,49000,1845.0,1814.0
1184,2019/07/01,1831.0,1825.778,1824.0,36000,1832.0,1820.0
1185,2019/07/02,1825.0,1828.969,1838.0,57700,1843.0,1822.0
1186,2019/07/03,1839.0,1836.675,1825.0,30800,1841.0,1824.0
1187,2019/07/04,1846.0,1847.964,1843.0,44700,1854.0,1837.0
1188,2019/07/05,1842.0,1836.62,1843.0,47600,1843.0,1830.0
1189,2019/07/08,1822.0,1827.207,1836.0,36300,1838.0,1822.0
1190,2019/07/09,1821.0,1820.703,1827.0,53900,1831.0,1814.0
1191,2019/07/10,1852.0,1840.027,1817.0,71100,1853.0,1814.0
1192,2019/07/11,1879.0,1877.654,1862.0,83400,1891.0,1854.0
1193,2019/07/12,1886.0,1888.334,1889.0,71800,1896.0,1881.0
1194,2019/07/16,1872.0,1872.21,1891.0,60400,1891.0,1863.0
1195,2019/07/17,1875.0,1879.735,1881.0,46700,1892.0,1866.0
1196,2019/07/18,1832.0,1847.24,1871.0,63000,1874.0,1830.0
1197,2019/07/19,1851.0,1850.521,1831.0,52600,1861.0,1831.0
1198,2019/07/22,1828.0,1829.752,1851.0,54100,1851.0,1820.0
1199,2019/07/23,1829.0,1828.616,1825.0,38300,1834.0,1821.0
1200,2019/07/24,1829.0,1827.499,1830.0,59300,1833.0,1822.0
1201,2019/07/25,1846.0,1837.47,1829.0,58900,1850.0,1823.0
1202,2019/07/26,1837.0,1851.07,1878.0,54600,1878.0,1830.0
1203,2019/07/29,1855.0,1849.263,1850.0,25500,1856.0,1843.0
1204,2019/07/30,1885.0,1878.564,1861.0,49100,1885.0,1861.0
1205,2019/07/31,1860.0,1864.734,1869.0,47000,1874.0,1857.0
1206,2019/08/01,1868.0,1857.345,1851.0,25800,1868.0,1838.0
1207,2019/08/02,1861.0,1861.072,1860.0,81500,1874.0,1851.0
1208,2019/08/05,1871.0,1884.373,1875.0,158300,1916.0,1862.0
1209,2019/08/06,1873.0,1854.39,1834.0,86100,1877.0,1830.0
1210,2019/08/07,1864.0,1867.548,1856.0,48200,1875.0,1856.0
1211,2019/08/08,1853.0,1855.191,1858.0,26200,1862.0,1850.0
1212,2019/08/09,1869.0,1872.331,1860.0,42900,1882.0,1858.0
1213,2019/08/13,1838.0,1841.566,1850.0,41900,1851.0,1837.0
1214,2019/08/14,1854.0,1843.843,1842.0,60300,1855.0,1828.0
1215,2019/08/15,1834.0,1827.748,1823.0,48800,1837.0,1816.0
1216,2019/08/16,1822.0,1824.698,1825.0,42400,1835.0,1817.0
1217,2019/08/19,1837.0,1831.415,1826.0,34200,1839.0,1821.0
1218,2019/08/20,1827.0,1824.971,1830.0,37800,1835.0,1818.0
1219,2019/08/21,1813.0,1809.439,1820.0,51900,1820.0,1803.0
1220,2019/08/22,1826.0,1819.209,1813.0,44600,1828.0,1806.0
1221,2019/08/23,1837.0,1837.776,1836.0,38800,1844.0,1833.0
