,DateTime,Open,High,Low,Close,VWAP,Trades,Volume,DS
0,2019/11/20 9:00:00,1184.0,1184.0,1184.0,1184.0,1184.0,1,600.0,2019-11-20 09:00:00
1,2019/11/20 9:01:00,1171.0,1171.0,1166.0,1166.0,1168.5,2,200.0,2019-11-20 09:01:00
2,2019/11/20 9:22:00,1170.0,1170.0,1170.0,1170.0,1170.0,1,200.0,2019-11-20 09:22:00
3,2019/11/20 9:23:00,1171.0,1171.0,1171.0,1171.0,1171.0,1,100.0,2019-11-20 09:23:00
4,2019/11/20 9:24:00,1171.0,1171.0,1171.0,1171.0,1171.0,1,100.0,2019-11-20 09:24:00
5,2019/11/20 9:36:00,1172.0,1172.0,1171.0,1171.0,1171.333,5,600.0,2019-11-20 09:36:00
6,2019/11/20 9:50:00,1170.0,1170.0,1170.0,1170.0,1170.0,1,800.0,2019-11-20 09:50:00
7,2019/11/20 10:03:00,1170.0,1170.0,1170.0,1170.0,1170.0,2,200.0,2019-11-20 10:03:00
8,2019/11/20 10:09:00,1174.0,1174.0,1174.0,1174.0,1174.0,1,100.0,2019-11-20 10:09:00
9,2019/11/20 10:56:00,1165.0,1165.0,1165.0,1165.0,1165.0,1,100.0,2019-11-20 10:56:00
10,2019/11/20 10:57:00,1174.0,1174.0,1174.0,1174.0,1174.0,1,100.0,2019-11-20 10:57:00
11,2019/11/20 11:30:00,1175.0,1175.0,1175.0,1175.0,1175.0,1,100.0,2019-11-20 11:30:00
12,2019/11/20 12:30:00,1188.0,1188.0,1188.0,1188.0,1188.0,2,200.0,2019-11-20 12:30:00
13,2019/11/20 12:47:00,1187.0,1189.0,1187.0,1189.0,1188.333,2,300.0,2019-11-20 12:47:00
14,2019/11/20 12:49:00,1188.0,1188.0,1188.0,1188.0,1188.0,1,100.0,2019-11-20 12:49:00
15,2019/11/20 13:32:00,1179.0,1179.0,1179.0,1179.0,1179.0,1,100.0,2019-11-20 13:32:00
16,2019/11/20 13:45:00,1180.0,1180.0,1180.0,1180.0,1180.0,1,100.0,2019-11-20 13:45:00
17,2019/11/20 13:58:00,1192.0,1192.0,1192.0,1192.0,1192.0,1,100.0,2019-11-20 13:58:00
18,2019/11/20 14:05:00,1184.0,1184.0,1183.0,1183.0,1183.5,2,600.0,2019-11-20 14:05:00
19,2019/11/20 14:10:00,1182.0,1182.0,1181.0,1181.0,1181.5,2,200.0,2019-11-20 14:10:00
20,2019/11/20 14:18:00,1189.0,1193.0,1189.0,1193.0,1191.857,2,700.0,2019-11-20 14:18:00
21,2019/11/20 14:24:00,1195.0,1198.0,1195.0,1198.0,1197.0,2,300.0,2019-11-20 14:24:00
22,2019/11/20 14:42:00,1199.0,1199.0,1199.0,1199.0,1199.0,1,500.0,2019-11-20 14:42:00
23,2019/11/20 14:43:00,1189.0,1189.0,1185.0,1185.0,1187.0,3,500.0,2019-11-20 14:43:00
24,2019/11/20 14:44:00,1182.0,1182.0,1180.0,1180.0,1180.778,3,900.0,2019-11-20 14:44:00
25,2019/11/20 14:59:00,1184.0,1184.0,1184.0,1184.0,1184.0,1,100.0,2019-11-20 14:59:00
26,2019/11/20 15:00:00,1184.0,1184.0,1184.0,1184.0,1184.0,1,500.0,2019-11-20 15:00:00
