ds,yhat
2019-07-16,746.1794966479715
2019-07-17,741.3030686730139
2019-07-18,743.3899735866875
2019-07-19,755.6102047591623
2019-07-22,788.51160423494
2019-07-23,780.527705712809
2019-07-24,769.228867607269
2019-07-25,761.4070609569386
2019-07-26,758.5873457663905
2019-07-29,742.369434803592
2019-07-30,730.0695598623738
2019-07-31,717.7251950651419
2019-08-01,705.5037279309244
2019-08-02,691.7434044326318
2019-08-05,648.881187612641
2019-08-06,641.8731478548214
2019-08-07,635.5876247251659
2019-08-08,624.2145108284144
2019-08-09,605.100226929815
