,Date,Close,VWAP,Open,Volume,High,Low
0,2014/08/25,94.0,94.807,95.0,1627100,96.0,93.0
1,2014/08/26,101.0,99.368,95.0,4496400,102.0,95.0
2,2014/08/27,98.0,101.351,104.0,2671200,104.0,98.0
3,2014/08/28,93.0,95.845,99.0,1856800,99.0,93.0
4,2014/08/29,92.0,90.85,93.0,2072300,93.0,89.0
5,2014/09/01,98.0,97.391,93.0,4285600,101.0,93.0
6,2014/09/02,98.0,98.752,99.0,1887400,101.0,96.0
7,2014/09/03,102.0,98.409,97.0,2526700,102.0,95.0
8,2014/09/04,110.0,108.844,106.0,8702000,114.0,104.0
9,2014/09/05,111.0,110.524,115.0,4159700,116.0,104.0
10,2014/09/08,118.0,117.953,114.0,8793400,125.0,109.0
11,2014/09/09,114.0,115.519,119.0,3432900,120.0,113.0
12,2014/09/10,102.0,105.4,109.0,3182600,110.0,102.0
13,2014/09/11,101.0,100.774,102.0,1812500,103.0,99.0
14,2014/09/12,99.0,98.171,100.0,1507700,100.0,97.0
15,2014/09/16,97.0,97.37,98.0,863000,99.0,96.0
16,2014/09/17,94.0,95.112,97.0,1062100,97.0,93.0
17,2014/09/18,99.0,96.501,95.0,1629400,99.0,93.0
18,2014/09/19,99.0,101.094,101.0,2208600,104.0,98.0
19,2014/09/22,97.0,96.535,98.0,1013200,98.0,95.0
20,2014/09/24,95.0,95.176,95.0,918900,97.0,94.0
21,2014/09/25,95.0,96.218,96.0,589700,98.0,95.0
22,2014/09/26,98.0,95.354,94.0,755300,98.0,93.0
23,2014/09/29,98.0,99.811,99.0,1515900,103.0,98.0
24,2014/09/30,96.0,96.18,97.0,643000,98.0,95.0
25,2014/10/01,93.0,94.768,97.0,1279800,97.0,93.0
26,2014/10/02,90.0,89.953,90.0,1324100,92.0,88.0
27,2014/10/03,93.0,91.982,90.0,506500,94.0,90.0
28,2014/10/06,94.0,94.41,94.0,406000,96.0,93.0
29,2014/10/07,92.0,93.146,95.0,518000,95.0,91.0
30,2014/10/08,91.0,90.56,91.0,463000,92.0,89.0
31,2014/10/09,90.0,90.663,92.0,520500,93.0,89.0
32,2014/10/10,88.0,87.429,87.0,824300,89.0,86.0
33,2014/10/14,81.0,83.809,86.0,1184000,87.0,80.0
34,2014/10/15,83.0,83.31,83.0,872400,86.0,81.0
35,2014/10/16,77.0,79.037,81.0,1194200,82.0,77.0
36,2014/10/17,74.0,76.364,77.0,949300,79.0,74.0
37,2014/10/20,81.0,80.098,80.0,1065500,82.0,77.0
38,2014/10/21,81.0,82.359,83.0,379200,84.0,81.0
39,2014/10/22,86.0,85.996,86.0,816000,88.0,84.0
40,2014/10/23,84.0,85.018,85.0,481100,86.0,84.0
41,2014/10/24,83.0,84.458,85.0,422400,86.0,83.0
42,2014/10/27,81.0,80.818,83.0,596100,83.0,79.0
43,2014/10/28,82.0,81.645,78.0,1058100,85.0,78.0
44,2014/10/29,82.0,83.743,84.0,930200,87.0,82.0
45,2014/10/30,82.0,82.029,83.0,579100,84.0,80.0
46,2014/10/31,80.0,80.04,82.0,733800,82.0,79.0
47,2014/11/04,81.0,80.654,82.0,561200,83.0,79.0
48,2014/11/05,83.0,81.16,81.0,599900,83.0,79.0
49,2014/11/06,81.0,82.407,83.0,528000,84.0,81.0
50,2014/11/07,91.0,86.44,81.0,1949300,91.0,81.0
51,2014/11/10,93.0,93.55,94.0,2346500,96.0,90.0
52,2014/11/11,92.0,92.277,94.0,707400,95.0,91.0
53,2014/11/12,89.0,89.178,92.0,755400,92.0,87.0
54,2014/11/13,88.0,88.038,88.0,550800,90.0,86.0
55,2014/11/14,90.0,88.635,88.0,642900,91.0,86.0
56,2014/11/17,100.0,100.249,103.0,8322300,107.0,95.0
57,2014/11/18,95.0,94.287,96.0,2494600,97.0,92.0
58,2014/11/19,90.0,91.57,93.0,1459800,94.0,90.0
59,2014/11/20,87.0,88.008,90.0,1793200,91.0,86.0
60,2014/11/21,86.0,85.389,86.0,1362900,87.0,84.0
61,2014/11/25,90.0,88.802,87.0,1713000,91.0,86.0
62,2014/11/26,92.0,90.154,90.0,1013800,92.0,88.0
63,2014/11/27,91.0,92.698,95.0,1372600,95.0,91.0
64,2014/11/28,97.0,96.329,93.0,4756500,100.0,92.0
65,2014/12/01,98.0,100.512,101.0,4074500,103.0,98.0
66,2014/12/02,97.0,97.384,98.0,1641900,99.0,96.0
67,2014/12/03,96.0,95.934,96.0,1196000,98.0,95.0
68,2014/12/04,95.0,94.133,96.0,1093900,97.0,93.0
69,2014/12/05,95.0,93.788,94.0,655700,95.0,92.0
70,2014/12/08,95.0,94.387,95.0,767800,96.0,93.0
71,2014/12/09,95.0,94.192,94.0,644400,96.0,93.0
72,2014/12/10,95.0,93.803,93.0,432700,95.0,93.0
73,2014/12/11,101.0,100.366,94.0,6490600,105.0,93.0
74,2014/12/12,104.0,102.485,103.0,4833500,106.0,98.0
75,2014/12/15,99.0,99.456,103.0,2918700,104.0,95.0
76,2014/12/16,93.0,93.98,95.0,2051100,97.0,92.0
77,2014/12/17,89.0,89.539,91.0,2330600,92.0,88.0
78,2014/12/18,90.0,90.756,91.0,760300,92.0,90.0
79,2014/12/19,89.0,90.236,91.0,846300,93.0,89.0
80,2014/12/22,91.0,89.457,89.0,704000,91.0,89.0
81,2014/12/24,90.0,89.84,91.0,435100,91.0,89.0
82,2014/12/25,90.0,89.388,89.0,645800,91.0,89.0
83,2014/12/26,92.0,91.42,89.0,1000800,94.0,89.0
84,2014/12/29,93.0,92.924,94.0,569200,94.0,91.0
85,2014/12/30,91.0,91.296,93.0,516600,93.0,90.0
86,2015/01/05,91.0,89.734,91.0,516000,91.0,89.0
87,2015/01/06,89.0,88.735,89.0,567900,90.0,88.0
88,2015/01/07,89.0,88.685,88.0,697600,90.0,87.0
89,2015/01/08,89.0,88.855,90.0,431200,90.0,88.0
90,2015/01/09,87.0,88.046,90.0,630100,90.0,87.0
91,2015/01/13,88.0,86.597,87.0,419200,88.0,86.0
92,2015/01/14,86.0,86.14,88.0,493800,88.0,85.0
93,2015/01/15,86.0,85.197,85.0,702600,87.0,84.0
94,2015/01/16,85.0,84.368,85.0,464800,86.0,84.0
95,2015/01/19,84.0,85.195,86.0,451400,86.0,84.0
96,2015/01/20,94.0,94.65,85.0,8670200,99.0,84.0
97,2015/01/21,94.0,94.493,97.0,2044200,97.0,92.0
98,2015/01/22,92.0,91.933,94.0,1256600,95.0,90.0
99,2015/01/23,89.0,91.827,93.0,1874400,95.0,89.0
100,2015/01/26,92.0,90.598,89.0,633600,92.0,89.0
101,2015/01/27,92.0,91.153,91.0,415500,92.0,90.0
102,2015/01/28,91.0,91.171,91.0,369400,92.0,90.0
103,2015/01/29,95.0,95.352,92.0,3504100,98.0,91.0
104,2015/01/30,92.0,92.791,95.0,878300,95.0,91.0
105,2015/02/02,92.0,91.753,92.0,456900,92.0,91.0
106,2015/02/03,97.0,95.886,93.0,2751600,99.0,91.0
107,2015/02/04,99.0,105.291,111.0,12745000,112.0,99.0
108,2015/02/05,100.0,99.798,101.0,4962000,105.0,95.0
109,2015/02/06,103.0,101.635,101.0,3276300,105.0,98.0
110,2015/02/09,93.0,93.47,93.0,3823200,97.0,91.0
111,2015/02/10,93.0,91.315,94.0,2580000,94.0,89.0
112,2015/02/12,90.0,91.793,93.0,1802800,94.0,90.0
113,2015/02/13,89.0,89.563,90.0,1284300,91.0,89.0
114,2015/02/16,88.0,88.248,90.0,1182800,90.0,87.0
115,2015/02/17,89.0,88.585,88.0,710000,90.0,87.0
116,2015/02/18,91.0,89.895,88.0,1359900,92.0,88.0
117,2015/02/19,90.0,89.847,91.0,1354300,92.0,88.0
118,2015/02/20,89.0,89.023,90.0,688300,90.0,88.0
119,2015/02/23,89.0,89.483,89.0,450300,90.0,89.0
120,2015/02/24,91.0,90.313,89.0,647900,92.0,89.0
121,2015/02/25,90.0,89.988,91.0,392900,91.0,89.0
122,2015/02/26,89.0,89.073,89.0,663800,90.0,88.0
123,2015/02/27,88.0,88.483,89.0,570000,90.0,88.0
124,2015/03/02,88.0,88.642,88.0,431800,90.0,88.0
125,2015/03/03,87.0,87.461,88.0,551700,89.0,87.0
126,2015/03/04,88.0,87.298,87.0,665100,89.0,86.0
127,2015/03/05,88.0,87.323,87.0,954000,89.0,86.0
128,2015/03/06,87.0,86.841,88.0,599000,88.0,86.0
129,2015/03/09,87.0,85.837,86.0,539100,87.0,85.0
130,2015/03/10,86.0,86.431,86.0,468500,88.0,85.0
131,2015/03/11,86.0,86.045,86.0,207300,87.0,85.0
132,2015/03/12,87.0,86.844,87.0,289300,88.0,86.0
133,2015/03/13,89.0,87.659,87.0,617200,89.0,86.0
134,2015/03/16,87.0,87.913,89.0,307900,89.0,87.0
135,2015/03/17,86.0,86.834,87.0,502800,88.0,86.0
136,2015/03/18,86.0,85.689,86.0,549000,87.0,85.0
137,2015/03/19,85.0,85.002,85.0,465300,86.0,84.0
138,2015/03/20,85.0,85.387,85.0,286700,87.0,84.0
139,2015/03/23,86.0,85.554,86.0,269700,86.0,85.0
140,2015/03/24,85.0,85.162,86.0,227300,86.0,85.0
141,2015/03/25,86.0,85.034,85.0,172700,86.0,85.0
142,2015/03/26,84.0,84.118,85.0,608200,85.0,84.0
143,2015/03/27,82.0,83.462,84.0,376300,85.0,82.0
144,2015/03/30,82.0,82.781,82.0,138100,84.0,82.0
145,2015/03/31,85.0,85.706,84.0,728600,88.0,84.0
146,2015/04/01,84.0,83.768,85.0,354900,85.0,83.0
147,2015/04/02,84.0,84.001,84.0,133400,85.0,83.0
148,2015/04/03,84.0,83.699,84.0,136700,85.0,83.0
149,2015/04/06,84.0,83.517,84.0,250400,85.0,82.0
150,2015/04/07,84.0,84.311,84.0,178900,85.0,84.0
151,2015/04/08,87.0,85.305,84.0,348200,87.0,84.0
152,2015/04/09,85.0,85.94,86.0,93900,87.0,85.0
153,2015/04/10,85.0,85.118,86.0,166600,86.0,84.0
154,2015/04/13,85.0,85.243,86.0,206600,86.0,84.0
155,2015/04/14,84.0,84.27,85.0,368100,85.0,84.0
156,2015/04/15,85.0,84.939,84.0,294400,86.0,84.0
157,2015/04/16,86.0,85.352,85.0,338700,87.0,84.0
158,2015/04/17,85.0,84.978,86.0,356700,86.0,84.0
159,2015/04/20,85.0,84.294,85.0,341700,86.0,84.0
160,2015/04/21,84.0,84.204,84.0,129200,85.0,84.0
161,2015/04/22,85.0,85.675,84.0,469700,87.0,84.0
162,2015/04/23,84.0,84.919,86.0,195900,86.0,84.0
163,2015/04/24,85.0,85.149,85.0,372800,86.0,84.0
164,2015/04/27,85.0,84.969,85.0,225600,86.0,84.0
165,2015/04/28,85.0,84.991,85.0,220500,85.0,84.0
166,2015/04/30,84.0,84.285,85.0,240300,85.0,84.0
167,2015/05/01,83.0,83.549,84.0,253800,84.0,83.0
168,2015/05/07,84.0,83.431,84.0,216700,84.0,83.0
169,2015/05/08,84.0,82.695,83.0,256300,84.0,82.0
170,2015/05/11,84.0,83.995,84.0,148800,85.0,83.0
171,2015/05/12,84.0,83.505,83.0,205500,85.0,83.0
172,2015/05/13,82.0,82.997,84.0,192600,84.0,82.0
173,2015/05/14,81.0,81.795,83.0,304500,83.0,81.0
174,2015/05/15,80.0,80.861,81.0,620600,82.0,79.0
175,2015/05/18,77.0,76.554,77.0,875300,78.0,75.0
176,2015/05/19,77.0,76.296,76.0,452000,78.0,75.0
177,2015/05/20,77.0,77.084,76.0,267000,78.0,76.0
178,2015/05/21,76.0,76.542,77.0,344400,78.0,75.0
179,2015/05/22,76.0,75.051,75.0,450300,76.0,74.0
180,2015/05/25,76.0,75.201,75.0,175600,76.0,75.0
181,2015/05/26,74.0,74.664,76.0,494200,76.0,74.0
182,2015/05/27,74.0,73.541,74.0,578900,75.0,73.0
183,2015/05/28,75.0,73.901,73.0,321400,75.0,73.0
184,2015/05/29,74.0,74.07,74.0,197000,75.0,73.0
185,2015/06/01,74.0,73.252,74.0,359900,75.0,72.0
186,2015/06/02,75.0,73.822,73.0,505400,75.0,72.0
187,2015/06/03,81.0,79.336,75.0,2301900,82.0,75.0
188,2015/06/04,79.0,80.818,82.0,656600,83.0,79.0
189,2015/06/05,79.0,77.991,79.0,326300,79.0,77.0
190,2015/06/08,77.0,77.754,78.0,120500,78.0,77.0
191,2015/06/09,75.0,76.37,77.0,193700,77.0,75.0
192,2015/06/10,75.0,76.01,76.0,146600,77.0,75.0
193,2015/06/11,76.0,75.724,77.0,130800,77.0,75.0
194,2015/06/12,77.0,75.717,76.0,111900,77.0,75.0
195,2015/06/15,79.0,79.544,77.0,920100,81.0,77.0
196,2015/06/16,76.0,77.076,79.0,437300,79.0,76.0
197,2015/06/17,77.0,76.287,76.0,330000,77.0,75.0
198,2015/06/18,75.0,75.449,76.0,133500,77.0,75.0
199,2015/06/19,75.0,75.6,75.0,207500,77.0,75.0
200,2015/06/22,76.0,76.609,77.0,176400,78.0,76.0
201,2015/06/23,76.0,75.035,76.0,432800,77.0,74.0
202,2015/06/24,75.0,75.322,76.0,401500,76.0,75.0
203,2015/06/25,71.0,68.315,65.0,2619900,72.0,64.0
204,2015/06/26,69.0,70.221,71.0,354300,71.0,69.0
205,2015/06/29,67.0,68.083,67.0,973400,71.0,66.0
206,2015/06/30,68.0,66.537,67.0,374100,68.0,66.0
207,2015/07/01,69.0,68.54,67.0,274400,70.0,67.0
208,2015/07/02,68.0,68.886,70.0,283300,70.0,68.0
209,2015/07/03,75.0,75.641,69.0,5906400,80.0,69.0
210,2015/07/06,76.0,75.277,75.0,1349700,78.0,73.0
211,2015/07/07,76.0,75.593,77.0,627300,78.0,74.0
212,2015/07/08,72.0,71.849,75.0,1469200,76.0,69.0
213,2015/07/09,71.0,67.854,70.0,842400,71.0,65.0
214,2015/07/10,69.0,68.837,71.0,360200,71.0,67.0
215,2015/07/13,69.0,68.79,69.0,271800,70.0,68.0
216,2015/07/14,70.0,71.162,72.0,722600,73.0,70.0
217,2015/07/15,73.0,72.819,71.0,845100,74.0,70.0
218,2015/07/16,72.0,72.382,74.0,422900,74.0,71.0
219,2015/07/17,72.0,72.487,73.0,256300,73.0,71.0
220,2015/07/21,72.0,71.512,73.0,261900,73.0,71.0
221,2015/07/22,72.0,71.142,71.0,184500,72.0,71.0
222,2015/07/23,71.0,71.91,72.0,237500,73.0,71.0
223,2015/07/24,73.0,73.15,72.0,1341000,75.0,71.0
224,2015/07/27,78.0,76.012,72.0,1711000,79.0,72.0
225,2015/07/28,76.0,76.998,77.0,2036100,79.0,75.0
226,2015/07/29,71.0,73.463,77.0,1740900,78.0,70.0
227,2015/07/30,70.0,71.041,71.0,574500,73.0,70.0
228,2015/07/31,72.0,71.379,70.0,377500,72.0,70.0
229,2015/08/03,71.0,71.34,72.0,297300,73.0,71.0
230,2015/08/04,71.0,71.023,71.0,322500,72.0,70.0
231,2015/08/05,72.0,70.94,70.0,109700,72.0,70.0
232,2015/08/06,71.0,70.285,71.0,372000,71.0,69.0
233,2015/08/07,68.0,69.113,70.0,656200,71.0,68.0
234,2015/08/10,70.0,68.692,68.0,163100,70.0,68.0
235,2015/08/11,63.0,63.288,64.0,1895000,65.0,61.0
236,2015/08/12,62.0,63.038,63.0,495300,64.0,62.0
237,2015/08/13,61.0,61.846,62.0,371700,63.0,61.0
238,2015/08/14,61.0,60.347,62.0,491700,62.0,59.0
239,2015/08/17,59.0,59.071,59.0,275200,60.0,59.0
240,2015/08/18,60.0,59.733,59.0,322000,61.0,59.0
241,2015/08/19,60.0,59.777,60.0,154500,61.0,59.0
242,2015/08/20,58.0,58.532,59.0,478600,60.0,57.0
243,2015/08/21,53.0,52.749,55.0,2060300,56.0,51.0
244,2015/08/24,43.0,47.487,48.0,1695000,51.0,43.0
245,2015/08/25,41.0,39.877,38.0,2674200,44.0,36.0
246,2015/08/26,43.0,44.139,43.0,1738300,47.0,42.0
247,2015/08/27,47.0,46.651,46.0,1416000,48.0,45.0
248,2015/08/28,48.0,48.948,48.0,1245000,51.0,47.0
249,2015/08/31,47.0,47.685,49.0,357000,49.0,47.0
250,2015/09/01,44.0,45.69,47.0,567500,47.0,44.0
251,2015/09/02,45.0,44.297,43.0,405300,47.0,42.0
252,2015/09/03,46.0,46.05,47.0,179500,47.0,45.0
253,2015/09/04,44.0,44.225,45.0,378600,46.0,43.0
254,2015/09/07,42.0,42.172,42.0,366400,44.0,41.0
255,2015/09/08,41.0,41.916,42.0,173200,43.0,41.0
256,2015/09/09,45.0,43.341,43.0,232000,45.0,42.0
257,2015/09/10,43.0,43.155,43.0,169500,44.0,43.0
258,2015/09/11,45.0,45.574,45.0,356200,47.0,44.0
259,2015/09/14,44.0,44.329,46.0,219500,46.0,43.0
260,2015/09/15,43.0,43.538,44.0,152300,45.0,43.0
261,2015/09/16,45.0,43.943,44.0,208400,45.0,43.0
262,2015/09/17,44.0,43.902,45.0,206700,45.0,43.0
263,2015/09/18,42.0,43.066,44.0,171600,44.0,42.0
264,2015/09/24,43.0,42.296,43.0,100100,43.0,42.0
265,2015/09/25,43.0,41.973,42.0,173500,43.0,41.0
266,2015/09/28,42.0,42.065,42.0,120800,43.0,42.0
267,2015/09/29,41.0,41.494,42.0,286600,42.0,41.0
268,2015/09/30,42.0,41.021,41.0,73100,42.0,40.0
269,2015/10/01,41.0,41.283,41.0,54100,42.0,41.0
270,2015/10/02,42.0,41.004,41.0,137500,42.0,40.0
271,2015/10/05,43.0,42.853,42.0,345600,44.0,42.0
272,2015/10/06,43.0,43.142,43.0,130400,44.0,43.0
273,2015/10/07,46.0,44.015,43.0,362500,46.0,43.0
274,2015/10/08,46.0,45.831,46.0,251400,47.0,45.0
275,2015/10/09,45.0,45.416,47.0,320500,47.0,45.0
276,2015/10/13,47.0,45.7,46.0,205600,47.0,45.0
277,2015/10/14,45.0,46.165,46.0,104400,47.0,45.0
278,2015/10/15,46.0,44.751,46.0,308400,46.0,44.0
279,2015/10/16,46.0,45.276,46.0,56200,46.0,45.0
280,2015/10/19,45.0,45.062,46.0,209500,46.0,44.0
281,2015/10/20,45.0,44.386,45.0,79000,45.0,44.0
282,2015/10/21,44.0,43.859,45.0,258300,45.0,43.0
283,2015/10/22,44.0,43.875,44.0,77700,44.0,43.0
284,2015/10/23,44.0,44.24,45.0,105200,45.0,44.0
285,2015/10/26,44.0,44.102,44.0,218700,45.0,44.0
286,2015/10/27,44.0,43.924,44.0,211300,45.0,43.0
287,2015/10/28,44.0,43.588,43.0,182900,44.0,43.0
288,2015/10/29,45.0,45.112,45.0,238600,46.0,44.0
289,2015/10/30,45.0,44.843,45.0,101100,45.0,44.0
290,2015/11/02,52.0,51.661,47.0,4802800,56.0,47.0
291,2015/11/04,49.0,50.787,52.0,895500,53.0,49.0
292,2015/11/05,48.0,47.486,50.0,512200,50.0,46.0
293,2015/11/06,47.0,47.284,47.0,188900,48.0,47.0
294,2015/11/09,47.0,47.796,47.0,236600,49.0,47.0
295,2015/11/10,49.0,49.17,48.0,431600,50.0,48.0
296,2015/11/11,49.0,48.096,49.0,303000,49.0,47.0
297,2015/11/12,48.0,47.627,48.0,176400,49.0,47.0
298,2015/11/13,47.0,47.048,47.0,224000,48.0,47.0
299,2015/11/16,50.0,50.96,50.0,1325600,53.0,50.0
300,2015/11/17,51.0,50.644,51.0,261500,52.0,50.0
301,2015/11/18,49.0,49.556,50.0,231100,51.0,49.0
302,2015/11/19,48.0,48.111,49.0,306800,49.0,47.0
303,2015/11/20,48.0,48.252,48.0,204200,49.0,47.0
304,2015/11/24,49.0,49.326,49.0,382500,51.0,49.0
305,2015/11/25,49.0,49.03,49.0,197700,50.0,49.0
306,2015/11/26,49.0,49.014,49.0,259500,50.0,48.0
307,2015/11/27,50.0,49.207,49.0,169000,50.0,49.0
308,2015/11/30,48.0,49.308,50.0,290800,50.0,48.0
309,2015/12/01,49.0,48.98,49.0,199000,50.0,48.0
310,2015/12/02,49.0,49.048,49.0,111600,50.0,49.0
311,2015/12/03,49.0,49.002,49.0,439800,50.0,48.0
312,2015/12/04,50.0,49.552,49.0,733900,51.0,48.0
313,2015/12/07,51.0,49.965,50.0,305200,51.0,49.0
314,2015/12/08,49.0,49.432,50.0,620200,51.0,48.0
315,2015/12/09,49.0,48.814,49.0,137000,49.0,48.0
316,2015/12/10,48.0,48.172,49.0,165600,49.0,48.0
317,2015/12/11,48.0,48.108,48.0,258800,49.0,47.0
318,2015/12/14,48.0,46.969,47.0,331900,48.0,46.0
319,2015/12/15,46.0,46.701,48.0,211600,48.0,46.0
320,2015/12/16,46.0,46.982,47.0,232300,48.0,46.0
321,2015/12/17,46.0,46.18,46.0,254100,47.0,46.0
322,2015/12/18,43.0,44.675,46.0,948700,46.0,42.0
323,2015/12/21,41.0,41.149,43.0,1044200,43.0,40.0
324,2015/12/22,43.0,41.274,41.0,716900,43.0,40.0
325,2015/12/24,40.0,41.069,43.0,857400,43.0,40.0
326,2015/12/25,40.0,39.849,40.0,760600,41.0,39.0
327,2015/12/28,44.0,42.684,41.0,441700,45.0,41.0
328,2015/12/29,45.0,43.779,45.0,241100,45.0,42.0
329,2015/12/30,44.0,43.839,44.0,208500,44.0,43.0
330,2016/01/04,44.0,44.589,44.0,388400,46.0,44.0
331,2016/01/05,44.0,44.415,43.0,102000,45.0,43.0
332,2016/01/06,48.0,47.38,45.0,1238200,49.0,45.0
333,2016/01/07,48.0,47.678,48.0,441300,49.0,47.0
334,2016/01/08,47.0,46.717,47.0,189100,47.0,46.0
335,2016/01/12,44.0,44.963,46.0,312600,47.0,44.0
336,2016/01/13,48.0,46.156,43.0,616000,49.0,43.0
337,2016/01/14,47.0,45.451,45.0,657500,47.0,44.0
338,2016/01/15,50.0,53.45,47.0,7620300,61.0,47.0
339,2016/01/18,49.0,49.772,46.0,2145900,54.0,45.0
340,2016/01/19,54.0,53.514,49.0,3549300,57.0,49.0
341,2016/01/20,50.0,53.284,57.0,1691100,57.0,50.0
342,2016/01/21,46.0,47.883,49.0,1689000,51.0,45.0
343,2016/01/22,48.0,47.798,48.0,541300,49.0,47.0
344,2016/01/25,49.0,48.926,49.0,437500,50.0,47.0
345,2016/01/26,49.0,47.901,48.0,192700,49.0,47.0
346,2016/01/27,46.0,47.502,48.0,590500,49.0,46.0
347,2016/01/28,48.0,47.741,47.0,373700,49.0,46.0
348,2016/01/29,47.0,47.145,47.0,331100,48.0,46.0
349,2016/02/01,52.0,50.18,49.0,743100,52.0,48.0
350,2016/02/02,50.0,50.832,51.0,355200,52.0,50.0
351,2016/02/03,49.0,49.242,49.0,351900,50.0,48.0
352,2016/02/04,52.0,51.089,50.0,599100,52.0,50.0
353,2016/02/05,49.0,49.393,52.0,763900,52.0,48.0
354,2016/02/08,79.0,68.717,61.0,22791900,79.0,53.0
355,2016/02/09,82.0,91.037,93.0,64554700,104.0,79.0
356,2016/02/10,87.0,91.574,97.0,36790400,103.0,79.0
357,2016/02/12,61.0,66.769,77.0,21002200,82.0,58.0
358,2016/02/15,81.0,86.397,78.0,17493200,91.0,75.0
359,2016/02/16,73.0,80.067,77.0,38728300,92.0,72.0
360,2016/02/17,73.0,75.924,76.0,17371700,81.0,69.0
361,2016/02/18,73.0,72.964,77.0,8401600,78.0,70.0
362,2016/02/19,69.0,68.894,72.0,4846800,72.0,67.0
363,2016/02/22,71.0,68.489,67.0,5829700,73.0,65.0
364,2016/02/23,68.0,69.625,71.0,3164200,72.0,68.0
365,2016/02/24,66.0,65.77,66.0,3338900,68.0,64.0
366,2016/02/25,70.0,69.627,67.0,7308400,73.0,67.0
367,2016/02/26,79.0,77.352,72.0,20760600,82.0,70.0
368,2016/02/29,77.0,80.552,84.0,9624900,85.0,77.0
369,2016/03/01,74.0,72.365,74.0,6723000,76.0,70.0
370,2016/03/02,81.0,80.74,77.0,18166900,86.0,74.0
371,2016/03/03,81.0,80.121,79.0,6219500,83.0,78.0
372,2016/03/04,82.0,81.21,80.0,4161100,83.0,79.0
373,2016/03/07,89.0,87.292,86.0,11504900,90.0,84.0
374,2016/03/08,84.0,85.469,91.0,7289000,91.0,81.0
375,2016/03/09,94.0,88.667,82.0,16278800,95.0,80.0
376,2016/03/10,91.0,94.423,91.0,15880600,99.0,89.0
377,2016/03/11,91.0,93.507,91.0,8260600,97.0,89.0
378,2016/03/14,94.0,93.526,95.0,8259100,96.0,90.0
379,2016/03/15,86.0,89.444,93.0,9443100,94.0,86.0
380,2016/03/16,84.0,84.784,84.0,3086900,87.0,83.0
381,2016/03/17,82.0,84.391,85.0,4790800,87.0,81.0
382,2016/03/18,83.0,81.072,80.0,2687700,84.0,79.0
383,2016/03/22,85.0,86.428,86.0,4000400,89.0,84.0
384,2016/03/23,83.0,83.631,86.0,2943800,86.0,82.0
385,2016/03/24,80.0,81.206,82.0,2579200,83.0,80.0
386,2016/03/25,80.0,80.012,80.0,2414300,82.0,79.0
387,2016/03/28,73.0,75.351,79.0,4702900,79.0,73.0
388,2016/03/29,76.0,75.162,74.0,1780600,77.0,73.0
389,2016/03/30,71.0,73.417,75.0,1813500,76.0,71.0
390,2016/03/31,72.0,72.484,73.0,1705500,74.0,72.0
391,2016/04/01,70.0,70.666,73.0,2042400,73.0,69.0
392,2016/04/04,70.0,69.935,69.0,1554100,72.0,68.0
393,2016/04/05,67.0,68.525,71.0,1787500,72.0,67.0
394,2016/04/06,66.0,66.286,66.0,1687700,68.0,65.0
395,2016/04/07,71.0,71.6,66.0,4725700,75.0,66.0
396,2016/04/08,74.0,71.208,70.0,2053100,74.0,69.0
397,2016/04/11,76.0,74.091,74.0,2660100,77.0,71.0
398,2016/04/12,73.0,75.187,76.0,2389800,78.0,73.0
399,2016/04/13,73.0,70.982,71.0,1461700,73.0,70.0
400,2016/04/14,71.0,71.305,71.0,1011600,73.0,70.0
401,2016/04/15,70.0,69.492,70.0,915900,71.0,68.0
402,2016/04/18,67.0,68.033,68.0,916200,69.0,67.0
403,2016/04/19,74.0,78.762,77.0,20447200,85.0,74.0
404,2016/04/20,73.0,74.342,76.0,2105200,77.0,73.0
405,2016/04/21,73.0,73.328,74.0,1646500,75.0,72.0
406,2016/04/22,72.0,72.057,73.0,961200,73.0,71.0
407,2016/04/25,76.0,75.411,73.0,3484900,78.0,73.0
408,2016/04/26,71.0,72.629,75.0,3813900,76.0,70.0
409,2016/04/27,71.0,71.394,71.0,863100,73.0,70.0
410,2016/04/28,71.0,71.497,72.0,1237900,73.0,71.0
411,2016/05/02,70.0,70.05,70.0,1087400,71.0,69.0
412,2016/05/06,72.0,70.586,71.0,921000,72.0,69.0
413,2016/05/09,75.0,72.751,71.0,1574800,75.0,70.0
414,2016/05/10,74.0,78.324,82.0,8688900,83.0,74.0
415,2016/05/11,72.0,72.393,75.0,2331300,75.0,71.0
416,2016/05/12,73.0,72.554,72.0,1219600,74.0,71.0
417,2016/05/13,70.0,70.679,73.0,1763700,73.0,69.0
418,2016/05/16,69.0,69.812,70.0,998800,71.0,69.0
419,2016/05/17,68.0,68.963,69.0,1002000,70.0,68.0
420,2016/05/18,66.0,67.354,69.0,2059500,70.0,66.0
421,2016/05/19,68.0,67.367,67.0,638800,69.0,66.0
422,2016/05/20,68.0,67.899,67.0,398500,69.0,67.0
423,2016/05/23,69.0,68.927,69.0,454800,70.0,68.0
424,2016/05/24,68.0,68.078,69.0,578400,69.0,67.0
425,2016/05/25,68.0,67.268,68.0,854500,68.0,66.0
426,2016/05/26,66.0,66.876,68.0,490100,68.0,66.0
427,2016/05/27,66.0,65.584,65.0,843600,67.0,65.0
428,2016/05/30,67.0,66.422,66.0,661200,68.0,65.0
429,2016/05/31,67.0,66.993,67.0,728100,68.0,66.0
430,2016/06/01,67.0,66.386,66.0,171900,67.0,66.0
431,2016/06/02,66.0,66.168,67.0,834700,68.0,65.0
432,2016/06/03,68.0,66.688,66.0,883000,68.0,65.0
433,2016/06/06,66.0,66.708,66.0,815300,68.0,65.0
434,2016/06/07,66.0,66.102,67.0,466700,67.0,65.0
435,2016/06/08,67.0,65.988,67.0,420900,67.0,65.0
436,2016/06/09,66.0,65.351,65.0,2061700,67.0,64.0
437,2016/06/10,65.0,65.344,65.0,240900,66.0,65.0
438,2016/06/13,63.0,63.749,65.0,638000,65.0,63.0
439,2016/06/14,59.0,60.542,63.0,1473100,64.0,59.0
440,2016/06/15,60.0,58.607,58.0,728400,60.0,57.0
441,2016/06/16,54.0,56.226,59.0,1030700,59.0,54.0
442,2016/06/17,56.0,55.724,55.0,563300,57.0,55.0
443,2016/06/20,58.0,57.227,55.0,597000,59.0,55.0
444,2016/06/21,59.0,58.93,58.0,575600,61.0,57.0
445,2016/06/22,59.0,58.823,59.0,517300,60.0,58.0
446,2016/06/23,59.0,58.941,58.0,250800,60.0,58.0
447,2016/06/24,51.0,52.487,60.0,2102900,60.0,42.0
448,2016/06/27,54.0,52.752,51.0,879600,54.0,51.0
449,2016/06/28,54.0,53.256,52.0,572600,55.0,51.0
450,2016/06/29,57.0,55.534,55.0,666500,57.0,54.0
451,2016/06/30,57.0,57.034,57.0,559500,58.0,56.0
452,2016/07/01,58.0,56.679,57.0,676900,58.0,55.0
453,2016/07/04,61.0,59.108,58.0,896000,61.0,57.0
454,2016/07/05,58.0,59.136,60.0,307700,61.0,58.0
455,2016/07/06,59.0,57.454,58.0,686600,59.0,56.0
456,2016/07/07,57.0,58.442,59.0,389600,60.0,57.0
457,2016/07/08,56.0,57.391,58.0,409800,59.0,56.0
458,2016/07/11,56.0,57.22,58.0,339000,59.0,56.0
459,2016/07/12,58.0,57.292,57.0,612700,58.0,56.0
460,2016/07/13,58.0,58.035,58.0,456100,59.0,57.0
461,2016/07/14,56.0,56.142,57.0,700300,57.0,55.0
462,2016/07/15,55.0,55.777,56.0,441100,57.0,55.0
463,2016/07/19,55.0,54.747,55.0,539900,56.0,53.0
464,2016/07/20,57.0,55.628,55.0,368400,57.0,55.0
465,2016/07/21,56.0,55.852,56.0,476900,57.0,55.0
466,2016/07/22,55.0,55.839,56.0,319100,57.0,55.0
467,2016/07/25,56.0,56.117,56.0,162500,57.0,55.0
468,2016/07/26,54.0,55.05,56.0,292200,56.0,54.0
469,2016/07/27,55.0,55.663,55.0,268100,57.0,54.0
470,2016/07/28,54.0,54.4,56.0,412600,56.0,54.0
471,2016/07/29,54.0,54.011,54.0,263500,55.0,53.0
472,2016/08/01,54.0,54.25,54.0,78000,55.0,54.0
473,2016/08/02,55.0,54.255,55.0,130800,55.0,54.0
474,2016/08/03,53.0,54.454,54.0,534100,56.0,53.0
475,2016/08/04,55.0,54.987,55.0,609700,56.0,54.0
476,2016/08/05,54.0,55.004,55.0,281000,56.0,54.0
477,2016/08/08,54.0,54.438,55.0,319100,56.0,54.0
478,2016/08/09,56.0,55.321,54.0,245800,57.0,54.0
479,2016/08/10,58.0,57.139,56.0,1421500,59.0,56.0
480,2016/08/12,56.0,55.629,56.0,807900,57.0,55.0
481,2016/08/15,55.0,54.999,55.0,513300,56.0,54.0
482,2016/08/16,53.0,53.984,55.0,426400,55.0,53.0
483,2016/08/17,55.0,54.05,53.0,294400,55.0,53.0
484,2016/08/18,54.0,54.175,54.0,425400,55.0,54.0
485,2016/08/19,55.0,54.059,54.0,329800,55.0,53.0
486,2016/08/22,55.0,54.51,55.0,217000,55.0,54.0
487,2016/08/23,56.0,55.033,55.0,324100,56.0,54.0
488,2016/08/24,58.0,57.168,55.0,2253800,59.0,55.0
489,2016/08/25,59.0,64.004,67.0,13391900,69.0,59.0
490,2016/08/26,56.0,57.475,59.0,2693800,59.0,56.0
491,2016/08/29,56.0,57.125,57.0,1184100,58.0,56.0
492,2016/08/30,59.0,58.775,57.0,2428700,60.0,57.0
493,2016/08/31,62.0,60.397,60.0,1563100,62.0,59.0
494,2016/09/01,62.0,63.101,62.0,2117100,65.0,61.0
495,2016/09/02,63.0,62.19,64.0,938500,64.0,61.0
496,2016/09/05,68.0,65.818,63.0,3352600,68.0,62.0
497,2016/09/06,68.0,67.358,67.0,2458700,69.0,66.0
498,2016/09/07,65.0,65.718,67.0,1933800,68.0,64.0
499,2016/09/08,66.0,65.685,66.0,1038700,67.0,64.0
500,2016/09/09,66.0,65.16,65.0,548600,66.0,64.0
501,2016/09/12,67.0,65.793,64.0,1024200,67.0,64.0
502,2016/09/13,66.0,65.031,67.0,1093400,67.0,64.0
503,2016/09/14,62.0,63.531,65.0,1470600,66.0,62.0
504,2016/09/15,62.0,61.497,62.0,693800,63.0,60.0
505,2016/09/16,64.0,63.236,63.0,422100,64.0,62.0
506,2016/09/20,63.0,63.662,64.0,677400,65.0,62.0
507,2016/09/21,64.0,63.421,64.0,283900,64.0,63.0
508,2016/09/23,64.0,63.305,64.0,353400,64.0,63.0
509,2016/09/26,66.0,65.098,64.0,849100,66.0,63.0
510,2016/09/27,64.0,64.904,65.0,467600,66.0,64.0
511,2016/09/28,64.0,64.004,65.0,310800,65.0,63.0
512,2016/09/29,66.0,65.673,65.0,981500,67.0,64.0
513,2016/09/30,65.0,64.984,65.0,644300,66.0,64.0
514,2016/10/03,65.0,64.922,65.0,497300,66.0,64.0
515,2016/10/04,64.0,64.279,65.0,198000,65.0,64.0
516,2016/10/05,65.0,64.163,64.0,360300,65.0,64.0
517,2016/10/06,64.0,63.967,65.0,588600,65.0,63.0
518,2016/10/07,63.0,62.886,64.0,736000,64.0,62.0
519,2016/10/11,62.0,62.148,63.0,662600,63.0,61.0
520,2016/10/12,61.0,61.036,61.0,551200,62.0,60.0
521,2016/10/13,64.0,63.451,62.0,1628000,66.0,61.0
522,2016/10/14,64.0,62.508,63.0,506600,64.0,62.0
523,2016/10/17,64.0,63.075,63.0,279400,64.0,62.0
524,2016/10/18,63.0,63.532,64.0,319100,64.0,63.0
525,2016/10/19,66.0,64.542,63.0,733800,66.0,63.0
526,2016/10/20,65.0,65.083,66.0,514900,66.0,64.0
527,2016/10/21,63.0,64.294,65.0,565100,66.0,63.0
528,2016/10/24,63.0,63.882,64.0,268800,65.0,63.0
529,2016/10/25,63.0,63.352,64.0,479900,64.0,62.0
530,2016/10/26,62.0,62.668,63.0,332900,64.0,62.0
531,2016/10/27,64.0,63.013,63.0,125200,64.0,62.0
532,2016/10/28,64.0,63.002,63.0,176700,64.0,62.0
533,2016/10/31,63.0,62.744,63.0,156700,64.0,62.0
534,2016/11/01,62.0,62.626,63.0,112000,63.0,62.0
535,2016/11/02,61.0,61.643,62.0,348400,63.0,61.0
536,2016/11/04,60.0,60.478,61.0,323800,62.0,60.0
537,2016/11/07,60.0,59.868,60.0,286400,61.0,59.0
538,2016/11/08,59.0,60.487,61.0,403100,62.0,59.0
539,2016/11/09,57.0,55.271,60.0,1411200,60.0,52.0
540,2016/11/10,60.0,59.132,59.0,404600,60.0,58.0
541,2016/11/11,57.0,58.678,59.0,504700,60.0,57.0
542,2016/11/14,60.0,58.87,58.0,639500,61.0,58.0
543,2016/11/15,64.0,64.597,64.0,2980100,67.0,63.0
544,2016/11/16,64.0,63.203,64.0,682900,65.0,62.0
545,2016/11/17,63.0,63.1,63.0,358800,64.0,63.0
546,2016/11/18,63.0,63.393,64.0,559700,64.0,62.0
547,2016/11/21,67.0,65.225,64.0,1564400,67.0,63.0
548,2016/11/22,67.0,67.028,66.0,2990900,69.0,65.0
549,2016/11/24,66.0,65.317,66.0,3870100,67.0,64.0
550,2016/11/25,63.0,63.448,65.0,1412100,66.0,62.0
551,2016/11/28,63.0,62.812,63.0,562900,64.0,62.0
552,2016/11/29,64.0,63.289,63.0,422500,65.0,62.0
553,2016/11/30,63.0,63.073,64.0,470900,64.0,62.0
554,2016/12/01,64.0,62.999,63.0,443700,64.0,62.0
555,2016/12/02,62.0,62.17,63.0,611900,63.0,61.0
556,2016/12/05,62.0,61.602,62.0,257800,62.0,61.0
557,2016/12/06,62.0,61.787,62.0,220400,63.0,61.0
558,2016/12/07,63.0,62.85,62.0,488700,64.0,62.0
559,2016/12/08,63.0,62.737,63.0,388400,64.0,62.0
560,2016/12/09,64.0,62.647,63.0,683000,64.0,61.0
561,2016/12/12,63.0,63.131,64.0,478600,64.0,62.0
562,2016/12/13,62.0,62.113,63.0,666300,63.0,62.0
563,2016/12/14,62.0,62.213,62.0,308000,63.0,62.0
564,2016/12/15,63.0,62.098,63.0,421200,63.0,61.0
565,2016/12/16,63.0,62.612,63.0,879700,64.0,61.0
566,2016/12/19,62.0,62.227,62.0,162500,63.0,62.0
567,2016/12/20,63.0,62.684,62.0,744500,64.0,61.0
568,2016/12/21,62.0,62.352,63.0,450800,64.0,62.0
569,2016/12/22,62.0,61.979,62.0,293000,63.0,61.0
570,2016/12/26,62.0,61.782,62.0,478600,63.0,61.0
571,2016/12/27,62.0,61.036,62.0,1168200,63.0,60.0
572,2016/12/28,62.0,60.559,62.0,1109400,62.0,60.0
573,2016/12/29,61.0,60.935,61.0,283800,62.0,60.0
574,2016/12/30,60.0,60.405,60.0,254900,61.0,60.0
575,2017/01/04,63.0,62.414,60.0,1234100,64.0,60.0
576,2017/01/05,64.0,63.38,63.0,1409300,65.0,62.0
577,2017/01/06,66.0,65.546,64.0,2415900,67.0,63.0
578,2017/01/10,67.0,66.347,67.0,1096800,67.0,65.0
579,2017/01/11,66.0,65.884,66.0,503800,67.0,65.0
580,2017/01/12,64.0,64.15,66.0,909200,66.0,63.0
581,2017/01/13,65.0,63.908,64.0,295200,65.0,63.0
582,2017/01/16,64.0,64.231,65.0,223900,65.0,64.0
583,2017/01/17,64.0,63.23,65.0,486900,65.0,62.0
584,2017/01/18,63.0,63.013,63.0,198200,64.0,62.0
585,2017/01/19,64.0,64.593,63.0,832200,66.0,63.0
586,2017/01/20,64.0,63.884,64.0,873000,66.0,63.0
587,2017/01/23,66.0,64.173,64.0,418100,66.0,63.0
588,2017/01/24,65.0,65.048,65.0,566600,66.0,64.0
589,2017/01/25,67.0,66.449,66.0,2413000,68.0,65.0
590,2017/01/26,66.0,66.015,66.0,565300,67.0,65.0
591,2017/01/27,66.0,65.682,66.0,265300,67.0,65.0
592,2017/01/30,67.0,66.634,66.0,1245300,67.0,65.0
593,2017/01/31,68.0,68.197,66.0,3065600,70.0,65.0
594,2017/02/01,69.0,67.825,68.0,2077100,69.0,66.0
595,2017/02/02,67.0,70.359,69.0,6123000,73.0,67.0
596,2017/02/03,70.0,69.19,68.0,2389200,71.0,68.0
597,2017/02/06,71.0,70.538,70.0,2372200,72.0,69.0
598,2017/02/07,71.0,70.171,71.0,1361200,71.0,69.0
599,2017/02/08,69.0,69.063,70.0,1716700,71.0,68.0
600,2017/02/09,69.0,68.911,69.0,675200,70.0,68.0
601,2017/02/10,70.0,69.356,70.0,368700,70.0,69.0
602,2017/02/13,71.0,70.092,70.0,1343700,71.0,69.0
603,2017/02/14,69.0,69.186,71.0,2138200,71.0,68.0
604,2017/02/15,68.0,68.37,69.0,1621700,69.0,67.0
605,2017/02/16,68.0,67.707,68.0,305500,68.0,67.0
606,2017/02/17,66.0,66.413,68.0,1164200,68.0,65.0
607,2017/02/20,68.0,66.623,66.0,672400,68.0,65.0
608,2017/02/21,66.0,66.419,67.0,381300,67.0,66.0
609,2017/02/22,69.0,67.784,67.0,1024700,69.0,66.0
610,2017/02/23,67.0,67.001,67.0,727300,68.0,66.0
611,2017/02/24,67.0,67.001,67.0,304600,68.0,66.0
612,2017/02/27,67.0,66.072,66.0,392300,67.0,65.0
613,2017/02/28,66.0,65.936,67.0,410800,67.0,65.0
614,2017/03/01,67.0,65.923,66.0,368100,67.0,65.0
615,2017/03/02,66.0,66.202,67.0,417400,67.0,65.0
616,2017/03/03,65.0,66.02,67.0,577900,67.0,65.0
617,2017/03/06,65.0,65.898,66.0,323200,67.0,65.0
618,2017/03/07,66.0,65.952,66.0,473400,67.0,65.0
619,2017/03/08,67.0,66.029,66.0,313600,67.0,65.0
620,2017/03/09,66.0,66.114,66.0,483100,67.0,65.0
621,2017/03/10,66.0,65.983,66.0,370100,67.0,65.0
622,2017/03/13,66.0,65.855,66.0,346300,67.0,65.0
623,2017/03/14,65.0,65.425,66.0,75700,66.0,65.0
624,2017/03/15,65.0,65.384,66.0,129900,66.0,65.0
625,2017/03/16,66.0,65.66,66.0,260800,66.0,65.0
626,2017/03/17,65.0,65.076,65.0,200800,66.0,65.0
627,2017/03/21,64.0,64.703,65.0,653100,66.0,64.0
628,2017/03/22,63.0,63.636,64.0,147600,64.0,63.0
629,2017/03/23,64.0,62.931,63.0,444500,64.0,62.0
630,2017/03/24,63.0,63.043,63.0,155200,64.0,62.0
631,2017/03/27,61.0,62.187,63.0,328000,63.0,61.0
632,2017/03/28,62.0,61.811,61.0,248600,63.0,61.0
633,2017/03/29,64.0,62.847,62.0,238100,64.0,62.0
634,2017/03/30,63.0,63.12,63.0,233400,64.0,62.0
635,2017/03/31,63.0,62.61,63.0,325100,64.0,62.0
636,2017/04/03,62.0,64.275,64.0,1727000,67.0,62.0
637,2017/04/04,63.0,62.633,63.0,654500,64.0,62.0
638,2017/04/05,63.0,62.147,62.0,350800,63.0,61.0
639,2017/04/06,59.0,60.507,62.0,951400,62.0,59.0
640,2017/04/07,60.0,59.404,59.0,836500,61.0,58.0
641,2017/04/10,60.0,59.552,59.0,190200,61.0,59.0
642,2017/04/11,59.0,58.931,60.0,281200,60.0,58.0
643,2017/04/12,56.0,56.929,58.0,778100,58.0,56.0
644,2017/04/13,57.0,56.069,56.0,528100,58.0,55.0
645,2017/04/14,55.0,56.615,57.0,756600,59.0,55.0
646,2017/04/17,57.0,56.768,56.0,460500,58.0,56.0
647,2017/04/18,59.0,58.679,58.0,402100,59.0,58.0
648,2017/04/19,59.0,58.998,59.0,311300,60.0,58.0
649,2017/04/20,59.0,59.862,59.0,247000,61.0,59.0
650,2017/04/21,60.0,60.029,60.0,197900,61.0,60.0
651,2017/04/24,59.0,59.541,60.0,95700,60.0,59.0
652,2017/04/25,60.0,59.111,59.0,216200,60.0,59.0
653,2017/04/26,61.0,60.577,60.0,343100,62.0,60.0
654,2017/04/27,61.0,61.751,61.0,201600,62.0,61.0
655,2017/04/28,61.0,61.166,62.0,360000,63.0,60.0
656,2017/05/01,62.0,61.018,61.0,211000,62.0,60.0
657,2017/05/02,63.0,61.799,61.0,309500,63.0,61.0
658,2017/05/08,64.0,62.873,62.0,214500,64.0,62.0
659,2017/05/09,62.0,63.507,64.0,434600,65.0,62.0
660,2017/05/10,63.0,62.637,63.0,187800,63.0,62.0
661,2017/05/11,63.0,63.084,63.0,378800,64.0,62.0
662,2017/05/12,64.0,63.076,62.0,196800,64.0,62.0
663,2017/05/15,64.0,63.349,63.0,223200,64.0,63.0
664,2017/05/16,65.0,64.598,66.0,1203700,66.0,63.0
665,2017/05/17,64.0,64.232,64.0,950200,65.0,63.0
666,2017/05/18,62.0,62.128,62.0,951700,63.0,61.0
667,2017/05/19,63.0,62.592,62.0,517300,64.0,62.0
668,2017/05/22,63.0,63.777,63.0,531300,65.0,63.0
669,2017/05/23,64.0,63.992,64.0,698900,65.0,63.0
670,2017/05/24,65.0,64.444,64.0,279500,65.0,64.0
671,2017/05/25,65.0,65.052,65.0,570400,66.0,64.0
672,2017/05/26,64.0,64.903,65.0,167900,65.0,64.0
673,2017/05/29,64.0,64.501,65.0,95700,65.0,64.0
674,2017/05/30,64.0,64.004,65.0,484700,65.0,63.0
675,2017/05/31,64.0,63.929,64.0,354000,64.0,63.0
676,2017/06/01,65.0,63.996,64.0,285600,65.0,63.0
677,2017/06/02,65.0,64.417,64.0,104100,65.0,64.0
678,2017/06/05,65.0,64.58,64.0,392900,65.0,63.0
679,2017/06/06,63.0,63.986,65.0,387000,65.0,63.0
680,2017/06/07,64.0,63.983,63.0,338600,64.0,63.0
681,2017/06/08,65.0,65.209,64.0,1019000,67.0,64.0
682,2017/06/09,66.0,65.951,67.0,1441700,67.0,65.0
683,2017/06/12,67.0,68.195,66.0,4982400,71.0,65.0
684,2017/06/13,67.0,67.709,69.0,1815300,70.0,66.0
685,2017/06/14,68.0,67.255,67.0,1043200,68.0,66.0
686,2017/06/15,66.0,66.821,68.0,570100,68.0,66.0
687,2017/06/16,67.0,66.546,67.0,174900,67.0,66.0
688,2017/06/19,69.0,68.888,67.0,2559000,71.0,67.0
689,2017/06/20,69.0,69.071,70.0,1467700,71.0,68.0
690,2017/06/21,68.0,68.912,69.0,976700,70.0,68.0
691,2017/06/22,69.0,68.958,68.0,679700,70.0,68.0
692,2017/06/23,69.0,71.001,70.0,4764400,75.0,68.0
693,2017/06/26,69.0,69.734,70.0,1134700,71.0,68.0
694,2017/06/27,99.0,90.161,78.0,59356500,99.0,77.0
695,2017/06/28,84.0,90.454,96.0,47265600,105.0,82.0
696,2017/06/29,84.0,84.953,87.0,11904700,91.0,82.0
697,2017/06/30,86.0,84.431,84.0,4411300,88.0,83.0
698,2017/07/03,113.0,102.421,89.0,40358100,116.0,87.0
699,2017/07/04,108.0,129.309,118.0,91584800,154.0,106.0
700,2017/07/05,130.0,124.418,119.0,51896300,134.0,113.0
701,2017/07/06,126.0,131.153,132.0,30556800,140.0,125.0
702,2017/07/07,124.0,124.467,121.0,15187400,132.0,120.0
703,2017/07/10,132.0,130.55,125.0,20157900,137.0,123.0
704,2017/07/11,136.0,137.729,137.0,19350300,143.0,133.0
705,2017/07/12,130.0,130.463,137.0,13495100,138.0,125.0
706,2017/07/13,119.0,122.973,128.0,7994300,128.0,117.0
707,2017/07/14,118.0,115.172,116.0,8994500,121.0,111.0
708,2017/07/18,115.0,112.627,114.0,4530800,116.0,109.0
709,2017/07/19,119.0,118.541,113.0,6652700,124.0,111.0
710,2017/07/20,117.0,116.529,118.0,2646600,119.0,114.0
711,2017/07/21,112.0,113.431,116.0,2174700,116.0,111.0
712,2017/07/24,116.0,114.713,114.0,1737900,117.0,112.0
713,2017/07/25,114.0,114.766,115.0,1643900,117.0,113.0
714,2017/07/26,122.0,121.088,115.0,7835500,125.0,114.0
715,2017/07/27,119.0,121.248,123.0,2774100,125.0,119.0
716,2017/07/28,115.0,115.178,119.0,2087800,119.0,112.0
717,2017/07/31,116.0,114.334,116.0,1652300,117.0,111.0
718,2017/08/01,113.0,117.585,119.0,4468900,122.0,113.0
719,2017/08/02,116.0,114.552,114.0,1051300,116.0,113.0
720,2017/08/03,111.0,112.609,115.0,1886200,116.0,111.0
721,2017/08/04,112.0,112.427,111.0,914000,114.0,111.0
722,2017/08/07,113.0,113.779,114.0,952400,116.0,112.0
723,2017/08/08,115.0,113.731,112.0,1053400,115.0,112.0
724,2017/08/09,110.0,111.578,113.0,1988500,114.0,110.0
725,2017/08/10,113.0,113.035,112.0,1569800,115.0,111.0
726,2017/08/14,111.0,111.079,111.0,1378300,113.0,109.0
727,2017/08/15,110.0,111.41,112.0,1065600,113.0,110.0
728,2017/08/16,106.0,108.127,110.0,1826300,110.0,106.0
729,2017/08/17,95.0,98.003,105.0,9585400,105.0,94.0
730,2017/08/18,93.0,92.809,91.0,3216600,95.0,91.0
731,2017/08/21,90.0,91.01,93.0,1695700,94.0,89.0
732,2017/08/22,93.0,92.73,90.0,1577700,95.0,90.0
733,2017/08/23,100.0,98.403,95.0,4273900,102.0,93.0
734,2017/08/24,100.0,99.522,100.0,1507100,102.0,98.0
735,2017/08/25,107.0,104.673,101.0,3005300,109.0,100.0
736,2017/08/28,115.0,113.398,110.0,5164400,116.0,110.0
737,2017/08/29,112.0,113.082,113.0,3079100,116.0,110.0
738,2017/08/30,111.0,113.371,116.0,2090400,116.0,111.0
739,2017/08/31,113.0,111.97,112.0,1081300,113.0,111.0
740,2017/09/01,110.0,110.525,112.0,1396100,112.0,108.0
741,2017/09/04,102.0,103.29,108.0,2682200,108.0,99.0
742,2017/09/05,97.0,98.302,103.0,2049100,103.0,95.0
743,2017/09/06,101.0,97.104,92.0,1701800,103.0,92.0
744,2017/09/07,99.0,100.644,102.0,462100,103.0,99.0
745,2017/09/08,98.0,99.171,99.0,551200,101.0,98.0
746,2017/09/11,103.0,101.496,100.0,707800,103.0,100.0
747,2017/09/12,105.0,104.496,105.0,922100,106.0,103.0
748,2017/09/13,105.0,105.083,105.0,639100,106.0,104.0
749,2017/09/14,101.0,103.048,106.0,744700,106.0,100.0
750,2017/09/15,103.0,102.079,100.0,715000,105.0,100.0
751,2017/09/19,105.0,105.351,105.0,566400,107.0,104.0
752,2017/09/20,104.0,104.452,105.0,440200,106.0,103.0
753,2017/09/21,104.0,103.688,105.0,886000,106.0,101.0
754,2017/09/22,102.0,103.22,104.0,397300,105.0,102.0
755,2017/09/25,106.0,106.091,103.0,2106800,109.0,102.0
756,2017/09/26,105.0,105.593,106.0,655600,107.0,104.0
757,2017/09/27,114.0,111.684,105.0,3154100,115.0,105.0
758,2017/09/28,111.0,112.384,113.0,2068200,114.0,110.0
759,2017/09/29,111.0,112.133,112.0,836800,114.0,111.0
760,2017/10/02,122.0,118.62,113.0,7265700,123.0,111.0
761,2017/10/03,119.0,119.866,122.0,3705500,123.0,117.0
762,2017/10/04,114.0,116.039,119.0,2312600,120.0,113.0
763,2017/10/05,112.0,113.512,115.0,1600700,116.0,112.0
764,2017/10/06,112.0,111.403,112.0,1347500,114.0,109.0
765,2017/10/10,117.0,116.4,114.0,1793400,119.0,112.0
766,2017/10/11,121.0,120.808,118.0,4669000,124.0,117.0
767,2017/10/12,117.0,118.483,122.0,3195200,122.0,115.0
768,2017/10/13,116.0,115.492,116.0,1523600,118.0,114.0
769,2017/10/16,116.0,118.043,118.0,2263900,120.0,116.0
770,2017/10/17,114.0,115.64,116.0,1248500,117.0,114.0
771,2017/10/18,115.0,115.039,115.0,603400,116.0,114.0
772,2017/10/19,113.0,113.935,116.0,757400,116.0,112.0
773,2017/10/20,114.0,113.25,112.0,795700,115.0,112.0
774,2017/10/23,115.0,114.049,114.0,549500,115.0,113.0
775,2017/10/24,115.0,114.679,114.0,667000,116.0,113.0
776,2017/10/25,117.0,117.382,115.0,3057800,119.0,114.0
777,2017/10/26,119.0,118.016,117.0,1780300,120.0,116.0
778,2017/10/27,120.0,118.64,119.0,1372100,120.0,117.0
779,2017/10/30,119.0,119.623,120.0,1974300,122.0,117.0
780,2017/10/31,120.0,118.89,119.0,505300,120.0,118.0
781,2017/11/01,119.0,121.849,120.0,4125000,125.0,119.0
782,2017/11/02,118.0,117.144,119.0,1959900,120.0,115.0
783,2017/11/06,116.0,116.071,118.0,771200,118.0,115.0
784,2017/11/07,114.0,114.816,116.0,1753800,117.0,113.0
785,2017/11/08,113.0,112.04,112.0,1080700,114.0,111.0
786,2017/11/09,110.0,111.8,114.0,1329300,115.0,109.0
787,2017/11/10,113.0,111.137,110.0,1051400,113.0,109.0
788,2017/11/13,115.0,115.393,114.0,1395800,118.0,112.0
789,2017/11/14,115.0,116.309,117.0,1105900,118.0,115.0
790,2017/11/15,117.0,117.321,117.0,3015900,119.0,116.0
791,2017/11/16,114.0,113.558,113.0,2328100,116.0,111.0
792,2017/11/17,113.0,114.536,116.0,1569200,116.0,113.0
793,2017/11/20,111.0,109.758,110.0,1786100,112.0,108.0
794,2017/11/21,113.0,112.453,111.0,788400,114.0,111.0
795,2017/11/22,115.0,114.516,115.0,1144300,116.0,113.0
796,2017/11/24,113.0,113.926,114.0,522700,115.0,113.0
797,2017/11/27,118.0,116.392,114.0,2433400,119.0,114.0
798,2017/11/28,116.0,116.666,118.0,1074000,119.0,115.0
799,2017/11/29,115.0,115.055,115.0,919800,116.0,114.0
800,2017/11/30,114.0,114.086,115.0,968800,115.0,113.0
801,2017/12/01,116.0,115.786,113.0,1705100,118.0,113.0
802,2017/12/04,114.0,115.145,115.0,844800,117.0,114.0
803,2017/12/05,114.0,112.691,114.0,1122100,114.0,111.0
804,2017/12/06,113.0,112.168,113.0,898100,113.0,111.0
805,2017/12/07,113.0,112.866,112.0,484700,114.0,112.0
806,2017/12/08,112.0,112.351,113.0,1081700,114.0,111.0
807,2017/12/11,112.0,113.451,113.0,967800,115.0,112.0
808,2017/12/12,113.0,112.939,113.0,507400,114.0,112.0
809,2017/12/13,113.0,112.556,113.0,457100,113.0,112.0
810,2017/12/14,112.0,112.303,112.0,761900,113.0,111.0
811,2017/12/15,113.0,111.318,112.0,1126800,113.0,110.0
812,2017/12/18,110.0,110.81,113.0,1016300,113.0,110.0
813,2017/12/19,119.0,127.46,134.0,25701200,137.0,118.0
814,2017/12/20,144.0,133.183,118.0,24726500,151.0,116.0
815,2017/12/21,153.0,150.282,148.0,44808800,163.0,141.0
816,2017/12/22,143.0,146.249,148.0,11676500,153.0,140.0
817,2017/12/25,152.0,151.017,141.0,17344300,159.0,141.0
818,2017/12/26,176.0,167.259,150.0,30218400,183.0,149.0
819,2017/12/27,177.0,179.035,178.0,20702300,188.0,172.0
820,2017/12/28,173.0,170.184,175.0,10600100,176.0,166.0
821,2017/12/29,179.0,179.427,178.0,13340000,186.0,173.0
822,2018/01/04,229.0,199.09,183.0,34267000,229.0,171.0
823,2018/01/05,230.0,237.077,218.0,47393600,262.0,214.0
824,2018/01/09,255.0,250.353,233.0,25395800,265.0,231.0
825,2018/01/10,291.0,283.588,256.0,41695000,307.0,251.0
826,2018/01/11,322.0,317.819,306.0,29924500,332.0,301.0
827,2018/01/12,393.0,356.532,340.0,38157200,399.0,329.0
828,2018/01/15,473.0,457.485,446.0,21763400,473.0,432.0
829,2018/01/16,393.0,482.337,553.0,11798000,553.0,393.0
830,2018/01/17,313.0,338.147,329.0,52417300,375.0,313.0
831,2018/01/18,304.0,313.946,329.0,44210600,339.0,289.0
832,2018/01/19,315.0,313.463,304.0,18888600,325.0,303.0
833,2018/01/22,395.0,363.881,327.0,46814000,395.0,317.0
834,2018/01/23,399.0,412.459,411.0,37967800,437.0,375.0
835,2018/01/24,382.0,380.002,375.0,20201200,397.0,361.0
836,2018/01/25,411.0,399.582,389.0,21002700,412.0,385.0
837,2018/01/26,392.0,410.154,418.0,16776900,426.0,390.0
838,2018/01/29,361.0,378.04,384.0,12532800,401.0,361.0
839,2018/01/30,385.0,358.973,356.0,15905000,389.0,338.0
840,2018/01/31,369.0,377.49,373.0,12146700,393.0,364.0
841,2018/02/01,369.0,373.91,377.0,6307000,380.0,367.0
842,2018/02/02,363.0,364.516,365.0,6825300,374.0,357.0
843,2018/02/05,348.0,347.561,339.0,7626900,367.0,338.0
844,2018/02/06,305.0,307.533,320.0,16756900,338.0,268.0
845,2018/02/07,340.0,354.288,337.0,14099300,375.0,334.0
846,2018/02/08,366.0,361.974,360.0,8423600,369.0,354.0
847,2018/02/09,367.0,358.039,342.0,14526500,380.0,338.0
848,2018/02/13,348.0,362.038,382.0,8947800,384.0,348.0
849,2018/02/14,337.0,333.815,347.0,8891000,353.0,315.0
850,2018/02/15,320.0,329.12,341.0,6239900,349.0,320.0
851,2018/02/16,324.0,323.751,320.0,6385600,335.0,311.0
852,2018/02/19,319.0,318.775,326.0,5231400,326.0,313.0
853,2018/02/20,317.0,316.588,317.0,3105500,323.0,313.0
854,2018/02/21,350.0,346.189,317.0,21016600,370.0,313.0
855,2018/02/22,340.0,347.702,344.0,7622100,360.0,337.0
856,2018/02/23,341.0,345.442,340.0,4236300,352.0,340.0
857,2018/02/26,341.0,346.172,349.0,3957300,355.0,340.0
858,2018/02/27,326.0,335.055,347.0,3409400,347.0,326.0
859,2018/02/28,330.0,328.666,323.0,2756700,336.0,322.0
860,2018/03/01,321.0,320.656,326.0,2926100,328.0,316.0
861,2018/03/02,319.0,313.936,308.0,3039500,323.0,307.0
862,2018/03/05,291.0,302.594,319.0,4556200,321.0,291.0
863,2018/03/06,301.0,303.492,300.0,3703100,312.0,298.0
864,2018/03/07,278.0,284.267,301.0,5464200,302.0,273.0
865,2018/03/08,277.0,284.765,281.0,5963900,299.0,275.0
866,2018/03/09,282.0,280.943,281.0,2584300,286.0,278.0
867,2018/03/12,279.0,282.124,286.0,3436100,291.0,274.0
868,2018/03/13,276.0,276.284,277.0,2167200,281.0,271.0
869,2018/03/14,292.0,295.765,272.0,12334600,320.0,272.0
870,2018/03/15,301.0,295.771,289.0,6490700,309.0,283.0
871,2018/03/16,289.0,297.969,308.0,3702300,309.0,288.0
872,2018/03/19,272.0,276.081,285.0,3354900,288.0,271.0
873,2018/03/20,260.0,263.748,268.0,4481600,272.0,258.0
874,2018/03/22,241.0,249.685,257.0,5770000,263.0,239.0
875,2018/03/23,231.0,229.67,230.0,6427500,239.0,223.0
876,2018/03/26,239.0,240.507,226.0,7366200,258.0,226.0
877,2018/03/27,234.0,240.254,243.0,3046100,247.0,233.0
878,2018/03/28,236.0,236.912,232.0,2041200,244.0,232.0
879,2018/03/29,243.0,241.94,239.0,2427800,249.0,236.0
880,2018/03/30,260.0,252.45,238.0,4352900,261.0,238.0
881,2018/04/02,285.0,273.071,257.0,5938900,287.0,257.0
882,2018/04/03,265.0,274.047,284.0,4725900,285.0,263.0
883,2018/04/04,251.0,255.174,270.0,4820200,272.0,245.0
884,2018/04/05,240.0,243.685,250.0,4679600,253.0,235.0
885,2018/04/06,233.0,235.945,238.0,2220600,242.0,233.0
886,2018/04/09,229.0,228.128,231.0,2300200,233.0,224.0
887,2018/04/10,227.0,227.631,226.0,1632300,232.0,225.0
888,2018/04/11,226.0,229.715,231.0,2285500,236.0,225.0
889,2018/04/12,226.0,228.228,227.0,1679000,234.0,225.0
890,2018/04/13,223.0,226.154,228.0,1590800,230.0,223.0
891,2018/04/16,207.0,207.005,224.0,6181700,224.0,199.0
892,2018/04/17,222.0,215.048,214.0,3219000,223.0,207.0
893,2018/04/18,215.0,215.047,218.0,2233200,221.0,210.0
894,2018/04/19,214.0,215.036,216.0,1088700,220.0,211.0
895,2018/04/20,213.0,213.819,214.0,1303000,219.0,210.0
896,2018/04/23,210.0,211.213,211.0,1339400,214.0,209.0
897,2018/04/24,205.0,207.37,209.0,1920400,211.0,204.0
898,2018/04/25,206.0,206.626,204.0,1048300,209.0,204.0
899,2018/04/26,286.0,234.549,208.0,3649600,286.0,202.0
900,2018/04/27,262.0,279.655,288.0,20087300,295.0,260.0
901,2018/05/01,271.0,264.064,254.0,10640700,282.0,244.0
902,2018/05/02,266.0,265.588,268.0,4381900,275.0,260.0
903,2018/05/07,247.0,252.436,264.0,4270600,265.0,247.0
904,2018/05/08,258.0,253.21,245.0,3876100,262.0,243.0
905,2018/05/09,260.0,258.25,254.0,2962800,266.0,250.0
906,2018/05/10,259.0,263.712,264.0,1871400,268.0,258.0
907,2018/05/11,255.0,254.204,257.0,2218600,259.0,249.0
908,2018/05/14,255.0,252.999,257.0,2132700,258.0,245.0
909,2018/05/15,251.0,261.764,274.0,4952000,275.0,251.0
910,2018/05/16,242.0,242.253,246.0,2232600,248.0,238.0
911,2018/05/17,240.0,238.791,238.0,1971300,244.0,234.0
912,2018/05/18,270.0,262.933,244.0,9803200,279.0,242.0
913,2018/05/21,271.0,271.268,275.0,4291600,279.0,263.0
914,2018/05/22,290.0,283.598,273.0,9487800,296.0,267.0
915,2018/05/23,304.0,305.218,287.0,15779700,316.0,286.0
916,2018/05/24,308.0,311.426,311.0,7218500,319.0,305.0
917,2018/05/25,302.0,304.295,300.0,4359900,311.0,298.0
918,2018/05/28,303.0,303.873,305.0,1884500,308.0,301.0
919,2018/05/29,287.0,288.924,304.0,4240900,304.0,280.0
920,2018/05/30,287.0,282.949,275.0,3359600,296.0,270.0
921,2018/05/31,285.0,286.91,289.0,1867600,295.0,279.0
922,2018/06/01,285.0,284.054,280.0,1783800,291.0,278.0
923,2018/06/04,311.0,304.663,289.0,6652400,315.0,285.0
924,2018/06/05,302.0,306.319,313.0,3598600,314.0,298.0
925,2018/06/06,305.0,305.811,302.0,5282600,319.0,291.0
926,2018/06/07,305.0,304.114,312.0,3227100,313.0,300.0
927,2018/06/08,307.0,305.571,306.0,2291700,313.0,300.0
928,2018/06/11,303.0,304.507,307.0,1555200,310.0,301.0
929,2018/06/12,298.0,300.287,301.0,2735400,305.0,297.0
930,2018/06/13,300.0,302.646,296.0,2593700,307.0,296.0
931,2018/06/14,312.0,316.078,302.0,8462600,327.0,301.0
932,2018/06/15,315.0,311.752,310.0,3397400,317.0,307.0
933,2018/06/18,310.0,312.281,312.0,2094700,317.0,308.0
934,2018/06/19,300.0,304.29,308.0,2794100,311.0,297.0
935,2018/06/20,303.0,296.769,297.0,3045900,305.0,287.0
936,2018/06/21,311.0,306.553,305.0,2077000,311.0,301.0
937,2018/06/22,306.0,308.502,307.0,1709900,313.0,305.0
938,2018/06/25,300.0,309.14,308.0,4228400,318.0,298.0
939,2018/06/26,304.0,299.722,296.0,1925400,305.0,295.0
940,2018/06/27,298.0,300.389,306.0,1249100,306.0,298.0
941,2018/06/28,288.0,291.544,297.0,2094700,299.0,288.0
942,2018/06/29,289.0,289.526,284.0,1182200,294.0,282.0
943,2018/07/02,287.0,292.68,290.0,1403400,299.0,287.0
944,2018/07/03,287.0,289.212,291.0,1325900,295.0,285.0
945,2018/07/04,292.0,307.583,318.0,11977700,323.0,292.0
946,2018/07/05,265.0,278.148,296.0,6786900,301.0,262.0
947,2018/07/06,266.0,267.131,270.0,1684100,272.0,263.0
948,2018/07/09,265.0,266.782,268.0,1360400,272.0,264.0
949,2018/07/10,251.0,255.262,264.0,2716800,266.0,249.0
950,2018/07/11,250.0,249.412,251.0,1950700,257.0,242.0
951,2018/07/12,254.0,254.345,250.0,1769400,262.0,247.0
952,2018/07/13,260.0,258.296,254.0,1178600,262.0,253.0
953,2018/07/17,264.0,263.799,258.0,1267800,268.0,258.0
954,2018/07/18,276.0,273.117,267.0,2005400,280.0,264.0
955,2018/07/19,273.0,275.614,276.0,916000,279.0,273.0
956,2018/07/20,272.0,272.896,276.0,988300,277.0,269.0
957,2018/07/23,264.0,266.94,270.0,1217900,273.0,262.0
958,2018/07/24,263.0,265.043,264.0,662700,268.0,262.0
959,2018/07/25,262.0,262.834,263.0,701200,266.0,261.0
960,2018/07/26,262.0,261.807,261.0,541200,264.0,260.0
961,2018/07/27,257.0,260.087,262.0,723000,264.0,257.0
962,2018/07/30,246.0,249.756,254.0,1092000,254.0,246.0
963,2018/07/31,251.0,246.391,240.0,1052500,253.0,240.0
964,2018/08/01,252.0,254.528,250.0,823100,259.0,250.0
965,2018/08/02,254.0,256.884,260.0,553800,260.0,254.0
966,2018/08/03,248.0,252.185,256.0,511800,256.0,248.0
967,2018/08/06,244.0,246.328,250.0,707900,251.0,243.0
968,2018/08/07,240.0,240.263,240.0,878000,243.0,237.0
969,2018/08/08,252.0,250.08,245.0,980300,257.0,242.0
970,2018/08/09,249.0,250.622,250.0,349300,252.0,249.0
971,2018/08/10,255.0,251.602,249.0,809600,256.0,247.0
972,2018/08/13,270.0,263.581,254.0,2361500,273.0,251.0
973,2018/08/14,251.0,259.063,262.0,1980700,272.0,250.0
974,2018/08/15,242.0,243.393,251.0,1322100,251.0,240.0
975,2018/08/16,233.0,236.104,240.0,1471500,240.0,231.0
976,2018/08/17,239.0,238.131,237.0,859200,241.0,235.0
977,2018/08/20,237.0,242.023,239.0,646700,248.0,237.0
978,2018/08/21,240.0,242.56,243.0,717700,246.0,240.0
979,2018/08/22,243.0,241.938,240.0,591200,245.0,238.0
980,2018/08/23,247.0,248.317,243.0,990700,254.0,243.0
981,2018/08/24,255.0,251.224,247.0,865700,256.0,246.0
982,2018/08/27,263.0,259.631,256.0,1132700,265.0,254.0
983,2018/08/28,260.0,263.179,269.0,1022000,269.0,258.0
984,2018/08/29,260.0,260.181,260.0,434300,263.0,259.0
985,2018/08/30,259.0,258.997,260.0,557000,263.0,257.0
986,2018/08/31,261.0,259.918,257.0,663500,262.0,256.0
987,2018/09/03,261.0,259.744,260.0,532100,263.0,257.0
988,2018/09/04,268.0,266.704,263.0,1253000,271.0,260.0
989,2018/09/05,265.0,269.125,267.0,834800,273.0,265.0
990,2018/09/06,255.0,258.113,262.0,751800,263.0,253.0
991,2018/09/07,253.0,254.254,251.0,644700,260.0,249.0
992,2018/09/10,251.0,251.551,250.0,413700,255.0,250.0
993,2018/09/11,248.0,248.357,249.0,566500,253.0,246.0
994,2018/09/12,241.0,244.274,247.0,678300,250.0,241.0
995,2018/09/13,242.0,241.25,241.0,599700,247.0,238.0
996,2018/09/14,247.0,244.404,238.0,593600,249.0,238.0
997,2018/09/18,250.0,250.016,246.0,566200,254.0,245.0
998,2018/09/19,258.0,254.664,254.0,643500,258.0,252.0
999,2018/09/20,255.0,256.56,258.0,457200,259.0,255.0
1000,2018/09/21,254.0,254.649,255.0,699200,258.0,252.0
1001,2018/09/25,250.0,251.811,253.0,428300,254.0,250.0
1002,2018/09/26,257.0,253.363,248.0,590400,259.0,247.0
1003,2018/09/27,255.0,255.51,256.0,368900,258.0,253.0
1004,2018/09/28,258.0,257.14,255.0,521600,260.0,255.0
1005,2018/10/01,264.0,264.491,258.0,916700,268.0,258.0
1006,2018/10/02,260.0,262.005,268.0,578100,268.0,258.0
1007,2018/10/03,253.0,254.08,258.0,628400,259.0,252.0
1008,2018/10/04,253.0,251.62,253.0,546300,254.0,249.0
1009,2018/10/05,256.0,256.44,251.0,1480700,264.0,249.0
1010,2018/10/09,248.0,250.484,252.0,632700,255.0,248.0
1011,2018/10/10,242.0,244.377,247.0,885800,251.0,241.0
1012,2018/10/11,230.0,228.397,229.0,1656900,235.0,220.0
1013,2018/10/12,245.0,238.72,225.0,1289000,251.0,224.0
1014,2018/10/15,243.0,243.462,243.0,663300,247.0,240.0
1015,2018/10/16,243.0,240.511,241.0,414400,243.0,238.0
1016,2018/10/17,254.0,270.513,271.0,10183000,289.0,251.0
1017,2018/10/18,243.0,246.08,251.0,1865900,252.0,242.0
1018,2018/10/19,238.0,238.291,240.0,1164800,241.0,236.0
1019,2018/10/22,245.0,241.138,237.0,724600,246.0,236.0
1020,2018/10/23,243.0,244.357,245.0,620900,249.0,240.0
1021,2018/10/24,243.0,243.07,243.0,537700,246.0,239.0
1022,2018/10/25,225.0,230.0,235.0,1694500,237.0,225.0
1023,2018/10/26,220.0,225.479,229.0,1352500,234.0,220.0
1024,2018/10/29,204.0,214.111,220.0,1853900,225.0,203.0
1025,2018/10/30,207.0,199.735,193.0,1981600,210.0,189.0
1026,2018/10/31,217.0,215.161,217.0,1022200,219.0,210.0
1027,2018/11/01,223.0,221.377,217.0,839100,225.0,216.0
1028,2018/11/02,233.0,230.678,224.0,1661400,237.0,224.0
1029,2018/11/05,236.0,236.111,231.0,769100,240.0,230.0
1030,2018/11/06,235.0,235.305,238.0,741600,239.0,231.0
1031,2018/11/07,243.0,240.204,235.0,1379400,244.0,233.0
1032,2018/11/08,242.0,244.621,246.0,805100,247.0,242.0
1033,2018/11/09,243.0,243.351,242.0,796800,246.0,241.0
1034,2018/11/12,254.0,257.562,245.0,2699600,267.0,244.0
1035,2018/11/13,259.0,254.821,250.0,1705500,261.0,246.0
1036,2018/11/14,256.0,258.296,261.0,1233000,262.0,254.0
1037,2018/11/15,257.0,258.698,258.0,1491600,261.0,255.0
1038,2018/11/16,263.0,285.248,293.0,19771500,307.0,263.0
1039,2018/11/19,262.0,257.451,271.0,4588100,271.0,246.0
1040,2018/11/20,249.0,252.934,257.0,2328100,261.0,247.0
1041,2018/11/21,247.0,248.321,242.0,1994900,256.0,241.0
1042,2018/11/22,243.0,245.635,245.0,1044600,251.0,243.0
1043,2018/11/26,244.0,246.333,247.0,994000,250.0,243.0
1044,2018/11/27,250.0,246.862,247.0,713300,250.0,245.0
1045,2018/11/28,258.0,256.874,252.0,1620300,262.0,249.0
1046,2018/11/29,261.0,261.305,261.0,1195200,265.0,259.0
1047,2018/11/30,254.0,257.372,262.0,825200,262.0,254.0
1048,2018/12/03,257.0,256.147,253.0,781800,260.0,253.0
1049,2018/12/04,248.0,250.887,256.0,783600,256.0,247.0
1050,2018/12/05,243.0,243.001,243.0,844400,246.0,241.0
1051,2018/12/06,240.0,240.408,241.0,999100,242.0,239.0
1052,2018/12/07,233.0,236.489,240.0,680500,242.0,232.0
1053,2018/12/10,220.0,223.953,225.0,1263100,231.0,219.0
1054,2018/12/11,207.0,211.105,218.0,1959200,222.0,202.0
1055,2018/12/12,224.0,218.717,214.0,1450000,229.0,213.0
1056,2018/12/13,215.0,220.461,224.0,1182800,227.0,215.0
1057,2018/12/14,209.0,210.687,216.0,1033900,217.0,207.0
1058,2018/12/17,202.0,203.03,205.0,1356400,207.0,200.0
1059,2018/12/18,191.0,194.798,196.0,1928700,199.0,191.0
1060,2018/12/19,190.0,190.202,183.0,2450400,199.0,183.0
1061,2018/12/20,181.0,182.874,187.0,2132100,189.0,178.0
1062,2018/12/21,177.0,173.795,178.0,2367500,182.0,165.0
1063,2018/12/25,156.0,159.918,162.0,2454900,167.0,154.0
1064,2018/12/26,165.0,165.612,166.0,1317600,169.0,163.0
1065,2018/12/27,177.0,178.268,183.0,1697700,184.0,174.0
1066,2018/12/28,171.0,172.595,173.0,1046800,175.0,171.0
1067,2019/01/04,168.0,163.606,161.0,1118600,168.0,160.0
1068,2019/01/07,174.0,175.261,173.0,1224600,178.0,173.0
1069,2019/01/08,175.0,175.763,175.0,846100,178.0,174.0
1070,2019/01/09,170.0,174.422,177.0,877700,178.0,170.0
1071,2019/01/10,166.0,166.96,171.0,857000,173.0,164.0
1072,2019/01/11,170.0,171.051,168.0,1182400,177.0,166.0
1073,2019/01/15,174.0,172.014,168.0,968700,175.0,167.0
1074,2019/01/16,174.0,174.682,175.0,772900,178.0,172.0
1075,2019/01/17,183.0,178.906,175.0,1418800,183.0,173.0
1076,2019/01/18,179.0,180.148,183.0,1224800,184.0,178.0
1077,2019/01/21,173.0,178.2,181.0,1254200,182.0,173.0
1078,2019/01/22,179.0,177.341,177.0,891200,180.0,174.0
1079,2019/01/23,176.0,176.34,176.0,780600,178.0,174.0
1080,2019/01/24,179.0,177.318,179.0,864400,179.0,175.0
1081,2019/01/25,184.0,182.525,180.0,1435000,185.0,178.0
1082,2019/01/28,189.0,189.299,191.0,1585800,194.0,185.0
1083,2019/01/29,192.0,188.866,188.0,1770600,194.0,184.0
1084,2019/01/30,185.0,188.286,190.0,1303700,193.0,185.0
1085,2019/01/31,190.0,190.237,188.0,949400,193.0,187.0
1086,2019/02/01,188.0,189.275,191.0,766600,192.0,187.0
1087,2019/02/04,193.0,191.031,190.0,1126800,193.0,188.0
1088,2019/02/05,192.0,193.641,194.0,1023600,197.0,191.0
1089,2019/02/06,190.0,191.345,192.0,769200,194.0,189.0
1090,2019/02/07,188.0,187.708,189.0,755200,190.0,185.0
1091,2019/02/08,181.0,183.577,185.0,829600,187.0,181.0
1092,2019/02/12,192.0,189.142,186.0,1008100,192.0,185.0
1093,2019/02/13,177.0,179.626,186.0,2705700,187.0,175.0
1094,2019/02/14,174.0,173.925,178.0,1242400,179.0,170.0
1095,2019/02/15,171.0,170.069,170.0,954300,173.0,168.0
1096,2019/02/18,176.0,174.736,172.0,923900,177.0,171.0
1097,2019/02/19,177.0,177.721,178.0,450500,180.0,175.0
1098,2019/02/20,175.0,174.986,177.0,508900,177.0,173.0
1099,2019/02/21,172.0,173.543,174.0,725100,176.0,172.0
1100,2019/02/22,174.0,172.46,171.0,640200,175.0,170.0
1101,2019/02/25,177.0,175.395,175.0,808800,178.0,174.0
1102,2019/02/26,173.0,174.658,176.0,768800,178.0,172.0
1103,2019/02/27,174.0,172.661,174.0,436700,174.0,171.0
1104,2019/02/28,169.0,170.796,172.0,742800,173.0,169.0
1105,2019/03/01,172.0,170.508,169.0,508800,172.0,169.0
1106,2019/03/04,174.0,173.113,172.0,673900,175.0,171.0
1107,2019/03/05,170.0,170.986,173.0,908500,173.0,169.0
1108,2019/03/06,171.0,169.73,169.0,351900,171.0,169.0
1109,2019/03/07,167.0,168.183,170.0,740800,171.0,167.0
1110,2019/03/08,162.0,161.449,164.0,928300,164.0,159.0
1111,2019/03/11,160.0,159.873,163.0,530400,164.0,156.0
1112,2019/03/12,167.0,165.429,162.0,692000,169.0,161.0
1113,2019/03/13,165.0,165.586,166.0,517100,168.0,163.0
1114,2019/03/14,164.0,165.438,165.0,228900,168.0,164.0
1115,2019/03/15,161.0,162.268,163.0,481300,164.0,160.0
1116,2019/03/18,161.0,162.174,160.0,572000,165.0,160.0
1117,2019/03/19,160.0,160.614,162.0,418000,162.0,159.0
1118,2019/03/20,162.0,160.452,160.0,255500,162.0,159.0
1119,2019/03/22,161.0,161.242,161.0,274000,163.0,160.0
1120,2019/03/25,158.0,157.728,157.0,465000,159.0,156.0
1121,2019/03/26,162.0,167.485,172.0,1903700,173.0,162.0
1122,2019/03/27,165.0,164.408,163.0,441000,166.0,163.0
1123,2019/03/28,162.0,161.831,162.0,415000,164.0,160.0
1124,2019/03/29,162.0,162.402,164.0,272400,164.0,161.0
1125,2019/04/01,162.0,164.035,163.0,386500,166.0,162.0
1126,2019/04/02,160.0,162.331,164.0,335300,165.0,160.0
1127,2019/04/03,162.0,162.03,160.0,378300,164.0,160.0
1128,2019/04/04,166.0,164.825,163.0,467400,167.0,162.0
1129,2019/04/05,166.0,166.402,166.0,383500,168.0,164.0
1130,2019/04/08,166.0,167.073,165.0,413800,169.0,165.0
1131,2019/04/09,169.0,169.137,166.0,709500,172.0,166.0
1132,2019/04/10,170.0,169.212,169.0,576900,171.0,167.0
1133,2019/04/11,173.0,171.194,170.0,643300,173.0,169.0
1134,2019/04/12,171.0,172.054,174.0,438500,174.0,170.0
1135,2019/04/15,172.0,171.703,174.0,412300,174.0,171.0
1136,2019/04/16,169.0,169.094,172.0,731300,172.0,167.0
1137,2019/04/17,166.0,166.633,168.0,609400,169.0,165.0
1138,2019/04/18,167.0,166.51,167.0,250600,168.0,166.0
1139,2019/04/19,169.0,168.948,167.0,737100,172.0,166.0
1140,2019/04/22,164.0,166.178,168.0,640600,169.0,164.0
1141,2019/04/23,162.0,162.281,164.0,594800,165.0,161.0
1142,2019/04/24,166.0,164.041,162.0,463100,166.0,161.0
1143,2019/04/25,169.0,166.073,165.0,316100,169.0,164.0
1144,2019/04/26,167.0,165.449,167.0,458600,167.0,164.0
1145,2019/05/07,169.0,167.027,165.0,350800,169.0,165.0
1146,2019/05/08,166.0,167.003,166.0,319000,169.0,166.0
1147,2019/05/09,161.0,163.522,167.0,792200,168.0,161.0
1148,2019/05/10,165.0,161.853,162.0,795300,165.0,159.0
1149,2019/05/13,168.0,165.179,165.0,787500,168.0,163.0
1150,2019/05/14,145.0,147.197,146.0,2158800,151.0,145.0
1151,2019/05/15,131.0,136.061,149.0,3058900,150.0,129.0
1152,2019/05/16,130.0,131.294,131.0,746700,134.0,130.0
1153,2019/05/17,128.0,128.465,131.0,855600,131.0,126.0
1154,2019/05/20,124.0,123.583,128.0,1480400,129.0,119.0
1155,2019/05/21,117.0,119.033,122.0,1372200,122.0,117.0
1156,2019/05/22,128.0,127.788,118.0,3472200,135.0,118.0
1157,2019/05/23,126.0,130.076,133.0,944900,134.0,126.0
1158,2019/05/24,125.0,125.35,127.0,652600,128.0,122.0
1159,2019/05/27,126.0,126.26,126.0,361900,127.0,125.0
1160,2019/05/28,125.0,126.098,126.0,523400,127.0,125.0
1161,2019/05/29,125.0,123.9,126.0,480200,126.0,122.0
1162,2019/05/30,124.0,124.973,125.0,374500,126.0,123.0
1163,2019/05/31,122.0,122.997,123.0,482900,125.0,122.0
1164,2019/06/03,118.0,119.324,121.0,670300,121.0,118.0
1165,2019/06/04,122.0,120.433,119.0,484900,123.0,118.0
1166,2019/06/05,127.0,125.604,125.0,562900,128.0,123.0
1167,2019/06/06,126.0,126.877,127.0,568400,129.0,124.0
1168,2019/06/07,130.0,128.227,129.0,538700,131.0,126.0
1169,2019/06/10,134.0,131.257,132.0,705000,134.0,129.0
1170,2019/06/11,144.0,139.853,132.0,1873200,145.0,132.0
1171,2019/06/12,146.0,153.223,147.0,6377900,161.0,145.0
1172,2019/06/13,148.0,145.236,150.0,1645600,150.0,141.0
1173,2019/06/14,143.0,145.452,147.0,886500,148.0,143.0
1174,2019/06/17,135.0,137.394,142.0,1321200,143.0,133.0
1175,2019/06/18,133.0,134.987,135.0,683800,138.0,132.0
1176,2019/06/19,137.0,136.91,135.0,646500,140.0,134.0
1177,2019/06/20,134.0,135.156,137.0,626100,137.0,133.0
1178,2019/06/21,133.0,135.258,136.0,877600,138.0,132.0
1179,2019/06/24,130.0,131.399,133.0,469800,133.0,130.0
1180,2019/06/25,129.0,129.732,132.0,754800,133.0,127.0
1181,2019/06/26,128.0,126.748,126.0,619300,129.0,125.0
1182,2019/06/27,126.0,126.891,127.0,600800,129.0,125.0
1183,2019/06/28,130.0,128.042,125.0,665100,130.0,125.0
1184,2019/07/01,138.0,135.722,133.0,871900,139.0,132.0
1185,2019/07/02,142.0,140.124,139.0,947300,143.0,136.0
1186,2019/07/03,140.0,141.903,143.0,597900,145.0,140.0
1187,2019/07/04,144.0,147.052,142.0,3531800,154.0,141.0
1188,2019/07/05,144.0,147.149,149.0,1363800,150.0,144.0
1189,2019/07/08,143.0,141.91,145.0,827800,146.0,140.0
1190,2019/07/09,144.0,144.423,142.0,831700,148.0,141.0
1191,2019/07/10,148.0,145.522,146.0,657200,148.0,143.0
1192,2019/07/11,148.0,146.914,148.0,486800,148.0,145.0
1193,2019/07/12,144.0,145.612,148.0,435200,148.0,143.0
1194,2019/07/16,142.0,142.739,145.0,404400,145.0,141.0
1195,2019/07/17,142.0,141.874,141.0,403000,144.0,140.0
1196,2019/07/18,140.0,139.408,143.0,666100,143.0,137.0
1197,2019/07/19,142.0,140.83,139.0,344300,142.0,139.0
1198,2019/07/22,147.0,143.435,140.0,664200,147.0,139.0
1199,2019/07/23,147.0,146.783,146.0,633700,149.0,145.0
1200,2019/07/24,148.0,148.515,148.0,683700,150.0,147.0
1201,2019/07/25,146.0,146.012,146.0,309100,147.0,145.0
1202,2019/07/26,147.0,146.607,148.0,280700,148.0,145.0
1203,2019/07/29,146.0,145.849,146.0,225700,147.0,145.0
1204,2019/07/30,143.0,144.064,145.0,336800,146.0,143.0
1205,2019/07/31,143.0,142.807,144.0,321200,144.0,141.0
1206,2019/08/01,146.0,145.098,142.0,330700,147.0,142.0
1207,2019/08/02,144.0,142.951,145.0,453200,145.0,141.0
1208,2019/08/05,136.0,138.791,142.0,759900,143.0,135.0
1209,2019/08/06,138.0,133.459,129.0,782000,139.0,129.0
1210,2019/08/07,138.0,137.691,140.0,365000,140.0,136.0
1211,2019/08/08,140.0,138.607,138.0,289500,142.0,136.0
1212,2019/08/09,144.0,142.823,140.0,562500,145.0,140.0
1213,2019/08/13,127.0,128.002,130.0,1743800,130.0,126.0
1214,2019/08/14,126.0,126.756,130.0,762200,131.0,124.0
1215,2019/08/15,124.0,121.314,120.0,1045300,124.0,119.0
1216,2019/08/16,127.0,124.319,123.0,668500,127.0,121.0
1217,2019/08/19,125.0,125.566,127.0,256700,128.0,124.0
1218,2019/08/20,127.0,126.086,125.0,469900,128.0,124.0
1219,2019/08/21,126.0,125.332,126.0,209500,127.0,124.0
1220,2019/08/22,121.0,122.879,125.0,614700,126.0,121.0
1221,2019/08/23,119.0,120.55,121.0,412900,122.0,119.0
