,Date,Close,VWAP,Open,Volume,High,Low
0,2014/08/25,750.0,749.498,749.0,2105500,752.0,746.0
1,2014/08/26,743.0,744.736,747.0,1619500,750.0,742.0
2,2014/08/27,742.0,743.297,749.0,2288500,750.0,740.0
3,2014/08/28,736.0,736.665,740.0,2117500,741.0,735.0
4,2014/08/29,746.0,741.817,738.0,3472500,748.0,735.0
5,2014/09/01,745.0,746.726,749.0,1855000,750.0,744.0
6,2014/09/02,751.0,751.187,748.0,2696500,758.0,744.0
7,2014/09/03,745.0,749.264,754.0,2911500,756.0,744.0
8,2014/09/04,744.0,744.793,742.0,2487000,749.0,740.0
9,2014/09/05,750.0,752.225,755.0,3259000,755.0,750.0
10,2014/09/08,751.0,748.487,748.0,1841000,752.0,744.0
11,2014/09/09,747.0,749.536,752.0,2702000,753.0,747.0
12,2014/09/10,753.0,749.79,744.0,3478500,755.0,742.0
13,2014/09/11,757.0,753.699,753.0,4173500,757.0,748.0
14,2014/09/12,758.0,753.866,753.0,11539000,758.0,751.0
15,2014/09/16,761.0,757.714,752.0,3029500,763.0,752.0
16,2014/09/17,764.0,765.28,766.0,2541000,769.0,763.0
17,2014/09/18,771.0,772.222,770.0,4390500,777.0,767.0
18,2014/09/19,790.0,787.068,780.0,6352500,792.0,777.0
19,2014/09/22,788.0,789.153,783.0,3355500,794.0,783.0
20,2014/09/24,785.0,783.014,783.0,2448500,789.0,777.0
21,2014/09/25,787.0,787.327,787.0,3191000,791.0,784.0
22,2014/09/26,782.0,778.835,768.0,2960000,783.0,767.0
23,2014/09/29,788.0,786.204,783.0,2909000,790.0,778.0
24,2014/09/30,790.0,784.02,780.0,4840500,790.0,774.0
25,2014/10/01,807.0,807.058,796.0,8660500,814.0,796.0
26,2014/10/02,797.0,799.675,802.0,6196000,810.0,796.0
27,2014/10/03,797.0,791.91,788.0,5496500,798.0,785.0
28,2014/10/06,797.0,800.147,800.0,3210500,805.0,797.0
29,2014/10/07,789.0,789.59,793.0,4384000,796.0,785.0
30,2014/10/08,788.0,787.315,779.0,4152000,792.0,778.0
31,2014/10/09,783.0,784.126,792.0,4640000,793.0,778.0
32,2014/10/10,770.0,766.766,767.0,8078000,773.0,759.0
33,2014/10/14,757.0,760.413,756.0,6552500,771.0,752.0
34,2014/10/15,758.0,756.716,759.0,4224500,762.0,752.0
35,2014/10/16,741.0,741.155,738.0,5238500,747.0,737.0
36,2014/10/17,732.0,734.589,742.0,6697000,743.0,729.0
37,2014/10/20,751.0,747.674,746.0,6361500,753.0,740.0
38,2014/10/21,756.0,755.716,759.0,8118000,764.0,748.0
39,2014/10/22,773.0,768.534,764.0,4547500,776.0,760.0
40,2014/10/23,769.0,767.315,765.0,3423500,771.0,763.0
41,2014/10/24,775.0,773.745,774.0,3711000,777.0,769.0
42,2014/10/27,787.0,785.804,783.0,3959500,790.0,780.0
43,2014/10/28,792.0,788.706,780.0,2801500,793.0,780.0
44,2014/10/29,804.0,801.373,791.0,4985000,808.0,791.0
45,2014/10/30,809.0,810.496,809.0,8581500,816.0,807.0
46,2014/10/31,853.0,844.927,812.0,13578500,875.0,811.0
47,2014/11/04,869.0,876.93,884.0,9060000,885.0,869.0
48,2014/11/05,874.0,871.514,866.0,7135000,878.0,865.0
49,2014/11/06,872.0,879.205,880.0,6515000,891.0,868.0
50,2014/11/07,871.0,872.466,876.0,5071500,879.0,867.0
51,2014/11/10,864.0,864.022,869.0,3951500,872.0,859.0
52,2014/11/11,869.0,865.997,865.0,5995000,872.0,861.0
53,2014/11/12,886.0,889.492,880.0,8062000,899.0,876.0
54,2014/11/13,880.0,877.156,882.0,4976500,884.0,870.0
55,2014/11/14,886.0,883.98,887.0,9012000,888.0,877.0
56,2014/11/17,861.0,867.759,885.0,5709500,886.0,855.0
57,2014/11/18,887.0,882.769,873.0,3770500,888.0,872.0
58,2014/11/19,876.0,880.691,885.0,3826500,891.0,875.0
59,2014/11/20,888.0,887.455,887.0,2826500,890.0,884.0
60,2014/11/21,896.0,889.431,890.0,4826000,898.0,876.0
61,2014/11/25,903.0,903.083,900.0,3527500,908.0,899.0
62,2014/11/26,906.0,904.442,903.0,4161000,909.0,899.0
63,2014/11/27,893.0,894.569,897.0,3443500,900.0,891.0
64,2014/11/28,906.0,904.11,900.0,2564500,907.0,899.0
65,2014/12/01,915.0,912.961,902.0,2175000,919.0,902.0
66,2014/12/02,913.0,911.104,905.0,3085000,915.0,904.0
67,2014/12/03,896.0,903.197,919.0,5283500,920.0,894.0
68,2014/12/04,895.0,897.704,908.0,2621500,909.0,893.0
69,2014/12/05,883.0,880.424,885.0,4658500,886.0,874.0
70,2014/12/08,872.0,873.127,883.0,4127000,886.0,868.0
71,2014/12/09,876.0,872.924,873.0,2843500,876.0,870.0
72,2014/12/10,865.0,863.049,862.0,4219500,871.0,854.0
73,2014/12/11,856.0,853.018,858.0,2444500,861.0,846.0
74,2014/12/12,861.0,863.796,864.0,11198000,870.0,857.0
75,2014/12/15,843.0,845.702,843.0,4137500,855.0,841.0
76,2014/12/16,829.0,831.769,832.0,5452500,838.0,827.0
77,2014/12/17,833.0,833.417,822.0,6153000,841.0,822.0
78,2014/12/18,861.0,860.056,852.0,5517500,868.0,850.0
79,2014/12/19,884.0,881.713,880.0,4373500,886.0,872.0
80,2014/12/22,885.0,883.8,888.0,3892000,889.0,879.0
81,2014/12/24,902.0,898.494,892.0,3900000,903.0,892.0
82,2014/12/25,906.0,900.823,896.0,2355000,906.0,896.0
83,2014/12/26,918.0,914.521,905.0,3497500,920.0,901.0
84,2014/12/29,910.0,910.179,926.0,4030500,927.0,895.0
85,2014/12/30,903.0,909.831,918.0,4353500,925.0,901.0
86,2015/01/05,906.0,901.569,890.0,3441000,911.0,885.0
87,2015/01/06,875.0,879.968,884.0,5408000,889.0,873.0
88,2015/01/07,860.0,864.747,865.0,4381000,878.0,858.0
89,2015/01/08,870.0,870.932,863.0,4353500,879.0,862.0
90,2015/01/09,866.0,868.337,871.0,4912500,876.0,861.0
91,2015/01/13,869.0,860.991,853.0,3477500,869.0,850.0
92,2015/01/14,852.0,853.201,856.0,5804000,866.0,844.0
93,2015/01/15,868.0,863.07,854.0,3417000,872.0,854.0
94,2015/01/16,859.0,849.472,850.0,5542500,866.0,836.0
95,2015/01/19,866.0,864.291,866.0,2441500,869.0,859.0
96,2015/01/20,898.0,890.408,872.0,3631500,899.0,869.0
97,2015/01/21,874.0,877.175,885.0,4444500,887.0,869.0
98,2015/01/22,867.0,865.499,874.0,3253500,877.0,859.0
99,2015/01/23,880.0,878.472,878.0,3244000,884.0,867.0
100,2015/01/26,878.0,873.08,869.0,1347500,879.0,867.0
101,2015/01/27,890.0,888.533,885.0,1936500,892.0,883.0
102,2015/01/28,897.0,895.689,882.0,2865500,902.0,881.0
103,2015/01/29,886.0,891.778,884.0,2211500,904.0,884.0
104,2015/01/30,903.0,904.148,897.0,3356000,909.0,896.0
105,2015/02/02,880.0,878.732,875.0,4358000,897.0,870.0
106,2015/02/03,895.0,890.532,884.0,3778500,900.0,882.0
107,2015/02/04,947.0,937.135,927.0,6223500,949.0,917.0
108,2015/02/05,925.0,925.745,938.0,4604000,938.0,915.0
109,2015/02/06,935.0,933.731,936.0,2863500,938.0,926.0
110,2015/02/09,934.0,938.866,945.0,2836000,949.0,932.0
111,2015/02/10,922.0,922.115,924.0,4175000,934.0,916.0
112,2015/02/12,942.0,943.969,945.0,3762500,950.0,938.0
113,2015/02/13,936.0,934.158,933.0,3892000,941.0,928.0
114,2015/02/16,936.0,939.931,938.0,2734500,947.0,934.0
115,2015/02/17,935.0,937.741,936.0,2436000,947.0,933.0
116,2015/02/18,945.0,940.614,936.0,3647000,945.0,930.0
117,2015/02/19,936.0,943.741,942.0,3364500,955.0,934.0
118,2015/02/20,932.0,935.807,945.0,2928500,947.0,928.0
119,2015/02/23,934.0,935.33,942.0,1990500,943.0,931.0
120,2015/02/24,955.0,948.512,933.0,3165500,955.0,932.0
121,2015/02/25,974.0,978.646,985.0,4670500,988.0,972.0
122,2015/02/26,984.0,980.755,976.0,3197000,985.0,973.0
123,2015/02/27,987.0,985.064,986.0,3739000,993.0,980.0
124,2015/03/02,990.0,990.625,988.0,3318000,997.0,981.0
125,2015/03/03,990.0,991.744,996.0,2305500,999.0,986.0
126,2015/03/04,984.0,982.1,983.0,2053000,986.0,976.0
127,2015/03/05,982.0,979.91,977.0,1902500,984.0,976.0
128,2015/03/06,989.0,988.012,987.0,2156000,991.0,984.0
129,2015/03/09,977.0,978.274,981.0,3166500,986.0,970.0
130,2015/03/10,971.0,975.576,976.0,4087000,990.0,965.0
131,2015/03/11,984.0,985.899,971.0,3580500,996.0,966.0
132,2015/03/12,1016.0,1006.716,989.0,4057000,1016.0,986.0
133,2015/03/13,1022.0,1027.246,1030.0,10892000,1030.0,1014.0
134,2015/03/16,1030.0,1032.164,1022.0,4810000,1046.0,1020.0
135,2015/03/17,1048.0,1048.082,1050.0,4762000,1054.0,1038.0
136,2015/03/18,1052.0,1050.103,1054.0,3007000,1056.0,1042.0
137,2015/03/19,1050.0,1047.549,1052.0,4148500,1054.0,1038.0
138,2015/03/20,1066.0,1061.131,1060.0,3562000,1068.0,1054.0
139,2015/03/23,1060.0,1061.502,1068.0,2520000,1068.0,1054.0
140,2015/03/24,1056.0,1057.835,1062.0,2874500,1064.0,1050.0
141,2015/03/25,1048.0,1038.556,1054.0,3944000,1056.0,1020.0
142,2015/03/26,1048.0,1044.137,1048.0,4769000,1052.0,1034.0
143,2015/03/27,1032.0,1033.764,1040.0,4807500,1052.0,1020.0
144,2015/03/30,1042.0,1041.963,1032.0,2943000,1050.0,1028.0
145,2015/03/31,1046.0,1048.709,1058.0,6650000,1058.0,1038.0
146,2015/04/01,1020.0,1025.106,1044.0,6266000,1050.0,1016.0
147,2015/04/02,1022.0,1023.175,1020.0,5067500,1032.0,1016.0
148,2015/04/03,1034.0,1030.143,1022.0,2223000,1036.0,1022.0
149,2015/04/06,1044.0,1042.337,1026.0,2722000,1052.0,1026.0
150,2015/04/07,1068.0,1062.67,1060.0,4425500,1068.0,1050.0
151,2015/04/08,1096.0,1093.2,1072.0,5728000,1106.0,1072.0
152,2015/04/09,1104.0,1101.25,1102.0,3238000,1108.0,1096.0
153,2015/04/10,1096.0,1099.981,1106.0,6119000,1108.0,1090.0
154,2015/04/13,1092.0,1096.058,1110.0,2780000,1112.0,1090.0
155,2015/04/14,1094.0,1094.568,1086.0,2382500,1100.0,1086.0
156,2015/04/15,1088.0,1086.096,1086.0,2956500,1090.0,1076.0
157,2015/04/16,1090.0,1086.889,1092.0,5048500,1100.0,1074.0
158,2015/04/17,1090.0,1093.094,1092.0,4015000,1104.0,1084.0
159,2015/04/20,1100.0,1096.056,1090.0,3823500,1100.0,1082.0
160,2015/04/21,1102.0,1104.679,1110.0,3000500,1112.0,1100.0
161,2015/04/22,1124.0,1119.498,1110.0,3735500,1126.0,1104.0
162,2015/04/23,1108.0,1107.908,1116.0,6142000,1124.0,1100.0
163,2015/04/24,1108.0,1111.209,1102.0,6190500,1122.0,1100.0
164,2015/04/27,1110.0,1112.452,1120.0,2923500,1120.0,1108.0
165,2015/04/28,1108.0,1108.948,1120.0,3683500,1120.0,1104.0
166,2015/04/30,1076.0,1082.294,1100.0,5429000,1102.0,1070.0
167,2015/05/01,1072.0,1067.033,1070.0,3719500,1076.0,1058.0
168,2015/05/07,1058.0,1064.983,1060.0,4685000,1078.0,1058.0
169,2015/05/08,1066.0,1059.961,1054.0,4042000,1074.0,1048.0
170,2015/05/11,1054.0,1054.915,1066.0,6385500,1070.0,1040.0
171,2015/05/12,1040.0,1043.181,1056.0,5916500,1056.0,1038.0
172,2015/05/13,1052.0,1051.846,1048.0,5949000,1058.0,1040.0
173,2015/05/14,1028.0,1033.03,1044.0,5785000,1046.0,1024.0
174,2015/05/15,1056.0,1047.263,1028.0,6435000,1058.0,1028.0
175,2015/05/18,1064.0,1064.782,1064.0,4447500,1070.0,1060.0
176,2015/05/19,1064.0,1061.784,1066.0,3709000,1070.0,1056.0
177,2015/05/20,1076.0,1079.831,1072.0,4813500,1090.0,1070.0
178,2015/05/21,1076.0,1079.723,1078.0,3378000,1088.0,1072.0
179,2015/05/22,1084.0,1082.508,1086.0,3012500,1088.0,1076.0
180,2015/05/25,1096.0,1090.459,1088.0,2861500,1096.0,1084.0
181,2015/05/26,1098.0,1094.58,1098.0,4014500,1100.0,1086.0
182,2015/05/27,1100.0,1098.498,1098.0,3166000,1102.0,1092.0
183,2015/05/28,1100.0,1100.7,1102.0,3726000,1106.0,1094.0
184,2015/05/29,1106.0,1104.778,1100.0,4028000,1110.0,1098.0
185,2015/06/01,1104.0,1106.173,1106.0,3107000,1112.0,1100.0
186,2015/06/02,1108.0,1106.913,1108.0,2652500,1114.0,1100.0
187,2015/06/03,1094.0,1094.805,1100.0,4296500,1102.0,1090.0
188,2015/06/04,1100.0,1097.761,1100.0,3035000,1106.0,1090.0
189,2015/06/05,1100.0,1097.07,1094.0,1997500,1102.0,1090.0
190,2015/06/08,1102.0,1106.053,1104.0,2548000,1114.0,1100.0
191,2015/06/09,1074.0,1081.766,1096.0,3250500,1096.0,1072.0
192,2015/06/10,1064.0,1065.464,1070.0,4122500,1074.0,1054.0
193,2015/06/11,1088.0,1084.022,1078.0,2825000,1088.0,1076.0
194,2015/06/12,1092.0,1095.622,1100.0,7435000,1100.0,1082.0
195,2015/06/15,1088.0,1084.442,1090.0,2515500,1090.0,1074.0
196,2015/06/16,1074.0,1076.114,1084.0,2676500,1084.0,1070.0
197,2015/06/17,1064.0,1062.175,1072.0,3346000,1078.0,1054.0
198,2015/06/18,1048.0,1049.507,1056.0,3601500,1056.0,1042.0
199,2015/06/19,1050.0,1052.687,1060.0,5166000,1064.0,1050.0
200,2015/06/22,1058.0,1056.359,1056.0,2931000,1064.0,1050.0
201,2015/06/23,1082.0,1076.102,1068.0,3615000,1082.0,1064.0
202,2015/06/24,1082.0,1081.173,1090.0,2959000,1090.0,1076.0
203,2015/06/25,1088.0,1086.409,1088.0,2919500,1090.0,1080.0
204,2015/06/26,1100.0,1099.199,1092.0,4203500,1106.0,1086.0
205,2015/06/29,1060.0,1068.002,1082.0,5011500,1082.0,1058.0
206,2015/06/30,1070.0,1063.887,1068.0,3544500,1070.0,1056.0
207,2015/07/01,1064.0,1064.292,1074.0,2467500,1074.0,1056.0
208,2015/07/02,1064.0,1066.687,1070.0,2521500,1074.0,1058.0
209,2015/07/03,1068.0,1066.644,1062.0,2744000,1074.0,1056.0
210,2015/07/06,1040.0,1041.39,1048.0,5137000,1058.0,1034.0
211,2015/07/07,1060.0,1057.956,1050.0,2485500,1062.0,1048.0
212,2015/07/08,1030.0,1036.218,1048.0,4055500,1050.0,1030.0
213,2015/07/09,1032.0,1015.342,1016.0,6513000,1034.0,989.0
214,2015/07/10,1044.0,1041.727,1030.0,5895000,1058.0,1024.0
215,2015/07/13,1084.0,1077.116,1050.0,4539500,1090.0,1050.0
216,2015/07/14,1080.0,1080.958,1088.0,3382500,1090.0,1072.0
217,2015/07/15,1088.0,1087.629,1086.0,2209000,1092.0,1080.0
218,2015/07/16,1110.0,1104.392,1096.0,4559000,1112.0,1088.0
219,2015/07/17,1114.0,1115.103,1112.0,3828500,1122.0,1104.0
220,2015/07/21,1140.0,1133.188,1122.0,4176500,1140.0,1120.0
221,2015/07/22,1128.0,1129.624,1128.0,3427500,1138.0,1124.0
222,2015/07/23,1132.0,1135.355,1134.0,3109000,1140.0,1130.0
223,2015/07/24,1132.0,1133.139,1130.0,2102000,1142.0,1126.0
224,2015/07/27,1132.0,1131.513,1130.0,2505000,1140.0,1122.0
225,2015/07/28,1140.0,1134.642,1132.0,4058500,1146.0,1120.0
226,2015/07/29,1180.0,1174.082,1156.0,6457000,1192.0,1152.0
227,2015/07/30,1198.0,1192.365,1190.0,7096500,1204.0,1174.0
228,2015/07/31,1186.0,1194.844,1220.0,5982500,1222.0,1178.0
229,2015/08/03,1184.0,1182.028,1178.0,3743000,1190.0,1168.0
230,2015/08/04,1178.0,1179.604,1174.0,3466000,1188.0,1174.0
231,2015/08/05,1182.0,1180.825,1176.0,3223000,1190.0,1168.0
232,2015/08/06,1190.0,1189.01,1192.0,3504000,1194.0,1182.0
233,2015/08/07,1192.0,1187.027,1194.0,3098000,1196.0,1178.0
234,2015/08/10,1196.0,1193.298,1184.0,2920500,1200.0,1180.0
235,2015/08/11,1194.0,1197.946,1198.0,3437500,1210.0,1186.0
236,2015/08/12,1174.0,1174.377,1186.0,4151000,1194.0,1160.0
237,2015/08/13,1188.0,1185.459,1188.0,3237000,1192.0,1174.0
238,2015/08/14,1184.0,1185.225,1188.0,2524000,1190.0,1178.0
239,2015/08/17,1188.0,1189.01,1190.0,1755000,1196.0,1182.0
240,2015/08/18,1186.0,1188.393,1186.0,1546500,1194.0,1182.0
241,2015/08/19,1172.0,1179.162,1184.0,2448000,1190.0,1170.0
242,2015/08/20,1174.0,1180.327,1188.0,2150500,1188.0,1172.0
243,2015/08/21,1138.0,1145.416,1154.0,4304500,1160.0,1138.0
244,2015/08/24,1110.0,1121.849,1128.0,7737000,1148.0,1106.0
245,2015/08/25,1056.0,1080.436,1066.0,7915000,1118.0,1052.0
246,2015/08/26,1106.0,1078.917,1052.0,6334500,1110.0,1052.0
247,2015/08/27,1124.0,1126.401,1118.0,3872000,1140.0,1116.0
248,2015/08/28,1154.0,1147.672,1148.0,3442500,1156.0,1138.0
249,2015/08/31,1168.0,1160.476,1174.0,4374500,1176.0,1144.0
250,2015/09/01,1124.0,1139.505,1156.0,3474500,1164.0,1124.0
251,2015/09/02,1108.0,1122.365,1106.0,4127500,1142.0,1100.0
252,2015/09/03,1120.0,1124.013,1122.0,4028500,1138.0,1110.0
253,2015/09/04,1126.0,1131.561,1140.0,5139500,1146.0,1114.0
254,2015/09/07,1118.0,1115.879,1120.0,3556500,1128.0,1100.0
255,2015/09/08,1066.0,1079.482,1130.0,5031000,1130.0,1060.0
256,2015/09/09,1136.0,1117.457,1106.0,5740500,1136.0,1092.0
257,2015/09/10,1108.0,1100.44,1096.0,3842000,1114.0,1082.0
258,2015/09/11,1122.0,1108.389,1104.0,10729500,1132.0,1102.0
259,2015/09/14,1162.0,1169.171,1156.0,7236500,1188.0,1148.0
260,2015/09/15,1174.0,1173.996,1176.0,5100000,1182.0,1162.0
261,2015/09/16,1212.0,1209.725,1190.0,7902500,1224.0,1184.0
262,2015/09/17,1214.0,1211.208,1214.0,4692000,1226.0,1198.0
263,2015/09/18,1204.0,1208.879,1210.0,4850500,1218.0,1202.0
264,2015/09/24,1192.0,1203.016,1184.0,3868000,1222.0,1182.0
265,2015/09/25,1218.0,1207.542,1206.0,4651000,1218.0,1196.0
266,2015/09/28,1226.0,1227.569,1222.0,4869000,1250.0,1214.0
267,2015/09/29,1170.0,1185.723,1206.0,6896000,1210.0,1166.0
268,2015/09/30,1202.0,1197.414,1208.0,4699000,1208.0,1182.0
269,2015/10/01,1200.0,1201.31,1216.0,5572000,1216.0,1188.0
270,2015/10/02,1168.0,1167.976,1170.0,5063000,1184.0,1160.0
271,2015/10/05,1226.0,1210.125,1190.0,7074500,1232.0,1182.0
272,2015/10/06,1236.0,1240.584,1250.0,5531000,1256.0,1228.0
273,2015/10/07,1226.0,1224.092,1248.0,5042500,1248.0,1208.0
274,2015/10/08,1178.0,1187.81,1216.0,7386500,1218.0,1168.0
275,2015/10/09,1154.0,1164.405,1180.0,12270500,1190.0,1150.0
276,2015/10/13,1160.0,1160.264,1142.0,5932500,1170.0,1140.0
277,2015/10/14,1158.0,1155.827,1156.0,4409000,1166.0,1148.0
278,2015/10/15,1174.0,1168.118,1146.0,3423500,1178.0,1142.0
279,2015/10/16,1162.0,1170.66,1186.0,4660000,1188.0,1154.0
280,2015/10/19,1178.0,1178.895,1166.0,4211000,1188.0,1162.0
281,2015/10/20,1198.0,1197.162,1196.0,4124000,1204.0,1188.0
282,2015/10/21,1214.0,1208.969,1202.0,4926000,1220.0,1196.0
283,2015/10/22,1220.0,1222.085,1220.0,3761500,1232.0,1212.0
284,2015/10/23,1216.0,1219.406,1230.0,5627000,1230.0,1212.0
285,2015/10/26,1218.0,1220.663,1224.0,3601000,1226.0,1206.0
286,2015/10/27,1228.0,1223.538,1222.0,4322500,1232.0,1212.0
287,2015/10/28,1260.0,1251.686,1236.0,7577500,1262.0,1234.0
288,2015/10/29,1254.0,1251.91,1250.0,3155500,1264.0,1240.0
289,2015/10/30,1210.0,1198.624,1174.0,9756000,1218.0,1160.0
290,2015/11/02,1186.0,1191.409,1212.0,4610500,1216.0,1182.0
291,2015/11/04,1164.0,1168.83,1198.0,6770000,1200.0,1160.0
292,2015/11/05,1164.0,1164.431,1162.0,4078000,1174.0,1152.0
293,2015/11/06,1176.0,1170.836,1166.0,3410500,1178.0,1158.0
294,2015/11/09,1180.0,1181.184,1180.0,4173000,1190.0,1168.0
295,2015/11/10,1174.0,1172.735,1172.0,3702000,1180.0,1164.0
296,2015/11/11,1192.0,1188.123,1180.0,3013000,1196.0,1176.0
297,2015/11/12,1202.0,1200.172,1188.0,3742000,1206.0,1186.0
298,2015/11/13,1210.0,1206.372,1204.0,5903500,1220.0,1192.0
299,2015/11/16,1192.0,1190.48,1190.0,2905000,1198.0,1180.0
300,2015/11/17,1206.0,1205.145,1200.0,4361000,1212.0,1190.0
301,2015/11/18,1214.0,1216.826,1216.0,3418500,1222.0,1212.0
302,2015/11/19,1234.0,1232.58,1226.0,4954000,1240.0,1218.0
303,2015/11/20,1234.0,1226.997,1234.0,3256500,1238.0,1218.0
304,2015/11/24,1230.0,1229.865,1224.0,2931500,1238.0,1218.0
305,2015/11/25,1214.0,1216.003,1228.0,3099500,1228.0,1208.0
306,2015/11/26,1214.0,1217.937,1226.0,2300500,1228.0,1214.0
307,2015/11/27,1206.0,1207.794,1214.0,3250000,1218.0,1200.0
308,2015/11/30,1200.0,1198.952,1204.0,3399000,1208.0,1190.0
309,2015/12/01,1212.0,1207.965,1200.0,3236500,1218.0,1192.0
310,2015/12/02,1220.0,1214.417,1206.0,2168000,1222.0,1202.0
311,2015/12/03,1220.0,1217.033,1210.0,2933500,1224.0,1210.0
312,2015/12/04,1200.0,1204.008,1206.0,3321500,1216.0,1194.0
313,2015/12/07,1210.0,1213.513,1220.0,2240500,1222.0,1208.0
314,2015/12/08,1212.0,1212.407,1206.0,3822500,1222.0,1204.0
315,2015/12/09,1208.0,1213.245,1214.0,5446500,1226.0,1206.0
316,2015/12/10,1210.0,1207.726,1202.0,3671500,1214.0,1196.0
317,2015/12/11,1212.0,1210.789,1208.0,8635500,1224.0,1206.0
318,2015/12/14,1180.0,1184.81,1198.0,5235000,1206.0,1174.0
319,2015/12/15,1168.0,1178.392,1182.0,4354500,1192.0,1168.0
320,2015/12/16,1192.0,1184.184,1184.0,4165500,1192.0,1168.0
321,2015/12/17,1212.0,1210.654,1216.0,5501000,1218.0,1206.0
322,2015/12/18,1192.0,1212.492,1210.0,7951000,1252.0,1190.0
323,2015/12/21,1174.0,1167.193,1184.0,5003000,1188.0,1152.0
324,2015/12/22,1174.0,1173.485,1180.0,2533500,1188.0,1166.0
325,2015/12/24,1160.0,1169.202,1190.0,2577000,1190.0,1158.0
326,2015/12/25,1154.0,1154.781,1160.0,2113500,1160.0,1150.0
327,2015/12/28,1162.0,1159.263,1160.0,1615500,1166.0,1152.0
328,2015/12/29,1170.0,1166.721,1166.0,1806000,1172.0,1156.0
329,2015/12/30,1176.0,1172.55,1178.0,1908000,1178.0,1166.0
330,2016/01/04,1146.0,1151.971,1160.0,4254000,1174.0,1142.0
331,2016/01/05,1154.0,1153.416,1146.0,3219000,1164.0,1140.0
332,2016/01/06,1138.0,1142.463,1148.0,3997500,1158.0,1134.0
333,2016/01/07,1132.0,1136.529,1140.0,3611000,1150.0,1128.0
334,2016/01/08,1142.0,1136.961,1112.0,9022500,1158.0,1110.0
335,2016/01/12,1114.0,1118.919,1124.0,5383000,1138.0,1110.0
336,2016/01/13,1150.0,1142.759,1130.0,4494000,1152.0,1122.0
337,2016/01/14,1126.0,1117.881,1126.0,5532000,1128.0,1100.0
338,2016/01/15,1132.0,1139.171,1144.0,5324000,1154.0,1128.0
339,2016/01/18,1120.0,1112.501,1116.0,4060500,1126.0,1094.0
340,2016/01/19,1124.0,1119.233,1118.0,3739500,1130.0,1108.0
341,2016/01/20,1084.0,1096.776,1128.0,4975500,1128.0,1082.0
342,2016/01/21,1056.0,1079.975,1088.0,5922000,1104.0,1052.0
343,2016/01/22,1110.0,1093.549,1090.0,5027000,1114.0,1072.0
344,2016/01/25,1116.0,1114.382,1120.0,3578500,1126.0,1100.0
345,2016/01/26,1102.0,1101.694,1100.0,4385000,1112.0,1092.0
346,2016/01/27,1128.0,1121.48,1112.0,4007500,1132.0,1106.0
347,2016/01/28,1128.0,1125.848,1116.0,3470500,1134.0,1108.0
348,2016/01/29,1150.0,1137.342,1132.0,7746500,1160.0,1106.0
349,2016/02/01,1172.0,1168.784,1150.0,5744500,1180.0,1146.0
350,2016/02/02,1190.0,1186.266,1152.0,4600500,1200.0,1152.0
351,2016/02/03,1252.0,1242.312,1246.0,10172000,1254.0,1228.0
352,2016/02/04,1246.0,1249.01,1242.0,5768000,1258.0,1240.0
353,2016/02/05,1232.0,1227.008,1228.0,4466500,1240.0,1212.0
354,2016/02/08,1244.0,1234.615,1222.0,5092500,1248.0,1212.0
355,2016/02/09,1166.0,1176.754,1200.0,7643500,1204.0,1162.0
356,2016/02/10,1136.0,1132.603,1170.0,9744500,1172.0,1114.0
357,2016/02/12,1094.0,1098.031,1108.0,8943000,1118.0,1070.0
358,2016/02/15,1170.0,1155.856,1114.0,5982500,1184.0,1114.0
359,2016/02/16,1142.0,1149.331,1150.0,5158500,1164.0,1138.0
360,2016/02/17,1116.0,1115.968,1128.0,6189500,1144.0,1096.0
361,2016/02/18,1124.0,1128.732,1136.0,5010500,1142.0,1118.0
362,2016/02/19,1106.0,1101.562,1114.0,4809000,1116.0,1088.0
363,2016/02/22,1124.0,1122.135,1094.0,5668500,1132.0,1092.0
364,2016/02/23,1114.0,1118.34,1138.0,4127000,1146.0,1106.0
365,2016/02/24,1116.0,1119.261,1106.0,2854000,1132.0,1106.0
366,2016/02/25,1130.0,1129.0,1128.0,5339000,1138.0,1122.0
367,2016/02/26,1142.0,1149.722,1144.0,4645000,1162.0,1140.0
368,2016/02/29,1130.0,1136.65,1142.0,4939000,1152.0,1128.0
369,2016/03/01,1126.0,1123.137,1124.0,4307000,1138.0,1114.0
370,2016/03/02,1136.0,1138.378,1154.0,4924500,1154.0,1130.0
371,2016/03/03,1134.0,1131.062,1132.0,3773500,1146.0,1124.0
372,2016/03/04,1124.0,1118.42,1126.0,3614000,1130.0,1108.0
373,2016/03/07,1110.0,1109.74,1122.0,4408500,1122.0,1102.0
374,2016/03/08,1106.0,1089.467,1096.0,8740000,1110.0,1066.0
375,2016/03/09,1098.0,1101.977,1102.0,5354000,1112.0,1092.0
376,2016/03/10,1110.0,1112.508,1114.0,3077000,1120.0,1104.0
377,2016/03/11,1098.0,1092.092,1090.0,10520500,1104.0,1084.0
378,2016/03/14,1108.0,1108.724,1114.0,3434000,1116.0,1096.0
379,2016/03/15,1102.0,1104.596,1112.0,3546000,1114.0,1096.0
380,2016/03/16,1112.0,1110.678,1098.0,4127000,1118.0,1096.0
381,2016/03/17,1104.0,1114.396,1118.0,3672000,1128.0,1102.0
382,2016/03/18,1084.0,1088.217,1106.0,3444500,1108.0,1082.0
383,2016/03/22,1108.0,1105.839,1094.0,3042500,1114.0,1092.0
384,2016/03/23,1108.0,1107.824,1110.0,2221000,1112.0,1098.0
385,2016/03/24,1134.0,1129.687,1108.0,5215000,1142.0,1104.0
386,2016/03/25,1128.0,1132.33,1138.0,2495500,1144.0,1126.0
387,2016/03/28,1132.0,1133.729,1140.0,2560500,1142.0,1126.0
388,2016/03/29,1148.0,1142.599,1132.0,4039500,1152.0,1128.0
389,2016/03/30,1148.0,1156.046,1154.0,3505000,1168.0,1146.0
390,2016/03/31,1130.0,1138.786,1160.0,3698500,1160.0,1130.0
391,2016/04/01,1108.0,1118.42,1130.0,4699000,1136.0,1104.0
392,2016/04/04,1106.0,1110.644,1106.0,4434500,1126.0,1102.0
393,2016/04/05,1078.0,1087.351,1114.0,3963000,1116.0,1074.0
394,2016/04/06,1068.0,1062.419,1074.0,3987000,1078.0,1048.0
395,2016/04/07,1064.0,1062.505,1072.0,3785000,1082.0,1050.0
396,2016/04/08,1072.0,1066.71,1058.0,4704500,1084.0,1054.0
397,2016/04/11,1072.0,1069.562,1074.0,3107000,1078.0,1060.0
398,2016/04/12,1074.0,1075.316,1076.0,2856000,1084.0,1068.0
399,2016/04/13,1100.0,1094.748,1086.0,3290500,1104.0,1084.0
400,2016/04/14,1124.0,1118.693,1112.0,4230500,1126.0,1106.0
401,2016/04/15,1128.0,1123.755,1122.0,2875500,1130.0,1114.0
402,2016/04/18,1102.0,1105.951,1108.0,3354000,1116.0,1100.0
403,2016/04/19,1130.0,1128.009,1126.0,3539000,1134.0,1120.0
404,2016/04/20,1138.0,1138.161,1140.0,3699000,1144.0,1130.0
405,2016/04/21,1170.0,1167.182,1162.0,4905000,1176.0,1152.0
406,2016/04/22,1178.0,1168.835,1168.0,6653500,1178.0,1152.0
407,2016/04/25,1168.0,1167.584,1172.0,3640000,1174.0,1160.0
408,2016/04/26,1186.0,1180.985,1172.0,4529000,1190.0,1166.0
409,2016/04/27,1182.0,1179.062,1182.0,5182000,1190.0,1170.0
410,2016/04/28,1148.0,1168.58,1194.0,7081500,1210.0,1142.0
411,2016/05/02,1122.0,1120.598,1112.0,3986000,1128.0,1112.0
412,2016/05/06,1114.0,1112.098,1116.0,4688000,1126.0,1104.0
413,2016/05/09,1132.0,1134.876,1132.0,2761500,1146.0,1130.0
414,2016/05/10,1150.0,1147.061,1126.0,4942500,1160.0,1126.0
415,2016/05/11,1110.0,1116.727,1112.0,5413500,1134.0,1110.0
416,2016/05/12,1108.0,1103.477,1106.0,3340000,1112.0,1094.0
417,2016/05/13,1112.0,1115.197,1122.0,4807000,1124.0,1104.0
418,2016/05/16,1106.0,1109.214,1118.0,2469500,1120.0,1100.0
419,2016/05/17,1112.0,1110.816,1112.0,3373000,1116.0,1106.0
420,2016/05/18,1110.0,1108.581,1114.0,4172500,1118.0,1100.0
421,2016/05/19,1114.0,1110.909,1112.0,4144500,1118.0,1104.0
422,2016/05/20,1140.0,1136.447,1118.0,4200500,1146.0,1116.0
423,2016/05/23,1130.0,1128.941,1134.0,2783000,1136.0,1120.0
424,2016/05/24,1132.0,1131.164,1130.0,3114000,1138.0,1124.0
425,2016/05/25,1114.0,1118.617,1132.0,4251000,1138.0,1108.0
426,2016/05/26,1092.0,1098.315,1120.0,5093000,1124.0,1092.0
427,2016/05/27,1104.0,1103.955,1108.0,2218000,1110.0,1100.0
428,2016/05/30,1118.0,1115.627,1122.0,1974500,1124.0,1110.0
429,2016/05/31,1144.0,1143.677,1128.0,13117000,1156.0,1122.0
430,2016/06/01,1128.0,1132.714,1140.0,3850000,1154.0,1122.0
431,2016/06/02,1110.0,1109.352,1114.0,2923500,1122.0,1102.0
432,2016/06/03,1106.0,1107.499,1110.0,2068500,1114.0,1102.0
433,2016/06/06,1094.0,1093.981,1082.0,2564000,1104.0,1082.0
434,2016/06/07,1094.0,1094.611,1094.0,2849500,1100.0,1088.0
435,2016/06/08,1096.0,1093.674,1094.0,3458000,1104.0,1084.0
436,2016/06/09,1074.0,1077.841,1084.0,3835000,1090.0,1070.0
437,2016/06/10,1054.0,1042.635,1040.0,10171500,1054.0,1034.0
438,2016/06/13,1020.0,1026.485,1036.0,3925500,1042.0,1020.0
439,2016/06/14,1008.0,1009.682,1024.0,4013500,1028.0,1004.0
440,2016/06/15,1008.0,1008.112,1000.0,3191000,1016.0,997.0
441,2016/06/16,981.0,990.415,1004.0,3892000,1010.0,980.0
442,2016/06/17,990.0,992.233,990.0,4916000,1002.0,986.0
443,2016/06/20,1008.0,1007.923,1000.0,4328500,1016.0,1000.0
444,2016/06/21,1010.0,1004.292,1000.0,2585500,1016.0,991.0
445,2016/06/22,1006.0,1002.73,1004.0,2495500,1012.0,991.0
446,2016/06/23,1004.0,1005.393,1016.0,1637000,1018.0,1000.0
447,2016/06/24,919.0,939.278,1008.0,7411000,1012.0,915.0
448,2016/06/27,957.0,944.203,924.0,5263000,958.0,922.0
449,2016/06/28,957.0,950.64,940.0,3928000,967.0,925.0
450,2016/06/29,967.0,966.916,969.0,3867500,976.0,957.0
451,2016/06/30,966.0,970.361,966.0,5582000,981.0,963.0
452,2016/07/01,982.0,980.275,976.0,2810000,987.0,971.0
453,2016/07/04,983.0,980.94,977.0,1886500,986.0,973.0
454,2016/07/05,990.0,988.682,978.0,2874000,994.0,978.0
455,2016/07/06,977.0,975.124,976.0,4341000,983.0,966.0
456,2016/07/07,963.0,966.888,968.0,3294500,975.0,962.0
457,2016/07/08,945.0,953.881,960.0,6962500,972.0,945.0
458,2016/07/11,982.0,981.068,970.0,3103500,989.0,961.0
459,2016/07/12,1018.0,1017.267,1000.0,4346000,1024.0,999.0
460,2016/07/13,1026.0,1026.45,1034.0,4056500,1038.0,1020.0
461,2016/07/14,1032.0,1030.969,1020.0,3091500,1038.0,1016.0
462,2016/07/15,1016.0,1020.068,1034.0,4068000,1036.0,1010.0
463,2016/07/19,1052.0,1045.264,1032.0,3628000,1056.0,1024.0
464,2016/07/20,1062.0,1055.475,1044.0,4210500,1062.0,1042.0
465,2016/07/21,1060.0,1063.253,1070.0,3526500,1074.0,1056.0
466,2016/07/22,1056.0,1052.62,1056.0,2758500,1058.0,1046.0
467,2016/07/25,1040.0,1045.98,1052.0,2191000,1058.0,1040.0
468,2016/07/26,1038.0,1035.973,1030.0,2967000,1044.0,1028.0
469,2016/07/27,1038.0,1042.466,1046.0,3825500,1058.0,1036.0
470,2016/07/28,1020.0,1015.225,1022.0,2981000,1024.0,1006.0
471,2016/07/29,1022.0,1015.268,1002.0,6349000,1030.0,1000.0
472,2016/08/01,1034.0,1025.718,1010.0,3263000,1034.0,1004.0
473,2016/08/02,1028.0,1027.249,1016.0,1812500,1034.0,1016.0
474,2016/08/03,994.0,1000.382,990.0,4374500,1008.0,990.0
475,2016/08/04,1012.0,1003.811,998.0,3972500,1012.0,986.0
476,2016/08/05,1064.0,1066.005,1070.0,5628000,1076.0,1052.0
477,2016/08/08,1038.0,1043.013,1064.0,3553500,1066.0,1034.0
478,2016/08/09,1046.0,1042.637,1036.0,2758000,1048.0,1026.0
479,2016/08/10,1048.0,1041.047,1030.0,2660500,1050.0,1030.0
480,2016/08/12,1060.0,1058.612,1062.0,3580000,1064.0,1050.0
481,2016/08/15,1068.0,1064.552,1056.0,1924500,1070.0,1052.0
482,2016/08/16,1054.0,1056.256,1070.0,3057000,1070.0,1050.0
483,2016/08/17,1076.0,1072.505,1062.0,3739000,1082.0,1054.0
484,2016/08/18,1066.0,1068.346,1086.0,3774000,1086.0,1060.0
485,2016/08/19,1062.0,1068.164,1076.0,3034500,1078.0,1058.0
486,2016/08/22,1054.0,1052.439,1056.0,2711000,1056.0,1042.0
487,2016/08/23,1054.0,1054.916,1050.0,2919000,1064.0,1048.0
488,2016/08/24,1074.0,1073.397,1050.0,3087000,1080.0,1050.0
489,2016/08/25,1070.0,1073.389,1078.0,4762500,1084.0,1066.0
490,2016/08/26,1048.0,1045.926,1058.0,5398000,1058.0,1028.0
491,2016/08/29,1070.0,1069.58,1068.0,3301000,1078.0,1064.0
492,2016/08/30,1070.0,1068.115,1068.0,2401500,1072.0,1060.0
493,2016/08/31,1078.0,1074.709,1072.0,2619500,1082.0,1062.0
494,2016/09/01,1070.0,1068.568,1080.0,3247000,1080.0,1064.0
495,2016/09/02,1080.0,1077.398,1074.0,3046500,1080.0,1070.0
496,2016/09/05,1080.0,1083.758,1094.0,1746500,1096.0,1076.0
497,2016/09/06,1078.0,1077.465,1074.0,2934500,1084.0,1070.0
498,2016/09/07,1072.0,1069.269,1070.0,3430000,1076.0,1060.0
499,2016/09/08,1088.0,1086.741,1084.0,3505000,1096.0,1074.0
500,2016/09/09,1070.0,1081.996,1088.0,5617000,1088.0,1064.0
501,2016/09/12,1056.0,1057.924,1066.0,2057000,1068.0,1050.0
502,2016/09/13,1064.0,1063.024,1056.0,2055000,1068.0,1054.0
503,2016/09/14,1052.0,1054.003,1060.0,2348000,1062.0,1048.0
504,2016/09/15,1036.0,1038.082,1044.0,2774000,1046.0,1034.0
505,2016/09/16,1036.0,1034.851,1038.0,2549500,1042.0,1030.0
506,2016/09/20,1042.0,1038.666,1030.0,2946500,1046.0,1028.0
507,2016/09/21,1036.0,1034.991,1028.0,4601500,1044.0,1024.0
508,2016/09/23,1022.0,1021.616,1012.0,4419500,1032.0,1012.0
509,2016/09/26,1010.0,1015.085,1018.0,3589500,1026.0,1010.0
510,2016/09/27,1018.0,1013.518,1002.0,3117500,1022.0,1000.0
511,2016/09/28,1008.0,1008.813,1000.0,3979000,1020.0,1000.0
512,2016/09/29,1026.0,1025.023,1014.0,2945500,1032.0,1014.0
513,2016/09/30,1006.0,1007.361,1014.0,3661500,1014.0,1002.0
514,2016/10/03,1014.0,1014.418,1010.0,2202500,1020.0,1010.0
515,2016/10/04,1022.0,1020.513,1018.0,1841000,1026.0,1014.0
516,2016/10/05,1016.0,1019.332,1022.0,2744000,1026.0,1012.0
517,2016/10/06,1032.0,1030.668,1030.0,2966500,1036.0,1022.0
518,2016/10/07,1012.0,1014.819,1024.0,2786000,1026.0,1012.0
519,2016/10/11,1024.0,1023.445,1012.0,2489000,1028.0,1010.0
520,2016/10/12,1020.0,1021.534,1012.0,2171000,1030.0,1012.0
521,2016/10/13,1030.0,1032.002,1032.0,2842500,1044.0,1024.0
522,2016/10/14,1030.0,1028.7,1026.0,4940000,1040.0,1024.0
523,2016/10/17,1034.0,1032.901,1034.0,2226000,1038.0,1026.0
524,2016/10/18,1040.0,1036.951,1028.0,2580000,1042.0,1026.0
525,2016/10/19,1056.0,1052.735,1044.0,2638000,1058.0,1040.0
526,2016/10/20,1076.0,1067.552,1050.0,3510000,1076.0,1050.0
527,2016/10/21,1072.0,1069.75,1078.0,3094000,1078.0,1064.0
528,2016/10/24,1076.0,1072.976,1078.0,2663500,1078.0,1064.0
529,2016/10/25,1088.0,1085.611,1084.0,2950000,1090.0,1078.0
530,2016/10/26,1084.0,1081.529,1084.0,2247000,1086.0,1074.0
531,2016/10/27,1080.0,1080.352,1078.0,2398000,1086.0,1076.0
532,2016/10/28,1078.0,1076.911,1088.0,3249000,1088.0,1068.0
533,2016/10/31,1084.0,1079.147,1070.0,2767500,1084.0,1068.0
534,2016/11/01,1086.0,1081.247,1074.0,2098000,1086.0,1072.0
535,2016/11/02,1076.0,1079.679,1088.0,3308000,1094.0,1070.0
536,2016/11/04,1074.0,1070.002,1068.0,2935500,1078.0,1056.0
537,2016/11/07,1122.0,1119.662,1110.0,6915500,1136.0,1096.0
538,2016/11/08,1106.0,1104.856,1122.0,3686000,1122.0,1094.0
539,2016/11/09,1044.0,1066.305,1116.0,6055000,1120.0,1040.0
540,2016/11/10,1100.0,1096.086,1098.0,4551000,1104.0,1084.0
541,2016/11/11,1094.0,1101.176,1120.0,6009500,1120.0,1084.0
542,2016/11/14,1108.0,1109.195,1104.0,3161000,1118.0,1100.0
543,2016/11/15,1102.0,1104.552,1114.0,3213500,1118.0,1096.0
544,2016/11/16,1110.0,1110.922,1108.0,3590000,1118.0,1104.0
545,2016/11/17,1106.0,1103.484,1104.0,3086500,1112.0,1096.0
546,2016/11/18,1092.0,1096.065,1104.0,5074500,1106.0,1092.0
547,2016/11/21,1112.0,1110.384,1098.0,3382000,1116.0,1098.0
548,2016/11/22,1122.0,1117.113,1118.0,3021000,1124.0,1104.0
549,2016/11/24,1136.0,1137.976,1134.0,3431000,1144.0,1128.0
550,2016/11/25,1130.0,1127.457,1130.0,3711500,1132.0,1120.0
551,2016/11/28,1128.0,1131.893,1130.0,2618000,1140.0,1124.0
552,2016/11/29,1134.0,1133.85,1126.0,4125000,1140.0,1120.0
553,2016/11/30,1138.0,1136.625,1130.0,3543500,1142.0,1130.0
554,2016/12/01,1132.0,1139.565,1146.0,3888500,1152.0,1132.0
555,2016/12/02,1118.0,1116.42,1124.0,3784500,1128.0,1110.0
556,2016/12/05,1096.0,1098.771,1130.0,4623500,1132.0,1088.0
557,2016/12/06,1096.0,1098.303,1100.0,3737000,1104.0,1094.0
558,2016/12/07,1098.0,1100.305,1104.0,2359000,1110.0,1094.0
559,2016/12/08,1096.0,1087.292,1078.0,5397000,1096.0,1058.0
560,2016/12/09,1110.0,1108.333,1110.0,9895000,1116.0,1090.0
561,2016/12/12,1134.0,1129.958,1120.0,4797000,1138.0,1118.0
562,2016/12/13,1156.0,1149.992,1138.0,4398500,1158.0,1136.0
563,2016/12/14,1170.0,1168.593,1160.0,4271500,1174.0,1158.0
564,2016/12/15,1164.0,1168.324,1178.0,3325000,1182.0,1160.0
565,2016/12/16,1166.0,1169.116,1176.0,3961000,1176.0,1164.0
566,2016/12/19,1166.0,1164.652,1158.0,2436500,1172.0,1156.0
567,2016/12/20,1184.0,1177.971,1166.0,3744000,1190.0,1162.0
568,2016/12/21,1174.0,1178.345,1188.0,3620500,1188.0,1172.0
569,2016/12/22,1174.0,1175.006,1180.0,3268000,1182.0,1168.0
570,2016/12/26,1162.0,1165.061,1166.0,2769500,1172.0,1162.0
571,2016/12/27,1160.0,1162.024,1156.0,2884000,1168.0,1154.0
572,2016/12/28,1152.0,1152.24,1148.0,2422000,1156.0,1146.0
573,2016/12/29,1138.0,1138.94,1140.0,2693500,1150.0,1132.0
574,2016/12/30,1130.0,1131.078,1122.0,2684000,1138.0,1122.0
575,2017/01/04,1146.0,1144.436,1140.0,3566500,1150.0,1136.0
576,2017/01/05,1146.0,1145.497,1136.0,3221000,1152.0,1136.0
577,2017/01/06,1152.0,1149.666,1146.0,2428000,1156.0,1142.0
578,2017/01/10,1140.0,1146.442,1142.0,3422000,1158.0,1140.0
579,2017/01/11,1140.0,1142.709,1140.0,2793500,1150.0,1138.0
580,2017/01/12,1142.0,1142.551,1142.0,3228000,1148.0,1136.0
581,2017/01/13,1158.0,1156.004,1156.0,4413500,1160.0,1150.0
582,2017/01/16,1146.0,1148.977,1150.0,2847500,1160.0,1142.0
583,2017/01/17,1128.0,1132.272,1152.0,3402000,1152.0,1126.0
584,2017/01/18,1120.0,1119.531,1128.0,2817500,1132.0,1112.0
585,2017/01/19,1124.0,1125.895,1122.0,3191500,1134.0,1120.0
586,2017/01/20,1122.0,1125.077,1130.0,2971500,1132.0,1120.0
587,2017/01/23,1112.0,1115.307,1118.0,4662000,1126.0,1108.0
588,2017/01/24,1110.0,1115.396,1114.0,3835500,1124.0,1110.0
589,2017/01/25,1122.0,1122.329,1122.0,2421500,1128.0,1118.0
590,2017/01/26,1142.0,1136.432,1128.0,4288500,1144.0,1122.0
591,2017/01/27,1148.0,1146.917,1144.0,3381500,1152.0,1142.0
592,2017/01/30,1150.0,1147.83,1144.0,3042000,1152.0,1138.0
593,2017/01/31,1140.0,1138.959,1138.0,4329000,1148.0,1128.0
594,2017/02/01,1124.0,1125.74,1136.0,3441500,1138.0,1120.0
595,2017/02/02,1122.0,1129.547,1130.0,4500500,1142.0,1120.0
596,2017/02/03,1134.0,1137.322,1134.0,3055500,1146.0,1132.0
597,2017/02/06,1160.0,1152.528,1148.0,3412500,1160.0,1140.0
598,2017/02/07,1154.0,1149.357,1152.0,3937000,1156.0,1136.0
599,2017/02/08,1094.0,1103.499,1118.0,7174500,1120.0,1094.0
600,2017/02/09,1056.0,1064.639,1074.0,6949500,1076.0,1056.0
601,2017/02/10,1078.0,1079.851,1082.0,5323000,1086.0,1074.0
602,2017/02/13,1094.0,1092.85,1092.0,3614000,1096.0,1084.0
603,2017/02/14,1080.0,1086.344,1092.0,3661000,1096.0,1078.0
604,2017/02/15,1088.0,1089.71,1090.0,2067000,1094.0,1084.0
605,2017/02/16,1090.0,1089.785,1096.0,2861000,1096.0,1086.0
606,2017/02/17,1082.0,1082.351,1080.0,2569500,1088.0,1076.0
607,2017/02/20,1072.0,1073.398,1076.0,2641500,1080.0,1068.0
608,2017/02/21,1072.0,1071.547,1074.0,3358500,1076.0,1066.0
609,2017/02/22,1082.0,1079.06,1078.0,3350000,1084.0,1070.0
610,2017/02/23,1074.0,1072.837,1078.0,4271000,1082.0,1070.0
611,2017/02/24,1066.0,1067.559,1068.0,3282500,1072.0,1064.0
612,2017/02/27,1060.0,1060.209,1064.0,4627500,1070.0,1052.0
613,2017/02/28,1060.0,1065.524,1068.0,4647000,1074.0,1058.0
614,2017/03/01,1070.0,1065.195,1060.0,4264000,1072.0,1054.0
615,2017/03/02,1086.0,1089.327,1090.0,5379500,1096.0,1080.0
616,2017/03/03,1074.0,1077.816,1086.0,3855500,1088.0,1070.0
617,2017/03/06,1078.0,1078.209,1074.0,2300500,1084.0,1070.0
618,2017/03/07,1084.0,1083.075,1078.0,3466500,1086.0,1076.0
619,2017/03/08,1082.0,1084.503,1076.0,3490500,1092.0,1074.0
620,2017/03/09,1096.0,1094.32,1092.0,3711000,1102.0,1084.0
621,2017/03/10,1076.0,1079.7,1084.0,8565500,1086.0,1072.0
622,2017/03/13,1086.0,1086.197,1078.0,3420500,1092.0,1076.0
623,2017/03/14,1084.0,1085.356,1086.0,1675000,1088.0,1082.0
624,2017/03/15,1084.0,1082.764,1082.0,1737500,1086.0,1074.0
625,2017/03/16,1074.0,1074.763,1074.0,4246500,1080.0,1070.0
626,2017/03/17,1070.0,1072.063,1072.0,3234000,1078.0,1070.0
627,2017/03/21,1066.0,1066.453,1062.0,2594500,1074.0,1058.0
628,2017/03/22,1048.0,1052.303,1054.0,4095500,1060.0,1046.0
629,2017/03/23,1050.0,1052.757,1052.0,2774000,1058.0,1050.0
630,2017/03/24,1066.0,1064.33,1048.0,3889500,1070.0,1048.0
631,2017/03/27,1050.0,1051.248,1056.0,3623000,1062.0,1048.0
632,2017/03/28,1066.0,1063.485,1056.0,3753000,1070.0,1054.0
633,2017/03/29,1066.0,1067.245,1060.0,3367500,1072.0,1058.0
634,2017/03/30,1060.0,1059.896,1058.0,3667000,1070.0,1056.0
635,2017/03/31,1056.0,1064.949,1068.0,4008500,1080.0,1056.0
636,2017/04/03,1074.0,1072.307,1062.0,4211500,1084.0,1054.0
637,2017/04/04,1038.0,1047.82,1066.0,6073000,1070.0,1036.0
638,2017/04/05,1038.0,1039.363,1038.0,3071500,1048.0,1034.0
639,2017/04/06,1022.0,1024.124,1032.0,4069000,1038.0,1018.0
640,2017/04/07,1024.0,1024.193,1032.0,4533000,1038.0,1016.0
641,2017/04/10,1028.0,1030.926,1034.0,2292500,1040.0,1024.0
642,2017/04/11,1026.0,1023.264,1020.0,2511500,1028.0,1018.0
643,2017/04/12,1026.0,1023.014,1020.0,4344000,1028.0,1018.0
644,2017/04/13,1024.0,1020.314,1022.0,2893500,1026.0,1012.0
645,2017/04/14,1010.0,1025.805,1042.0,5250000,1042.0,1006.0
646,2017/04/17,1016.0,1013.738,1006.0,2520500,1020.0,1006.0
647,2017/04/18,1024.0,1021.016,1022.0,2201500,1028.0,1016.0
648,2017/04/19,1020.0,1017.988,1014.0,4920000,1024.0,1010.0
649,2017/04/20,1006.0,1008.543,1012.0,3528000,1018.0,1004.0
650,2017/04/21,1014.0,1011.676,1012.0,4030000,1016.0,1006.0
651,2017/04/24,1016.0,1017.666,1028.0,3804500,1028.0,1012.0
652,2017/04/25,1034.0,1030.046,1018.0,3936000,1040.0,1014.0
653,2017/04/26,1038.0,1036.564,1030.0,2991000,1040.0,1030.0
654,2017/04/27,1040.0,1040.085,1036.0,2408500,1044.0,1034.0
655,2017/04/28,1034.0,1035.085,1044.0,2739500,1044.0,1030.0
656,2017/05/01,1094.0,1095.004,1094.0,7607500,1106.0,1086.0
657,2017/05/02,1094.0,1092.153,1092.0,3442500,1096.0,1086.0
658,2017/05/08,1122.0,1114.907,1106.0,5401000,1122.0,1102.0
659,2017/05/09,1118.0,1117.28,1122.0,3709000,1122.0,1112.0
660,2017/05/10,1124.0,1124.398,1126.0,3475500,1128.0,1120.0
661,2017/05/11,1156.0,1158.695,1142.0,6079500,1170.0,1142.0
662,2017/05/12,1166.0,1163.043,1162.0,7418500,1170.0,1148.0
663,2017/05/15,1170.0,1167.03,1164.0,2768500,1174.0,1156.0
664,2017/05/16,1172.0,1176.026,1178.0,3895500,1184.0,1172.0
665,2017/05/17,1186.0,1181.561,1168.0,6208000,1190.0,1166.0
666,2017/05/18,1184.0,1182.004,1168.0,4393500,1186.0,1168.0
667,2017/05/19,1178.0,1176.714,1184.0,4814500,1188.0,1164.0
668,2017/05/22,1174.0,1175.055,1178.0,2438500,1182.0,1170.0
669,2017/05/23,1180.0,1184.222,1180.0,2773500,1192.0,1180.0
670,2017/05/24,1194.0,1197.418,1198.0,4812000,1206.0,1192.0
671,2017/05/25,1212.0,1210.263,1204.0,4556000,1216.0,1200.0
672,2017/05/26,1222.0,1216.115,1210.0,6622500,1222.0,1202.0
673,2017/05/29,1212.0,1211.652,1216.0,2682500,1216.0,1206.0
674,2017/05/30,1202.0,1203.524,1210.0,2491000,1214.0,1198.0
675,2017/05/31,1194.0,1194.767,1192.0,3299500,1198.0,1190.0
676,2017/06/01,1216.0,1211.865,1200.0,3566500,1218.0,1198.0
677,2017/06/02,1214.0,1216.851,1218.0,5530000,1224.0,1212.0
678,2017/06/05,1226.0,1223.27,1210.0,2950500,1232.0,1206.0
679,2017/06/06,1222.0,1221.859,1226.0,3405500,1230.0,1212.0
680,2017/06/07,1220.0,1216.734,1212.0,3409000,1224.0,1210.0
681,2017/06/08,1216.0,1220.013,1222.0,3289500,1226.0,1216.0
682,2017/06/09,1208.0,1211.047,1214.0,6679000,1218.0,1202.0
683,2017/06/12,1208.0,1199.938,1194.0,2889500,1210.0,1186.0
684,2017/06/13,1206.0,1207.728,1202.0,2831000,1212.0,1202.0
685,2017/06/14,1212.0,1214.848,1208.0,1892000,1222.0,1208.0
686,2017/06/15,1218.0,1217.675,1208.0,3040000,1222.0,1208.0
687,2017/06/16,1232.0,1232.372,1226.0,4406000,1238.0,1226.0
688,2017/06/19,1250.0,1246.216,1240.0,3731000,1250.0,1240.0
689,2017/06/20,1248.0,1253.637,1256.0,3846500,1266.0,1248.0
690,2017/06/21,1258.0,1257.874,1256.0,2591000,1262.0,1254.0
691,2017/06/22,1272.0,1272.668,1262.0,3944500,1278.0,1262.0
692,2017/06/23,1268.0,1274.43,1280.0,2972500,1282.0,1268.0
693,2017/06/26,1278.0,1276.578,1268.0,2500500,1280.0,1266.0
694,2017/06/27,1276.0,1276.668,1284.0,3117000,1288.0,1270.0
695,2017/06/28,1290.0,1286.883,1290.0,3956400,1296.0,1271.0
696,2017/06/29,1268.0,1275.117,1292.0,5624800,1298.0,1266.0
697,2017/06/30,1250.0,1252.751,1260.0,4680000,1263.0,1246.0
698,2017/07/03,1255.0,1254.419,1243.0,2608500,1259.0,1241.0
699,2017/07/04,1243.0,1245.938,1258.0,3304300,1261.0,1239.0
700,2017/07/05,1235.0,1228.603,1237.0,2970900,1237.0,1219.0
701,2017/07/06,1230.0,1228.637,1224.0,2560700,1235.0,1222.0
702,2017/07/07,1226.0,1223.938,1231.0,3151800,1232.0,1215.0
703,2017/07/10,1239.0,1239.216,1230.0,2665500,1245.0,1230.0
704,2017/07/11,1244.0,1240.63,1226.0,3316600,1250.0,1224.0
705,2017/07/12,1230.0,1231.974,1238.0,2600700,1244.0,1226.0
706,2017/07/13,1245.0,1243.176,1236.0,2466100,1248.0,1236.0
707,2017/07/14,1241.0,1244.159,1248.0,2902900,1248.0,1239.0
708,2017/07/18,1240.0,1242.275,1255.0,2508500,1255.0,1236.0
709,2017/07/19,1251.0,1249.134,1241.0,2001500,1253.0,1240.0
710,2017/07/20,1262.0,1258.198,1261.0,2385700,1263.0,1248.0
711,2017/07/21,1247.0,1250.022,1252.0,2284000,1257.0,1246.0
712,2017/07/24,1243.0,1241.411,1244.0,2196100,1244.0,1233.0
713,2017/07/25,1237.0,1237.532,1240.0,2550900,1241.0,1235.0
714,2017/07/26,1224.0,1227.643,1237.0,2720100,1240.0,1222.0
715,2017/07/27,1226.0,1225.313,1220.0,2168900,1232.0,1217.0
716,2017/07/28,1209.0,1211.5,1215.0,2302100,1219.0,1208.0
717,2017/07/31,1203.0,1203.536,1201.0,2918500,1207.0,1200.0
718,2017/08/01,1200.0,1203.116,1198.0,2123600,1210.0,1195.0
719,2017/08/02,1205.0,1204.164,1198.0,2344600,1213.0,1194.0
720,2017/08/03,1200.0,1203.037,1205.0,2342300,1216.0,1199.0
721,2017/08/04,1228.0,1225.821,1230.0,3141600,1232.0,1218.0
722,2017/08/07,1210.0,1215.837,1230.0,1905700,1230.0,1208.0
723,2017/08/08,1206.0,1205.623,1205.0,1594900,1210.0,1203.0
724,2017/08/09,1192.0,1193.865,1210.0,2609600,1211.0,1188.0
725,2017/08/10,1197.0,1196.627,1198.0,2330900,1202.0,1190.0
726,2017/08/14,1188.0,1187.614,1190.0,2408000,1194.0,1182.0
727,2017/08/15,1217.0,1212.362,1197.0,2633700,1220.0,1195.0
728,2017/08/16,1216.0,1219.748,1217.0,1809600,1228.0,1215.0
729,2017/08/17,1210.0,1210.624,1212.0,1737100,1217.0,1207.0
730,2017/08/18,1200.0,1199.879,1195.0,2672800,1205.0,1193.0
731,2017/08/21,1193.0,1194.202,1204.0,1430700,1207.0,1190.0
732,2017/08/22,1190.0,1193.564,1198.0,1393600,1201.0,1188.0
733,2017/08/23,1180.0,1182.991,1189.0,2095700,1192.0,1178.0
734,2017/08/24,1174.0,1179.391,1192.0,2792100,1192.0,1172.0
735,2017/08/25,1167.0,1167.037,1166.0,1930700,1172.0,1163.0
736,2017/08/28,1174.0,1175.153,1170.0,1774500,1180.0,1169.0
737,2017/08/29,1166.0,1163.898,1163.0,2150800,1169.0,1156.0
738,2017/08/30,1174.0,1173.415,1167.0,1713400,1178.0,1165.0
739,2017/08/31,1188.0,1188.359,1177.0,2425800,1194.0,1177.0
740,2017/09/01,1180.0,1184.767,1201.0,2092400,1202.0,1176.0
741,2017/09/04,1173.0,1171.703,1172.0,2481600,1177.0,1163.0
742,2017/09/05,1163.0,1167.441,1177.0,1822700,1182.0,1162.0
743,2017/09/06,1155.0,1156.207,1160.0,3585400,1167.0,1153.0
744,2017/09/07,1150.0,1152.343,1160.0,2089000,1166.0,1145.0
745,2017/09/08,1139.0,1133.729,1130.0,6689500,1148.0,1130.0
746,2017/09/11,1165.0,1163.702,1156.0,2331700,1169.0,1152.0
747,2017/09/12,1161.0,1159.871,1166.0,3259100,1167.0,1153.0
748,2017/09/13,1179.0,1175.924,1170.0,1873900,1181.0,1165.0
749,2017/09/14,1171.0,1171.578,1181.0,2264200,1182.0,1164.0
750,2017/09/15,1183.0,1180.293,1170.0,3602900,1185.0,1169.0
751,2017/09/19,1200.0,1198.599,1197.0,3346500,1203.0,1191.0
752,2017/09/20,1184.0,1184.126,1192.0,3387800,1197.0,1179.0
753,2017/09/21,1186.0,1188.095,1192.0,3148900,1197.0,1182.0
754,2017/09/22,1190.0,1191.468,1198.0,2986100,1198.0,1187.0
755,2017/09/25,1203.0,1202.169,1200.0,2036600,1206.0,1198.0
756,2017/09/26,1201.0,1200.908,1200.0,2257500,1205.0,1197.0
757,2017/09/27,1194.0,1192.069,1195.0,1984600,1198.0,1186.0
758,2017/09/28,1204.0,1201.206,1184.0,3830300,1210.0,1184.0
759,2017/09/29,1204.0,1201.952,1198.0,4144800,1207.0,1187.0
760,2017/10/02,1201.0,1201.951,1202.0,1889200,1208.0,1198.0
761,2017/10/03,1212.0,1207.943,1197.0,3114300,1213.0,1193.0
762,2017/10/04,1200.0,1203.824,1208.0,1948300,1211.0,1200.0
763,2017/10/05,1204.0,1203.585,1200.0,1553900,1207.0,1199.0
764,2017/10/06,1206.0,1206.214,1214.0,2530200,1215.0,1201.0
765,2017/10/10,1223.0,1218.649,1203.0,2758000,1225.0,1199.0
766,2017/10/11,1233.0,1231.388,1221.0,2003700,1237.0,1217.0
767,2017/10/12,1226.0,1229.971,1231.0,2598400,1240.0,1225.0
768,2017/10/13,1230.0,1219.048,1211.0,5655000,1235.0,1211.0
769,2017/10/16,1250.0,1249.37,1236.0,2925500,1257.0,1233.0
770,2017/10/17,1267.0,1262.619,1260.0,3556600,1270.0,1251.0
771,2017/10/18,1285.0,1283.275,1272.0,4253700,1292.0,1268.0
772,2017/10/19,1287.0,1288.417,1286.0,2224000,1295.0,1279.0
773,2017/10/20,1281.0,1281.333,1289.0,2812100,1289.0,1276.0
774,2017/10/23,1290.0,1291.885,1298.0,3358400,1298.0,1288.0
775,2017/10/24,1293.0,1290.982,1288.0,2193300,1294.0,1287.0
776,2017/10/25,1279.0,1282.268,1293.0,2616300,1293.0,1277.0
777,2017/10/26,1279.0,1278.594,1275.0,1928500,1283.0,1273.0
778,2017/10/27,1315.0,1304.901,1289.0,4085400,1315.0,1282.0
779,2017/10/30,1316.0,1317.968,1330.0,3376800,1332.0,1312.0
780,2017/10/31,1317.0,1314.034,1315.0,2685200,1317.0,1303.0
781,2017/11/01,1355.0,1344.709,1325.0,3986000,1357.0,1322.0
782,2017/11/02,1361.0,1357.265,1360.0,3347700,1363.0,1344.0
783,2017/11/06,1349.0,1350.705,1357.0,2940200,1357.0,1345.0
784,2017/11/07,1358.0,1353.245,1330.0,4089100,1363.0,1328.0
785,2017/11/08,1317.0,1320.112,1300.0,5670800,1340.0,1300.0
786,2017/11/09,1322.0,1332.078,1321.0,6006400,1362.0,1301.0
787,2017/11/10,1307.0,1302.116,1295.0,6011800,1322.0,1294.0
788,2017/11/13,1282.0,1289.266,1298.0,3748200,1303.0,1282.0
789,2017/11/14,1277.0,1283.167,1282.0,3629300,1294.0,1277.0
790,2017/11/15,1254.0,1262.357,1270.0,5038400,1279.0,1254.0
791,2017/11/16,1275.0,1270.911,1254.0,3375700,1279.0,1252.0
792,2017/11/17,1289.0,1299.899,1301.0,4477500,1322.0,1281.0
793,2017/11/20,1270.0,1273.336,1287.0,2598600,1289.0,1266.0
794,2017/11/21,1265.0,1271.663,1284.0,3069500,1286.0,1264.0
795,2017/11/22,1292.0,1290.005,1278.0,3745100,1299.0,1274.0
796,2017/11/24,1283.0,1282.419,1286.0,2015400,1290.0,1275.0
797,2017/11/27,1287.0,1288.401,1300.0,1793200,1301.0,1279.0
798,2017/11/28,1294.0,1288.605,1285.0,2739400,1295.0,1273.0
799,2017/11/29,1313.0,1310.85,1303.0,3086800,1317.0,1300.0
800,2017/11/30,1321.0,1315.807,1308.0,5324400,1327.0,1301.0
801,2017/12/01,1331.0,1330.15,1330.0,3733300,1341.0,1316.0
802,2017/12/04,1322.0,1325.023,1341.0,2725000,1341.0,1321.0
803,2017/12/05,1320.0,1317.863,1320.0,2935200,1325.0,1306.0
804,2017/12/06,1300.0,1305.803,1322.0,4608500,1326.0,1294.0
805,2017/12/07,1326.0,1321.549,1304.0,3996100,1327.0,1302.0
806,2017/12/08,1330.0,1330.771,1334.0,6780600,1334.0,1319.0
807,2017/12/11,1342.0,1337.029,1332.0,2526600,1344.0,1324.0
808,2017/12/12,1338.0,1341.028,1350.0,2526900,1350.0,1336.0
809,2017/12/13,1340.0,1338.188,1344.0,2628200,1346.0,1322.0
810,2017/12/14,1347.0,1348.252,1335.0,2293600,1359.0,1335.0
811,2017/12/15,1314.0,1318.671,1339.0,4469200,1347.0,1307.0
812,2017/12/18,1352.0,1346.452,1333.0,3156500,1357.0,1324.0
813,2017/12/19,1346.0,1345.437,1350.0,1632900,1352.0,1338.0
814,2017/12/20,1340.0,1341.36,1342.0,1858900,1348.0,1332.0
815,2017/12/21,1338.0,1337.031,1336.0,1556500,1344.0,1329.0
816,2017/12/22,1353.0,1348.442,1339.0,2211200,1353.0,1337.0
817,2017/12/25,1343.0,1342.513,1339.0,871700,1347.0,1338.0
818,2017/12/26,1354.0,1351.438,1344.0,1509100,1355.0,1342.0
819,2017/12/27,1352.0,1350.047,1349.0,1438100,1354.0,1343.0
820,2017/12/28,1338.0,1343.118,1351.0,1510100,1352.0,1335.0
821,2017/12/29,1339.0,1342.201,1342.0,1632200,1351.0,1338.0
822,2018/01/04,1403.0,1391.931,1363.0,4249800,1403.0,1362.0
823,2018/01/05,1412.0,1407.687,1405.0,3359400,1416.0,1395.0
824,2018/01/09,1410.0,1410.603,1422.0,2866900,1424.0,1403.0
825,2018/01/10,1397.0,1398.718,1403.0,2014200,1409.0,1392.0
826,2018/01/11,1394.0,1393.319,1390.0,2664500,1402.0,1382.0
827,2018/01/12,1369.0,1378.177,1391.0,4619600,1395.0,1366.0
828,2018/01/15,1377.0,1385.953,1390.0,4372200,1417.0,1375.0
829,2018/01/16,1393.0,1390.734,1379.0,1871400,1396.0,1379.0
830,2018/01/17,1392.0,1387.208,1379.0,3421600,1396.0,1373.0
831,2018/01/18,1378.0,1384.75,1402.0,5064300,1408.0,1373.0
832,2018/01/19,1367.0,1369.431,1378.0,3425900,1382.0,1362.0
833,2018/01/22,1359.0,1358.151,1364.0,1967400,1368.0,1352.0
834,2018/01/23,1375.0,1373.488,1368.0,2325300,1380.0,1365.0
835,2018/01/24,1356.0,1359.508,1366.0,2798400,1372.0,1355.0
836,2018/01/25,1332.0,1338.865,1351.0,2793800,1354.0,1332.0
837,2018/01/26,1338.0,1339.951,1345.0,3029200,1350.0,1334.0
838,2018/01/29,1324.0,1327.891,1335.0,2740100,1348.0,1320.0
839,2018/01/30,1321.0,1323.271,1320.0,3214000,1340.0,1315.0
840,2018/01/31,1283.0,1293.321,1319.0,5508400,1322.0,1282.0
841,2018/02/01,1308.0,1300.824,1293.0,3227800,1308.0,1287.0
842,2018/02/02,1302.0,1298.849,1301.0,3699000,1311.0,1288.0
843,2018/02/05,1276.0,1278.953,1285.0,3720100,1291.0,1274.0
844,2018/02/06,1211.0,1204.781,1216.0,7788900,1226.0,1175.0
845,2018/02/07,1164.0,1181.486,1171.0,10616700,1223.0,1159.0
846,2018/02/08,1176.0,1171.133,1161.0,4887100,1182.0,1159.0
847,2018/02/09,1160.0,1156.57,1153.0,7605200,1171.0,1145.0
848,2018/02/13,1126.0,1137.815,1171.0,4788500,1175.0,1122.0
849,2018/02/14,1106.0,1105.77,1112.0,4852400,1118.0,1096.0
850,2018/02/15,1118.0,1115.566,1113.0,3475400,1123.0,1107.0
851,2018/02/16,1110.0,1113.706,1112.0,5440300,1129.0,1106.0
852,2018/02/19,1116.0,1111.825,1108.0,4640200,1117.0,1099.0
853,2018/02/20,1106.0,1103.825,1108.0,4191900,1111.0,1097.0
854,2018/02/21,1113.0,1110.919,1107.0,4991000,1119.0,1100.0
855,2018/02/22,1089.0,1089.837,1102.0,4731500,1104.0,1084.0
856,2018/02/23,1091.0,1086.002,1081.0,3269500,1092.0,1076.0
857,2018/02/26,1100.0,1101.244,1105.0,2417000,1108.0,1095.0
858,2018/02/27,1125.0,1125.021,1129.0,5497300,1136.0,1113.0
859,2018/02/28,1112.0,1115.21,1119.0,4012300,1124.0,1112.0
860,2018/03/01,1100.0,1101.23,1113.0,3068400,1113.0,1094.0
861,2018/03/02,1063.0,1065.302,1074.0,5244400,1076.0,1058.0
862,2018/03/05,1056.0,1056.235,1055.0,3787400,1063.0,1051.0
863,2018/03/06,1074.0,1075.653,1069.0,2731500,1081.0,1069.0
864,2018/03/07,1084.0,1084.872,1074.0,5152900,1095.0,1072.0
865,2018/03/08,1090.0,1089.369,1095.0,4157500,1096.0,1081.0
866,2018/03/09,1098.0,1099.595,1099.0,7051900,1112.0,1091.0
867,2018/03/12,1135.0,1135.505,1140.0,3792400,1140.0,1131.0
868,2018/03/13,1132.0,1130.606,1131.0,3052600,1139.0,1124.0
869,2018/03/14,1126.0,1125.146,1128.0,4950300,1135.0,1115.0
870,2018/03/15,1125.0,1124.724,1126.0,2666700,1133.0,1117.0
871,2018/03/16,1114.0,1116.399,1123.0,4175800,1127.0,1111.0
872,2018/03/19,1113.0,1110.588,1105.0,2837300,1119.0,1099.0
873,2018/03/20,1110.0,1101.128,1098.0,4511400,1112.0,1086.0
874,2018/03/22,1120.0,1116.836,1110.0,3627200,1120.0,1108.0
875,2018/03/23,1067.0,1071.882,1090.0,7280700,1096.0,1062.0
876,2018/03/26,1072.0,1064.287,1056.0,3911900,1072.0,1052.0
877,2018/03/27,1104.0,1096.622,1075.0,4585900,1105.0,1071.0
878,2018/03/28,1092.0,1089.249,1080.0,4421800,1100.0,1078.0
879,2018/03/29,1103.0,1103.192,1113.0,3862300,1116.0,1093.0
880,2018/03/30,1132.0,1126.924,1116.0,3889800,1133.0,1109.0
881,2018/04/02,1116.0,1121.897,1132.0,2322000,1136.0,1115.0
882,2018/04/03,1102.0,1102.453,1106.0,3348600,1110.0,1096.0
883,2018/04/04,1103.0,1101.841,1100.0,3162400,1108.0,1090.0
884,2018/04/05,1122.0,1121.619,1113.0,3007200,1133.0,1106.0
885,2018/04/06,1117.0,1118.26,1117.0,3649600,1127.0,1112.0
886,2018/04/09,1146.0,1140.718,1119.0,3245500,1149.0,1117.0
887,2018/04/10,1160.0,1162.022,1178.0,4906500,1183.0,1149.0
888,2018/04/11,1118.0,1124.816,1151.0,3290600,1152.0,1117.0
889,2018/04/12,1131.0,1133.832,1120.0,3109400,1142.0,1115.0
890,2018/04/13,1133.0,1137.389,1139.0,3914200,1144.0,1131.0
891,2018/04/16,1138.0,1140.656,1140.0,2232600,1148.0,1135.0
892,2018/04/17,1142.0,1140.018,1136.0,2544000,1144.0,1127.0
893,2018/04/18,1166.0,1160.857,1145.0,2709300,1169.0,1142.0
894,2018/04/19,1174.0,1176.083,1174.0,3326200,1181.0,1171.0
895,2018/04/20,1170.0,1170.281,1174.0,3517200,1177.0,1162.0
896,2018/04/23,1158.0,1160.177,1173.0,2179000,1173.0,1157.0
897,2018/04/24,1176.0,1171.752,1166.0,2574200,1179.0,1156.0
898,2018/04/25,1160.0,1159.928,1163.0,2375700,1165.0,1154.0
899,2018/04/26,1167.0,1166.681,1157.0,2400100,1170.0,1156.0
900,2018/04/27,1179.0,1181.058,1182.0,3535400,1190.0,1176.0
901,2018/05/01,1191.0,1187.215,1170.0,3087400,1196.0,1167.0
902,2018/05/02,1197.0,1195.511,1200.0,2715900,1202.0,1189.0
903,2018/05/07,1178.0,1178.898,1197.0,2985000,1200.0,1171.0
904,2018/05/08,1215.0,1211.02,1194.0,5107900,1222.0,1188.0
905,2018/05/09,1224.0,1222.887,1217.0,4164200,1233.0,1209.0
906,2018/05/10,1241.0,1237.532,1240.0,4055800,1245.0,1223.0
907,2018/05/11,1195.0,1206.49,1224.0,7498000,1229.0,1181.0
908,2018/05/14,1181.0,1183.167,1195.0,3848800,1198.0,1175.0
909,2018/05/15,1220.0,1211.433,1193.0,4150900,1225.0,1187.0
910,2018/05/16,1199.0,1198.424,1213.0,2534100,1213.0,1192.0
911,2018/05/17,1183.0,1184.486,1187.0,4170900,1201.0,1174.0
912,2018/05/18,1170.0,1171.602,1182.0,4220600,1190.0,1167.0
913,2018/05/21,1195.0,1190.73,1175.0,2850600,1197.0,1174.0
914,2018/05/22,1199.0,1196.839,1198.0,2728400,1203.0,1189.0
915,2018/05/23,1183.0,1188.403,1205.0,3953400,1210.0,1179.0
916,2018/05/24,1226.0,1216.601,1188.0,7294200,1229.0,1186.0
917,2018/05/25,1232.0,1236.776,1240.0,5617800,1252.0,1220.0
918,2018/05/28,1241.0,1235.657,1233.0,2731300,1241.0,1224.0
919,2018/05/29,1226.0,1218.775,1226.0,3694700,1228.0,1208.0
920,2018/05/30,1210.0,1207.665,1201.0,3603700,1214.0,1200.0
921,2018/05/31,1217.0,1215.695,1211.0,9644400,1225.0,1195.0
922,2018/06/01,1220.0,1220.722,1223.0,3292100,1231.0,1211.0
923,2018/06/04,1244.0,1241.249,1234.0,2091700,1246.0,1233.0
924,2018/06/05,1266.0,1262.458,1253.0,3545600,1267.0,1251.0
925,2018/06/06,1266.0,1264.323,1264.0,2834800,1268.0,1258.0
926,2018/06/07,1276.0,1273.571,1270.0,3662600,1279.0,1262.0
927,2018/06/08,1280.0,1277.797,1276.0,5072300,1287.0,1266.0
928,2018/06/11,1278.0,1278.106,1278.0,1641100,1285.0,1269.0
929,2018/06/12,1284.0,1284.037,1285.0,2721900,1290.0,1275.0
930,2018/06/13,1284.0,1283.865,1289.0,1774900,1290.0,1277.0
931,2018/06/14,1255.0,1261.499,1273.0,3149500,1274.0,1255.0
932,2018/06/15,1287.0,1281.716,1265.0,3133900,1288.0,1265.0
933,2018/06/18,1283.0,1280.308,1279.0,1755900,1286.0,1273.0
934,2018/06/19,1244.0,1248.981,1268.0,3181600,1268.0,1239.0
935,2018/06/20,1265.0,1260.802,1249.0,3080200,1267.0,1248.0
936,2018/06/21,1281.0,1275.992,1264.0,3400900,1286.0,1259.0
937,2018/06/22,1264.0,1264.832,1271.0,2955400,1271.0,1256.0
938,2018/06/25,1266.0,1265.531,1267.0,2157900,1272.0,1258.0
939,2018/06/26,1270.0,1265.678,1255.0,3125800,1273.0,1245.0
940,2018/06/27,1273.0,1272.782,1270.0,3035500,1283.0,1265.0
941,2018/06/28,1270.0,1266.935,1262.0,2737400,1273.0,1252.0
942,2018/06/29,1276.0,1274.28,1270.0,2486900,1279.0,1264.0
943,2018/07/02,1251.0,1262.705,1275.0,2375800,1283.0,1248.0
944,2018/07/03,1241.0,1241.278,1255.0,3435500,1262.0,1226.0
945,2018/07/04,1265.0,1258.023,1230.0,2100400,1270.0,1228.0
946,2018/07/05,1262.0,1264.964,1269.0,3467900,1281.0,1250.0
947,2018/07/06,1248.0,1251.021,1266.0,3424000,1267.0,1240.0
948,2018/07/09,1261.0,1259.878,1241.0,2468000,1267.0,1236.0
949,2018/07/10,1258.0,1261.008,1252.0,2584300,1270.0,1250.0
950,2018/07/11,1243.0,1245.5,1250.0,2955500,1255.0,1234.0
951,2018/07/12,1270.0,1266.227,1242.0,4076800,1277.0,1241.0
952,2018/07/13,1293.0,1290.345,1279.0,4309000,1301.0,1274.0
953,2018/07/17,1304.0,1305.413,1304.0,3029200,1310.0,1299.0
954,2018/07/18,1280.0,1286.752,1310.0,3201900,1312.0,1278.0
955,2018/07/19,1298.0,1296.93,1287.0,3206500,1304.0,1285.0
956,2018/07/20,1284.0,1279.783,1290.0,3109600,1291.0,1268.0
957,2018/07/23,1270.0,1269.906,1272.0,2868300,1278.0,1262.0
958,2018/07/24,1280.0,1280.776,1284.0,2190500,1287.0,1274.0
959,2018/07/25,1277.0,1279.056,1290.0,1780200,1290.0,1271.0
960,2018/07/26,1276.0,1279.457,1298.0,3308500,1298.0,1271.0
961,2018/07/27,1288.0,1284.873,1281.0,2512600,1293.0,1277.0
962,2018/07/30,1269.0,1270.502,1282.0,1711600,1282.0,1266.0
963,2018/07/31,1273.0,1268.34,1260.0,2825200,1277.0,1258.0
964,2018/08/01,1284.0,1278.191,1264.0,2244100,1285.0,1263.0
965,2018/08/02,1280.0,1285.252,1285.0,2350600,1302.0,1273.0
966,2018/08/03,1276.0,1275.036,1289.0,2775900,1290.0,1266.0
967,2018/08/06,1372.0,1373.882,1387.0,7805400,1395.0,1354.0
968,2018/08/07,1400.0,1404.826,1393.0,5619700,1420.0,1390.0
969,2018/08/08,1316.0,1324.913,1351.0,7633400,1352.0,1305.0
970,2018/08/09,1327.0,1324.924,1315.0,3167200,1333.0,1307.0
971,2018/08/10,1310.0,1316.011,1330.0,3522500,1330.0,1306.0
972,2018/08/13,1291.0,1296.626,1302.0,2940100,1311.0,1291.0
973,2018/08/14,1344.0,1331.468,1317.0,3364700,1344.0,1309.0
974,2018/08/15,1341.0,1340.249,1350.0,2276900,1353.0,1330.0
975,2018/08/16,1360.0,1357.004,1336.0,3442300,1368.0,1331.0
976,2018/08/17,1357.0,1360.402,1367.0,1962500,1375.0,1356.0
977,2018/08/20,1350.0,1350.994,1357.0,1743600,1359.0,1343.0
978,2018/08/21,1366.0,1364.244,1355.0,2920500,1370.0,1348.0
979,2018/08/22,1376.0,1377.368,1391.0,2583800,1397.0,1367.0
980,2018/08/23,1393.0,1389.806,1380.0,2573300,1396.0,1377.0
981,2018/08/24,1418.0,1412.793,1398.0,2701600,1420.0,1392.0
982,2018/08/27,1422.0,1421.899,1423.0,2431600,1435.0,1414.0
983,2018/08/28,1422.0,1426.036,1435.0,2963100,1441.0,1418.0
984,2018/08/29,1425.0,1426.779,1422.0,2731200,1439.0,1415.0
985,2018/08/30,1419.0,1422.117,1440.0,3129100,1440.0,1417.0
986,2018/08/31,1428.0,1422.435,1411.0,3251500,1430.0,1404.0
987,2018/09/03,1427.0,1426.043,1426.0,1972900,1433.0,1413.0
988,2018/09/04,1424.0,1420.521,1425.0,2412000,1426.0,1412.0
989,2018/09/05,1422.0,1423.535,1424.0,2615800,1432.0,1414.0
990,2018/09/06,1411.0,1409.86,1412.0,2652600,1416.0,1402.0
991,2018/09/07,1432.0,1422.62,1408.0,3372100,1432.0,1403.0
992,2018/09/10,1446.0,1438.051,1433.0,2656700,1447.0,1421.0
993,2018/09/11,1465.0,1459.233,1450.0,3143300,1465.0,1446.0
994,2018/09/12,1506.0,1496.996,1495.0,4998900,1509.0,1480.0
995,2018/09/13,1523.0,1527.285,1507.0,4271300,1541.0,1507.0
996,2018/09/14,1501.0,1518.991,1540.0,7762200,1540.0,1486.0
997,2018/09/18,1551.0,1538.06,1515.0,4232300,1554.0,1509.0
998,2018/09/19,1559.0,1562.668,1579.0,3671700,1582.0,1552.0
999,2018/09/20,1549.0,1547.836,1559.0,3924600,1560.0,1536.0
1000,2018/09/21,1552.0,1555.329,1567.0,4933100,1567.0,1551.0
1001,2018/09/25,1577.0,1576.842,1554.0,4088300,1595.0,1554.0
1002,2018/09/26,1581.0,1577.532,1573.0,4168200,1584.0,1560.0
1003,2018/09/27,1556.0,1564.611,1573.0,3247200,1585.0,1556.0
1004,2018/09/28,1573.0,1572.248,1571.0,4691700,1584.0,1560.0
1005,2018/10/01,1588.0,1589.397,1578.0,3093900,1603.0,1578.0
1006,2018/10/02,1589.0,1591.38,1605.0,4378100,1607.0,1584.0
1007,2018/10/03,1582.0,1581.144,1584.0,2896800,1589.0,1572.0
1008,2018/10/04,1552.0,1557.92,1594.0,4242000,1597.0,1548.0
1009,2018/10/05,1543.0,1539.719,1540.0,3936500,1551.0,1519.0
1010,2018/10/09,1527.0,1533.544,1519.0,4485000,1553.0,1519.0
1011,2018/10/10,1545.0,1544.95,1538.0,3479600,1557.0,1536.0
1012,2018/10/11,1477.0,1478.356,1485.0,5033800,1494.0,1465.0
1013,2018/10/12,1502.0,1477.511,1447.0,6901600,1503.0,1447.0
1014,2018/10/15,1477.0,1478.989,1489.0,3713100,1498.0,1456.0
1015,2018/10/16,1496.0,1496.222,1500.0,4147800,1520.0,1482.0
1016,2018/10/17,1510.0,1513.233,1512.0,3755200,1531.0,1503.0
1017,2018/10/18,1527.0,1525.955,1518.0,2743500,1534.0,1517.0
1018,2018/10/19,1507.0,1503.896,1494.0,4110700,1515.0,1489.0
1019,2018/10/22,1536.0,1527.729,1501.0,3115600,1543.0,1501.0
1020,2018/10/23,1514.0,1517.281,1534.0,3830300,1535.0,1509.0
1021,2018/10/24,1511.0,1512.805,1531.0,3869100,1532.0,1493.0
1022,2018/10/25,1457.0,1461.574,1471.0,3697700,1479.0,1447.0
1023,2018/10/26,1429.0,1434.166,1460.0,4787100,1467.0,1417.0
1024,2018/10/29,1404.0,1411.83,1427.0,3625500,1434.0,1402.0
1025,2018/10/30,1434.0,1425.813,1396.0,8574000,1439.0,1392.0
1026,2018/10/31,1456.0,1448.167,1425.0,4087200,1459.0,1414.0
1027,2018/11/01,1468.0,1470.504,1462.0,3924100,1483.0,1452.0
1028,2018/11/02,1479.0,1480.492,1472.0,5678100,1505.0,1458.0
1029,2018/11/05,1356.0,1362.634,1389.0,6630400,1397.0,1341.0
1030,2018/11/06,1378.0,1372.989,1374.0,4470500,1382.0,1356.0
1031,2018/11/07,1388.0,1382.151,1384.0,4558800,1400.0,1357.0
1032,2018/11/08,1415.0,1414.205,1411.0,2726400,1428.0,1404.0
1033,2018/11/09,1396.0,1405.329,1417.0,3609700,1423.0,1392.0
1034,2018/11/12,1401.0,1397.817,1376.0,2020500,1406.0,1372.0
1035,2018/11/13,1363.0,1360.739,1355.0,3811900,1373.0,1342.0
1036,2018/11/14,1351.0,1356.114,1370.0,2363400,1375.0,1346.0
1037,2018/11/15,1370.0,1362.716,1335.0,2141200,1372.0,1334.0
1038,2018/11/16,1349.0,1358.514,1373.0,2520500,1375.0,1348.0
1039,2018/11/19,1335.0,1339.651,1341.0,1753400,1358.0,1333.0
1040,2018/11/20,1298.0,1304.073,1321.0,2942700,1324.0,1297.0
1041,2018/11/21,1270.0,1273.325,1285.0,2908300,1285.0,1266.0
1042,2018/11/22,1283.0,1283.612,1289.0,2456500,1293.0,1276.0
1043,2018/11/26,1271.0,1273.92,1290.0,3249500,1298.0,1262.0
1044,2018/11/27,1308.0,1298.332,1292.0,3925600,1309.0,1279.0
1045,2018/11/28,1337.0,1326.71,1313.0,4181300,1341.0,1301.0
1046,2018/11/29,1311.0,1327.048,1343.0,3465100,1355.0,1310.0
1047,2018/11/30,1320.0,1319.149,1308.0,3956600,1326.0,1307.0
1048,2018/12/03,1341.0,1340.694,1341.0,2682400,1348.0,1332.0
1049,2018/12/04,1315.0,1330.991,1341.0,4132600,1364.0,1315.0
1050,2018/12/05,1333.0,1326.423,1306.0,3452900,1338.0,1302.0
1051,2018/12/06,1298.0,1300.845,1325.0,3663900,1333.0,1292.0
1052,2018/12/07,1318.0,1314.616,1307.0,3062600,1322.0,1303.0
1053,2018/12/10,1292.0,1292.776,1290.0,3133800,1305.0,1284.0
1054,2018/12/11,1315.0,1315.524,1309.0,5693700,1332.0,1303.0
1055,2018/12/12,1382.0,1372.44,1338.0,7706800,1393.0,1333.0
1056,2018/12/13,1369.0,1375.533,1393.0,3344400,1398.0,1366.0
1057,2018/12/14,1322.0,1341.261,1350.0,7333300,1371.0,1320.0
1058,2018/12/17,1336.0,1334.223,1316.0,3085300,1342.0,1315.0
1059,2018/12/18,1290.0,1298.585,1332.0,3564300,1337.0,1289.0
1060,2018/12/19,1273.0,1276.939,1272.0,3381300,1297.0,1265.0
1061,2018/12/20,1211.0,1220.332,1251.0,4351200,1257.0,1203.0
1062,2018/12/21,1209.0,1208.332,1216.0,4060500,1218.0,1197.0
1063,2018/12/25,1148.0,1151.611,1157.0,3819900,1168.0,1144.0
1064,2018/12/26,1173.0,1168.402,1158.0,4295000,1183.0,1146.0
1065,2018/12/27,1200.0,1200.807,1203.0,4365000,1215.0,1193.0
1066,2018/12/28,1205.0,1202.51,1194.0,3242300,1210.0,1187.0
1067,2019/01/04,1205.0,1198.13,1183.0,3252500,1206.0,1171.0
1068,2019/01/07,1219.0,1223.724,1237.0,4069700,1245.0,1216.0
1069,2019/01/08,1252.0,1252.705,1264.0,4386500,1265.0,1238.0
1070,2019/01/09,1270.0,1269.263,1260.0,3052300,1281.0,1246.0
1071,2019/01/10,1237.0,1240.32,1262.0,2975300,1265.0,1232.0
1072,2019/01/11,1246.0,1241.986,1240.0,4006600,1253.0,1234.0
1073,2019/01/15,1287.0,1275.98,1244.0,3291400,1288.0,1242.0
1074,2019/01/16,1278.0,1279.618,1299.0,2424700,1299.0,1272.0
1075,2019/01/17,1271.0,1275.925,1275.0,2285100,1288.0,1270.0
1076,2019/01/18,1297.0,1297.206,1289.0,2520300,1307.0,1283.0
1077,2019/01/21,1275.0,1284.853,1314.0,2255100,1314.0,1271.0
1078,2019/01/22,1271.0,1271.812,1284.0,3046400,1285.0,1261.0
1079,2019/01/23,1282.0,1279.534,1265.0,2063900,1289.0,1260.0
1080,2019/01/24,1296.0,1289.924,1276.0,1720700,1298.0,1273.0
1081,2019/01/25,1294.0,1295.378,1292.0,1718200,1303.0,1290.0
1082,2019/01/28,1277.0,1281.232,1291.0,1691600,1293.0,1274.0
1083,2019/01/29,1283.0,1276.663,1273.0,2988000,1288.0,1257.0
1084,2019/01/30,1278.0,1279.304,1279.0,2526200,1287.0,1271.0
1085,2019/01/31,1296.0,1295.365,1302.0,2620200,1302.0,1284.0
1086,2019/02/01,1295.0,1288.469,1298.0,2519300,1299.0,1272.0
1087,2019/02/04,1323.0,1321.952,1309.0,2382700,1331.0,1306.0
1088,2019/02/05,1341.0,1339.054,1345.0,4172200,1352.0,1328.0
1089,2019/02/06,1218.0,1224.627,1251.0,10118900,1268.0,1205.0
1090,2019/02/07,1184.0,1181.541,1214.0,6529300,1214.0,1166.0
1091,2019/02/08,1152.0,1153.594,1154.0,6482200,1164.0,1144.0
1092,2019/02/12,1190.0,1178.494,1151.0,4287200,1192.0,1151.0
1093,2019/02/13,1217.0,1215.359,1192.0,5142200,1228.0,1188.0
1094,2019/02/14,1216.0,1217.845,1219.0,3110000,1230.0,1212.0
1095,2019/02/15,1189.0,1189.372,1203.0,3212600,1208.0,1177.0
1096,2019/02/18,1195.0,1194.678,1199.0,2588500,1201.0,1183.0
1097,2019/02/19,1221.0,1216.731,1203.0,3252900,1223.0,1198.0
1098,2019/02/20,1217.0,1218.13,1226.0,2543300,1228.0,1208.0
1099,2019/02/21,1211.0,1205.464,1202.0,3627500,1213.0,1192.0
1100,2019/02/22,1217.0,1215.18,1218.0,2402900,1221.0,1207.0
1101,2019/02/25,1227.0,1227.268,1229.0,2710400,1235.0,1221.0
1102,2019/02/26,1204.0,1207.307,1230.0,3123600,1232.0,1198.0
1103,2019/02/27,1215.0,1213.452,1213.0,2850200,1217.0,1205.0
1104,2019/02/28,1217.0,1219.439,1222.0,2943600,1226.0,1213.0
1105,2019/03/01,1227.0,1230.175,1227.0,2679700,1238.0,1226.0
1106,2019/03/04,1253.0,1247.865,1244.0,2878100,1255.0,1238.0
1107,2019/03/05,1250.0,1246.888,1250.0,2175900,1253.0,1238.0
1108,2019/03/06,1254.0,1251.151,1255.0,2471000,1259.0,1240.0
1109,2019/03/07,1233.0,1234.222,1243.0,3252100,1249.0,1227.0
1110,2019/03/08,1216.0,1230.837,1240.0,5691500,1244.0,1210.0
1111,2019/03/11,1234.0,1229.242,1227.0,1815700,1235.0,1213.0
1112,2019/03/12,1253.0,1253.839,1250.0,2576300,1261.0,1248.0
1113,2019/03/13,1235.0,1235.566,1237.0,2790400,1248.0,1229.0
1114,2019/03/14,1239.0,1241.68,1251.0,2339300,1258.0,1236.0
1115,2019/03/15,1251.0,1253.385,1255.0,3614700,1264.0,1251.0
1116,2019/03/18,1244.0,1244.258,1252.0,2717600,1253.0,1238.0
1117,2019/03/19,1222.0,1222.114,1233.0,2897900,1236.0,1218.0
1118,2019/03/20,1229.0,1225.467,1224.0,2792800,1230.0,1217.0
1119,2019/03/22,1211.0,1213.07,1233.0,3265800,1233.0,1203.0
1120,2019/03/25,1175.0,1175.689,1185.0,3442800,1190.0,1171.0
1121,2019/03/26,1207.0,1202.785,1190.0,3751000,1209.0,1188.0
1122,2019/03/27,1227.0,1222.494,1210.0,4272300,1228.0,1210.0
1123,2019/03/28,1220.0,1216.613,1222.0,3428900,1224.0,1202.0
1124,2019/03/29,1221.0,1222.746,1234.0,2447300,1238.0,1219.0
1125,2019/04/01,1231.0,1236.118,1248.0,3160500,1255.0,1227.0
1126,2019/04/02,1231.0,1234.899,1248.0,2478900,1248.0,1229.0
1127,2019/04/03,1237.0,1237.828,1240.0,2954300,1245.0,1231.0
1128,2019/04/04,1214.0,1215.288,1230.0,2442700,1230.0,1210.0
1129,2019/04/05,1207.0,1210.432,1213.0,2306500,1219.0,1206.0
1130,2019/04/08,1205.0,1207.84,1215.0,2475800,1216.0,1203.0
1131,2019/04/09,1250.0,1245.74,1228.0,3341500,1256.0,1224.0
1132,2019/04/10,1235.0,1236.628,1249.0,3301700,1254.0,1226.0
1133,2019/04/11,1234.0,1232.564,1223.0,1786800,1242.0,1223.0
1134,2019/04/12,1238.0,1239.411,1253.0,3723800,1253.0,1218.0
1135,2019/04/15,1256.0,1255.857,1258.0,1882200,1261.0,1248.0
1136,2019/04/16,1256.0,1253.229,1250.0,2011800,1260.0,1240.0
1137,2019/04/17,1257.0,1257.472,1260.0,3044000,1262.0,1252.0
1138,2019/04/18,1249.0,1250.734,1255.0,2302200,1257.0,1246.0
1139,2019/04/19,1264.0,1263.63,1261.0,2153300,1268.0,1255.0
1140,2019/04/22,1283.0,1279.165,1260.0,2260300,1286.0,1257.0
1141,2019/04/23,1289.0,1289.705,1284.0,2020900,1297.0,1282.0
1142,2019/04/24,1292.0,1295.995,1299.0,2433300,1304.0,1290.0
1143,2019/04/25,1300.0,1296.254,1288.0,2146600,1303.0,1288.0
1144,2019/04/26,1294.0,1292.249,1287.0,3221600,1300.0,1282.0
1145,2019/05/07,1271.0,1271.86,1288.0,3472100,1291.0,1264.0
1146,2019/05/08,1261.0,1257.054,1254.0,3199100,1264.0,1247.0
1147,2019/05/09,1258.0,1252.039,1240.0,3764200,1260.0,1237.0
1148,2019/05/10,1224.0,1246.934,1277.0,7795400,1300.0,1218.0
1149,2019/05/13,1245.0,1237.302,1221.0,3862800,1251.0,1211.0
1150,2019/05/14,1236.0,1225.69,1223.0,2896000,1236.0,1205.0
1151,2019/05/15,1220.0,1217.979,1234.0,3825100,1235.0,1210.0
1152,2019/05/16,1228.0,1222.236,1213.0,2925300,1229.0,1209.0
1153,2019/05/17,1244.0,1242.732,1234.0,2218000,1249.0,1234.0
1154,2019/05/20,1257.0,1258.758,1253.0,2106600,1265.0,1253.0
1155,2019/05/21,1272.0,1266.828,1247.0,2399900,1273.0,1245.0
1156,2019/05/22,1312.0,1300.26,1290.0,3423300,1312.0,1280.0
1157,2019/05/23,1324.0,1320.931,1310.0,2936400,1328.0,1308.0
1158,2019/05/24,1334.0,1321.616,1317.0,3101100,1334.0,1296.0
1159,2019/05/27,1329.0,1332.444,1336.0,1395200,1342.0,1327.0
1160,2019/05/28,1318.0,1320.946,1327.0,3142300,1334.0,1315.0
1161,2019/05/29,1299.0,1294.071,1305.0,3455300,1307.0,1278.0
1162,2019/05/30,1315.0,1315.372,1317.0,2562800,1324.0,1308.0
1163,2019/05/31,1300.0,1304.236,1304.0,3278200,1317.0,1296.0
1164,2019/06/03,1301.0,1298.868,1292.0,2456300,1306.0,1288.0
1165,2019/06/04,1259.0,1265.976,1291.0,2800900,1294.0,1257.0
1166,2019/06/05,1305.0,1299.151,1289.0,3119600,1307.0,1284.0
1167,2019/06/06,1294.0,1297.576,1300.0,2833500,1308.0,1287.0
1168,2019/06/07,1304.0,1306.994,1306.0,1657300,1315.0,1303.0
1169,2019/06/10,1330.0,1324.758,1316.0,3609900,1332.0,1310.0
1170,2019/06/11,1313.0,1316.291,1322.0,2455000,1327.0,1313.0
1171,2019/06/12,1342.0,1353.168,1351.0,5133400,1369.0,1342.0
1172,2019/06/13,1344.0,1344.257,1345.0,3352000,1352.0,1332.0
1173,2019/06/14,1344.0,1342.415,1340.0,4799500,1355.0,1330.0
1174,2019/06/17,1347.0,1349.803,1348.0,2799000,1358.0,1342.0
1175,2019/06/18,1348.0,1350.629,1345.0,2402800,1367.0,1340.0
1176,2019/06/19,1361.0,1361.13,1355.0,2913600,1368.0,1352.0
1177,2019/06/20,1382.0,1377.654,1367.0,3297500,1386.0,1360.0
1178,2019/06/21,1374.0,1379.89,1395.0,3935100,1396.0,1370.0
1179,2019/06/24,1418.0,1405.123,1375.0,4110100,1418.0,1375.0
1180,2019/06/25,1424.0,1423.671,1426.0,3954400,1437.0,1415.0
1181,2019/06/26,1426.0,1422.389,1410.0,4302800,1434.0,1405.0
1182,2019/06/27,1443.0,1437.351,1437.0,4272400,1443.0,1421.0
1183,2019/06/28,1435.0,1432.388,1430.0,4452400,1436.0,1424.0
1184,2019/07/01,1461.0,1459.026,1450.0,4275600,1471.0,1439.0
1185,2019/07/02,1480.0,1477.388,1470.0,3465600,1485.0,1463.0
1186,2019/07/03,1481.0,1479.574,1473.0,3589400,1488.0,1472.0
1187,2019/07/04,1493.0,1491.868,1487.0,2307000,1497.0,1484.0
1188,2019/07/05,1484.0,1482.094,1486.0,2624000,1488.0,1478.0
1189,2019/07/08,1483.0,1483.329,1485.0,2790500,1493.0,1475.0
1190,2019/07/09,1495.0,1492.952,1493.0,2560800,1502.0,1486.0
1191,2019/07/10,1474.0,1478.459,1484.0,3273200,1493.0,1474.0
1192,2019/07/11,1479.0,1477.993,1471.0,2247300,1488.0,1465.0
1193,2019/07/12,1471.0,1476.786,1490.0,2793700,1490.0,1464.0
1194,2019/07/16,1464.0,1461.965,1462.0,2159400,1470.0,1450.0
1195,2019/07/17,1446.0,1447.013,1456.0,2288300,1459.0,1440.0
1196,2019/07/18,1406.0,1413.356,1431.0,3789400,1434.0,1399.0
1197,2019/07/19,1440.0,1431.506,1411.0,2114700,1440.0,1411.0
1198,2019/07/22,1419.0,1419.493,1426.0,2163100,1431.0,1414.0
1199,2019/07/23,1412.0,1414.253,1411.0,1841200,1421.0,1404.0
1200,2019/07/24,1391.0,1395.796,1409.0,4031600,1412.0,1383.0
1201,2019/07/25,1390.0,1390.472,1381.0,2309200,1398.0,1379.0
1202,2019/07/26,1429.0,1421.503,1397.0,2904000,1433.0,1394.0
1203,2019/07/29,1450.0,1444.127,1438.0,3364900,1453.0,1434.0
1204,2019/07/30,1450.0,1450.273,1456.0,2540900,1460.0,1447.0
1205,2019/07/31,1435.0,1434.749,1431.0,4033200,1444.0,1422.0
1206,2019/08/01,1453.0,1445.579,1439.0,3072000,1453.0,1430.0
1207,2019/08/02,1431.0,1431.371,1439.0,3604300,1449.0,1412.0
1208,2019/08/05,1324.0,1325.311,1360.0,6206100,1377.0,1301.0
1209,2019/08/06,1321.0,1304.527,1282.0,4217600,1324.0,1270.0
1210,2019/08/07,1327.0,1322.704,1315.0,2863300,1332.0,1304.0
1211,2019/08/08,1344.0,1342.149,1338.0,2477200,1357.0,1327.0
1212,2019/08/09,1375.0,1369.215,1363.0,3627500,1381.0,1356.0
1213,2019/08/13,1347.0,1345.08,1353.0,2709200,1355.0,1332.0
1214,2019/08/14,1347.0,1348.528,1360.0,2406300,1367.0,1340.0
1215,2019/08/15,1350.0,1342.891,1315.0,2312900,1353.0,1313.0
1216,2019/08/16,1359.0,1356.813,1335.0,2648200,1368.0,1333.0
1217,2019/08/19,1376.0,1372.518,1371.0,1598300,1381.0,1360.0
1218,2019/08/20,1396.0,1391.223,1380.0,2367600,1399.0,1368.0
1219,2019/08/21,1388.0,1384.214,1380.0,2171600,1390.0,1369.0
1220,2019/08/22,1393.0,1389.476,1387.0,1995400,1396.0,1381.0
1221,2019/08/23,1386.0,1377.134,1363.0,2422100,1389.0,1359.0
