ds,yhat
2019-08-05,2861.648836352834
2019-08-06,2853.9783216123087
2019-08-07,2847.325300055048
2019-08-08,2842.9100907652632
2019-08-09,2837.936437058602
2019-08-13,2805.221390158892
2019-08-14,2809.0792008960784
2019-08-15,2813.1604435934214
2019-08-16,2811.0079090742165
2019-08-19,2787.4646161077317
2019-08-20,2789.882539659228
2019-08-21,2793.146220709552
2019-08-22,2790.007610460245
2019-08-23,2779.36833735584
2019-08-26,2776.6777360891633
2019-08-27,2793.2344101423105
2019-08-28,2804.8779556757145
2019-08-29,2804.840793078216
2019-08-30,2795.983499943873
