,Date,Close,VWAP,Open,Volume,High,Low
0,2014/08/25,3635.0,3635.575,3665.0,92200,3665.0,3620.0
1,2014/08/26,3630.0,3634.019,3635.0,86600,3650.0,3620.0
2,2014/08/27,3635.0,3637.896,3640.0,75100,3665.0,3615.0
3,2014/08/28,3595.0,3597.489,3615.0,116100,3625.0,3580.0
4,2014/08/29,3565.0,3565.103,3570.0,87100,3580.0,3550.0
5,2014/09/01,3565.0,3562.015,3545.0,53100,3580.0,3545.0
6,2014/09/02,3625.0,3609.494,3580.0,80100,3650.0,3575.0
7,2014/09/03,3640.0,3655.622,3650.0,85200,3690.0,3635.0
8,2014/09/04,3620.0,3627.308,3625.0,74300,3650.0,3610.0
9,2014/09/05,3705.0,3699.335,3650.0,135300,3720.0,3650.0
10,2014/09/08,3825.0,3804.066,3750.0,200700,3845.0,3735.0
11,2014/09/09,3850.0,3854.65,3865.0,170100,3875.0,3830.0
12,2014/09/10,3850.0,3841.113,3815.0,186000,3860.0,3795.0
13,2014/09/11,3830.0,3834.226,3880.0,123400,3895.0,3810.0
14,2014/09/12,3800.0,3795.293,3800.0,240500,3805.0,3775.0
15,2014/09/16,3815.0,3798.532,3780.0,89600,3820.0,3760.0
16,2014/09/17,3760.0,3787.876,3815.0,214000,3855.0,3750.0
17,2014/09/18,3730.0,3743.004,3760.0,221200,3790.0,3705.0
18,2014/09/19,3815.0,3804.04,3750.0,135900,3840.0,3735.0
19,2014/09/22,3830.0,3824.074,3810.0,109600,3840.0,3785.0
20,2014/09/24,3820.0,3815.759,3780.0,190500,3840.0,3780.0
21,2014/09/25,3935.0,3901.91,3835.0,224900,3935.0,3830.0
22,2014/09/26,3920.0,3925.109,3910.0,105700,3945.0,3905.0
23,2014/09/29,3965.0,3972.629,3955.0,124400,4000.0,3950.0
24,2014/09/30,3920.0,3925.447,3995.0,152100,4000.0,3890.0
25,2014/10/01,3940.0,3949.368,3925.0,104500,3990.0,3925.0
26,2014/10/02,3805.0,3843.24,3905.0,130100,3930.0,3805.0
27,2014/10/03,3815.0,3803.488,3765.0,102500,3830.0,3765.0
28,2014/10/06,3875.0,3878.264,3895.0,79500,3905.0,3860.0
29,2014/10/07,3820.0,3838.459,3885.0,121700,3900.0,3810.0
30,2014/10/08,3805.0,3794.516,3750.0,93000,3820.0,3730.0
31,2014/10/09,3740.0,3768.999,3835.0,84400,3850.0,3740.0
32,2014/10/10,3685.0,3670.137,3650.0,153800,3695.0,3650.0
33,2014/10/14,3595.0,3590.889,3505.0,233400,3630.0,3505.0
34,2014/10/15,3620.0,3631.028,3615.0,148800,3680.0,3600.0
35,2014/10/16,3550.0,3558.611,3520.0,140700,3595.0,3515.0
36,2014/10/17,3465.0,3501.134,3550.0,163100,3575.0,3455.0
37,2014/10/20,3610.0,3583.201,3550.0,191800,3615.0,3485.0
38,2014/10/21,3575.0,3583.953,3625.0,201000,3645.0,3550.0
39,2014/10/22,3655.0,3636.981,3660.0,245300,3680.0,3590.0
40,2014/10/23,3610.0,3615.156,3660.0,221500,3665.0,3590.0
41,2014/10/24,3610.0,3567.743,3605.0,306100,3635.0,3485.0
42,2014/10/27,3700.0,3687.644,3645.0,224300,3715.0,3630.0
43,2014/10/28,3690.0,3696.41,3700.0,84400,3715.0,3675.0
44,2014/10/29,3735.0,3750.823,3745.0,141000,3785.0,3730.0
45,2014/10/30,3770.0,3777.16,3730.0,172200,3800.0,3730.0
46,2014/10/31,3910.0,3865.115,3815.0,231400,3920.0,3805.0
47,2014/11/04,3875.0,3908.212,3980.0,344700,3995.0,3875.0
48,2014/11/05,3870.0,3871.249,3885.0,207800,3910.0,3850.0
49,2014/11/06,3815.0,3846.193,3915.0,172200,3920.0,3795.0
50,2014/11/07,3895.0,3904.352,3885.0,155100,3930.0,3860.0
51,2014/11/10,3855.0,3857.087,3895.0,114300,3915.0,3840.0
52,2014/11/11,3865.0,3859.843,3860.0,146700,3875.0,3840.0
53,2014/11/12,3850.0,3867.152,3900.0,203800,3915.0,3840.0
54,2014/11/13,3850.0,3834.451,3815.0,247800,3860.0,3795.0
55,2014/11/14,3920.0,3903.516,3920.0,162100,3920.0,3870.0
56,2014/11/17,3800.0,3814.691,3875.0,191100,3890.0,3780.0
57,2014/11/18,3875.0,3853.639,3790.0,135600,3880.0,3780.0
58,2014/11/19,3900.0,3903.518,3895.0,145100,3925.0,3870.0
59,2014/11/20,3860.0,3874.704,3930.0,126700,3930.0,3850.0
60,2014/11/21,3840.0,3834.105,3850.0,121200,3870.0,3805.0
61,2014/11/25,3830.0,3851.947,3910.0,149200,3910.0,3825.0
62,2014/11/26,3825.0,3840.448,3830.0,176400,3870.0,3815.0
63,2014/11/27,3790.0,3796.935,3830.0,104900,3835.0,3770.0
64,2014/11/28,3785.0,3792.331,3795.0,86000,3810.0,3775.0
65,2014/12/01,3830.0,3817.382,3770.0,137100,3840.0,3770.0
66,2014/12/02,3845.0,3823.796,3790.0,169900,3850.0,3780.0
67,2014/12/03,3825.0,3830.668,3845.0,110100,3850.0,3810.0
68,2014/12/04,3805.0,3819.564,3845.0,82600,3850.0,3800.0
69,2014/12/05,3740.0,3755.828,3795.0,181200,3800.0,3740.0
70,2014/12/08,3645.0,3659.629,3760.0,318100,3760.0,3625.0
71,2014/12/09,3700.0,3683.514,3625.0,219700,3710.0,3615.0
72,2014/12/10,3685.0,3676.956,3655.0,200200,3690.0,3650.0
73,2014/12/11,3730.0,3727.672,3715.0,205300,3780.0,3665.0
74,2014/12/12,3775.0,3791.645,3805.0,380900,3805.0,3750.0
75,2014/12/15,3730.0,3740.864,3705.0,134900,3770.0,3705.0
76,2014/12/16,3630.0,3638.975,3625.0,190800,3670.0,3620.0
77,2014/12/17,3605.0,3608.424,3605.0,158000,3655.0,3580.0
78,2014/12/18,3650.0,3654.294,3675.0,114700,3700.0,3630.0
79,2014/12/19,3875.0,3813.66,3745.0,273400,3875.0,3735.0
80,2014/12/22,3855.0,3858.004,3870.0,212400,3895.0,3820.0
81,2014/12/24,3910.0,3893.934,3925.0,177800,3925.0,3865.0
82,2014/12/25,3925.0,3914.306,3925.0,68400,3940.0,3895.0
83,2014/12/26,3980.0,3967.689,3925.0,101700,3990.0,3920.0
84,2014/12/29,3980.0,3969.534,3980.0,124400,3995.0,3935.0
85,2014/12/30,3935.0,3959.548,4000.0,116200,4000.0,3930.0
86,2015/01/05,3980.0,3973.585,3945.0,202800,4005.0,3930.0
87,2015/01/06,3885.0,3905.84,3920.0,187600,3945.0,3870.0
88,2015/01/07,3840.0,3840.314,3835.0,146500,3885.0,3820.0
89,2015/01/08,3865.0,3863.817,3855.0,216900,3895.0,3820.0
90,2015/01/09,3855.0,3851.076,3860.0,167700,3870.0,3830.0
91,2015/01/13,3875.0,3869.436,3840.0,428800,3895.0,3810.0
92,2015/01/14,3790.0,3803.022,3840.0,205500,3865.0,3775.0
93,2015/01/15,3820.0,3816.504,3785.0,186900,3850.0,3770.0
94,2015/01/16,3785.0,3754.971,3725.0,209900,3795.0,3725.0
95,2015/01/19,3820.0,3818.296,3805.0,132000,3850.0,3785.0
96,2015/01/20,3850.0,3839.051,3830.0,215400,3860.0,3800.0
97,2015/01/21,3815.0,3823.834,3855.0,227200,3855.0,3800.0
98,2015/01/22,3735.0,3726.97,3810.0,291700,3820.0,3700.0
99,2015/01/23,3745.0,3751.664,3810.0,206700,3825.0,3725.0
100,2015/01/26,3770.0,3762.526,3730.0,211200,3780.0,3710.0
101,2015/01/27,3870.0,3853.988,3815.0,198200,3885.0,3785.0
102,2015/01/28,3885.0,3889.866,3920.0,299300,3920.0,3840.0
103,2015/01/29,3900.0,3922.803,3885.0,204400,3955.0,3885.0
104,2015/01/30,3975.0,3973.448,3930.0,414500,4005.0,3895.0
105,2015/02/02,4090.0,4040.438,3935.0,397400,4105.0,3935.0
106,2015/02/03,4100.0,4117.229,4160.0,376400,4180.0,4075.0
107,2015/02/04,4225.0,4219.091,4180.0,199100,4250.0,4120.0
108,2015/02/05,4190.0,4186.258,4220.0,167400,4230.0,4150.0
109,2015/02/06,4235.0,4237.405,4245.0,115200,4255.0,4205.0
110,2015/02/09,4210.0,4222.314,4275.0,105000,4280.0,4190.0
111,2015/02/10,4165.0,4168.569,4215.0,94000,4240.0,4150.0
112,2015/02/12,4240.0,4249.862,4295.0,174100,4295.0,4205.0
113,2015/02/13,4220.0,4210.404,4235.0,138600,4235.0,4170.0
114,2015/02/16,4245.0,4240.73,4235.0,225300,4280.0,4210.0
115,2015/02/17,4245.0,4247.605,4300.0,147600,4300.0,4225.0
116,2015/02/18,4330.0,4321.076,4300.0,191900,4350.0,4280.0
117,2015/02/19,4385.0,4362.544,4350.0,180600,4385.0,4335.0
118,2015/02/20,4400.0,4391.773,4400.0,137600,4420.0,4355.0
119,2015/02/23,4410.0,4400.721,4410.0,102600,4435.0,4370.0
120,2015/02/24,4380.0,4381.823,4370.0,122900,4410.0,4365.0
121,2015/02/25,4410.0,4407.219,4410.0,138800,4440.0,4385.0
122,2015/02/26,4415.0,4411.11,4420.0,133300,4435.0,4375.0
123,2015/02/27,4445.0,4432.327,4435.0,175800,4445.0,4395.0
124,2015/03/02,4465.0,4469.595,4450.0,153200,4505.0,4435.0
125,2015/03/03,4560.0,4554.69,4510.0,206500,4595.0,4510.0
126,2015/03/04,4495.0,4519.006,4585.0,191200,4585.0,4485.0
127,2015/03/05,4530.0,4521.863,4535.0,105200,4540.0,4490.0
128,2015/03/06,4665.0,4625.889,4535.0,145700,4665.0,4525.0
129,2015/03/09,4625.0,4633.773,4675.0,121800,4675.0,4600.0
130,2015/03/10,4660.0,4662.129,4660.0,197000,4705.0,4635.0
131,2015/03/11,4700.0,4695.491,4680.0,185200,4720.0,4650.0
132,2015/03/12,4805.0,4798.974,4750.0,205700,4825.0,4735.0
133,2015/03/13,4800.0,4798.305,4800.0,424500,4820.0,4755.0
134,2015/03/16,4765.0,4762.351,4815.0,231400,4850.0,4720.0
135,2015/03/17,4735.0,4743.146,4815.0,261300,4825.0,4720.0
136,2015/03/18,4725.0,4722.438,4795.0,260500,4795.0,4665.0
137,2015/03/19,4680.0,4677.162,4725.0,266000,4725.0,4640.0
138,2015/03/20,4755.0,4720.434,4670.0,282300,4765.0,4605.0
139,2015/03/23,4775.0,4771.55,4820.0,173600,4835.0,4730.0
140,2015/03/24,4915.0,4881.477,4810.0,204200,4925.0,4775.0
141,2015/03/25,5020.0,4965.233,4910.0,251500,5020.0,4910.0
142,2015/03/26,4920.0,4911.099,4995.0,359500,5020.0,4850.0
143,2015/03/27,4850.0,4884.693,4875.0,192200,4965.0,4825.0
144,2015/03/30,5080.0,5033.2,4850.0,369900,5110.0,4850.0
145,2015/03/31,5100.0,5123.875,5180.0,252900,5200.0,5090.0
146,2015/04/01,4995.0,4997.035,5060.0,311300,5080.0,4930.0
147,2015/04/02,5330.0,5250.584,5050.0,495300,5420.0,5030.0
148,2015/04/03,5220.0,5227.341,5330.0,382400,5330.0,5180.0
149,2015/04/06,5210.0,5212.688,5320.0,210600,5350.0,5160.0
150,2015/04/07,5440.0,5374.943,5310.0,572300,5450.0,5190.0
151,2015/04/08,5650.0,5561.356,5510.0,407900,5660.0,5420.0
152,2015/04/09,5760.0,5729.029,5700.0,459200,5820.0,5660.0
153,2015/04/10,5900.0,5895.457,5820.0,593600,5980.0,5720.0
154,2015/04/13,5550.0,5634.828,5860.0,565500,5860.0,5520.0
155,2015/04/14,5480.0,5477.484,5450.0,851600,5570.0,5330.0
156,2015/04/15,5410.0,5405.658,5470.0,339700,5480.0,5360.0
157,2015/04/16,4970.0,4987.953,5210.0,1227500,5230.0,4860.0
158,2015/04/17,4825.0,4865.35,4985.0,612800,4995.0,4810.0
159,2015/04/20,4840.0,4827.787,4815.0,615800,4915.0,4760.0
160,2015/04/21,5040.0,4997.325,4910.0,486000,5050.0,4870.0
161,2015/04/22,4800.0,4868.472,4910.0,655600,4980.0,4785.0
162,2015/04/23,4835.0,4808.955,4800.0,436300,4845.0,4755.0
163,2015/04/24,5180.0,5145.162,5140.0,966600,5240.0,5000.0
164,2015/04/27,5200.0,5214.204,5190.0,432900,5260.0,5130.0
165,2015/04/28,5190.0,5234.819,5270.0,304600,5300.0,5170.0
166,2015/04/30,5020.0,5074.509,5250.0,478900,5250.0,4995.0
167,2015/05/01,5020.0,5011.188,5020.0,443800,5070.0,4955.0
168,2015/05/07,4990.0,5020.897,5050.0,379500,5140.0,4955.0
169,2015/05/08,4985.0,4998.124,5050.0,204400,5050.0,4970.0
170,2015/05/11,4970.0,4981.774,5010.0,280500,5020.0,4950.0
171,2015/05/12,4995.0,4997.951,4950.0,418000,5040.0,4925.0
172,2015/05/13,5060.0,5083.164,5010.0,327300,5140.0,4995.0
173,2015/05/14,4930.0,4958.661,5020.0,215500,5040.0,4915.0
174,2015/05/15,5050.0,5011.377,4945.0,219700,5050.0,4940.0
175,2015/05/18,5030.0,5029.36,5040.0,170400,5070.0,5000.0
176,2015/05/19,5030.0,5013.402,5040.0,188300,5040.0,4985.0
177,2015/05/20,5130.0,5130.229,5090.0,345400,5170.0,5050.0
178,2015/05/21,5120.0,5155.497,5150.0,288000,5210.0,5110.0
179,2015/05/22,5100.0,5103.756,5160.0,262500,5160.0,5050.0
180,2015/05/25,5090.0,5100.331,5150.0,293500,5150.0,5070.0
181,2015/05/26,5020.0,5040.933,5090.0,143700,5110.0,5010.0
182,2015/05/27,4965.0,4985.2,5030.0,233100,5050.0,4950.0
183,2015/05/28,5000.0,5017.719,5000.0,189800,5070.0,4980.0
184,2015/05/29,5090.0,5119.11,5030.0,288900,5170.0,5030.0
185,2015/06/01,5070.0,5080.483,5110.0,159600,5150.0,5040.0
186,2015/06/02,5170.0,5171.349,5130.0,246800,5210.0,5110.0
187,2015/06/03,5300.0,5288.292,5230.0,478200,5330.0,5230.0
188,2015/06/04,5360.0,5351.255,5350.0,330000,5380.0,5330.0
189,2015/06/05,5250.0,5265.867,5310.0,176400,5340.0,5210.0
190,2015/06/08,5150.0,5166.775,5220.0,175200,5250.0,5140.0
191,2015/06/09,5040.0,5087.842,5160.0,141300,5170.0,5030.0
192,2015/06/10,4965.0,4973.113,5000.0,431400,5020.0,4930.0
193,2015/06/11,4980.0,4969.368,4980.0,333300,5010.0,4950.0
194,2015/06/12,4990.0,4982.955,4975.0,304600,5010.0,4960.0
195,2015/06/15,5030.0,5007.288,4965.0,161300,5040.0,4940.0
196,2015/06/16,5030.0,5011.119,5000.0,149200,5040.0,4975.0
197,2015/06/17,5090.0,5051.812,5020.0,202800,5100.0,4990.0
198,2015/06/18,5140.0,5146.957,5150.0,236300,5220.0,5100.0
199,2015/06/19,5290.0,5287.092,5250.0,268200,5330.0,5230.0
200,2015/06/22,5410.0,5389.649,5290.0,344700,5430.0,5290.0
201,2015/06/23,5420.0,5393.42,5410.0,235700,5430.0,5350.0
202,2015/06/24,5440.0,5401.228,5410.0,315100,5450.0,5330.0
203,2015/06/25,5400.0,5403.093,5400.0,133200,5440.0,5370.0
204,2015/06/26,5390.0,5387.615,5400.0,127900,5420.0,5360.0
205,2015/06/29,5300.0,5293.082,5200.0,172600,5340.0,5200.0
206,2015/06/30,5460.0,5408.076,5240.0,314400,5470.0,5240.0
207,2015/07/01,5560.0,5521.732,5480.0,290400,5580.0,5400.0
208,2015/07/02,5520.0,5541.243,5620.0,235000,5620.0,5500.0
209,2015/07/03,5580.0,5559.391,5570.0,164100,5620.0,5500.0
210,2015/07/06,5510.0,5510.822,5460.0,225100,5560.0,5450.0
211,2015/07/07,5740.0,5666.305,5580.0,307700,5750.0,5540.0
212,2015/07/08,5510.0,5526.005,5660.0,358200,5710.0,5430.0
213,2015/07/09,5600.0,5500.723,5440.0,280700,5610.0,5330.0
214,2015/07/10,5650.0,5665.623,5650.0,299300,5740.0,5610.0
215,2015/07/13,5780.0,5744.449,5720.0,213100,5800.0,5610.0
216,2015/07/14,5840.0,5846.53,5900.0,316700,5960.0,5800.0
217,2015/07/15,5910.0,5873.979,5890.0,214400,5920.0,5830.0
218,2015/07/16,5910.0,5899.57,5830.0,383400,5970.0,5800.0
219,2015/07/17,6040.0,6007.613,5910.0,291200,6080.0,5910.0
220,2015/07/21,6080.0,6056.872,6130.0,269500,6140.0,6010.0
221,2015/07/22,5990.0,6002.152,6080.0,184500,6080.0,5950.0
222,2015/07/23,5820.0,5838.014,5900.0,461200,5910.0,5730.0
223,2015/07/24,5860.0,5880.795,5920.0,280400,5930.0,5860.0
224,2015/07/27,5690.0,5742.494,5860.0,305100,5880.0,5660.0
225,2015/07/28,5800.0,5765.991,5600.0,382100,5860.0,5600.0
226,2015/07/29,6060.0,5967.517,5790.0,347100,6070.0,5760.0
227,2015/07/30,6020.0,6044.693,6080.0,294300,6100.0,6010.0
228,2015/07/31,5890.0,5902.585,6060.0,241800,6060.0,5850.0
229,2015/08/03,6080.0,6034.079,5900.0,199300,6080.0,5900.0
230,2015/08/04,6140.0,6131.167,6040.0,182600,6180.0,6030.0
231,2015/08/05,6120.0,6185.719,6200.0,237800,6360.0,6080.0
232,2015/08/06,6110.0,6169.137,6130.0,155200,6240.0,6110.0
233,2015/08/07,5940.0,5927.385,5980.0,341500,5990.0,5830.0
234,2015/08/10,6070.0,6028.891,5950.0,160500,6080.0,5910.0
235,2015/08/11,6020.0,6032.279,6150.0,147900,6160.0,5950.0
236,2015/08/12,5950.0,5960.329,5950.0,103400,6020.0,5910.0
237,2015/08/13,5940.0,5930.379,5890.0,160800,5980.0,5880.0
238,2015/08/14,6010.0,5996.677,5920.0,125200,6050.0,5900.0
239,2015/08/17,6050.0,6056.655,6010.0,173400,6120.0,6000.0
240,2015/08/18,5920.0,5945.613,6000.0,198300,6050.0,5900.0
241,2015/08/19,5850.0,5873.172,5900.0,188500,5960.0,5840.0
242,2015/08/20,5780.0,5796.415,5790.0,192200,5850.0,5760.0
243,2015/08/21,5620.0,5626.418,5610.0,290300,5730.0,5560.0
244,2015/08/24,5360.0,5440.49,5460.0,383400,5570.0,5340.0
245,2015/08/25,5080.0,5147.15,5070.0,545700,5290.0,5010.0
246,2015/08/26,5200.0,5200.259,5100.0,382600,5280.0,5100.0
247,2015/08/27,5300.0,5323.256,5360.0,304100,5440.0,5250.0
248,2015/08/28,5390.0,5367.853,5450.0,240300,5450.0,5300.0
249,2015/08/31,5410.0,5365.791,5360.0,210000,5410.0,5300.0
250,2015/09/01,5140.0,5220.726,5400.0,202500,5400.0,5130.0
251,2015/09/02,5080.0,5113.297,5030.0,291800,5210.0,5010.0
252,2015/09/03,5200.0,5214.684,5160.0,281800,5280.0,5160.0
253,2015/09/04,5020.0,5065.208,5260.0,280900,5260.0,4990.0
254,2015/09/07,4995.0,4989.513,5000.0,480100,5040.0,4930.0
255,2015/09/08,4775.0,4871.786,5020.0,435800,5030.0,4775.0
256,2015/09/09,5050.0,5013.464,4975.0,320900,5050.0,4960.0
257,2015/09/10,5000.0,4975.565,4960.0,506200,5040.0,4880.0
258,2015/09/11,5080.0,5085.515,5020.0,537700,5180.0,4995.0
259,2015/09/14,4895.0,4957.384,5120.0,498500,5130.0,4880.0
260,2015/09/15,5010.0,5020.906,4980.0,210800,5060.0,4960.0
261,2015/09/16,4945.0,4969.286,5030.0,137200,5050.0,4925.0
262,2015/09/17,5070.0,5038.355,5040.0,196900,5080.0,4960.0
263,2015/09/18,5040.0,5030.83,4970.0,243400,5060.0,4965.0
264,2015/09/24,4995.0,5032.609,5000.0,391600,5140.0,4960.0
265,2015/09/25,5180.0,5232.065,5240.0,423300,5430.0,5110.0
266,2015/09/28,5480.0,5503.626,5440.0,632700,5650.0,5310.0
267,2015/09/29,5280.0,5322.278,5350.0,374900,5420.0,5230.0
268,2015/09/30,5450.0,5501.68,5490.0,429200,5600.0,5430.0
269,2015/10/01,5360.0,5371.547,5300.0,336200,5430.0,5300.0
270,2015/10/02,5380.0,5329.197,5280.0,225500,5380.0,5230.0
271,2015/10/05,5590.0,5516.436,5450.0,237100,5600.0,5400.0
272,2015/10/06,5650.0,5661.429,5660.0,445700,5710.0,5580.0
273,2015/10/07,5500.0,5528.524,5670.0,393700,5760.0,5430.0
274,2015/10/08,5470.0,5461.817,5470.0,412800,5560.0,5360.0
275,2015/10/09,5510.0,5501.68,5500.0,341000,5570.0,5390.0
276,2015/10/13,5520.0,5494.395,5430.0,381100,5570.0,5390.0
277,2015/10/14,5530.0,5526.309,5430.0,285000,5580.0,5430.0
278,2015/10/15,5740.0,5667.527,5560.0,412500,5750.0,5500.0
279,2015/10/16,5700.0,5740.231,5760.0,298300,5820.0,5670.0
280,2015/10/19,5820.0,5795.446,5650.0,364500,5880.0,5600.0
281,2015/10/20,5760.0,5787.571,5800.0,266400,5890.0,5750.0
282,2015/10/21,5690.0,5665.973,5700.0,367000,5710.0,5610.0
283,2015/10/22,6110.0,6112.866,5970.0,826500,6220.0,5900.0
284,2015/10/23,6120.0,6126.478,6260.0,647400,6260.0,6060.0
285,2015/10/26,6230.0,6226.042,6200.0,375400,6270.0,6140.0
286,2015/10/27,6230.0,6239.174,6210.0,215600,6300.0,6170.0
287,2015/10/28,6370.0,6380.816,6260.0,326100,6440.0,6250.0
288,2015/10/29,6370.0,6370.26,6410.0,281300,6500.0,6290.0
289,2015/10/30,6420.0,6371.751,6370.0,258700,6440.0,6270.0
290,2015/11/02,6320.0,6336.389,6400.0,191900,6420.0,6290.0
291,2015/11/04,6340.0,6324.077,6340.0,349300,6370.0,6260.0
292,2015/11/05,6180.0,6222.444,6250.0,451300,6290.0,6170.0
293,2015/11/06,6120.0,6111.395,6180.0,444600,6190.0,6060.0
294,2015/11/09,6100.0,6106.385,6050.0,532700,6170.0,6050.0
295,2015/11/10,5970.0,5953.442,5990.0,580800,6050.0,5890.0
296,2015/11/11,6250.0,6181.884,6000.0,406700,6290.0,5980.0
297,2015/11/12,6220.0,6258.421,6190.0,353300,6350.0,6190.0
298,2015/11/13,6270.0,6231.47,6210.0,485600,6300.0,6140.0
299,2015/11/16,6220.0,6214.501,6130.0,373500,6270.0,6120.0
300,2015/11/17,6230.0,6226.335,6220.0,309400,6280.0,6150.0
301,2015/11/18,6190.0,6215.081,6230.0,253700,6280.0,6170.0
302,2015/11/19,6320.0,6288.222,6240.0,285700,6340.0,6200.0
303,2015/11/20,6390.0,6346.294,6260.0,262000,6400.0,6250.0
304,2015/11/24,6440.0,6433.827,6360.0,352200,6470.0,6350.0
305,2015/11/25,6340.0,6355.783,6470.0,424000,6480.0,6270.0
306,2015/11/26,6430.0,6433.662,6400.0,429600,6490.0,6370.0
307,2015/11/27,6360.0,6363.877,6490.0,451100,6550.0,6280.0
308,2015/11/30,6550.0,6536.45,6440.0,5307700,6590.0,6390.0
309,2015/12/01,6800.0,6759.349,6650.0,1297700,6900.0,6620.0
310,2015/12/02,6800.0,6758.272,6710.0,625500,6830.0,6630.0
311,2015/12/03,6820.0,6823.592,6850.0,311800,6880.0,6780.0
312,2015/12/04,6620.0,6660.426,6670.0,411200,6750.0,6600.0
313,2015/12/07,6660.0,6667.157,6650.0,336300,6710.0,6620.0
314,2015/12/08,6630.0,6653.592,6660.0,393900,6760.0,6610.0
315,2015/12/09,6510.0,6516.82,6590.0,396500,6620.0,6460.0
316,2015/12/10,6410.0,6428.389,6420.0,452500,6530.0,6380.0
317,2015/12/11,6360.0,6372.933,6320.0,477000,6480.0,6300.0
318,2015/12/14,6260.0,6237.888,6200.0,363200,6300.0,6160.0
319,2015/12/15,6270.0,6340.979,6310.0,546500,6430.0,6270.0
320,2015/12/16,6430.0,6380.401,6410.0,383700,6470.0,6240.0
321,2015/12/17,6610.0,6626.991,6600.0,429100,6770.0,6570.0
322,2015/12/18,6550.0,6616.585,6600.0,394700,6730.0,6540.0
323,2015/12/21,6490.0,6429.261,6450.0,377300,6530.0,6290.0
324,2015/12/22,6500.0,6502.753,6500.0,274600,6580.0,6430.0
325,2015/12/24,6320.0,6380.166,6600.0,216700,6600.0,6280.0
326,2015/12/25,6300.0,6308.12,6200.0,170200,6380.0,6200.0
327,2015/12/28,6330.0,6264.339,6310.0,253500,6340.0,6190.0
328,2015/12/29,6400.0,6368.053,6340.0,206000,6400.0,6270.0
329,2015/12/30,6440.0,6399.17,6400.0,167400,6460.0,6290.0
330,2016/01/04,6230.0,6281.504,6380.0,239300,6470.0,6200.0
331,2016/01/05,6280.0,6269.029,6220.0,251200,6330.0,6180.0
332,2016/01/06,6210.0,6216.501,6300.0,226900,6320.0,6140.0
333,2016/01/07,6220.0,6251.863,6250.0,339200,6370.0,6170.0
334,2016/01/08,6450.0,6452.762,6290.0,667700,6580.0,6290.0
335,2016/01/12,6030.0,6123.754,6150.0,511400,6270.0,6030.0
336,2016/01/13,6260.0,6232.241,6200.0,331100,6290.0,6150.0
337,2016/01/14,6110.0,6068.676,6190.0,317300,6210.0,5970.0
338,2016/01/15,6170.0,6205.021,6260.0,283200,6290.0,6160.0
339,2016/01/18,6110.0,6098.937,6070.0,227600,6160.0,6010.0
340,2016/01/19,6120.0,6093.632,6070.0,245600,6190.0,6040.0
341,2016/01/20,5830.0,5912.3,6060.0,279100,6120.0,5820.0
342,2016/01/21,5620.0,5753.714,5770.0,272500,5890.0,5620.0
343,2016/01/22,5960.0,5853.385,5810.0,283300,5960.0,5710.0
344,2016/01/25,5990.0,5964.1,6040.0,444200,6050.0,5850.0
345,2016/01/26,5900.0,5931.834,5900.0,196300,6030.0,5850.0
346,2016/01/27,6070.0,6044.154,6080.0,195500,6080.0,5980.0
347,2016/01/28,6130.0,6142.083,6120.0,420100,6220.0,6050.0
348,2016/01/29,6170.0,6104.399,6100.0,452200,6170.0,5960.0
349,2016/02/01,6230.0,6237.456,6220.0,237400,6300.0,6190.0
350,2016/02/02,6360.0,6327.491,6200.0,212000,6390.0,6170.0
351,2016/02/03,6240.0,6231.118,6220.0,159200,6280.0,6180.0
352,2016/02/04,5970.0,5996.007,6150.0,250700,6200.0,5910.0
353,2016/02/05,5530.0,5584.766,5680.0,555200,5740.0,5480.0
354,2016/02/08,5620.0,5533.086,5400.0,319800,5670.0,5350.0
355,2016/02/09,5180.0,5197.512,5340.0,506800,5340.0,5110.0
356,2016/02/10,5120.0,5090.754,5200.0,387300,5240.0,5000.0
357,2016/02/12,4935.0,4968.292,5020.0,592300,5050.0,4875.0
358,2016/02/15,5380.0,5306.325,5220.0,286500,5430.0,5180.0
359,2016/02/16,5340.0,5384.111,5370.0,274600,5460.0,5320.0
360,2016/02/17,5380.0,5409.014,5540.0,326600,5590.0,5290.0
361,2016/02/18,5520.0,5544.544,5610.0,260800,5610.0,5500.0
362,2016/02/19,5410.0,5397.617,5460.0,175000,5520.0,5310.0
363,2016/02/22,5570.0,5529.867,5360.0,233200,5600.0,5340.0
364,2016/02/23,5390.0,5438.004,5600.0,230500,5620.0,5350.0
365,2016/02/24,5490.0,5488.233,5320.0,241600,5570.0,5320.0
366,2016/02/25,5600.0,5599.266,5490.0,167500,5640.0,5490.0
367,2016/02/26,5760.0,5763.843,5610.0,362200,5850.0,5570.0
368,2016/02/29,5610.0,5693.178,5750.0,373500,5810.0,5610.0
369,2016/03/01,5690.0,5672.703,5610.0,289300,5740.0,5570.0
370,2016/03/02,5870.0,5862.833,5850.0,232600,5920.0,5810.0
371,2016/03/03,5810.0,5801.868,5780.0,201800,5840.0,5750.0
372,2016/03/04,5820.0,5784.007,5780.0,169700,5830.0,5710.0
373,2016/03/07,5740.0,5721.872,5800.0,241400,5800.0,5680.0
374,2016/03/08,5730.0,5708.614,5650.0,217200,5760.0,5620.0
375,2016/03/09,5690.0,5705.835,5660.0,190400,5780.0,5640.0
376,2016/03/10,5890.0,5835.08,5680.0,237800,5920.0,5660.0
377,2016/03/11,5790.0,5800.428,5790.0,326800,5870.0,5760.0
378,2016/03/14,5830.0,5819.201,5780.0,176400,5880.0,5730.0
379,2016/03/15,5900.0,5903.395,5810.0,172900,5990.0,5770.0
380,2016/03/16,5910.0,5900.472,5870.0,169500,5950.0,5840.0
381,2016/03/17,5840.0,5888.762,5950.0,180900,6000.0,5790.0
382,2016/03/18,5750.0,5757.749,5780.0,159900,5850.0,5710.0
383,2016/03/22,5860.0,5858.925,5760.0,251100,5940.0,5760.0
384,2016/03/23,5920.0,5917.155,5910.0,156400,5950.0,5880.0
385,2016/03/24,5980.0,5995.135,5920.0,163400,6030.0,5920.0
386,2016/03/25,5960.0,5989.844,5990.0,140700,6080.0,5940.0
387,2016/03/28,6170.0,6125.802,6060.0,256800,6170.0,6060.0
388,2016/03/29,6230.0,6233.925,6220.0,232100,6280.0,6170.0
389,2016/03/30,6180.0,6211.724,6180.0,224500,6290.0,6170.0
390,2016/03/31,5950.0,5958.602,5880.0,345600,6040.0,5860.0
391,2016/04/01,5760.0,5780.557,5900.0,303700,5910.0,5700.0
392,2016/04/04,5670.0,5707.301,5740.0,338600,5790.0,5640.0
393,2016/04/05,5540.0,5576.541,5630.0,283900,5670.0,5510.0
394,2016/04/06,5650.0,5605.398,5570.0,345100,5670.0,5460.0
395,2016/04/07,5710.0,5677.641,5600.0,281500,5750.0,5600.0
396,2016/04/08,5780.0,5755.564,5630.0,211000,5840.0,5600.0
397,2016/04/11,5750.0,5741.896,5780.0,217800,5800.0,5680.0
398,2016/04/12,5780.0,5782.308,5770.0,201500,5840.0,5730.0
399,2016/04/13,5880.0,5874.603,5880.0,260500,5930.0,5830.0
400,2016/04/14,6070.0,6013.456,5990.0,203700,6070.0,5950.0
401,2016/04/15,6020.0,6003.459,5970.0,161300,6040.0,5930.0
402,2016/04/18,5930.0,5929.296,5800.0,221700,5980.0,5800.0
403,2016/04/19,6100.0,6097.957,6080.0,235900,6160.0,6040.0
404,2016/04/20,6100.0,6105.146,6100.0,240600,6150.0,6050.0
405,2016/04/21,6100.0,6118.277,6180.0,249000,6190.0,6070.0
406,2016/04/22,5960.0,5957.699,6000.0,272000,6040.0,5910.0
407,2016/04/25,5970.0,5933.14,5820.0,308900,5980.0,5760.0
408,2016/04/26,5910.0,5935.649,5900.0,308200,6030.0,5820.0
409,2016/04/27,5850.0,5857.356,5840.0,267800,5920.0,5820.0
410,2016/04/28,5810.0,5923.286,5920.0,325600,6120.0,5810.0
411,2016/05/02,5710.0,5658.494,5510.0,284100,5740.0,5510.0
412,2016/05/06,5750.0,5765.991,5810.0,324500,5830.0,5720.0
413,2016/05/09,5840.0,5835.371,5780.0,220800,5860.0,5710.0
414,2016/05/10,5970.0,5941.547,5840.0,236600,5970.0,5840.0
415,2016/05/11,5920.0,5936.225,5990.0,218800,6000.0,5890.0
416,2016/05/12,5840.0,5844.017,5850.0,230500,5910.0,5800.0
417,2016/05/13,5980.0,5937.957,5850.0,284900,6040.0,5760.0
418,2016/05/16,5860.0,5895.992,5960.0,370800,5960.0,5820.0
419,2016/05/17,5820.0,5825.728,5840.0,276200,5870.0,5790.0
420,2016/05/18,5760.0,5789.293,5890.0,250400,5890.0,5750.0
421,2016/05/19,5780.0,5774.438,5810.0,163600,5830.0,5740.0
422,2016/05/20,5850.0,5843.698,5790.0,148200,5880.0,5780.0
423,2016/05/23,5830.0,5833.065,5860.0,142600,5890.0,5800.0
424,2016/05/24,5760.0,5779.645,5820.0,152000,5830.0,5710.0
425,2016/05/25,5770.0,5771.404,5830.0,148900,5830.0,5740.0
426,2016/05/26,5710.0,5718.563,5810.0,228300,5810.0,5650.0
427,2016/05/27,5750.0,5728.695,5720.0,145600,5750.0,5680.0
428,2016/05/30,5870.0,5854.041,5830.0,187600,5940.0,5800.0
429,2016/05/31,6030.0,5981.698,5920.0,395800,6050.0,5880.0
430,2016/06/01,5980.0,5982.588,5980.0,301000,6040.0,5890.0
431,2016/06/02,5860.0,5875.434,5920.0,302200,5960.0,5830.0
432,2016/06/03,5910.0,5909.224,5840.0,140500,5950.0,5840.0
433,2016/06/06,5950.0,5920.511,5900.0,144900,5960.0,5830.0
434,2016/06/07,5900.0,5900.931,5950.0,98800,5950.0,5880.0
435,2016/06/08,5900.0,5870.525,5860.0,169600,5900.0,5810.0
436,2016/06/09,5800.0,5805.137,5850.0,167800,5900.0,5760.0
437,2016/06/10,5760.0,5747.038,5750.0,184000,5790.0,5700.0
438,2016/06/13,5600.0,5613.569,5620.0,130300,5680.0,5580.0
439,2016/06/14,5560.0,5577.096,5600.0,151500,5660.0,5530.0
440,2016/06/15,5630.0,5630.367,5610.0,138900,5660.0,5590.0
441,2016/06/16,5520.0,5551.897,5630.0,179200,5650.0,5500.0
442,2016/06/17,5480.0,5506.673,5570.0,264800,5610.0,5450.0
443,2016/06/20,5500.0,5518.265,5540.0,159100,5570.0,5490.0
444,2016/06/21,5530.0,5505.305,5470.0,283700,5550.0,5400.0
445,2016/06/22,5510.0,5487.268,5510.0,225800,5540.0,5420.0
446,2016/06/23,5530.0,5525.657,5520.0,137000,5570.0,5490.0
447,2016/06/24,5170.0,5235.524,5530.0,298700,5570.0,5090.0
448,2016/06/27,5460.0,5426.7,5270.0,262400,5510.0,5270.0
449,2016/06/28,5540.0,5520.815,5450.0,218500,5590.0,5420.0
450,2016/06/29,5630.0,5618.223,5610.0,194700,5670.0,5540.0
451,2016/06/30,5610.0,5616.814,5620.0,248900,5640.0,5580.0
452,2016/07/01,5690.0,5681.506,5670.0,233000,5720.0,5630.0
453,2016/07/04,5740.0,5708.941,5670.0,131200,5740.0,5650.0
454,2016/07/05,5770.0,5749.827,5680.0,127400,5780.0,5670.0
455,2016/07/06,5680.0,5660.169,5640.0,212800,5700.0,5600.0
456,2016/07/07,5640.0,5664.379,5700.0,205300,5720.0,5620.0
457,2016/07/08,5550.0,5590.996,5670.0,158700,5680.0,5550.0
458,2016/07/11,5700.0,5698.073,5650.0,237200,5740.0,5620.0
459,2016/07/12,5750.0,5790.11,5800.0,310300,5850.0,5740.0
460,2016/07/13,5830.0,5850.784,5900.0,172100,5910.0,5810.0
461,2016/07/14,5810.0,5808.04,5810.0,221400,5850.0,5740.0
462,2016/07/15,5710.0,5737.907,5850.0,214500,5850.0,5690.0
463,2016/07/19,5980.0,5925.015,5810.0,275200,5990.0,5790.0
464,2016/07/20,5980.0,5971.694,5920.0,200700,6020.0,5890.0
465,2016/07/21,5990.0,5986.177,6050.0,170300,6070.0,5940.0
466,2016/07/22,5950.0,5950.963,5890.0,207600,6020.0,5870.0
467,2016/07/25,5990.0,5983.497,5990.0,203600,6050.0,5930.0
468,2016/07/26,5980.0,5980.164,6030.0,188800,6030.0,5930.0
469,2016/07/27,5940.0,5990.561,6070.0,156900,6130.0,5920.0
470,2016/07/28,5830.0,5863.226,5840.0,207100,5990.0,5810.0
471,2016/07/29,6030.0,5961.768,5930.0,273800,6060.0,5860.0
472,2016/08/01,5930.0,5896.339,5800.0,155400,5960.0,5800.0
473,2016/08/02,5890.0,5889.341,5830.0,132000,5920.0,5830.0
474,2016/08/03,5780.0,5775.619,5750.0,99300,5810.0,5740.0
475,2016/08/04,5740.0,5763.644,5810.0,169300,5860.0,5720.0
476,2016/08/05,5650.0,5666.841,5710.0,120300,5770.0,5610.0
477,2016/08/08,5590.0,5615.841,5700.0,119500,5710.0,5560.0
478,2016/08/09,5670.0,5661.829,5620.0,100600,5700.0,5610.0
479,2016/08/10,5730.0,5703.098,5630.0,117500,5750.0,5630.0
480,2016/08/12,5730.0,5725.507,5700.0,97700,5760.0,5670.0
481,2016/08/15,5730.0,5707.741,5680.0,64200,5730.0,5650.0
482,2016/08/16,5580.0,5599.315,5720.0,172300,5720.0,5560.0
483,2016/08/17,5560.0,5577.498,5640.0,127100,5660.0,5540.0
484,2016/08/18,5430.0,5481.447,5570.0,151400,5600.0,5430.0
485,2016/08/19,5440.0,5471.774,5700.0,173600,5700.0,5380.0
486,2016/08/22,5460.0,5433.462,5440.0,142700,5470.0,5390.0
487,2016/08/23,5460.0,5453.597,5390.0,129000,5490.0,5390.0
488,2016/08/24,5490.0,5498.638,5470.0,140200,5530.0,5460.0
489,2016/08/25,5470.0,5462.929,5500.0,122900,5530.0,5420.0
490,2016/08/26,5350.0,5365.367,5320.0,132300,5420.0,5320.0
491,2016/08/29,5300.0,5328.586,5430.0,178900,5440.0,5260.0
492,2016/08/30,5380.0,5358.368,5310.0,136000,5400.0,5270.0
493,2016/08/31,5300.0,5302.838,5400.0,190300,5400.0,5280.0
494,2016/09/01,5320.0,5327.658,5280.0,140900,5380.0,5280.0
495,2016/09/02,5300.0,5287.748,5190.0,175400,5350.0,5190.0
496,2016/09/05,5260.0,5283.387,5340.0,150000,5360.0,5250.0
497,2016/09/06,5380.0,5327.099,5200.0,134100,5390.0,5200.0
498,2016/09/07,5450.0,5424.878,5320.0,131400,5460.0,5300.0
499,2016/09/08,5400.0,5405.148,5440.0,152100,5470.0,5380.0
500,2016/09/09,5240.0,5264.145,5280.0,307600,5330.0,5210.0
501,2016/09/12,5170.0,5152.985,5100.0,180900,5210.0,5100.0
502,2016/09/13,5150.0,5149.883,5130.0,161800,5210.0,5120.0
503,2016/09/14,5100.0,5107.591,5100.0,156500,5160.0,5080.0
504,2016/09/15,5080.0,5069.932,5050.0,102200,5090.0,5040.0
505,2016/09/16,5090.0,5088.563,5080.0,119000,5110.0,5050.0
506,2016/09/20,5210.0,5159.484,5020.0,287000,5220.0,5020.0
507,2016/09/21,5270.0,5241.11,5160.0,167500,5290.0,5160.0
508,2016/09/23,5320.0,5300.239,5260.0,183900,5340.0,5210.0
509,2016/09/26,5370.0,5361.233,5370.0,188200,5400.0,5300.0
510,2016/09/27,5410.0,5378.131,5320.0,248200,5430.0,5250.0
511,2016/09/28,5400.0,5416.5,5450.0,194300,5490.0,5370.0
512,2016/09/29,5400.0,5405.53,5420.0,115000,5440.0,5380.0
513,2016/09/30,5350.0,5353.343,5300.0,203700,5410.0,5260.0
514,2016/10/03,5350.0,5370.302,5410.0,122600,5420.0,5340.0
515,2016/10/04,5360.0,5340.568,5370.0,111000,5370.0,5300.0
516,2016/10/05,5300.0,5317.163,5340.0,209700,5350.0,5300.0
517,2016/10/06,5260.0,5294.77,5370.0,278600,5390.0,5240.0
518,2016/10/07,5240.0,5225.329,5290.0,190100,5290.0,5180.0
519,2016/10/11,5250.0,5255.934,5240.0,111400,5290.0,5240.0
520,2016/10/12,5290.0,5301.758,5240.0,159300,5330.0,5230.0
521,2016/10/13,5310.0,5303.863,5330.0,155600,5330.0,5260.0
522,2016/10/14,5300.0,5312.785,5310.0,136800,5370.0,5280.0
523,2016/10/17,5330.0,5326.331,5270.0,95400,5360.0,5270.0
524,2016/10/18,5450.0,5447.014,5400.0,190200,5490.0,5380.0
525,2016/10/19,5460.0,5466.937,5470.0,119500,5500.0,5430.0
526,2016/10/20,5460.0,5457.293,5470.0,123400,5480.0,5430.0
527,2016/10/21,5430.0,5416.832,5440.0,144900,5450.0,5370.0
528,2016/10/24,5460.0,5442.066,5420.0,130700,5470.0,5400.0
529,2016/10/25,5480.0,5485.044,5480.0,112800,5520.0,5470.0
530,2016/10/26,5550.0,5532.87,5510.0,161700,5560.0,5480.0
531,2016/10/27,5530.0,5539.629,5560.0,156500,5580.0,5510.0
532,2016/10/28,5490.0,5477.922,5570.0,222300,5590.0,5420.0
533,2016/10/31,5460.0,5447.196,5510.0,179400,5510.0,5360.0
534,2016/11/01,5410.0,5357.353,5290.0,250800,5420.0,5230.0
535,2016/11/02,5230.0,5259.545,5250.0,237200,5350.0,5210.0
536,2016/11/04,5160.0,5141.718,5190.0,171100,5190.0,5080.0
537,2016/11/07,5180.0,5188.626,5220.0,134600,5230.0,5150.0
538,2016/11/08,5110.0,5110.104,5170.0,163400,5180.0,5060.0
539,2016/11/09,4885.0,4945.896,5120.0,164100,5160.0,4855.0
540,2016/11/10,5220.0,5201.117,5230.0,264100,5250.0,5120.0
541,2016/11/11,5070.0,5116.613,5260.0,235000,5260.0,5040.0
542,2016/11/14,5130.0,5113.231,5120.0,218200,5140.0,5060.0
543,2016/11/15,5050.0,5059.456,5140.0,198500,5160.0,5020.0
544,2016/11/16,5160.0,5143.87,5120.0,207000,5170.0,5080.0
545,2016/11/17,5190.0,5173.571,5120.0,138600,5220.0,5110.0
546,2016/11/18,5080.0,5104.868,5170.0,204600,5180.0,5080.0
547,2016/11/21,4975.0,4982.465,4995.0,339600,5030.0,4960.0
548,2016/11/22,4965.0,4930.391,4935.0,452900,4975.0,4870.0
549,2016/11/24,4980.0,5008.974,4980.0,273500,5070.0,4980.0
550,2016/11/25,5030.0,5029.113,4970.0,224800,5070.0,4970.0
551,2016/11/28,4985.0,4990.991,4995.0,244100,5010.0,4975.0
552,2016/11/29,4970.0,4951.524,4915.0,318300,4995.0,4895.0
553,2016/11/30,5030.0,5018.945,4995.0,376200,5050.0,4980.0
554,2016/12/01,5060.0,5058.444,5080.0,311600,5090.0,5000.0
555,2016/12/02,4970.0,4994.569,5020.0,257500,5060.0,4965.0
556,2016/12/05,4895.0,4903.854,4980.0,228700,4990.0,4875.0
557,2016/12/06,4850.0,4869.688,4955.0,235900,4965.0,4840.0
558,2016/12/07,4900.0,4895.62,4940.0,262300,4940.0,4855.0
559,2016/12/08,4870.0,4873.246,4905.0,192700,4930.0,4845.0
560,2016/12/09,4930.0,4896.29,4815.0,306700,4950.0,4815.0
561,2016/12/12,4920.0,4905.025,4910.0,305400,4940.0,4870.0
562,2016/12/13,5020.0,5010.492,4920.0,204200,5040.0,4920.0
563,2016/12/14,5090.0,5095.627,5090.0,196900,5130.0,5070.0
564,2016/12/15,5110.0,5107.372,5090.0,249600,5130.0,5080.0
565,2016/12/16,5120.0,5125.145,5150.0,251900,5160.0,5100.0
566,2016/12/19,5140.0,5131.846,5100.0,193400,5160.0,5090.0
567,2016/12/20,5210.0,5186.709,5130.0,140700,5230.0,5110.0
568,2016/12/21,5110.0,5148.892,5210.0,197600,5210.0,5110.0
569,2016/12/22,5040.0,5043.782,5040.0,198600,5090.0,5020.0
570,2016/12/26,5100.0,5103.178,5090.0,126500,5140.0,5050.0
571,2016/12/27,5110.0,5130.053,5150.0,114300,5160.0,5100.0
572,2016/12/28,5090.0,5099.063,5120.0,139800,5120.0,5080.0
573,2016/12/29,5120.0,5108.807,5140.0,191100,5140.0,5060.0
574,2016/12/30,5110.0,5105.781,5110.0,106900,5130.0,5080.0
575,2017/01/04,5170.0,5174.864,5160.0,216300,5230.0,5120.0
576,2017/01/05,5340.0,5294.808,5190.0,312400,5340.0,5180.0
577,2017/01/06,5330.0,5327.003,5320.0,197200,5350.0,5300.0
578,2017/01/10,5230.0,5261.847,5290.0,198700,5340.0,5220.0
579,2017/01/11,5190.0,5189.821,5200.0,167800,5240.0,5170.0
580,2017/01/12,5130.0,5175.306,5280.0,202800,5280.0,5130.0
581,2017/01/13,5180.0,5169.54,5130.0,119600,5190.0,5130.0
582,2017/01/16,5150.0,5148.896,5140.0,124100,5190.0,5120.0
583,2017/01/17,5080.0,5096.253,5170.0,151300,5180.0,5070.0
584,2017/01/18,5060.0,5067.434,5080.0,147300,5100.0,5040.0
585,2017/01/19,5050.0,5063.243,5060.0,155700,5100.0,5040.0
586,2017/01/20,5050.0,5053.689,5060.0,135800,5080.0,5020.0
587,2017/01/23,4985.0,4993.793,5010.0,147500,5030.0,4950.0
588,2017/01/24,5000.0,4988.451,4985.0,180800,5020.0,4950.0
589,2017/01/25,5030.0,5036.743,5060.0,100400,5070.0,5020.0
590,2017/01/26,5230.0,5209.657,5120.0,309300,5260.0,5110.0
591,2017/01/27,5280.0,5265.976,5250.0,177200,5290.0,5210.0
592,2017/01/30,5370.0,5323.761,5220.0,274900,5390.0,5190.0
593,2017/01/31,5420.0,5397.226,5310.0,317200,5450.0,5300.0
594,2017/02/01,5340.0,5328.006,5370.0,216600,5390.0,5270.0
595,2017/02/02,5310.0,5330.405,5400.0,165400,5410.0,5290.0
596,2017/02/03,5270.0,5280.99,5310.0,283900,5340.0,5250.0
597,2017/02/06,5270.0,5271.1,5320.0,213700,5330.0,5230.0
598,2017/02/07,5280.0,5270.415,5270.0,149300,5300.0,5230.0
599,2017/02/08,5270.0,5271.919,5330.0,155300,5330.0,5240.0
600,2017/02/09,5160.0,5182.413,5220.0,184000,5230.0,5160.0
601,2017/02/10,5230.0,5221.809,5240.0,133800,5250.0,5190.0
602,2017/02/13,5280.0,5285.925,5300.0,204400,5320.0,5250.0
603,2017/02/14,5390.0,5380.04,5300.0,326900,5420.0,5280.0
604,2017/02/15,5390.0,5412.554,5490.0,160900,5500.0,5370.0
605,2017/02/16,5390.0,5371.355,5380.0,154200,5400.0,5330.0
606,2017/02/17,5370.0,5350.174,5310.0,138100,5380.0,5290.0
607,2017/02/20,5350.0,5338.215,5350.0,180900,5380.0,5290.0
608,2017/02/21,5310.0,5311.053,5370.0,88300,5370.0,5290.0
609,2017/02/22,5280.0,5267.021,5280.0,206100,5290.0,5230.0
610,2017/02/23,5290.0,5288.454,5290.0,223200,5330.0,5240.0
611,2017/02/24,5240.0,5252.296,5280.0,167700,5290.0,5220.0
612,2017/02/27,5270.0,5256.909,5220.0,246500,5290.0,5210.0
613,2017/02/28,5230.0,5257.212,5320.0,297700,5320.0,5210.0
614,2017/03/01,5250.0,5245.875,5240.0,252100,5280.0,5200.0
615,2017/03/02,5260.0,5261.19,5310.0,146200,5320.0,5230.0
616,2017/03/03,5220.0,5221.558,5260.0,171400,5290.0,5190.0
617,2017/03/06,5250.0,5249.091,5240.0,96800,5270.0,5210.0
618,2017/03/07,5310.0,5306.386,5250.0,192300,5340.0,5240.0
619,2017/03/08,5400.0,5410.711,5450.0,312300,5450.0,5370.0
620,2017/03/09,5430.0,5420.473,5440.0,179700,5450.0,5380.0
621,2017/03/10,5400.0,5417.477,5430.0,264000,5450.0,5380.0
622,2017/03/13,5440.0,5448.403,5410.0,154000,5480.0,5410.0
623,2017/03/14,5400.0,5392.78,5400.0,123400,5420.0,5350.0
624,2017/03/15,5340.0,5349.992,5360.0,126600,5380.0,5340.0
625,2017/03/16,5390.0,5358.454,5300.0,159100,5390.0,5280.0
626,2017/03/17,5390.0,5384.849,5350.0,201700,5400.0,5350.0
627,2017/03/21,5390.0,5381.392,5350.0,106300,5410.0,5350.0
628,2017/03/22,5300.0,5334.123,5310.0,179000,5400.0,5300.0
629,2017/03/23,5330.0,5333.446,5330.0,144800,5400.0,5300.0
630,2017/03/24,5400.0,5390.636,5370.0,125800,5410.0,5340.0
631,2017/03/27,5320.0,5334.641,5350.0,160300,5380.0,5290.0
632,2017/03/28,5420.0,5411.291,5390.0,214600,5440.0,5380.0
633,2017/03/29,5410.0,5415.836,5470.0,202200,5480.0,5380.0
634,2017/03/30,5360.0,5369.169,5390.0,229700,5420.0,5340.0
635,2017/03/31,5300.0,5353.351,5390.0,284700,5420.0,5300.0
636,2017/04/03,5380.0,5350.173,5310.0,225300,5410.0,5290.0
637,2017/04/04,5410.0,5422.14,5470.0,303300,5480.0,5380.0
638,2017/04/05,5390.0,5416.136,5410.0,257000,5450.0,5390.0
639,2017/04/06,5260.0,5303.463,5380.0,224100,5390.0,5260.0
640,2017/04/07,5310.0,5316.46,5340.0,243200,5350.0,5260.0
641,2017/04/10,5290.0,5313.069,5360.0,188000,5370.0,5270.0
642,2017/04/11,5290.0,5297.195,5310.0,181800,5350.0,5270.0
643,2017/04/12,5290.0,5274.331,5270.0,187500,5300.0,5240.0
644,2017/04/13,5310.0,5302.16,5290.0,177800,5350.0,5260.0
645,2017/04/14,5210.0,5248.856,5310.0,122400,5330.0,5210.0
646,2017/04/17,5350.0,5317.075,5230.0,188700,5360.0,5210.0
647,2017/04/18,5400.0,5385.202,5410.0,173600,5430.0,5340.0
648,2017/04/19,5450.0,5445.83,5350.0,184400,5490.0,5350.0
649,2017/04/20,5460.0,5458.071,5490.0,211500,5500.0,5420.0
650,2017/04/21,5400.0,5400.013,5450.0,153800,5450.0,5360.0
651,2017/04/24,5500.0,5469.473,5480.0,193700,5500.0,5420.0
652,2017/04/25,5540.0,5509.357,5470.0,228500,5540.0,5440.0
653,2017/04/26,5960.0,5904.758,5740.0,762300,6000.0,5740.0
654,2017/04/27,6080.0,6041.374,6000.0,583900,6130.0,5960.0
655,2017/04/28,6020.0,6028.833,6070.0,268200,6100.0,5990.0
656,2017/05/01,6130.0,6113.888,6040.0,205500,6160.0,6040.0
657,2017/05/02,6100.0,6150.419,6250.0,238800,6250.0,6090.0
658,2017/05/08,6280.0,6271.745,6260.0,356400,6300.0,6240.0
659,2017/05/09,6210.0,6217.169,6260.0,248000,6280.0,6180.0
660,2017/05/10,6260.0,6269.125,6230.0,258400,6310.0,6230.0
661,2017/05/11,6320.0,6334.215,6310.0,242000,6380.0,6310.0
662,2017/05/12,6290.0,6276.689,6260.0,135000,6310.0,6240.0
663,2017/05/15,6350.0,6331.841,6280.0,161300,6370.0,6280.0
664,2017/05/16,6390.0,6397.398,6400.0,142600,6440.0,6370.0
665,2017/05/17,6410.0,6428.509,6430.0,165600,6460.0,6400.0
666,2017/05/18,6450.0,6428.2,6340.0,206100,6460.0,6340.0
667,2017/05/19,6480.0,6486.833,6480.0,261100,6530.0,6470.0
668,2017/05/22,6490.0,6479.341,6470.0,142600,6500.0,6450.0
669,2017/05/23,6570.0,6577.687,6600.0,181600,6620.0,6540.0
670,2017/05/24,6610.0,6591.032,6630.0,210200,6640.0,6550.0
671,2017/05/25,6600.0,6604.118,6610.0,132600,6640.0,6580.0
672,2017/05/26,6530.0,6531.197,6440.0,254900,6570.0,6440.0
673,2017/05/29,6520.0,6518.087,6500.0,198100,6540.0,6490.0
674,2017/05/30,6470.0,6479.392,6500.0,215500,6520.0,6450.0
675,2017/05/31,6430.0,6443.683,6470.0,257700,6500.0,6410.0
676,2017/06/01,6590.0,6580.826,6500.0,220400,6620.0,6490.0
677,2017/06/02,6520.0,6552.5,6650.0,278800,6660.0,6500.0
678,2017/06/05,6520.0,6510.856,6450.0,163600,6560.0,6410.0
679,2017/06/06,6450.0,6420.433,6460.0,242800,6490.0,6350.0
680,2017/06/07,6460.0,6439.995,6400.0,202100,6460.0,6380.0
681,2017/06/08,6400.0,6427.471,6480.0,187400,6490.0,6380.0
682,2017/06/09,6310.0,6319.077,6300.0,280700,6380.0,6290.0
683,2017/06/12,6300.0,6262.111,6260.0,191400,6330.0,6160.0
684,2017/06/13,6270.0,6289.284,6290.0,231900,6380.0,6250.0
685,2017/06/14,6270.0,6292.909,6290.0,166400,6360.0,6260.0
686,2017/06/15,6340.0,6319.742,6310.0,170300,6360.0,6260.0
687,2017/06/16,6450.0,6430.435,6430.0,390600,6490.0,6350.0
688,2017/06/19,6550.0,6551.275,6460.0,167800,6600.0,6460.0
689,2017/06/20,6700.0,6701.549,6600.0,294400,6760.0,6590.0
690,2017/06/21,6770.0,6773.625,6810.0,241400,6810.0,6710.0
691,2017/06/22,6920.0,6913.933,6820.0,281500,6960.0,6800.0
692,2017/06/23,6890.0,6894.615,6970.0,124800,6970.0,6870.0
693,2017/06/26,6990.0,6940.051,6940.0,196400,7000.0,6880.0
694,2017/06/27,6950.0,6989.268,7090.0,158500,7110.0,6940.0
695,2017/06/28,6890.0,6896.987,6930.0,200100,6940.0,6870.0
696,2017/06/29,7020.0,7083.817,7150.0,325100,7180.0,6990.0
697,2017/06/30,6900.0,6907.084,6910.0,283300,6960.0,6870.0
698,2017/07/03,6960.0,6947.361,6980.0,212200,6990.0,6890.0
699,2017/07/04,6760.0,6811.49,7000.0,302100,7000.0,6740.0
700,2017/07/05,6760.0,6716.485,6690.0,275100,6760.0,6640.0
701,2017/07/06,6800.0,6802.16,6760.0,150500,6840.0,6750.0
702,2017/07/07,6790.0,6792.013,6760.0,160500,6830.0,6740.0
703,2017/07/10,6860.0,6864.848,6830.0,160900,6920.0,6810.0
704,2017/07/11,6970.0,6923.977,6850.0,129000,6980.0,6840.0
705,2017/07/12,6910.0,6910.254,6920.0,137900,6970.0,6860.0
706,2017/07/13,6990.0,6974.594,6920.0,73800,7000.0,6910.0
707,2017/07/14,6970.0,6972.559,6990.0,139100,7000.0,6930.0
708,2017/07/18,6960.0,6952.49,6940.0,103600,6980.0,6910.0
709,2017/07/19,7060.0,7037.128,6930.0,132300,7070.0,6930.0
710,2017/07/20,7140.0,7117.726,7070.0,142500,7150.0,7030.0
711,2017/07/21,7130.0,7108.216,7080.0,160900,7150.0,7010.0
712,2017/07/24,7180.0,7143.543,7120.0,189100,7190.0,7090.0
713,2017/07/25,7050.0,7082.14,7140.0,276700,7160.0,6990.0
714,2017/07/26,6700.0,6795.015,6980.0,793900,7010.0,6680.0
715,2017/07/27,6720.0,6746.281,6700.0,462500,6800.0,6700.0
716,2017/07/28,6840.0,6810.439,6790.0,239400,6850.0,6720.0
717,2017/07/31,6890.0,6941.133,7040.0,399100,7050.0,6890.0
718,2017/08/01,6900.0,6905.936,6890.0,166100,6940.0,6860.0
719,2017/08/02,6870.0,6892.214,6910.0,180200,6930.0,6850.0
720,2017/08/03,6940.0,6939.052,6870.0,136100,7000.0,6870.0
721,2017/08/04,7020.0,7017.406,6950.0,129900,7060.0,6930.0
722,2017/08/07,6970.0,6999.743,7020.0,147600,7040.0,6960.0
723,2017/08/08,6930.0,6905.925,6910.0,237800,6960.0,6850.0
724,2017/08/09,6880.0,6862.272,6900.0,250900,6920.0,6800.0
725,2017/08/10,6890.0,6894.956,6880.0,157600,6940.0,6850.0
726,2017/08/14,6780.0,6818.397,6850.0,276300,6900.0,6770.0
727,2017/08/15,6850.0,6850.831,6810.0,257400,6890.0,6790.0
728,2017/08/16,6920.0,6937.092,6930.0,152000,6970.0,6890.0
729,2017/08/17,6910.0,6931.977,6910.0,122400,6970.0,6900.0
730,2017/08/18,6790.0,6806.269,6810.0,138300,6840.0,6780.0
731,2017/08/21,6910.0,6895.235,6840.0,172100,6930.0,6840.0
732,2017/08/22,6890.0,6912.557,6880.0,114600,6970.0,6870.0
733,2017/08/23,6860.0,6873.648,6940.0,170500,6950.0,6840.0
734,2017/08/24,6790.0,6813.877,6820.0,125100,6880.0,6790.0
735,2017/08/25,6770.0,6758.728,6800.0,120300,6800.0,6700.0
736,2017/08/28,6800.0,6808.237,6780.0,146300,6850.0,6770.0
737,2017/08/29,6820.0,6817.561,6750.0,109900,6850.0,6740.0
738,2017/08/30,6850.0,6867.097,6860.0,142600,6910.0,6830.0
739,2017/08/31,6890.0,6898.677,6860.0,163300,6930.0,6860.0
740,2017/09/01,6910.0,6911.918,6940.0,140800,6950.0,6880.0
741,2017/09/04,6870.0,6872.864,6910.0,128500,6920.0,6810.0
742,2017/09/05,6690.0,6753.864,6880.0,111800,6880.0,6690.0
743,2017/09/06,6740.0,6716.897,6640.0,143100,6760.0,6620.0
744,2017/09/07,6750.0,6759.129,6720.0,148100,6830.0,6700.0
745,2017/09/08,6780.0,6789.96,6790.0,249900,6820.0,6750.0
746,2017/09/11,6820.0,6824.348,6800.0,78200,6850.0,6780.0
747,2017/09/12,6910.0,6908.657,6890.0,136300,6950.0,6850.0
748,2017/09/13,6960.0,6954.194,6950.0,114700,6990.0,6920.0
749,2017/09/14,6930.0,6941.27,6920.0,129100,6980.0,6900.0
750,2017/09/15,6860.0,6872.244,6950.0,234000,6960.0,6840.0
751,2017/09/19,6940.0,6928.577,6940.0,120900,6950.0,6890.0
752,2017/09/20,6840.0,6845.629,6920.0,154900,6930.0,6800.0
753,2017/09/21,6800.0,6807.062,6900.0,155900,6900.0,6780.0
754,2017/09/22,6780.0,6806.762,6830.0,139900,6880.0,6770.0
755,2017/09/25,6910.0,6898.519,6860.0,122900,6950.0,6820.0
756,2017/09/26,7000.0,6983.101,6950.0,178000,7000.0,6930.0
757,2017/09/27,6920.0,6906.469,6990.0,111300,7000.0,6850.0
758,2017/09/28,7050.0,7018.026,6930.0,121100,7070.0,6870.0
759,2017/09/29,7080.0,7086.809,7090.0,185500,7120.0,7060.0
760,2017/10/02,6980.0,7014.592,7090.0,83400,7100.0,6960.0
761,2017/10/03,6900.0,6892.415,6940.0,164800,6940.0,6860.0
762,2017/10/04,6890.0,6917.563,6960.0,139100,6990.0,6880.0
763,2017/10/05,6850.0,6850.209,6870.0,138800,6880.0,6830.0
764,2017/10/06,6840.0,6851.053,6870.0,173800,6890.0,6810.0
765,2017/10/10,6810.0,6787.166,6740.0,279800,6830.0,6730.0
766,2017/10/11,6900.0,6874.93,6820.0,150300,6910.0,6810.0
767,2017/10/12,6950.0,6942.362,6940.0,133800,6970.0,6910.0
768,2017/10/13,6920.0,6921.945,6930.0,261700,6970.0,6900.0
769,2017/10/16,7040.0,7046.375,7020.0,204700,7100.0,6980.0
770,2017/10/17,7120.0,7074.309,7090.0,207700,7120.0,6990.0
771,2017/10/18,7160.0,7156.208,7090.0,160600,7190.0,7090.0
772,2017/10/19,7120.0,7114.933,7150.0,111700,7150.0,7080.0
773,2017/10/20,7220.0,7150.057,7060.0,210300,7220.0,7020.0
774,2017/10/23,7220.0,7223.699,7290.0,129500,7300.0,7180.0
775,2017/10/24,7260.0,7247.622,7220.0,135400,7310.0,7210.0
776,2017/10/25,7150.0,7165.341,7280.0,136500,7280.0,7130.0
777,2017/10/26,7120.0,7105.804,7120.0,134900,7140.0,7080.0
778,2017/10/27,7270.0,7216.762,7140.0,164900,7270.0,7110.0
779,2017/10/30,7310.0,7304.582,7280.0,515300,7360.0,7230.0
780,2017/10/31,7470.0,7443.908,7510.0,277100,7550.0,7320.0
781,2017/11/01,7750.0,7689.791,7570.0,344000,7760.0,7520.0
782,2017/11/02,7770.0,7748.544,7760.0,150400,7820.0,7690.0
783,2017/11/06,7650.0,7655.849,7620.0,229100,7740.0,7590.0
784,2017/11/07,7720.0,7669.356,7580.0,188000,7730.0,7550.0
785,2017/11/08,7720.0,7706.378,7680.0,130300,7740.0,7630.0
786,2017/11/09,7730.0,7761.254,7750.0,220100,7850.0,7660.0
787,2017/11/10,7650.0,7652.268,7640.0,138900,7700.0,7620.0
788,2017/11/13,7490.0,7510.95,7530.0,247300,7570.0,7480.0
789,2017/11/14,7420.0,7428.314,7360.0,139400,7480.0,7330.0
790,2017/11/15,7300.0,7317.678,7370.0,229500,7420.0,7250.0
791,2017/11/16,7500.0,7470.345,7300.0,206000,7570.0,7280.0
792,2017/11/17,7510.0,7544.554,7620.0,163800,7650.0,7490.0
793,2017/11/20,7510.0,7503.897,7410.0,163700,7560.0,7370.0
794,2017/11/21,7580.0,7594.353,7550.0,129800,7640.0,7510.0
795,2017/11/22,7590.0,7576.676,7580.0,113100,7610.0,7530.0
796,2017/11/24,7570.0,7556.752,7550.0,73900,7580.0,7510.0
797,2017/11/27,7650.0,7653.51,7670.0,147600,7710.0,7610.0
798,2017/11/28,7650.0,7623.118,7640.0,83700,7650.0,7540.0
799,2017/11/29,7780.0,7754.377,7710.0,159700,7780.0,7680.0
800,2017/11/30,7790.0,7742.472,7760.0,334500,7790.0,7580.0
801,2017/12/01,7830.0,7849.096,7900.0,172600,7930.0,7770.0
802,2017/12/04,7790.0,7821.499,7910.0,170100,7920.0,7790.0
803,2017/12/05,7770.0,7757.177,7790.0,109100,7800.0,7690.0
804,2017/12/06,7740.0,7759.459,7800.0,251200,7870.0,7660.0
805,2017/12/07,7830.0,7841.081,7780.0,255300,7900.0,7780.0
806,2017/12/08,7900.0,7832.27,7770.0,234800,7910.0,7770.0
807,2017/12/11,8100.0,8022.523,8000.0,182300,8100.0,7900.0
808,2017/12/12,8060.0,8045.629,8050.0,100200,8090.0,8000.0
809,2017/12/13,8100.0,8103.194,8080.0,122100,8140.0,8070.0
810,2017/12/14,8070.0,8081.194,8130.0,174200,8140.0,8040.0
811,2017/12/15,8060.0,8050.406,8100.0,302700,8130.0,7960.0
812,2017/12/18,8180.0,8149.694,8150.0,146900,8210.0,8040.0
813,2017/12/19,8170.0,8173.195,8270.0,127400,8300.0,8120.0
814,2017/12/20,8160.0,8162.899,8170.0,92100,8190.0,8130.0
815,2017/12/21,8260.0,8216.408,8160.0,92700,8260.0,8120.0
816,2017/12/22,8340.0,8302.986,8270.0,135300,8340.0,8220.0
817,2017/12/25,8360.0,8345.771,8310.0,70000,8400.0,8300.0
818,2017/12/26,8460.0,8475.854,8510.0,144700,8590.0,8430.0
819,2017/12/27,8460.0,8460.255,8460.0,101900,8520.0,8420.0
820,2017/12/28,8340.0,8365.022,8470.0,157900,8480.0,8270.0
821,2017/12/29,8280.0,8305.012,8370.0,81600,8370.0,8260.0
822,2018/01/04,8510.0,8464.904,8460.0,222700,8510.0,8390.0
823,2018/01/05,8550.0,8537.313,8600.0,191300,8640.0,8460.0
824,2018/01/09,8490.0,8490.627,8550.0,138700,8560.0,8460.0
825,2018/01/10,8470.0,8457.838,8430.0,155400,8500.0,8400.0
826,2018/01/11,8450.0,8434.678,8470.0,110100,8520.0,8390.0
827,2018/01/12,8400.0,8347.161,8390.0,232800,8420.0,8230.0
828,2018/01/15,8470.0,8485.514,8510.0,141100,8560.0,8430.0
829,2018/01/16,9030.0,8995.054,9060.0,422600,9140.0,8870.0
830,2018/01/17,8970.0,8960.398,8970.0,153400,9010.0,8920.0
831,2018/01/18,8890.0,8966.53,9230.0,195700,9240.0,8870.0
832,2018/01/19,8910.0,8897.133,8900.0,112300,8970.0,8850.0
833,2018/01/22,8930.0,8912.896,8920.0,96700,8940.0,8870.0
834,2018/01/23,9000.0,9000.646,9000.0,185800,9040.0,8960.0
835,2018/01/24,8810.0,8846.586,8940.0,206500,8980.0,8800.0
836,2018/01/25,8680.0,8685.03,8740.0,322100,8740.0,8560.0
837,2018/01/26,8900.0,8918.067,8980.0,431500,9100.0,8790.0
838,2018/01/29,8870.0,8920.568,9080.0,167400,9080.0,8840.0
839,2018/01/30,8730.0,8765.213,8900.0,206800,8900.0,8720.0
840,2018/01/31,8490.0,8562.69,8660.0,295200,8730.0,8490.0
841,2018/02/01,8790.0,8717.871,8550.0,277100,8800.0,8510.0
842,2018/02/02,8930.0,8872.134,8660.0,210400,8960.0,8660.0
843,2018/02/05,8620.0,8658.433,8700.0,220800,8750.0,8610.0
844,2018/02/06,8230.0,8216.568,8240.0,338600,8330.0,8070.0
845,2018/02/07,8200.0,8328.069,8350.0,225300,8550.0,8200.0
846,2018/02/08,8330.0,8334.275,8220.0,168900,8390.0,8220.0
847,2018/02/09,8190.0,8126.022,8030.0,157100,8200.0,8010.0
848,2018/02/13,8180.0,8216.783,8320.0,185900,8380.0,8130.0
849,2018/02/14,8180.0,8157.11,8210.0,188900,8240.0,8060.0
850,2018/02/15,8320.0,8330.04,8260.0,173600,8390.0,8220.0
851,2018/02/16,8460.0,8444.583,8380.0,235200,8520.0,8310.0
852,2018/02/19,8700.0,8646.1,8610.0,120500,8700.0,8570.0
853,2018/02/20,8570.0,8564.792,8600.0,149000,8640.0,8510.0
854,2018/02/21,8660.0,8635.052,8550.0,96400,8720.0,8540.0
855,2018/02/22,8610.0,8590.202,8550.0,109200,8640.0,8520.0
856,2018/02/23,8640.0,8586.261,8500.0,93600,8650.0,8500.0
857,2018/02/26,8690.0,8675.156,8740.0,89600,8740.0,8580.0
858,2018/02/27,8870.0,8844.688,8840.0,144000,8890.0,8730.0
859,2018/02/28,8940.0,8959.741,8860.0,216500,9020.0,8860.0
860,2018/03/01,8750.0,8784.017,8840.0,161300,8880.0,8730.0
861,2018/03/02,8610.0,8593.7,8540.0,92700,8660.0,8520.0
862,2018/03/05,8680.0,8665.077,8570.0,168400,8720.0,8570.0
863,2018/03/06,8990.0,8955.984,8780.0,243800,9030.0,8780.0
864,2018/03/07,8940.0,8929.67,8890.0,151600,9010.0,8830.0
865,2018/03/08,8920.0,8909.25,9000.0,142700,9010.0,8840.0
866,2018/03/09,8900.0,8932.415,9000.0,269200,9010.0,8860.0
867,2018/03/12,9030.0,9020.368,9080.0,103400,9080.0,8940.0
868,2018/03/13,9120.0,9075.814,8920.0,97700,9130.0,8910.0
869,2018/03/14,9200.0,9168.852,9120.0,135000,9220.0,9030.0
870,2018/03/15,9450.0,9381.359,9210.0,143500,9460.0,9180.0
871,2018/03/16,9510.0,9473.962,9480.0,353900,9520.0,9330.0
872,2018/03/19,9320.0,9332.197,9490.0,153400,9490.0,9190.0
873,2018/03/20,9080.0,9023.34,9020.0,250900,9100.0,8880.0
874,2018/03/22,9000.0,9004.382,9000.0,345700,9060.0,8970.0
875,2018/03/23,8670.0,8720.444,8710.0,349300,8810.0,8640.0
876,2018/03/26,8700.0,8656.793,8590.0,282500,8700.0,8560.0
877,2018/03/27,8950.0,8945.2,8990.0,302100,9000.0,8860.0
878,2018/03/28,8850.0,8854.265,8890.0,251800,8950.0,8780.0
879,2018/03/29,8830.0,8854.053,8850.0,365200,8940.0,8780.0
880,2018/03/30,8850.0,8837.868,8930.0,185300,8960.0,8780.0
881,2018/04/02,8890.0,8896.586,8860.0,182200,8940.0,8860.0
882,2018/04/03,8910.0,8899.567,8830.0,238000,8950.0,8810.0
883,2018/04/04,8930.0,8927.133,8950.0,348500,8960.0,8860.0
884,2018/04/05,8940.0,8958.232,9030.0,241500,9050.0,8890.0
885,2018/04/06,8990.0,9048.143,9070.0,378000,9130.0,8980.0
886,2018/04/09,9150.0,9111.385,9000.0,165300,9190.0,8960.0
887,2018/04/10,9070.0,9102.845,9140.0,188400,9190.0,9030.0
888,2018/04/11,8800.0,8795.46,9000.0,197800,9010.0,8710.0
889,2018/04/12,8990.0,8949.237,8800.0,175700,9010.0,8800.0
890,2018/04/13,9000.0,8980.499,9050.0,164300,9070.0,8860.0
891,2018/04/16,9020.0,9039.246,9000.0,169800,9120.0,8990.0
892,2018/04/17,9010.0,9023.476,8970.0,168000,9100.0,8970.0
893,2018/04/18,9110.0,9101.717,9020.0,205600,9150.0,9020.0
894,2018/04/19,8940.0,8984.854,9190.0,171600,9190.0,8910.0
895,2018/04/20,8970.0,8961.971,8910.0,124300,9010.0,8890.0
896,2018/04/23,8790.0,8811.281,8970.0,179600,8970.0,8750.0
897,2018/04/24,8800.0,8780.541,8790.0,195800,8840.0,8730.0
898,2018/04/25,8850.0,8823.906,8840.0,167700,8890.0,8750.0
899,2018/04/26,8890.0,8896.034,8850.0,340900,8970.0,8790.0
900,2018/04/27,9170.0,9162.743,8970.0,363500,9290.0,8960.0
901,2018/05/01,9350.0,9320.909,9100.0,203600,9480.0,9070.0
902,2018/05/02,9480.0,9426.15,9400.0,193000,9480.0,9310.0
903,2018/05/07,9390.0,9446.515,9540.0,156100,9580.0,9370.0
904,2018/05/08,9300.0,9330.912,9420.0,153500,9440.0,9270.0
905,2018/05/09,9380.0,9406.69,9410.0,184000,9490.0,9350.0
906,2018/05/10,9360.0,9356.285,9430.0,111700,9430.0,9290.0
907,2018/05/11,9390.0,9395.737,9360.0,179000,9480.0,9340.0
908,2018/05/14,9220.0,9245.495,9400.0,194000,9400.0,9190.0
909,2018/05/15,9080.0,9132.045,9220.0,195600,9230.0,9080.0
910,2018/05/16,9090.0,9106.621,9070.0,153300,9160.0,9070.0
911,2018/05/17,9040.0,9050.601,9140.0,158000,9140.0,9000.0
912,2018/05/18,9120.0,9107.151,9140.0,167400,9170.0,9050.0
913,2018/05/21,9200.0,9194.609,9160.0,130400,9230.0,9130.0
914,2018/05/22,9220.0,9193.058,9220.0,99100,9260.0,9130.0
915,2018/05/23,9220.0,9226.546,9200.0,126800,9300.0,9180.0
916,2018/05/24,9220.0,9237.278,9250.0,139600,9310.0,9200.0
917,2018/05/25,9320.0,9326.484,9280.0,124000,9390.0,9250.0
918,2018/05/28,9410.0,9411.488,9320.0,116300,9460.0,9310.0
919,2018/05/29,9390.0,9376.827,9400.0,118800,9410.0,9290.0
920,2018/05/30,9220.0,9234.236,9200.0,130300,9290.0,9190.0
921,2018/05/31,9420.0,9402.713,9280.0,227800,9460.0,9240.0
922,2018/06/01,9430.0,9447.691,9400.0,141200,9520.0,9380.0
923,2018/06/04,9620.0,9606.151,9500.0,143400,9650.0,9480.0
924,2018/06/05,9860.0,9811.143,9640.0,218800,9890.0,9630.0
925,2018/06/06,9610.0,9662.721,9830.0,228200,9830.0,9600.0
926,2018/06/07,9480.0,9500.922,9620.0,267900,9660.0,9410.0
927,2018/06/08,9600.0,9543.375,9430.0,283000,9620.0,9430.0
928,2018/06/11,9650.0,9609.431,9600.0,147600,9690.0,9530.0
929,2018/06/12,9690.0,9676.186,9620.0,109600,9740.0,9570.0
930,2018/06/13,9620.0,9650.172,9730.0,121800,9770.0,9600.0
931,2018/06/14,9570.0,9572.267,9600.0,147800,9610.0,9480.0
932,2018/06/15,9630.0,9624.599,9610.0,301800,9660.0,9570.0
933,2018/06/18,9660.0,9631.597,9600.0,100200,9680.0,9540.0
934,2018/06/19,9540.0,9566.616,9540.0,191800,9650.0,9510.0
935,2018/06/20,9450.0,9455.923,9490.0,218300,9580.0,9380.0
936,2018/06/21,9330.0,9359.343,9370.0,203900,9440.0,9310.0
937,2018/06/22,9360.0,9333.709,9240.0,252600,9400.0,9210.0
938,2018/06/25,9230.0,9246.63,9270.0,183700,9360.0,9200.0
939,2018/06/26,9140.0,9130.527,9160.0,201300,9180.0,9070.0
940,2018/06/27,9230.0,9195.478,9110.0,126700,9270.0,9090.0
941,2018/06/28,9190.0,9174.975,9220.0,217500,9220.0,9070.0
942,2018/06/29,9170.0,9158.882,9230.0,216400,9250.0,9050.0
943,2018/07/02,9020.0,9125.269,9170.0,124700,9280.0,9010.0
944,2018/07/03,9010.0,9037.513,9020.0,232800,9180.0,8960.0
945,2018/07/04,9110.0,9090.309,9010.0,268300,9160.0,9000.0
946,2018/07/05,9150.0,9154.477,9140.0,244600,9230.0,9090.0
947,2018/07/06,9050.0,9043.578,9120.0,163500,9120.0,8960.0
948,2018/07/09,9200.0,9194.742,9120.0,163000,9270.0,9120.0
949,2018/07/10,9020.0,9091.056,9230.0,203600,9270.0,9020.0
950,2018/07/11,9000.0,8974.224,8920.0,193200,9030.0,8860.0
951,2018/07/12,9140.0,9166.724,9070.0,175200,9250.0,9070.0
952,2018/07/13,9280.0,9274.319,9240.0,147500,9310.0,9210.0
953,2018/07/17,9530.0,9504.945,9450.0,225900,9570.0,9340.0
954,2018/07/18,9450.0,9460.591,9580.0,138800,9590.0,9370.0
955,2018/07/19,9380.0,9423.305,9500.0,153400,9510.0,9380.0
956,2018/07/20,9430.0,9409.092,9380.0,133200,9450.0,9340.0
957,2018/07/23,9360.0,9400.991,9380.0,114000,9490.0,9350.0
958,2018/07/24,9330.0,9365.809,9440.0,118100,9450.0,9300.0
959,2018/07/25,9310.0,9277.229,9240.0,141800,9340.0,9170.0
960,2018/07/26,9970.0,10146.332,10060.0,632200,10640.0,9880.0
961,2018/07/27,10010.0,9971.786,10100.0,209400,10110.0,9820.0
962,2018/07/30,9550.0,9629.178,9840.0,249400,9850.0,9540.0
963,2018/07/31,9580.0,9530.464,9500.0,342500,9630.0,9380.0
964,2018/08/01,9990.0,9883.059,9730.0,354000,10050.0,9690.0
965,2018/08/02,9750.0,9843.245,9990.0,162100,10050.0,9720.0
966,2018/08/03,9660.0,9686.372,9820.0,126800,9840.0,9620.0
967,2018/08/06,9620.0,9660.123,9700.0,105400,9760.0,9620.0
968,2018/08/07,9730.0,9695.444,9630.0,125100,9760.0,9590.0
969,2018/08/08,9630.0,9676.989,9690.0,149100,9770.0,9630.0
970,2018/08/09,9770.0,9753.858,9640.0,108100,9810.0,9620.0
971,2018/08/10,9590.0,9623.135,9740.0,210200,9750.0,9550.0
972,2018/08/13,9340.0,9397.137,9500.0,180600,9550.0,9330.0
973,2018/08/14,9490.0,9456.674,9350.0,135900,9520.0,9350.0
974,2018/08/15,9550.0,9532.776,9500.0,147000,9590.0,9470.0
975,2018/08/16,9600.0,9597.792,9540.0,247700,9690.0,9440.0
976,2018/08/17,9750.0,9735.425,9600.0,233200,9820.0,9510.0
977,2018/08/20,9640.0,9639.413,9650.0,117600,9690.0,9580.0
978,2018/08/21,9620.0,9620.7,9570.0,74300,9660.0,9550.0
979,2018/08/22,9640.0,9633.327,9660.0,110600,9680.0,9590.0
980,2018/08/23,9670.0,9686.451,9640.0,115800,9730.0,9630.0
981,2018/08/24,9940.0,9902.668,9800.0,80600,9960.0,9790.0
982,2018/08/27,10060.0,10048.086,10080.0,102900,10100.0,9970.0
983,2018/08/28,10080.0,10093.747,10150.0,117700,10200.0,10020.0
984,2018/08/29,10150.0,10164.568,10120.0,137700,10250.0,10090.0
985,2018/08/30,10310.0,10310.291,10210.0,227000,10370.0,10210.0
986,2018/08/31,10440.0,10422.531,10250.0,273000,10510.0,10240.0
987,2018/09/03,10520.0,10489.067,10420.0,209000,10570.0,10370.0
988,2018/09/04,10840.0,10791.34,10600.0,253700,10920.0,10570.0
989,2018/09/05,10850.0,10809.157,10810.0,193300,10880.0,10730.0
990,2018/09/06,10400.0,10440.916,10570.0,307900,10620.0,10360.0
991,2018/09/07,10410.0,10413.259,10400.0,191800,10520.0,10350.0
992,2018/09/10,10350.0,10338.1,10330.0,171600,10460.0,10280.0
993,2018/09/11,10390.0,10378.725,10320.0,163100,10480.0,10290.0
994,2018/09/12,10480.0,10452.647,10450.0,234200,10520.0,10350.0
995,2018/09/13,10410.0,10408.834,10430.0,197200,10540.0,10340.0
996,2018/09/14,10490.0,10482.775,10500.0,236800,10540.0,10380.0
997,2018/09/18,10670.0,10542.094,10400.0,233100,10690.0,10360.0
998,2018/09/19,10510.0,10540.482,10680.0,344400,10680.0,10490.0
999,2018/09/20,10430.0,10399.974,10480.0,306600,10490.0,10290.0
1000,2018/09/21,10410.0,10430.711,10510.0,389700,10580.0,10380.0
1001,2018/09/25,10780.0,10703.384,10470.0,393600,10780.0,10460.0
1002,2018/09/26,11080.0,10988.506,10790.0,383600,11090.0,10770.0
1003,2018/09/27,10750.0,10829.832,10940.0,220100,10990.0,10730.0
1004,2018/09/28,10750.0,10771.382,10780.0,316200,10860.0,10710.0
1005,2018/10/01,10790.0,10814.314,10760.0,170600,10870.0,10760.0
1006,2018/10/02,10780.0,10829.161,10850.0,235900,10900.0,10760.0
1007,2018/10/03,10740.0,10787.467,10820.0,230200,10880.0,10710.0
1008,2018/10/04,10670.0,10734.937,10840.0,229300,10890.0,10660.0
1009,2018/10/05,10690.0,10663.083,10620.0,201100,10710.0,10590.0
1010,2018/10/09,10590.0,10620.557,10540.0,409500,10760.0,10520.0
1011,2018/10/10,10640.0,10643.846,10630.0,252500,10740.0,10560.0
1012,2018/10/11,10450.0,10416.013,10340.0,451500,10530.0,10270.0
1013,2018/10/12,10600.0,10612.782,10490.0,423500,10710.0,10490.0
1014,2018/10/15,10210.0,10270.881,10400.0,271300,10450.0,10200.0
1015,2018/10/16,10050.0,10046.404,10160.0,301400,10190.0,9960.0
1016,2018/10/17,10380.0,10366.511,10210.0,211800,10460.0,10200.0
1017,2018/10/18,10350.0,10454.548,10600.0,312200,10740.0,10340.0
1018,2018/10/19,10170.0,10159.668,10140.0,282900,10270.0,10080.0
1019,2018/10/22,10050.0,10002.216,9950.0,325800,10090.0,9860.0
1020,2018/10/23,9800.0,9829.655,9990.0,290200,9990.0,9780.0
1021,2018/10/24,9770.0,9778.117,9760.0,234200,9850.0,9690.0
1022,2018/10/25,9400.0,9462.001,9620.0,258900,9630.0,9370.0
1023,2018/10/26,9110.0,9197.881,9450.0,425100,9460.0,9050.0
1024,2018/10/29,8760.0,8867.174,9040.0,354500,9090.0,8720.0
1025,2018/10/30,9500.0,9440.44,9210.0,1318400,9590.0,9160.0
1026,2018/10/31,10280.0,10158.195,10100.0,659100,10330.0,9910.0
1027,2018/11/01,10430.0,10446.755,10430.0,899900,10640.0,10330.0
1028,2018/11/02,10380.0,10472.206,10550.0,537200,10730.0,10350.0
1029,2018/11/05,10100.0,10142.65,10300.0,301100,10320.0,10050.0
1030,2018/11/06,9980.0,10044.896,10130.0,226300,10180.0,9970.0
1031,2018/11/07,10170.0,10134.748,10020.0,268300,10240.0,10000.0
1032,2018/11/08,10060.0,10100.265,10270.0,313800,10270.0,10000.0
1033,2018/11/09,9860.0,9904.371,10060.0,263300,10100.0,9810.0
1034,2018/11/12,9810.0,9800.677,9780.0,243800,9840.0,9730.0
1035,2018/11/13,9650.0,9540.568,9470.0,373400,9660.0,9270.0
1036,2018/11/14,9560.0,9570.682,9660.0,227400,9740.0,9520.0
1037,2018/11/15,9660.0,9632.019,9560.0,206500,9690.0,9510.0
1038,2018/11/16,9490.0,9522.167,9650.0,224700,9660.0,9420.0
1039,2018/11/19,9790.0,9750.643,9620.0,207000,9800.0,9620.0
1040,2018/11/20,9430.0,9452.858,9600.0,192800,9610.0,9390.0
1041,2018/11/21,9220.0,9223.994,9200.0,292700,9320.0,9160.0
1042,2018/11/22,9490.0,9414.231,9290.0,177500,9510.0,9260.0
1043,2018/11/26,9480.0,9468.458,9480.0,226300,9550.0,9340.0
1044,2018/11/27,9480.0,9502.423,9550.0,207200,9580.0,9450.0
1045,2018/11/28,9720.0,9681.427,9570.0,223500,9760.0,9560.0
1046,2018/11/29,9770.0,9786.234,9800.0,211900,9880.0,9720.0
1047,2018/11/30,9810.0,9827.771,9810.0,365100,9930.0,9750.0
1048,2018/12/03,10040.0,10065.3,9960.0,264900,10150.0,9960.0
1049,2018/12/04,9760.0,9867.862,10000.0,248300,10100.0,9740.0
1050,2018/12/05,9680.0,9675.514,9610.0,236300,9780.0,9540.0
1051,2018/12/06,9350.0,9382.682,9540.0,215500,9630.0,9260.0
1052,2018/12/07,9460.0,9439.26,9440.0,232500,9500.0,9330.0
1053,2018/12/10,9160.0,9157.257,9230.0,202300,9300.0,9070.0
1054,2018/12/11,9310.0,9256.731,9160.0,304400,9320.0,9150.0
1055,2018/12/12,9630.0,9594.955,9610.0,333800,9680.0,9490.0
1056,2018/12/13,9400.0,9479.697,9610.0,237500,9620.0,9400.0
1057,2018/12/14,9250.0,9331.52,9400.0,219100,9460.0,9220.0
1058,2018/12/17,9400.0,9366.003,9290.0,196900,9440.0,9170.0
1059,2018/12/18,8860.0,8979.151,9140.0,257800,9140.0,8860.0
1060,2018/12/19,9120.0,9066.74,8980.0,318700,9160.0,8880.0
1061,2018/12/20,8550.0,8673.995,8970.0,231800,9000.0,8520.0
1062,2018/12/21,8440.0,8488.172,8590.0,428900,8650.0,8430.0
1063,2018/12/25,8170.0,8147.941,8150.0,208300,8230.0,8070.0
1064,2018/12/26,8150.0,8161.764,8220.0,171800,8340.0,8030.0
1065,2018/12/27,8670.0,8641.766,8600.0,216300,8720.0,8530.0
1066,2018/12/28,8490.0,8475.529,8550.0,199500,8560.0,8370.0
1067,2019/01/04,8520.0,8422.994,8200.0,353400,8530.0,8160.0
1068,2019/01/07,8800.0,8807.311,8750.0,325800,8900.0,8650.0
1069,2019/01/08,8800.0,8830.743,8820.0,280100,8930.0,8770.0
1070,2019/01/09,9020.0,9017.092,8950.0,203900,9090.0,8900.0
1071,2019/01/10,8840.0,8835.561,8910.0,203200,8930.0,8750.0
1072,2019/01/11,8830.0,8871.691,8960.0,139600,8990.0,8800.0
1073,2019/01/15,8960.0,8984.379,8990.0,208500,9070.0,8920.0
1074,2019/01/16,8990.0,8960.414,8860.0,166600,9040.0,8850.0
1075,2019/01/17,9040.0,9011.05,9050.0,210400,9050.0,8930.0
1076,2019/01/18,9150.0,9120.85,9040.0,167100,9180.0,9000.0
1077,2019/01/21,8970.0,9034.966,9180.0,118200,9200.0,8970.0
1078,2019/01/22,8980.0,8981.273,8990.0,154000,9060.0,8900.0
1079,2019/01/23,8850.0,8864.138,8840.0,238300,8910.0,8770.0
1080,2019/01/24,8870.0,8868.338,8760.0,109500,8940.0,8740.0
1081,2019/01/25,9000.0,9036.827,8990.0,282400,9160.0,8960.0
1082,2019/01/28,8950.0,8949.364,8920.0,171400,8980.0,8900.0
1083,2019/01/29,9200.0,9151.164,9010.0,462300,9260.0,8960.0
1084,2019/01/30,9910.0,9800.574,9400.0,1001500,10040.0,9390.0
1085,2019/01/31,10280.0,10203.759,10120.0,366900,10330.0,9960.0
1086,2019/02/01,10140.0,10168.508,10100.0,223200,10320.0,10040.0
1087,2019/02/04,10440.0,10449.373,10340.0,240800,10510.0,10340.0
1088,2019/02/05,10450.0,10492.937,10500.0,146400,10610.0,10410.0
1089,2019/02/06,10230.0,10265.724,10390.0,187100,10420.0,10190.0
1090,2019/02/07,10220.0,10195.59,10200.0,242200,10240.0,10120.0
1091,2019/02/08,10080.0,10063.901,10120.0,189700,10170.0,9970.0
1092,2019/02/12,10320.0,10345.524,10340.0,254900,10400.0,10310.0
1093,2019/02/13,10440.0,10437.846,10250.0,204300,10530.0,10250.0
1094,2019/02/14,10490.0,10492.634,10510.0,104800,10540.0,10440.0
1095,2019/02/15,10390.0,10390.04,10350.0,150100,10480.0,10290.0
1096,2019/02/18,10470.0,10478.795,10540.0,108700,10570.0,10400.0
1097,2019/02/19,10630.0,10640.873,10550.0,169600,10730.0,10540.0
1098,2019/02/20,10330.0,10401.149,10510.0,288200,10610.0,10270.0
1099,2019/02/21,10300.0,10274.877,10280.0,264900,10350.0,10160.0
1100,2019/02/22,10510.0,10504.414,10460.0,250100,10580.0,10450.0
1101,2019/02/25,10700.0,10668.386,10500.0,245400,10730.0,10500.0
1102,2019/02/26,10660.0,10655.813,10750.0,145700,10750.0,10600.0
1103,2019/02/27,10610.0,10610.89,10580.0,199900,10660.0,10550.0
1104,2019/02/28,10630.0,10658.495,10690.0,253200,10740.0,10610.0
1105,2019/03/01,10730.0,10730.141,10610.0,135000,10780.0,10610.0
1106,2019/03/04,10960.0,10912.369,10800.0,168400,10970.0,10770.0
1107,2019/03/05,10950.0,10931.271,10900.0,226600,10980.0,10880.0
1108,2019/03/06,11060.0,11029.465,10950.0,211200,11100.0,10910.0
1109,2019/03/07,10900.0,10897.479,10950.0,251100,10950.0,10820.0
1110,2019/03/08,10770.0,10776.768,10740.0,260800,10910.0,10730.0
1111,2019/03/11,10860.0,10813.177,10770.0,123400,10870.0,10690.0
1112,2019/03/12,11030.0,11013.797,11000.0,165400,11040.0,10960.0
1113,2019/03/13,10970.0,10969.847,11000.0,156400,11020.0,10920.0
1114,2019/03/14,10900.0,10923.647,11050.0,117900,11070.0,10890.0
1115,2019/03/15,11110.0,11077.738,11020.0,200700,11110.0,10950.0
1116,2019/03/18,11080.0,11085.83,11250.0,157300,11250.0,11020.0
1117,2019/03/19,11050.0,11016.279,11000.0,111000,11070.0,10940.0
1118,2019/03/20,11050.0,11061.842,11020.0,168300,11130.0,10990.0
1119,2019/03/22,11070.0,11079.567,11070.0,131600,11160.0,11040.0
1120,2019/03/25,10840.0,10804.284,10740.0,205400,10850.0,10710.0
1121,2019/03/26,11210.0,11173.467,10920.0,244600,11240.0,10920.0
1122,2019/03/27,11300.0,11273.439,11200.0,250100,11320.0,11150.0
1123,2019/03/28,11070.0,11073.375,11110.0,250100,11170.0,10990.0
1124,2019/03/29,11160.0,11167.487,11290.0,175900,11320.0,11110.0
1125,2019/04/01,11420.0,11390.538,11390.0,340400,11490.0,11240.0
1126,2019/04/02,11590.0,11598.94,11720.0,323700,11790.0,11470.0
1127,2019/04/03,11730.0,11686.714,11680.0,263500,11760.0,11530.0
1128,2019/04/04,11640.0,11629.695,11580.0,186600,11700.0,11500.0
1129,2019/04/05,11650.0,11617.03,11610.0,182800,11680.0,11550.0
1130,2019/04/08,11820.0,11777.656,11670.0,232500,11820.0,11670.0
1131,2019/04/09,11810.0,11786.008,11810.0,157300,11860.0,11730.0
1132,2019/04/10,11740.0,11712.227,11700.0,129800,11750.0,11580.0
1133,2019/04/11,11750.0,11773.454,11710.0,168800,11830.0,11690.0
1134,2019/04/12,11930.0,11899.364,11930.0,154000,12000.0,11770.0
1135,2019/04/15,11930.0,11948.492,11960.0,269200,12020.0,11860.0
1136,2019/04/16,12040.0,12037.885,11980.0,196700,12090.0,11880.0
1137,2019/04/17,11750.0,11808.672,11940.0,280200,11980.0,11730.0
1138,2019/04/18,11730.0,11745.696,11810.0,231200,11830.0,11670.0
1139,2019/04/19,11890.0,11888.125,11890.0,174900,11980.0,11800.0
1140,2019/04/22,12020.0,11993.222,11890.0,170100,12090.0,11880.0
1141,2019/04/23,12170.0,12166.557,12180.0,316000,12220.0,12100.0
1142,2019/04/24,12830.0,12820.109,12920.0,512600,12980.0,12490.0
1143,2019/04/25,12900.0,12926.191,12960.0,352100,13100.0,12770.0
1144,2019/04/26,12860.0,12816.231,12770.0,286800,12970.0,12680.0
1145,2019/05/07,12720.0,12748.7,12770.0,251600,12830.0,12660.0
1146,2019/05/08,12590.0,12559.861,12620.0,273500,12640.0,12430.0
1147,2019/05/09,12390.0,12446.296,12590.0,402300,12630.0,12360.0
1148,2019/05/10,12230.0,12235.926,12220.0,380000,12370.0,12120.0
1149,2019/05/13,12130.0,12192.158,12230.0,222900,12310.0,12110.0
1150,2019/05/14,12170.0,12076.1,11890.0,301500,12220.0,11820.0
1151,2019/05/15,12280.0,12196.983,12180.0,228000,12300.0,12020.0
1152,2019/05/16,12470.0,12413.483,12380.0,169700,12490.0,12270.0
1153,2019/05/17,12780.0,12812.317,12890.0,164900,12940.0,12740.0
1154,2019/05/20,12710.0,12710.558,12720.0,71700,12800.0,12640.0
1155,2019/05/21,12850.0,12805.575,12700.0,134900,12850.0,12690.0
1156,2019/05/22,12960.0,13042.21,13290.0,205400,13330.0,12920.0
1157,2019/05/23,13370.0,13304.054,13060.0,242000,13390.0,13060.0
1158,2019/05/24,13500.0,13442.299,13240.0,210500,13530.0,13230.0
1159,2019/05/27,13540.0,13511.641,13500.0,112100,13620.0,13450.0
1160,2019/05/28,13520.0,13575.256,13540.0,266000,13720.0,13500.0
1161,2019/05/29,13290.0,13344.074,13360.0,206900,13480.0,13290.0
1162,2019/05/30,12650.0,12786.923,13050.0,418300,13090.0,12620.0
1163,2019/05/31,13130.0,13042.347,12690.0,358700,13190.0,12650.0
1164,2019/06/03,13110.0,13041.746,12960.0,162700,13120.0,12800.0
1165,2019/06/04,12670.0,12718.217,13010.0,248500,13070.0,12570.0
1166,2019/06/05,12800.0,12782.136,12860.0,274300,12890.0,12670.0
1167,2019/06/06,12630.0,12597.945,12650.0,371200,12720.0,12450.0
1168,2019/06/07,12730.0,12710.691,12730.0,156400,12790.0,12580.0
1169,2019/06/10,13100.0,13066.727,12800.0,226100,13210.0,12740.0
1170,2019/06/11,13080.0,13037.864,13200.0,210700,13230.0,12910.0
1171,2019/06/12,13210.0,13252.699,13100.0,142300,13370.0,13010.0
1172,2019/06/13,13140.0,13142.862,13150.0,118800,13270.0,13060.0
1173,2019/06/14,13420.0,13335.796,13210.0,218100,13440.0,13100.0
1174,2019/06/17,12960.0,13011.892,13210.0,317200,13270.0,12880.0
1175,2019/06/18,12830.0,12887.853,12960.0,253800,13030.0,12800.0
1176,2019/06/19,13010.0,12960.206,12920.0,174900,13030.0,12830.0
1177,2019/06/20,13030.0,13105.602,13090.0,142100,13230.0,13020.0
1178,2019/06/21,12100.0,12432.214,13060.0,565500,13120.0,12000.0
1179,2019/06/24,12760.0,12692.051,12540.0,277900,12850.0,12480.0
1180,2019/06/25,12770.0,12777.462,12640.0,163500,12920.0,12640.0
1181,2019/06/26,12530.0,12499.181,12660.0,233200,12750.0,12410.0
1182,2019/06/27,12290.0,12252.678,12230.0,377200,12430.0,12180.0
1183,2019/06/28,12200.0,12189.684,12110.0,307300,12310.0,12110.0
1184,2019/07/01,12350.0,12235.713,12230.0,298800,12370.0,12100.0
1185,2019/07/02,12490.0,12482.145,12360.0,262500,12570.0,12270.0
1186,2019/07/03,12410.0,12434.856,12450.0,245700,12640.0,12300.0
1187,2019/07/04,12380.0,12384.105,12420.0,110600,12440.0,12350.0
1188,2019/07/05,12240.0,12213.884,12250.0,185100,12260.0,12160.0
1189,2019/07/08,12120.0,12191.293,12250.0,199500,12340.0,12080.0
1190,2019/07/09,12060.0,12067.3,12150.0,151500,12180.0,12020.0
1191,2019/07/10,11860.0,11872.416,11960.0,315000,12000.0,11800.0
1192,2019/07/11,11780.0,11817.572,11780.0,264800,11900.0,11730.0
1193,2019/07/12,11620.0,11730.462,11830.0,233900,11920.0,11620.0
1194,2019/07/16,11840.0,11836.675,11650.0,334100,11930.0,11620.0
1195,2019/07/17,11700.0,11719.804,11830.0,239900,11830.0,11670.0
1196,2019/07/18,11550.0,11571.11,11640.0,218100,11700.0,11490.0
1197,2019/07/19,11750.0,11765.146,11650.0,215500,11840.0,11650.0
1198,2019/07/22,11690.0,11725.878,11730.0,250100,11810.0,11640.0
1199,2019/07/23,11490.0,11625.236,11990.0,365900,11990.0,11480.0
1200,2019/07/24,11700.0,11662.929,11600.0,288200,11780.0,11410.0
1201,2019/07/25,11770.0,11791.818,11670.0,195300,11870.0,11650.0
1202,2019/07/26,11820.0,11832.843,11750.0,218400,11930.0,11710.0
1203,2019/07/29,11860.0,11848.854,11890.0,160500,11940.0,11790.0
1204,2019/07/30,11610.0,11713.557,11890.0,235600,11940.0,11580.0
1205,2019/07/31,11670.0,11602.031,11500.0,252100,11750.0,11390.0
1206,2019/08/01,11560.0,11545.48,11540.0,127200,11590.0,11490.0
1207,2019/08/02,11550.0,11525.847,11410.0,214800,11620.0,11350.0
1208,2019/08/05,11410.0,11379.341,11470.0,279200,11540.0,11200.0
1209,2019/08/06,11610.0,11474.35,11120.0,454000,11660.0,11100.0
1210,2019/08/07,11600.0,11571.442,11620.0,258700,11780.0,11420.0
1211,2019/08/08,11570.0,11608.281,11660.0,126800,11740.0,11510.0
1212,2019/08/09,11530.0,11529.665,11630.0,184800,11680.0,11460.0
1213,2019/08/13,11350.0,11376.309,11330.0,160400,11520.0,11280.0
1214,2019/08/14,11500.0,11484.174,11440.0,179700,11530.0,11370.0
1215,2019/08/15,11440.0,11359.895,11270.0,190200,11460.0,11250.0
1216,2019/08/16,11730.0,11667.887,11370.0,173700,11740.0,11370.0
1217,2019/08/19,11850.0,11853.689,11840.0,184900,11930.0,11750.0
1218,2019/08/20,12060.0,12017.221,11880.0,185300,12090.0,11880.0
1219,2019/08/21,11990.0,11943.109,11950.0,190100,12020.0,11820.0
1220,2019/08/22,12050.0,12010.901,12000.0,178700,12050.0,11910.0
1221,2019/08/23,12050.0,12028.773,12070.0,149900,12070.0,11980.0
