,Date,Close,VWAP,Open,Volume,High,Low
0,2014/08/25,206.5,206.227,206.3,8800,207.3,206.0
1,2014/08/26,206.8,206.278,206.3,3600,206.8,206.0
2,2014/08/27,206.0,206.0,206.0,2000,206.0,206.0
3,2014/08/28,206.0,206.139,206.3,3600,206.3,206.0
4,2014/08/29,207.0,207.0,207.0,800,207.0,207.0
5,2014/09/01,206.3,206.55,206.8,2000,207.0,206.3
6,2014/09/02,207.5,207.51,207.5,10000,207.8,207.5
7,2014/09/03,207.3,207.289,206.3,7600,208.0,206.3
8,2014/09/04,206.0,206.143,206.3,2800,206.3,206.0
9,2014/09/05,207.5,207.045,206.5,4400,207.8,206.5
10,2014/09/08,207.5,207.75,208.3,1200,208.3,207.5
11,2014/09/09,207.8,207.708,207.5,4800,207.8,207.5
12,2014/09/10,213.0,209.546,208.8,43600,213.0,206.3
13,2014/09/11,208.3,207.727,212.0,8800,212.0,205.8
14,2014/09/12,208.0,208.111,209.0,3600,209.0,207.8
15,2014/09/16,208.0,208.5,208.8,2400,208.8,208.0
16,2014/09/17,208.0,208.542,208.8,2400,209.0,208.0
17,2014/09/18,208.0,208.813,208.8,1600,209.8,208.0
18,2014/09/19,208.3,208.329,208.3,7600,209.0,207.8
19,2014/09/22,208.3,207.885,207.8,5200,208.8,207.8
20,2014/09/24,209.0,208.563,208.8,3200,209.0,208.3
21,2014/09/25,208.3,208.321,208.5,2800,208.5,207.8
22,2014/09/26,206.8,207.51,208.3,9600,208.5,206.5
23,2014/09/29,207.3,208.438,208.8,3200,209.0,207.3
24,2014/09/30,207.5,209.554,210.3,5600,210.3,207.5
25,2014/10/01,208.0,208.0,209.8,3600,209.8,207.5
26,2014/10/02,207.3,207.639,207.8,3600,207.8,207.3
27,2014/10/03,207.3,207.25,207.3,800,207.3,207.3
28,2014/10/06,207.5,207.734,207.3,6400,209.8,207.3
29,2014/10/07,206.8,206.933,207.0,6000,207.3,206.8
30,2014/10/08,207.5,207.0,206.8,5600,207.5,206.8
31,2014/10/09,206.3,206.588,206.3,8000,207.8,206.3
32,2014/10/10,205.8,206.05,206.3,8000,206.3,205.8
33,2014/10/14,205.3,205.39,205.3,10000,206.0,205.3
34,2014/10/15,207.8,206.8,205.3,2000,208.0,205.3
35,2014/10/16,203.8,204.833,206.3,9600,206.3,203.8
36,2014/10/17,202.5,203.25,202.5,4400,206.0,202.5
37,2014/10/20,206.5,203.75,206.3,3200,206.5,201.3
38,2014/10/21,205.8,205.625,205.5,800,205.8,205.5
39,2014/10/22,205.0,205.95,207.5,2000,207.5,205.0
40,2014/10/23,205.0,205.0,205.0,400,205.0,205.0
41,2014/10/24,204.0,204.75,205.0,2800,205.0,204.0
42,2014/10/27,204.0,204.719,204.5,3200,207.3,204.0
43,2014/10/28,202.3,202.705,203.5,11200,203.5,202.3
44,2014/10/29,201.3,201.75,202.3,5200,202.3,201.3
45,2014/10/30,201.8,202.208,202.0,2400,203.5,201.8
46,2014/10/31,202.5,203.0,203.5,4800,203.5,202.5
47,2014/11/04,201.3,201.985,202.5,20000,202.5,201.3
48,2014/11/05,202.5,202.063,201.3,4800,204.0,201.3
49,2014/11/06,202.5,202.5,202.5,3600,202.5,202.5
50,2014/11/07,201.3,201.685,202.5,12400,204.5,201.3
51,2014/11/10,202.0,201.917,201.8,7200,202.5,201.8
52,2014/11/11,201.8,201.375,201.8,24800,202.0,201.3
53,2014/11/12,202.3,202.25,202.0,3200,202.5,202.0
54,2014/11/13,202.8,202.1,201.5,4000,202.8,201.5
55,2014/11/14,202.0,201.971,203.8,6800,203.8,201.3
56,2014/11/17,202.0,201.981,202.0,5200,202.0,201.8
57,2014/11/18,202.0,201.672,201.8,6400,202.0,201.5
58,2014/11/19,203.8,203.75,203.8,400,203.8,203.8
59,2014/11/20,204.0,203.917,203.8,6000,204.5,203.5
60,2014/11/21,204.5,203.942,204.5,5200,204.8,202.8
61,2014/11/25,205.0,205.917,205.3,6000,206.8,204.8
62,2014/11/26,205.8,206.153,206.5,7200,206.8,205.0
63,2014/11/27,207.5,207.028,206.8,3600,208.8,206.5
64,2014/11/28,207.3,207.455,207.5,8800,208.5,206.3
65,2014/12/01,208.8,208.068,207.5,4400,208.8,207.5
66,2014/12/02,209.8,209.222,208.8,7200,209.8,208.8
67,2014/12/03,209.5,209.341,209.0,4400,209.5,209.0
68,2014/12/04,209.5,209.512,209.5,8400,209.8,209.3
69,2014/12/05,209.8,209.868,209.8,7600,210.0,209.8
70,2014/12/08,209.3,208.971,208.8,10400,209.8,208.5
71,2014/12/09,210.5,209.955,209.5,8800,210.5,209.3
72,2014/12/10,210.5,210.175,210.0,8000,210.5,209.3
73,2014/12/11,210.3,210.075,210.0,4000,210.5,210.0
74,2014/12/12,211.3,210.433,210.3,6000,211.3,210.3
75,2014/12/15,211.0,210.875,211.5,10400,211.5,210.3
76,2014/12/16,210.3,210.646,211.0,4800,211.0,210.3
77,2014/12/17,208.8,210.11,210.8,10000,211.0,208.8
78,2014/12/18,206.8,208.654,209.0,15600,210.5,206.3
79,2014/12/19,210.3,209.167,207.8,2400,210.5,207.8
80,2014/12/22,210.5,211.355,212.3,20000,212.3,210.3
81,2014/12/24,210.5,211.06,211.3,8400,211.3,210.5
82,2014/12/25,210.0,210.154,210.5,5200,210.5,210.0
83,2014/12/26,211.0,211.117,211.0,6000,211.3,210.8
84,2014/12/29,212.0,211.118,211.0,15200,212.3,210.3
85,2014/12/30,213.8,212.611,212.5,14400,213.8,211.5
86,2015/01/05,214.8,214.672,214.5,11600,215.3,214.0
87,2015/01/06,215.5,215.159,214.8,8800,215.8,214.3
88,2015/01/07,215.8,215.6,215.0,24000,216.8,213.5
89,2015/01/08,216.3,214.919,214.5,14800,216.3,214.5
90,2015/01/09,217.0,217.125,216.8,12800,217.8,216.5
91,2015/01/13,219.5,218.321,218.0,14000,219.5,217.8
92,2015/01/14,217.8,218.715,220.0,37200,221.3,217.5
93,2015/01/15,220.0,218.284,220.0,14800,220.5,217.5
94,2015/01/16,220.0,221.25,221.3,12800,222.0,220.0
95,2015/01/19,221.3,221.511,222.3,9200,222.3,220.5
96,2015/01/20,221.8,221.917,221.3,4800,224.3,221.3
97,2015/01/21,223.3,223.023,222.3,4400,224.3,222.0
98,2015/01/22,223.3,223.788,224.3,5200,224.5,223.3
99,2015/01/23,227.0,225.48,224.5,24400,227.8,223.8
100,2015/01/26,227.5,229.665,230.3,22400,232.0,227.5
101,2015/01/27,231.3,230.238,232.0,8000,232.0,229.3
102,2015/01/28,227.5,228.733,231.0,11600,231.0,226.8
103,2015/01/29,229.8,228.962,227.5,5200,231.3,227.5
104,2015/01/30,227.8,229.842,230.0,15200,230.0,227.8
105,2015/02/02,228.3,229.15,230.0,4000,230.0,228.3
106,2015/02/03,229.3,229.614,230.0,4400,230.0,229.3
107,2015/02/04,230.3,230.0,229.3,4400,230.3,229.3
108,2015/02/05,230.3,229.923,230.3,5200,230.3,229.3
109,2015/02/06,230.3,230.409,230.5,8800,230.5,230.3
110,2015/02/09,230.3,230.417,230.5,8400,230.8,230.0
111,2015/02/10,232.0,231.282,231.3,21600,232.0,230.5
112,2015/02/12,232.3,232.139,232.0,10800,232.5,232.0
113,2015/02/13,233.5,232.658,232.5,15200,233.5,232.3
114,2015/02/16,235.8,234.889,234.5,14400,235.8,234.5
115,2015/02/17,237.3,236.26,235.8,10400,237.3,235.8
116,2015/02/18,237.5,237.336,237.3,15200,237.5,237.0
117,2015/02/19,237.3,237.871,238.5,12400,238.5,237.3
118,2015/02/20,236.0,236.852,237.3,10800,237.5,236.0
119,2015/02/23,237.3,236.764,236.3,14000,237.3,236.3
120,2015/02/24,237.5,237.235,237.3,13600,237.5,236.5
121,2015/02/25,238.3,237.904,238.0,18800,238.3,237.5
122,2015/02/26,242.3,239.975,238.8,20000,242.3,238.8
123,2015/02/27,237.5,244.33,245.0,67200,248.3,237.5
124,2015/03/02,240.5,239.888,238.3,11600,242.3,238.3
125,2015/03/03,245.0,244.764,246.0,14800,246.0,242.0
126,2015/03/04,244.0,243.578,245.0,6400,245.0,242.8
127,2015/03/05,247.5,246.632,245.0,15200,247.5,244.5
128,2015/03/06,244.5,245.311,247.8,21200,248.0,242.8
129,2015/03/09,245.0,244.8,244.8,8000,245.0,244.5
130,2015/03/10,246.8,246.864,247.0,13200,247.0,246.0
131,2015/03/11,246.3,246.978,246.8,18000,247.3,246.3
132,2015/03/12,246.3,246.639,246.3,10800,247.5,246.3
133,2015/03/13,246.8,246.344,246.3,6400,247.0,245.8
134,2015/03/16,247.0,246.888,247.0,15200,247.0,246.3
135,2015/03/17,250.0,248.445,247.0,34400,250.0,247.0
136,2015/03/18,253.3,251.734,250.0,31600,255.0,250.0
137,2015/03/19,253.5,253.418,253.5,31600,255.0,249.8
138,2015/03/20,254.5,253.638,253.8,8000,254.8,252.8
139,2015/03/23,255.3,256.274,256.3,29600,257.5,255.3
140,2015/03/24,258.5,257.463,257.3,10800,258.5,256.5
141,2015/03/25,255.0,255.716,255.8,29200,257.0,255.0
142,2015/03/26,255.5,247.256,256.5,65200,256.5,228.5
143,2015/03/27,258.8,257.131,256.3,32000,258.8,255.3
144,2015/03/30,262.3,260.619,259.8,42000,262.3,259.0
145,2015/03/31,255.3,262.091,262.3,54800,265.5,255.3
146,2015/04/01,254.0,254.61,255.3,35600,257.8,249.8
147,2015/04/02,249.5,249.473,250.0,58800,252.0,246.5
148,2015/04/03,247.5,247.297,248.8,42800,249.8,245.0
149,2015/04/06,245.5,244.467,245.0,54800,245.5,242.0
150,2015/04/07,245.5,244.186,243.8,34400,245.5,243.0
151,2015/04/08,248.8,245.861,244.8,25200,248.8,244.8
152,2015/04/09,252.0,250.922,251.3,32000,252.0,249.5
153,2015/04/10,251.8,250.633,252.0,30800,252.0,249.0
154,2015/04/13,254.3,255.185,257.0,44400,257.3,250.3
155,2015/04/14,254.8,254.87,255.0,20800,256.0,253.0
156,2015/04/15,254.5,254.278,255.0,7200,255.0,253.8
157,2015/04/16,253.8,252.409,254.5,32800,254.5,250.8
158,2015/04/17,252.0,251.773,250.8,8800,253.3,250.8
159,2015/04/20,248.0,250.117,251.0,43600,251.5,248.0
160,2015/04/21,250.0,248.472,247.8,18000,250.0,247.8
161,2015/04/22,252.0,252.125,250.5,11200,253.5,250.5
162,2015/04/23,254.3,253.612,252.5,26000,255.0,252.5
163,2015/04/24,254.0,254.868,256.0,36400,256.0,254.0
164,2015/04/27,260.0,257.585,255.5,37600,260.0,255.0
165,2015/04/28,256.5,257.641,257.5,37600,259.0,256.5
166,2015/04/30,252.5,254.095,254.3,66000,257.3,252.5
167,2015/05/01,253.8,253.675,252.5,21200,254.8,252.5
168,2015/05/07,255.0,254.476,254.5,32800,255.0,254.3
169,2015/05/08,257.0,257.038,257.5,31200,257.5,255.5
170,2015/05/11,256.8,256.806,256.3,28800,257.5,256.3
171,2015/05/12,256.5,256.619,256.8,23600,257.0,256.3
172,2015/05/13,255.8,255.753,256.5,36800,256.5,255.0
173,2015/05/14,256.3,256.339,256.5,22400,256.5,256.0
174,2015/05/15,256.5,256.25,256.3,19200,256.5,256.0
175,2015/05/18,255.8,256.293,256.5,28000,256.8,255.8
176,2015/05/19,255.5,255.754,255.8,25200,256.0,255.5
177,2015/05/20,252.5,249.45,248.0,133200,252.8,247.5
178,2015/05/21,252.8,252.68,252.5,38800,253.5,252.3
179,2015/05/22,255.0,253.658,253.0,51200,256.3,251.5
180,2015/05/25,256.8,255.991,255.3,56400,257.3,255.0
181,2015/05/26,262.5,259.071,257.5,95600,262.5,257.3
182,2015/05/27,239.0,238.885,239.3,220800,240.3,237.5
183,2015/05/28,236.5,238.077,239.0,54800,239.3,236.5
184,2015/05/29,232.5,234.584,236.5,42800,236.5,232.5
185,2015/06/01,227.8,229.628,232.5,33600,232.5,227.8
186,2015/06/02,229.0,228.446,227.8,20400,229.8,227.8
187,2015/06/03,229.3,229.147,229.0,11600,232.3,228.0
188,2015/06/04,230.0,230.387,229.5,12400,231.3,229.5
189,2015/06/05,228.8,229.075,230.3,21200,230.3,228.3
190,2015/06/08,228.5,227.788,227.8,16000,228.5,227.5
191,2015/06/09,228.3,228.013,228.5,15200,228.8,227.5
192,2015/06/10,225.5,226.98,228.3,14800,228.3,225.5
193,2015/06/11,225.8,226.594,227.5,6400,227.5,225.8
194,2015/06/12,225.5,225.588,225.8,6800,225.8,225.3
195,2015/06/15,223.8,224.942,225.8,22400,225.8,223.3
196,2015/06/16,224.3,225.047,225.3,6400,225.5,224.3
197,2015/06/17,225.0,224.188,223.8,8000,225.3,223.8
198,2015/06/18,223.8,224.115,225.0,5200,225.0,223.5
199,2015/06/19,225.5,225.333,225.3,4800,225.5,225.3
200,2015/06/22,224.8,225.176,225.0,6800,226.0,224.5
201,2015/06/23,224.5,224.75,224.8,5600,225.3,224.5
202,2015/06/24,224.3,224.44,224.5,8400,224.5,224.3
203,2015/06/25,224.0,224.104,224.3,9600,224.5,224.0
204,2015/06/26,222.5,223.232,223.8,16800,223.8,222.5
205,2015/06/29,217.8,218.172,220.3,26800,221.3,215.0
206,2015/06/30,217.8,217.46,217.8,10000,217.8,216.3
207,2015/07/01,219.3,218.33,219.0,8800,219.3,217.5
208,2015/07/02,219.8,219.046,219.5,10800,219.8,218.0
209,2015/07/03,219.5,219.412,220.0,6800,220.0,218.8
210,2015/07/06,219.0,219.844,219.5,12800,221.5,219.0
211,2015/07/07,218.8,218.833,219.0,3600,219.0,218.8
212,2015/07/08,218.0,218.771,218.8,9600,220.5,218.0
213,2015/07/09,215.8,216.452,217.8,25200,217.8,215.0
214,2015/07/10,215.8,215.75,215.8,4400,215.8,215.8
215,2015/07/13,217.0,216.3,215.8,2000,217.0,215.8
216,2015/07/14,221.3,219.555,217.0,12800,221.3,217.0
217,2015/07/15,223.3,226.052,226.0,17200,227.8,223.3
218,2015/07/16,224.5,224.75,225.0,3200,225.0,224.3
219,2015/07/17,225.0,224.969,225.0,6400,225.0,224.8
220,2015/07/21,225.0,224.825,225.0,4000,225.0,224.5
221,2015/07/22,226.0,224.659,225.0,4400,226.0,223.8
222,2015/07/23,225.0,225.2,226.0,2000,226.0,225.0
223,2015/07/24,224.0,224.15,223.8,2000,224.5,223.8
224,2015/07/27,223.3,223.673,224.5,5200,224.5,223.3
225,2015/07/28,223.5,223.278,223.3,3600,223.5,223.3
226,2015/07/29,222.5,223.15,223.3,4000,223.5,222.5
227,2015/07/30,221.5,221.594,221.8,3200,221.8,221.5
228,2015/07/31,221.0,221.25,221.5,2800,221.5,221.0
229,2015/08/03,221.0,220.75,221.0,4800,221.0,220.3
230,2015/08/04,220.8,220.925,220.8,4000,221.5,220.8
231,2015/08/05,222.0,221.925,221.5,4000,222.5,221.5
232,2015/08/06,221.5,222.013,222.0,8000,222.5,221.3
233,2015/08/07,221.8,221.95,221.5,2000,222.5,221.5
234,2015/08/10,220.5,221.261,221.8,9200,222.0,220.5
235,2015/08/11,220.3,220.469,220.5,6400,221.3,220.3
236,2015/08/12,219.8,219.987,220.3,7600,220.5,219.3
237,2015/08/13,220.3,219.673,220.3,5200,220.3,218.8
238,2015/08/14,218.8,219.063,218.8,3200,220.8,218.8
239,2015/08/17,220.8,224.212,224.5,5200,224.5,220.8
240,2015/08/18,224.5,224.313,224.3,4800,224.5,224.3
241,2015/08/19,221.3,218.424,218.8,9200,221.3,217.5
242,2015/08/20,218.8,218.917,219.0,1200,219.0,218.8
243,2015/08/21,218.3,218.103,217.8,6800,218.8,217.5
244,2015/08/24,212.5,214.429,217.0,25200,217.0,212.5
245,2015/08/25,209.3,205.456,203.3,18000,211.3,203.3
246,2015/08/26,209.0,206.909,205.0,8800,209.0,205.0
247,2015/08/27,216.0,210.213,207.8,10800,216.0,207.8
248,2015/08/28,216.5,216.25,216.3,3200,216.5,216.0
249,2015/08/31,222.0,218.653,217.8,7200,222.0,216.3
250,2015/09/01,216.3,218.5,220.0,2800,221.0,216.3
251,2015/09/02,213.3,215.271,216.3,4800,219.8,212.5
252,2015/09/03,212.5,214.267,220.0,12000,220.0,212.5
253,2015/09/04,210.5,211.818,212.5,4400,217.8,210.3
254,2015/09/07,206.3,207.632,210.0,7600,210.0,206.3
255,2015/09/08,205.5,206.724,206.3,7600,210.3,205.0
256,2015/09/09,209.5,206.793,205.8,11600,209.5,205.0
257,2015/09/10,209.0,210.065,211.0,10800,211.0,205.3
258,2015/09/11,208.8,209.083,209.3,1200,209.3,208.8
259,2015/09/14,210.3,209.607,208.8,5600,212.3,208.8
260,2015/09/15,209.0,209.368,212.0,6800,212.0,208.8
261,2015/09/16,208.3,207.9,207.8,2000,208.3,207.8
262,2015/09/17,210.5,210.0,209.5,1600,210.5,209.5
263,2015/09/18,209.5,209.625,209.5,1600,209.8,209.5
264,2015/09/24,208.8,209.313,209.5,1600,209.5,208.8
265,2015/09/25,209.0,208.614,210.8,4400,212.0,205.5
266,2015/09/28,209.0,209.0,209.0,1200,209.0,209.0
267,2015/09/29,209.0,210.143,212.0,2800,212.0,209.0
268,2015/09/30,210.8,212.0,212.3,2400,212.3,210.8
269,2015/10/01,206.3,209.25,210.8,6000,211.0,206.3
270,2015/10/02,207.5,207.214,206.5,2800,207.5,206.5
271,2015/10/05,211.3,211.518,210.0,5600,212.5,210.0
272,2015/10/06,209.0,207.916,207.8,44000,209.3,207.5
273,2015/10/07,212.5,211.517,211.3,11600,212.8,209.8
274,2015/10/08,210.3,210.245,211.3,18400,212.5,207.5
275,2015/10/09,213.3,212.922,212.8,6400,213.5,212.5
276,2015/10/13,215.0,216.417,216.5,7200,217.0,215.0
277,2015/10/14,215.8,217.15,217.5,4000,217.5,215.8
278,2015/10/15,216.3,215.833,215.8,2400,216.3,215.5
279,2015/10/16,216.8,216.517,217.0,6000,217.5,216.0
280,2015/10/19,220.8,219.444,217.5,10800,220.8,217.5
281,2015/10/20,221.3,219.724,220.5,7600,221.3,218.5
282,2015/10/21,217.3,217.2,217.0,4000,218.0,217.0
283,2015/10/22,217.5,217.607,217.0,5600,219.0,215.5
284,2015/10/23,219.5,218.157,217.5,10800,221.0,215.5
285,2015/10/26,221.0,220.964,221.0,2800,221.0,220.8
286,2015/10/27,219.8,220.188,220.0,1600,221.0,219.8
287,2015/10/28,218.8,219.481,219.8,5200,219.8,218.8
288,2015/10/29,218.3,218.292,218.5,12000,218.8,218.3
289,2015/10/30,218.0,218.708,220.0,2400,220.0,217.5
290,2015/11/02,218.0,218.383,218.0,6000,218.5,218.0
291,2015/11/04,219.8,219.295,218.3,4400,220.8,218.3
292,2015/11/05,219.3,219.361,219.0,3600,220.3,219.0
293,2015/11/06,220.8,220.75,220.8,1200,220.8,220.8
294,2015/11/09,220.5,221.508,221.0,12000,222.5,220.5
295,2015/11/10,222.3,221.382,221.0,6800,222.3,221.0
296,2015/11/11,223.3,223.047,222.5,6400,223.5,222.5
297,2015/11/12,225.8,224.429,223.3,5600,225.8,223.3
298,2015/11/13,224.5,225.22,225.5,10000,226.3,224.5
299,2015/11/16,225.5,225.104,226.3,4800,226.3,223.3
300,2015/11/17,226.3,226.25,226.3,3600,226.5,226.0
301,2015/11/18,225.8,226.522,226.8,13600,228.0,225.5
302,2015/11/19,227.0,226.15,225.3,4000,227.0,224.5
303,2015/11/20,229.3,227.921,227.3,16400,229.3,227.3
304,2015/11/24,234.0,233.13,231.3,32400,235.0,231.3
305,2015/11/25,233.8,234.407,234.0,10800,236.0,232.8
306,2015/11/26,238.3,236.632,236.3,21200,238.5,235.8
307,2015/11/27,238.5,238.702,238.3,16800,240.0,238.3
308,2015/11/30,239.0,238.8,238.5,12000,239.5,238.3
309,2015/12/01,238.5,239.3,239.5,12000,239.8,238.5
310,2015/12/02,238.3,238.39,238.3,10000,238.8,237.8
311,2015/12/03,239.0,238.5,238.3,7200,239.0,237.8
312,2015/12/04,230.8,235.476,239.0,16800,239.0,230.8
313,2015/12/07,234.5,235.157,235.0,10800,237.3,233.0
314,2015/12/08,234.5,234.864,234.5,13200,236.3,234.5
315,2015/12/09,235.0,234.875,234.8,5600,236.8,234.0
316,2015/12/10,235.0,235.581,235.0,12400,236.8,235.0
317,2015/12/11,236.8,237.078,237.8,6400,237.8,235.8
318,2015/12/14,234.0,234.796,236.3,10800,236.3,234.0
319,2015/12/15,235.3,237.3,238.5,8000,238.8,235.0
320,2015/12/16,235.3,234.797,235.3,6400,235.5,234.0
321,2015/12/17,236.8,237.01,238.8,10000,238.8,235.5
322,2015/12/18,237.5,236.942,236.8,5200,237.5,236.5
323,2015/12/21,237.8,236.913,237.3,19600,238.0,236.3
324,2015/12/22,236.5,236.813,236.5,1600,237.8,236.5
325,2015/12/24,235.0,236.313,237.3,4800,237.3,235.0
326,2015/12/25,234.8,234.1,235.0,10000,235.0,233.8
327,2015/12/28,239.0,236.988,234.8,16800,240.5,234.8
328,2015/12/29,242.3,244.174,246.5,18400,246.5,240.3
329,2015/12/30,240.8,241.575,242.3,8000,242.3,240.3
330,2016/01/04,242.8,244.125,245.8,10400,245.8,242.5
331,2016/01/05,244.8,243.625,243.0,10400,244.8,242.8
332,2016/01/06,244.5,244.016,244.8,12800,245.0,243.0
333,2016/01/07,244.3,243.586,244.3,11600,244.3,242.8
334,2016/01/08,243.5,242.38,244.3,9200,244.3,241.5
335,2016/01/12,232.5,241.122,243.5,33600,243.5,230.0
336,2016/01/13,242.5,238.542,236.3,4800,242.5,236.3
337,2016/01/14,238.5,237.606,238.8,16000,241.8,236.3
338,2016/01/15,237.8,237.806,238.5,3600,238.5,237.0
339,2016/01/18,236.5,236.838,234.5,6800,240.0,234.5
340,2016/01/19,239.8,239.75,239.8,400,239.8,239.8
341,2016/01/20,234.5,235.865,239.0,5200,239.0,233.8
342,2016/01/21,226.3,228.209,231.3,14800,231.3,225.5
343,2016/01/22,228.3,226.786,224.5,14000,228.8,224.5
344,2016/01/25,236.5,234.734,234.5,6400,236.5,229.5
345,2016/01/26,237.5,237.433,237.5,12000,238.0,235.5
346,2016/01/27,234.0,233.316,231.5,7600,237.3,231.5
347,2016/01/28,236.0,236.688,237.0,4800,237.0,236.0
348,2016/01/29,239.0,237.583,237.5,6000,239.0,236.0
349,2016/02/01,240.0,239.153,238.8,19600,240.0,238.3
350,2016/02/02,243.0,242.536,242.5,11200,243.5,240.8
351,2016/02/03,241.3,243.432,244.0,14800,245.0,240.5
352,2016/02/04,240.3,240.464,240.0,5600,241.5,240.0
353,2016/02/05,239.3,239.813,240.3,3200,240.5,239.3
354,2016/02/08,238.5,238.525,239.0,8000,239.0,237.8
355,2016/02/09,230.0,234.833,237.5,9600,238.3,230.0
356,2016/02/10,228.8,230.423,237.0,10400,237.0,225.3
357,2016/02/12,221.3,220.367,224.8,18800,224.8,215.0
358,2016/02/15,232.3,233.517,234.0,6000,234.0,229.8
359,2016/02/16,236.3,236.289,236.3,7600,236.5,236.0
360,2016/02/17,235.8,236.107,236.3,8400,236.3,235.8
361,2016/02/18,238.3,238.428,237.5,18000,243.8,235.8
362,2016/02/19,240.5,241.016,241.3,6400,241.5,240.3
363,2016/02/22,243.8,242.344,243.3,9600,243.8,239.5
364,2016/02/23,242.8,244.725,245.0,8000,246.0,242.8
365,2016/02/24,244.8,243.727,243.5,4400,244.8,242.5
366,2016/02/25,239.8,244.523,246.3,17200,246.3,239.0
367,2016/02/26,248.3,246.283,240.8,24000,249.5,240.8
368,2016/02/29,245.0,249.842,250.0,47600,252.8,245.0
369,2016/03/01,245.0,245.721,245.0,6800,248.0,245.0
370,2016/03/02,244.3,243.735,245.0,20400,245.8,241.0
371,2016/03/03,240.3,240.73,239.8,14800,242.0,239.8
372,2016/03/04,242.3,238.3,238.0,22000,242.3,232.8
373,2016/03/07,243.5,242.893,242.8,5600,243.5,242.0
374,2016/03/08,241.3,242.5,243.8,15200,244.0,240.3
375,2016/03/09,244.0,243.188,243.8,1600,244.0,241.3
376,2016/03/10,243.0,243.143,244.5,8400,244.5,241.5
377,2016/03/11,244.5,243.527,243.3,11200,244.5,243.3
378,2016/03/14,244.5,245.598,245.8,16400,246.3,244.5
379,2016/03/15,244.5,244.519,244.5,10800,245.0,243.8
380,2016/03/16,246.0,245.273,245.5,8800,246.5,244.3
381,2016/03/17,245.3,245.677,245.8,19200,246.5,244.3
382,2016/03/18,247.0,246.033,245.0,6000,247.0,245.0
383,2016/03/22,243.0,245.177,247.3,16400,247.3,243.0
384,2016/03/23,243.0,243.181,243.0,7200,243.8,243.0
385,2016/03/24,243.8,244.009,244.8,21200,245.8,243.0
386,2016/03/25,247.0,246.407,246.5,24800,247.0,245.5
387,2016/03/28,250.0,248.86,247.8,26400,250.0,247.8
388,2016/03/29,251.8,252.25,251.3,32000,253.8,251.0
389,2016/03/30,252.8,253.597,253.8,17600,255.0,251.8
390,2016/03/31,255.0,255.037,253.5,50800,256.3,253.5
391,2016/04/01,250.3,252.653,256.3,72400,258.0,247.0
392,2016/04/04,254.5,253.255,253.8,20400,255.0,250.0
393,2016/04/05,252.5,252.915,254.5,17600,255.0,250.3
394,2016/04/06,251.5,252.136,250.5,8800,253.8,250.5
395,2016/04/07,253.8,253.231,253.8,10400,253.8,251.3
396,2016/04/08,253.0,251.495,251.3,22000,253.0,250.0
397,2016/04/11,254.5,253.725,253.3,16000,254.5,251.5
398,2016/04/12,251.0,251.222,254.8,35200,255.0,249.5
399,2016/04/13,251.0,250.532,249.5,138000,254.0,249.3
400,2016/04/14,250.8,251.451,251.8,22400,252.5,250.5
401,2016/04/15,251.3,250.281,249.8,19600,251.5,249.8
402,2016/04/18,250.3,249.776,250.0,30400,250.5,248.8
403,2016/04/19,249.8,250.12,250.0,10800,250.5,249.8
404,2016/04/20,249.3,249.795,249.8,22400,250.8,249.3
405,2016/04/21,250.5,250.534,250.3,14800,251.0,250.3
406,2016/04/22,250.8,250.639,251.0,18000,251.0,250.3
407,2016/04/25,252.5,251.633,250.8,37600,252.5,250.8
408,2016/04/26,249.8,250.899,252.5,26800,252.5,249.8
409,2016/04/27,250.5,250.845,251.3,16800,251.3,250.0
410,2016/04/28,249.0,249.811,250.5,49200,251.3,248.8
411,2016/05/02,250.0,246.345,244.5,34800,250.0,244.5
412,2016/05/06,251.0,249.648,249.8,19600,251.0,248.8
413,2016/05/09,247.5,248.49,250.0,40400,250.5,247.0
414,2016/05/10,247.5,247.393,247.5,32800,247.5,247.0
415,2016/05/11,246.3,245.969,245.3,28800,247.0,245.3
416,2016/05/12,246.8,245.325,245.0,20000,246.8,244.5
417,2016/05/13,246.3,246.213,246.0,13600,247.0,245.5
418,2016/05/16,246.0,245.75,245.0,17200,246.3,245.0
419,2016/05/17,245.3,245.583,245.8,21600,245.8,245.3
420,2016/05/18,245.3,245.043,245.3,14000,245.5,244.5
421,2016/05/19,244.0,244.215,244.3,26000,245.0,243.8
422,2016/05/20,245.3,244.551,243.8,31200,245.3,243.8
423,2016/05/23,246.0,245.573,246.0,28800,246.3,244.0
424,2016/05/24,246.8,246.19,246.0,18400,246.8,245.8
425,2016/05/25,247.3,246.815,247.0,26000,247.3,246.0
426,2016/05/26,245.5,245.036,243.8,72000,246.8,243.8
427,2016/05/27,226.8,227.126,225.5,100000,231.3,225.3
428,2016/05/30,226.0,227.727,228.8,26000,229.0,226.0
429,2016/05/31,226.5,226.556,226.5,21600,227.5,226.0
430,2016/06/01,225.3,225.892,226.5,12000,226.5,225.3
431,2016/06/02,224.0,224.653,225.3,14400,225.3,224.0
432,2016/06/03,220.3,223.02,224.0,10000,225.5,220.3
433,2016/06/06,217.0,217.325,220.0,22800,220.0,215.0
434,2016/06/07,218.8,218.014,217.0,7200,220.8,217.0
435,2016/06/08,219.0,219.393,219.8,2800,220.0,219.0
436,2016/06/09,219.0,219.461,219.3,7600,220.0,219.0
437,2016/06/10,218.5,219.176,220.8,10800,220.8,217.5
438,2016/06/13,217.3,218.581,219.3,13600,221.8,217.3
439,2016/06/14,215.5,216.111,216.5,14400,217.3,214.8
440,2016/06/15,213.5,213.688,214.5,9600,214.5,213.3
441,2016/06/16,212.5,212.938,213.5,12800,213.8,212.5
442,2016/06/17,210.0,210.679,211.5,5600,211.5,210.0
443,2016/06/20,214.0,212.158,209.8,12000,215.8,208.8
444,2016/06/21,211.8,211.9,214.0,4000,214.0,211.0
445,2016/06/22,211.3,215.125,216.5,4800,216.5,211.3
446,2016/06/23,210.8,211.342,210.8,7600,215.0,210.8
447,2016/06/24,202.0,205.598,211.0,27600,211.3,201.5
448,2016/06/27,203.3,203.688,202.5,9600,207.5,202.5
449,2016/06/28,203.0,203.844,204.8,9600,204.8,202.5
450,2016/06/29,202.8,203.019,202.8,10800,203.3,202.5
451,2016/06/30,203.0,203.278,203.0,7200,204.8,202.8
452,2016/07/01,206.8,205.52,203.0,10000,210.0,203.0
453,2016/07/04,208.0,208.278,206.8,3600,209.8,206.8
454,2016/07/05,208.3,208.2,208.0,2000,208.3,208.0
455,2016/07/06,207.5,208.25,208.5,9200,208.5,207.5
456,2016/07/07,211.8,209.411,207.5,5600,211.8,207.5
457,2016/07/08,210.3,211.172,213.8,6400,213.8,209.0
458,2016/07/11,213.3,212.544,211.3,6800,213.5,211.3
459,2016/07/12,220.5,217.389,217.3,20800,220.5,214.0
460,2016/07/13,222.8,228.311,231.8,47200,231.8,221.0
461,2016/07/14,217.3,216.391,221.0,12800,221.0,214.3
462,2016/07/15,217.3,218.023,219.3,4400,219.3,217.3
463,2016/07/19,214.0,214.37,215.0,9200,215.0,213.3
464,2016/07/20,213.0,212.95,212.8,2000,213.0,212.8
465,2016/07/21,212.5,212.598,212.5,11200,214.0,212.5
466,2016/07/22,0.0,0.0,0.0,0,0.0,0.0
467,2016/07/25,214.0,215.054,215.3,9200,215.5,214.0
468,2016/07/26,212.8,213.875,215.5,3200,215.5,212.8
469,2016/07/27,213.0,213.313,213.5,1600,213.8,213.0
470,2016/07/28,213.8,214.375,215.3,1600,215.3,213.3
471,2016/07/29,213.3,214.0,215.0,2400,215.0,213.3
472,2016/08/01,214.8,214.75,214.8,800,214.8,214.8
473,2016/08/02,0.0,0.0,0.0,0,0.0,0.0
474,2016/08/03,215.0,214.778,214.0,3600,215.0,214.0
475,2016/08/04,213.3,213.25,213.5,2000,213.5,213.0
476,2016/08/05,213.0,214.5,215.3,1200,215.3,213.0
477,2016/08/08,213.0,213.0,213.0,800,213.0,213.0
478,2016/08/09,212.8,213.05,213.3,4000,213.3,212.8
479,2016/08/10,216.3,214.031,213.3,6400,216.3,213.0
480,2016/08/12,216.3,216.417,216.5,3600,216.8,216.3
481,2016/08/15,217.0,216.636,215.0,4400,217.0,215.0
482,2016/08/16,0.0,0.0,0.0,0,0.0,0.0
483,2016/08/17,217.0,217.0,217.0,2000,217.0,217.0
484,2016/08/18,216.0,217.917,220.8,6000,220.8,215.5
485,2016/08/19,216.0,216.125,216.0,4000,216.5,216.0
486,2016/08/22,215.5,216.406,220.0,6400,220.0,215.3
487,2016/08/23,215.5,215.5,215.5,400,215.5,215.5
488,2016/08/24,217.5,217.125,215.3,1600,218.3,215.3
489,2016/08/25,216.3,216.25,216.3,400,216.3,216.3
490,2016/08/26,216.8,216.825,217.0,4000,217.5,216.5
491,2016/08/29,219.0,218.263,217.5,7600,219.3,217.5
492,2016/08/30,221.8,221.134,219.3,16400,222.3,219.3
493,2016/08/31,223.8,223.017,221.8,6000,225.0,221.8
494,2016/09/01,223.0,222.778,222.5,3600,223.0,222.5
495,2016/09/02,223.3,223.107,222.8,2800,223.8,222.5
496,2016/09/05,223.3,223.219,223.0,3200,223.3,223.0
497,2016/09/06,225.5,224.25,223.8,5200,225.5,223.8
498,2016/09/07,225.0,225.944,225.5,3600,226.5,225.0
499,2016/09/08,226.0,225.5,225.0,2400,226.0,225.0
500,2016/09/09,227.5,226.839,226.3,5600,227.5,226.0
501,2016/09/12,226.5,229.826,230.0,13200,230.3,226.5
502,2016/09/13,226.3,226.417,226.5,2400,226.5,226.3
503,2016/09/14,224.8,223.81,225.0,11600,225.0,222.3
504,2016/09/15,224.5,224.5,224.5,400,224.5,224.5
505,2016/09/16,226.3,227.786,229.5,5600,229.5,225.8
506,2016/09/20,221.3,222.65,226.3,12000,226.3,220.3
507,2016/09/21,0.0,0.0,0.0,0,0.0,0.0
508,2016/09/23,225.0,226.036,227.0,5600,227.0,224.0
509,2016/09/26,226.8,225.571,226.8,5600,226.8,225.0
510,2016/09/27,224.8,224.983,225.5,6000,225.5,224.3
511,2016/09/28,227.0,226.167,225.0,3600,227.0,225.0
512,2016/09/29,226.3,226.857,227.3,2800,227.8,226.3
513,2016/09/30,227.8,231.0,232.0,15600,232.0,227.5
514,2016/10/03,228.0,227.906,227.8,3200,228.0,227.8
515,2016/10/04,228.8,229.15,229.3,2000,229.5,228.8
516,2016/10/05,228.5,229.025,228.8,4000,229.8,228.3
517,2016/10/06,229.3,228.917,228.8,3600,229.8,228.5
518,2016/10/07,229.3,229.732,229.3,11200,230.8,228.5
519,2016/10/11,231.0,231.268,232.0,11200,232.0,229.5
520,2016/10/12,230.3,231.52,231.0,10000,232.5,230.3
521,2016/10/13,243.8,240.41,241.5,89200,243.8,236.5
522,2016/10/14,241.5,242.902,243.8,31600,244.5,239.0
523,2016/10/17,240.0,240.888,241.5,8000,243.0,238.3
524,2016/10/18,239.3,238.95,240.8,4000,240.8,238.5
525,2016/10/19,239.8,239.528,239.3,3600,239.8,239.3
526,2016/10/20,239.5,239.667,239.3,3600,240.0,239.3
527,2016/10/21,238.8,240.831,243.3,16000,243.3,238.8
528,2016/10/24,243.3,241.762,238.8,26000,243.3,238.8
529,2016/10/25,242.3,245.042,245.8,19200,246.0,242.3
530,2016/10/26,241.0,242.306,244.8,3600,244.8,241.0
531,2016/10/27,241.3,240.963,244.3,8000,244.3,240.0
532,2016/10/28,242.5,242.792,242.5,2400,243.3,242.5
533,2016/10/31,241.0,241.188,242.8,8000,242.8,239.0
534,2016/11/01,241.0,240.0,240.5,4000,241.0,239.0
535,2016/11/02,239.0,239.5,240.3,2000,240.3,239.0
536,2016/11/04,237.8,237.629,237.5,12400,239.3,237.5
537,2016/11/07,237.5,237.429,237.5,2800,237.5,237.0
538,2016/11/08,239.3,238.75,237.5,3200,239.3,237.5
539,2016/11/09,232.8,235.304,240.8,22400,241.0,232.8
540,2016/11/10,238.8,238.3,238.3,4000,238.8,238.3
541,2016/11/11,236.8,237.125,237.5,2400,237.5,236.8
542,2016/11/14,234.5,233.944,233.3,3600,236.0,233.3
543,2016/11/15,235.3,235.125,235.0,800,235.3,235.0
544,2016/11/16,236.8,236.321,236.3,2800,236.8,236.3
545,2016/11/17,0.0,0.0,0.0,0,0.0,0.0
546,2016/11/18,235.5,234.55,235.3,2000,235.5,234.0
547,2016/11/21,237.0,236.196,236.3,5600,237.0,235.0
548,2016/11/22,235.8,236.5,237.0,2800,237.0,235.8
549,2016/11/24,236.8,238.105,238.8,7600,238.8,236.3
550,2016/11/25,239.8,238.688,238.8,9600,239.8,236.8
551,2016/11/28,237.8,237.942,237.8,5200,238.8,237.5
552,2016/11/29,236.8,237.021,237.8,4800,237.8,236.8
553,2016/11/30,244.5,243.397,240.5,29200,245.0,240.5
554,2016/12/01,256.8,256.742,257.5,123600,259.3,255.0
555,2016/12/02,251.8,253.003,255.5,34800,255.5,251.8
556,2016/12/05,252.5,251.994,251.5,18000,253.8,247.8
557,2016/12/06,253.3,253.795,253.0,24400,254.8,253.0
558,2016/12/07,254.8,254.801,253.3,27200,255.8,253.3
559,2016/12/08,254.0,253.045,254.3,8800,254.3,250.5
560,2016/12/09,253.8,252.654,251.5,5200,254.0,251.5
561,2016/12/12,254.0,253.288,253.8,21200,254.0,251.8
562,2016/12/13,253.8,252.675,252.0,4000,253.8,251.8
563,2016/12/14,254.5,253.846,253.8,10400,254.5,253.0
564,2016/12/15,257.5,255.757,254.5,40800,257.5,252.8
565,2016/12/16,262.3,259.447,257.8,86400,262.3,256.8
566,2016/12/19,263.3,262.642,264.3,74800,266.0,256.5
567,2016/12/20,256.8,259.814,259.5,45200,262.5,255.0
568,2016/12/21,248.0,249.369,253.0,87600,254.5,244.3
569,2016/12/22,249.5,250.286,248.5,5600,256.3,248.5
570,2016/12/26,253.3,251.342,249.8,15200,253.3,249.8
571,2016/12/27,247.8,250.63,253.3,29200,253.3,247.8
572,2016/12/28,251.3,250.731,247.8,16000,252.8,247.8
573,2016/12/29,249.5,250.049,254.0,24400,254.0,248.3
574,2016/12/30,249.8,249.765,251.0,6800,251.0,249.3
575,2017/01/04,251.3,251.535,253.5,22800,253.5,250.3
576,2017/01/05,252.3,252.138,251.5,8000,253.0,251.5
577,2017/01/06,257.0,254.459,252.8,19600,257.3,252.5
578,2017/01/10,258.0,257.436,257.8,15600,258.0,257.0
579,2017/01/11,260.0,258.971,259.0,27600,260.0,258.0
580,2017/01/12,258.0,255.746,259.0,50000,262.5,249.5
581,2017/01/13,333.0,318.229,260.0,432800,333.0,256.0
582,2017/01/16,321.3,328.744,335.5,588000,344.0,313.8
583,2017/01/17,305.0,309.298,314.3,97200,314.5,305.0
584,2017/01/18,317.5,305.625,300.0,101600,321.8,295.8
585,2017/01/19,308.8,311.718,317.5,41200,317.5,305.5
586,2017/01/20,308.5,307.528,309.0,28800,310.0,306.0
587,2017/01/23,314.5,313.906,312.5,46800,317.5,312.5
588,2017/01/24,312.3,312.931,315.0,26000,315.0,309.0
589,2017/01/25,311.5,309.868,309.3,34000,312.8,307.8
590,2017/01/26,315.5,314.624,315.0,34000,315.5,310.0
591,2017/01/27,332.3,327.84,320.3,98400,333.5,320.3
592,2017/01/30,334.8,334.198,335.5,79200,336.0,331.8
593,2017/01/31,333.0,334.446,337.0,31200,337.0,332.0
594,2017/02/01,333.8,329.386,330.3,33200,337.0,325.0
595,2017/02/02,316.3,324.576,331.0,47200,333.0,315.3
596,2017/02/03,310.8,314.509,317.5,34400,322.3,309.8
597,2017/02/06,312.3,311.133,309.5,19600,315.0,309.5
598,2017/02/07,313.8,312.181,315.0,11600,315.0,311.3
599,2017/02/08,312.8,313.0,314.8,6000,314.8,311.8
600,2017/02/09,313.3,315.667,317.0,12000,317.0,313.0
601,2017/02/10,322.5,318.452,319.8,35600,322.8,313.5
602,2017/02/13,336.8,331.94,325.0,63200,336.8,323.0
603,2017/02/14,353.8,349.249,337.0,186400,365.5,336.5
604,2017/02/15,368.8,369.91,370.0,86400,373.3,365.5
605,2017/02/16,380.0,378.06,365.0,119200,388.8,364.0
606,2017/02/17,385.0,384.821,387.3,35200,387.3,381.0
607,2017/02/20,415.0,403.932,390.0,102800,419.3,390.0
608,2017/02/21,401.8,401.467,419.8,113600,422.0,385.0
609,2017/02/22,392.8,393.61,398.0,60000,399.8,387.5
610,2017/02/23,402.5,394.349,392.8,54400,402.5,390.3
611,2017/02/24,411.3,412.205,412.3,44800,417.5,405.3
612,2017/02/27,415.0,414.833,412.8,37200,420.0,411.5
613,2017/02/28,405.0,406.608,415.0,72000,417.5,395.0
614,2017/03/01,413.8,411.605,413.8,22800,414.0,402.8
615,2017/03/02,411.8,413.905,416.3,11600,416.3,407.8
616,2017/03/03,406.3,407.392,412.5,12000,412.5,404.8
617,2017/03/06,400.0,401.379,402.8,27200,403.3,398.0
618,2017/03/07,404.3,401.594,400.0,16000,404.8,400.0
619,2017/03/08,400.0,403.204,404.8,21600,405.5,400.0
620,2017/03/09,401.5,400.183,400.0,22400,402.0,397.8
621,2017/03/10,408.5,405.512,401.8,24400,408.5,401.3
622,2017/03/13,436.3,426.417,411.3,146800,440.0,411.3
623,2017/03/14,481.0,465.543,444.8,177600,481.3,444.8
624,2017/03/15,550.0,523.786,477.5,539200,557.3,476.0
625,2017/03/16,665.5,617.205,564.8,941200,675.0,555.0
626,2017/03/17,554.8,587.018,640.5,596000,645.0,546.5
627,2017/03/21,594.8,573.19,550.3,244800,596.5,543.8
628,2017/03/22,564.8,567.791,577.8,97200,594.8,552.5
629,2017/03/23,551.5,552.712,551.8,68000,561.3,549.5
630,2017/03/24,551.3,552.204,551.5,41600,561.0,547.5
631,2017/03/27,564.0,563.397,567.0,49600,567.0,554.0
632,2017/03/28,622.3,592.632,567.3,108800,622.3,565.0
633,2017/03/29,641.0,622.695,622.3,176000,644.5,602.5
634,2017/03/30,633.8,645.138,644.5,91200,650.0,632.8
635,2017/03/31,617.5,622.914,625.3,44000,633.3,612.8
636,2017/04/03,596.0,605.602,610.0,85200,610.0,596.0
637,2017/04/04,571.3,581.68,595.8,98800,600.0,552.8
638,2017/04/05,575.0,568.906,555.3,84800,579.8,555.3
639,2017/04/06,560.8,566.999,574.3,67200,575.0,556.5
640,2017/04/07,612.3,575.295,556.3,110400,612.3,553.3
641,2017/04/10,664.8,651.315,612.3,313200,686.5,610.5
642,2017/04/11,652.5,688.775,687.5,557200,722.5,650.3
643,2017/04/12,610.3,609.343,643.3,232400,644.5,567.5
644,2017/04/13,610.3,611.569,605.3,32000,622.0,603.0
645,2017/04/14,620.3,617.0,618.8,29600,622.0,606.3
646,2017/04/17,695.0,663.485,627.3,104000,695.0,627.3
647,2017/04/18,725.0,720.689,700.0,151600,742.5,695.5
648,2017/04/19,679.5,711.409,745.0,92800,745.0,678.0
649,2017/04/20,805.0,779.654,746.3,206800,805.0,746.3
650,2017/04/21,950.0,918.825,835.0,958000,980.0,830.0
651,2017/04/24,860.0,886.19,925.0,324400,925.0,850.0
652,2017/04/25,935.0,885.281,830.0,277200,935.0,807.5
653,2017/04/26,885.0,892.204,882.5,177200,921.3,878.8
654,2017/04/27,855.0,864.774,886.3,75200,900.0,845.0
655,2017/04/28,875.0,845.153,837.5,81600,875.0,825.0
656,2017/05/01,861.3,885.232,910.0,90400,912.5,857.5
657,2017/05/02,840.0,845.741,861.3,66800,867.5,831.3
658,2017/05/08,827.5,837.116,861.3,56000,861.3,822.5
659,2017/05/09,873.8,853.518,823.8,94800,873.8,822.5
660,2017/05/10,883.8,871.929,873.8,111200,885.0,851.3
661,2017/05/11,987.5,935.224,900.0,361200,987.5,892.5
662,2017/05/12,982.5,964.151,962.5,148400,982.5,940.0
663,2017/05/15,967.5,981.49,986.3,166400,1007.5,961.3
664,2017/05/16,978.8,973.579,985.0,99600,988.8,953.8
665,2017/05/17,1076.3,1051.309,978.8,364000,1143.8,977.5
666,2017/05/18,1033.8,1033.502,1026.3,183200,1085.0,1005.0
667,2017/05/19,1125.0,1096.254,1051.3,258400,1130.0,1040.0
668,2017/05/22,1238.8,1219.374,1142.5,345600,1295.0,1142.5
669,2017/05/23,1223.8,1243.39,1257.5,341200,1307.5,1188.8
670,2017/05/24,1175.0,1191.14,1225.0,199200,1227.5,1156.3
671,2017/05/25,1115.0,1124.089,1157.5,282000,1162.5,1090.0
672,2017/05/26,1056.3,1072.865,1110.0,310800,1140.0,1025.0
673,2017/05/29,1012.5,1024.592,1037.5,204400,1041.3,1003.8
674,2017/05/30,1068.8,1073.348,1025.0,282400,1100.0,1025.0
675,2017/05/31,1106.3,1092.314,1056.3,129200,1112.5,1053.8
676,2017/06/01,1106.3,1120.039,1125.0,204800,1135.0,1093.8
677,2017/06/02,1040.0,1054.516,1106.3,179600,1106.3,1026.3
678,2017/06/05,1096.3,1077.423,1023.8,129200,1098.8,1018.8
679,2017/06/06,1072.5,1073.217,1100.0,95600,1100.0,1045.0
680,2017/06/07,1051.3,1065.488,1068.8,51200,1082.5,1050.0
681,2017/06/08,1103.8,1119.388,1086.3,260400,1142.5,1067.5
682,2017/06/09,1127.5,1131.013,1092.5,137200,1152.5,1087.5
683,2017/06/12,1141.3,1132.322,1137.5,151600,1168.8,1095.0
684,2017/06/13,1112.5,1113.837,1108.8,74800,1127.5,1107.5
685,2017/06/14,1068.8,1104.281,1113.8,119600,1146.3,1051.3
686,2017/06/15,1075.0,1060.092,1057.5,60000,1085.0,1037.5
687,2017/06/16,1061.3,1061.307,1070.0,44000,1075.0,1051.3
688,2017/06/19,1056.3,1060.202,1052.5,27200,1075.0,1050.0
689,2017/06/20,1100.0,1089.824,1070.0,76800,1106.3,1060.0
690,2017/06/21,1101.3,1109.083,1116.3,24000,1116.3,1100.0
691,2017/06/22,1073.8,1078.424,1095.0,46000,1115.0,1062.5
692,2017/06/23,1057.5,1057.927,1057.5,34000,1073.8,1051.3
693,2017/06/26,1057.5,1061.014,1057.5,14800,1068.8,1055.0
694,2017/06/27,1041.3,1038.19,1055.0,58000,1055.0,1025.0
695,2017/06/28,948.8,977.094,1018.8,129200,1023.8,936.3
696,2017/06/29,962.5,975.762,950.0,65600,1000.0,950.0
697,2017/06/30,928.8,921.303,935.0,104000,953.8,901.3
698,2017/07/03,1000.0,978.152,928.8,128800,1012.5,926.3
699,2017/07/04,996.3,1003.787,998.8,108800,1023.8,987.5
700,2017/07/05,1005.0,1005.604,1007.5,47200,1018.8,997.5
701,2017/07/06,1046.3,1032.5,1010.0,112400,1050.0,1001.3
702,2017/07/07,1063.8,1059.971,1046.3,136800,1075.0,1028.8
703,2017/07/10,1107.5,1105.78,1085.0,176400,1150.0,1082.5
704,2017/07/11,1047.5,1092.933,1122.5,903600,1190.0,1001.3
705,2017/07/12,1022.5,1015.569,1025.0,282800,1043.8,987.5
706,2017/07/13,1086.3,1061.379,1038.8,147200,1086.3,1027.5
707,2017/07/14,1220.0,1178.634,1087.5,628400,1220.0,1087.5
708,2017/07/18,1300.0,1241.276,1196.3,379200,1300.0,1175.0
709,2017/07/19,1337.5,1302.192,1297.5,243200,1367.5,1245.0
710,2017/07/20,1272.5,1296.284,1337.5,88000,1337.5,1267.5
711,2017/07/21,1265.0,1249.929,1272.5,92000,1300.0,1197.5
712,2017/07/24,1262.5,1258.916,1252.5,51200,1285.0,1232.5
713,2017/07/25,1290.0,1294.228,1250.0,92000,1325.0,1240.0
714,2017/07/26,1505.0,1423.891,1310.0,336400,1525.0,1297.5
715,2017/07/27,1492.5,1483.708,1487.5,192000,1562.5,1427.5
716,2017/07/28,1617.5,1609.492,1542.5,200800,1662.5,1542.5
717,2017/07/31,1557.5,1548.856,1592.5,146800,1617.5,1482.5
718,2017/08/01,1507.5,1608.159,1562.5,347600,1732.5,1437.5
719,2017/08/02,1557.5,1552.767,1542.5,63600,1590.0,1527.5
720,2017/08/03,1450.0,1489.125,1507.5,128000,1572.5,1447.5
721,2017/08/04,1380.0,1378.478,1447.5,193200,1450.0,1340.0
722,2017/08/07,1335.0,1353.762,1402.5,84800,1405.0,1325.0
723,2017/08/08,1357.5,1371.978,1335.0,170400,1432.5,1302.5
724,2017/08/09,1467.5,1425.754,1345.0,172400,1487.5,1320.0
725,2017/08/10,1582.5,1558.645,1467.5,208800,1600.0,1467.5
726,2017/08/14,1612.5,1590.558,1557.5,175600,1637.5,1537.5
727,2017/08/15,1602.5,1603.025,1612.5,112400,1650.0,1557.5
728,2017/08/16,1567.5,1584.132,1577.5,57600,1612.5,1562.5
729,2017/08/17,1475.0,1501.715,1567.5,145200,1567.5,1460.0
730,2017/08/18,1452.5,1494.97,1480.0,66800,1550.0,1450.0
731,2017/08/21,1347.5,1350.721,1427.5,245600,1437.5,1325.0
732,2017/08/22,1290.0,1307.907,1387.5,196800,1387.5,1257.5
733,2017/08/23,1265.0,1259.014,1292.5,208000,1295.0,1237.5
734,2017/08/24,1202.5,1239.692,1270.0,155600,1295.0,1200.0
735,2017/08/25,1270.0,1269.385,1243.8,230000,1300.0,1225.0
736,2017/08/28,1360.0,1342.863,1290.0,214800,1387.5,1287.5
737,2017/08/29,1317.5,1352.579,1337.5,253200,1430.0,1302.5
738,2017/08/30,1352.5,1357.361,1317.5,107600,1377.5,1317.5
739,2017/08/31,1300.0,1320.844,1352.5,98400,1387.5,1290.0
740,2017/09/01,1300.0,1294.426,1302.5,64400,1322.5,1280.0
741,2017/09/04,1272.5,1261.081,1270.0,53200,1277.5,1243.8
742,2017/09/05,1245.0,1259.533,1277.5,72800,1302.5,1236.3
743,2017/09/06,1252.5,1238.776,1235.0,58000,1275.0,1202.5
744,2017/09/07,1241.3,1241.875,1267.5,31200,1267.5,1225.0
745,2017/09/08,1350.0,1340.915,1275.0,246000,1387.5,1272.5
746,2017/09/11,1447.5,1428.569,1417.5,195600,1447.5,1397.5
747,2017/09/12,1570.0,1537.577,1472.5,271200,1595.0,1472.5
748,2017/09/13,1610.0,1585.784,1570.0,168400,1620.0,1540.0
749,2017/09/14,1602.5,1596.265,1610.0,130400,1620.0,1552.5
750,2017/09/15,1575.0,1578.112,1565.0,55600,1617.5,1560.0
751,2017/09/19,1570.0,1540.16,1550.0,75200,1575.0,1507.5
752,2017/09/20,1537.5,1559.231,1570.0,41600,1577.5,1537.5
753,2017/09/21,1562.5,1558.598,1545.0,59200,1582.5,1532.5
754,2017/09/22,1530.0,1536.732,1587.5,50800,1587.5,1507.5
755,2017/09/25,1582.5,1583.701,1530.0,123200,1630.0,1520.0
756,2017/09/26,1612.5,1569.063,1607.5,121600,1612.5,1515.0
757,2017/09/27,1602.5,1609.099,1580.0,54400,1625.0,1555.0
758,2017/09/28,1645.0,1630.098,1592.5,61200,1650.0,1592.5
759,2017/09/29,1725.0,1689.693,1632.5,156400,1742.5,1615.0
760,2017/10/02,1747.5,1780.048,1742.5,188400,1860.0,1740.0
761,2017/10/03,1765.0,1769.371,1767.5,68400,1787.5,1747.5
762,2017/10/04,1680.0,1713.286,1775.0,119600,1797.5,1675.0
763,2017/10/05,1685.0,1696.589,1680.0,60400,1720.0,1680.0
764,2017/10/06,1847.5,1802.109,1710.0,192000,1875.0,1710.0
765,2017/10/10,1960.0,1941.531,1865.0,208400,1992.5,1865.0
766,2017/10/11,1960.0,2038.381,1977.5,281600,2147.5,1925.0
767,2017/10/12,2335.0,2249.635,2110.0,257600,2335.0,2102.5
768,2017/10/13,2387.5,2365.409,2372.5,694400,2575.0,2152.5
769,2017/10/16,2762.5,2602.931,2425.0,241200,2762.5,2425.0
770,2017/10/17,2650.0,2677.525,2837.5,405600,2880.0,2515.0
771,2017/10/18,2480.0,2516.282,2575.0,172400,2575.0,2477.5
772,2017/10/19,2315.0,2355.499,2442.5,218400,2480.0,2290.0
773,2017/10/20,2247.5,2323.421,2327.5,231200,2445.0,2245.0
774,2017/10/23,2285.0,2293.137,2280.0,84800,2330.0,2255.0
775,2017/10/24,2445.0,2401.608,2260.0,251200,2600.0,2215.0
776,2017/10/25,2307.5,2384.167,2435.0,170400,2502.5,2292.5
777,2017/10/26,2335.0,2340.625,2320.0,108800,2422.5,2272.5
778,2017/10/27,2312.5,2344.772,2350.0,92000,2402.5,2307.5
779,2017/10/30,2407.5,2369.141,2350.0,76800,2410.0,2325.0
780,2017/10/31,2440.0,2450.489,2350.0,182000,2537.5,2327.5
781,2017/11/01,2432.5,2447.005,2467.5,88800,2485.0,2405.0
782,2017/11/02,2420.0,2471.297,2437.5,105600,2537.5,2420.0
783,2017/11/06,2345.0,2391.525,2457.5,56400,2457.5,2345.0
784,2017/11/07,2692.5,2567.933,2457.5,390400,2697.5,2435.0
785,2017/11/08,2700.0,2666.982,2735.0,247200,2737.5,2565.0
786,2017/11/09,2672.5,2800.451,2750.0,359200,2982.5,2575.0
787,2017/11/10,2707.5,2641.453,2535.0,162400,2745.0,2505.0
788,2017/11/13,2895.0,2877.079,2710.0,294400,3020.0,2640.0
789,2017/11/14,2800.0,2869.791,2820.0,143600,2995.0,2797.5
790,2017/11/15,2612.5,2637.994,2757.5,154000,2757.5,2542.5
791,2017/11/16,2705.0,2726.717,2637.5,125200,2800.0,2625.0
792,2017/11/17,2750.0,2793.219,2830.0,136400,2890.0,2667.5
793,2017/11/20,2747.5,2751.139,2705.0,31600,2792.5,2705.0
794,2017/11/21,2695.0,2722.799,2797.5,56800,2800.0,2675.0
795,2017/11/22,2725.0,2750.436,2712.5,94000,2830.0,2697.5
796,2017/11/24,2942.5,2858.91,2775.0,153200,2950.0,2745.0
797,2017/11/27,3040.0,3043.533,3000.0,180000,3117.5,2997.5
798,2017/11/28,2860.0,2906.094,3040.0,147200,3045.0,2750.0
799,2017/11/29,3150.0,3057.663,2945.0,160000,3150.0,2930.0
800,2017/11/30,3075.0,3221.296,3300.0,273200,3440.0,3035.0
801,2017/12/01,2920.0,3018.836,3125.0,201800,3185.0,2915.0
802,2017/12/04,2985.0,3039.413,3050.0,92000,3105.0,2955.0
803,2017/12/05,2900.0,3022.609,3035.0,187400,3165.0,2900.0
804,2017/12/06,2400.0,2442.178,2600.0,318400,2600.0,2400.0
805,2017/12/07,2230.0,2219.584,2295.0,606000,2317.5,2150.0
806,2017/12/08,2210.0,2200.006,2222.5,166800,2225.0,2177.5
807,2017/12/11,2210.0,2173.65,2225.0,191400,2235.0,2125.0
808,2017/12/12,2155.0,2197.373,2217.5,252600,2275.0,2127.5
809,2017/12/13,1980.0,2033.845,2180.0,311600,2180.0,1965.0
810,2017/12/14,2090.0,2059.036,2000.0,273200,2132.5,1985.0
811,2017/12/15,2092.5,2081.39,2132.5,110400,2132.5,2025.0
812,2017/12/18,2442.5,2318.422,2155.0,674200,2442.5,2092.5
813,2017/12/19,2245.0,2298.885,2387.5,400400,2390.0,2225.0
814,2017/12/20,2137.5,2215.266,2227.5,226000,2335.0,2130.0
815,2017/12/21,2230.0,2225.234,2232.5,121800,2270.0,2180.0
816,2017/12/22,2230.0,2242.385,2272.5,73600,2277.5,2200.0
817,2017/12/25,2182.5,2194.676,2257.5,88000,2257.5,2145.0
818,2017/12/26,2140.0,2147.665,2170.0,96800,2185.0,2107.5
819,2017/12/27,2162.5,2132.572,2137.5,118800,2192.5,2067.5
820,2017/12/28,2122.5,2131.388,2142.5,47200,2162.5,2115.0
821,2017/12/29,2140.0,2134.84,2117.5,43600,2155.0,2110.0
822,2018/01/04,2262.5,2231.642,2170.0,126400,2295.0,2162.5
823,2018/01/05,2365.0,2316.709,2215.0,178800,2387.5,2200.0
824,2018/01/09,2455.0,2450.139,2402.5,190400,2490.0,2402.5
825,2018/01/10,2395.0,2414.245,2440.0,237200,2477.5,2355.0
826,2018/01/11,2150.0,2182.028,2160.0,473000,2282.5,2107.5
827,2018/01/12,2127.5,2132.623,2200.0,163000,2200.0,2080.0
828,2018/01/15,1995.0,2032.164,2135.0,307800,2135.0,1975.0
829,2018/01/16,2150.0,2097.733,2005.0,244800,2150.0,2005.0
830,2018/01/17,1952.5,1994.359,2050.0,535000,2060.0,1950.0
831,2018/01/18,1820.0,1845.372,1902.5,499600,1910.0,1802.5
832,2018/01/19,1802.5,1817.529,1800.0,204000,1850.0,1787.5
833,2018/01/22,1875.0,1875.818,1820.0,206600,1917.5,1807.5
834,2018/01/23,1857.5,1863.339,1910.0,155600,1910.0,1835.0
835,2018/01/24,1880.0,1870.659,1857.5,85000,1892.5,1845.0
836,2018/01/25,1827.5,1841.525,1852.5,156400,1872.5,1827.5
837,2018/01/26,1830.0,1848.023,1850.0,126200,1895.0,1825.0
838,2018/01/29,1872.5,1882.921,1875.0,179400,1915.0,1840.0
839,2018/01/30,1895.0,1911.708,1910.0,224200,1957.5,1850.0
840,2018/01/31,1927.5,1920.357,1890.0,108000,1942.5,1887.5
841,2018/02/01,1972.5,1978.5,1957.5,249000,2017.5,1935.0
842,2018/02/02,2097.5,2038.6,2007.5,343200,2097.5,1997.5
843,2018/02/05,2050.0,2021.137,2027.5,265200,2072.5,1955.0
844,2018/02/06,1740.0,1807.595,1840.0,367600,1932.5,1700.0
845,2018/02/07,1745.0,1843.935,1850.0,302400,1940.0,1745.0
846,2018/02/08,1845.0,1805.615,1760.0,148800,1852.5,1750.0
847,2018/02/09,1910.0,1837.766,1707.5,208800,1912.5,1707.5
848,2018/02/13,1842.5,1949.655,1970.0,199800,2017.5,1842.5
849,2018/02/14,1812.5,1854.854,1840.0,133600,1960.0,1800.0
850,2018/02/15,1882.5,1896.727,1917.5,88600,1927.5,1852.5
851,2018/02/16,2022.5,1990.577,1917.5,163000,2022.5,1917.5
852,2018/02/19,1990.0,2026.54,2090.0,129200,2092.5,1980.0
853,2018/02/20,2127.5,2095.458,2000.0,354800,2147.5,1952.5
854,2018/02/21,2195.0,2192.613,2155.0,274200,2235.0,2135.0
855,2018/02/22,2112.5,2135.557,2175.0,124000,2192.5,2105.0
856,2018/02/23,2040.0,2073.84,2107.5,127600,2160.0,2027.5
857,2018/02/26,2002.5,2023.157,2040.0,78400,2075.0,1980.0
858,2018/02/27,1952.5,1958.938,2002.5,116800,2015.0,1940.0
859,2018/02/28,2025.0,1995.392,1952.5,63800,2045.0,1940.0
860,2018/03/01,2057.5,2037.081,2015.0,89400,2077.5,1965.0
861,2018/03/02,2070.0,2055.969,1987.5,112000,2107.5,1967.5
862,2018/03/05,2040.0,2085.497,2082.5,116800,2127.5,2027.5
863,2018/03/06,2130.0,2108.418,2092.5,108400,2135.0,2055.0
864,2018/03/07,2087.5,2102.97,2140.0,88400,2145.0,2065.0
865,2018/03/08,2125.0,2126.199,2122.5,87600,2142.5,2090.0
866,2018/03/09,2165.0,2174.177,2160.0,108800,2187.5,2130.0
867,2018/03/12,2235.0,2225.71,2197.5,142200,2250.0,2180.0
868,2018/03/13,2342.5,2322.405,2235.0,183600,2365.0,2227.5
869,2018/03/14,2500.0,2451.157,2400.0,217400,2500.0,2367.5
870,2018/03/15,2420.0,2429.014,2460.0,118600,2482.5,2350.0
871,2018/03/16,2337.5,2383.329,2420.0,75400,2450.0,2337.5
872,2018/03/19,2325.0,2303.926,2275.0,78200,2382.5,2262.5
873,2018/03/20,2292.5,2278.323,2255.0,47400,2317.5,2252.5
874,2018/03/22,2320.0,2348.284,2320.0,53600,2395.0,2300.0
875,2018/03/23,2335.0,2288.273,2215.0,167000,2405.0,2175.0
876,2018/03/26,2387.5,2384.086,2335.0,103400,2417.5,2322.5
877,2018/03/27,2290.0,2350.718,2447.5,86400,2447.5,2235.0
878,2018/03/28,2327.0,2327.91,2240.0,41000,2399.0,2240.0
879,2018/03/29,2308.0,2335.21,2350.0,18600,2360.0,2298.0
880,2018/03/30,2223.0,2237.026,2309.0,83900,2325.0,2212.0
881,2018/04/02,2161.0,2172.592,2200.0,75800,2200.0,2151.0
882,2018/04/03,2266.0,2191.614,2129.0,45300,2274.0,2124.0
883,2018/04/04,2218.0,2253.979,2280.0,42300,2302.0,2193.0
884,2018/04/05,2155.0,2176.057,2202.0,49500,2228.0,2150.0
885,2018/04/06,2110.0,2140.257,2186.0,47500,2189.0,2100.0
886,2018/04/09,1962.0,1971.021,2063.0,118200,2063.0,1925.0
887,2018/04/10,1920.0,1910.4,1932.0,168200,1950.0,1887.0
888,2018/04/11,1740.0,1722.485,1720.0,226700,1750.0,1697.0
889,2018/04/12,1705.0,1713.346,1727.0,122800,1756.0,1702.0
890,2018/04/13,1557.0,1584.241,1700.0,271400,1700.0,1509.0
891,2018/04/16,1501.0,1510.397,1557.0,193500,1560.0,1480.0
892,2018/04/17,1628.0,1601.843,1550.0,173400,1665.0,1537.0
893,2018/04/18,1541.0,1552.712,1583.0,172400,1595.0,1514.0
894,2018/04/19,1482.0,1505.606,1557.0,132700,1557.0,1482.0
895,2018/04/20,1503.0,1499.969,1487.0,83400,1530.0,1482.0
896,2018/04/23,1438.0,1454.067,1501.0,103500,1501.0,1431.0
897,2018/04/24,1434.0,1414.751,1438.0,133700,1468.0,1397.0
898,2018/04/25,1537.0,1493.227,1437.0,139100,1548.0,1414.0
899,2018/04/26,1678.0,1658.19,1530.0,273400,1740.0,1526.0
900,2018/04/27,1691.0,1720.12,1676.0,162800,1776.0,1655.0
901,2018/05/01,1869.0,1802.825,1708.0,184800,1870.0,1708.0
902,2018/05/02,1752.0,1791.27,1802.0,153100,1864.0,1717.0
903,2018/05/07,1684.0,1692.469,1745.0,61400,1749.0,1662.0
904,2018/05/08,1846.0,1812.532,1684.0,160100,1866.0,1684.0
905,2018/05/09,1804.0,1847.031,1853.0,55500,1885.0,1794.0
906,2018/05/10,1786.0,1815.762,1787.0,41100,1875.0,1784.0
907,2018/05/11,1763.0,1781.014,1787.0,21900,1819.0,1753.0
908,2018/05/14,1740.0,1733.444,1750.0,33800,1798.0,1718.0
909,2018/05/15,1692.0,1700.584,1740.0,51400,1750.0,1668.0
910,2018/05/16,1770.0,1736.532,1692.0,38000,1774.0,1686.0
911,2018/05/17,1793.0,1791.495,1770.0,41600,1813.0,1760.0
912,2018/05/18,1787.0,1818.747,1800.0,82300,1860.0,1782.0
913,2018/05/21,1890.0,1864.87,1788.0,92300,1897.0,1788.0
914,2018/05/22,1899.0,1895.046,1875.0,73500,1915.0,1851.0
915,2018/05/23,1937.0,1937.365,1899.0,89600,1985.0,1886.0
916,2018/05/24,1878.0,1912.32,1934.0,56800,1961.0,1872.0
917,2018/05/25,1778.0,1838.099,1870.0,55400,1909.0,1771.0
918,2018/05/28,1773.0,1765.655,1776.0,50700,1812.0,1728.0
919,2018/05/29,1790.0,1798.222,1763.0,30600,1820.0,1763.0
920,2018/05/30,1868.0,1798.672,1720.0,77500,1880.0,1711.0
921,2018/05/31,1860.0,1852.423,1869.0,37800,1869.0,1835.0
922,2018/06/01,1843.0,1851.104,1862.0,16300,1864.0,1827.0
923,2018/06/04,1814.0,1847.669,1848.0,51700,1888.0,1807.0
924,2018/06/05,1764.0,1763.052,1807.0,71500,1807.0,1721.0
925,2018/06/06,2005.0,2000.566,1993.0,322700,2036.0,1950.0
926,2018/06/07,2066.0,2055.17,1996.0,123500,2093.0,1965.0
927,2018/06/08,2147.0,2118.228,2067.0,89600,2183.0,2033.0
928,2018/06/11,2235.0,2249.96,2187.0,160300,2300.0,2180.0
929,2018/06/12,2309.0,2319.473,2220.0,137500,2350.0,2220.0
930,2018/06/13,2264.0,2324.584,2369.0,96400,2395.0,2264.0
931,2018/06/14,2349.0,2338.565,2324.0,95200,2380.0,2275.0
932,2018/06/15,2342.0,2420.764,2344.0,197100,2499.0,2310.0
933,2018/06/18,2480.0,2454.309,2392.0,84600,2485.0,2385.0
934,2018/06/19,2469.0,2540.892,2500.0,137100,2629.0,2454.0
935,2018/06/20,2700.0,2631.176,2619.0,163400,2700.0,2470.0
936,2018/06/21,2644.0,2661.518,2700.0,93700,2750.0,2571.0
937,2018/06/22,2717.0,2719.2,2677.0,68900,2748.0,2665.0
938,2018/06/25,2717.0,2798.768,2750.0,120600,2870.0,2711.0
939,2018/06/26,2576.0,2626.751,2617.0,104900,2694.0,2545.0
940,2018/06/27,2480.0,2527.932,2550.0,103100,2600.0,2480.0
941,2018/06/28,2546.0,2415.488,2466.0,127700,2550.0,2298.0
942,2018/06/29,2495.0,2549.296,2528.0,58500,2631.0,2485.0
943,2018/07/02,2370.0,2378.33,2472.0,82400,2494.0,2339.0
944,2018/07/03,2620.0,2600.413,2420.0,130900,2685.0,2411.0
945,2018/07/04,2476.0,2443.586,2531.0,111400,2548.0,2372.0
946,2018/07/05,2237.0,2303.494,2485.0,152300,2485.0,2180.0
947,2018/07/06,2232.0,2237.23,2237.0,43000,2310.0,2194.0
948,2018/07/09,2245.0,2234.36,2244.0,25000,2284.0,2201.0
949,2018/07/10,2151.0,2135.04,2245.0,134500,2245.0,2059.0
950,2018/07/11,2543.0,2490.172,2501.0,375800,2590.0,2389.0
951,2018/07/12,2730.0,2692.467,2536.0,244800,2750.0,2527.0
952,2018/07/13,2710.0,2789.526,2680.0,231800,2880.0,2631.0
953,2018/07/17,2872.0,2905.881,2770.0,238300,2965.0,2770.0
954,2018/07/18,2772.0,2833.373,2922.0,115500,2972.0,2735.0
955,2018/07/19,2892.0,2855.289,2762.0,64100,2920.0,2732.0
956,2018/07/20,2740.0,2779.816,2842.0,137200,2898.0,2732.0
957,2018/07/23,2417.0,2482.306,2649.0,207800,2650.0,2412.0
958,2018/07/24,2381.0,2410.403,2440.0,126600,2492.0,2350.0
959,2018/07/25,2432.0,2379.809,2374.0,128200,2449.0,2311.0
960,2018/07/26,2438.0,2387.936,2441.0,119800,2468.0,2323.0
961,2018/07/27,2373.0,2359.901,2400.0,104600,2400.0,2335.0
962,2018/07/30,2270.0,2292.085,2358.0,96900,2358.0,2259.0
963,2018/07/31,2132.0,2157.819,2264.0,203200,2264.0,2123.0
964,2018/08/01,2226.0,2237.239,2182.0,108300,2280.0,2170.0
965,2018/08/02,2370.0,2335.067,2240.0,153800,2383.0,2240.0
966,2018/08/03,2328.0,2295.478,2415.0,105400,2415.0,2222.0
967,2018/08/06,2406.0,2391.274,2310.0,113500,2462.0,2243.0
968,2018/08/07,2283.0,2326.894,2372.0,62200,2417.0,2270.0
969,2018/08/08,2300.0,2314.608,2284.0,36700,2341.0,2277.0
970,2018/08/09,2270.0,2253.362,2323.0,64100,2325.0,2208.0
971,2018/08/10,2206.0,2221.02,2237.0,64200,2276.0,2193.0
972,2018/08/13,2264.0,2233.776,2200.0,45000,2269.0,2174.0
973,2018/08/14,2290.0,2267.037,2264.0,27400,2309.0,2201.0
974,2018/08/15,2245.0,2260.225,2280.0,20000,2300.0,2233.0
975,2018/08/16,2177.0,2199.969,2245.0,29300,2249.0,2154.0
976,2018/08/17,2157.0,2176.887,2177.0,15100,2219.0,2150.0
977,2018/08/20,2157.0,2196.064,2155.0,15700,2243.0,2155.0
978,2018/08/21,2023.0,2032.186,2112.0,85300,2151.0,2000.0
979,2018/08/22,2059.0,2011.924,2014.0,51600,2060.0,1957.0
980,2018/08/23,2150.0,2110.235,2033.0,41300,2176.0,2015.0
981,2018/08/24,2160.0,2170.877,2149.0,30100,2203.0,2132.0
982,2018/08/27,2253.0,2262.098,2187.0,45100,2289.0,2185.0
983,2018/08/28,2168.0,2228.815,2300.0,33000,2300.0,2165.0
984,2018/08/29,2191.0,2201.615,2185.0,32500,2242.0,2141.0
985,2018/08/30,2298.0,2281.489,2205.0,50500,2335.0,2205.0
986,2018/08/31,2285.0,2276.298,2276.0,17100,2298.0,2255.0
987,2018/09/03,2315.0,2355.216,2285.0,46800,2397.0,2285.0
988,2018/09/04,2261.0,2293.559,2337.0,46700,2357.0,2234.0
989,2018/09/05,2180.0,2192.281,2230.0,34500,2245.0,2142.0
990,2018/09/06,2134.0,2138.105,2150.0,54500,2233.0,2087.0
991,2018/09/07,2049.0,2037.646,2051.0,73900,2091.0,1983.0
992,2018/09/10,2046.0,2099.791,2043.0,35400,2159.0,2036.0
993,2018/09/11,2016.0,2037.644,2096.0,59200,2123.0,1998.0
994,2018/09/12,2001.0,1992.493,2021.0,43200,2045.0,1975.0
995,2018/09/13,1907.0,1952.161,2001.0,66400,2025.0,1884.0
996,2018/09/14,1903.0,1912.061,1919.0,60300,1977.0,1890.0
997,2018/09/18,1902.0,1920.524,1914.0,48500,1974.0,1891.0
998,2018/09/19,1873.0,1884.551,1916.0,62200,1928.0,1866.0
999,2018/09/20,1869.0,1861.513,1874.0,46600,1890.0,1836.0
1000,2018/09/21,1851.0,1854.599,1859.0,61800,1895.0,1822.0
1001,2018/09/25,1816.0,1815.001,1827.0,69800,1848.0,1802.0
1002,2018/09/26,1902.0,1864.431,1824.0,81400,1905.0,1815.0
1003,2018/09/27,1879.0,1875.099,1912.0,71800,1912.0,1840.0
1004,2018/09/28,1972.0,1942.064,1897.0,130800,2003.0,1881.0
1005,2018/10/01,1926.0,1932.089,1970.0,62900,1972.0,1912.0
1006,2018/10/02,1880.0,1883.646,1930.0,81400,1946.0,1833.0
1007,2018/10/03,1831.0,1826.462,1884.0,41100,1885.0,1812.0
1008,2018/10/04,1764.0,1780.5,1831.0,132900,1850.0,1720.0
1009,2018/10/05,1708.0,1706.064,1710.0,147300,1754.0,1674.0
1010,2018/10/09,1488.0,1544.761,1653.0,226500,1659.0,1488.0
1011,2018/10/10,1526.0,1511.292,1503.0,131200,1540.0,1480.0
1012,2018/10/11,1126.0,1126.0,1126.0,35600,1126.0,1126.0
1013,2018/10/12,1015.0,995.377,1015.0,700600,1015.0,965.0
1014,2018/10/15,1061.0,1030.162,1021.0,283000,1087.0,1001.0
1015,2018/10/16,1082.0,1068.735,1071.0,134100,1108.0,1029.0
1016,2018/10/17,1087.0,1096.876,1107.0,103300,1122.0,1072.0
1017,2018/10/18,1186.0,1174.756,1107.0,255600,1240.0,1070.0
1018,2018/10/19,1158.0,1161.311,1175.0,123800,1204.0,1110.0
1019,2018/10/22,1167.0,1138.068,1152.0,88900,1174.0,1091.0
1020,2018/10/23,1100.0,1110.413,1143.0,73800,1147.0,1085.0
1021,2018/10/24,1120.0,1116.399,1085.0,66200,1150.0,1082.0
1022,2018/10/25,1026.0,1043.833,1056.0,103800,1079.0,1010.0
1023,2018/10/26,944.0,986.259,1030.0,182200,1055.0,937.0
1024,2018/10/29,1017.0,1060.892,1094.0,213400,1094.0,990.0
1025,2018/10/30,1028.0,1021.425,987.0,133700,1073.0,977.0
1026,2018/10/31,1029.0,1043.724,1058.0,47100,1068.0,1023.0
1027,2018/11/01,1059.0,1080.821,1060.0,63100,1108.0,1054.0
1028,2018/11/02,1034.0,1033.022,1085.0,73400,1085.0,1002.0
1029,2018/11/05,1015.0,1020.39,1023.0,38700,1040.0,1001.0
1030,2018/11/06,987.0,999.596,1009.0,58200,1036.0,985.0
1031,2018/11/07,1000.0,1008.335,989.0,54400,1028.0,985.0
1032,2018/11/08,950.0,977.581,1010.0,96600,1024.0,950.0
1033,2018/11/09,909.0,924.441,952.0,121500,962.0,900.0
1034,2018/11/12,874.0,895.277,924.0,97500,924.0,864.0
1035,2018/11/13,834.0,833.538,850.0,147800,855.0,820.0
1036,2018/11/14,813.0,811.021,846.0,154400,846.0,796.0
1037,2018/11/15,814.0,819.863,843.0,65000,843.0,803.0
1038,2018/11/16,781.0,801.824,825.0,48800,828.0,781.0
1039,2018/11/19,808.0,792.476,782.0,82800,818.0,761.0
1040,2018/11/20,767.0,778.811,805.0,71300,805.0,763.0
1041,2018/11/21,773.0,773.205,758.0,65900,804.0,758.0
1042,2018/11/22,819.0,796.194,778.0,58900,822.0,767.0
1043,2018/11/26,832.0,828.245,810.0,48500,850.0,795.0
1044,2018/11/27,820.0,838.946,841.0,49500,869.0,820.0
1045,2018/11/28,905.0,887.995,821.0,127200,917.0,821.0
1046,2018/11/29,921.0,913.793,898.0,95700,940.0,877.0
1047,2018/11/30,931.0,949.805,921.0,109700,976.0,919.0
1048,2018/12/03,956.0,965.759,934.0,136100,999.0,934.0
1049,2018/12/04,917.0,940.658,944.0,89000,975.0,910.0
1050,2018/12/05,925.0,918.482,902.0,38800,947.0,891.0
1051,2018/12/06,830.0,859.697,925.0,88300,925.0,830.0
1052,2018/12/07,762.0,780.816,815.0,159600,818.0,762.0
1053,2018/12/10,712.0,736.864,762.0,178500,782.0,711.0
1054,2018/12/11,694.0,698.84,718.0,112500,729.0,684.0
1055,2018/12/12,711.0,703.893,693.0,73900,726.0,683.0
1056,2018/12/13,694.0,693.17,713.0,174800,718.0,675.0
1057,2018/12/14,685.0,686.364,705.0,46200,705.0,674.0
1058,2018/12/17,649.0,660.172,675.0,113700,675.0,646.0
1059,2018/12/18,644.0,642.456,647.0,68500,657.0,629.0
1060,2018/12/19,665.0,668.749,642.0,50600,689.0,641.0
1061,2018/12/20,613.0,621.724,652.0,75000,660.0,600.0
1062,2018/12/21,600.0,598.555,610.0,75000,611.0,566.0
1063,2018/12/25,556.0,556.676,550.0,100400,582.0,540.0
1064,2018/12/26,573.0,567.552,553.0,57800,591.0,553.0
1065,2018/12/27,602.0,599.791,591.0,68900,611.0,589.0
1066,2018/12/28,581.0,588.054,592.0,44900,603.0,576.0
1067,2019/01/04,577.0,570.33,567.0,27900,582.0,559.0
1068,2019/01/07,601.0,619.564,590.0,77900,635.0,586.0
1069,2019/01/08,644.0,645.613,610.0,60000,664.0,610.0
1070,2019/01/09,616.0,627.714,637.0,60900,655.0,615.0
1071,2019/01/10,579.0,587.892,625.0,80700,630.0,574.0
1072,2019/01/11,576.0,571.812,571.0,44700,578.0,566.0
1073,2019/01/15,627.0,611.475,577.0,71100,645.0,576.0
1074,2019/01/16,727.0,714.001,647.0,263200,727.0,645.0
1075,2019/01/17,715.0,701.995,717.0,217100,739.0,673.0
1076,2019/01/18,663.0,676.971,700.0,90100,700.0,663.0
1077,2019/01/21,646.0,656.844,670.0,52700,673.0,643.0
1078,2019/01/22,711.0,685.777,641.0,180000,731.0,640.0
1079,2019/01/23,682.0,699.622,696.0,79300,722.0,682.0
1080,2019/01/24,773.0,761.987,717.0,258900,782.0,701.0
1081,2019/01/25,819.0,804.544,767.0,203900,828.0,767.0
1082,2019/01/28,843.0,863.654,858.0,167200,895.0,838.0
1083,2019/01/29,907.0,900.85,835.0,269100,957.0,826.0
1084,2019/01/30,873.0,907.039,965.0,219400,979.0,858.0
1085,2019/01/31,894.0,876.134,895.0,65700,896.0,850.0
1086,2019/02/01,829.0,844.867,895.0,85800,895.0,824.0
1087,2019/02/04,819.0,830.181,827.0,88600,865.0,812.0
1088,2019/02/05,838.0,839.461,837.0,59900,862.0,820.0
1089,2019/02/06,825.0,827.885,830.0,34900,836.0,819.0
1090,2019/02/07,793.0,799.737,817.0,54800,827.0,785.0
1091,2019/02/08,764.0,772.334,790.0,42800,790.0,758.0
1092,2019/02/12,756.0,757.798,760.0,27200,770.0,750.0
1093,2019/02/13,746.0,744.902,751.0,29700,766.0,738.0
1094,2019/02/14,731.0,735.552,746.0,20300,746.0,729.0
1095,2019/02/15,706.0,708.67,732.0,37900,732.0,700.0
1096,2019/02/18,698.0,694.571,700.0,48000,700.0,687.0
1097,2019/02/19,686.0,689.035,691.0,17300,698.0,681.0
1098,2019/02/20,686.0,680.811,687.0,30100,691.0,676.0
1099,2019/02/21,683.0,682.094,683.0,21200,688.0,676.0
1100,2019/02/22,682.0,676.75,680.0,20000,682.0,673.0
1101,2019/02/25,743.0,719.398,688.0,80700,746.0,683.0
1102,2019/02/26,710.0,716.34,742.0,55300,742.0,701.0
1103,2019/02/27,711.0,709.916,721.0,21300,721.0,704.0
1104,2019/02/28,694.0,702.123,719.0,28400,719.0,694.0
1105,2019/03/01,704.0,698.635,694.0,21900,710.0,688.0
1106,2019/03/04,710.0,703.842,711.0,20300,711.0,690.0
1107,2019/03/05,701.0,704.76,710.0,20400,712.0,700.0
1108,2019/03/06,696.0,695.958,707.0,11800,707.0,690.0
1109,2019/03/07,673.0,676.973,694.0,32700,694.0,667.0
1110,2019/03/08,627.0,640.346,665.0,39900,665.0,624.0
1111,2019/03/11,610.0,611.276,624.0,37000,624.0,602.0
1112,2019/03/12,614.0,609.72,611.0,31800,616.0,605.0
1113,2019/03/13,609.0,609.353,611.0,19000,612.0,605.0
1114,2019/03/14,609.0,603.334,610.0,47900,610.0,598.0
1115,2019/03/15,599.0,599.914,605.0,16200,605.0,597.0
1116,2019/03/18,602.0,599.801,603.0,17100,604.0,596.0
1117,2019/03/19,599.0,601.175,607.0,17700,607.0,597.0
1118,2019/03/20,596.0,596.423,597.0,20100,600.0,595.0
1119,2019/03/22,592.0,594.227,600.0,18100,600.0,590.0
1120,2019/03/25,577.0,578.785,591.0,33000,591.0,573.0
1121,2019/03/26,600.0,595.817,578.0,51800,612.0,575.0
1122,2019/03/27,611.0,609.068,603.0,17600,612.0,603.0
1123,2019/03/28,587.0,594.012,605.0,24400,610.0,586.0
1124,2019/03/29,576.0,579.355,592.0,28700,592.0,574.0
1125,2019/04/01,588.0,593.504,582.0,42900,608.0,581.0
1126,2019/04/02,581.0,588.108,604.0,30500,606.0,580.0
1127,2019/04/03,574.0,572.708,579.0,68400,583.0,565.0
1128,2019/04/04,560.0,565.269,577.0,49900,577.0,558.0
1129,2019/04/05,564.0,563.717,563.0,24400,567.0,560.0
1130,2019/04/08,564.0,565.351,565.0,19100,571.0,560.0
1131,2019/04/09,558.0,558.188,562.0,43600,566.0,554.0
1132,2019/04/10,553.0,555.234,564.0,48700,564.0,550.0
1133,2019/04/11,559.0,550.639,558.0,50400,559.0,545.0
1134,2019/04/12,568.0,567.736,560.0,68200,579.0,559.0
1135,2019/04/15,560.0,570.208,571.0,51900,580.0,559.0
1136,2019/04/16,558.0,558.467,561.0,27000,562.0,556.0
1137,2019/04/17,553.0,555.576,560.0,29700,565.0,550.0
1138,2019/04/18,545.0,548.966,556.0,46400,556.0,545.0
1139,2019/04/19,535.0,542.065,550.0,40000,552.0,535.0
1140,2019/04/22,562.0,550.805,545.0,59000,562.0,534.0
1141,2019/04/23,560.0,565.994,564.0,53500,573.0,557.0
1142,2019/04/24,566.0,566.132,565.0,32500,572.0,557.0
1143,2019/04/25,562.0,572.081,568.0,43100,581.0,562.0
1144,2019/04/26,565.0,562.104,565.0,28900,574.0,557.0
1145,2019/05/07,580.0,581.391,563.0,65500,593.0,561.0
1146,2019/05/08,595.0,585.318,585.0,45000,595.0,573.0
1147,2019/05/09,567.0,571.774,595.0,64700,595.0,559.0
1148,2019/05/10,569.0,570.951,567.0,30800,582.0,561.0
1149,2019/05/13,568.0,565.654,572.0,24000,572.0,562.0
1150,2019/05/14,551.0,552.492,551.0,41500,558.0,549.0
1151,2019/05/15,541.0,544.262,551.0,34000,554.0,540.0
1152,2019/05/16,523.0,526.3,540.0,77400,540.0,519.0
1153,2019/05/17,509.0,508.672,521.0,92500,521.0,502.0
1154,2019/05/20,497.0,498.2,505.0,73900,507.0,492.0
1155,2019/05/21,510.0,497.485,497.0,46800,510.0,488.0
1156,2019/05/22,500.0,503.507,506.0,21700,509.0,498.0
1157,2019/05/23,501.0,502.581,500.0,26000,507.0,499.0
1158,2019/05/24,509.0,512.026,500.0,73000,522.0,500.0
1159,2019/05/27,511.0,505.602,516.0,57600,516.0,499.0
1160,2019/05/28,509.0,518.807,504.0,101900,537.0,504.0
1161,2019/05/29,481.0,487.662,498.0,95900,499.0,479.0
1162,2019/05/30,473.0,474.807,480.0,45600,481.0,469.0
1163,2019/05/31,461.0,466.436,471.0,41300,473.0,460.0
1164,2019/06/03,426.0,446.796,465.0,74400,465.0,426.0
1165,2019/06/04,412.0,413.188,423.0,105700,423.0,404.0
1166,2019/06/05,435.0,430.621,420.0,98100,440.0,414.0
1167,2019/06/06,417.0,424.291,436.0,52500,436.0,416.0
1168,2019/06/07,426.0,422.127,418.0,25900,428.0,415.0
1169,2019/06/10,432.0,431.972,430.0,42700,440.0,427.0
1170,2019/06/11,418.0,419.767,429.0,52400,429.0,415.0
1171,2019/06/12,410.0,412.967,417.0,48100,418.0,410.0
1172,2019/06/13,406.0,404.411,409.0,43300,410.0,401.0
1173,2019/06/14,403.0,402.018,402.0,57100,406.0,399.0
1174,2019/06/17,401.0,403.514,404.0,47900,414.0,398.0
1175,2019/06/18,398.0,399.654,404.0,22800,404.0,397.0
1176,2019/06/19,400.0,400.131,402.0,28300,403.0,397.0
1177,2019/06/20,395.0,395.554,400.0,55800,400.0,392.0
1178,2019/06/21,397.0,400.583,395.0,33300,409.0,395.0
1179,2019/06/24,387.0,390.053,401.0,62400,401.0,387.0
1180,2019/06/25,383.0,382.75,387.0,50300,388.0,380.0
1181,2019/06/26,378.0,378.177,381.0,32300,382.0,375.0
1182,2019/06/27,392.0,388.706,386.0,30900,393.0,384.0
1183,2019/06/28,394.0,393.311,394.0,19600,396.0,391.0
1184,2019/07/01,408.0,403.475,400.0,63400,410.0,398.0
1185,2019/07/02,404.0,404.056,404.0,26600,408.0,401.0
1186,2019/07/03,407.0,406.325,406.0,31400,412.0,404.0
1187,2019/07/04,412.0,412.919,407.0,53200,419.0,407.0
1188,2019/07/05,435.0,426.124,415.0,75800,435.0,415.0
1189,2019/07/08,431.0,430.942,435.0,65300,440.0,422.0
1190,2019/07/09,439.0,434.636,434.0,79100,440.0,427.0
1191,2019/07/10,490.0,507.766,455.0,1328400,519.0,453.0
1192,2019/07/11,512.0,485.702,486.0,547200,515.0,463.0
1193,2019/07/12,501.0,504.812,519.0,252100,520.0,493.0
1194,2019/07/16,483.0,484.991,499.0,115400,501.0,478.0
1195,2019/07/17,471.0,473.592,480.0,88800,488.0,466.0
1196,2019/07/18,456.0,453.265,467.0,129200,467.0,441.0
1197,2019/07/19,453.0,454.416,459.0,35300,460.0,451.0
1198,2019/07/22,439.0,442.154,450.0,59000,450.0,436.0
1199,2019/07/23,458.0,452.605,445.0,42500,460.0,445.0
1200,2019/07/24,459.0,455.849,460.0,30500,461.0,449.0
1201,2019/07/25,454.0,454.665,460.0,20900,461.0,450.0
1202,2019/07/26,448.0,446.868,449.0,18900,449.0,444.0
1203,2019/07/29,443.0,446.498,446.0,22500,451.0,443.0
1204,2019/07/30,440.0,442.096,442.0,21900,446.0,440.0
1205,2019/07/31,442.0,437.943,438.0,50800,444.0,429.0
1206,2019/08/01,445.0,444.899,441.0,28700,448.0,440.0
1207,2019/08/02,444.0,444.888,437.0,42800,453.0,435.0
1208,2019/08/05,432.0,438.75,447.0,74100,457.0,426.0
1209,2019/08/06,451.0,436.036,419.0,77500,457.0,414.0
1210,2019/08/07,452.0,451.877,450.0,21900,457.0,445.0
1211,2019/08/08,448.0,448.912,450.0,9100,453.0,445.0
1212,2019/08/09,446.0,446.622,448.0,14300,451.0,445.0
1213,2019/08/13,427.0,429.575,439.0,37900,439.0,422.0
1214,2019/08/14,419.0,421.784,430.0,30500,430.0,419.0
1215,2019/08/15,421.0,417.067,411.0,32700,424.0,411.0
1216,2019/08/16,422.0,422.59,417.0,32400,429.0,417.0
1217,2019/08/19,413.0,418.265,422.0,55800,423.0,411.0
1218,2019/08/20,420.0,421.845,420.0,18100,425.0,417.0
1219,2019/08/21,416.0,416.633,417.0,35100,423.0,414.0
1220,2019/08/22,411.0,413.029,417.0,24600,423.0,409.0
1221,2019/08/23,404.0,406.585,411.0,35400,413.0,401.0
