,Date,Close,VWAP,Open,Volume,High,Low
0,2016/06/27,857.5,949.041,967.5,7918800,1037.5,840.0
1,2016/06/28,1032.5,930.894,865.0,2350800,1032.5,865.0
2,2016/06/29,1207.5,1182.929,1175.0,784400,1207.5,1158.8
3,2016/06/30,1337.5,1336.72,1382.5,7823600,1382.5,1226.3
4,2016/07/01,1585.0,1464.374,1310.0,12505600,1585.0,1252.5
5,2016/07/04,1657.5,1650.051,1512.5,12345200,1785.0,1450.0
6,2016/07/05,1407.5,1548.094,1650.0,3794400,1695.0,1407.5
7,2016/07/06,1412.5,1351.269,1332.5,2246800,1440.0,1257.5
8,2016/07/07,1192.5,1293.221,1425.0,1262400,1432.5,1162.5
9,2016/07/08,1117.5,1109.967,1200.0,1087600,1235.0,1037.5
10,2016/07/11,1110.0,1090.555,1150.0,883200,1162.5,1015.0
11,2016/07/12,1202.5,1194.636,1105.0,2010000,1262.5,1081.3
12,2016/07/13,1077.5,1132.524,1198.8,945200,1217.5,1076.3
13,2016/07/14,1053.8,1076.845,1068.8,556400,1135.0,1030.0
14,2016/07/15,967.5,998.739,1036.3,321600,1046.3,951.3
15,2016/07/19,925.0,912.135,962.5,257200,962.5,875.0
16,2016/07/20,962.5,945.56,936.3,193600,973.8,902.5
17,2016/07/21,895.0,919.188,961.3,104000,966.3,891.3
18,2016/07/22,887.5,901.052,912.5,96000,917.5,885.0
19,2016/07/25,868.8,893.787,875.0,81200,937.5,862.5
20,2016/07/26,856.3,857.47,853.8,98800,893.8,837.5
21,2016/07/27,930.0,918.952,862.5,234800,965.0,858.8
22,2016/07/28,888.8,905.208,932.5,122400,935.0,878.8
23,2016/07/29,868.8,847.741,888.8,116400,888.8,825.0
24,2016/08/01,878.8,868.148,847.5,44000,888.8,841.3
25,2016/08/02,876.3,870.92,878.8,50000,892.5,858.8
26,2016/08/03,801.3,831.929,858.8,115600,866.3,801.3
27,2016/08/04,763.8,783.739,802.5,136400,835.0,755.0
28,2016/08/05,727.5,734.84,773.8,147200,780.0,710.0
29,2016/08/08,704.3,702.562,702.5,144000,721.8,688.8
30,2016/08/09,662.3,664.914,702.5,244000,702.5,645.0
31,2016/08/10,650.0,658.097,667.3,54400,667.3,650.0
32,2016/08/12,675.0,660.331,640.3,71600,675.0,640.3
33,2016/08/15,687.5,674.478,661.3,40000,694.5,660.0
34,2016/08/16,675.0,686.647,687.5,62400,702.5,669.5
35,2016/08/17,644.3,650.279,668.3,68800,668.3,642.3
36,2016/08/18,603.5,613.077,631.8,75600,631.8,602.5
37,2016/08/19,728.5,721.493,716.0,223600,728.5,712.5
38,2016/08/22,659.0,698.549,737.5,766800,744.8,655.5
39,2016/08/23,682.5,681.149,668.0,213600,705.5,650.3
40,2016/08/24,663.8,655.986,670.0,104000,672.3,643.8
41,2016/08/25,717.5,696.457,674.8,235600,723.3,658.3
42,2016/08/26,827.5,779.522,722.5,749200,840.0,709.0
43,2016/08/29,955.0,929.188,845.0,2376800,988.8,837.5
44,2016/08/30,912.5,911.089,972.5,709600,972.5,871.3
45,2016/08/31,823.8,833.646,871.3,321600,871.3,807.5
46,2016/09/01,873.8,887.901,843.8,411200,923.8,843.8
47,2016/09/02,898.8,856.062,843.8,263600,905.0,811.3
48,2016/09/05,901.3,901.175,912.5,152400,917.5,878.8
49,2016/09/06,885.0,915.457,900.0,202400,942.5,885.0
50,2016/09/07,933.8,911.493,875.0,202000,940.0,872.5
51,2016/09/08,903.8,928.386,946.3,211600,960.0,901.3
52,2016/09/09,925.0,907.237,900.0,87600,925.0,890.0
53,2016/09/12,872.5,870.465,900.0,170000,922.5,828.8
54,2016/09/13,868.8,874.436,886.3,48800,886.3,860.0
55,2016/09/14,857.5,847.924,845.0,48400,866.3,831.3
56,2016/09/15,818.8,821.12,840.0,65600,841.3,810.0
57,2016/09/16,870.0,854.855,823.8,65600,886.3,822.5
58,2016/09/20,886.3,885.787,887.5,64800,906.3,872.5
59,2016/09/21,932.5,932.032,886.3,241600,956.3,880.0
60,2016/09/23,932.5,950.481,957.5,126800,970.0,926.3
61,2016/09/26,931.3,924.769,945.0,104000,945.0,900.0
62,2016/09/27,926.3,921.89,912.5,86000,936.3,908.8
63,2016/09/28,956.3,935.846,907.5,127600,960.0,906.3
64,2016/09/29,946.3,941.678,957.5,86400,957.5,927.5
65,2016/09/30,925.0,946.603,946.3,99200,968.8,917.5
66,2016/10/03,937.5,919.0,932.5,86000,937.5,895.0
67,2016/10/04,1091.3,1050.234,946.3,899200,1100.0,943.8
68,2016/10/05,1036.3,1067.512,1095.0,487600,1122.5,1025.0
69,2016/10/06,1010.0,1015.363,1045.0,228400,1056.3,995.0
70,2016/10/07,1147.5,1116.414,1016.3,905200,1172.5,1011.3
71,2016/10/11,1157.5,1183.989,1172.5,777600,1241.3,1112.5
72,2016/10/12,1110.0,1131.156,1148.8,213600,1165.0,1092.5
73,2016/10/13,1158.8,1109.856,1127.5,256800,1158.8,1060.0
74,2016/10/14,1140.0,1138.067,1162.5,132400,1162.5,1112.5
75,2016/10/17,1091.3,1099.516,1130.0,115600,1130.0,1080.0
76,2016/10/18,1077.5,1080.356,1082.5,80000,1091.3,1070.0
77,2016/10/19,1122.5,1108.903,1085.0,120800,1133.8,1076.3
78,2016/10/20,1085.0,1112.599,1113.8,110800,1151.3,1082.5
79,2016/10/21,1103.8,1089.238,1077.5,176400,1117.5,1070.0
80,2016/10/24,1078.8,1093.076,1107.5,86000,1115.0,1072.5
81,2016/10/25,981.3,1010.719,1061.3,238400,1078.8,980.0
82,2016/10/26,950.0,948.674,971.3,138000,971.3,928.8
83,2016/10/27,982.5,977.736,966.3,108000,993.8,953.8
84,2016/10/28,953.8,955.53,982.5,60400,982.5,930.0
85,2016/10/31,961.3,960.301,945.0,44800,976.3,941.3
86,2016/11/01,965.0,959.008,961.3,48400,978.8,937.5
87,2016/11/02,897.5,912.316,937.5,149600,982.5,855.0
88,2016/11/04,843.8,859.435,897.5,62800,900.0,838.8
89,2016/11/07,870.0,866.025,850.0,66800,897.5,846.3
90,2016/11/08,886.3,881.306,870.0,54000,902.5,852.5
91,2016/11/09,822.5,806.345,893.8,145200,903.8,749.8
92,2016/11/10,866.3,862.394,877.5,75200,897.5,831.3
93,2016/11/11,838.8,854.661,873.8,42800,887.5,832.5
94,2016/11/14,913.8,883.391,838.8,101600,922.5,825.0
95,2016/11/15,1002.5,1008.038,1001.3,349600,1038.8,966.3
96,2016/11/16,1003.8,1002.216,1013.8,95200,1015.0,981.3
97,2016/11/17,1067.5,1071.555,1035.0,238000,1093.8,1035.0
98,2016/11/18,1083.8,1070.323,1067.5,138000,1098.8,1046.3
99,2016/11/21,1043.8,1054.386,1088.8,90400,1088.8,1041.3
100,2016/11/22,1018.8,1027.949,1042.5,76800,1051.3,1013.8
101,2016/11/24,1031.3,1033.414,1022.5,107200,1057.5,1010.0
102,2016/11/25,978.8,987.965,1021.3,135600,1023.8,962.5
103,2016/11/28,1023.8,1012.095,976.3,82800,1050.0,971.3
104,2016/11/29,1061.3,1057.056,1030.0,128400,1077.5,1030.0
105,2016/11/30,1072.5,1083.028,1073.8,169600,1098.8,1062.5
106,2016/12/01,1112.5,1126.385,1070.0,325600,1162.5,1070.0
107,2016/12/02,1112.5,1112.973,1090.0,128000,1138.8,1087.5
108,2016/12/05,1188.8,1181.185,1145.0,269600,1212.5,1132.5
109,2016/12/06,1190.0,1188.117,1187.5,150800,1217.5,1157.5
110,2016/12/07,1330.0,1280.323,1208.8,520400,1345.0,1190.0
111,2016/12/08,1226.3,1251.154,1305.0,336800,1330.0,1212.5
112,2016/12/09,1175.0,1176.601,1191.3,196800,1236.3,1145.0
113,2016/12/12,1217.5,1228.808,1200.0,146000,1270.0,1178.8
114,2016/12/13,1285.0,1251.902,1200.0,128000,1285.0,1191.3
115,2016/12/14,1247.5,1260.311,1300.0,74000,1302.5,1230.0
116,2016/12/15,1212.5,1209.804,1265.0,96800,1267.5,1181.3
117,2016/12/16,1167.5,1172.747,1203.8,127600,1203.8,1157.5
118,2016/12/19,1200.0,1197.842,1178.8,62800,1225.0,1168.8
119,2016/12/20,1250.0,1232.034,1202.5,74000,1250.0,1202.5
120,2016/12/21,1367.5,1333.178,1267.5,361200,1395.0,1255.0
121,2016/12/22,1375.0,1352.711,1317.5,279600,1385.0,1312.5
122,2016/12/26,1462.5,1435.97,1420.0,212400,1465.0,1387.5
123,2016/12/27,1395.0,1430.872,1475.0,137600,1475.0,1387.5
124,2016/12/28,1505.0,1485.351,1437.5,293200,1520.0,1425.0
125,2016/12/29,1465.0,1459.508,1480.0,172800,1480.0,1437.5
126,2016/12/30,1437.5,1442.113,1437.5,108400,1467.5,1425.0
127,2017/01/04,1440.0,1453.502,1435.0,173600,1505.0,1415.0
128,2017/01/05,1417.5,1428.408,1450.0,178400,1455.0,1390.0
129,2017/01/06,1370.0,1377.755,1397.5,152800,1405.0,1360.0
130,2017/01/10,1550.0,1501.201,1370.0,406400,1577.5,1370.0
131,2017/01/11,1512.5,1571.867,1575.0,453600,1660.0,1490.0
132,2017/01/12,1727.5,1690.216,1557.5,908000,1762.5,1480.0
133,2017/01/13,1705.0,1708.064,1752.5,824400,1825.0,1630.0
134,2017/01/16,1782.5,1740.84,1705.0,342800,1782.5,1702.5
135,2017/01/17,1622.5,1687.659,1752.5,277600,1775.0,1622.5
136,2017/01/18,1682.5,1694.638,1640.0,237600,1740.0,1627.5
137,2017/01/19,1655.0,1671.304,1685.0,92000,1725.0,1637.5
138,2017/01/20,1710.0,1688.361,1655.0,120800,1715.0,1630.0
139,2017/01/23,1792.5,1798.357,1760.0,490000,1855.0,1717.5
140,2017/01/24,1947.5,1912.077,1800.0,654800,2005.0,1787.5
141,2017/01/25,1972.5,1937.235,1952.5,336400,2000.0,1862.5
142,2017/01/26,1937.5,2013.008,2010.0,417600,2077.5,1937.5
143,2017/01/27,2085.0,2160.685,2112.5,1642800,2287.5,2040.0
144,2017/01/30,2112.5,2134.275,2047.5,394400,2212.5,2037.5
145,2017/01/31,2087.5,2109.946,2125.0,258400,2162.5,2050.0
146,2017/02/01,2350.0,2281.242,2162.5,1247600,2392.5,2100.0
147,2017/02/02,2300.0,2388.457,2425.0,869200,2515.0,2277.5
148,2017/02/03,2257.5,2204.699,2320.0,739600,2395.0,2062.5
149,2017/02/06,2252.5,2233.236,2295.0,282800,2322.5,2150.0
150,2017/02/07,2102.5,2154.019,2260.0,327200,2262.5,2100.0
151,2017/02/08,2250.0,2203.257,2082.5,379200,2270.0,2067.5
152,2017/02/09,2247.5,2258.677,2195.0,266800,2312.5,2175.0
153,2017/02/10,2225.0,2229.148,2262.5,182000,2277.5,2187.5
154,2017/02/13,2150.0,2160.701,2202.5,191200,2215.0,2132.5
155,2017/02/14,2040.0,2041.245,2140.0,380000,2145.0,2010.0
156,2017/02/15,2060.0,2069.433,2077.5,185200,2122.5,2022.5
157,2017/02/16,2075.0,2108.126,2062.5,217200,2147.5,2052.5
158,2017/02/17,2150.0,2149.06,2135.0,287200,2175.0,2110.0
159,2017/02/20,2047.5,2066.657,2145.0,280000,2145.0,2040.0
160,2017/02/21,1980.0,1991.453,2035.0,199600,2037.5,1962.5
161,2017/02/22,1977.5,2000.944,2010.0,120800,2025.0,1975.0
162,2017/02/23,1992.5,1983.931,2000.0,104800,2005.0,1962.5
163,2017/02/24,2100.0,2054.113,1992.5,223200,2100.0,1992.5
164,2017/02/27,2047.5,2062.962,2087.5,132000,2115.0,2025.0
165,2017/02/28,2090.0,2091.094,2077.5,108800,2110.0,2060.0
166,2017/03/01,2067.5,2064.643,2060.0,92400,2090.0,2040.0
167,2017/03/02,2227.5,2184.149,2100.0,462800,2235.0,2067.5
168,2017/03/03,2207.5,2231.391,2257.5,305600,2292.5,2177.5
169,2017/03/06,2447.5,2371.479,2275.0,717600,2457.5,2237.5
170,2017/03/07,2362.5,2386.485,2405.0,310400,2432.5,2350.0
171,2017/03/08,2557.5,2505.751,2367.5,915200,2580.0,2367.5
172,2017/03/09,2537.5,2509.442,2520.0,352800,2570.0,2432.5
173,2017/03/10,2472.5,2498.355,2542.5,153200,2552.5,2460.0
174,2017/03/13,2290.0,2326.09,2455.0,321200,2460.0,2270.0
175,2017/03/14,2310.0,2328.372,2325.0,128400,2400.0,2280.0
176,2017/03/15,2220.0,2243.901,2325.0,145600,2325.0,2177.5
177,2017/03/16,2167.5,2177.808,2150.0,90800,2215.0,2137.5
178,2017/03/17,2110.0,2120.657,2167.5,109600,2170.0,2077.5
179,2017/03/21,2210.0,2177.608,2087.5,129200,2222.5,2087.5
180,2017/03/22,2175.0,2180.964,2210.0,84000,2217.5,2137.5
181,2017/03/23,2345.0,2282.057,2200.0,182800,2345.0,2185.0
182,2017/03/24,2317.5,2341.858,2310.0,135600,2375.0,2302.5
183,2017/03/27,2270.0,2317.988,2355.0,112800,2385.0,2270.0
184,2017/03/28,2210.0,2241.394,2275.0,97600,2307.5,2177.5
185,2017/03/29,2345.0,2344.671,2312.5,150400,2435.0,2242.5
186,2017/03/30,2275.0,2305.472,2400.0,165200,2400.0,2202.5
187,2017/03/31,2235.0,2244.486,2252.5,102200,2297.5,2215.0
188,2017/04/03,2155.0,2196.026,2245.0,90200,2265.0,2137.5
189,2017/04/04,2052.5,2086.018,2140.0,141400,2227.5,2005.0
190,2017/04/05,2085.0,2098.527,2092.5,51600,2140.0,2055.0
191,2017/04/06,2012.5,2035.137,2112.5,62000,2112.5,2000.0
192,2017/04/07,1997.5,1988.193,2010.0,62800,2037.5,1905.0
193,2017/04/10,2170.0,2207.367,2022.5,296400,2347.5,2002.5
194,2017/04/11,2102.5,2113.483,2170.0,80400,2170.0,2055.0
195,2017/04/12,1965.0,2006.425,2050.0,84200,2060.0,1965.0
196,2017/04/13,1912.5,1881.13,1860.0,125200,1957.5,1790.0
197,2017/04/14,1967.5,1954.452,1905.0,87600,1990.0,1890.0
198,2017/04/17,1975.0,1959.11,1910.0,47200,1997.5,1910.0
199,2017/04/18,2117.5,2068.233,2005.0,101000,2142.5,1980.0
200,2017/04/19,2100.0,2093.525,2082.5,44400,2125.0,2060.0
201,2017/04/20,2050.0,2074.917,2100.0,30000,2100.0,2042.5
202,2017/04/21,1980.0,2006.605,2050.0,35200,2065.0,1980.0
203,2017/04/24,1960.0,1973.4,2005.0,30000,2012.5,1950.0
204,2017/04/25,1997.5,1990.161,1940.0,28000,2020.0,1930.0
205,2017/04/26,2035.0,2054.928,2100.0,27600,2100.0,2025.0
206,2017/04/27,2052.5,2053.82,2025.0,25000,2072.5,2025.0
207,2017/04/28,2062.5,2050.021,2067.5,48400,2082.5,2005.0
208,2017/05/01,2035.0,2073.123,2082.5,54600,2112.5,2035.0
209,2017/05/02,2070.0,2060.952,2025.0,54600,2097.5,2020.0
210,2017/05/08,2247.5,2199.092,2127.5,146400,2247.5,2112.5
211,2017/05/09,2250.0,2252.267,2247.5,115600,2292.5,2207.5
212,2017/05/10,2275.0,2270.848,2297.5,59000,2297.5,2250.0
213,2017/05/11,2222.5,2232.511,2275.0,45000,2275.0,2205.0
214,2017/05/12,2172.5,2176.768,2182.5,51200,2207.5,2157.5
215,2017/05/15,2090.0,2103.813,2080.0,88000,2157.5,2070.0
216,2017/05/16,2105.0,2116.233,2115.0,28800,2140.0,2102.5
217,2017/05/17,2182.5,2172.849,2110.0,57400,2217.5,2100.0
218,2017/05/18,2147.5,2143.286,2122.5,42600,2180.0,2102.5
219,2017/05/19,2250.0,2232.98,2207.5,102200,2260.0,2180.0
220,2017/05/22,2210.0,2222.452,2272.5,62000,2275.0,2195.0
221,2017/05/23,2185.0,2213.75,2217.5,26800,2247.5,2185.0
222,2017/05/24,2197.5,2193.697,2215.0,47200,2225.0,2175.0
223,2017/05/25,2160.0,2171.322,2197.5,51800,2197.5,2147.5
224,2017/05/26,2212.5,2194.769,2165.0,103800,2222.5,2165.0
225,2017/05/29,2280.0,2259.517,2215.0,114800,2300.0,2215.0
226,2017/05/30,2625.0,2536.933,2295.0,880200,2630.0,2200.0
227,2017/05/31,2385.0,2443.643,2515.0,531800,2550.0,2365.0
228,2017/06/01,2370.0,2379.339,2410.0,168600,2440.0,2340.0
229,2017/06/02,2310.0,2330.365,2375.0,130200,2395.0,2300.0
230,2017/06/05,2375.0,2349.322,2310.0,75200,2380.0,2305.0
231,2017/06/06,2312.5,2357.935,2420.0,96600,2420.0,2310.0
232,2017/06/07,2335.0,2327.556,2317.5,62600,2350.0,2312.5
233,2017/06/08,2345.0,2353.618,2375.0,43400,2375.0,2332.5
234,2017/06/09,2322.5,2344.114,2370.0,70000,2370.0,2310.0
235,2017/06/12,2250.0,2284.535,2342.5,74200,2342.5,2250.0
236,2017/06/13,2210.0,2229.221,2230.0,71200,2275.0,2205.0
237,2017/06/14,2160.0,2169.537,2212.5,139200,2240.0,2120.0
238,2017/06/15,2115.0,2132.996,2160.0,55400,2160.0,2115.0
239,2017/06/16,2140.0,2136.594,2147.5,48000,2162.5,2107.5
240,2017/06/19,2160.0,2162.473,2147.5,54800,2190.0,2142.5
241,2017/06/20,2190.0,2166.135,2165.0,85000,2190.0,2150.0
242,2017/06/21,2157.5,2173.399,2190.0,64000,2195.0,2152.5
243,2017/06/22,2160.0,2148.019,2160.0,43400,2165.0,2125.0
244,2017/06/23,2090.0,2117.719,2175.0,80000,2175.0,2075.0
245,2017/06/26,2120.0,2113.209,2090.0,26800,2145.0,2090.0
246,2017/06/27,2167.5,2143.337,2135.0,50200,2167.5,2102.5
247,2017/06/28,2060.0,2095.106,2160.0,80600,2160.0,2060.0
248,2017/06/29,2075.0,2085.812,2100.0,23400,2100.0,2067.5
249,2017/06/30,2072.5,2056.333,2052.5,24000,2072.5,2042.5
250,2017/07/03,2077.5,2063.898,2085.0,23600,2085.0,2052.5
251,2017/07/04,2000.0,2021.355,2077.5,66800,2077.5,1977.5
252,2017/07/05,2040.0,2008.418,2000.0,29400,2050.0,1977.5
253,2017/07/06,2060.0,2037.56,2047.5,42000,2060.0,2000.0
254,2017/07/07,2005.0,2002.049,2025.0,48800,2025.0,1987.5
255,2017/07/10,2012.5,2021.875,2025.0,23200,2042.5,2002.5
256,2017/07/11,2117.5,2077.184,2017.5,58600,2117.5,2017.5
257,2017/07/12,2115.0,2102.984,2117.5,42400,2122.5,2077.5
258,2017/07/13,2140.0,2149.611,2125.0,51400,2167.5,2122.5
259,2017/07/14,2147.5,2138.756,2160.0,44200,2165.0,2100.0
260,2017/07/18,2107.5,2135.795,2147.5,43400,2167.5,2107.5
261,2017/07/19,2152.5,2140.399,2107.5,18800,2157.5,2107.5
262,2017/07/20,2160.0,2157.702,2162.5,24800,2170.0,2142.5
263,2017/07/21,2150.0,2162.281,2165.0,27400,2170.0,2147.5
264,2017/07/24,2180.0,2166.282,2127.5,39000,2190.0,2127.5
265,2017/07/25,2152.5,2171.378,2195.0,31200,2195.0,2142.5
266,2017/07/26,2130.0,2130.906,2152.5,25400,2160.0,2110.0
267,2017/07/27,2095.0,2097.752,2137.5,25800,2137.5,2082.5
268,2017/07/28,2060.0,2054.398,2085.0,38200,2085.0,2025.0
269,2017/07/31,2052.5,2048.136,2045.0,11800,2060.0,2037.5
270,2017/08/01,2035.0,2034.955,2060.0,22400,2060.0,2022.5
271,2017/08/02,2025.0,2036.681,2035.0,34200,2060.0,2010.0
272,2017/08/03,2030.0,2025.992,2027.5,24200,2045.0,2017.5
273,2017/08/04,2072.5,2041.315,2030.0,19400,2072.5,2017.5
274,2017/08/07,2065.0,2058.18,2080.0,22800,2080.0,2042.5
275,2017/08/08,2030.0,2040.909,2062.5,24200,2062.5,2025.0
276,2017/08/09,2030.0,2019.5,2042.5,20000,2042.5,2007.5
277,2017/08/10,2022.5,2035.276,2042.5,30800,2052.5,2017.5
278,2017/08/14,2085.0,2007.652,2002.5,46000,2085.0,1980.0
279,2017/08/15,1990.0,2003.805,2065.0,86200,2065.0,1985.0
280,2017/08/16,2037.5,2026.137,1992.5,46600,2045.0,1992.5
281,2017/08/17,2032.5,2021.603,2027.5,23400,2032.5,2010.0
282,2017/08/18,2012.5,2021.236,2027.5,17800,2030.0,2007.5
283,2017/08/21,2015.0,2011.75,2012.5,10000,2020.0,2002.5
284,2017/08/22,2030.0,2028.311,2007.5,14800,2045.0,2007.5
285,2017/08/23,2040.0,2028.793,2040.0,17400,2040.0,2015.0
286,2017/08/24,2037.5,2052.011,2040.0,36800,2072.5,2032.5
287,2017/08/25,2045.0,2049.007,2035.0,13600,2060.0,2035.0
288,2017/08/28,2055.0,2050.57,2045.0,27200,2070.0,2035.0
289,2017/08/29,2087.5,2071.754,2050.0,47600,2090.0,2040.0
290,2017/08/30,2080.0,2092.972,2095.0,39200,2117.5,2065.0
291,2017/08/31,2075.0,2088.367,2090.0,19600,2110.0,2072.5
292,2017/09/01,2090.0,2093.228,2090.0,48800,2115.0,2077.5
293,2017/09/04,2055.0,2074.094,2100.0,39200,2110.0,2047.5
294,2017/09/05,2107.5,2091.858,2120.0,127000,2137.5,2022.5
295,2017/09/06,2065.0,2065.0,2057.5,34000,2110.0,2045.0
296,2017/09/07,2022.5,2040.087,2075.0,23000,2075.0,2022.5
297,2017/09/08,1985.0,1994.332,1995.0,46400,2025.0,1982.5
298,2017/09/11,1992.5,2000.775,2010.0,20000,2022.5,1990.0
299,2017/09/12,1992.5,1991.808,1997.5,29600,2007.5,1985.0
300,2017/09/13,1990.0,1990.927,1990.0,23200,2000.0,1985.0
301,2017/09/14,1985.0,1988.875,1995.0,16000,2000.0,1985.0
302,2017/09/15,2000.0,1988.833,1982.5,15000,2000.0,1980.0
303,2017/09/19,1990.0,1996.039,2012.5,26000,2012.5,1985.0
304,2017/09/20,1987.5,1985.758,1990.0,24400,1997.5,1980.0
305,2017/09/21,2005.0,1996.35,1997.5,20000,2010.0,1985.0
306,2017/09/22,1992.5,1996.907,2005.0,31200,2007.5,1985.0
307,2017/09/25,2022.5,2013.013,1997.5,23400,2025.0,1995.0
308,2017/09/26,1990.0,1999.303,2005.0,24400,2015.0,1990.0
309,2017/09/27,1945.0,1964.066,1987.5,38000,2000.0,1922.5
310,2017/09/28,1940.0,1951.25,1950.0,23200,1972.5,1935.0
311,2017/09/29,1942.5,1940.446,1932.5,31400,1962.5,1930.0
312,2017/10/02,1937.5,1947.5,1950.0,13600,1960.0,1937.5
313,2017/10/03,1910.0,1917.761,1937.5,40200,1945.0,1902.5
314,2017/10/04,1902.5,1909.283,1917.5,23000,1927.5,1902.5
315,2017/10/05,1882.5,1899.983,1902.5,29200,1910.0,1882.5
316,2017/10/06,1857.5,1865.613,1892.5,40800,1892.5,1845.0
317,2017/10/10,1907.5,1899.16,1892.5,25600,1907.5,1872.5
318,2017/10/11,1927.5,1925.793,1922.5,16400,1930.0,1920.0
319,2017/10/12,1915.0,1916.455,1925.0,33000,1932.5,1907.5
320,2017/10/13,1922.5,1918.464,1915.0,14000,1932.5,1915.0
321,2017/10/16,1942.5,1944.88,1950.0,33400,1952.5,1922.5
322,2017/10/17,1932.5,1937.848,1950.0,24400,1957.5,1917.5
323,2017/10/18,1960.0,1947.26,1937.5,20800,1960.0,1937.5
324,2017/10/19,1970.0,1963.608,1965.0,17600,1970.0,1952.5
325,2017/10/20,1972.5,1968.316,1970.0,9800,1972.5,1952.5
326,2017/10/23,1997.5,1983.0,1975.0,15000,1997.5,1967.5
327,2017/10/24,1990.0,1985.543,1980.0,21200,1992.5,1975.0
328,2017/10/25,1985.0,1993.632,2000.0,19000,2002.5,1980.0
329,2017/10/26,1980.0,1980.0,1985.0,11400,1987.5,1970.0
330,2017/10/27,1985.0,1989.656,1990.0,16000,2000.0,1972.5
331,2017/10/30,2000.0,2000.605,2000.0,31400,2005.0,1990.0
332,2017/10/31,2002.5,1998.114,2000.0,11400,2005.0,1990.0
333,2017/11/01,2020.0,2006.5,1997.5,20000,2020.0,1997.5
334,2017/11/02,1980.0,1991.843,2020.0,27400,2020.0,1975.0
335,2017/11/06,1965.0,1966.667,1977.5,9600,1977.5,1955.0
336,2017/11/07,1955.0,1950.469,1960.0,19200,1965.0,1932.5
337,2017/11/08,2027.5,2014.21,1997.5,38600,2045.0,1980.0
338,2017/11/09,2072.5,2056.294,2047.5,45200,2075.0,2030.0
339,2017/11/10,2095.0,2072.012,2065.0,24600,2095.0,2050.0
340,2017/11/13,2102.5,2104.415,2090.0,49600,2120.0,2060.0
341,2017/11/14,2005.0,2040.718,2122.5,60600,2122.5,1980.0
342,2017/11/15,2010.0,2004.575,2040.0,37600,2040.0,1977.5
343,2017/11/16,2050.0,2047.103,2000.0,25200,2075.0,2000.0
344,2017/11/17,2062.5,2051.591,2050.0,13200,2062.5,2042.5
345,2017/11/20,2050.0,2052.688,2052.5,16000,2067.5,2047.5
346,2017/11/21,2020.0,2036.706,2050.0,17000,2057.5,2020.0
347,2017/11/22,2060.0,2047.993,2050.0,28400,2060.0,2022.5
348,2017/11/24,2255.0,2273.847,2247.5,369000,2390.0,2212.5
349,2017/11/27,2247.5,2252.224,2285.0,67000,2285.0,2225.0
350,2017/11/28,2187.5,2202.126,2247.5,50800,2247.5,2182.5
351,2017/11/29,2160.0,2183.986,2177.5,36000,2215.0,2160.0
352,2017/11/30,2265.0,2191.612,2150.0,95200,2267.5,2120.0
353,2017/12/01,2200.0,2232.064,2265.0,42400,2267.5,2200.0
354,2017/12/04,2250.0,2240.093,2260.0,37800,2260.0,2220.0
355,2017/12/05,2322.5,2280.297,2250.0,85800,2325.0,2220.0
356,2017/12/06,2260.0,2318.024,2322.5,67800,2355.0,2252.5
357,2017/12/07,2387.5,2365.796,2300.0,96800,2397.5,2300.0
358,2017/12/08,2350.0,2369.056,2390.0,55600,2410.0,2330.0
359,2017/12/11,2372.5,2370.473,2397.5,25400,2397.5,2345.0
360,2017/12/12,2307.5,2323.638,2372.5,51400,2375.0,2297.5
361,2017/12/13,2262.5,2269.546,2295.0,39600,2305.0,2245.0
362,2017/12/14,2290.0,2264.976,2250.0,21000,2295.0,2242.5
363,2017/12/15,2340.0,2322.243,2300.0,35000,2347.5,2300.0
364,2017/12/18,2417.5,2384.88,2375.0,41600,2422.5,2340.0
365,2017/12/19,2540.0,2506.72,2490.0,103800,2545.0,2452.5
366,2017/12/20,2505.0,2549.377,2550.0,54600,2585.0,2505.0
367,2017/12/21,2655.0,2612.73,2550.0,113200,2680.0,2525.0
368,2017/12/22,2830.0,2780.822,2695.0,148400,2890.0,2690.0
369,2017/12/25,2735.0,2718.89,2690.0,78400,2810.0,2655.0
370,2017/12/26,2655.0,2676.596,2725.0,61400,2750.0,2650.0
371,2017/12/27,2880.0,2796.042,2650.0,69900,2950.0,2650.0
372,2017/12/28,3010.0,3018.4,2949.0,122700,3180.0,2900.0
373,2017/12/29,3080.0,3085.785,3020.0,65600,3140.0,3000.0
374,2018/01/04,3175.0,3156.828,3110.0,103400,3225.0,3095.0
375,2018/01/05,3160.0,3160.994,3170.0,70400,3240.0,3100.0
376,2018/01/09,3115.0,3211.394,3295.0,74600,3330.0,3115.0
377,2018/01/10,3130.0,3105.061,3105.0,49200,3160.0,3025.0
378,2018/01/11,3160.0,3188.3,3150.0,34700,3245.0,3150.0
379,2018/01/12,3150.0,3159.487,3150.0,19500,3200.0,3150.0
380,2018/01/15,3275.0,3242.463,3195.0,40600,3295.0,3150.0
381,2018/01/16,3170.0,3200.258,3245.0,25200,3260.0,3160.0
382,2018/01/17,3240.0,3221.035,3225.0,31900,3275.0,3185.0
383,2018/01/18,3440.0,3471.51,3295.0,117200,3665.0,3280.0
384,2018/01/19,3455.0,3467.274,3600.0,59600,3600.0,3360.0
385,2018/01/22,3820.0,3822.206,3590.0,129200,4035.0,3545.0
386,2018/01/23,4005.0,3946.036,3820.0,89800,4030.0,3820.0
387,2018/01/24,3900.0,3920.381,4065.0,74900,4065.0,3815.0
388,2018/01/25,3910.0,3866.366,3880.0,46500,3945.0,3800.0
389,2018/01/26,3860.0,3892.626,3960.0,33700,3980.0,3855.0
390,2018/01/29,3890.0,3870.069,3900.0,36000,3930.0,3805.0
391,2018/01/30,3815.0,3836.725,3920.0,34500,3920.0,3750.0
392,2018/01/31,3880.0,3858.807,3700.0,62000,3980.0,3700.0
393,2018/02/01,3940.0,3856.396,3870.0,35100,3950.0,3800.0
394,2018/02/02,3835.0,3857.282,3935.0,25200,3935.0,3815.0
395,2018/02/05,3750.0,3669.616,3580.0,43000,3780.0,3550.0
396,2018/02/06,3415.0,3330.739,3260.0,108900,3490.0,3225.0
397,2018/02/07,3390.0,3531.22,3600.0,45900,3695.0,3375.0
398,2018/02/08,3620.0,3534.68,3400.0,31200,3640.0,3390.0
399,2018/02/09,3330.0,3315.918,3250.0,73500,3440.0,3225.0
400,2018/02/13,2939.0,3005.937,3260.0,140400,3265.0,2905.0
401,2018/02/14,2827.0,2874.402,2930.0,89300,2970.0,2815.0
402,2018/02/15,2838.0,2835.593,2827.0,44500,2880.0,2794.0
403,2018/02/16,2995.0,2948.489,2900.0,50700,2995.0,2858.0
404,2018/02/19,3110.0,3086.679,3115.0,53300,3135.0,3040.0
405,2018/02/20,3170.0,3090.364,3110.0,53600,3175.0,3015.0
406,2018/02/21,3120.0,3126.223,3160.0,37600,3165.0,3080.0
407,2018/02/22,3175.0,3177.489,3115.0,43600,3240.0,3090.0
408,2018/02/23,3220.0,3229.056,3205.0,40800,3255.0,3200.0
409,2018/02/26,3250.0,3265.991,3280.0,57000,3310.0,3220.0
410,2018/02/27,3280.0,3249.649,3270.0,47000,3290.0,3200.0
411,2018/02/28,3320.0,3350.534,3290.0,50600,3435.0,3280.0
412,2018/03/01,3280.0,3283.892,3290.0,31600,3330.0,3245.0
413,2018/03/02,3265.0,3229.582,3195.0,32300,3295.0,3160.0
414,2018/03/05,3080.0,3155.213,3205.0,58600,3250.0,3015.0
415,2018/03/06,3225.0,3225.359,3200.0,22300,3290.0,3180.0
416,2018/03/07,3290.0,3292.569,3200.0,32500,3375.0,3195.0
417,2018/03/08,3320.0,3321.667,3290.0,22800,3355.0,3290.0
418,2018/03/09,3440.0,3466.06,3420.0,61300,3570.0,3355.0
419,2018/03/12,3570.0,3533.987,3615.0,45400,3615.0,3445.0
420,2018/03/13,3620.0,3616.992,3600.0,35400,3660.0,3585.0
421,2018/03/14,3650.0,3617.453,3600.0,21400,3660.0,3585.0
422,2018/03/15,3685.0,3658.983,3620.0,24100,3685.0,3600.0
423,2018/03/16,3705.0,3730.012,3695.0,41100,3790.0,3675.0
424,2018/03/19,3545.0,3571.577,3760.0,31700,3760.0,3440.0
425,2018/03/20,3580.0,3497.193,3455.0,21200,3605.0,3410.0
426,2018/03/22,3610.0,3611.641,3605.0,19500,3645.0,3595.0
427,2018/03/23,3615.0,3600.112,3580.0,57900,3655.0,3555.0
428,2018/03/26,3555.0,3508.588,3600.0,37900,3610.0,3355.0
429,2018/03/27,3625.0,3626.864,3620.0,17700,3670.0,3600.0
430,2018/03/28,3645.0,3684.669,3600.0,25700,3750.0,3600.0
431,2018/03/29,3875.0,3747.876,3670.0,33900,3925.0,3600.0
432,2018/03/30,3910.0,3887.582,3920.0,39900,3950.0,3810.0
433,2018/04/02,3890.0,3954.216,3980.0,33800,4035.0,3865.0
434,2018/04/03,3780.0,3778.214,3750.0,35000,3835.0,3735.0
435,2018/04/04,3735.0,3774.308,3850.0,31800,3875.0,3710.0
436,2018/04/05,3685.0,3697.572,3710.0,31100,3760.0,3665.0
437,2018/04/06,3610.0,3636.434,3685.0,27900,3685.0,3610.0
438,2018/04/09,3690.0,3656.771,3605.0,31900,3750.0,3580.0
439,2018/04/10,3690.0,3708.265,3750.0,12100,3750.0,3675.0
440,2018/04/11,3615.0,3632.355,3695.0,15500,3695.0,3600.0
441,2018/04/12,3490.0,3512.103,3605.0,32100,3605.0,3430.0
442,2018/04/13,3465.0,3453.543,3490.0,15100,3510.0,3425.0
443,2018/04/16,3595.0,3593.38,3600.0,67600,3625.0,3510.0
444,2018/04/17,3295.0,3424.747,3610.0,82900,3650.0,3295.0
445,2018/04/18,3330.0,3268.986,3345.0,76400,3345.0,3140.0
446,2018/04/19,3210.0,3259.308,3340.0,32500,3345.0,3200.0
447,2018/04/20,3200.0,3173.506,3155.0,26100,3220.0,3115.0
448,2018/04/23,3115.0,3093.035,3200.0,34100,3200.0,3030.0
449,2018/04/24,3110.0,3115.995,3115.0,20100,3185.0,3085.0
450,2018/04/25,3140.0,3133.385,3095.0,19500,3180.0,3095.0
451,2018/04/26,3165.0,3197.977,3210.0,34600,3295.0,3145.0
452,2018/04/27,3350.0,3308.687,3280.0,47600,3380.0,3210.0
453,2018/05/01,3425.0,3415.144,3315.0,38200,3470.0,3315.0
454,2018/05/02,3585.0,3503.234,3430.0,40200,3590.0,3415.0
455,2018/05/07,3800.0,3749.751,3690.0,78200,3825.0,3605.0
456,2018/05/08,3885.0,3858.677,3765.0,64600,3930.0,3675.0
457,2018/05/09,3855.0,3864.014,3855.0,27900,3910.0,3820.0
458,2018/05/10,3690.0,3734.208,3775.0,28400,3820.0,3665.0
459,2018/05/11,3630.0,3632.365,3585.0,35100,3710.0,3565.0
460,2018/05/14,2967.0,2989.044,2930.0,249000,3100.0,2930.0
461,2018/05/15,2823.0,2833.824,2950.0,162200,2951.0,2784.0
462,2018/05/16,2626.0,2683.019,2800.0,161800,2803.0,2605.0
463,2018/05/17,2697.0,2688.579,2632.0,73400,2734.0,2632.0
464,2018/05/18,2851.0,2817.077,2758.0,122700,2870.0,2741.0
465,2018/05/21,2970.0,2955.028,2972.0,109500,2990.0,2880.0
466,2018/05/22,2983.0,2998.344,3015.0,67400,3025.0,2977.0
467,2018/05/23,3015.0,2966.425,2980.0,36500,3025.0,2925.0
468,2018/05/24,3015.0,2998.528,3030.0,30100,3030.0,2962.0
469,2018/05/25,3020.0,3007.186,3015.0,25300,3030.0,2971.0
470,2018/05/28,3005.0,3001.984,2989.0,18600,3020.0,2981.0
471,2018/05/29,2947.0,2959.436,2994.0,39200,3015.0,2902.0
472,2018/05/30,2896.0,2908.435,2900.0,17000,2937.0,2875.0
473,2018/05/31,2890.0,2910.509,2898.0,15900,2959.0,2890.0
474,2018/06/01,2833.0,2847.845,2880.0,20600,2898.0,2802.0
475,2018/06/04,2753.0,2784.509,2820.0,44600,2870.0,2751.0
476,2018/06/05,2744.0,2760.076,2760.0,22300,2793.0,2740.0
477,2018/06/06,2710.0,2720.542,2740.0,27100,2748.0,2700.0
478,2018/06/07,2765.0,2760.005,2715.0,18600,2794.0,2715.0
479,2018/06/08,2833.0,2818.119,2815.0,19300,2842.0,2767.0
480,2018/06/11,2889.0,2855.266,2833.0,20300,2905.0,2795.0
481,2018/06/12,2874.0,2902.27,2943.0,22600,2943.0,2865.0
482,2018/06/13,2818.0,2823.31,2902.0,15800,2902.0,2786.0
483,2018/06/14,2804.0,2801.42,2815.0,11200,2817.0,2780.0
484,2018/06/15,2761.0,2777.667,2800.0,16500,2837.0,2756.0
485,2018/06/18,2729.0,2703.667,2726.0,23700,2729.0,2677.0
486,2018/06/19,2620.0,2650.723,2701.0,23500,2717.0,2601.0
487,2018/06/20,2644.0,2566.055,2601.0,25300,2662.0,2501.0
488,2018/06/21,2636.0,2641.336,2661.0,13400,2678.0,2620.0
489,2018/06/22,2270.0,2254.299,2216.0,125100,2380.0,2175.0
490,2018/06/25,1997.0,2065.846,2160.0,84200,2169.0,1990.0
491,2018/06/26,1965.0,1947.62,1957.0,58100,1985.0,1882.0
492,2018/06/27,2029.0,2009.61,1972.0,40800,2053.0,1972.0
493,2018/06/28,1973.0,1980.956,2016.0,33700,2016.0,1960.0
494,2018/06/29,2159.0,2138.659,2008.0,62700,2220.0,2000.0
495,2018/07/02,2032.0,2034.582,2018.0,24400,2068.0,2012.0
496,2018/07/03,1976.0,1988.332,2021.0,19300,2060.0,1943.0
497,2018/07/04,1947.0,1949.867,1947.0,15000,1980.0,1928.0
498,2018/07/05,1890.0,1910.371,1924.0,28300,1960.0,1856.0
499,2018/07/06,1960.0,1920.749,1879.0,17100,1960.0,1869.0
500,2018/07/09,1997.0,1966.891,1960.0,11000,2027.0,1917.0
501,2018/07/10,1982.0,1998.099,2037.0,8100,2037.0,1967.0
502,2018/07/11,1996.0,1979.135,1942.0,8900,2009.0,1937.0
503,2018/07/12,1969.0,1979.577,1993.0,8500,1998.0,1963.0
504,2018/07/13,1970.0,1974.095,1969.0,7400,1995.0,1965.0
505,2018/07/17,1963.0,1981.72,2000.0,11800,2000.0,1960.0
506,2018/07/18,1973.0,1954.849,1969.0,20500,1989.0,1916.0
507,2018/07/19,1974.0,1967.789,1975.0,17500,1996.0,1940.0
508,2018/07/20,1921.0,1923.966,1961.0,17800,1981.0,1887.0
509,2018/07/23,1912.0,1919.079,1922.0,11400,1949.0,1901.0
510,2018/07/24,1924.0,1933.441,1912.0,13600,1950.0,1912.0
511,2018/07/25,2109.0,2068.971,1928.0,66300,2140.0,1928.0
512,2018/07/26,2104.0,2146.486,2139.0,62700,2215.0,2069.0
513,2018/07/27,2102.0,2087.388,2104.0,19600,2164.0,2032.0
514,2018/07/30,2078.0,2123.975,2152.0,19900,2176.0,2068.0
515,2018/07/31,2027.0,2027.595,2061.0,11100,2066.0,2000.0
516,2018/08/01,1997.0,2000.371,2002.0,12400,2037.0,1980.0
517,2018/08/02,2009.0,2007.505,1982.0,10700,2029.0,1960.0
518,2018/08/03,1946.0,1982.733,2011.0,15000,2048.0,1946.0
519,2018/08/06,1903.0,1914.57,1946.0,17900,1948.0,1885.0
520,2018/08/07,1873.0,1878.225,1900.0,15100,1903.0,1840.0
521,2018/08/08,1919.0,1914.007,1863.0,14000,1931.0,1863.0
522,2018/08/09,1924.0,1917.837,1933.0,4900,1934.0,1909.0
523,2018/08/10,1840.0,1870.066,1913.0,22900,1924.0,1840.0
524,2018/08/13,1883.0,1791.349,1790.0,31800,1906.0,1717.0
525,2018/08/14,2000.0,1959.637,1904.0,34400,2000.0,1871.0
526,2018/08/15,1931.0,1973.358,1957.0,13400,2032.0,1931.0
527,2018/08/16,1796.0,1833.841,1901.0,21400,1905.0,1795.0
528,2018/08/17,1899.0,1869.233,1836.0,27100,1915.0,1803.0
529,2018/08/20,1873.0,1843.769,1899.0,16000,1899.0,1810.0
530,2018/08/21,1817.0,1832.063,1873.0,24000,1898.0,1810.0
531,2018/08/22,1785.0,1793.582,1819.0,19600,1825.0,1764.0
532,2018/08/23,1800.0,1801.382,1780.0,13600,1811.0,1775.0
533,2018/08/24,1827.0,1809.805,1798.0,4100,1827.0,1794.0
534,2018/08/27,1944.0,1901.172,1830.0,19200,1966.0,1830.0
535,2018/08/28,1968.0,1971.562,1970.0,27600,1993.0,1939.0
536,2018/08/29,1979.0,1965.64,1970.0,8900,1985.0,1931.0
537,2018/08/30,2046.0,2004.343,1979.0,17800,2067.0,1960.0
538,2018/08/31,1971.0,2005.17,2067.0,23500,2080.0,1971.0
539,2018/09/03,1906.0,1908.864,1970.0,16900,1970.0,1890.0
540,2018/09/04,1950.0,1958.065,1977.0,15500,1993.0,1916.0
541,2018/09/05,1920.0,1951.831,1990.0,17700,1990.0,1920.0
542,2018/09/06,1837.0,1877.575,1960.0,24700,1960.0,1832.0
543,2018/09/07,1920.0,1862.39,1830.0,14100,1926.0,1830.0
544,2018/09/10,1918.0,1901.977,1897.0,17500,1924.0,1842.0
545,2018/09/11,1899.0,1898.152,1919.0,10500,1924.0,1882.0
546,2018/09/12,1845.0,1862.034,1890.0,8900,1905.0,1845.0
547,2018/09/13,1880.0,1876.019,1857.0,15900,1914.0,1838.0
548,2018/09/14,1995.0,1974.252,1949.0,43200,1998.0,1941.0
549,2018/09/18,1950.0,1985.535,1995.0,20000,2009.0,1950.0
550,2018/09/19,1938.0,1930.0,1955.0,17800,1955.0,1910.0
551,2018/09/20,2017.0,1971.213,1938.0,21600,2017.0,1905.0
552,2018/09/21,1990.0,1988.539,1971.0,19500,2040.0,1954.0
553,2018/09/25,2005.0,2001.829,2028.0,11100,2028.0,1992.0
554,2018/09/26,1991.0,1996.69,1980.0,11300,2015.0,1980.0
555,2018/09/27,1967.0,1993.415,1992.0,17600,2034.0,1953.0
556,2018/09/28,2115.0,2056.078,1989.0,38700,2129.0,1966.0
557,2018/10/01,2092.0,2107.513,2146.0,26900,2146.0,2063.0
558,2018/10/02,1985.0,2018.987,2100.0,22200,2100.0,1977.0
559,2018/10/03,1955.0,1963.336,1971.0,13700,1995.0,1937.0
560,2018/10/04,2050.0,2034.823,1995.0,38300,2098.0,1921.0
561,2018/10/05,1988.0,2006.593,2001.0,10800,2050.0,1970.0
562,2018/10/09,1896.0,1893.238,1948.0,21400,1948.0,1856.0
563,2018/10/10,1854.0,1848.006,1897.0,17700,1919.0,1806.0
564,2018/10/11,1799.0,1784.366,1740.0,25700,1839.0,1740.0
565,2018/10/12,1819.0,1802.688,1759.0,16000,1844.0,1759.0
566,2018/10/15,1807.0,1819.607,1802.0,5600,1840.0,1801.0
567,2018/10/16,1805.0,1799.088,1815.0,12500,1827.0,1765.0
568,2018/10/17,1860.0,1850.149,1829.0,7400,1876.0,1829.0
569,2018/10/18,1822.0,1825.149,1823.0,4700,1831.0,1820.0
570,2018/10/19,1833.0,1795.791,1783.0,6700,1833.0,1776.0
571,2018/10/22,1824.0,1819.818,1833.0,4400,1833.0,1808.0
572,2018/10/23,1761.0,1784.6,1805.0,15500,1840.0,1756.0
573,2018/10/24,1777.0,1779.805,1768.0,11300,1807.0,1759.0
574,2018/10/25,1721.0,1718.703,1725.0,12100,1744.0,1708.0
575,2018/10/26,1604.0,1640.021,1758.0,28100,1758.0,1554.0
576,2018/10/29,1530.0,1563.116,1595.0,19900,1636.0,1504.0
577,2018/10/30,1470.0,1471.164,1490.0,36700,1525.0,1451.0
578,2018/10/31,1499.0,1482.536,1451.0,28200,1511.0,1451.0
579,2018/11/01,1500.0,1497.896,1499.0,6700,1517.0,1480.0
580,2018/11/02,1463.0,1467.117,1498.0,16300,1498.0,1450.0
581,2018/11/05,1454.0,1457.615,1453.0,9100,1471.0,1443.0
582,2018/11/06,1436.0,1446.589,1454.0,9000,1468.0,1429.0
583,2018/11/07,1394.0,1408.328,1422.0,12200,1428.0,1387.0
584,2018/11/08,1442.0,1431.405,1401.0,11600,1461.0,1401.0
585,2018/11/09,1419.0,1439.876,1442.0,15300,1475.0,1411.0
586,2018/11/12,1454.0,1442.571,1449.0,19600,1468.0,1400.0
587,2018/11/13,1255.0,1284.279,1350.0,51700,1380.0,1254.0
588,2018/11/14,1100.0,1070.076,1225.0,136500,1240.0,1008.0
589,2018/11/15,998.0,1026.504,1101.0,103800,1110.0,990.0
590,2018/11/16,997.0,1012.068,1033.0,36600,1033.0,992.0
591,2018/11/19,1012.0,1018.894,1032.0,15100,1032.0,1005.0
592,2018/11/20,1002.0,1000.664,1009.0,26200,1014.0,984.0
593,2018/11/21,991.0,986.566,980.0,25600,998.0,962.0
594,2018/11/22,987.0,989.874,991.0,19000,1007.0,982.0
595,2018/11/26,997.0,987.165,987.0,35200,999.0,972.0
596,2018/11/27,987.0,986.069,996.0,21600,998.0,973.0
597,2018/11/28,1137.0,1067.575,979.0,74900,1137.0,976.0
598,2018/11/29,1076.0,1100.959,1134.0,67700,1134.0,1058.0
599,2018/11/30,1115.0,1191.282,1130.0,237200,1265.0,1105.0
600,2018/12/03,1415.0,1329.968,1190.0,352600,1415.0,1154.0
601,2018/12/04,1300.0,1333.421,1395.0,228500,1395.0,1272.0
602,2018/12/05,1295.0,1266.604,1240.0,68000,1306.0,1221.0
603,2018/12/06,1134.0,1196.673,1275.0,73000,1294.0,1122.0
604,2018/12/07,1080.0,1104.509,1132.0,69500,1165.0,1061.0
605,2018/12/10,1005.0,1001.188,1070.0,108800,1070.0,972.0
606,2018/12/11,895.0,902.456,1014.0,165000,1020.0,854.0
607,2018/12/12,857.0,848.05,900.0,205200,902.0,820.0
608,2018/12/13,837.0,830.822,850.0,121600,851.0,817.0
609,2018/12/14,803.0,812.957,835.0,115400,835.0,801.0
610,2018/12/17,746.0,766.159,798.0,154400,798.0,735.0
611,2018/12/18,718.0,728.792,742.0,88900,744.0,718.0
612,2018/12/19,724.0,720.877,718.0,98800,742.0,703.0
613,2018/12/20,648.0,637.317,715.0,366300,715.0,602.0
614,2018/12/21,655.0,674.19,698.0,161300,700.0,648.0
615,2018/12/25,610.0,624.713,637.0,151900,639.0,604.0
616,2018/12/26,595.0,600.446,620.0,247800,642.0,565.0
617,2018/12/27,616.0,617.602,615.0,232600,637.0,599.0
618,2018/12/28,622.0,618.776,626.0,109300,635.0,606.0
619,2019/01/04,574.0,567.518,592.0,261000,594.0,555.0
620,2019/01/07,614.0,613.64,583.0,177600,638.0,583.0
621,2019/01/08,703.0,693.556,644.0,346800,714.0,644.0
622,2019/01/09,659.0,677.934,700.0,276100,711.0,656.0
623,2019/01/10,662.0,662.424,669.0,117000,693.0,646.0
624,2019/01/11,631.0,648.167,669.0,116500,675.0,625.0
625,2019/01/15,701.0,690.836,641.0,177300,725.0,641.0
626,2019/01/16,746.0,732.474,698.0,275600,768.0,674.0
627,2019/01/17,730.0,725.446,740.0,139100,749.0,703.0
628,2019/01/18,780.0,788.16,732.0,297300,818.0,732.0
629,2019/01/21,761.0,779.751,790.0,225300,814.0,758.0
630,2019/01/22,728.0,737.247,766.0,165900,770.0,705.0
631,2019/01/23,704.0,712.018,719.0,208300,741.0,700.0
632,2019/01/24,764.0,740.014,711.0,171900,773.0,705.0
633,2019/01/25,750.0,752.713,765.0,107200,774.0,736.0
634,2019/01/28,754.0,767.34,755.0,97000,795.0,751.0
635,2019/01/29,733.0,726.172,739.0,109400,740.0,713.0
636,2019/01/30,701.0,708.586,735.0,81100,735.0,700.0
637,2019/01/31,737.0,725.664,713.0,74100,746.0,703.0
638,2019/02/01,731.0,730.727,723.0,57900,744.0,716.0
639,2019/02/04,748.0,747.989,735.0,83000,762.0,734.0
640,2019/02/05,760.0,765.794,751.0,68400,780.0,751.0
641,2019/02/06,729.0,735.46,756.0,87600,760.0,716.0
642,2019/02/07,715.0,721.868,743.0,66100,744.0,711.0
643,2019/02/08,692.0,697.276,701.0,98400,720.0,684.0
644,2019/02/12,727.0,710.235,700.0,93800,733.0,690.0
645,2019/02/13,646.0,652.439,667.0,309900,680.0,632.0
646,2019/02/14,609.0,613.032,647.0,332800,667.0,586.0
647,2019/02/15,593.0,593.357,605.0,148900,608.0,584.0
648,2019/02/18,583.0,583.714,600.0,179700,600.0,575.0
649,2019/02/19,574.0,573.871,586.0,244900,605.0,550.0
650,2019/02/20,575.0,576.303,580.0,110600,583.0,564.0
651,2019/02/21,574.0,565.771,576.0,174500,589.0,556.0
652,2019/02/22,570.0,569.516,569.0,82500,577.0,560.0
653,2019/02/25,583.0,580.551,580.0,106900,589.0,574.0
654,2019/02/26,626.0,606.574,589.0,326600,628.0,588.0
655,2019/02/27,665.0,649.803,636.0,298300,669.0,630.0
656,2019/02/28,640.0,648.219,679.0,305400,679.0,631.0
657,2019/03/01,683.0,695.659,655.0,733500,736.0,650.0
658,2019/03/04,726.0,711.111,693.0,358000,731.0,685.0
659,2019/03/05,721.0,722.427,712.0,250500,739.0,710.0
660,2019/03/06,684.0,693.88,736.0,381600,736.0,670.0
661,2019/03/07,683.0,680.219,689.0,244900,711.0,657.0
662,2019/03/08,634.0,637.216,658.0,287200,663.0,618.0
663,2019/03/11,639.0,626.485,637.0,139300,647.0,607.0
664,2019/03/12,657.0,668.084,652.0,253600,695.0,646.0
665,2019/03/13,659.0,646.889,647.0,105300,660.0,631.0
666,2019/03/14,641.0,643.557,667.0,93700,670.0,633.0
667,2019/03/15,641.0,649.122,639.0,76800,663.0,637.0
668,2019/03/18,679.0,671.398,648.0,129700,692.0,643.0
669,2019/03/19,679.0,674.527,687.0,117500,688.0,654.0
670,2019/03/20,678.0,674.498,684.0,58000,684.0,665.0
671,2019/03/22,689.0,682.285,687.0,101500,692.0,672.0
672,2019/03/25,653.0,655.891,665.0,98700,669.0,646.0
673,2019/03/26,655.0,654.649,662.0,55600,662.0,647.0
674,2019/03/27,652.0,642.966,633.0,133000,669.0,623.0
675,2019/03/28,653.0,649.082,654.0,63800,661.0,636.0
676,2019/03/29,648.0,642.747,656.0,80300,668.0,631.0
677,2019/04/01,634.0,645.034,648.0,96200,664.0,631.0
678,2019/04/02,617.0,622.562,637.0,95300,644.0,610.0
679,2019/04/03,643.0,636.136,620.0,56100,649.0,615.0
680,2019/04/04,663.0,671.813,649.0,162700,691.0,643.0
681,2019/04/05,672.0,667.789,664.0,68300,682.0,648.0
682,2019/04/08,672.0,670.99,682.0,51700,682.0,664.0
683,2019/04/09,677.0,676.781,676.0,147300,700.0,653.0
684,2019/04/10,719.0,703.307,677.0,273900,719.0,665.0
685,2019/04/11,694.0,703.155,710.0,150200,721.0,692.0
686,2019/04/12,665.0,673.308,698.0,140800,698.0,660.0
687,2019/04/15,686.0,687.503,669.0,199600,704.0,666.0
688,2019/04/16,682.0,687.778,694.0,68600,700.0,679.0
689,2019/04/17,678.0,686.592,687.0,160100,709.0,665.0
690,2019/04/18,636.0,645.376,676.0,211800,676.0,628.0
691,2019/04/19,641.0,641.141,636.0,60800,651.0,630.0
692,2019/04/22,646.0,638.367,640.0,78800,651.0,629.0
693,2019/04/23,634.0,627.582,645.0,90400,647.0,615.0
694,2019/04/24,625.0,631.262,633.0,38500,646.0,621.0
695,2019/04/25,623.0,621.77,635.0,55200,635.0,613.0
696,2019/04/26,640.0,620.315,619.0,103100,640.0,604.0
697,2019/05/07,640.0,642.46,630.0,50700,651.0,630.0
698,2019/05/08,629.0,624.384,637.0,48500,637.0,616.0
699,2019/05/09,614.0,615.07,632.0,93400,632.0,607.0
700,2019/05/10,615.0,616.066,608.0,85100,639.0,603.0
701,2019/05/13,583.0,596.995,613.0,80300,614.0,582.0
702,2019/05/14,577.0,564.062,553.0,117100,586.0,546.0
703,2019/05/15,572.0,565.933,577.0,70300,580.0,555.0
704,2019/05/16,538.0,543.014,573.0,151400,575.0,523.0
705,2019/05/17,562.0,556.119,548.0,70800,569.0,536.0
706,2019/05/20,551.0,558.193,567.0,48700,579.0,542.0
707,2019/05/21,554.0,547.66,571.0,54400,571.0,534.0
708,2019/05/22,587.0,576.934,564.0,91900,590.0,556.0
709,2019/05/23,577.0,575.079,577.0,44500,588.0,563.0
710,2019/05/24,585.0,578.369,567.0,44700,596.0,557.0
711,2019/05/27,594.0,589.457,595.0,55400,600.0,576.0
712,2019/05/28,626.0,617.419,603.0,104300,631.0,595.0
713,2019/05/29,642.0,665.657,660.0,331200,688.0,640.0
714,2019/05/30,641.0,626.421,637.0,80600,641.0,613.0
715,2019/05/31,641.0,640.033,644.0,51900,652.0,627.0
716,2019/06/03,606.0,614.914,631.0,87200,631.0,600.0
717,2019/06/04,607.0,598.015,603.0,40600,607.0,583.0
718,2019/06/05,637.0,628.591,608.0,59400,640.0,608.0
719,2019/06/06,625.0,638.847,640.0,58000,654.0,625.0
720,2019/06/07,619.0,624.341,626.0,32300,635.0,614.0
721,2019/06/10,617.0,622.762,619.0,26500,634.0,614.0
722,2019/06/11,618.0,618.984,614.0,31100,631.0,607.0
723,2019/06/12,642.0,634.735,624.0,66800,649.0,620.0
724,2019/06/13,633.0,633.764,632.0,26700,641.0,627.0
725,2019/06/14,643.0,637.665,642.0,22400,643.0,631.0
726,2019/06/17,645.0,645.07,648.0,30000,654.0,637.0
727,2019/06/18,617.0,625.923,645.0,49500,645.0,616.0
728,2019/06/19,626.0,630.324,627.0,32700,642.0,618.0
729,2019/06/20,626.0,625.539,628.0,16900,632.0,619.0
730,2019/06/21,617.0,621.99,622.0,29600,635.0,616.0
731,2019/06/24,611.0,609.355,612.0,39200,620.0,603.0
732,2019/06/25,605.0,609.816,615.0,30900,627.0,600.0
733,2019/06/26,596.0,600.629,614.0,20500,614.0,593.0
734,2019/06/27,594.0,595.992,593.0,35800,605.0,587.0
735,2019/06/28,594.0,600.108,600.0,20400,608.0,590.0
736,2019/07/01,607.0,607.775,604.0,40400,616.0,600.0
737,2019/07/02,619.0,618.041,609.0,41900,627.0,606.0
738,2019/07/03,616.0,616.729,623.0,18100,626.0,610.0
739,2019/07/04,623.0,621.899,616.0,16800,627.0,614.0
740,2019/07/05,629.0,629.694,625.0,34600,635.0,622.0
741,2019/07/08,627.0,631.239,635.0,20500,641.0,624.0
742,2019/07/09,624.0,626.232,628.0,13800,633.0,622.0
743,2019/07/10,620.0,621.436,620.0,17200,627.0,615.0
744,2019/07/11,620.0,620.776,626.0,10700,626.0,618.0
745,2019/07/12,602.0,610.296,624.0,70000,626.0,600.0
746,2019/07/16,600.0,599.728,599.0,33800,608.0,597.0
747,2019/07/17,612.0,603.379,610.0,21100,612.0,598.0
748,2019/07/18,597.0,604.044,606.0,34000,622.0,596.0
749,2019/07/19,599.0,604.649,605.0,13100,612.0,599.0
750,2019/07/22,600.0,601.043,600.0,18700,608.0,594.0
751,2019/07/23,601.0,603.569,600.0,42000,613.0,599.0
752,2019/07/24,605.0,607.83,610.0,14700,611.0,603.0
753,2019/07/25,600.0,604.397,605.0,14600,608.0,600.0
754,2019/07/26,596.0,599.238,601.0,14300,603.0,596.0
755,2019/07/29,594.0,598.603,598.0,11600,609.0,594.0
756,2019/07/30,598.0,597.777,600.0,8500,602.0,595.0
757,2019/07/31,598.0,594.964,598.0,19200,599.0,590.0
758,2019/08/01,605.0,603.917,598.0,24200,613.0,596.0
759,2019/08/02,595.0,596.326,601.0,23900,604.0,590.0
760,2019/08/05,578.0,578.934,590.0,37800,591.0,570.0
761,2019/08/06,575.0,566.897,560.0,32100,580.0,556.0
762,2019/08/07,577.0,579.038,580.0,8000,586.0,574.0
763,2019/08/08,576.0,576.313,577.0,13400,584.0,569.0
764,2019/08/09,577.0,580.91,573.0,16600,587.0,573.0
765,2019/08/13,562.0,562.552,557.0,33500,575.0,557.0
766,2019/08/14,570.0,570.194,562.0,22700,583.0,562.0
767,2019/08/15,568.0,567.984,569.0,24900,575.0,561.0
768,2019/08/16,569.0,570.171,574.0,8800,574.0,567.0
769,2019/08/19,583.0,575.185,574.0,13000,586.0,569.0
770,2019/08/20,582.0,584.367,591.0,9800,591.0,580.0
771,2019/08/21,578.0,577.988,582.0,16200,582.0,574.0
772,2019/08/22,555.0,568.667,576.0,23700,576.0,555.0
773,2019/08/23,560.0,559.869,558.0,9900,564.0,556.0
