,Date,Close,VWAP,Open,Volume,High,Low
0,2014/08/25,1520.0,1515.95,1518.0,20000,1520.0,1506.0
1,2014/08/26,1522.0,1525.486,1520.0,17500,1540.0,1518.0
2,2014/08/27,1530.0,1524.833,1528.0,12000,1532.0,1518.0
3,2014/08/28,1534.0,1526.833,1528.0,12000,1540.0,1516.0
4,2014/08/29,1534.0,1527.333,1530.0,7500,1534.0,1518.0
5,2014/09/01,1540.0,1529.533,1522.0,30000,1542.0,1504.0
6,2014/09/02,1546.0,1537.647,1540.0,17000,1546.0,1530.0
7,2014/09/03,1550.0,1547.2,1552.0,25000,1552.0,1540.0
8,2014/09/04,1536.0,1536.714,1546.0,7000,1546.0,1530.0
9,2014/09/05,1540.0,1553.095,1544.0,21000,1568.0,1540.0
10,2014/09/08,1542.0,1542.824,1550.0,17000,1556.0,1528.0
11,2014/09/09,1572.0,1555.458,1550.0,29500,1572.0,1540.0
12,2014/09/10,1594.0,1573.17,1566.0,47000,1594.0,1558.0
13,2014/09/11,1610.0,1618.523,1624.0,55500,1630.0,1604.0
14,2014/09/12,1604.0,1607.538,1610.0,39000,1610.0,1594.0
15,2014/09/16,1624.0,1627.912,1626.0,34000,1632.0,1624.0
16,2014/09/17,1622.0,1632.0,1632.0,23500,1640.0,1622.0
17,2014/09/18,1638.0,1636.239,1634.0,58500,1646.0,1622.0
18,2014/09/19,1654.0,1648.88,1646.0,50000,1656.0,1636.0
19,2014/09/22,1648.0,1646.526,1654.0,19000,1654.0,1640.0
20,2014/09/24,1660.0,1652.319,1640.0,34500,1666.0,1640.0
21,2014/09/25,1682.0,1672.415,1664.0,26500,1682.0,1662.0
22,2014/09/26,1654.0,1646.966,1618.0,29000,1660.0,1618.0
23,2014/09/29,1658.0,1663.273,1668.0,11000,1674.0,1654.0
24,2014/09/30,1642.0,1640.977,1644.0,21500,1648.0,1632.0
25,2014/10/01,1634.0,1631.608,1626.0,25500,1644.0,1612.0
26,2014/10/02,1600.0,1604.154,1600.0,26000,1614.0,1596.0
27,2014/10/03,1588.0,1591.448,1590.0,14500,1600.0,1576.0
28,2014/10/06,1604.0,1605.481,1596.0,13500,1618.0,1596.0
29,2014/10/07,1610.0,1612.703,1604.0,18500,1626.0,1600.0
30,2014/10/08,1588.0,1579.694,1570.0,36000,1600.0,1570.0
31,2014/10/09,1572.0,1577.913,1606.0,34500,1606.0,1554.0
32,2014/10/10,1550.0,1551.673,1546.0,24500,1568.0,1542.0
33,2014/10/14,1498.0,1520.281,1520.0,28500,1546.0,1498.0
34,2014/10/15,1526.0,1524.154,1528.0,13000,1540.0,1514.0
35,2014/10/16,1498.0,1507.137,1498.0,25500,1528.0,1498.0
36,2014/10/17,1490.0,1497.244,1498.0,22500,1516.0,1484.0
37,2014/10/20,1528.0,1527.257,1514.0,17500,1534.0,1514.0
38,2014/10/21,1516.0,1521.438,1528.0,16000,1532.0,1512.0
39,2014/10/22,1538.0,1534.765,1522.0,17000,1542.0,1522.0
40,2014/10/23,1534.0,1539.273,1542.0,16500,1552.0,1526.0
41,2014/10/24,1544.0,1548.552,1550.0,14500,1558.0,1542.0
42,2014/10/27,1560.0,1563.9,1574.0,10000,1574.0,1558.0
43,2014/10/28,1548.0,1551.4,1560.0,5000,1560.0,1548.0
44,2014/10/29,1560.0,1555.419,1550.0,15500,1562.0,1550.0
45,2014/10/30,1562.0,1564.311,1564.0,61000,1576.0,1562.0
46,2014/10/31,1594.0,1587.782,1590.0,50500,1616.0,1568.0
47,2014/11/04,1624.0,1623.689,1616.0,67500,1638.0,1606.0
48,2014/11/05,1636.0,1625.941,1620.0,51000,1640.0,1616.0
49,2014/11/06,1624.0,1630.074,1636.0,27000,1644.0,1618.0
50,2014/11/07,1642.0,1634.207,1632.0,29000,1648.0,1620.0
51,2014/11/10,1642.0,1633.375,1638.0,16000,1644.0,1624.0
52,2014/11/11,1644.0,1642.929,1648.0,14000,1650.0,1636.0
53,2014/11/12,1630.0,1638.6,1644.0,15000,1648.0,1630.0
54,2014/11/13,1646.0,1632.514,1620.0,35000,1646.0,1610.0
55,2014/11/14,1652.0,1640.816,1634.0,24500,1652.0,1630.0
56,2014/11/17,1620.0,1621.189,1632.0,18500,1632.0,1612.0
57,2014/11/18,1626.0,1621.882,1618.0,17000,1630.0,1616.0
58,2014/11/19,1618.0,1623.487,1624.0,19500,1634.0,1614.0
59,2014/11/20,1616.0,1607.069,1608.0,29000,1620.0,1586.0
60,2014/11/21,1614.0,1613.615,1610.0,13000,1620.0,1606.0
61,2014/11/25,1628.0,1625.355,1622.0,15500,1634.0,1612.0
62,2014/11/26,1616.0,1625.729,1630.0,29500,1638.0,1614.0
63,2014/11/27,1610.0,1612.452,1616.0,15500,1620.0,1610.0
64,2014/11/28,1622.0,1618.5,1622.0,8000,1622.0,1610.0
65,2014/12/01,1622.0,1621.314,1622.0,17500,1626.0,1618.0
66,2014/12/02,1634.0,1622.19,1614.0,10500,1636.0,1610.0
67,2014/12/03,1632.0,1631.854,1616.0,20500,1640.0,1616.0
68,2014/12/04,1634.0,1634.667,1630.0,16500,1640.0,1628.0
69,2014/12/05,1644.0,1640.857,1636.0,10500,1646.0,1636.0
70,2014/12/08,1630.0,1639.545,1650.0,33000,1656.0,1626.0
71,2014/12/09,1632.0,1636.471,1618.0,17000,1646.0,1618.0
72,2014/12/10,1624.0,1627.855,1632.0,27500,1632.0,1622.0
73,2014/12/11,1620.0,1619.515,1614.0,16500,1634.0,1614.0
74,2014/12/12,1622.0,1618.092,1614.0,32500,1632.0,1614.0
75,2014/12/15,1622.0,1620.489,1622.0,22500,1626.0,1610.0
76,2014/12/16,1594.0,1596.828,1592.0,29000,1610.0,1592.0
77,2014/12/17,1598.0,1597.333,1586.0,16500,1604.0,1586.0
78,2014/12/18,1616.0,1612.364,1610.0,11000,1616.0,1604.0
79,2014/12/19,1634.0,1626.301,1626.0,46500,1636.0,1616.0
80,2014/12/22,1638.0,1638.138,1640.0,14500,1646.0,1626.0
81,2014/12/24,1636.0,1637.037,1648.0,13500,1648.0,1630.0
82,2014/12/25,1630.0,1626.063,1636.0,16000,1636.0,1610.0
83,2014/12/26,1630.0,1631.571,1630.0,14000,1638.0,1628.0
84,2014/12/29,1634.0,1635.619,1630.0,21000,1640.0,1630.0
85,2014/12/30,1632.0,1635.867,1644.0,15000,1644.0,1628.0
86,2015/01/05,1634.0,1630.6,1632.0,15000,1636.0,1624.0
87,2015/01/06,1586.0,1598.154,1628.0,45500,1628.0,1586.0
88,2015/01/07,1584.0,1585.094,1578.0,26500,1600.0,1574.0
89,2015/01/08,1602.0,1604.8,1598.0,17500,1610.0,1598.0
90,2015/01/09,1606.0,1604.698,1602.0,21500,1612.0,1602.0
91,2015/01/13,1596.0,1587.647,1590.0,17000,1596.0,1578.0
92,2015/01/14,1570.0,1583.941,1584.0,17000,1594.0,1570.0
93,2015/01/15,1586.0,1583.879,1568.0,16500,1590.0,1568.0
94,2015/01/16,1558.0,1564.4,1570.0,27500,1582.0,1558.0
95,2015/01/19,1572.0,1567.077,1560.0,26000,1578.0,1558.0
96,2015/01/20,1598.0,1590.571,1582.0,14000,1598.0,1582.0
97,2015/01/21,1578.0,1577.706,1596.0,17000,1596.0,1560.0
98,2015/01/22,1578.0,1576.471,1578.0,8500,1578.0,1572.0
99,2015/01/23,1590.0,1586.571,1582.0,7000,1592.0,1582.0
100,2015/01/26,1604.0,1602.824,1582.0,17000,1612.0,1582.0
101,2015/01/27,1618.0,1616.067,1604.0,15000,1620.0,1604.0
102,2015/01/28,1628.0,1620.667,1606.0,19500,1628.0,1606.0
103,2015/01/29,1616.0,1616.0,1614.0,7500,1620.0,1612.0
104,2015/01/30,1624.0,1624.127,1616.0,31500,1638.0,1616.0
105,2015/02/02,1610.0,1612.875,1612.0,32000,1620.0,1606.0
106,2015/02/03,1592.0,1603.0,1610.0,23000,1618.0,1592.0
107,2015/02/04,1612.0,1611.48,1602.0,25000,1624.0,1598.0
108,2015/02/05,1616.0,1616.444,1612.0,9000,1620.0,1612.0
109,2015/02/06,1610.0,1612.471,1622.0,17000,1622.0,1606.0
110,2015/02/09,1610.0,1614.323,1616.0,15500,1618.0,1606.0
111,2015/02/10,1616.0,1618.737,1610.0,9500,1622.0,1610.0
112,2015/02/12,1618.0,1626.875,1624.0,16000,1636.0,1616.0
113,2015/02/13,1640.0,1634.688,1618.0,32000,1650.0,1618.0
114,2015/02/16,1656.0,1658.39,1640.0,20500,1668.0,1640.0
115,2015/02/17,1664.0,1658.872,1656.0,19500,1664.0,1650.0
116,2015/02/18,1666.0,1668.16,1652.0,50000,1680.0,1652.0
117,2015/02/19,1692.0,1686.027,1682.0,37500,1692.0,1680.0
118,2015/02/20,1692.0,1694.209,1698.0,33500,1698.0,1684.0
119,2015/02/23,1700.0,1700.897,1700.0,39000,1710.0,1692.0
120,2015/02/24,1630.0,1623.254,1616.0,151500,1634.0,1610.0
121,2015/02/25,1630.0,1630.038,1636.0,53000,1636.0,1620.0
122,2015/02/26,1630.0,1629.359,1630.0,51500,1634.0,1620.0
123,2015/02/27,1620.0,1622.169,1634.0,89000,1636.0,1614.0
124,2015/03/02,1616.0,1620.523,1628.0,32500,1632.0,1616.0
125,2015/03/03,1612.0,1613.919,1620.0,37000,1624.0,1608.0
126,2015/03/04,1604.0,1604.973,1612.0,73000,1612.0,1602.0
127,2015/03/05,1606.0,1607.769,1606.0,26000,1616.0,1606.0
128,2015/03/06,1612.0,1609.552,1606.0,29000,1616.0,1604.0
129,2015/03/09,1612.0,1612.227,1610.0,22000,1620.0,1602.0
130,2015/03/10,1614.0,1619.193,1626.0,28500,1626.0,1610.0
131,2015/03/11,1622.0,1618.068,1610.0,29500,1624.0,1610.0
132,2015/03/12,1624.0,1626.571,1622.0,24500,1630.0,1622.0
133,2015/03/13,1636.0,1642.966,1648.0,58000,1648.0,1632.0
134,2015/03/16,1648.0,1647.889,1650.0,36000,1656.0,1640.0
135,2015/03/17,1656.0,1651.275,1648.0,45500,1660.0,1642.0
136,2015/03/18,1666.0,1654.925,1656.0,33500,1666.0,1648.0
137,2015/03/19,1664.0,1665.258,1678.0,31000,1680.0,1654.0
138,2015/03/20,1696.0,1675.675,1674.0,40000,1696.0,1654.0
139,2015/03/23,1696.0,1692.635,1694.0,42500,1706.0,1682.0
140,2015/03/24,1706.0,1702.229,1696.0,35000,1716.0,1692.0
141,2015/03/25,1720.0,1715.081,1706.0,67500,1724.0,1700.0
142,2015/03/26,1734.0,1734.085,1730.0,71000,1746.0,1720.0
143,2015/03/27,1702.0,1715.264,1726.0,62500,1746.0,1692.0
144,2015/03/30,1682.0,1688.306,1700.0,42500,1706.0,1658.0
145,2015/03/31,1682.0,1686.852,1682.0,30500,1704.0,1678.0
146,2015/04/01,1660.0,1667.04,1676.0,37500,1676.0,1658.0
147,2015/04/02,1700.0,1692.589,1670.0,47500,1704.0,1670.0
148,2015/04/03,1700.0,1695.772,1700.0,39500,1704.0,1690.0
149,2015/04/06,1702.0,1709.538,1718.0,19500,1720.0,1702.0
150,2015/04/07,1706.0,1705.474,1702.0,19000,1708.0,1702.0
151,2015/04/08,1718.0,1725.105,1718.0,38000,1736.0,1704.0
152,2015/04/09,1706.0,1702.545,1708.0,22000,1718.0,1684.0
153,2015/04/10,1702.0,1703.462,1712.0,13000,1712.0,1694.0
154,2015/04/13,1704.0,1701.944,1700.0,18000,1708.0,1698.0
155,2015/04/14,1708.0,1705.412,1708.0,8500,1708.0,1702.0
156,2015/04/15,1710.0,1707.04,1700.0,12500,1726.0,1700.0
157,2015/04/16,1718.0,1719.489,1724.0,23500,1724.0,1710.0
158,2015/04/17,1720.0,1725.32,1702.0,25000,1734.0,1702.0
159,2015/04/20,1718.0,1724.121,1714.0,16500,1736.0,1714.0
160,2015/04/21,1724.0,1722.095,1716.0,21000,1730.0,1712.0
161,2015/04/22,1718.0,1720.0,1710.0,19000,1732.0,1696.0
162,2015/04/23,1716.0,1721.28,1720.0,12500,1730.0,1712.0
163,2015/04/24,1704.0,1710.421,1712.0,19000,1720.0,1702.0
164,2015/04/27,1710.0,1711.556,1704.0,13500,1720.0,1702.0
165,2015/04/28,1714.0,1717.2,1710.0,20000,1728.0,1710.0
166,2015/04/30,1722.0,1711.961,1706.0,25500,1724.0,1704.0
167,2015/05/01,1702.0,1705.318,1704.0,22000,1720.0,1696.0
168,2015/05/07,1726.0,1705.927,1700.0,27500,1728.0,1694.0
169,2015/05/08,1716.0,1713.167,1714.0,6000,1716.0,1710.0
170,2015/05/11,1726.0,1726.75,1728.0,16000,1736.0,1722.0
171,2015/05/12,1728.0,1722.258,1724.0,15500,1734.0,1706.0
172,2015/05/13,1728.0,1720.4,1710.0,12500,1728.0,1710.0
173,2015/05/14,1720.0,1724.816,1716.0,24500,1734.0,1712.0
174,2015/05/15,1764.0,1788.096,1736.0,125500,1836.0,1732.0
175,2015/05/18,1818.0,1809.824,1806.0,74000,1824.0,1794.0
176,2015/05/19,1846.0,1838.915,1834.0,64500,1852.0,1810.0
177,2015/05/20,1830.0,1831.386,1852.0,44000,1852.0,1816.0
178,2015/05/21,1812.0,1819.149,1822.0,23500,1834.0,1806.0
179,2015/05/22,1820.0,1814.146,1812.0,20500,1824.0,1800.0
180,2015/05/25,1836.0,1837.267,1846.0,30000,1846.0,1830.0
181,2015/05/26,1826.0,1833.357,1846.0,28000,1850.0,1818.0
182,2015/05/27,1836.0,1833.94,1838.0,33500,1840.0,1826.0
183,2015/05/28,1834.0,1832.905,1840.0,21000,1840.0,1826.0
184,2015/05/29,1848.0,1844.4,1840.0,40000,1852.0,1836.0
185,2015/06/01,1872.0,1865.507,1848.0,34500,1882.0,1848.0
186,2015/06/02,1886.0,1885.538,1876.0,45500,1900.0,1870.0
187,2015/06/03,1892.0,1888.082,1888.0,24500,1894.0,1882.0
188,2015/06/04,1898.0,1893.448,1896.0,29000,1900.0,1886.0
189,2015/06/05,1916.0,1905.833,1896.0,42000,1918.0,1894.0
190,2015/06/08,1918.0,1920.685,1926.0,36500,1928.0,1906.0
191,2015/06/09,1904.0,1911.71,1916.0,31000,1918.0,1902.0
192,2015/06/10,1928.0,1941.898,1920.0,59000,1966.0,1918.0
193,2015/06/11,1944.0,1940.432,1924.0,18500,1952.0,1924.0
194,2015/06/12,1936.0,1942.136,1946.0,66000,1958.0,1908.0
195,2015/06/15,1942.0,1932.426,1944.0,23500,1944.0,1920.0
196,2015/06/16,1932.0,1939.114,1942.0,35000,1956.0,1920.0
197,2015/06/17,1944.0,1937.676,1938.0,18500,1944.0,1932.0
198,2015/06/18,1930.0,1929.412,1946.0,25500,1946.0,1920.0
199,2015/06/19,1946.0,1945.461,1940.0,44500,1956.0,1940.0
200,2015/06/22,1966.0,1964.279,1942.0,21500,1994.0,1942.0
201,2015/06/23,1978.0,1978.162,1986.0,49500,1986.0,1968.0
202,2015/06/24,1986.0,1978.881,1978.0,42000,1988.0,1972.0
203,2015/06/25,1978.0,1984.585,1984.0,41000,1992.0,1976.0
204,2015/06/26,1988.0,1980.197,1974.0,30500,1994.0,1964.0
205,2015/06/29,1942.0,1956.211,1958.0,47500,1966.0,1934.0
206,2015/06/30,1956.0,1938.937,1936.0,39500,1960.0,1920.0
207,2015/07/01,1946.0,1960.292,1972.0,48000,1980.0,1938.0
208,2015/07/02,1936.0,1941.587,1952.0,31500,1952.0,1926.0
209,2015/07/03,1932.0,1931.742,1936.0,15500,1940.0,1924.0
210,2015/07/06,1906.0,1907.85,1932.0,40000,1932.0,1894.0
211,2015/07/07,1918.0,1917.56,1906.0,25000,1930.0,1906.0
212,2015/07/08,1868.0,1883.703,1898.0,64000,1904.0,1864.0
213,2015/07/09,1838.0,1819.609,1820.0,66500,1852.0,1774.0
214,2015/07/10,1854.0,1858.713,1856.0,50500,1888.0,1838.0
215,2015/07/13,1878.0,1879.118,1854.0,17000,1894.0,1854.0
216,2015/07/14,1904.0,1902.901,1892.0,35500,1918.0,1890.0
217,2015/07/15,1912.0,1910.217,1904.0,23000,1920.0,1898.0
218,2015/07/16,1946.0,1933.164,1912.0,27500,1950.0,1912.0
219,2015/07/17,1948.0,1950.216,1960.0,18500,1960.0,1922.0
220,2015/07/21,1948.0,1949.538,1950.0,13000,1958.0,1940.0
221,2015/07/22,1942.0,1942.8,1944.0,22500,1962.0,1932.0
222,2015/07/23,1954.0,1938.708,1948.0,32500,1954.0,1908.0
223,2015/07/24,1944.0,1945.793,1946.0,29000,1958.0,1936.0
224,2015/07/27,1936.0,1937.394,1944.0,16500,1952.0,1924.0
225,2015/07/28,1906.0,1904.854,1928.0,41000,1928.0,1884.0
226,2015/07/29,1906.0,1908.737,1942.0,19000,1942.0,1896.0
227,2015/07/30,1910.0,1918.733,1936.0,30000,1952.0,1902.0
228,2015/07/31,1954.0,1939.692,1920.0,32500,1956.0,1918.0
229,2015/08/03,1944.0,1929.083,1928.0,24000,1948.0,1900.0
230,2015/08/04,1938.0,1939.0,1944.0,31000,1950.0,1924.0
231,2015/08/05,1950.0,1941.573,1942.0,37500,1952.0,1924.0
232,2015/08/06,1988.0,1974.248,1950.0,64500,2028.0,1940.0
233,2015/08/07,1972.0,1973.523,1980.0,44000,1992.0,1956.0
234,2015/08/10,1992.0,1986.5,1972.0,36000,1998.0,1956.0
235,2015/08/11,1990.0,2000.836,1994.0,33500,2016.0,1990.0
236,2015/08/12,1966.0,1968.644,1990.0,29500,2000.0,1942.0
237,2015/08/13,1908.0,1912.892,1938.0,74000,1938.0,1892.0
238,2015/08/14,1916.0,1914.984,1908.0,61000,1934.0,1860.0
239,2015/08/17,1930.0,1926.179,1916.0,33500,1940.0,1910.0
240,2015/08/18,1934.0,1936.909,1942.0,16500,1948.0,1928.0
241,2015/08/19,1920.0,1920.343,1924.0,17500,1948.0,1910.0
242,2015/08/20,1906.0,1913.59,1932.0,19500,1932.0,1902.0
243,2015/08/21,1850.0,1878.0,1870.0,30000,1904.0,1846.0
244,2015/08/24,1744.0,1778.945,1800.0,55000,1812.0,1744.0
245,2015/08/25,1656.0,1644.907,1610.0,75000,1710.0,1610.0
246,2015/08/26,1682.0,1669.604,1656.0,50500,1712.0,1620.0
247,2015/08/27,1686.0,1696.13,1712.0,23000,1720.0,1684.0
248,2015/08/28,1746.0,1731.417,1706.0,24000,1756.0,1706.0
249,2015/08/31,1734.0,1732.044,1746.0,22500,1750.0,1720.0
250,2015/09/01,1698.0,1712.73,1734.0,31500,1734.0,1696.0
251,2015/09/02,1680.0,1684.219,1680.0,32000,1702.0,1662.0
252,2015/09/03,1682.0,1690.137,1692.0,51000,1706.0,1672.0
253,2015/09/04,1666.0,1668.92,1690.0,50000,1692.0,1652.0
254,2015/09/07,1698.0,1675.694,1658.0,36000,1702.0,1650.0
255,2015/09/08,1686.0,1692.954,1680.0,32500,1718.0,1680.0
256,2015/09/09,1810.0,1784.06,1704.0,66500,1826.0,1704.0
257,2015/09/10,1834.0,1811.816,1766.0,43500,1846.0,1766.0
258,2015/09/11,1788.0,1804.731,1804.0,52000,1826.0,1784.0
259,2015/09/14,1800.0,1795.245,1816.0,26500,1838.0,1770.0
260,2015/09/15,1788.0,1801.864,1800.0,29500,1824.0,1766.0
261,2015/09/16,1804.0,1791.391,1794.0,11500,1814.0,1778.0
262,2015/09/17,1808.0,1808.185,1804.0,27000,1828.0,1790.0
263,2015/09/18,1802.0,1800.578,1808.0,22500,1826.0,1778.0
264,2015/09/24,1760.0,1772.575,1782.0,43500,1790.0,1752.0
265,2015/09/25,1798.0,1779.966,1774.0,29500,1802.0,1742.0
266,2015/09/28,1812.0,1799.318,1798.0,42500,1826.0,1782.0
267,2015/09/29,1660.0,1726.882,1794.0,119000,1794.0,1650.0
268,2015/09/30,1592.0,1600.967,1630.0,135500,1646.0,1554.0
269,2015/10/01,1612.0,1613.068,1632.0,59000,1638.0,1594.0
270,2015/10/02,1568.0,1577.393,1596.0,44500,1600.0,1562.0
271,2015/10/05,1546.0,1559.649,1568.0,48500,1570.0,1544.0
272,2015/10/06,1562.0,1569.692,1568.0,26000,1582.0,1562.0
273,2015/10/07,1584.0,1567.613,1560.0,80000,1590.0,1552.0
274,2015/10/08,1560.0,1570.464,1578.0,34500,1588.0,1560.0
275,2015/10/09,1572.0,1572.607,1578.0,56000,1584.0,1564.0
276,2015/10/13,1564.0,1571.481,1572.0,40500,1590.0,1562.0
277,2015/10/14,1550.0,1554.659,1560.0,44000,1562.0,1546.0
278,2015/10/15,1562.0,1557.043,1550.0,23000,1570.0,1540.0
279,2015/10/16,1560.0,1567.682,1570.0,22000,1576.0,1560.0
280,2015/10/19,1584.0,1570.913,1562.0,23000,1584.0,1560.0
281,2015/10/20,1574.0,1579.2,1584.0,12500,1584.0,1572.0
282,2015/10/21,1586.0,1578.731,1574.0,26000,1586.0,1564.0
283,2015/10/22,1586.0,1588.519,1594.0,27000,1596.0,1580.0
284,2015/10/23,1596.0,1603.83,1610.0,23500,1612.0,1596.0
285,2015/10/26,1618.0,1613.933,1606.0,15000,1624.0,1606.0
286,2015/10/27,1596.0,1603.529,1618.0,25500,1618.0,1594.0
287,2015/10/28,1612.0,1616.597,1608.0,33500,1630.0,1606.0
288,2015/10/29,1612.0,1605.709,1606.0,27500,1616.0,1592.0
289,2015/10/30,1586.0,1595.633,1598.0,30000,1614.0,1586.0
290,2015/11/02,1566.0,1560.904,1594.0,88500,1594.0,1540.0
291,2015/11/04,1576.0,1585.889,1566.0,45000,1602.0,1566.0
292,2015/11/05,1598.0,1588.45,1578.0,20000,1598.0,1578.0
293,2015/11/06,1606.0,1595.943,1584.0,17500,1606.0,1584.0
294,2015/11/09,1648.0,1633.718,1618.0,39000,1650.0,1616.0
295,2015/11/10,1652.0,1645.76,1628.0,25000,1658.0,1628.0
296,2015/11/11,1644.0,1642.976,1646.0,20500,1658.0,1634.0
297,2015/11/12,1644.0,1649.308,1654.0,26000,1660.0,1642.0
298,2015/11/13,1622.0,1620.375,1624.0,24000,1634.0,1614.0
299,2015/11/16,1620.0,1619.891,1624.0,27500,1626.0,1612.0
300,2015/11/17,1662.0,1651.84,1626.0,50000,1680.0,1626.0
301,2015/11/18,1662.0,1670.741,1670.0,27000,1684.0,1660.0
302,2015/11/19,1694.0,1694.766,1674.0,47000,1712.0,1674.0
303,2015/11/20,1716.0,1694.238,1698.0,42000,1722.0,1670.0
304,2015/11/24,1720.0,1719.024,1716.0,20500,1726.0,1712.0
305,2015/11/25,1712.0,1713.12,1724.0,12500,1724.0,1704.0
306,2015/11/26,1704.0,1718.235,1728.0,17000,1730.0,1704.0
307,2015/11/27,1682.0,1690.381,1700.0,21000,1706.0,1680.0
308,2015/11/30,1682.0,1686.313,1702.0,16000,1702.0,1674.0
309,2015/12/01,1684.0,1688.294,1690.0,17000,1698.0,1678.0
310,2015/12/02,1670.0,1674.785,1684.0,39500,1698.0,1662.0
311,2015/12/03,1690.0,1680.882,1668.0,17000,1694.0,1668.0
312,2015/12/04,1668.0,1665.36,1668.0,12500,1674.0,1656.0
313,2015/12/07,1686.0,1682.72,1672.0,12500,1698.0,1672.0
314,2015/12/08,1666.0,1667.476,1686.0,21000,1686.0,1644.0
315,2015/12/09,1660.0,1653.65,1646.0,20000,1664.0,1632.0
316,2015/12/10,1632.0,1647.267,1662.0,30000,1662.0,1628.0
317,2015/12/11,1652.0,1634.188,1628.0,64000,1654.0,1628.0
318,2015/12/14,1644.0,1639.368,1640.0,19000,1646.0,1630.0
319,2015/12/15,1650.0,1657.765,1648.0,25500,1670.0,1648.0
320,2015/12/16,1666.0,1674.031,1680.0,32000,1680.0,1662.0
321,2015/12/17,1672.0,1677.452,1680.0,31000,1686.0,1670.0
322,2015/12/18,1602.0,1641.396,1678.0,26500,1678.0,1602.0
323,2015/12/21,1594.0,1597.444,1602.0,27000,1604.0,1592.0
324,2015/12/22,1594.0,1597.448,1600.0,14500,1602.0,1590.0
325,2015/12/24,1586.0,1596.375,1602.0,24000,1604.0,1586.0
326,2015/12/25,1580.0,1568.734,1596.0,39500,1596.0,1540.0
327,2015/12/28,1604.0,1594.286,1572.0,7000,1604.0,1572.0
328,2015/12/29,1630.0,1625.438,1600.0,16000,1632.0,1600.0
329,2015/12/30,1630.0,1638.25,1638.0,12000,1652.0,1628.0
330,2016/01/04,1608.0,1616.722,1634.0,18000,1644.0,1604.0
331,2016/01/05,1624.0,1627.647,1608.0,8500,1636.0,1608.0
332,2016/01/06,1604.0,1609.692,1624.0,19500,1624.0,1592.0
333,2016/01/07,1584.0,1587.458,1584.0,24000,1602.0,1580.0
334,2016/01/08,1548.0,1562.273,1574.0,22000,1592.0,1544.0
335,2016/01/12,1494.0,1509.477,1540.0,53500,1540.0,1494.0
336,2016/01/13,1532.0,1521.36,1502.0,12500,1534.0,1502.0
337,2016/01/14,1496.0,1502.652,1512.0,70500,1548.0,1466.0
338,2016/01/15,1528.0,1532.114,1526.0,35000,1542.0,1518.0
339,2016/01/18,1520.0,1504.048,1492.0,42000,1528.0,1488.0
340,2016/01/19,1516.0,1533.188,1524.0,48000,1554.0,1516.0
341,2016/01/20,1440.0,1466.773,1530.0,75000,1530.0,1432.0
342,2016/01/21,1392.0,1422.345,1442.0,58000,1456.0,1388.0
343,2016/01/22,1456.0,1435.973,1436.0,111000,1470.0,1410.0
344,2016/01/25,1466.0,1474.018,1480.0,112500,1498.0,1446.0
345,2016/01/26,1436.0,1442.842,1448.0,28500,1458.0,1432.0
346,2016/01/27,1468.0,1456.691,1440.0,27500,1480.0,1438.0
347,2016/01/28,1456.0,1465.563,1468.0,16000,1480.0,1456.0
348,2016/01/29,1492.0,1465.619,1480.0,21000,1492.0,1442.0
349,2016/02/01,1410.0,1390.058,1440.0,103000,1444.0,1336.0
350,2016/02/02,1388.0,1395.452,1414.0,42000,1414.0,1378.0
351,2016/02/03,1366.0,1361.9,1378.0,40000,1386.0,1342.0
352,2016/02/04,1344.0,1356.808,1346.0,26000,1370.0,1344.0
353,2016/02/05,1370.0,1361.908,1340.0,32500,1380.0,1338.0
354,2016/02/08,1360.0,1365.143,1370.0,17500,1370.0,1358.0
355,2016/02/09,1290.0,1309.895,1350.0,47500,1350.0,1284.0
356,2016/02/10,1172.0,1204.949,1290.0,68500,1290.0,1170.0
357,2016/02/12,1090.0,1115.098,1154.0,82000,1160.0,1060.0
358,2016/02/15,1176.0,1170.246,1162.0,32500,1178.0,1160.0
359,2016/02/16,1186.0,1204.0,1184.0,43500,1228.0,1178.0
360,2016/02/17,1208.0,1213.08,1190.0,25000,1236.0,1190.0
361,2016/02/18,1268.0,1256.383,1236.0,47000,1272.0,1220.0
362,2016/02/19,1262.0,1263.652,1266.0,34500,1276.0,1256.0
363,2016/02/22,1248.0,1247.608,1262.0,48500,1262.0,1240.0
364,2016/02/23,1254.0,1253.113,1272.0,48500,1272.0,1240.0
365,2016/02/24,1248.0,1248.044,1260.0,45000,1262.0,1236.0
366,2016/02/25,1270.0,1272.974,1266.0,19500,1284.0,1266.0
367,2016/02/26,1268.0,1282.069,1294.0,14500,1294.0,1268.0
368,2016/02/29,1276.0,1287.208,1294.0,26500,1300.0,1276.0
369,2016/03/01,1260.0,1259.152,1272.0,16500,1280.0,1248.0
370,2016/03/02,1294.0,1293.097,1300.0,15500,1300.0,1278.0
371,2016/03/03,1304.0,1302.813,1278.0,16000,1316.0,1278.0
372,2016/03/04,1304.0,1302.545,1288.0,22000,1326.0,1270.0
373,2016/03/07,1316.0,1316.293,1304.0,20500,1336.0,1292.0
374,2016/03/08,1280.0,1284.706,1308.0,34000,1308.0,1268.0
375,2016/03/09,1268.0,1264.857,1264.0,31500,1278.0,1258.0
376,2016/03/10,1296.0,1288.19,1268.0,21000,1304.0,1268.0
377,2016/03/11,1298.0,1288.09,1284.0,33500,1298.0,1280.0
378,2016/03/14,1324.0,1320.286,1318.0,28000,1334.0,1302.0
379,2016/03/15,1322.0,1320.448,1320.0,29000,1336.0,1308.0
380,2016/03/16,1316.0,1320.706,1322.0,25500,1326.0,1314.0
381,2016/03/17,1318.0,1327.875,1336.0,16000,1346.0,1316.0
382,2016/03/18,1310.0,1303.14,1338.0,57000,1338.0,1284.0
383,2016/03/22,1324.0,1329.25,1320.0,20000,1354.0,1318.0
384,2016/03/23,1330.0,1337.238,1342.0,10500,1342.0,1328.0
385,2016/03/24,1312.0,1321.571,1332.0,14000,1332.0,1312.0
386,2016/03/25,1322.0,1324.976,1330.0,20500,1332.0,1310.0
387,2016/03/28,1332.0,1325.366,1342.0,20500,1342.0,1312.0
388,2016/03/29,1320.0,1318.696,1320.0,11500,1324.0,1314.0
389,2016/03/30,1332.0,1338.444,1320.0,18000,1366.0,1320.0
390,2016/03/31,1320.0,1329.852,1350.0,13500,1350.0,1320.0
391,2016/04/01,1246.0,1275.923,1338.0,39000,1338.0,1240.0
392,2016/04/04,1246.0,1236.132,1246.0,38000,1248.0,1222.0
393,2016/04/05,1218.0,1216.061,1234.0,33000,1234.0,1200.0
394,2016/04/06,1218.0,1221.371,1218.0,35000,1246.0,1204.0
395,2016/04/07,1214.0,1218.978,1218.0,45000,1240.0,1212.0
396,2016/04/08,1226.0,1232.197,1220.0,30500,1250.0,1208.0
397,2016/04/11,1208.0,1213.625,1222.0,8000,1222.0,1208.0
398,2016/04/12,1230.0,1228.4,1228.0,22500,1238.0,1210.0
399,2016/04/13,1248.0,1245.412,1240.0,17000,1252.0,1234.0
400,2016/04/14,1280.0,1274.409,1264.0,63500,1296.0,1250.0
401,2016/04/15,1284.0,1278.505,1280.0,47500,1296.0,1262.0
402,2016/04/18,1266.0,1270.597,1270.0,33500,1280.0,1266.0
403,2016/04/19,1304.0,1279.038,1274.0,66500,1304.0,1254.0
404,2016/04/20,1292.0,1305.259,1316.0,58000,1316.0,1290.0
405,2016/04/21,1292.0,1306.711,1306.0,114000,1326.0,1290.0
406,2016/04/22,1308.0,1298.444,1302.0,13500,1308.0,1286.0
407,2016/04/25,1312.0,1318.5,1328.0,12000,1328.0,1312.0
408,2016/04/26,1302.0,1302.684,1308.0,19000,1312.0,1294.0
409,2016/04/27,1290.0,1293.147,1296.0,34000,1306.0,1280.0
410,2016/04/28,1270.0,1286.453,1290.0,26500,1314.0,1264.0
411,2016/05/02,1240.0,1240.0,1246.0,21500,1248.0,1232.0
412,2016/05/06,1238.0,1233.138,1236.0,29000,1258.0,1222.0
413,2016/05/09,1234.0,1238.167,1230.0,12000,1254.0,1228.0
414,2016/05/10,1274.0,1255.838,1234.0,18500,1274.0,1234.0
415,2016/05/11,1286.0,1290.0,1294.0,15000,1298.0,1278.0
416,2016/05/12,1278.0,1272.583,1284.0,12000,1284.0,1262.0
417,2016/05/13,1252.0,1256.45,1262.0,20000,1266.0,1248.0
418,2016/05/16,1282.0,1272.553,1240.0,38000,1290.0,1240.0
419,2016/05/17,1300.0,1291.944,1282.0,18000,1300.0,1282.0
420,2016/05/18,1296.0,1293.125,1288.0,8000,1306.0,1288.0
421,2016/05/19,1296.0,1291.592,1294.0,24500,1302.0,1278.0
422,2016/05/20,1298.0,1296.867,1306.0,15000,1306.0,1280.0
423,2016/05/23,1280.0,1278.686,1298.0,17500,1298.0,1272.0
424,2016/05/24,1272.0,1278.667,1288.0,12000,1288.0,1270.0
425,2016/05/25,1274.0,1269.654,1266.0,26000,1278.0,1264.0
426,2016/05/26,1276.0,1278.118,1280.0,25500,1282.0,1272.0
427,2016/05/27,1284.0,1280.833,1278.0,12000,1288.0,1278.0
428,2016/05/30,1302.0,1297.778,1286.0,9000,1304.0,1280.0
429,2016/05/31,1300.0,1300.56,1302.0,12500,1312.0,1286.0
430,2016/06/01,1296.0,1293.714,1298.0,7000,1298.0,1290.0
431,2016/06/02,1288.0,1293.333,1304.0,13500,1308.0,1284.0
432,2016/06/03,1302.0,1293.16,1294.0,25000,1302.0,1286.0
433,2016/06/06,1292.0,1288.56,1284.0,12500,1300.0,1280.0
434,2016/06/07,1286.0,1288.526,1294.0,9500,1296.0,1280.0
435,2016/06/08,1296.0,1290.333,1300.0,6000,1300.0,1282.0
436,2016/06/09,1300.0,1297.935,1296.0,15500,1302.0,1290.0
437,2016/06/10,1306.0,1321.525,1338.0,61000,1338.0,1296.0
438,2016/06/13,1250.0,1269.657,1286.0,35000,1288.0,1250.0
439,2016/06/14,1250.0,1249.063,1252.0,16000,1262.0,1240.0
440,2016/06/15,1252.0,1259.333,1250.0,18000,1276.0,1248.0
441,2016/06/16,1222.0,1233.367,1242.0,39500,1256.0,1218.0
442,2016/06/17,1188.0,1210.275,1246.0,65500,1246.0,1188.0
443,2016/06/20,1246.0,1236.342,1218.0,73000,1256.0,1218.0
444,2016/06/21,1284.0,1273.417,1246.0,12000,1296.0,1242.0
445,2016/06/22,1276.0,1282.174,1304.0,11500,1304.0,1262.0
446,2016/06/23,1296.0,1281.882,1268.0,25500,1298.0,1264.0
447,2016/06/24,1228.0,1246.877,1314.0,28500,1314.0,1202.0
448,2016/06/27,1256.0,1241.788,1224.0,33000,1262.0,1224.0
449,2016/06/28,1236.0,1244.857,1256.0,21000,1262.0,1228.0
450,2016/06/29,1252.0,1247.476,1258.0,21000,1264.0,1238.0
451,2016/06/30,1256.0,1260.947,1266.0,9500,1270.0,1250.0
452,2016/07/01,1248.0,1258.028,1260.0,35500,1274.0,1242.0
453,2016/07/04,1246.0,1247.341,1242.0,41000,1260.0,1232.0
454,2016/07/05,1244.0,1236.462,1238.0,39000,1248.0,1230.0
455,2016/07/06,1224.0,1215.824,1232.0,51000,1236.0,1190.0
456,2016/07/07,1224.0,1221.892,1214.0,18500,1234.0,1214.0
457,2016/07/08,1212.0,1213.613,1216.0,15500,1222.0,1210.0
458,2016/07/11,1248.0,1239.286,1230.0,14000,1254.0,1220.0
459,2016/07/12,1262.0,1266.577,1248.0,26000,1294.0,1248.0
460,2016/07/13,1282.0,1278.882,1274.0,17000,1294.0,1270.0
461,2016/07/14,1280.0,1277.875,1276.0,8000,1282.0,1268.0
462,2016/07/15,1288.0,1279.714,1270.0,7000,1292.0,1266.0
463,2016/07/19,1298.0,1290.571,1282.0,10500,1298.0,1282.0
464,2016/07/20,1296.0,1295.063,1298.0,16000,1300.0,1282.0
465,2016/07/21,1314.0,1304.9,1300.0,10000,1318.0,1290.0
466,2016/07/22,1308.0,1313.25,1312.0,4000,1320.0,1308.0
467,2016/07/25,1326.0,1316.829,1314.0,20500,1334.0,1304.0
468,2016/07/26,1312.0,1319.375,1326.0,16000,1332.0,1308.0
469,2016/07/27,1320.0,1325.52,1326.0,12500,1338.0,1298.0
470,2016/07/28,1332.0,1326.923,1334.0,13000,1336.0,1316.0
471,2016/07/29,1292.0,1282.805,1336.0,43500,1348.0,1236.0
472,2016/08/01,1256.0,1267.286,1278.0,21000,1284.0,1256.0
473,2016/08/02,1266.0,1264.25,1260.0,8000,1270.0,1260.0
474,2016/08/03,1232.0,1240.462,1262.0,13000,1262.0,1230.0
475,2016/08/04,1258.0,1239.091,1234.0,11000,1264.0,1230.0
476,2016/08/05,1250.0,1240.8,1246.0,12500,1250.0,1230.0
477,2016/08/08,1262.0,1258.4,1256.0,12500,1274.0,1244.0
478,2016/08/09,1268.0,1269.524,1274.0,10500,1274.0,1262.0
479,2016/08/10,1272.0,1265.6,1250.0,10000,1272.0,1250.0
480,2016/08/12,1276.0,1270.0,1282.0,12500,1282.0,1260.0
481,2016/08/15,1272.0,1269.2,1276.0,10000,1278.0,1260.0
482,2016/08/16,1280.0,1281.677,1282.0,15500,1286.0,1280.0
483,2016/08/17,1280.0,1274.074,1280.0,13500,1284.0,1264.0
484,2016/08/18,1280.0,1277.68,1270.0,12500,1290.0,1270.0
485,2016/08/19,1274.0,1289.579,1298.0,9500,1298.0,1274.0
486,2016/08/22,1296.0,1286.727,1282.0,11000,1296.0,1276.0
487,2016/08/23,1292.0,1288.667,1300.0,12000,1300.0,1278.0
488,2016/08/24,1302.0,1294.328,1292.0,33500,1304.0,1286.0
489,2016/08/25,1298.0,1307.158,1316.0,9500,1318.0,1296.0
490,2016/08/26,1296.0,1297.333,1298.0,1500,1298.0,1296.0
491,2016/08/29,1318.0,1316.0,1316.0,6000,1322.0,1306.0
492,2016/08/30,1328.0,1330.909,1330.0,5500,1344.0,1326.0
493,2016/08/31,1336.0,1337.111,1328.0,4500,1356.0,1328.0
494,2016/09/01,1334.0,1335.333,1336.0,3000,1348.0,1328.0
495,2016/09/02,1340.0,1335.333,1336.0,3000,1340.0,1322.0
496,2016/09/05,1346.0,1353.2,1354.0,5000,1364.0,1346.0
497,2016/09/06,1356.0,1350.667,1346.0,3000,1358.0,1346.0
498,2016/09/07,1348.0,1350.7,1356.0,10000,1360.0,1342.0
499,2016/09/08,1352.0,1355.286,1360.0,7000,1360.0,1352.0
500,2016/09/09,1358.0,1355.938,1358.0,16000,1358.0,1346.0
501,2016/09/12,1344.0,1340.588,1336.0,8500,1352.0,1328.0
502,2016/09/13,1348.0,1349.143,1354.0,7000,1360.0,1340.0
503,2016/09/14,1344.0,1342.0,1342.0,5000,1344.0,1338.0
504,2016/09/15,1326.0,1330.462,1340.0,6500,1358.0,1318.0
505,2016/09/16,1340.0,1333.515,1326.0,16500,1340.0,1322.0
506,2016/09/20,1348.0,1350.091,1352.0,11000,1352.0,1346.0
507,2016/09/21,1396.0,1378.75,1338.0,12000,1396.0,1338.0
508,2016/09/23,1404.0,1403.045,1396.0,22000,1412.0,1396.0
509,2016/09/26,1392.0,1394.5,1404.0,14000,1404.0,1378.0
510,2016/09/27,1302.0,1296.014,1312.0,143000,1312.0,1278.0
511,2016/09/28,1276.0,1279.44,1296.0,62500,1296.0,1262.0
512,2016/09/29,1282.0,1285.136,1282.0,22000,1292.0,1276.0
513,2016/09/30,1264.0,1266.161,1276.0,31000,1278.0,1258.0
514,2016/10/03,1276.0,1275.727,1274.0,11000,1280.0,1264.0
515,2016/10/04,1298.0,1294.228,1284.0,39500,1300.0,1278.0
516,2016/10/05,1302.0,1299.4,1306.0,15000,1306.0,1288.0
517,2016/10/06,1302.0,1307.064,1314.0,23500,1318.0,1300.0
518,2016/10/07,1302.0,1298.583,1304.0,12000,1304.0,1294.0
519,2016/10/11,1306.0,1309.375,1314.0,8000,1314.0,1300.0
520,2016/10/12,1292.0,1296.816,1294.0,24500,1302.0,1292.0
521,2016/10/13,1300.0,1297.238,1302.0,10500,1302.0,1290.0
522,2016/10/14,1294.0,1294.182,1292.0,5500,1298.0,1292.0
523,2016/10/17,1304.0,1299.8,1296.0,15000,1304.0,1292.0
524,2016/10/18,1300.0,1297.8,1296.0,5000,1300.0,1296.0
525,2016/10/19,1306.0,1304.4,1298.0,7500,1306.0,1298.0
526,2016/10/20,1312.0,1319.563,1322.0,43500,1334.0,1308.0
527,2016/10/21,1326.0,1323.167,1312.0,6000,1326.0,1312.0
528,2016/10/24,1322.0,1322.364,1318.0,5500,1332.0,1318.0
529,2016/10/25,1326.0,1324.65,1330.0,20000,1330.0,1318.0
530,2016/10/26,1328.0,1329.931,1330.0,14500,1334.0,1326.0
531,2016/10/27,1330.0,1328.842,1328.0,9500,1334.0,1326.0
532,2016/10/28,1346.0,1342.259,1330.0,27000,1348.0,1330.0
533,2016/10/31,1350.0,1354.605,1346.0,21500,1362.0,1344.0
534,2016/11/01,1350.0,1352.625,1350.0,24000,1368.0,1340.0
535,2016/11/02,1342.0,1340.809,1350.0,23500,1360.0,1310.0
536,2016/11/04,1354.0,1344.429,1330.0,14000,1356.0,1324.0
537,2016/11/07,1352.0,1350.299,1360.0,33500,1360.0,1330.0
538,2016/11/08,1360.0,1355.917,1358.0,12000,1360.0,1350.0
539,2016/11/09,1302.0,1320.206,1360.0,34000,1360.0,1302.0
540,2016/11/10,1356.0,1352.216,1356.0,18500,1360.0,1338.0
541,2016/11/11,1346.0,1347.576,1356.0,33000,1372.0,1332.0
542,2016/11/14,1354.0,1346.333,1338.0,18000,1354.0,1330.0
543,2016/11/15,1354.0,1354.3,1354.0,20000,1360.0,1350.0
544,2016/11/16,1366.0,1359.739,1366.0,11500,1366.0,1350.0
545,2016/11/17,1372.0,1367.176,1356.0,17000,1372.0,1356.0
546,2016/11/18,1386.0,1388.889,1392.0,22500,1392.0,1382.0
547,2016/11/21,1404.0,1393.292,1386.0,32500,1408.0,1380.0
548,2016/11/22,1474.0,1460.04,1432.0,75500,1492.0,1432.0
549,2016/11/24,1476.0,1481.981,1490.0,51500,1500.0,1474.0
550,2016/11/25,1478.0,1491.294,1496.0,34000,1504.0,1476.0
551,2016/11/28,1494.0,1475.808,1478.0,36500,1494.0,1456.0
552,2016/11/29,1484.0,1482.074,1470.0,13500,1490.0,1470.0
553,2016/11/30,1484.0,1481.429,1490.0,7000,1490.0,1470.0
554,2016/12/01,1498.0,1498.311,1496.0,22500,1504.0,1484.0
555,2016/12/02,1494.0,1489.273,1478.0,11000,1502.0,1478.0
556,2016/12/05,1498.0,1496.467,1494.0,15000,1500.0,1494.0
557,2016/12/06,1486.0,1494.198,1502.0,40500,1504.0,1484.0
558,2016/12/07,1488.0,1485.25,1486.0,32000,1494.0,1480.0
559,2016/12/08,1498.0,1490.055,1488.0,36500,1498.0,1482.0
560,2016/12/09,1488.0,1486.72,1498.0,62500,1498.0,1466.0
561,2016/12/12,1480.0,1478.958,1488.0,35500,1488.0,1472.0
562,2016/12/13,1482.0,1476.658,1472.0,38000,1482.0,1470.0
563,2016/12/14,1474.0,1465.905,1482.0,21000,1482.0,1440.0
564,2016/12/15,1474.0,1467.818,1474.0,33000,1474.0,1456.0
565,2016/12/16,1484.0,1482.472,1490.0,44500,1490.0,1474.0
566,2016/12/19,1474.0,1467.309,1472.0,27500,1482.0,1448.0
567,2016/12/20,1462.0,1459.928,1476.0,41500,1478.0,1444.0
568,2016/12/21,1482.0,1477.562,1470.0,36500,1486.0,1470.0
569,2016/12/22,1486.0,1483.429,1486.0,31500,1488.0,1468.0
570,2016/12/26,1484.0,1489.673,1490.0,24500,1510.0,1474.0
571,2016/12/27,1478.0,1479.44,1496.0,12500,1496.0,1472.0
572,2016/12/28,1484.0,1482.8,1478.0,10000,1496.0,1466.0
573,2016/12/29,1468.0,1470.865,1478.0,18500,1480.0,1464.0
574,2016/12/30,1476.0,1474.651,1468.0,21500,1482.0,1460.0
575,2017/01/04,1492.0,1492.319,1488.0,47000,1494.0,1488.0
576,2017/01/05,1498.0,1493.617,1492.0,23500,1500.0,1486.0
577,2017/01/06,1512.0,1502.031,1500.0,32000,1512.0,1474.0
578,2017/01/10,1512.0,1510.894,1512.0,42500,1516.0,1492.0
579,2017/01/11,1512.0,1506.132,1512.0,38000,1518.0,1488.0
580,2017/01/12,1504.0,1504.341,1518.0,20500,1518.0,1494.0
581,2017/01/13,1506.0,1503.056,1504.0,36000,1510.0,1494.0
582,2017/01/16,1504.0,1499.434,1496.0,26500,1510.0,1490.0
583,2017/01/17,1470.0,1480.533,1492.0,30000,1498.0,1466.0
584,2017/01/18,1484.0,1480.414,1478.0,43500,1506.0,1466.0
585,2017/01/19,1486.0,1485.292,1476.0,32500,1494.0,1476.0
586,2017/01/20,1496.0,1491.962,1492.0,53000,1506.0,1472.0
587,2017/01/23,1482.0,1487.421,1492.0,38000,1494.0,1480.0
588,2017/01/24,1484.0,1479.565,1480.0,11500,1484.0,1474.0
589,2017/01/25,1484.0,1486.52,1500.0,25000,1500.0,1478.0
590,2017/01/26,1494.0,1485.08,1486.0,43500,1496.0,1476.0
591,2017/01/27,1488.0,1490.197,1494.0,30500,1504.0,1482.0
592,2017/01/30,1476.0,1479.72,1480.0,25000,1488.0,1470.0
593,2017/01/31,1488.0,1484.706,1472.0,25500,1496.0,1472.0
594,2017/02/01,1502.0,1491.362,1478.0,23500,1506.0,1474.0
595,2017/02/02,1468.0,1478.525,1502.0,30500,1502.0,1464.0
596,2017/02/03,1464.0,1470.81,1472.0,21000,1480.0,1462.0
597,2017/02/06,1454.0,1462.0,1472.0,15500,1472.0,1454.0
598,2017/02/07,1446.0,1446.0,1454.0,20500,1454.0,1438.0
599,2017/02/08,1448.0,1446.071,1446.0,14000,1458.0,1442.0
600,2017/02/09,1442.0,1441.455,1442.0,27500,1466.0,1432.0
601,2017/02/10,1462.0,1455.59,1450.0,19500,1472.0,1450.0
602,2017/02/13,1470.0,1465.135,1462.0,18500,1472.0,1458.0
603,2017/02/14,1472.0,1476.778,1474.0,45000,1488.0,1468.0
604,2017/02/15,1476.0,1476.923,1476.0,26000,1486.0,1470.0
605,2017/02/16,1474.0,1468.649,1476.0,38500,1478.0,1460.0
606,2017/02/17,1484.0,1480.211,1474.0,9500,1484.0,1474.0
607,2017/02/20,1470.0,1473.212,1478.0,16500,1478.0,1462.0
608,2017/02/21,1476.0,1476.6,1472.0,10000,1480.0,1472.0
609,2017/02/22,1496.0,1489.87,1476.0,23000,1500.0,1476.0
610,2017/02/23,1502.0,1497.818,1490.0,22000,1508.0,1490.0
611,2017/02/24,1502.0,1498.41,1502.0,19500,1506.0,1484.0
612,2017/02/27,1480.0,1481.316,1486.0,19000,1496.0,1474.0
613,2017/02/28,1496.0,1500.122,1496.0,24500,1508.0,1496.0
614,2017/03/01,1510.0,1506.074,1508.0,27000,1516.0,1488.0
615,2017/03/02,1522.0,1518.444,1516.0,27000,1524.0,1510.0
616,2017/03/03,1520.0,1520.125,1512.0,16000,1524.0,1512.0
617,2017/03/06,1518.0,1511.478,1520.0,11500,1520.0,1498.0
618,2017/03/07,1516.0,1513.952,1512.0,21000,1526.0,1500.0
619,2017/03/08,1520.0,1517.517,1516.0,14500,1526.0,1510.0
620,2017/03/09,1524.0,1520.813,1520.0,16000,1526.0,1514.0
621,2017/03/10,1528.0,1529.031,1534.0,32000,1534.0,1512.0
622,2017/03/13,1544.0,1534.071,1528.0,28000,1544.0,1512.0
623,2017/03/14,1534.0,1537.517,1544.0,14500,1546.0,1528.0
624,2017/03/15,1538.0,1537.03,1538.0,16500,1542.0,1532.0
625,2017/03/16,1532.0,1528.611,1524.0,18000,1538.0,1520.0
626,2017/03/17,1516.0,1520.448,1534.0,29000,1534.0,1502.0
627,2017/03/21,1522.0,1518.0,1516.0,9500,1522.0,1510.0
628,2017/03/22,1506.0,1507.818,1508.0,11000,1512.0,1504.0
629,2017/03/23,1486.0,1500.789,1506.0,19000,1516.0,1486.0
630,2017/03/24,1514.0,1508.444,1494.0,9000,1522.0,1494.0
631,2017/03/27,1494.0,1501.875,1510.0,16000,1514.0,1494.0
632,2017/03/28,1532.0,1522.81,1510.0,21000,1536.0,1496.0
633,2017/03/29,1508.0,1512.64,1518.0,12500,1526.0,1504.0
634,2017/03/30,1500.0,1509.917,1522.0,12000,1522.0,1500.0
635,2017/03/31,1466.0,1476.222,1500.0,13500,1506.0,1464.0
636,2017/04/03,1450.0,1448.04,1466.0,25000,1466.0,1430.0
637,2017/04/04,1446.0,1439.067,1450.0,15000,1450.0,1426.0
638,2017/04/05,1444.0,1447.394,1446.0,16500,1458.0,1442.0
639,2017/04/06,1428.0,1424.105,1444.0,19000,1444.0,1400.0
640,2017/04/07,1438.0,1436.0,1424.0,15500,1460.0,1424.0
641,2017/04/10,1442.0,1445.25,1438.0,8000,1452.0,1438.0
642,2017/04/11,1430.0,1435.878,1420.0,24500,1454.0,1420.0
643,2017/04/12,1402.0,1404.973,1414.0,18500,1414.0,1400.0
644,2017/04/13,1402.0,1400.087,1388.0,23000,1408.0,1388.0
645,2017/04/14,1392.0,1395.286,1400.0,28000,1402.0,1388.0
646,2017/04/17,1402.0,1395.28,1390.0,12500,1406.0,1388.0
647,2017/04/18,1398.0,1401.655,1404.0,29000,1414.0,1394.0
648,2017/04/19,1408.0,1410.667,1398.0,13500,1420.0,1398.0
649,2017/04/20,1388.0,1401.864,1412.0,22000,1414.0,1388.0
650,2017/04/21,1414.0,1406.182,1406.0,11000,1418.0,1390.0
651,2017/04/24,1416.0,1418.211,1426.0,9500,1426.0,1412.0
652,2017/04/25,1414.0,1415.12,1404.0,25000,1422.0,1404.0
653,2017/04/26,1428.0,1421.034,1416.0,14500,1428.0,1414.0
654,2017/04/27,1424.0,1421.25,1414.0,20000,1428.0,1414.0
655,2017/04/28,1410.0,1416.311,1424.0,22500,1424.0,1408.0
656,2017/05/01,1446.0,1433.182,1426.0,33000,1448.0,1420.0
657,2017/05/02,1456.0,1452.381,1446.0,21000,1458.0,1446.0
658,2017/05/08,1490.0,1480.753,1466.0,38500,1498.0,1466.0
659,2017/05/09,1498.0,1488.659,1490.0,41000,1500.0,1472.0
660,2017/05/10,1500.0,1495.872,1498.0,23500,1504.0,1486.0
661,2017/05/11,1500.0,1498.526,1500.0,9500,1500.0,1494.0
662,2017/05/12,1508.0,1503.704,1500.0,13500,1508.0,1496.0
663,2017/05/15,1564.0,1557.8,1510.0,65000,1592.0,1510.0
664,2017/05/16,1618.0,1596.191,1564.0,110000,1622.0,1562.0
665,2017/05/17,1628.0,1625.909,1620.0,55000,1638.0,1606.0
666,2017/05/18,1626.0,1608.025,1614.0,40000,1626.0,1596.0
667,2017/05/19,1616.0,1614.816,1624.0,49000,1624.0,1606.0
668,2017/05/22,1616.0,1617.308,1608.0,26000,1626.0,1608.0
669,2017/05/23,1626.0,1628.575,1624.0,36500,1636.0,1620.0
670,2017/05/24,1662.0,1644.309,1628.0,48500,1676.0,1628.0
671,2017/05/25,1662.0,1657.778,1666.0,22500,1666.0,1648.0
672,2017/05/26,1648.0,1649.6,1652.0,30000,1662.0,1636.0
673,2017/05/29,1652.0,1650.943,1648.0,26500,1666.0,1640.0
674,2017/05/30,1648.0,1641.702,1652.0,23500,1652.0,1636.0
675,2017/05/31,1624.0,1618.422,1632.0,54500,1638.0,1604.0
676,2017/06/01,1618.0,1617.289,1614.0,22500,1624.0,1612.0
677,2017/06/02,1618.0,1620.543,1618.0,40500,1628.0,1610.0
678,2017/06/05,1602.0,1605.875,1616.0,24000,1616.0,1600.0
679,2017/06/06,1600.0,1601.552,1602.0,33500,1610.0,1596.0
680,2017/06/07,1600.0,1603.612,1608.0,49000,1616.0,1598.0
681,2017/06/08,1602.0,1597.063,1602.0,55500,1606.0,1586.0
682,2017/06/09,1592.0,1597.719,1606.0,57000,1606.0,1586.0
683,2017/06/12,1568.0,1564.293,1578.0,37500,1578.0,1552.0
684,2017/06/13,1588.0,1590.081,1572.0,37000,1600.0,1558.0
685,2017/06/14,1572.0,1583.738,1588.0,30500,1596.0,1568.0
686,2017/06/15,1556.0,1561.571,1580.0,28000,1580.0,1554.0
687,2017/06/16,1528.0,1540.862,1558.0,61500,1564.0,1526.0
688,2017/06/19,1532.0,1532.366,1526.0,35500,1542.0,1524.0
689,2017/06/20,1554.0,1543.253,1532.0,37500,1556.0,1532.0
690,2017/06/21,1536.0,1542.389,1560.0,18000,1560.0,1536.0
691,2017/06/22,1542.0,1547.929,1550.0,14000,1558.0,1540.0
692,2017/06/23,1556.0,1558.429,1560.0,21000,1564.0,1554.0
693,2017/06/26,1560.0,1560.0,1560.0,5000,1562.0,1556.0
694,2017/06/27,1568.0,1561.744,1560.0,19500,1570.0,1552.0
695,2017/06/28,1558.0,1560.478,1558.0,23000,1570.0,1552.0
696,2017/06/29,1564.0,1569.333,1570.0,18000,1584.0,1560.0
697,2017/06/30,1560.0,1554.875,1564.0,16000,1564.0,1544.0
698,2017/07/03,1578.0,1576.159,1574.0,31500,1588.0,1564.0
699,2017/07/04,1578.0,1575.676,1582.0,18500,1582.0,1570.0
700,2017/07/05,1592.0,1588.829,1566.0,20500,1596.0,1566.0
701,2017/07/06,1602.0,1594.75,1594.0,16000,1602.0,1580.0
702,2017/07/07,1594.0,1594.483,1590.0,14500,1600.0,1590.0
703,2017/07/10,1598.0,1592.4,1586.0,12500,1600.0,1584.0
704,2017/07/11,1590.0,1592.118,1586.0,8500,1598.0,1586.0
705,2017/07/12,1594.0,1583.77,1582.0,30500,1596.0,1578.0
706,2017/07/13,1592.0,1587.891,1596.0,27500,1596.0,1580.0
707,2017/07/14,1586.0,1586.769,1584.0,6500,1592.0,1584.0
708,2017/07/18,1596.0,1588.533,1586.0,7500,1596.0,1582.0
709,2017/07/19,1592.0,1592.952,1596.0,10500,1600.0,1586.0
710,2017/07/20,1586.0,1589.818,1592.0,11000,1598.0,1582.0
711,2017/07/21,1594.0,1593.385,1594.0,6500,1594.0,1592.0
712,2017/07/24,1600.0,1596.829,1598.0,20500,1602.0,1590.0
713,2017/07/25,1598.0,1600.077,1600.0,13000,1610.0,1594.0
714,2017/07/26,1600.0,1597.769,1610.0,13000,1610.0,1590.0
715,2017/07/27,1592.0,1605.038,1600.0,26000,1616.0,1590.0
716,2017/07/28,1614.0,1599.963,1594.0,27000,1614.0,1592.0
717,2017/07/31,1606.0,1603.022,1630.0,158500,1680.0,1502.0
718,2017/08/01,1608.0,1606.024,1600.0,42500,1632.0,1574.0
719,2017/08/02,1594.0,1608.068,1608.0,29500,1618.0,1594.0
720,2017/08/03,1628.0,1620.182,1602.0,22000,1634.0,1602.0
721,2017/08/04,1618.0,1624.966,1638.0,14500,1640.0,1614.0
722,2017/08/07,1630.0,1635.355,1642.0,15500,1642.0,1628.0
723,2017/08/08,1636.0,1629.822,1630.0,22500,1636.0,1610.0
724,2017/08/09,1622.0,1627.821,1624.0,28000,1640.0,1620.0
725,2017/08/10,1626.0,1618.733,1626.0,15000,1636.0,1610.0
726,2017/08/14,1600.0,1599.213,1610.0,47000,1610.0,1576.0
727,2017/08/15,1594.0,1598.417,1600.0,12000,1602.0,1592.0
728,2017/08/16,1600.0,1599.429,1594.0,7000,1610.0,1594.0
729,2017/08/17,1596.0,1590.615,1596.0,13000,1598.0,1586.0
730,2017/08/18,1572.0,1576.789,1580.0,19000,1588.0,1564.0
731,2017/08/21,1602.0,1587.756,1572.0,20500,1604.0,1562.0
732,2017/08/22,1596.0,1598.313,1600.0,16000,1604.0,1586.0
733,2017/08/23,1598.0,1597.194,1592.0,33500,1606.0,1592.0
734,2017/08/24,1594.0,1590.933,1582.0,7500,1596.0,1582.0
735,2017/08/25,1584.0,1584.759,1594.0,14500,1594.0,1576.0
736,2017/08/28,1586.0,1584.538,1578.0,26000,1592.0,1576.0
737,2017/08/29,1578.0,1586.071,1576.0,14000,1592.0,1576.0
738,2017/08/30,1600.0,1596.6,1594.0,15000,1600.0,1590.0
739,2017/08/31,1590.0,1597.722,1602.0,18000,1610.0,1590.0
740,2017/09/01,1600.0,1596.667,1592.0,15000,1604.0,1590.0
741,2017/09/04,1578.0,1577.533,1580.0,15000,1582.0,1572.0
742,2017/09/05,1574.0,1574.545,1580.0,5500,1580.0,1570.0
743,2017/09/06,1568.0,1564.895,1554.0,19000,1574.0,1550.0
744,2017/09/07,1578.0,1575.4,1580.0,20000,1586.0,1548.0
745,2017/09/08,1574.0,1570.733,1562.0,30000,1580.0,1562.0
746,2017/09/11,1582.0,1579.0,1564.0,11000,1584.0,1564.0
747,2017/09/12,1584.0,1581.25,1582.0,16000,1584.0,1566.0
748,2017/09/13,1588.0,1589.31,1584.0,14500,1594.0,1584.0
749,2017/09/14,1576.0,1580.609,1588.0,11500,1588.0,1574.0
750,2017/09/15,1588.0,1586.118,1584.0,8500,1588.0,1580.0
751,2017/09/19,1610.0,1610.8,1588.0,37500,1630.0,1588.0
752,2017/09/20,1618.0,1609.25,1600.0,32000,1620.0,1600.0
753,2017/09/21,1610.0,1616.595,1626.0,18500,1626.0,1610.0
754,2017/09/22,1600.0,1609.813,1620.0,16000,1624.0,1598.0
755,2017/09/25,1614.0,1617.833,1606.0,24000,1628.0,1606.0
756,2017/09/26,1696.0,1715.539,1704.0,184500,1760.0,1692.0
757,2017/09/27,1708.0,1715.613,1694.0,47800,1738.0,1691.0
758,2017/09/28,1697.0,1694.889,1700.0,33200,1703.0,1688.0
759,2017/09/29,1704.0,1705.708,1693.0,32900,1716.0,1690.0
760,2017/10/02,1714.0,1714.364,1711.0,23100,1723.0,1702.0
761,2017/10/03,1709.0,1714.449,1722.0,43400,1726.0,1700.0
762,2017/10/04,1679.0,1692.632,1706.0,61700,1710.0,1675.0
763,2017/10/05,1706.0,1695.959,1686.0,62700,1710.0,1671.0
764,2017/10/06,1705.0,1705.003,1701.0,34200,1715.0,1697.0
765,2017/10/10,1719.0,1710.155,1710.0,77200,1720.0,1692.0
766,2017/10/11,1704.0,1713.387,1719.0,19400,1723.0,1703.0
767,2017/10/12,1717.0,1710.031,1705.0,29200,1720.0,1698.0
768,2017/10/13,1725.0,1718.545,1702.0,36900,1728.0,1702.0
769,2017/10/16,1739.0,1744.025,1730.0,44400,1763.0,1730.0
770,2017/10/17,1732.0,1734.947,1750.0,41200,1750.0,1722.0
771,2017/10/18,1740.0,1726.268,1726.0,32800,1742.0,1714.0
772,2017/10/19,1702.0,1713.636,1742.0,38500,1746.0,1702.0
773,2017/10/20,1721.0,1714.344,1714.0,27300,1725.0,1702.0
774,2017/10/23,1742.0,1739.982,1732.0,34100,1751.0,1728.0
775,2017/10/24,1745.0,1739.34,1730.0,25300,1746.0,1722.0
776,2017/10/25,1731.0,1737.856,1760.0,37400,1760.0,1719.0
777,2017/10/26,1728.0,1731.562,1738.0,26500,1738.0,1725.0
778,2017/10/27,1741.0,1736.793,1727.0,24200,1745.0,1725.0
779,2017/10/30,1781.0,1772.663,1756.0,103200,1798.0,1736.0
780,2017/10/31,1756.0,1775.331,1788.0,71700,1811.0,1753.0
781,2017/11/01,1748.0,1759.015,1787.0,25900,1787.0,1744.0
782,2017/11/02,1750.0,1744.831,1748.0,26100,1752.0,1733.0
783,2017/11/06,1745.0,1746.014,1762.0,21800,1768.0,1725.0
784,2017/11/07,1749.0,1747.974,1751.0,37800,1752.0,1739.0
785,2017/11/08,1751.0,1743.276,1744.0,25700,1755.0,1728.0
786,2017/11/09,1733.0,1740.564,1751.0,28900,1754.0,1716.0
787,2017/11/10,1729.0,1725.005,1727.0,22400,1738.0,1703.0
788,2017/11/13,1720.0,1720.156,1722.0,10900,1725.0,1716.0
789,2017/11/14,1721.0,1722.346,1727.0,21400,1735.0,1717.0
790,2017/11/15,1698.0,1707.395,1721.0,31900,1724.0,1690.0
791,2017/11/16,1690.0,1693.466,1696.0,16100,1708.0,1690.0
792,2017/11/17,1673.0,1683.066,1700.0,18200,1703.0,1670.0
793,2017/11/20,1711.0,1695.337,1677.0,34400,1715.0,1663.0
794,2017/11/21,1704.0,1706.309,1711.0,15200,1717.0,1696.0
795,2017/11/22,1728.0,1718.023,1707.0,39600,1745.0,1703.0
796,2017/11/24,1741.0,1735.156,1740.0,28800,1751.0,1723.0
797,2017/11/27,1741.0,1742.186,1760.0,18800,1760.0,1730.0
798,2017/11/28,1727.0,1729.234,1749.0,4700,1749.0,1722.0
799,2017/11/29,1733.0,1735.09,1739.0,25500,1743.0,1718.0
800,2017/11/30,1737.0,1733.501,1733.0,35900,1744.0,1715.0
801,2017/12/01,1749.0,1742.751,1737.0,35700,1750.0,1726.0
802,2017/12/04,1746.0,1750.831,1749.0,35000,1758.0,1743.0
803,2017/12/05,1740.0,1742.544,1746.0,6800,1749.0,1739.0
804,2017/12/06,1736.0,1733.168,1739.0,20900,1747.0,1720.0
805,2017/12/07,1744.0,1741.627,1740.0,22500,1749.0,1736.0
806,2017/12/08,1747.0,1740.256,1740.0,43800,1748.0,1735.0
807,2017/12/11,1742.0,1739.233,1743.0,25800,1743.0,1730.0
808,2017/12/12,1734.0,1733.713,1742.0,39000,1742.0,1725.0
809,2017/12/13,1725.0,1724.154,1741.0,28500,1741.0,1715.0
810,2017/12/14,1749.0,1744.359,1736.0,21200,1750.0,1735.0
811,2017/12/15,1777.0,1763.791,1750.0,40600,1777.0,1739.0
812,2017/12/18,1820.0,1807.353,1800.0,51300,1827.0,1783.0
813,2017/12/19,1803.0,1804.537,1818.0,29600,1820.0,1792.0
814,2017/12/20,1804.0,1807.06,1814.0,21800,1814.0,1796.0
815,2017/12/21,1818.0,1814.56,1816.0,17500,1818.0,1805.0
816,2017/12/22,1844.0,1838.554,1818.0,35900,1851.0,1818.0
817,2017/12/25,1818.0,1826.857,1841.0,21600,1847.0,1813.0
818,2017/12/26,1804.0,1807.197,1821.0,11700,1829.0,1801.0
819,2017/12/27,1844.0,1828.023,1797.0,17600,1846.0,1797.0
820,2017/12/28,1833.0,1840.022,1853.0,13700,1853.0,1829.0
821,2017/12/29,1825.0,1822.542,1833.0,11800,1840.0,1809.0
822,2018/01/04,1834.0,1835.473,1857.0,39500,1865.0,1812.0
823,2018/01/05,1844.0,1840.374,1830.0,10700,1846.0,1830.0
824,2018/01/09,1839.0,1839.134,1846.0,13400,1850.0,1825.0
825,2018/01/10,1853.0,1852.094,1846.0,12800,1866.0,1846.0
826,2018/01/11,1895.0,1880.457,1855.0,26700,1900.0,1852.0
827,2018/01/12,1903.0,1896.848,1888.0,32900,1914.0,1880.0
828,2018/01/15,1913.0,1922.641,1915.0,19500,1946.0,1910.0
829,2018/01/16,1922.0,1918.611,1921.0,14400,1937.0,1907.0
830,2018/01/17,1927.0,1924.708,1919.0,33600,1939.0,1905.0
831,2018/01/18,1926.0,1932.761,1929.0,41400,1949.0,1919.0
832,2018/01/19,1932.0,1936.236,1949.0,23700,1949.0,1921.0
833,2018/01/22,1941.0,1935.656,1932.0,46200,1947.0,1916.0
834,2018/01/23,1934.0,1935.422,1949.0,48400,1949.0,1925.0
835,2018/01/24,1940.0,1944.929,1934.0,49200,1955.0,1925.0
836,2018/01/25,1925.0,1926.456,1944.0,36200,1944.0,1920.0
837,2018/01/26,1884.0,1897.793,1926.0,35700,1926.0,1884.0
838,2018/01/29,1878.0,1885.557,1885.0,18300,1897.0,1876.0
839,2018/01/30,1844.0,1855.701,1898.0,29800,1899.0,1839.0
840,2018/01/31,1920.0,1908.567,1861.0,217000,1949.0,1850.0
841,2018/02/01,1912.0,1916.305,1910.0,39700,1942.0,1900.0
842,2018/02/02,1933.0,1915.678,1900.0,28600,1936.0,1893.0
843,2018/02/05,1881.0,1883.965,1891.0,34000,1898.0,1871.0
844,2018/02/06,1780.0,1766.88,1760.0,74400,1791.0,1747.0
845,2018/02/07,1810.0,1836.277,1825.0,47000,1862.0,1810.0
846,2018/02/08,1816.0,1825.318,1820.0,34900,1842.0,1814.0
847,2018/02/09,1816.0,1806.396,1779.0,49300,1825.0,1768.0
848,2018/02/13,1821.0,1826.733,1826.0,42700,1861.0,1803.0
849,2018/02/14,1796.0,1800.479,1819.0,18600,1819.0,1792.0
850,2018/02/15,1799.0,1808.164,1797.0,22000,1826.0,1793.0
851,2018/02/16,1812.0,1819.069,1799.0,26200,1838.0,1799.0
852,2018/02/19,1837.0,1832.462,1832.0,10400,1838.0,1822.0
853,2018/02/20,1849.0,1842.829,1837.0,24000,1853.0,1829.0
854,2018/02/21,1861.0,1864.015,1850.0,27500,1881.0,1850.0
855,2018/02/22,1850.0,1848.386,1861.0,11400,1861.0,1830.0
856,2018/02/23,1862.0,1855.894,1868.0,17900,1868.0,1790.0
857,2018/02/26,1868.0,1866.521,1870.0,11700,1872.0,1859.0
858,2018/02/27,1866.0,1870.076,1872.0,27700,1882.0,1862.0
859,2018/02/28,1862.0,1862.121,1861.0,41500,1869.0,1825.0
860,2018/03/01,1841.0,1844.806,1857.0,16500,1857.0,1822.0
861,2018/03/02,1797.0,1797.491,1794.0,16100,1807.0,1788.0
862,2018/03/05,1773.0,1774.784,1787.0,19400,1795.0,1760.0
863,2018/03/06,1787.0,1789.011,1780.0,9400,1806.0,1780.0
864,2018/03/07,1761.0,1765.177,1777.0,19200,1778.0,1753.0
865,2018/03/08,1759.0,1762.855,1764.0,8300,1775.0,1755.0
866,2018/03/09,1794.0,1807.686,1819.0,39500,1819.0,1784.0
867,2018/03/12,1817.0,1808.576,1797.0,17200,1820.0,1797.0
868,2018/03/13,1851.0,1829.621,1803.0,16100,1855.0,1803.0
869,2018/03/14,1845.0,1843.896,1840.0,14400,1864.0,1834.0
870,2018/03/15,1847.0,1840.587,1857.0,15000,1857.0,1822.0
871,2018/03/16,1865.0,1855.268,1860.0,28700,1871.0,1839.0
872,2018/03/19,1834.0,1840.77,1865.0,19600,1865.0,1827.0
873,2018/03/20,1823.0,1823.298,1834.0,17100,1834.0,1810.0
874,2018/03/22,1825.0,1821.806,1826.0,14400,1831.0,1810.0
875,2018/03/23,1779.0,1792.574,1825.0,22300,1825.0,1772.0
876,2018/03/26,1766.0,1761.816,1781.0,17400,1781.0,1738.0
877,2018/03/27,1806.0,1800.802,1770.0,26800,1810.0,1770.0
878,2018/03/28,1756.0,1754.387,1755.0,29700,1763.0,1740.0
879,2018/03/29,1756.0,1751.686,1766.0,22600,1766.0,1738.0
880,2018/03/30,1749.0,1759.511,1783.0,9000,1783.0,1749.0
881,2018/04/02,1788.0,1780.762,1765.0,12600,1796.0,1765.0
882,2018/04/03,1760.0,1757.888,1768.0,18800,1768.0,1739.0
883,2018/04/04,1804.0,1795.633,1766.0,18800,1813.0,1763.0
884,2018/04/05,1805.0,1790.545,1804.0,20000,1812.0,1733.0
885,2018/04/06,1778.0,1786.196,1796.0,13300,1800.0,1772.0
886,2018/04/09,1754.0,1754.033,1768.0,9100,1768.0,1744.0
887,2018/04/10,1760.0,1760.606,1750.0,28700,1779.0,1740.0
888,2018/04/11,1763.0,1763.649,1778.0,20500,1778.0,1750.0
889,2018/04/12,1759.0,1762.748,1768.0,10300,1784.0,1757.0
890,2018/04/13,1766.0,1765.66,1759.0,14700,1771.0,1757.0
891,2018/04/16,1789.0,1782.699,1766.0,11300,1789.0,1762.0
892,2018/04/17,1758.0,1765.945,1775.0,23600,1792.0,1742.0
893,2018/04/18,1780.0,1775.105,1761.0,5700,1780.0,1761.0
894,2018/04/19,1770.0,1770.615,1778.0,14300,1778.0,1766.0
895,2018/04/20,1763.0,1765.382,1767.0,22800,1784.0,1756.0
896,2018/04/23,1783.0,1777.871,1763.0,3100,1783.0,1763.0
897,2018/04/24,1831.0,1816.203,1789.0,19700,1831.0,1788.0
898,2018/04/25,1852.0,1839.071,1820.0,15600,1857.0,1820.0
899,2018/04/26,1860.0,1851.048,1855.0,14500,1860.0,1838.0
900,2018/04/27,1835.0,1828.016,1860.0,12500,1860.0,1806.0
901,2018/05/01,1804.0,1803.039,1828.0,10400,1828.0,1792.0
902,2018/05/02,1820.0,1817.105,1837.0,17100,1837.0,1791.0
903,2018/05/07,1832.0,1824.737,1820.0,9900,1833.0,1805.0
904,2018/05/08,1801.0,1802.224,1831.0,25500,1839.0,1788.0
905,2018/05/09,1796.0,1805.087,1860.0,19500,1860.0,1781.0
906,2018/05/10,1807.0,1801.84,1796.0,7500,1808.0,1790.0
907,2018/05/11,1804.0,1795.028,1797.0,17900,1805.0,1785.0
908,2018/05/14,1806.0,1805.063,1818.0,19100,1818.0,1793.0
909,2018/05/15,1840.0,1876.406,1826.0,87500,1960.0,1824.0
910,2018/05/16,1842.0,1840.238,1845.0,39100,1855.0,1821.0
911,2018/05/17,1852.0,1842.857,1842.0,30700,1855.0,1827.0
912,2018/05/18,1860.0,1855.06,1860.0,15100,1861.0,1834.0
913,2018/05/21,1842.0,1845.733,1870.0,12000,1870.0,1833.0
914,2018/05/22,1840.0,1844.25,1850.0,26000,1868.0,1834.0
915,2018/05/23,1838.0,1833.015,1840.0,13700,1840.0,1824.0
916,2018/05/24,1840.0,1831.317,1844.0,18000,1844.0,1818.0
917,2018/05/25,1837.0,1836.839,1844.0,8700,1845.0,1830.0
918,2018/05/28,1833.0,1834.429,1837.0,5600,1842.0,1829.0
919,2018/05/29,1846.0,1839.652,1838.0,20700,1846.0,1830.0
920,2018/05/30,1828.0,1826.023,1822.0,13200,1833.0,1820.0
921,2018/05/31,1821.0,1823.202,1829.0,13400,1834.0,1817.0
922,2018/06/01,1829.0,1826.022,1819.0,13400,1844.0,1805.0
923,2018/06/04,1876.0,1863.224,1829.0,16100,1878.0,1829.0
924,2018/06/05,1826.0,1822.295,1863.0,32900,1863.0,1801.0
925,2018/06/06,1826.0,1823.534,1826.0,13100,1833.0,1813.0
926,2018/06/07,1845.0,1839.264,1826.0,29500,1845.0,1826.0
927,2018/06/08,1868.0,1867.98,1875.0,50800,1875.0,1849.0
928,2018/06/11,1862.0,1863.317,1873.0,35700,1873.0,1854.0
929,2018/06/12,1860.0,1858.617,1862.0,27400,1865.0,1855.0
930,2018/06/13,1879.0,1875.811,1860.0,17500,1885.0,1859.0
931,2018/06/14,1869.0,1863.352,1879.0,14200,1879.0,1850.0
932,2018/06/15,1853.0,1859.717,1869.0,34600,1884.0,1846.0
933,2018/06/18,1828.0,1838.041,1865.0,22100,1865.0,1824.0
934,2018/06/19,1823.0,1821.937,1828.0,33500,1845.0,1808.0
935,2018/06/20,1834.0,1828.489,1837.0,43400,1837.0,1805.0
936,2018/06/21,1841.0,1840.757,1833.0,20200,1859.0,1833.0
937,2018/06/22,1897.0,1879.686,1828.0,47400,1897.0,1817.0
938,2018/06/25,1840.0,1844.158,1889.0,25900,1889.0,1825.0
939,2018/06/26,1826.0,1823.069,1850.0,11600,1850.0,1808.0
940,2018/06/27,1827.0,1820.192,1826.0,10400,1835.0,1807.0
941,2018/06/28,1821.0,1816.174,1821.0,14400,1824.0,1802.0
942,2018/06/29,1807.0,1804.907,1821.0,15100,1821.0,1793.0
943,2018/07/02,1798.0,1806.369,1819.0,26000,1819.0,1794.0
944,2018/07/03,1745.0,1753.301,1799.0,31200,1804.0,1727.0
945,2018/07/04,1749.0,1746.132,1740.0,10600,1759.0,1737.0
946,2018/07/05,1734.0,1737.231,1744.0,12100,1744.0,1733.0
947,2018/07/06,1736.0,1733.396,1734.0,22000,1755.0,1721.0
948,2018/07/09,1791.0,1771.897,1750.0,30000,1807.0,1742.0
949,2018/07/10,1787.0,1797.882,1791.0,23700,1813.0,1785.0
950,2018/07/11,1747.0,1767.581,1787.0,47200,1794.0,1746.0
951,2018/07/12,1730.0,1737.008,1760.0,13300,1760.0,1729.0
952,2018/07/13,1706.0,1712.922,1726.0,30800,1732.0,1705.0
953,2018/07/17,1719.0,1719.49,1712.0,48400,1726.0,1707.0
954,2018/07/18,1726.0,1727.243,1721.0,36600,1730.0,1721.0
955,2018/07/19,1735.0,1730.81,1726.0,12600,1735.0,1720.0
956,2018/07/20,1718.0,1722.628,1735.0,26600,1739.0,1707.0
957,2018/07/23,1740.0,1737.745,1718.0,25100,1749.0,1710.0
958,2018/07/24,1734.0,1739.329,1740.0,16100,1756.0,1731.0
959,2018/07/25,1719.0,1719.682,1730.0,26700,1730.0,1711.0
960,2018/07/26,1733.0,1726.347,1720.0,14700,1735.0,1718.0
961,2018/07/27,1744.0,1738.391,1733.0,17400,1744.0,1730.0
962,2018/07/30,1745.0,1735.972,1740.0,21700,1745.0,1720.0
963,2018/07/31,1763.0,1740.637,1745.0,58100,1833.0,1691.0
964,2018/08/01,1738.0,1735.592,1764.0,33600,1764.0,1722.0
965,2018/08/02,1707.0,1710.877,1727.0,31600,1730.0,1696.0
966,2018/08/03,1693.0,1695.64,1700.0,21400,1701.0,1690.0
967,2018/08/06,1668.0,1676.517,1693.0,43300,1695.0,1663.0
968,2018/08/07,1664.0,1664.511,1669.0,27000,1683.0,1656.0
969,2018/08/08,1668.0,1669.075,1664.0,20100,1679.0,1660.0
970,2018/08/09,1672.0,1665.273,1660.0,33700,1672.0,1655.0
971,2018/08/10,1659.0,1660.741,1665.0,28600,1672.0,1654.0
972,2018/08/13,1628.0,1630.085,1652.0,40000,1654.0,1612.0
973,2018/08/14,1641.0,1628.868,1629.0,22000,1641.0,1623.0
974,2018/08/15,1607.0,1615.155,1630.0,20700,1635.0,1601.0
975,2018/08/16,1578.0,1581.523,1601.0,28500,1601.0,1571.0
976,2018/08/17,1594.0,1585.132,1580.0,19700,1594.0,1576.0
977,2018/08/20,1562.0,1572.388,1600.0,27300,1600.0,1555.0
978,2018/08/21,1560.0,1559.758,1570.0,24400,1570.0,1542.0
979,2018/08/22,1591.0,1574.709,1550.0,20300,1594.0,1550.0
980,2018/08/23,1609.0,1600.27,1589.0,17800,1610.0,1588.0
981,2018/08/24,1616.0,1613.912,1615.0,14700,1620.0,1602.0
982,2018/08/27,1625.0,1621.604,1612.0,21700,1634.0,1610.0
983,2018/08/28,1629.0,1628.942,1627.0,17100,1639.0,1625.0
984,2018/08/29,1639.0,1636.055,1629.0,16300,1646.0,1621.0
985,2018/08/30,1650.0,1643.821,1636.0,20100,1655.0,1633.0
986,2018/08/31,1662.0,1652.651,1626.0,21500,1668.0,1626.0
987,2018/09/03,1617.0,1636.437,1675.0,38000,1675.0,1612.0
988,2018/09/04,1608.0,1606.375,1612.0,13600,1614.0,1598.0
989,2018/09/05,1628.0,1625.747,1615.0,19400,1641.0,1609.0
990,2018/09/06,1640.0,1633.327,1626.0,20200,1645.0,1618.0
991,2018/09/07,1628.0,1621.763,1644.0,27800,1644.0,1612.0
992,2018/09/10,1627.0,1628.28,1627.0,12500,1633.0,1614.0
993,2018/09/11,1615.0,1620.398,1637.0,23900,1637.0,1613.0
994,2018/09/12,1571.0,1582.499,1630.0,37900,1630.0,1560.0
995,2018/09/13,1607.0,1603.701,1586.0,14700,1615.0,1572.0
996,2018/09/14,1649.0,1635.765,1614.0,40000,1656.0,1614.0
997,2018/09/18,1661.0,1661.02,1648.0,15200,1667.0,1648.0
998,2018/09/19,1690.0,1686.591,1676.0,34200,1697.0,1674.0
999,2018/09/20,1698.0,1693.483,1701.0,33100,1701.0,1685.0
1000,2018/09/21,1738.0,1731.986,1701.0,28500,1743.0,1698.0
1001,2018/09/25,1770.0,1757.65,1742.0,43700,1770.0,1742.0
1002,2018/09/26,1753.0,1744.74,1738.0,21500,1757.0,1734.0
1003,2018/09/27,1712.0,1723.538,1722.0,25300,1741.0,1711.0
1004,2018/09/28,1721.0,1721.816,1713.0,11400,1729.0,1713.0
1005,2018/10/01,1710.0,1709.695,1718.0,20000,1718.0,1705.0
1006,2018/10/02,1708.0,1720.419,1711.0,26000,1750.0,1702.0
1007,2018/10/03,1667.0,1687.576,1704.0,28800,1725.0,1667.0
1008,2018/10/04,1689.0,1692.603,1684.0,13600,1703.0,1682.0
1009,2018/10/05,1663.0,1669.693,1686.0,25400,1686.0,1658.0
1010,2018/10/09,1649.0,1655.179,1668.0,30800,1680.0,1637.0
1011,2018/10/10,1641.0,1648.326,1651.0,25500,1660.0,1631.0
1012,2018/10/11,1580.0,1588.573,1605.0,44000,1605.0,1574.0
1013,2018/10/12,1576.0,1583.587,1585.0,22500,1600.0,1573.0
1014,2018/10/15,1556.0,1563.193,1565.0,27000,1577.0,1555.0
1015,2018/10/16,1565.0,1567.209,1551.0,19600,1581.0,1551.0
1016,2018/10/17,1595.0,1592.427,1571.0,26700,1638.0,1571.0
1017,2018/10/18,1592.0,1594.554,1597.0,22200,1611.0,1581.0
1018,2018/10/19,1595.0,1585.33,1577.0,26100,1601.0,1567.0
1019,2018/10/22,1596.0,1588.216,1575.0,17600,1603.0,1564.0
1020,2018/10/23,1571.0,1572.71,1573.0,23800,1585.0,1561.0
1021,2018/10/24,1581.0,1579.155,1571.0,23300,1602.0,1557.0
1022,2018/10/25,1538.0,1548.507,1556.0,30800,1569.0,1534.0
1023,2018/10/26,1530.0,1533.381,1545.0,38900,1550.0,1517.0
1024,2018/10/29,1513.0,1523.322,1549.0,28600,1557.0,1511.0
1025,2018/10/30,1500.0,1506.565,1510.0,112600,1540.0,1500.0
1026,2018/10/31,1571.0,1555.755,1516.0,29800,1572.0,1516.0
1027,2018/11/01,1564.0,1571.411,1568.0,31900,1590.0,1555.0
1028,2018/11/02,1586.0,1574.931,1564.0,30400,1601.0,1548.0
1029,2018/11/05,1558.0,1560.605,1574.0,12400,1574.0,1547.0
1030,2018/11/06,1571.0,1569.736,1562.0,18200,1577.0,1562.0
1031,2018/11/07,1565.0,1576.333,1585.0,16200,1592.0,1557.0
1032,2018/11/08,1600.0,1597.162,1582.0,10500,1609.0,1582.0
1033,2018/11/09,1607.0,1602.907,1600.0,14000,1612.0,1594.0
1034,2018/11/12,1605.0,1605.926,1605.0,10800,1609.0,1592.0
1035,2018/11/13,1571.0,1574.068,1588.0,24900,1588.0,1560.0
1036,2018/11/14,1567.0,1570.434,1571.0,19600,1584.0,1567.0
1037,2018/11/15,1577.0,1565.982,1567.0,22500,1582.0,1529.0
1038,2018/11/16,1558.0,1568.794,1577.0,16500,1580.0,1557.0
1039,2018/11/19,1565.0,1564.808,1562.0,7800,1572.0,1554.0
1040,2018/11/20,1565.0,1569.861,1575.0,18000,1580.0,1550.0
1041,2018/11/21,1555.0,1555.309,1546.0,20700,1571.0,1530.0
1042,2018/11/22,1573.0,1567.74,1571.0,10400,1582.0,1555.0
1043,2018/11/26,1563.0,1564.863,1558.0,8000,1574.0,1558.0
1044,2018/11/27,1584.0,1579.671,1566.0,14900,1592.0,1563.0
1045,2018/11/28,1598.0,1597.041,1584.0,14700,1608.0,1584.0
1046,2018/11/29,1608.0,1607.914,1618.0,14000,1619.0,1597.0
1047,2018/11/30,1600.0,1605.531,1608.0,9600,1610.0,1590.0
1048,2018/12/03,1640.0,1630.096,1610.0,17800,1640.0,1610.0
1049,2018/12/04,1600.0,1609.839,1639.0,19200,1640.0,1593.0
1050,2018/12/05,1590.0,1590.733,1585.0,24000,1606.0,1573.0
1051,2018/12/06,1580.0,1586.171,1590.0,24500,1600.0,1575.0
1052,2018/12/07,1587.0,1582.061,1564.0,29500,1598.0,1564.0
1053,2018/12/10,1560.0,1586.109,1627.0,37700,1627.0,1540.0
1054,2018/12/11,1517.0,1530.346,1560.0,18800,1561.0,1513.0
1055,2018/12/12,1528.0,1532.679,1533.0,16800,1544.0,1525.0
1056,2018/12/13,1539.0,1540.77,1539.0,19600,1551.0,1534.0
1057,2018/12/14,1520.0,1534.506,1539.0,25500,1543.0,1520.0
1058,2018/12/17,1500.0,1503.247,1526.0,26300,1526.0,1491.0
1059,2018/12/18,1458.0,1466.26,1490.0,15400,1490.0,1450.0
1060,2018/12/19,1457.0,1454.96,1461.0,27300,1462.0,1440.0
1061,2018/12/20,1398.0,1426.95,1453.0,47700,1456.0,1396.0
1062,2018/12/21,1337.0,1342.895,1406.0,44600,1406.0,1312.0
1063,2018/12/25,1285.0,1303.955,1320.0,40100,1334.0,1280.0
1064,2018/12/26,1298.0,1298.508,1291.0,24400,1319.0,1280.0
1065,2018/12/27,1397.0,1381.887,1352.0,19400,1397.0,1349.0
1066,2018/12/28,1412.0,1405.549,1400.0,15300,1421.0,1392.0
1067,2019/01/04,1403.0,1397.919,1397.0,24600,1411.0,1380.0
1068,2019/01/07,1427.0,1428.811,1430.0,42800,1440.0,1409.0
1069,2019/01/08,1411.0,1416.151,1413.0,39200,1420.0,1399.0
1070,2019/01/09,1414.0,1418.182,1412.0,27000,1425.0,1408.0
1071,2019/01/10,1405.0,1402.849,1408.0,32500,1410.0,1392.0
1072,2019/01/11,1398.0,1400.021,1405.0,9600,1405.0,1395.0
1073,2019/01/15,1391.0,1387.392,1385.0,25500,1397.0,1379.0
1074,2019/01/16,1364.0,1374.032,1390.0,21900,1395.0,1364.0
1075,2019/01/17,1381.0,1377.297,1371.0,26600,1389.0,1368.0
1076,2019/01/18,1407.0,1402.524,1388.0,38000,1418.0,1382.0
1077,2019/01/21,1422.0,1418.564,1407.0,16500,1430.0,1401.0
1078,2019/01/22,1420.0,1421.171,1422.0,11700,1428.0,1415.0
1079,2019/01/23,1385.0,1397.577,1405.0,18900,1411.0,1384.0
1080,2019/01/24,1392.0,1394.658,1391.0,11400,1404.0,1385.0
1081,2019/01/25,1406.0,1408.938,1407.0,11300,1421.0,1400.0
1082,2019/01/28,1370.0,1378.959,1398.0,12300,1398.0,1370.0
1083,2019/01/29,1364.0,1362.723,1370.0,22000,1371.0,1355.0
1084,2019/01/30,1350.0,1357.442,1378.0,31200,1387.0,1349.0
1085,2019/01/31,1366.0,1368.532,1365.0,29300,1383.0,1357.0
1086,2019/02/01,1334.0,1342.921,1352.0,27700,1360.0,1334.0
1087,2019/02/04,1368.0,1356.306,1334.0,28800,1368.0,1331.0
1088,2019/02/05,1399.0,1392.405,1369.0,21000,1408.0,1369.0
1089,2019/02/06,1386.0,1386.104,1400.0,21200,1407.0,1375.0
1090,2019/02/07,1388.0,1377.901,1380.0,14200,1389.0,1364.0
1091,2019/02/08,1363.0,1366.362,1371.0,22400,1376.0,1358.0
1092,2019/02/12,1378.0,1377.838,1365.0,27700,1386.0,1365.0
1093,2019/02/13,1413.0,1393.437,1380.0,40700,1414.0,1369.0
1094,2019/02/14,1413.0,1414.393,1413.0,32300,1426.0,1396.0
1095,2019/02/15,1408.0,1405.558,1409.0,16300,1414.0,1393.0
1096,2019/02/18,1455.0,1447.858,1433.0,19000,1456.0,1433.0
1097,2019/02/19,1491.0,1480.239,1454.0,29300,1494.0,1451.0
1098,2019/02/20,1481.0,1481.332,1490.0,20500,1495.0,1466.0
1099,2019/02/21,1475.0,1470.54,1481.0,21500,1481.0,1461.0
1100,2019/02/22,1478.0,1473.255,1470.0,24300,1481.0,1452.0
1101,2019/02/25,1479.0,1478.712,1490.0,10400,1490.0,1467.0
1102,2019/02/26,1476.0,1479.161,1479.0,42200,1500.0,1454.0
1103,2019/02/27,1490.0,1484.312,1489.0,29800,1497.0,1469.0
1104,2019/02/28,1478.0,1481.479,1491.0,30900,1491.0,1463.0
1105,2019/03/01,1502.0,1495.444,1479.0,20500,1507.0,1477.0
1106,2019/03/04,1486.0,1486.633,1488.0,39200,1506.0,1476.0
1107,2019/03/05,1503.0,1497.0,1490.0,21400,1534.0,1471.0
1108,2019/03/06,1519.0,1520.289,1500.0,30500,1536.0,1494.0
1109,2019/03/07,1528.0,1527.214,1530.0,43500,1540.0,1513.0
1110,2019/03/08,1468.0,1486.844,1505.0,30700,1506.0,1467.0
1111,2019/03/11,1466.0,1466.489,1470.0,23500,1477.0,1452.0
1112,2019/03/12,1515.0,1506.51,1481.0,30600,1525.0,1473.0
1113,2019/03/13,1485.0,1489.374,1499.0,10700,1507.0,1482.0
1114,2019/03/14,1465.0,1468.674,1497.0,13500,1497.0,1459.0
1115,2019/03/15,1493.0,1488.073,1463.0,20600,1496.0,1463.0
1116,2019/03/18,1548.0,1536.762,1510.0,29400,1548.0,1510.0
1117,2019/03/19,1515.0,1518.252,1537.0,17100,1540.0,1503.0
1118,2019/03/20,1519.0,1518.448,1519.0,20100,1533.0,1503.0
1119,2019/03/22,1534.0,1521.177,1519.0,12400,1535.0,1506.0
1120,2019/03/25,1485.0,1491.762,1529.0,21000,1529.0,1477.0
1121,2019/03/26,1563.0,1549.652,1486.0,36500,1563.0,1484.0
1122,2019/03/27,1541.0,1532.154,1521.0,20200,1545.0,1509.0
1123,2019/03/28,1486.0,1490.067,1519.0,20900,1519.0,1480.0
1124,2019/03/29,1468.0,1470.485,1488.0,9900,1499.0,1452.0
1125,2019/04/01,1531.0,1521.646,1469.0,24600,1536.0,1469.0
1126,2019/04/02,1523.0,1533.836,1531.0,16500,1557.0,1523.0
1127,2019/04/03,1534.0,1530.119,1521.0,10900,1538.0,1507.0
1128,2019/04/04,1515.0,1524.342,1528.0,31300,1533.0,1502.0
1129,2019/04/05,1551.0,1543.652,1524.0,6900,1551.0,1524.0
1130,2019/04/08,1517.0,1521.371,1544.0,6200,1544.0,1515.0
1131,2019/04/09,1506.0,1505.116,1511.0,8600,1514.0,1494.0
1132,2019/04/10,1493.0,1490.544,1493.0,4600,1503.0,1477.0
1133,2019/04/11,1496.0,1490.328,1489.0,6700,1501.0,1484.0
1134,2019/04/12,1494.0,1498.75,1496.0,7200,1510.0,1489.0
1135,2019/04/15,1535.0,1529.372,1506.0,19600,1540.0,1505.0
1136,2019/04/16,1517.0,1518.444,1537.0,12400,1537.0,1500.0
1137,2019/04/17,1530.0,1511.466,1511.0,23200,1532.0,1469.0
1138,2019/04/18,1509.0,1511.738,1536.0,12200,1537.0,1497.0
1139,2019/04/19,1502.0,1511.48,1529.0,12500,1531.0,1486.0
1140,2019/04/22,1512.0,1509.377,1504.0,5300,1513.0,1497.0
1141,2019/04/23,1518.0,1514.117,1511.0,7700,1522.0,1504.0
1142,2019/04/24,1499.0,1502.898,1512.0,9800,1521.0,1494.0
1143,2019/04/25,1532.0,1524.204,1515.0,16700,1536.0,1515.0
1144,2019/04/26,1524.0,1513.193,1512.0,53000,1550.0,1472.0
1145,2019/05/07,1519.0,1521.445,1528.0,13700,1543.0,1500.0
1146,2019/05/08,1512.0,1498.938,1497.0,30400,1521.0,1476.0
1147,2019/05/09,1513.0,1518.049,1492.0,51200,1562.0,1492.0
1148,2019/05/10,1530.0,1539.992,1529.0,38600,1575.0,1519.0
1149,2019/05/13,1535.0,1546.389,1496.0,31400,1576.0,1495.0
1150,2019/05/14,1532.0,1521.257,1482.0,15200,1540.0,1479.0
1151,2019/05/15,1523.0,1524.914,1527.0,22100,1543.0,1513.0
1152,2019/05/16,1523.0,1505.311,1516.0,25700,1524.0,1476.0
1153,2019/05/17,1531.0,1531.03,1527.0,19800,1544.0,1522.0
1154,2019/05/20,1525.0,1527.894,1537.0,13200,1537.0,1516.0
1155,2019/05/21,1515.0,1521.843,1524.0,15300,1533.0,1510.0
1156,2019/05/22,1521.0,1518.986,1523.0,14600,1531.0,1495.0
1157,2019/05/23,1535.0,1534.0,1535.0,34500,1544.0,1525.0
1158,2019/05/24,1535.0,1531.677,1526.0,35300,1544.0,1513.0
1159,2019/05/27,1558.0,1551.099,1539.0,15200,1562.0,1535.0
1160,2019/05/28,1555.0,1553.426,1542.0,15500,1570.0,1535.0
1161,2019/05/29,1568.0,1562.881,1548.0,27700,1573.0,1548.0
1162,2019/05/30,1544.0,1544.919,1567.0,22100,1573.0,1526.0
1163,2019/05/31,1533.0,1537.593,1544.0,18900,1548.0,1526.0
1164,2019/06/03,1509.0,1502.113,1506.0,20400,1511.0,1497.0
1165,2019/06/04,1527.0,1514.884,1514.0,27500,1532.0,1493.0
1166,2019/06/05,1563.0,1553.615,1549.0,18700,1565.0,1532.0
1167,2019/06/06,1560.0,1567.361,1550.0,34900,1578.0,1550.0
1168,2019/06/07,1583.0,1579.22,1572.0,17300,1587.0,1560.0
1169,2019/06/10,1619.0,1603.359,1597.0,40400,1628.0,1581.0
1170,2019/06/11,1630.0,1627.026,1619.0,11400,1640.0,1619.0
1171,2019/06/12,1640.0,1636.702,1630.0,16100,1645.0,1616.0
1172,2019/06/13,1609.0,1603.729,1618.0,26900,1623.0,1588.0
1173,2019/06/14,1605.0,1606.312,1611.0,18600,1613.0,1596.0
1174,2019/06/17,1586.0,1586.135,1608.0,15600,1608.0,1576.0
1175,2019/06/18,1580.0,1583.175,1577.0,21200,1596.0,1575.0
1176,2019/06/19,1627.0,1623.591,1601.0,25200,1634.0,1597.0
1177,2019/06/20,1608.0,1627.583,1641.0,28300,1641.0,1607.0
1178,2019/06/21,1651.0,1636.758,1612.0,35600,1651.0,1610.0
1179,2019/06/24,1644.0,1649.247,1645.0,8900,1662.0,1640.0
1180,2019/06/25,1645.0,1643.503,1655.0,15500,1655.0,1630.0
1181,2019/06/26,1596.0,1617.076,1636.0,17200,1647.0,1596.0
1182,2019/06/27,1630.0,1624.0,1614.0,15000,1635.0,1607.0
1183,2019/06/28,1600.0,1607.269,1634.0,16000,1634.0,1589.0
1184,2019/07/01,1627.0,1613.106,1633.0,23500,1633.0,1600.0
1185,2019/07/02,1634.0,1631.662,1627.0,14800,1640.0,1615.0
1186,2019/07/03,1667.0,1655.625,1625.0,27700,1674.0,1625.0
1187,2019/07/04,1692.0,1692.116,1689.0,18100,1705.0,1682.0
1188,2019/07/05,1672.0,1665.045,1691.0,26500,1691.0,1611.0
1189,2019/07/08,1634.0,1646.327,1653.0,15300,1672.0,1630.0
1190,2019/07/09,1627.0,1633.072,1645.0,13900,1654.0,1615.0
1191,2019/07/10,1606.0,1612.26,1602.0,22300,1628.0,1602.0
1192,2019/07/11,1646.0,1640.371,1606.0,22400,1659.0,1606.0
1193,2019/07/12,1645.0,1649.766,1662.0,14500,1662.0,1634.0
1194,2019/07/16,1640.0,1643.144,1638.0,11100,1657.0,1634.0
1195,2019/07/17,1632.0,1630.921,1633.0,14000,1647.0,1619.0
1196,2019/07/18,1579.0,1591.246,1617.0,24800,1621.0,1572.0
1197,2019/07/19,1627.0,1609.039,1583.0,17800,1632.0,1576.0
1198,2019/07/22,1615.0,1618.114,1626.0,8800,1632.0,1612.0
1199,2019/07/23,1622.0,1628.075,1615.0,6700,1637.0,1615.0
1200,2019/07/24,1632.0,1627.222,1628.0,9000,1632.0,1617.0
1201,2019/07/25,1632.0,1634.305,1635.0,8200,1642.0,1628.0
1202,2019/07/26,1616.0,1618.929,1631.0,5600,1631.0,1610.0
1203,2019/07/29,1613.0,1614.0,1629.0,7300,1629.0,1609.0
1204,2019/07/30,1606.0,1609.0,1619.0,14000,1632.0,1595.0
1205,2019/07/31,1630.0,1621.952,1600.0,54500,1662.0,1532.0
1206,2019/08/01,1618.0,1620.59,1630.0,9500,1630.0,1612.0
1207,2019/08/02,1586.0,1604.146,1617.0,31500,1651.0,1579.0
1208,2019/08/05,1547.0,1545.622,1546.0,23300,1571.0,1527.0
1209,2019/08/06,1533.0,1527.385,1497.0,23100,1546.0,1475.0
1210,2019/08/07,1526.0,1530.133,1530.0,15800,1538.0,1526.0
1211,2019/08/08,1555.0,1554.443,1532.0,21000,1580.0,1529.0
1212,2019/08/09,1597.0,1593.949,1561.0,19500,1603.0,1561.0
1213,2019/08/13,1600.0,1596.671,1571.0,25800,1603.0,1571.0
1214,2019/08/14,1616.0,1612.222,1607.0,16200,1620.0,1600.0
1215,2019/08/15,1600.0,1593.906,1577.0,19100,1604.0,1577.0
1216,2019/08/16,1588.0,1590.276,1591.0,9800,1599.0,1581.0
1217,2019/08/19,1607.0,1603.836,1589.0,7300,1613.0,1589.0
1218,2019/08/20,1632.0,1615.146,1605.0,13000,1632.0,1600.0
1219,2019/08/21,1619.0,1615.416,1613.0,12500,1624.0,1602.0
1220,2019/08/22,1621.0,1621.14,1632.0,11400,1632.0,1605.0
1221,2019/08/23,1606.0,1609.293,1610.0,9900,1615.0,1604.0
