,Date,Close,VWAP,Open,Volume,High,Low
0,2014/08/25,753.0,752.132,751.0,7600,753.0,750.0
1,2014/08/26,752.0,753.614,755.0,11400,755.0,752.0
2,2014/08/27,755.0,754.817,755.0,7100,755.0,754.0
3,2014/08/28,756.0,754.378,755.0,9000,756.0,752.0
4,2014/08/29,757.0,757.6,756.0,11500,760.0,756.0
5,2014/09/01,766.0,764.456,757.0,28700,776.0,756.0
6,2014/09/02,774.0,770.027,766.0,18500,774.0,766.0
7,2014/09/03,771.0,770.4,775.0,11000,775.0,768.0
8,2014/09/04,772.0,772.204,774.0,11300,775.0,769.0
9,2014/09/05,774.0,773.435,773.0,16100,775.0,770.0
10,2014/09/08,774.0,773.961,774.0,10200,775.0,772.0
11,2014/09/09,774.0,775.736,776.0,7200,777.0,774.0
12,2014/09/10,774.0,772.988,771.0,25200,777.0,766.0
13,2014/09/11,777.0,775.839,777.0,8700,777.0,773.0
14,2014/09/12,777.0,777.913,778.0,36700,779.0,777.0
15,2014/09/16,779.0,778.419,779.0,12400,779.0,777.0
16,2014/09/17,777.0,778.495,779.0,10300,780.0,777.0
17,2014/09/18,779.0,778.52,780.0,15000,780.0,770.0
18,2014/09/19,784.0,780.547,779.0,37100,784.0,777.0
19,2014/09/22,781.0,783.129,785.0,7000,785.0,781.0
20,2014/09/24,783.0,782.935,784.0,10800,785.0,778.0
21,2014/09/25,788.0,785.602,783.0,17600,788.0,781.0
22,2014/09/26,783.0,786.585,789.0,18300,789.0,783.0
23,2014/09/29,785.0,784.622,785.0,9000,786.0,782.0
24,2014/09/30,782.0,781.911,781.0,16800,785.0,780.0
25,2014/10/01,784.0,784.669,785.0,12100,787.0,781.0
26,2014/10/02,752.0,765.475,780.0,24200,780.0,750.0
27,2014/10/03,766.0,763.817,755.0,9300,773.0,755.0
28,2014/10/06,776.0,775.987,770.0,7600,780.0,770.0
29,2014/10/07,771.0,775.188,771.0,13300,779.0,771.0
30,2014/10/08,760.0,761.071,757.0,9800,772.0,757.0
31,2014/10/09,755.0,758.806,764.0,10300,764.0,755.0
32,2014/10/10,750.0,750.503,750.0,16500,753.0,750.0
33,2014/10/14,743.0,748.161,750.0,27900,752.0,741.0
34,2014/10/15,745.0,744.234,744.0,7700,746.0,743.0
35,2014/10/16,740.0,743.531,745.0,17700,747.0,740.0
36,2014/10/17,717.0,727.071,738.0,16900,738.0,717.0
37,2014/10/20,738.0,733.954,719.0,15200,749.0,719.0
38,2014/10/21,744.0,746.392,746.0,17600,750.0,739.0
39,2014/10/22,753.0,750.77,750.0,8700,755.0,746.0
40,2014/10/23,751.0,750.606,751.0,7100,754.0,747.0
41,2014/10/24,749.0,753.224,761.0,8500,762.0,747.0
42,2014/10/27,758.0,754.181,750.0,7200,760.0,749.0
43,2014/10/28,750.0,750.241,751.0,7900,754.0,747.0
44,2014/10/29,760.0,757.955,758.0,11200,760.0,752.0
45,2014/10/30,761.0,762.451,761.0,15300,765.0,760.0
46,2014/10/31,776.0,771.751,767.0,26900,778.0,760.0
47,2014/11/04,758.0,764.107,775.0,36500,777.0,750.0
48,2014/11/05,754.0,751.98,751.0,20100,757.0,750.0
49,2014/11/06,750.0,751.42,754.0,16900,754.0,748.0
50,2014/11/07,748.0,748.622,752.0,11100,752.0,747.0
51,2014/11/10,748.0,747.16,748.0,10000,749.0,745.0
52,2014/11/11,750.0,749.5,751.0,9800,752.0,746.0
53,2014/11/12,746.0,749.921,750.0,27800,754.0,745.0
54,2014/11/13,751.0,748.82,747.0,8900,751.0,746.0
55,2014/11/14,751.0,751.046,753.0,17300,753.0,747.0
56,2014/11/17,744.0,748.697,752.0,20800,756.0,744.0
57,2014/11/18,748.0,746.658,743.0,15500,750.0,743.0
58,2014/11/19,745.0,746.716,748.0,11600,750.0,745.0
59,2014/11/20,745.0,746.213,749.0,6100,749.0,745.0
60,2014/11/21,746.0,744.812,747.0,12200,747.0,742.0
61,2014/11/25,747.0,747.721,746.0,11100,751.0,746.0
62,2014/11/26,744.0,745.479,750.0,20900,750.0,744.0
63,2014/11/27,743.0,745.0,748.0,8700,748.0,743.0
64,2014/11/28,743.0,743.289,744.0,12100,745.0,742.0
65,2014/12/01,745.0,745.487,747.0,7800,747.0,744.0
66,2014/12/02,745.0,744.066,747.0,15100,747.0,742.0
67,2014/12/03,743.0,742.405,741.0,17300,744.0,741.0
68,2014/12/04,746.0,744.954,745.0,21500,746.0,743.0
69,2014/12/05,747.0,746.494,748.0,8700,748.0,745.0
70,2014/12/08,747.0,747.541,749.0,18300,751.0,745.0
71,2014/12/09,746.0,747.284,749.0,13400,749.0,746.0
72,2014/12/10,746.0,746.884,748.0,22400,748.0,746.0
73,2014/12/11,742.0,743.374,745.0,20300,746.0,741.0
74,2014/12/12,742.0,742.41,742.0,32900,745.0,742.0
75,2014/12/15,739.0,742.238,749.0,17200,749.0,739.0
76,2014/12/16,732.0,734.993,737.0,30200,737.0,732.0
77,2014/12/17,715.0,721.281,730.0,40600,730.0,715.0
78,2014/12/18,719.0,718.462,720.0,22500,725.0,715.0
79,2014/12/19,720.0,720.646,724.0,17800,724.0,718.0
80,2014/12/22,726.0,725.775,729.0,13800,729.0,723.0
81,2014/12/24,726.0,726.159,726.0,20800,728.0,725.0
82,2014/12/25,727.0,726.225,728.0,18200,728.0,724.0
83,2014/12/26,735.0,732.956,733.0,9100,735.0,729.0
84,2014/12/29,744.0,741.031,735.0,13100,746.0,735.0
85,2014/12/30,741.0,741.212,744.0,18400,745.0,738.0
86,2015/01/05,739.0,740.125,741.0,16000,743.0,737.0
87,2015/01/06,734.0,735.703,739.0,22900,739.0,733.0
88,2015/01/07,730.0,730.842,731.0,9500,733.0,730.0
89,2015/01/08,732.0,731.466,730.0,7300,733.0,730.0
90,2015/01/09,734.0,732.835,732.0,10900,735.0,730.0
91,2015/01/13,734.0,734.451,734.0,18400,737.0,733.0
92,2015/01/14,739.0,737.772,736.0,22400,740.0,736.0
93,2015/01/15,740.0,739.321,740.0,16200,740.0,737.0
94,2015/01/16,736.0,735.4,738.0,12500,740.0,733.0
95,2015/01/19,748.0,747.116,750.0,38100,751.0,742.0
96,2015/01/20,749.0,748.379,750.0,13200,750.0,746.0
97,2015/01/21,743.0,745.731,749.0,28300,750.0,740.0
98,2015/01/22,743.0,741.93,744.0,10000,745.0,740.0
99,2015/01/23,749.0,746.427,745.0,15000,749.0,740.0
100,2015/01/26,750.0,747.608,750.0,14300,750.0,740.0
101,2015/01/27,750.0,751.278,750.0,21200,757.0,748.0
102,2015/01/28,754.0,753.093,750.0,15000,756.0,750.0
103,2015/01/29,739.0,740.76,744.0,36700,748.0,737.0
104,2015/01/30,741.0,741.177,740.0,16400,744.0,739.0
105,2015/02/02,742.0,743.063,744.0,20700,746.0,740.0
106,2015/02/03,742.0,742.221,742.0,12700,745.0,741.0
107,2015/02/04,752.0,747.199,740.0,23100,752.0,740.0
108,2015/02/05,751.0,751.72,753.0,11800,753.0,750.0
109,2015/02/06,753.0,753.172,754.0,8700,755.0,750.0
110,2015/02/09,770.0,759.496,757.0,38500,770.0,741.0
111,2015/02/10,779.0,773.344,766.0,25000,780.0,766.0
112,2015/02/12,784.0,783.265,779.0,35500,788.0,779.0
113,2015/02/13,786.0,786.336,784.0,29200,790.0,784.0
114,2015/02/16,786.0,788.957,790.0,23000,792.0,786.0
115,2015/02/17,788.0,788.495,787.0,9700,790.0,787.0
116,2015/02/18,790.0,792.196,790.0,22400,795.0,789.0
117,2015/02/19,795.0,792.897,790.0,32900,795.0,790.0
118,2015/02/20,798.0,796.874,795.0,15100,799.0,793.0
119,2015/02/23,788.0,792.941,798.0,22200,798.0,788.0
120,2015/02/24,798.0,796.473,796.0,25600,799.0,790.0
121,2015/02/25,797.0,796.235,798.0,11500,799.0,794.0
122,2015/02/26,795.0,795.204,797.0,19100,797.0,792.0
123,2015/02/27,791.0,793.888,797.0,16900,797.0,790.0
124,2015/03/02,794.0,793.612,791.0,8500,796.0,791.0
125,2015/03/03,793.0,793.842,798.0,8200,798.0,791.0
126,2015/03/04,788.0,786.688,790.0,15400,790.0,781.0
127,2015/03/05,783.0,784.689,788.0,13200,788.0,783.0
128,2015/03/06,784.0,781.78,783.0,21400,786.0,775.0
129,2015/03/09,778.0,778.369,780.0,13000,780.0,775.0
130,2015/03/10,778.0,777.908,778.0,20600,780.0,775.0
131,2015/03/11,777.0,775.262,774.0,17200,778.0,772.0
132,2015/03/12,788.0,780.545,777.0,31200,788.0,777.0
133,2015/03/13,794.0,792.267,790.0,43800,798.0,789.0
134,2015/03/16,797.0,795.277,794.0,18800,798.0,794.0
135,2015/03/17,795.0,796.411,797.0,17500,799.0,795.0
136,2015/03/18,798.0,796.69,795.0,25800,800.0,793.0
137,2015/03/19,795.0,795.857,798.0,16100,798.0,792.0
138,2015/03/20,798.0,796.149,795.0,17400,800.0,792.0
139,2015/03/23,798.0,797.402,798.0,9700,798.0,795.0
140,2015/03/24,795.0,794.709,798.0,17500,798.0,790.0
141,2015/03/25,795.0,794.279,795.0,11100,795.0,792.0
142,2015/03/26,794.0,794.129,795.0,21700,797.0,791.0
143,2015/03/27,798.0,799.786,794.0,29400,804.0,794.0
144,2015/03/30,803.0,802.255,803.0,23900,803.0,800.0
145,2015/03/31,813.0,810.658,808.0,32200,815.0,806.0
146,2015/04/01,810.0,811.702,813.0,36600,815.0,805.0
147,2015/04/02,817.0,814.805,810.0,38000,819.0,810.0
148,2015/04/03,818.0,816.797,817.0,35000,820.0,813.0
149,2015/04/06,815.0,816.345,818.0,17400,818.0,815.0
150,2015/04/07,817.0,817.477,819.0,23700,819.0,815.0
151,2015/04/08,822.0,819.963,817.0,32800,824.0,817.0
152,2015/04/09,823.0,823.722,824.0,25200,826.0,821.0
153,2015/04/10,828.0,825.582,823.0,33700,829.0,823.0
154,2015/04/13,835.0,831.362,828.0,50000,837.0,828.0
155,2015/04/14,848.0,842.207,835.0,51200,848.0,835.0
156,2015/04/15,856.0,853.27,849.0,53700,858.0,849.0
157,2015/04/16,845.0,846.148,856.0,58000,860.0,828.0
158,2015/04/17,854.0,850.118,843.0,49200,857.0,839.0
159,2015/04/20,849.0,850.59,852.0,32700,853.0,846.0
160,2015/04/21,848.0,849.955,849.0,28700,854.0,845.0
161,2015/04/22,850.0,850.648,848.0,26100,854.0,848.0
162,2015/04/23,853.0,853.214,850.0,29900,857.0,850.0
163,2015/04/24,855.0,856.412,854.0,45900,863.0,853.0
164,2015/04/27,902.0,879.035,856.0,105900,912.0,856.0
165,2015/04/28,943.0,929.936,923.0,170800,950.0,907.0
166,2015/04/30,965.0,952.477,955.0,201400,967.0,930.0
167,2015/05/01,921.0,931.921,965.0,221500,965.0,900.0
168,2015/05/07,948.0,948.167,929.0,202200,975.0,929.0
169,2015/05/08,922.0,916.887,925.0,150600,932.0,900.0
170,2015/05/11,914.0,915.749,922.0,76000,929.0,900.0
171,2015/05/12,904.0,907.212,912.0,58500,913.0,901.0
172,2015/05/13,896.0,899.06,903.0,92100,909.0,890.0
173,2015/05/14,881.0,884.376,893.0,64600,894.0,880.0
174,2015/05/15,900.0,893.436,883.0,41100,905.0,883.0
175,2015/05/18,917.0,914.173,912.0,30000,918.0,910.0
176,2015/05/19,926.0,924.242,920.0,42500,929.0,917.0
177,2015/05/20,935.0,933.339,932.0,38700,939.0,926.0
178,2015/05/21,933.0,938.302,943.0,35800,944.0,931.0
179,2015/05/22,932.0,933.853,941.0,32600,941.0,930.0
180,2015/05/25,936.0,936.386,940.0,29800,940.0,933.0
181,2015/05/26,937.0,938.213,939.0,28700,940.0,937.0
182,2015/05/27,938.0,936.207,937.0,38100,940.0,932.0
183,2015/05/28,936.0,936.831,936.0,54400,939.0,935.0
184,2015/05/29,932.0,933.728,936.0,75700,939.0,930.0
185,2015/06/01,935.0,929.067,927.0,55400,935.0,920.0
186,2015/06/02,931.0,932.234,935.0,47000,936.0,930.0
187,2015/06/03,930.0,930.552,932.0,67900,933.0,925.0
188,2015/06/04,937.0,932.636,929.0,81200,939.0,928.0
189,2015/06/05,937.0,937.783,939.0,49400,940.0,935.0
190,2015/06/08,948.0,943.812,940.0,51700,948.0,940.0
191,2015/06/09,936.0,942.106,946.0,72700,948.0,936.0
192,2015/06/10,935.0,937.111,936.0,56700,941.0,932.0
193,2015/06/11,938.0,937.47,938.0,50900,943.0,935.0
194,2015/06/12,941.0,940.967,941.0,88700,945.0,938.0
195,2015/06/15,937.0,938.661,941.0,130700,941.0,936.0
196,2015/06/16,935.0,936.041,936.0,305500,939.0,935.0
197,2015/06/17,907.0,912.428,913.0,337000,922.0,906.0
198,2015/06/18,912.0,906.763,905.0,97700,912.0,900.0
199,2015/06/19,917.0,915.357,911.0,70100,919.0,911.0
200,2015/06/22,908.0,907.031,914.0,68300,915.0,901.0
201,2015/06/23,905.0,901.981,905.0,73200,906.0,899.0
202,2015/06/24,910.0,905.718,905.0,59300,910.0,900.0
203,2015/06/25,906.0,904.425,901.0,77800,910.0,901.0
204,2015/06/26,891.0,897.641,905.0,76300,906.0,891.0
205,2015/06/29,857.0,863.704,871.0,76100,872.0,854.0
206,2015/06/30,852.0,852.959,857.0,51700,863.0,847.0
207,2015/07/01,848.0,850.47,853.0,30200,855.0,848.0
208,2015/07/02,852.0,853.218,854.0,39000,862.0,849.0
209,2015/07/03,847.0,849.423,853.0,33600,854.0,847.0
210,2015/07/06,842.0,841.349,846.0,44400,846.0,830.0
211,2015/07/07,850.0,850.737,847.0,27000,855.0,845.0
212,2015/07/08,824.0,833.282,846.0,39400,849.0,824.0
213,2015/07/09,814.0,806.016,812.0,56500,816.0,798.0
214,2015/07/10,811.0,816.659,814.0,27300,826.0,810.0
215,2015/07/13,830.0,824.313,814.0,26500,837.0,814.0
216,2015/07/14,844.0,843.141,839.0,19100,847.0,839.0
217,2015/07/15,849.0,847.049,849.0,20600,850.0,844.0
218,2015/07/16,849.0,847.47,850.0,30000,850.0,841.0
219,2015/07/17,840.0,842.24,853.0,27100,853.0,838.0
220,2015/07/21,842.0,842.548,842.0,12600,846.0,840.0
221,2015/07/22,833.0,835.73,841.0,18500,841.0,833.0
222,2015/07/23,831.0,831.497,834.0,15100,835.0,830.0
223,2015/07/24,831.0,833.44,831.0,15700,839.0,831.0
224,2015/07/27,830.0,831.587,833.0,20100,838.0,828.0
225,2015/07/28,829.0,829.787,829.0,24400,840.0,823.0
226,2015/07/29,834.0,834.137,827.0,24100,842.0,827.0
227,2015/07/30,829.0,832.89,834.0,23700,840.0,829.0
228,2015/07/31,847.0,845.432,844.0,41900,858.0,833.0
229,2015/08/03,896.0,878.55,862.0,84000,898.0,856.0
230,2015/08/04,889.0,890.904,892.0,16700,896.0,881.0
231,2015/08/05,893.0,892.916,893.0,19000,898.0,882.0
232,2015/08/06,893.0,894.804,900.0,27000,900.0,885.0
233,2015/08/07,870.0,874.335,889.0,26000,892.0,864.0
234,2015/08/10,889.0,882.792,884.0,17300,890.0,871.0
235,2015/08/11,889.0,890.356,892.0,30900,895.0,885.0
236,2015/08/12,868.0,874.591,889.0,29100,890.0,861.0
237,2015/08/13,863.0,862.184,865.0,19000,872.0,855.0
238,2015/08/14,868.0,866.178,864.0,9000,873.0,862.0
239,2015/08/17,876.0,874.16,869.0,19400,883.0,869.0
240,2015/08/18,841.0,849.628,856.0,76600,862.0,841.0
241,2015/08/19,844.0,847.539,854.0,41400,857.0,839.0
242,2015/08/20,851.0,849.577,846.0,26000,855.0,835.0
243,2015/08/21,834.0,838.995,840.0,20300,846.0,834.0
244,2015/08/24,785.0,798.711,800.0,55400,819.0,785.0
245,2015/08/25,768.0,765.56,751.0,74300,809.0,728.0
246,2015/08/26,798.0,786.065,773.0,21700,799.0,770.0
247,2015/08/27,807.0,810.683,810.0,16700,824.0,806.0
248,2015/08/28,820.0,818.832,832.0,14300,832.0,810.0
249,2015/08/31,813.0,815.865,832.0,14100,832.0,809.0
250,2015/09/01,799.0,807.453,812.0,22300,820.0,799.0
251,2015/09/02,783.0,786.328,790.0,29300,796.0,775.0
252,2015/09/03,800.0,801.689,786.0,13500,810.0,786.0
253,2015/09/04,789.0,794.228,808.0,12700,808.0,787.0
254,2015/09/07,799.0,799.146,787.0,14400,811.0,784.0
255,2015/09/08,790.0,797.889,803.0,9000,809.0,789.0
256,2015/09/09,819.0,812.596,811.0,14100,819.0,802.0
257,2015/09/10,807.0,804.685,805.0,8900,812.0,797.0
258,2015/09/11,833.0,835.134,837.0,38100,844.0,820.0
259,2015/09/14,830.0,834.732,833.0,16800,842.0,830.0
260,2015/09/15,832.0,833.305,831.0,10500,840.0,830.0
261,2015/09/16,816.0,813.569,839.0,20200,839.0,790.0
262,2015/09/17,820.0,816.227,812.0,13200,830.0,790.0
263,2015/09/18,823.0,821.148,826.0,12200,826.0,815.0
264,2015/09/24,813.0,813.69,816.0,19000,819.0,808.0
265,2015/09/25,820.0,813.933,824.0,30000,825.0,800.0
266,2015/09/28,828.0,822.736,832.0,15500,832.0,799.0
267,2015/09/29,802.0,808.424,812.0,11800,825.0,802.0
268,2015/09/30,812.0,811.603,809.0,6800,816.0,808.0
269,2015/10/01,828.0,821.988,816.0,8600,831.0,808.0
270,2015/10/02,825.0,822.642,829.0,12000,831.0,808.0
271,2015/10/05,823.0,822.209,830.0,4300,830.0,812.0
272,2015/10/06,828.0,827.72,831.0,13200,831.0,816.0
273,2015/10/07,831.0,826.831,830.0,5900,831.0,818.0
274,2015/10/08,824.0,825.263,828.0,8000,830.0,821.0
275,2015/10/09,825.0,823.102,825.0,13700,825.0,820.0
276,2015/10/13,830.0,826.605,825.0,19500,830.0,825.0
277,2015/10/14,820.0,824.135,830.0,27500,830.0,818.0
278,2015/10/15,832.0,827.547,822.0,8600,832.0,821.0
279,2015/10/16,835.0,833.066,835.0,15200,835.0,830.0
280,2015/10/19,834.0,834.0,836.0,6400,836.0,831.0
281,2015/10/20,831.0,831.311,834.0,4500,834.0,830.0
282,2015/10/21,832.0,828.122,831.0,11500,832.0,820.0
283,2015/10/22,830.0,830.79,831.0,5700,833.0,829.0
284,2015/10/23,833.0,832.806,834.0,14400,835.0,830.0
285,2015/10/26,839.0,837.339,836.0,21800,839.0,836.0
286,2015/10/27,837.0,838.064,839.0,12600,840.0,836.0
287,2015/10/28,840.0,838.152,839.0,6600,840.0,835.0
288,2015/10/29,839.0,838.51,839.0,20400,840.0,837.0
289,2015/10/30,840.0,841.114,840.0,25500,845.0,838.0
290,2015/11/02,835.0,838.231,841.0,14700,843.0,834.0
291,2015/11/04,835.0,836.122,839.0,9800,839.0,831.0
292,2015/11/05,840.0,839.856,839.0,13200,844.0,836.0
293,2015/11/06,846.0,845.008,840.0,13200,850.0,839.0
294,2015/11/09,862.0,855.789,849.0,29800,862.0,848.0
295,2015/11/10,855.0,855.64,854.0,11400,860.0,852.0
296,2015/11/11,860.0,857.549,855.0,20400,862.0,855.0
297,2015/11/12,868.0,864.135,860.0,21500,868.0,860.0
298,2015/11/13,865.0,865.405,867.0,28900,867.0,860.0
299,2015/11/16,860.0,860.223,862.0,27300,865.0,855.0
300,2015/11/17,861.0,854.588,866.0,24000,866.0,841.0
301,2015/11/18,858.0,860.119,864.0,10100,865.0,849.0
302,2015/11/19,856.0,854.07,853.0,14300,859.0,851.0
303,2015/11/20,856.0,851.446,857.0,16600,857.0,846.0
304,2015/11/24,849.0,847.819,856.0,24800,858.0,840.0
305,2015/11/25,843.0,843.224,843.0,16100,846.0,840.0
306,2015/11/26,847.0,846.16,846.0,10000,848.0,843.0
307,2015/11/27,844.0,845.741,847.0,5400,848.0,843.0
308,2015/11/30,837.0,837.313,843.0,15000,843.0,833.0
309,2015/12/01,838.0,838.61,842.0,13600,843.0,837.0
310,2015/12/02,838.0,839.471,841.0,11900,842.0,838.0
311,2015/12/03,840.0,840.084,840.0,8300,842.0,839.0
312,2015/12/04,836.0,837.413,838.0,14300,840.0,836.0
313,2015/12/07,836.0,838.621,840.0,16600,845.0,835.0
314,2015/12/08,834.0,832.972,837.0,28500,839.0,825.0
315,2015/12/09,848.0,849.649,850.0,53600,856.0,842.0
316,2015/12/10,829.0,838.258,849.0,38000,849.0,829.0
317,2015/12/11,818.0,819.456,820.0,58300,831.0,815.0
318,2015/12/14,810.0,812.464,818.0,37100,818.0,805.0
319,2015/12/15,806.0,807.757,811.0,34100,814.0,805.0
320,2015/12/16,805.0,803.798,807.0,35600,808.0,800.0
321,2015/12/17,815.0,814.955,817.0,17600,817.0,810.0
322,2015/12/18,811.0,813.917,815.0,21800,824.0,808.0
323,2015/12/21,798.0,799.207,810.0,34800,810.0,790.0
324,2015/12/22,797.0,798.208,801.0,17800,804.0,796.0
325,2015/12/24,795.0,797.742,800.0,15500,800.0,795.0
326,2015/12/25,793.0,794.675,801.0,24000,801.0,789.0
327,2015/12/28,796.0,795.931,801.0,18800,801.0,790.0
328,2015/12/29,805.0,800.225,798.0,17300,808.0,792.0
329,2015/12/30,812.0,808.579,808.0,14000,813.0,803.0
330,2016/01/04,803.0,807.198,815.0,16700,815.0,801.0
331,2016/01/05,805.0,806.303,803.0,13200,813.0,800.0
332,2016/01/06,805.0,805.133,808.0,9800,808.0,803.0
333,2016/01/07,800.0,802.433,808.0,12000,808.0,800.0
334,2016/01/08,801.0,801.244,801.0,20900,809.0,797.0
335,2016/01/12,790.0,796.826,801.0,35700,803.0,790.0
336,2016/01/13,796.0,798.223,791.0,12100,808.0,791.0
337,2016/01/14,781.0,783.799,794.0,28300,794.0,777.0
338,2016/01/15,781.0,782.926,785.0,17600,792.0,778.0
339,2016/01/18,767.0,768.044,772.0,20300,773.0,764.0
340,2016/01/19,762.0,764.161,772.0,14900,772.0,760.0
341,2016/01/20,748.0,754.402,762.0,24900,766.0,748.0
342,2016/01/21,718.0,734.848,745.0,30300,754.0,718.0
343,2016/01/22,747.0,736.962,727.0,28700,749.0,724.0
344,2016/01/25,756.0,750.57,750.0,20700,758.0,741.0
345,2016/01/26,748.0,753.425,756.0,24000,758.0,742.0
346,2016/01/27,761.0,759.311,760.0,10300,762.0,755.0
347,2016/01/28,780.0,771.663,760.0,16000,781.0,758.0
348,2016/01/29,777.0,766.886,774.0,22000,778.0,753.0
349,2016/02/01,791.0,788.579,780.0,19700,792.0,780.0
350,2016/02/02,797.0,795.19,791.0,14200,799.0,790.0
351,2016/02/03,754.0,759.425,790.0,40900,790.0,748.0
352,2016/02/04,745.0,747.882,754.0,23700,754.0,745.0
353,2016/02/05,737.0,739.956,744.0,20600,746.0,735.0
354,2016/02/08,736.0,732.494,735.0,31600,741.0,723.0
355,2016/02/09,719.0,721.822,726.0,28100,728.0,719.0
356,2016/02/10,703.0,710.815,722.0,35200,725.0,703.0
357,2016/02/12,692.0,699.119,703.0,51100,714.0,690.0
358,2016/02/15,729.0,722.598,718.0,17900,731.0,710.0
359,2016/02/16,731.0,735.816,729.0,21200,745.0,725.0
360,2016/02/17,735.0,735.259,734.0,10800,743.0,731.0
361,2016/02/18,749.0,749.06,744.0,18200,755.0,741.0
362,2016/02/19,740.0,741.248,749.0,10500,749.0,737.0
363,2016/02/22,736.0,737.04,738.0,17700,744.0,730.0
364,2016/02/23,736.0,742.107,749.0,13100,749.0,736.0
365,2016/02/24,733.0,735.837,730.0,14100,745.0,728.0
366,2016/02/25,762.0,756.778,746.0,23000,763.0,745.0
367,2016/02/26,764.0,768.844,764.0,14700,777.0,762.0
368,2016/02/29,751.0,761.539,776.0,16500,777.0,751.0
369,2016/03/01,735.0,738.194,740.0,31900,751.0,734.0
370,2016/03/02,749.0,748.754,743.0,12600,755.0,742.0
371,2016/03/03,754.0,751.228,750.0,12300,756.0,748.0
372,2016/03/04,769.0,763.163,756.0,13500,770.0,756.0
373,2016/03/07,779.0,781.778,781.0,18000,788.0,773.0
374,2016/03/08,774.0,776.585,784.0,14200,784.0,770.0
375,2016/03/09,786.0,775.879,772.0,14000,786.0,766.0
376,2016/03/10,790.0,788.414,788.0,10400,791.0,786.0
377,2016/03/11,793.0,791.122,790.0,29500,797.0,787.0
378,2016/03/14,799.0,797.189,797.0,20600,799.0,795.0
379,2016/03/15,810.0,805.484,799.0,22500,810.0,799.0
380,2016/03/16,820.0,818.541,810.0,34200,826.0,810.0
381,2016/03/17,819.0,821.373,825.0,12600,825.0,816.0
382,2016/03/18,808.0,807.885,818.0,19200,818.0,800.0
383,2016/03/22,825.0,822.262,822.0,24400,825.0,811.0
384,2016/03/23,825.0,825.044,825.0,20700,828.0,823.0
385,2016/03/24,825.0,825.604,825.0,21200,828.0,820.0
386,2016/03/25,835.0,831.13,829.0,27000,836.0,827.0
387,2016/03/28,847.0,842.029,836.0,28000,847.0,836.0
388,2016/03/29,852.0,849.199,847.0,28200,853.0,843.0
389,2016/03/30,848.0,849.034,853.0,32500,853.0,846.0
390,2016/03/31,840.0,846.004,848.0,26400,852.0,839.0
391,2016/04/01,818.0,826.292,848.0,39400,848.0,818.0
392,2016/04/04,837.0,833.915,828.0,25800,840.0,825.0
393,2016/04/05,824.0,826.375,832.0,17600,833.0,822.0
394,2016/04/06,835.0,827.108,822.0,16700,835.0,820.0
395,2016/04/07,835.0,833.975,836.0,8000,839.0,830.0
396,2016/04/08,833.0,831.528,823.0,19700,839.0,823.0
397,2016/04/11,825.0,826.193,833.0,14000,833.0,822.0
398,2016/04/12,834.0,829.598,825.0,23600,838.0,825.0
399,2016/04/13,838.0,834.726,836.0,19000,839.0,831.0
400,2016/04/14,850.0,847.252,843.0,23000,850.0,843.0
401,2016/04/15,849.0,848.149,848.0,22900,850.0,845.0
402,2016/04/18,843.0,845.418,849.0,24400,849.0,842.0
403,2016/04/19,848.0,847.168,845.0,17300,850.0,845.0
404,2016/04/20,848.0,847.299,849.0,14400,849.0,845.0
405,2016/04/21,849.0,848.939,850.0,23100,850.0,846.0
406,2016/04/22,852.0,849.347,846.0,37800,852.0,846.0
407,2016/04/25,853.0,853.065,854.0,15500,855.0,850.0
408,2016/04/26,853.0,851.992,853.0,13000,853.0,850.0
409,2016/04/27,849.0,849.185,848.0,18900,852.0,847.0
410,2016/04/28,845.0,846.099,845.0,17200,854.0,842.0
411,2016/05/02,844.0,837.6,831.0,31000,848.0,823.0
412,2016/05/06,845.0,840.958,840.0,16700,846.0,833.0
413,2016/05/09,848.0,846.909,845.0,12100,850.0,843.0
414,2016/05/10,857.0,855.45,850.0,28200,859.0,850.0
415,2016/05/11,857.0,855.019,858.0,26900,858.0,848.0
416,2016/05/12,857.0,854.129,856.0,18600,857.0,848.0
417,2016/05/13,849.0,850.198,857.0,18200,857.0,844.0
418,2016/05/16,851.0,851.17,850.0,15300,854.0,849.0
419,2016/05/17,854.0,854.402,854.0,11200,857.0,852.0
420,2016/05/18,851.0,853.217,856.0,14300,858.0,848.0
421,2016/05/19,854.0,854.269,854.0,11900,857.0,852.0
422,2016/05/20,854.0,852.086,854.0,16200,855.0,848.0
423,2016/05/23,853.0,852.73,854.0,13700,855.0,850.0
424,2016/05/24,848.0,849.55,850.0,14000,852.0,848.0
425,2016/05/25,858.0,855.314,852.0,8600,858.0,852.0
426,2016/05/26,858.0,858.199,859.0,15600,860.0,855.0
427,2016/05/27,857.0,856.007,855.0,15300,859.0,854.0
428,2016/05/30,855.0,854.95,855.0,27700,858.0,853.0
429,2016/05/31,854.0,853.816,852.0,30500,856.0,851.0
430,2016/06/01,852.0,853.043,851.0,41900,857.0,850.0
431,2016/06/02,850.0,849.801,850.0,35600,852.0,848.0
432,2016/06/03,852.0,850.615,850.0,32200,853.0,848.0
433,2016/06/06,859.0,856.552,853.0,69700,860.0,853.0
434,2016/06/07,860.0,860.162,860.0,78200,864.0,858.0
435,2016/06/08,858.0,859.214,860.0,116600,862.0,856.0
436,2016/06/09,854.0,856.45,858.0,58700,859.0,854.0
437,2016/06/10,852.0,852.188,854.0,172700,855.0,849.0
438,2016/06/13,841.0,845.901,852.0,133100,852.0,841.0
439,2016/06/14,812.0,823.177,841.0,154000,841.0,809.0
440,2016/06/15,794.0,802.415,810.0,336000,810.0,794.0
441,2016/06/16,771.0,780.825,789.0,247300,789.0,761.0
442,2016/06/17,785.0,780.331,770.0,63200,788.0,770.0
443,2016/06/20,798.0,797.739,800.0,82300,805.0,792.0
444,2016/06/21,803.0,795.354,792.0,69200,805.0,786.0
445,2016/06/22,822.0,810.6,804.0,84500,822.0,799.0
446,2016/06/23,845.0,830.161,820.0,104800,846.0,815.0
447,2016/06/24,818.0,828.941,840.0,156100,848.0,799.0
448,2016/06/27,814.0,813.82,803.0,90500,835.0,803.0
449,2016/06/28,815.0,812.452,803.0,58800,835.0,795.0
450,2016/06/29,817.0,817.207,815.0,33400,822.0,815.0
451,2016/06/30,818.0,819.008,818.0,24600,826.0,815.0
452,2016/07/01,821.0,819.222,820.0,36100,822.0,815.0
453,2016/07/04,825.0,822.608,820.0,20900,829.0,815.0
454,2016/07/05,830.0,824.954,823.0,17500,830.0,819.0
455,2016/07/06,839.0,834.282,829.0,51100,839.0,825.0
456,2016/07/07,830.0,829.506,831.0,23700,836.0,825.0
457,2016/07/08,814.0,818.21,830.0,21400,830.0,805.0
458,2016/07/11,843.0,838.605,822.0,29400,843.0,822.0
459,2016/07/12,845.0,846.244,843.0,33600,850.0,843.0
460,2016/07/13,831.0,839.801,849.0,18600,849.0,828.0
461,2016/07/14,840.0,839.815,829.0,13500,845.0,829.0
462,2016/07/15,837.0,839.346,842.0,31500,848.0,824.0
463,2016/07/19,838.0,838.019,843.0,15500,846.0,830.0
464,2016/07/20,844.0,840.892,839.0,13000,845.0,837.0
465,2016/07/21,840.0,841.802,846.0,11600,847.0,834.0
466,2016/07/22,842.0,838.485,837.0,9700,842.0,832.0
467,2016/07/25,842.0,841.33,841.0,9700,845.0,838.0
468,2016/07/26,844.0,843.791,844.0,15800,846.0,842.0
469,2016/07/27,848.0,847.346,846.0,18800,849.0,845.0
470,2016/07/28,847.0,843.695,844.0,8200,847.0,840.0
471,2016/07/29,850.0,845.024,848.0,12300,850.0,837.0
472,2016/08/01,846.0,842.748,848.0,11100,849.0,832.0
473,2016/08/02,851.0,848.508,840.0,30300,851.0,840.0
474,2016/08/03,849.0,848.21,841.0,14800,851.0,840.0
475,2016/08/04,850.0,847.775,850.0,8000,850.0,844.0
476,2016/08/05,846.0,845.267,845.0,7500,848.0,843.0
477,2016/08/08,851.0,849.456,850.0,14700,851.0,847.0
478,2016/08/09,851.0,849.467,851.0,19700,851.0,845.0
479,2016/08/10,850.0,849.434,848.0,5300,851.0,847.0
480,2016/08/12,849.0,850.392,850.0,18900,853.0,848.0
481,2016/08/15,851.0,850.849,850.0,7300,852.0,850.0
482,2016/08/16,845.0,847.509,851.0,16300,852.0,842.0
483,2016/08/17,847.0,843.313,840.0,16600,847.0,838.0
484,2016/08/18,838.0,839.517,840.0,12000,843.0,837.0
485,2016/08/19,830.0,829.9,834.0,10000,835.0,826.0
486,2016/08/22,826.0,819.184,830.0,21200,832.0,804.0
487,2016/08/23,833.0,825.849,817.0,14600,835.0,817.0
488,2016/08/24,833.0,832.303,829.0,6600,835.0,829.0
489,2016/08/25,848.0,842.462,833.0,13000,849.0,833.0
490,2016/08/26,841.0,843.947,850.0,9500,850.0,835.0
491,2016/08/29,848.0,846.25,849.0,6800,849.0,843.0
492,2016/08/30,839.0,839.019,838.0,5400,842.0,837.0
493,2016/08/31,845.0,840.986,839.0,6900,845.0,835.0
494,2016/09/01,846.0,844.848,842.0,9200,848.0,842.0
495,2016/09/02,847.0,846.318,846.0,8500,848.0,843.0
496,2016/09/05,850.0,849.129,849.0,12400,850.0,845.0
497,2016/09/06,848.0,848.703,845.0,11100,850.0,845.0
498,2016/09/07,849.0,849.07,849.0,11500,850.0,847.0
499,2016/09/08,849.0,848.351,848.0,13100,850.0,845.0
500,2016/09/09,846.0,845.043,845.0,23500,849.0,840.0
501,2016/09/12,848.0,845.391,845.0,12800,848.0,842.0
502,2016/09/13,843.0,844.667,847.0,10200,847.0,842.0
503,2016/09/14,843.0,843.985,841.0,6500,847.0,838.0
504,2016/09/15,834.0,810.914,843.0,62700,844.0,785.0
505,2016/09/16,822.0,825.295,826.0,14900,833.0,821.0
506,2016/09/20,827.0,827.604,820.0,18200,833.0,819.0
507,2016/09/21,839.0,834.27,828.0,14100,839.0,825.0
508,2016/09/23,849.0,845.628,840.0,19100,849.0,839.0
509,2016/09/26,848.0,848.474,849.0,19400,850.0,845.0
510,2016/09/27,849.0,846.962,845.0,15600,849.0,839.0
511,2016/09/28,848.0,847.034,846.0,8800,849.0,842.0
512,2016/09/29,849.0,848.7,849.0,19000,850.0,846.0
513,2016/09/30,846.0,845.846,843.0,6500,849.0,843.0
514,2016/10/03,847.0,847.023,849.0,8900,849.0,844.0
515,2016/10/04,849.0,847.738,848.0,8400,849.0,844.0
516,2016/10/05,849.0,848.309,849.0,15200,849.0,845.0
517,2016/10/06,846.0,847.093,849.0,11800,849.0,844.0
518,2016/10/07,842.0,840.953,840.0,10700,844.0,838.0
519,2016/10/11,845.0,841.372,842.0,11300,845.0,836.0
520,2016/10/12,835.0,842.502,845.0,23700,846.0,835.0
521,2016/10/13,842.0,839.941,836.0,5100,842.0,836.0
522,2016/10/14,843.0,840.842,838.0,7600,844.0,838.0
523,2016/10/17,846.0,844.655,843.0,14800,848.0,842.0
524,2016/10/18,847.0,845.916,843.0,7100,848.0,843.0
525,2016/10/19,848.0,848.083,847.0,8400,849.0,846.0
526,2016/10/20,849.0,848.6,847.0,12000,849.0,847.0
527,2016/10/21,846.0,845.932,847.0,5900,848.0,844.0
528,2016/10/24,848.0,845.686,840.0,12100,849.0,840.0
529,2016/10/25,849.0,848.379,848.0,20300,849.0,846.0
530,2016/10/26,849.0,848.211,848.0,18000,849.0,846.0
531,2016/10/27,848.0,847.868,849.0,12900,849.0,845.0
532,2016/10/28,847.0,847.448,849.0,25700,849.0,846.0
533,2016/10/31,846.0,846.846,847.0,14300,849.0,844.0
534,2016/11/01,849.0,847.641,846.0,17000,849.0,844.0
535,2016/11/02,837.0,838.113,845.0,22100,845.0,830.0
536,2016/11/04,837.0,834.78,840.0,12700,841.0,830.0
537,2016/11/07,833.0,833.443,835.0,11300,837.0,830.0
538,2016/11/08,826.0,821.5,838.0,18800,838.0,805.0
539,2016/11/09,804.0,809.915,832.0,23500,835.0,804.0
540,2016/11/10,823.0,824.223,830.0,20200,835.0,819.0
541,2016/11/11,826.0,826.489,830.0,14100,832.0,821.0
542,2016/11/14,833.0,831.256,827.0,17200,837.0,827.0
543,2016/11/15,836.0,836.0,834.0,10800,839.0,834.0
544,2016/11/16,841.0,838.435,836.0,14700,841.0,836.0
545,2016/11/17,843.0,841.948,841.0,15400,843.0,841.0
546,2016/11/18,846.0,845.358,845.0,16200,848.0,840.0
547,2016/11/21,846.0,847.285,849.0,23900,849.0,846.0
548,2016/11/22,844.0,845.029,849.0,14000,849.0,841.0
549,2016/11/24,847.0,846.093,849.0,9700,849.0,843.0
550,2016/11/25,846.0,845.414,848.0,16200,848.0,843.0
551,2016/11/28,849.0,847.228,846.0,11400,849.0,844.0
552,2016/11/29,849.0,848.258,848.0,9700,849.0,846.0
553,2016/11/30,848.0,847.347,846.0,7200,849.0,845.0
554,2016/12/01,847.0,847.231,849.0,13400,849.0,845.0
555,2016/12/02,843.0,842.618,845.0,8900,846.0,840.0
556,2016/12/05,841.0,841.168,843.0,12500,844.0,839.0
557,2016/12/06,839.0,840.281,842.0,17800,844.0,839.0
558,2016/12/07,843.0,841.942,841.0,12000,844.0,838.0
559,2016/12/08,844.0,842.742,843.0,16300,845.0,840.0
560,2016/12/09,845.0,840.91,838.0,22300,846.0,838.0
561,2016/12/12,849.0,846.884,845.0,21500,849.0,843.0
562,2016/12/13,850.0,848.378,848.0,33600,850.0,846.0
563,2016/12/14,849.0,849.439,850.0,18700,850.0,847.0
564,2016/12/15,850.0,849.232,849.0,67700,850.0,845.0
565,2016/12/16,848.0,848.139,848.0,26700,850.0,846.0
566,2016/12/19,850.0,849.224,850.0,16500,850.0,847.0
567,2016/12/20,850.0,849.736,850.0,17800,850.0,848.0
568,2016/12/21,849.0,848.546,849.0,8800,850.0,847.0
569,2016/12/22,850.0,848.768,848.0,8200,850.0,847.0
570,2016/12/26,850.0,849.18,849.0,24400,850.0,847.0
571,2016/12/27,850.0,849.447,850.0,19700,850.0,848.0
572,2016/12/28,840.0,844.054,850.0,37300,850.0,838.0
573,2016/12/29,844.0,842.168,842.0,20800,845.0,839.0
574,2016/12/30,845.0,843.984,845.0,12200,845.0,840.0
575,2017/01/04,844.0,845.875,850.0,65700,854.0,830.0
576,2017/01/05,844.0,844.758,845.0,21900,846.0,843.0
577,2017/01/06,846.0,845.149,845.0,30300,847.0,843.0
578,2017/01/10,847.0,846.201,846.0,19900,849.0,844.0
579,2017/01/11,849.0,847.789,849.0,16100,849.0,844.0
580,2017/01/12,846.0,847.208,847.0,24000,849.0,846.0
581,2017/01/13,847.0,845.882,843.0,10200,849.0,843.0
582,2017/01/16,848.0,847.219,848.0,10500,848.0,846.0
583,2017/01/17,845.0,846.509,848.0,11200,849.0,844.0
584,2017/01/18,845.0,844.687,845.0,9900,846.0,843.0
585,2017/01/19,847.0,846.818,846.0,14300,849.0,844.0
586,2017/01/20,849.0,848.146,845.0,8900,849.0,845.0
587,2017/01/23,847.0,849.07,849.0,19900,850.0,847.0
588,2017/01/24,848.0,847.234,849.0,10700,849.0,845.0
589,2017/01/25,848.0,850.58,849.0,25000,854.0,846.0
590,2017/01/26,854.0,852.848,850.0,31000,856.0,849.0
591,2017/01/27,853.0,855.733,856.0,27300,858.0,853.0
592,2017/01/30,856.0,857.52,859.0,22300,859.0,856.0
593,2017/01/31,853.0,854.219,858.0,18700,858.0,851.0
594,2017/02/01,850.0,849.557,850.0,19400,851.0,846.0
595,2017/02/02,846.0,848.193,853.0,16600,854.0,845.0
596,2017/02/03,846.0,846.913,846.0,8000,849.0,845.0
597,2017/02/06,843.0,844.762,846.0,18100,849.0,843.0
598,2017/02/07,843.0,843.994,842.0,15400,846.0,842.0
599,2017/02/08,845.0,845.429,844.0,16100,847.0,843.0
600,2017/02/09,849.0,848.513,847.0,19300,853.0,846.0
601,2017/02/10,852.0,851.381,850.0,22300,853.0,848.0
602,2017/02/13,855.0,854.349,853.0,28100,857.0,853.0
603,2017/02/14,848.0,852.182,855.0,21400,855.0,848.0
604,2017/02/15,851.0,855.31,859.0,17400,859.0,850.0
605,2017/02/16,855.0,857.39,853.0,20500,861.0,853.0
606,2017/02/17,855.0,855.76,857.0,12500,858.0,854.0
607,2017/02/20,857.0,857.086,855.0,11700,859.0,855.0
608,2017/02/21,857.0,856.444,858.0,11700,858.0,855.0
609,2017/02/22,858.0,858.0,858.0,9000,859.0,857.0
610,2017/02/23,860.0,859.362,859.0,12700,860.0,858.0
611,2017/02/24,862.0,862.235,862.0,24700,865.0,858.0
612,2017/02/27,867.0,865.796,866.0,22500,867.0,863.0
613,2017/02/28,872.0,872.325,867.0,35100,878.0,867.0
614,2017/03/01,872.0,872.029,873.0,17300,875.0,869.0
615,2017/03/02,877.0,878.293,879.0,22900,880.0,876.0
616,2017/03/03,879.0,880.877,882.0,25100,883.0,878.0
617,2017/03/06,881.0,880.884,880.0,13800,884.0,878.0
618,2017/03/07,879.0,883.081,884.0,26100,886.0,878.0
619,2017/03/08,879.0,879.877,883.0,16300,883.0,878.0
620,2017/03/09,881.0,880.785,879.0,13000,882.0,879.0
621,2017/03/10,884.0,884.737,883.0,44100,889.0,883.0
622,2017/03/13,886.0,885.777,884.0,26500,889.0,884.0
623,2017/03/14,888.0,887.272,889.0,18400,889.0,885.0
624,2017/03/15,878.0,879.378,885.0,26700,885.0,870.0
625,2017/03/16,880.0,879.136,878.0,17700,882.0,877.0
626,2017/03/17,874.0,874.497,875.0,16700,876.0,872.0
627,2017/03/21,874.0,873.688,875.0,13800,879.0,872.0
628,2017/03/22,866.0,869.533,872.0,19500,873.0,866.0
629,2017/03/23,870.0,865.936,870.0,15500,873.0,860.0
630,2017/03/24,876.0,875.906,878.0,14900,881.0,870.0
631,2017/03/27,870.0,873.446,876.0,25100,878.0,869.0
632,2017/03/28,884.0,879.418,869.0,23700,884.0,869.0
633,2017/03/29,885.0,883.2,880.0,22500,888.0,880.0
634,2017/03/30,878.0,882.652,885.0,20100,886.0,877.0
635,2017/03/31,871.0,875.686,880.0,25800,882.0,871.0
636,2017/04/03,880.0,880.783,880.0,18900,884.0,873.0
637,2017/04/04,882.0,881.675,883.0,24900,884.0,875.0
638,2017/04/05,878.0,875.9,875.0,33100,884.0,870.0
639,2017/04/06,864.0,871.239,882.0,28400,882.0,864.0
640,2017/04/07,865.0,865.744,865.0,30100,871.0,863.0
641,2017/04/10,872.0,875.193,869.0,20700,881.0,869.0
642,2017/04/11,870.0,872.288,876.0,17000,876.0,870.0
643,2017/04/12,865.0,867.54,870.0,35900,871.0,863.0
644,2017/04/13,864.0,866.527,863.0,20300,870.0,862.0
645,2017/04/14,855.0,859.885,862.0,26000,865.0,855.0
646,2017/04/17,868.0,864.742,857.0,15900,871.0,857.0
647,2017/04/18,871.0,870.513,868.0,18700,873.0,868.0
648,2017/04/19,871.0,875.811,873.0,24300,880.0,871.0
649,2017/04/20,871.0,870.897,870.0,16500,874.0,870.0
650,2017/04/21,872.0,872.591,877.0,15900,877.0,870.0
651,2017/04/24,873.0,874.401,877.0,33200,878.0,870.0
652,2017/04/25,871.0,872.496,872.0,24200,877.0,870.0
653,2017/04/26,881.0,879.228,875.0,57900,883.0,873.0
654,2017/04/27,895.0,891.086,881.0,89600,899.0,880.0
655,2017/04/28,889.0,893.824,898.0,32300,898.0,889.0
656,2017/05/01,885.0,883.291,883.0,39500,888.0,880.0
657,2017/05/02,897.0,892.678,885.0,41300,898.0,882.0
658,2017/05/08,900.0,899.613,899.0,77700,904.0,895.0
659,2017/05/09,900.0,901.097,900.0,40200,904.0,898.0
660,2017/05/10,904.0,902.735,900.0,49000,905.0,900.0
661,2017/05/11,913.0,910.317,907.0,33400,913.0,906.0
662,2017/05/12,934.0,922.105,913.0,76400,934.0,913.0
663,2017/05/15,931.0,932.522,934.0,43900,937.0,927.0
664,2017/05/16,926.0,929.676,934.0,28400,935.0,925.0
665,2017/05/17,925.0,925.427,926.0,26700,928.0,922.0
666,2017/05/18,922.0,920.278,922.0,41800,923.0,917.0
667,2017/05/19,917.0,915.646,919.0,42700,921.0,912.0
668,2017/05/22,920.0,920.646,918.0,52000,925.0,918.0
669,2017/05/23,920.0,920.38,920.0,37600,923.0,918.0
670,2017/05/24,923.0,922.859,925.0,35500,925.0,920.0
671,2017/05/25,924.0,923.537,923.0,50100,925.0,920.0
672,2017/05/26,923.0,922.165,922.0,44900,924.0,920.0
673,2017/05/29,921.0,923.589,924.0,82900,927.0,920.0
674,2017/05/30,922.0,921.127,921.0,68600,923.0,920.0
675,2017/05/31,924.0,924.195,924.0,76100,926.0,922.0
676,2017/06/01,920.0,922.349,924.0,75100,925.0,920.0
677,2017/06/02,920.0,921.173,920.0,108100,926.0,918.0
678,2017/06/05,918.0,919.3,920.0,73800,921.0,916.0
679,2017/06/06,919.0,919.865,919.0,66800,923.0,917.0
680,2017/06/07,922.0,921.103,920.0,45800,924.0,919.0
681,2017/06/08,926.0,926.554,924.0,62500,929.0,924.0
682,2017/06/09,929.0,924.304,921.0,125700,929.0,921.0
683,2017/06/12,939.0,934.235,929.0,121800,940.0,928.0
684,2017/06/13,933.0,935.037,937.0,75000,940.0,930.0
685,2017/06/14,925.0,928.222,930.0,133000,934.0,925.0
686,2017/06/15,913.0,920.386,925.0,376500,926.0,912.0
687,2017/06/16,934.0,915.848,909.0,464800,935.0,902.0
688,2017/06/19,948.0,936.278,932.0,127100,949.0,926.0
689,2017/06/20,982.0,964.416,952.0,192300,984.0,950.0
690,2017/06/21,979.0,977.468,974.0,124300,984.0,965.0
691,2017/06/22,994.0,988.702,979.0,130300,998.0,976.0
692,2017/06/23,1023.0,1016.189,996.0,210300,1033.0,996.0
693,2017/06/26,981.0,999.876,1023.0,129500,1024.0,978.0
694,2017/06/27,974.0,978.15,981.0,114900,988.0,973.0
695,2017/06/28,956.0,967.535,979.0,100200,979.0,953.0
696,2017/06/29,960.0,961.621,966.0,41400,974.0,956.0
697,2017/06/30,965.0,959.309,969.0,59500,969.0,948.0
698,2017/07/03,974.0,973.342,962.0,52700,980.0,962.0
699,2017/07/04,961.0,966.323,975.0,31900,975.0,961.0
700,2017/07/05,956.0,957.589,959.0,41400,962.0,952.0
701,2017/07/06,980.0,971.014,960.0,50700,980.0,958.0
702,2017/07/07,985.0,985.413,988.0,96400,995.0,977.0
703,2017/07/10,1009.0,1002.323,988.0,95000,1024.0,985.0
704,2017/07/11,1065.0,1045.461,1022.0,138400,1066.0,1020.0
705,2017/07/12,1037.0,1046.877,1065.0,77200,1065.0,1033.0
706,2017/07/13,1041.0,1038.629,1031.0,24800,1045.0,1031.0
707,2017/07/14,1043.0,1046.333,1048.0,46900,1053.0,1040.0
708,2017/07/18,1044.0,1044.182,1044.0,52700,1053.0,1037.0
709,2017/07/19,1029.0,1044.772,1053.0,72900,1055.0,1028.0
710,2017/07/20,1031.0,1027.881,1028.0,31800,1035.0,1010.0
711,2017/07/21,1025.0,1026.036,1031.0,33800,1031.0,1020.0
712,2017/07/24,1030.0,1024.793,1019.0,22200,1030.0,1017.0
713,2017/07/25,1041.0,1037.154,1031.0,27200,1041.0,1031.0
714,2017/07/26,1022.0,1032.314,1042.0,25200,1043.0,1020.0
715,2017/07/27,1038.0,1033.165,1020.0,30900,1040.0,1019.0
716,2017/07/28,1021.0,1021.339,1029.0,25400,1032.0,1016.0
717,2017/07/31,1022.0,1023.923,1025.0,23400,1030.0,1021.0
718,2017/08/01,1048.0,1042.227,1040.0,59100,1048.0,1029.0
719,2017/08/02,1019.0,1011.917,1001.0,129100,1037.0,984.0
720,2017/08/03,1009.0,1008.582,1011.0,40700,1019.0,1001.0
721,2017/08/04,1026.0,1017.339,1004.0,38900,1026.0,1003.0
722,2017/08/07,1038.0,1032.134,1030.0,38100,1039.0,1027.0
723,2017/08/08,1033.0,1033.696,1038.0,35200,1043.0,1023.0
724,2017/08/09,1027.0,1024.523,1036.0,32900,1036.0,1018.0
725,2017/08/10,1037.0,1033.191,1030.0,45100,1039.0,1023.0
726,2017/08/14,1026.0,1030.301,1034.0,45200,1037.0,1024.0
727,2017/08/15,1036.0,1041.948,1030.0,47700,1049.0,1030.0
728,2017/08/16,1029.0,1035.933,1037.0,46000,1044.0,1029.0
729,2017/08/17,1027.0,1031.369,1030.0,36300,1040.0,1024.0
730,2017/08/18,1027.0,1024.819,1024.0,28800,1033.0,1016.0
731,2017/08/21,1025.0,1024.112,1025.0,17900,1030.0,1020.0
732,2017/08/22,1018.0,1021.411,1023.0,19000,1028.0,1016.0
733,2017/08/23,1031.0,1029.911,1018.0,27000,1037.0,1018.0
734,2017/08/24,1031.0,1029.546,1025.0,25300,1035.0,1023.0
735,2017/08/25,1020.0,1023.644,1035.0,27000,1037.0,1000.0
736,2017/08/28,1020.0,1021.708,1020.0,9600,1026.0,1017.0
737,2017/08/29,1013.0,1012.972,1018.0,14100,1019.0,1009.0
738,2017/08/30,1017.0,1013.982,1015.0,27200,1024.0,1005.0
739,2017/08/31,1018.0,1018.711,1023.0,15900,1023.0,1007.0
740,2017/09/01,1021.0,1019.447,1023.0,13200,1024.0,1015.0
741,2017/09/04,1007.0,1009.043,1021.0,13900,1021.0,1002.0
742,2017/09/05,992.0,997.147,1007.0,31900,1008.0,990.0
743,2017/09/06,998.0,994.546,990.0,18500,1001.0,986.0
744,2017/09/07,998.0,997.037,998.0,24200,1007.0,988.0
745,2017/09/08,1000.0,997.524,996.0,24600,1003.0,995.0
746,2017/09/11,1005.0,1004.413,1000.0,12600,1008.0,1000.0
747,2017/09/12,1018.0,1013.834,1010.0,19900,1018.0,1009.0
748,2017/09/13,1014.0,1013.963,1018.0,16400,1018.0,1006.0
749,2017/09/14,998.0,1000.005,1010.0,20200,1010.0,994.0
750,2017/09/15,1008.0,1005.356,1001.0,26400,1012.0,999.0
751,2017/09/19,1013.0,1009.703,1008.0,21900,1013.0,1005.0
752,2017/09/20,1008.0,1008.424,1011.0,15100,1014.0,1005.0
753,2017/09/21,1014.0,1011.337,1013.0,17800,1014.0,1006.0
754,2017/09/22,1010.0,1010.756,1014.0,12300,1015.0,1008.0
755,2017/09/25,1013.0,1010.44,1016.0,19100,1016.0,1006.0
756,2017/09/26,1015.0,1010.569,1015.0,28100,1015.0,1002.0
757,2017/09/27,1014.0,1010.446,1014.0,10100,1014.0,1005.0
758,2017/09/28,1018.0,1012.289,1017.0,16600,1018.0,1005.0
759,2017/09/29,1007.0,1009.565,1015.0,11500,1015.0,1005.0
760,2017/10/02,1003.0,1004.152,1007.0,25000,1008.0,1000.0
761,2017/10/03,1014.0,1011.33,1008.0,17600,1017.0,1006.0
762,2017/10/04,1018.0,1013.421,1008.0,14500,1018.0,1007.0
763,2017/10/05,1032.0,1024.576,1018.0,25700,1032.0,1016.0
764,2017/10/06,1014.0,1018.577,1025.0,25300,1025.0,1013.0
765,2017/10/10,1015.0,1012.554,1014.0,17500,1016.0,1008.0
766,2017/10/11,1020.0,1015.437,1011.0,19000,1020.0,1009.0
767,2017/10/12,1029.0,1025.886,1021.0,24500,1030.0,1021.0
768,2017/10/13,1040.0,1034.505,1029.0,56200,1043.0,1024.0
769,2017/10/16,1034.0,1039.997,1042.0,28700,1046.0,1034.0
770,2017/10/17,1024.0,1024.669,1034.0,16300,1034.0,1016.0
771,2017/10/18,1020.0,1016.596,1024.0,15600,1024.0,1012.0
772,2017/10/19,1017.0,1016.138,1014.0,12300,1018.0,1014.0
773,2017/10/20,1018.0,1016.955,1013.0,17700,1020.0,1010.0
774,2017/10/23,1028.0,1025.07,1020.0,15800,1029.0,1020.0
775,2017/10/24,1033.0,1030.624,1020.0,21300,1035.0,1020.0
776,2017/10/25,1026.0,1028.043,1035.0,16200,1037.0,1023.0
777,2017/10/26,1021.0,1022.453,1023.0,13700,1027.0,1021.0
778,2017/10/27,1027.0,1023.58,1027.0,14300,1027.0,1020.0
779,2017/10/30,1035.0,1032.659,1035.0,38400,1035.0,1026.0
780,2017/10/31,1046.0,1039.257,1035.0,31900,1046.0,1030.0
781,2017/11/01,1043.0,1044.816,1046.0,38100,1048.0,1039.0
782,2017/11/02,1041.0,1040.154,1043.0,16900,1044.0,1036.0
783,2017/11/06,1029.0,1033.835,1045.0,26000,1046.0,1021.0
784,2017/11/07,1030.0,1026.966,1025.0,23400,1032.0,1023.0
785,2017/11/08,1027.0,1023.924,1020.0,23600,1028.0,1019.0
786,2017/11/09,1034.0,1033.458,1025.0,35400,1042.0,1024.0
787,2017/11/10,1028.0,1027.389,1025.0,22100,1033.0,1024.0
788,2017/11/13,1022.0,1022.862,1028.0,20300,1028.0,1019.0
789,2017/11/14,1015.0,1017.183,1023.0,12600,1023.0,1014.0
790,2017/11/15,1013.0,1015.464,1015.0,27600,1024.0,1011.0
791,2017/11/16,1011.0,1011.833,1010.0,13200,1016.0,1007.0
792,2017/11/17,1001.0,1003.621,1011.0,22400,1012.0,1001.0
793,2017/11/20,1000.0,1001.373,1001.0,16900,1004.0,1000.0
794,2017/11/21,1003.0,1003.618,1005.0,12300,1007.0,1001.0
795,2017/11/22,1001.0,1003.143,1005.0,14700,1006.0,1000.0
796,2017/11/24,1007.0,1004.602,1001.0,9300,1008.0,1001.0
797,2017/11/27,1002.0,1004.919,1007.0,23500,1009.0,1002.0
798,2017/11/28,1004.0,1003.614,1002.0,16300,1010.0,1000.0
799,2017/11/29,1009.0,1009.138,1010.0,19600,1013.0,1004.0
800,2017/11/30,1001.0,1003.143,1010.0,11900,1010.0,1001.0
801,2017/12/01,1002.0,1002.244,1009.0,18000,1009.0,1000.0
802,2017/12/04,1001.0,1005.024,1003.0,12500,1009.0,1001.0
803,2017/12/05,999.0,999.425,1001.0,34100,1003.0,996.0
804,2017/12/06,992.0,995.75,999.0,30000,1002.0,991.0
805,2017/12/07,998.0,998.795,994.0,16100,1002.0,993.0
806,2017/12/08,1006.0,999.145,993.0,39200,1007.0,993.0
807,2017/12/11,1009.0,1007.28,1007.0,11800,1009.0,1004.0
808,2017/12/12,1012.0,1010.95,1009.0,15900,1013.0,1009.0
809,2017/12/13,1006.0,1009.808,1012.0,26000,1013.0,1006.0
810,2017/12/14,1015.0,1014.288,1007.0,16300,1016.0,1007.0
811,2017/12/15,1002.0,1004.241,1006.0,104500,1010.0,999.0
812,2017/12/18,998.0,999.506,999.0,33000,1004.0,997.0
813,2017/12/19,997.0,998.389,999.0,14900,1003.0,996.0
814,2017/12/20,996.0,996.74,997.0,15000,1000.0,995.0
815,2017/12/21,1002.0,999.036,996.0,16700,1002.0,996.0
816,2017/12/22,1008.0,1008.417,1007.0,49400,1015.0,1000.0
817,2017/12/25,1014.0,1012.14,1009.0,11400,1014.0,1008.0
818,2017/12/26,1016.0,1016.044,1016.0,20600,1018.0,1015.0
819,2017/12/27,1023.0,1020.527,1016.0,18800,1024.0,1016.0
820,2017/12/28,1021.0,1024.283,1023.0,15200,1029.0,1021.0
821,2017/12/29,1021.0,1025.508,1030.0,12400,1030.0,1021.0
822,2018/01/04,1029.0,1028.016,1030.0,12900,1030.0,1023.0
823,2018/01/05,1029.0,1027.496,1029.0,13500,1029.0,1024.0
824,2018/01/09,1026.0,1027.436,1030.0,16300,1030.0,1023.0
825,2018/01/10,1024.0,1025.0,1025.0,8100,1029.0,1022.0
826,2018/01/11,1030.0,1028.037,1026.0,13400,1030.0,1023.0
827,2018/01/12,1011.0,1019.157,1030.0,35600,1030.0,1008.0
828,2018/01/15,1014.0,1017.123,1020.0,11400,1023.0,1012.0
829,2018/01/16,1005.0,1009.627,1014.0,21200,1018.0,1002.0
830,2018/01/17,1017.0,1014.178,1009.0,16300,1019.0,1006.0
831,2018/01/18,1011.0,1017.166,1023.0,15100,1023.0,1011.0
832,2018/01/19,1008.0,1011.539,1011.0,10400,1017.0,1008.0
833,2018/01/22,1015.0,1012.459,1010.0,15900,1016.0,1008.0
834,2018/01/23,1020.0,1020.805,1020.0,18500,1023.0,1017.0
835,2018/01/24,1017.0,1018.172,1024.0,18600,1024.0,1013.0
836,2018/01/25,1009.0,1012.572,1020.0,15900,1020.0,1009.0
837,2018/01/26,1007.0,1009.932,1015.0,17700,1016.0,1007.0
838,2018/01/29,1011.0,1024.21,1034.0,42800,1036.0,1011.0
839,2018/01/30,1006.0,1008.592,1010.0,29900,1015.0,1005.0
840,2018/01/31,1000.0,1005.446,1009.0,28000,1012.0,1000.0
841,2018/02/01,1017.0,1013.398,1014.0,35900,1019.0,1006.0
842,2018/02/02,1018.0,1009.195,1011.0,68800,1021.0,995.0
843,2018/02/05,1000.0,1003.429,1014.0,33100,1015.0,998.0
844,2018/02/06,964.0,971.787,992.0,79700,995.0,956.0
845,2018/02/07,975.0,986.331,981.0,40800,1000.0,975.0
846,2018/02/08,989.0,988.916,986.0,21500,996.0,984.0
847,2018/02/09,980.0,975.93,975.0,35500,985.0,970.0
848,2018/02/13,977.0,983.679,986.0,31100,993.0,975.0
849,2018/02/14,970.0,974.736,979.0,20800,983.0,970.0
850,2018/02/15,971.0,975.297,982.0,14800,982.0,971.0
851,2018/02/16,977.0,977.613,971.0,23500,985.0,971.0
852,2018/02/19,999.0,996.173,991.0,22500,999.0,991.0
853,2018/02/20,997.0,993.225,998.0,26700,999.0,975.0
854,2018/02/21,986.0,988.766,991.0,26500,995.0,982.0
855,2018/02/22,988.0,986.011,986.0,9000,994.0,982.0
856,2018/02/23,993.0,992.038,995.0,15800,997.0,988.0
857,2018/02/26,999.0,997.1,1000.0,13000,1000.0,992.0
858,2018/02/27,999.0,999.834,1000.0,19300,1003.0,996.0
859,2018/02/28,978.0,985.928,996.0,34700,999.0,978.0
860,2018/03/01,974.0,974.855,978.0,24800,982.0,972.0
861,2018/03/02,958.0,960.841,970.0,42000,970.0,954.0
862,2018/03/05,962.0,962.601,958.0,21300,970.0,958.0
863,2018/03/06,964.0,963.437,965.0,27900,969.0,959.0
864,2018/03/07,966.0,966.619,964.0,18100,974.0,963.0
865,2018/03/08,964.0,965.098,971.0,8200,972.0,962.0
866,2018/03/09,966.0,968.646,972.0,22600,974.0,961.0
867,2018/03/12,974.0,969.98,970.0,19900,975.0,966.0
868,2018/03/13,988.0,981.153,974.0,19000,989.0,973.0
869,2018/03/14,984.0,982.434,988.0,8300,988.0,977.0
870,2018/03/15,996.0,990.824,987.0,23300,998.0,979.0
871,2018/03/16,995.0,994.351,999.0,11100,999.0,987.0
872,2018/03/19,992.0,992.582,1000.0,14600,1000.0,985.0
873,2018/03/20,997.0,993.859,992.0,12800,997.0,987.0
874,2018/03/22,1013.0,1007.947,1003.0,28200,1013.0,1000.0
875,2018/03/23,994.0,997.02,1006.0,25200,1006.0,991.0
876,2018/03/26,1000.0,999.296,1008.0,37900,1008.0,992.0
877,2018/03/27,1010.0,1003.534,1000.0,47000,1010.0,999.0
878,2018/03/28,1010.0,1011.387,1001.0,47000,1020.0,1001.0
879,2018/03/29,1020.0,1016.201,1010.0,21400,1020.0,1010.0
880,2018/03/30,1023.0,1020.521,1020.0,23400,1023.0,1018.0
881,2018/04/02,1023.0,1026.947,1030.0,20700,1030.0,1023.0
882,2018/04/03,1023.0,1022.028,1020.0,25200,1027.0,1015.0
883,2018/04/04,1034.0,1032.046,1029.0,41600,1036.0,1026.0
884,2018/04/05,1044.0,1042.643,1037.0,24400,1045.0,1037.0
885,2018/04/06,1050.0,1051.5,1047.0,39200,1059.0,1044.0
886,2018/04/09,1050.0,1050.735,1050.0,22300,1054.0,1047.0
887,2018/04/10,1044.0,1048.943,1051.0,30000,1054.0,1044.0
888,2018/04/11,1019.0,1025.737,1043.0,32300,1043.0,1018.0
889,2018/04/12,1032.0,1028.903,1020.0,18600,1038.0,1020.0
890,2018/04/13,1044.0,1039.78,1035.0,20000,1044.0,1035.0
891,2018/04/16,1053.0,1049.241,1048.0,29000,1055.0,1044.0
892,2018/04/17,1050.0,1052.341,1054.0,29000,1055.0,1049.0
893,2018/04/18,1066.0,1067.357,1053.0,44800,1078.0,1051.0
894,2018/04/19,1083.0,1080.26,1074.0,27700,1085.0,1074.0
895,2018/04/20,1086.0,1088.652,1086.0,18100,1093.0,1085.0
896,2018/04/23,1094.0,1095.044,1098.0,20700,1099.0,1089.0
897,2018/04/24,1091.0,1091.242,1098.0,28500,1099.0,1085.0
898,2018/04/25,1085.0,1087.402,1085.0,22400,1093.0,1082.0
899,2018/04/26,1073.0,1077.333,1084.0,37900,1084.0,1073.0
900,2018/04/27,1074.0,1078.137,1080.0,27000,1084.0,1073.0
901,2018/05/01,1075.0,1071.973,1075.0,40000,1079.0,1066.0
902,2018/05/02,1076.0,1074.534,1075.0,17800,1079.0,1071.0
903,2018/05/07,1090.0,1082.157,1076.0,35000,1090.0,1076.0
904,2018/05/08,1097.0,1098.615,1095.0,36400,1104.0,1094.0
905,2018/05/09,1106.0,1104.4,1103.0,34500,1108.0,1101.0
906,2018/05/10,1103.0,1103.704,1106.0,19600,1110.0,1098.0
907,2018/05/11,1084.0,1085.597,1104.0,48600,1104.0,1074.0
908,2018/05/14,1097.0,1088.223,1084.0,36300,1098.0,1081.0
909,2018/05/15,1087.0,1087.538,1098.0,40700,1100.0,1078.0
910,2018/05/16,1091.0,1089.549,1087.0,19500,1092.0,1085.0
911,2018/05/17,1085.0,1085.282,1093.0,25500,1093.0,1080.0
912,2018/05/18,1091.0,1087.449,1089.0,20700,1092.0,1080.0
913,2018/05/21,1097.0,1094.775,1092.0,44500,1100.0,1091.0
914,2018/05/22,1097.0,1098.63,1100.0,37000,1100.0,1095.0
915,2018/05/23,1110.0,1108.076,1097.0,34100,1114.0,1097.0
916,2018/05/24,1107.0,1107.172,1110.0,28500,1111.0,1100.0
917,2018/05/25,1109.0,1107.902,1109.0,21400,1111.0,1103.0
918,2018/05/28,1117.0,1113.987,1114.0,37400,1118.0,1110.0
919,2018/05/29,1125.0,1120.442,1120.0,60800,1127.0,1116.0
920,2018/05/30,1121.0,1119.418,1120.0,43300,1123.0,1113.0
921,2018/05/31,1116.0,1120.761,1125.0,38900,1125.0,1116.0
922,2018/06/01,1101.0,1107.133,1115.0,52000,1115.0,1101.0
923,2018/06/04,1112.0,1111.907,1109.0,62400,1122.0,1108.0
924,2018/06/05,1111.0,1111.99,1113.0,40600,1117.0,1108.0
925,2018/06/06,1114.0,1111.079,1109.0,90500,1117.0,1108.0
926,2018/06/07,1107.0,1111.674,1114.0,95400,1116.0,1106.0
927,2018/06/08,1106.0,1101.704,1100.0,114000,1108.0,1100.0
928,2018/06/11,1113.0,1115.179,1110.0,143400,1128.0,1109.0
929,2018/06/12,1119.0,1120.524,1120.0,88800,1124.0,1116.0
930,2018/06/13,1119.0,1120.665,1119.0,98400,1126.0,1119.0
931,2018/06/14,1106.0,1114.431,1121.0,174100,1121.0,1105.0
932,2018/06/15,1102.0,1101.442,1105.0,279600,1107.0,1094.0
933,2018/06/18,1073.0,1087.317,1093.0,238600,1095.0,1072.0
934,2018/06/19,1094.0,1089.336,1073.0,97000,1097.0,1072.0
935,2018/06/20,1091.0,1089.939,1100.0,63900,1100.0,1080.0
936,2018/06/21,1064.0,1072.855,1088.0,55000,1089.0,1061.0
937,2018/06/22,1087.0,1083.227,1067.0,80700,1093.0,1064.0
938,2018/06/25,1062.0,1069.714,1085.0,56300,1085.0,1057.0
939,2018/06/26,1056.0,1055.973,1060.0,56000,1065.0,1051.0
940,2018/06/27,1083.0,1071.837,1055.0,73600,1090.0,1051.0
941,2018/06/28,1075.0,1076.491,1090.0,37100,1091.0,1070.0
942,2018/06/29,1096.0,1084.265,1074.0,66000,1096.0,1063.0
943,2018/07/02,1069.0,1079.141,1095.0,33300,1095.0,1066.0
944,2018/07/03,1062.0,1064.083,1068.0,35100,1079.0,1055.0
945,2018/07/04,1054.0,1054.753,1054.0,19800,1060.0,1051.0
946,2018/07/05,1024.0,1035.445,1050.0,37500,1057.0,1023.0
947,2018/07/06,1011.0,1014.693,1018.0,26400,1025.0,1009.0
948,2018/07/09,1000.0,1003.752,1002.0,26600,1010.0,1000.0
949,2018/07/10,985.0,993.653,1004.0,27700,1006.0,985.0
950,2018/07/11,970.0,975.011,985.0,55000,986.0,970.0
951,2018/07/12,981.0,981.982,971.0,22400,989.0,971.0
952,2018/07/13,994.0,992.587,983.0,22500,998.0,983.0
953,2018/07/17,1012.0,1005.546,995.0,24000,1015.0,995.0
954,2018/07/18,1013.0,1015.014,1013.0,14600,1018.0,1013.0
955,2018/07/19,998.0,1005.209,1013.0,27700,1016.0,998.0
956,2018/07/20,1001.0,1001.034,999.0,8900,1007.0,998.0
957,2018/07/23,1001.0,1002.815,1001.0,11900,1006.0,1000.0
958,2018/07/24,996.0,999.195,1000.0,14900,1003.0,996.0
959,2018/07/25,996.0,996.204,995.0,10300,1000.0,995.0
960,2018/07/26,1014.0,1011.806,1002.0,24200,1018.0,1000.0
961,2018/07/27,1022.0,1023.395,1021.0,21000,1045.0,1018.0
962,2018/07/30,1019.0,1018.374,1025.0,21100,1025.0,1011.0
963,2018/07/31,1038.0,1028.238,1019.0,33200,1039.0,1009.0
964,2018/08/01,1050.0,1045.54,1040.0,42800,1050.0,1040.0
965,2018/08/02,1015.0,1022.02,1033.0,74300,1034.0,1013.0
966,2018/08/03,1007.0,1012.827,1015.0,16200,1021.0,1007.0
967,2018/08/06,992.0,999.249,1007.0,17700,1008.0,992.0
968,2018/08/07,985.0,984.752,991.0,22200,992.0,979.0
969,2018/08/08,991.0,992.663,982.0,16000,999.0,982.0
970,2018/08/09,987.0,989.295,991.0,11200,992.0,987.0
971,2018/08/10,984.0,984.369,986.0,17900,989.0,981.0
972,2018/08/13,972.0,976.377,984.0,31000,985.0,969.0
973,2018/08/14,980.0,977.258,975.0,21300,982.0,973.0
974,2018/08/15,970.0,975.647,980.0,15300,982.0,970.0
975,2018/08/16,956.0,959.262,970.0,25600,970.0,954.0
976,2018/08/17,954.0,955.895,957.0,23700,962.0,951.0
977,2018/08/20,956.0,953.094,952.0,20300,956.0,951.0
978,2018/08/21,970.0,961.025,955.0,23900,971.0,950.0
979,2018/08/22,973.0,971.157,972.0,10200,974.0,966.0
980,2018/08/23,976.0,973.573,973.0,11700,978.0,968.0
981,2018/08/24,979.0,980.43,983.0,8600,983.0,978.0
982,2018/08/27,991.0,985.762,980.0,23500,991.0,978.0
983,2018/08/28,989.0,987.369,996.0,17600,996.0,980.0
984,2018/08/29,984.0,983.75,989.0,12000,991.0,981.0
985,2018/08/30,975.0,976.492,984.0,13000,984.0,971.0
986,2018/08/31,970.0,971.99,975.0,10400,976.0,970.0
987,2018/09/03,963.0,967.116,975.0,14600,975.0,960.0
988,2018/09/04,959.0,960.049,963.0,10200,965.0,956.0
989,2018/09/05,959.0,960.41,960.0,12200,964.0,959.0
990,2018/09/06,953.0,956.347,959.0,17300,962.0,952.0
991,2018/09/07,950.0,949.472,951.0,28600,953.0,946.0
992,2018/09/10,952.0,951.25,950.0,10000,953.0,949.0
993,2018/09/11,958.0,957.362,955.0,14100,961.0,953.0
994,2018/09/12,945.0,947.027,958.0,33400,958.0,935.0
995,2018/09/13,952.0,950.856,943.0,11800,958.0,943.0
996,2018/09/14,960.0,956.226,953.0,29600,964.0,953.0
997,2018/09/18,975.0,969.108,960.0,19500,975.0,959.0
998,2018/09/19,983.0,981.016,975.0,25100,986.0,975.0
999,2018/09/20,987.0,984.842,983.0,15200,988.0,981.0
1000,2018/09/21,991.0,989.598,986.0,25400,993.0,984.0
1001,2018/09/25,1012.0,1003.707,991.0,40300,1012.0,991.0
1002,2018/09/26,1026.0,1019.653,1014.0,28500,1029.0,1013.0
1003,2018/09/27,1002.0,1012.244,1025.0,16400,1025.0,999.0
1004,2018/09/28,1001.0,1004.218,1002.0,17900,1014.0,998.0
1005,2018/10/01,993.0,996.88,993.0,10800,1005.0,993.0
1006,2018/10/02,994.0,997.647,995.0,18400,1008.0,994.0
1007,2018/10/03,980.0,986.823,1000.0,14100,1000.0,980.0
1008,2018/10/04,983.0,984.076,981.0,10500,988.0,981.0
1009,2018/10/05,976.0,977.364,984.0,15100,984.0,974.0
1010,2018/10/09,948.0,951.634,976.0,42600,976.0,944.0
1011,2018/10/10,949.0,953.74,956.0,26500,960.0,949.0
1012,2018/10/11,943.0,939.857,945.0,39900,946.0,934.0
1013,2018/10/12,939.0,932.938,925.0,60900,944.0,925.0
1014,2018/10/15,909.0,920.843,924.0,84600,931.0,909.0
1015,2018/10/16,900.0,901.344,899.0,55300,909.0,898.0
1016,2018/10/17,927.0,921.873,913.0,16500,932.0,911.0
1017,2018/10/18,922.0,926.635,931.0,15600,933.0,921.0
1018,2018/10/19,919.0,917.634,918.0,19400,923.0,911.0
1019,2018/10/22,919.0,914.311,915.0,26400,922.0,906.0
1020,2018/10/23,900.0,904.688,912.0,25300,912.0,900.0
1021,2018/10/24,913.0,906.233,902.0,33000,916.0,898.0
1022,2018/10/25,893.0,893.684,898.0,37000,901.0,889.0
1023,2018/10/26,888.0,889.838,895.0,29600,903.0,881.0
1024,2018/10/29,881.0,887.099,885.0,20200,897.0,881.0
1025,2018/10/30,897.0,893.728,881.0,42600,902.0,879.0
1026,2018/10/31,917.0,912.078,905.0,23200,917.0,901.0
1027,2018/11/01,915.0,914.962,921.0,23500,921.0,909.0
1028,2018/11/02,906.0,895.183,885.0,49700,906.0,885.0
1029,2018/11/05,895.0,896.426,900.0,16200,904.0,892.0
1030,2018/11/06,888.0,889.689,895.0,25400,896.0,885.0
1031,2018/11/07,895.0,896.768,888.0,18100,904.0,888.0
1032,2018/11/08,905.0,904.791,901.0,15300,909.0,901.0
1033,2018/11/09,907.0,907.507,907.0,15400,912.0,905.0
1034,2018/11/12,901.0,905.828,907.0,18000,912.0,901.0
1035,2018/11/13,891.0,892.325,900.0,23100,900.0,886.0
1036,2018/11/14,890.0,891.469,894.0,16000,898.0,889.0
1037,2018/11/15,894.0,890.413,890.0,16000,895.0,887.0
1038,2018/11/16,897.0,895.147,895.0,15600,903.0,891.0
1039,2018/11/19,903.0,902.011,899.0,9000,906.0,899.0
1040,2018/11/20,904.0,900.94,901.0,11700,904.0,896.0
1041,2018/11/21,893.0,892.44,896.0,19300,898.0,888.0
1042,2018/11/22,897.0,894.68,894.0,12200,899.0,889.0
1043,2018/11/26,893.0,895.611,897.0,9500,898.0,893.0
1044,2018/11/27,894.0,894.306,899.0,14700,899.0,891.0
1045,2018/11/28,905.0,902.942,900.0,13900,906.0,898.0
1046,2018/11/29,913.0,911.548,912.0,16600,918.0,908.0
1047,2018/11/30,914.0,912.314,913.0,10200,914.0,908.0
1048,2018/12/03,914.0,913.7,915.0,12000,916.0,910.0
1049,2018/12/04,902.0,906.317,916.0,15800,916.0,902.0
1050,2018/12/05,894.0,897.164,900.0,31800,904.0,891.0
1051,2018/12/06,897.0,892.943,894.0,24500,899.0,888.0
1052,2018/12/07,892.0,894.446,900.0,19500,904.0,889.0
1053,2018/12/10,881.0,885.16,890.0,27500,891.0,881.0
1054,2018/12/11,882.0,882.341,888.0,13800,888.0,880.0
1055,2018/12/12,891.0,891.066,882.0,21300,897.0,882.0
1056,2018/12/13,890.0,891.087,895.0,27500,897.0,886.0
1057,2018/12/14,882.0,887.763,890.0,33700,891.0,882.0
1058,2018/12/17,888.0,883.906,886.0,76700,888.0,881.0
1059,2018/12/18,858.0,865.293,878.0,35100,878.0,855.0
1060,2018/12/19,846.0,849.13,858.0,29300,858.0,842.0
1061,2018/12/20,812.0,825.232,842.0,38300,845.0,812.0
1062,2018/12/21,780.0,786.403,809.0,48400,809.0,772.0
1063,2018/12/25,739.0,741.737,765.0,55500,765.0,725.0
1064,2018/12/26,764.0,761.511,750.0,35400,775.0,750.0
1065,2018/12/27,837.0,818.98,800.0,29700,837.0,796.0
1066,2018/12/28,838.0,836.201,841.0,21900,841.0,830.0
1067,2019/01/04,816.0,814.636,823.0,41500,830.0,792.0
1068,2019/01/07,836.0,834.036,841.0,33000,844.0,820.0
1069,2019/01/08,837.0,835.745,836.0,20800,842.0,826.0
1070,2019/01/09,851.0,848.206,839.0,18000,852.0,839.0
1071,2019/01/10,837.0,837.976,851.0,20400,851.0,828.0
1072,2019/01/11,835.0,837.063,839.0,14400,844.0,832.0
1073,2019/01/15,815.0,819.832,835.0,56600,836.0,810.0
1074,2019/01/16,800.0,804.182,811.0,42800,816.0,800.0
1075,2019/01/17,813.0,807.008,801.0,24200,813.0,801.0
1076,2019/01/18,827.0,827.513,815.0,22400,835.0,815.0
1077,2019/01/21,822.0,825.081,839.0,41900,839.0,817.0
1078,2019/01/22,823.0,821.081,828.0,23500,828.0,816.0
1079,2019/01/23,817.0,817.061,815.0,21200,822.0,815.0
1080,2019/01/24,829.0,826.464,820.0,25200,834.0,813.0
1081,2019/01/25,827.0,832.541,833.0,27900,841.0,826.0
1082,2019/01/28,807.0,812.028,827.0,38700,827.0,807.0
1083,2019/01/29,791.0,795.479,800.0,70500,807.0,789.0
1084,2019/01/30,770.0,777.645,792.0,67900,792.0,770.0
1085,2019/01/31,780.0,780.783,775.0,36000,788.0,774.0
1086,2019/02/01,766.0,772.305,781.0,39000,782.0,766.0
1087,2019/02/04,779.0,775.661,772.0,30700,779.0,769.0
1088,2019/02/05,789.0,788.203,780.0,22700,793.0,780.0
1089,2019/02/06,797.0,796.33,789.0,22400,802.0,789.0
1090,2019/02/07,789.0,788.798,792.0,17800,796.0,785.0
1091,2019/02/08,782.0,784.005,785.0,20100,790.0,780.0
1092,2019/02/12,790.0,785.706,782.0,32600,792.0,778.0
1093,2019/02/13,799.0,793.665,795.0,16700,799.0,789.0
1094,2019/02/14,804.0,802.435,797.0,14700,805.0,797.0
1095,2019/02/15,801.0,800.207,804.0,11600,804.0,795.0
1096,2019/02/18,817.0,813.765,809.0,20400,817.0,809.0
1097,2019/02/19,819.0,820.52,820.0,15400,825.0,817.0
1098,2019/02/20,825.0,822.667,820.0,11100,826.0,817.0
1099,2019/02/21,828.0,828.224,829.0,11600,830.0,824.0
1100,2019/02/22,814.0,818.315,828.0,20000,828.0,813.0
1101,2019/02/25,822.0,822.665,824.0,21500,825.0,816.0
1102,2019/02/26,834.0,829.969,829.0,16200,834.0,826.0
1103,2019/02/27,832.0,833.246,837.0,17500,839.0,829.0
1104,2019/02/28,836.0,833.518,833.0,14300,838.0,829.0
1105,2019/03/01,839.0,839.368,845.0,12500,845.0,834.0
1106,2019/03/04,846.0,845.21,846.0,14800,848.0,841.0
1107,2019/03/05,843.0,842.42,845.0,13100,845.0,840.0
1108,2019/03/06,836.0,837.701,843.0,17400,844.0,835.0
1109,2019/03/07,825.0,827.368,836.0,26900,836.0,821.0
1110,2019/03/08,805.0,809.567,816.0,36700,820.0,801.0
1111,2019/03/11,828.0,821.589,813.0,18500,828.0,811.0
1112,2019/03/12,840.0,837.887,828.0,28200,844.0,828.0
1113,2019/03/13,834.0,837.749,840.0,20300,844.0,832.0
1114,2019/03/14,836.0,835.46,840.0,12400,840.0,830.0
1115,2019/03/15,846.0,844.355,837.0,21700,847.0,837.0
1116,2019/03/18,862.0,853.617,850.0,41200,862.0,841.0
1117,2019/03/19,859.0,856.351,863.0,17400,863.0,848.0
1118,2019/03/20,855.0,855.092,855.0,18400,861.0,851.0
1119,2019/03/22,854.0,850.934,854.0,21200,856.0,844.0
1120,2019/03/25,839.0,840.968,852.0,25200,852.0,834.0
1121,2019/03/26,873.0,862.888,839.0,69900,874.0,839.0
1122,2019/03/27,887.0,881.607,875.0,36600,889.0,874.0
1123,2019/03/28,870.0,872.446,886.0,28500,886.0,866.0
1124,2019/03/29,865.0,868.192,872.0,29100,873.0,862.0
1125,2019/04/01,875.0,877.594,874.0,45800,885.0,871.0
1126,2019/04/02,857.0,865.443,878.0,37500,878.0,856.0
1127,2019/04/03,859.0,856.127,856.0,23700,861.0,850.0
1128,2019/04/04,872.0,868.232,865.0,14200,872.0,864.0
1129,2019/04/05,866.0,866.155,868.0,21900,875.0,857.0
1130,2019/04/08,865.0,865.292,868.0,15400,869.0,861.0
1131,2019/04/09,853.0,854.258,863.0,33400,864.0,848.0
1132,2019/04/10,857.0,849.724,850.0,12300,857.0,841.0
1133,2019/04/11,866.0,862.025,853.0,12200,870.0,853.0
1134,2019/04/12,872.0,868.828,866.0,18600,873.0,866.0
1135,2019/04/15,879.0,876.103,874.0,31000,879.0,873.0
1136,2019/04/16,877.0,877.256,879.0,25000,879.0,873.0
1137,2019/04/17,875.0,873.971,877.0,13600,877.0,870.0
1138,2019/04/18,866.0,870.468,876.0,23700,876.0,865.0
1139,2019/04/19,862.0,865.75,868.0,20000,874.0,860.0
1140,2019/04/22,876.0,866.414,862.0,19800,877.0,859.0
1141,2019/04/23,881.0,878.488,877.0,20500,882.0,873.0
1142,2019/04/24,876.0,878.711,880.0,19000,886.0,874.0
1143,2019/04/25,879.0,878.918,880.0,19600,881.0,875.0
1144,2019/04/26,881.0,881.372,878.0,23100,888.0,876.0
1145,2019/05/07,880.0,879.079,880.0,30400,882.0,874.0
1146,2019/05/08,870.0,871.631,876.0,29800,877.0,867.0
1147,2019/05/09,861.0,863.19,870.0,29000,870.0,860.0
1148,2019/05/10,862.0,865.132,861.0,30300,878.0,860.0
1149,2019/05/13,847.0,856.662,862.0,53900,865.0,846.0
1150,2019/05/14,858.0,842.39,832.0,24600,858.0,824.0
1151,2019/05/15,855.0,856.445,858.0,51200,863.0,849.0
1152,2019/05/16,863.0,857.627,856.0,19300,863.0,851.0
1153,2019/05/17,873.0,867.316,866.0,32900,873.0,862.0
1154,2019/05/20,884.0,878.165,873.0,37500,886.0,873.0
1155,2019/05/21,879.0,877.402,878.0,20900,879.0,874.0
1156,2019/05/22,879.0,881.13,880.0,16100,884.0,879.0
1157,2019/05/23,877.0,879.02,878.0,20400,886.0,877.0
1158,2019/05/24,884.0,878.568,877.0,26400,885.0,870.0
1159,2019/05/27,895.0,885.884,884.0,98000,895.0,883.0
1160,2019/05/28,889.0,892.308,895.0,31200,895.0,888.0
1161,2019/05/29,884.0,882.1,884.0,51000,886.0,876.0
1162,2019/05/30,880.0,877.858,877.0,61100,884.0,877.0
1163,2019/05/31,863.0,872.722,878.0,68300,880.0,862.0
1164,2019/06/03,857.0,855.061,853.0,94600,864.0,851.0
1165,2019/06/04,858.0,855.892,857.0,57600,860.0,852.0
1166,2019/06/05,870.0,866.366,866.0,79900,871.0,861.0
1167,2019/06/06,870.0,871.873,870.0,138100,880.0,867.0
1168,2019/06/07,878.0,877.076,877.0,63300,879.0,871.0
1169,2019/06/10,884.0,884.192,880.0,41600,888.0,880.0
1170,2019/06/11,883.0,884.155,885.0,30300,886.0,880.0
1171,2019/06/12,871.0,876.549,883.0,78700,883.0,871.0
1172,2019/06/13,862.0,862.29,866.0,101300,866.0,857.0
1173,2019/06/14,859.0,859.447,860.0,88900,863.0,855.0
1174,2019/06/17,848.0,855.158,857.0,387700,863.0,847.0
1175,2019/06/18,845.0,848.873,850.0,305800,852.0,838.0
1176,2019/06/19,848.0,846.894,850.0,74200,851.0,843.0
1177,2019/06/20,846.0,850.569,853.0,50100,855.0,846.0
1178,2019/06/21,878.0,865.185,846.0,220300,883.0,838.0
1179,2019/06/24,855.0,862.291,872.0,72100,872.0,854.0
1180,2019/06/25,849.0,853.852,857.0,68100,860.0,846.0
1181,2019/06/26,829.0,836.523,841.0,65600,844.0,829.0
1182,2019/06/27,823.0,826.228,832.0,29000,833.0,822.0
1183,2019/06/28,815.0,818.545,823.0,29000,823.0,815.0
1184,2019/07/01,833.0,828.497,822.0,34200,837.0,819.0
1185,2019/07/02,844.0,841.035,834.0,37400,847.0,834.0
1186,2019/07/03,848.0,846.352,843.0,32700,850.0,842.0
1187,2019/07/04,858.0,859.039,855.0,36100,863.0,855.0
1188,2019/07/05,860.0,861.0,860.0,36800,867.0,859.0
1189,2019/07/08,840.0,847.024,855.0,25400,855.0,840.0
1190,2019/07/09,835.0,840.284,852.0,25700,852.0,834.0
1191,2019/07/10,833.0,834.277,830.0,33900,838.0,830.0
1192,2019/07/11,838.0,838.214,839.0,14000,840.0,835.0
1193,2019/07/12,840.0,842.312,840.0,20200,848.0,838.0
1194,2019/07/16,847.0,844.698,848.0,39400,851.0,840.0
1195,2019/07/17,833.0,838.357,845.0,24100,847.0,833.0
1196,2019/07/18,813.0,818.517,833.0,51600,833.0,813.0
1197,2019/07/19,828.0,826.163,818.0,14100,829.0,818.0
1198,2019/07/22,819.0,823.197,828.0,25400,828.0,817.0
1199,2019/07/23,824.0,826.333,820.0,9900,831.0,820.0
1200,2019/07/24,825.0,824.548,825.0,17700,828.0,821.0
1201,2019/07/25,824.0,826.369,827.0,10300,829.0,824.0
1202,2019/07/26,822.0,822.157,824.0,8900,824.0,818.0
1203,2019/07/29,823.0,821.764,822.0,12300,825.0,819.0
1204,2019/07/30,825.0,824.762,826.0,12600,827.0,821.0
1205,2019/07/31,827.0,829.34,822.0,14100,834.0,820.0
1206,2019/08/01,825.0,823.361,822.0,9700,825.0,821.0
1207,2019/08/02,822.0,821.067,820.0,31200,824.0,818.0
1208,2019/08/05,808.0,809.965,823.0,34200,823.0,803.0
1209,2019/08/06,808.0,802.166,800.0,29600,810.0,791.0
1210,2019/08/07,823.0,819.689,815.0,15100,826.0,809.0
1211,2019/08/08,824.0,824.644,819.0,8700,829.0,819.0
1212,2019/08/09,828.0,826.795,825.0,16100,829.0,821.0
1213,2019/08/13,828.0,826.74,828.0,24600,829.0,821.0
1214,2019/08/14,835.0,831.557,831.0,18500,835.0,827.0
1215,2019/08/15,833.0,827.214,825.0,15900,835.0,821.0
1216,2019/08/16,836.0,835.0,831.0,14800,840.0,830.0
1217,2019/08/19,838.0,837.979,835.0,9700,841.0,834.0
1218,2019/08/20,848.0,844.441,838.0,12700,848.0,838.0
1219,2019/08/21,843.0,841.838,838.0,6800,846.0,838.0
1220,2019/08/22,841.0,842.206,848.0,6300,848.0,840.0
1221,2019/08/23,836.0,837.169,844.0,6500,844.0,833.0
