,Date,Close,VWAP,Open,Volume,High,Low
0,2014/08/25,2222.0,2223.795,2222.0,45900,2236.0,2200.0
1,2014/08/26,2195.0,2205.593,2228.0,41300,2228.0,2193.0
2,2014/08/27,2187.0,2189.915,2183.0,62000,2205.0,2178.0
3,2014/08/28,2172.0,2173.952,2187.0,47900,2187.0,2164.0
4,2014/08/29,2149.0,2153.915,2165.0,57800,2183.0,2141.0
5,2014/09/01,2180.0,2163.45,2154.0,66900,2180.0,2147.0
6,2014/09/02,2175.0,2174.051,2160.0,54800,2189.0,2160.0
7,2014/09/03,2200.0,2194.934,2200.0,115100,2224.0,2178.0
8,2014/09/04,2158.0,2169.882,2186.0,59200,2190.0,2157.0
9,2014/09/05,2165.0,2166.01,2195.0,76900,2195.0,2152.0
10,2014/09/08,2173.0,2170.66,2185.0,88200,2186.0,2162.0
11,2014/09/09,2207.0,2203.158,2173.0,84300,2222.0,2167.0
12,2014/09/10,2249.0,2228.662,2207.0,117900,2250.0,2184.0
13,2014/09/11,2230.0,2244.728,2270.0,79800,2280.0,2223.0
14,2014/09/12,2233.0,2238.315,2238.0,110000,2258.0,2221.0
15,2014/09/16,2247.0,2253.404,2250.0,117600,2280.0,2230.0
16,2014/09/17,2245.0,2249.054,2250.0,96300,2268.0,2240.0
17,2014/09/18,2282.0,2275.277,2243.0,109800,2300.0,2243.0
18,2014/09/19,2300.0,2293.98,2282.0,121000,2305.0,2274.0
19,2014/09/22,2294.0,2293.049,2312.0,84000,2315.0,2281.0
20,2014/09/24,2276.0,2279.452,2275.0,119600,2300.0,2261.0
21,2014/09/25,2307.0,2297.464,2300.0,82300,2310.0,2280.0
22,2014/09/26,2268.0,2270.972,2229.0,79800,2300.0,2216.0
23,2014/09/29,2250.0,2246.179,2268.0,126000,2268.0,2221.0
24,2014/09/30,2200.0,2206.421,2243.0,101100,2250.0,2194.0
25,2014/10/01,2152.0,2176.495,2200.0,136400,2211.0,2150.0
26,2014/10/02,2074.0,2089.071,2108.0,195400,2110.0,2073.0
27,2014/10/03,2117.0,2102.885,2072.0,104100,2120.0,2072.0
28,2014/10/06,2115.0,2114.395,2120.0,101600,2143.0,2093.0
29,2014/10/07,2098.0,2103.57,2110.0,101500,2126.0,2091.0
30,2014/10/08,2086.0,2082.19,2075.0,108500,2105.0,2052.0
31,2014/10/09,2034.0,2047.591,2081.0,91100,2084.0,2030.0
32,2014/10/10,1984.0,1988.15,2000.0,99500,2007.0,1973.0
33,2014/10/14,1902.0,1924.552,1949.0,154700,1951.0,1900.0
34,2014/10/15,1935.0,1926.065,1905.0,95300,1944.0,1905.0
35,2014/10/16,1848.0,1868.089,1895.0,149500,1895.0,1843.0
36,2014/10/17,1774.0,1802.601,1808.0,310800,1845.0,1774.0
37,2014/10/20,1869.0,1844.721,1820.0,107800,1870.0,1820.0
38,2014/10/21,1829.0,1845.244,1869.0,129900,1869.0,1827.0
39,2014/10/22,1900.0,1886.33,1876.0,80900,1903.0,1869.0
40,2014/10/23,1888.0,1891.816,1901.0,72800,1908.0,1870.0
41,2014/10/24,1871.0,1878.573,1900.0,85100,1905.0,1866.0
42,2014/10/27,1862.0,1869.163,1895.0,61500,1900.0,1856.0
43,2014/10/28,1846.0,1850.345,1871.0,69800,1877.0,1840.0
44,2014/10/29,1885.0,1873.921,1874.0,82100,1886.0,1851.0
45,2014/10/30,1861.0,1868.732,1890.0,142500,1895.0,1861.0
46,2014/10/31,1931.0,1913.127,1901.0,177700,1936.0,1881.0
47,2014/11/04,1974.0,1993.082,2020.0,316300,2040.0,1958.0
48,2014/11/05,2020.0,2013.727,1994.0,245900,2035.0,1990.0
49,2014/11/06,1986.0,2008.162,2020.0,144400,2034.0,1980.0
50,2014/11/07,1993.0,2002.727,2011.0,113400,2017.0,1991.0
51,2014/11/10,2011.0,2001.307,1994.0,105100,2024.0,1982.0
52,2014/11/11,2052.0,2037.032,2028.0,110400,2054.0,2020.0
53,2014/11/12,2028.0,2050.755,2071.0,158100,2084.0,2018.0
54,2014/11/13,2058.0,2046.805,2035.0,107500,2060.0,2025.0
55,2014/11/14,2069.0,2064.437,2086.0,108000,2086.0,2044.0
56,2014/11/17,2003.0,2019.901,2066.0,71800,2066.0,2000.0
57,2014/11/18,2035.0,2031.424,2019.0,77200,2050.0,2000.0
58,2014/11/19,2047.0,2055.308,2059.0,85400,2079.0,2037.0
59,2014/11/20,2030.0,2039.955,2047.0,50900,2051.0,2028.0
60,2014/11/21,2020.0,2019.85,2023.0,60700,2044.0,2004.0
61,2014/11/25,2145.0,2116.046,2040.0,178900,2162.0,2040.0
62,2014/11/26,2292.0,2259.225,2150.0,437100,2318.0,2150.0
63,2014/11/27,2277.0,2284.5,2280.0,213500,2310.0,2256.0
64,2014/11/28,2245.0,2252.897,2277.0,136000,2282.0,2225.0
65,2014/12/01,2312.0,2299.313,2249.0,174400,2320.0,2249.0
66,2014/12/02,2373.0,2352.15,2315.0,153400,2379.0,2298.0
67,2014/12/03,2395.0,2404.478,2392.0,188900,2429.0,2380.0
68,2014/12/04,2445.0,2438.94,2425.0,122700,2466.0,2405.0
69,2014/12/05,2482.0,2477.506,2465.0,134300,2495.0,2448.0
70,2014/12/08,2466.0,2474.402,2500.0,63400,2500.0,2454.0
71,2014/12/09,2409.0,2423.943,2426.0,77200,2457.0,2404.0
72,2014/12/10,2355.0,2374.065,2409.0,161400,2415.0,2352.0
73,2014/12/11,2328.0,2311.747,2292.0,610200,2343.0,2288.0
74,2014/12/12,2350.0,2349.093,2327.0,153900,2374.0,2315.0
75,2014/12/15,2321.0,2329.643,2315.0,80700,2350.0,2306.0
76,2014/12/16,2262.0,2266.031,2308.0,127400,2320.0,2169.0
77,2014/12/17,2248.0,2255.136,2234.0,113600,2299.0,2231.0
78,2014/12/18,2311.0,2316.252,2303.0,72300,2338.0,2287.0
79,2014/12/19,2331.0,2340.254,2350.0,70900,2357.0,2317.0
80,2014/12/22,2327.0,2323.004,2349.0,53100,2349.0,2311.0
81,2014/12/24,2362.0,2367.969,2367.0,44400,2386.0,2352.0
82,2014/12/25,2349.0,2356.095,2348.0,32700,2370.0,2346.0
83,2014/12/26,2380.0,2368.405,2342.0,63000,2384.0,2335.0
84,2014/12/29,2364.0,2373.672,2397.0,46300,2398.0,2344.0
85,2014/12/30,2354.0,2360.739,2364.0,46400,2379.0,2328.0
86,2015/01/05,2356.0,2360.39,2354.0,39700,2383.0,2324.0
87,2015/01/06,2268.0,2286.854,2313.0,72800,2313.0,2266.0
88,2015/01/07,2249.0,2256.666,2248.0,41300,2274.0,2238.0
89,2015/01/08,2275.0,2275.773,2262.0,47500,2298.0,2255.0
90,2015/01/09,2274.0,2290.928,2290.0,62700,2318.0,2264.0
91,2015/01/13,2269.0,2250.573,2274.0,67200,2274.0,2222.0
92,2015/01/14,2201.0,2219.634,2241.0,65600,2269.0,2200.0
93,2015/01/15,2235.0,2222.903,2195.0,51300,2246.0,2195.0
94,2015/01/16,2170.0,2169.832,2185.0,87400,2188.0,2154.0
95,2015/01/19,2197.0,2194.2,2203.0,39000,2205.0,2173.0
96,2015/01/20,2231.0,2218.301,2200.0,36500,2238.0,2190.0
97,2015/01/21,2219.0,2225.28,2242.0,60000,2248.0,2208.0
98,2015/01/22,2204.0,2189.36,2208.0,62300,2208.0,2168.0
99,2015/01/23,2233.0,2230.21,2226.0,40900,2242.0,2214.0
100,2015/01/26,2223.0,2212.935,2183.0,21500,2226.0,2183.0
101,2015/01/27,2256.0,2250.212,2250.0,45700,2260.0,2232.0
102,2015/01/28,2273.0,2258.538,2248.0,47200,2283.0,2229.0
103,2015/01/29,2258.0,2258.083,2250.0,44400,2283.0,2249.0
104,2015/01/30,2283.0,2289.227,2260.0,71900,2320.0,2260.0
105,2015/02/02,2186.0,2203.993,2250.0,120000,2278.0,2172.0
106,2015/02/03,2144.0,2153.978,2187.0,135100,2193.0,2127.0
107,2015/02/04,2180.0,2174.892,2163.0,90000,2204.0,2149.0
108,2015/02/05,2147.0,2147.691,2185.0,58900,2185.0,2131.0
109,2015/02/06,2137.0,2142.527,2160.0,46100,2169.0,2130.0
110,2015/02/09,2134.0,2121.936,2145.0,104900,2148.0,2106.0
111,2015/02/10,2111.0,2100.779,2134.0,108500,2140.0,2080.0
112,2015/02/12,2129.0,2144.348,2130.0,94100,2175.0,2129.0
113,2015/02/13,2142.0,2138.329,2129.0,51100,2149.0,2129.0
114,2015/02/16,2149.0,2163.486,2146.0,56600,2184.0,2146.0
115,2015/02/17,2122.0,2133.359,2149.0,93300,2152.0,2120.0
116,2015/02/18,2180.0,2182.709,2149.0,171700,2207.0,2132.0
117,2015/02/19,2202.0,2202.493,2166.0,99600,2223.0,2160.0
118,2015/02/20,2182.0,2180.846,2202.0,105200,2210.0,2170.0
119,2015/02/23,2183.0,2177.685,2180.0,111400,2200.0,2161.0
120,2015/02/24,2166.0,2165.701,2180.0,104300,2198.0,2152.0
121,2015/02/25,2156.0,2157.919,2166.0,105500,2174.0,2146.0
122,2015/02/26,2148.0,2144.855,2162.0,106000,2164.0,2136.0
123,2015/02/27,2146.0,2141.794,2140.0,134700,2163.0,2122.0
124,2015/03/02,2162.0,2158.113,2145.0,110800,2178.0,2135.0
125,2015/03/03,2162.0,2159.692,2156.0,124800,2179.0,2141.0
126,2015/03/04,2189.0,2178.83,2162.0,172200,2199.0,2147.0
127,2015/03/05,2148.0,2152.405,2168.0,151700,2180.0,2139.0
128,2015/03/06,2195.0,2171.371,2151.0,185700,2196.0,2145.0
129,2015/03/09,2225.0,2226.738,2200.0,298300,2267.0,2186.0
130,2015/03/10,2232.0,2251.985,2250.0,238300,2293.0,2220.0
131,2015/03/11,2250.0,2264.085,2236.0,119200,2288.0,2236.0
132,2015/03/12,2269.0,2281.48,2263.0,111900,2303.0,2262.0
133,2015/03/13,2286.0,2294.129,2287.0,154700,2309.0,2275.0
134,2015/03/16,2283.0,2282.495,2286.0,108400,2299.0,2268.0
135,2015/03/17,2333.0,2335.133,2309.0,165700,2361.0,2301.0
136,2015/03/18,2353.0,2334.497,2355.0,129600,2358.0,2304.0
137,2015/03/19,2319.0,2319.843,2340.0,100800,2345.0,2304.0
138,2015/03/20,2321.0,2318.624,2319.0,80800,2331.0,2309.0
139,2015/03/23,2381.0,2368.028,2349.0,127700,2385.0,2327.0
140,2015/03/24,2369.0,2362.256,2380.0,112900,2380.0,2339.0
141,2015/03/25,2301.0,2311.085,2350.0,193000,2361.0,2274.0
142,2015/03/26,2275.0,2268.937,2294.0,128600,2294.0,2249.0
143,2015/03/27,2222.0,2237.04,2250.0,101300,2277.0,2203.0
144,2015/03/30,2193.0,2174.064,2208.0,206400,2227.0,2148.0
145,2015/03/31,2236.0,2224.259,2200.0,186400,2245.0,2200.0
146,2015/04/01,2226.0,2251.115,2300.0,257700,2318.0,2217.0
147,2015/04/02,2302.0,2264.799,2221.0,235500,2308.0,2194.0
148,2015/04/03,2255.0,2250.578,2285.0,149300,2286.0,2228.0
149,2015/04/06,2246.0,2224.139,2227.0,153200,2257.0,2192.0
150,2015/04/07,2331.0,2300.528,2243.0,198300,2332.0,2243.0
151,2015/04/08,2235.0,2247.848,2319.0,364600,2327.0,2231.0
152,2015/04/09,2238.0,2239.465,2240.0,176700,2258.0,2229.0
153,2015/04/10,2240.0,2234.713,2238.0,161600,2249.0,2212.0
154,2015/04/13,2230.0,2233.427,2249.0,70300,2253.0,2222.0
155,2015/04/14,2225.0,2226.782,2229.0,66600,2245.0,2221.0
156,2015/04/15,2260.0,2246.028,2225.0,145800,2263.0,2212.0
157,2015/04/16,2282.0,2289.591,2265.0,214100,2324.0,2257.0
158,2015/04/17,2199.0,2207.648,2242.0,223700,2250.0,2192.0
159,2015/04/20,2165.0,2169.723,2199.0,138600,2200.0,2155.0
160,2015/04/21,2172.0,2169.567,2169.0,101300,2188.0,2159.0
161,2015/04/22,2182.0,2178.209,2188.0,59400,2190.0,2171.0
162,2015/04/23,2182.0,2182.458,2185.0,72300,2200.0,2166.0
163,2015/04/24,2175.0,2173.151,2175.0,64300,2186.0,2165.0
164,2015/04/27,2176.0,2173.328,2175.0,45100,2186.0,2165.0
165,2015/04/28,2205.0,2208.815,2195.0,117700,2224.0,2190.0
166,2015/04/30,2170.0,2180.454,2203.0,84300,2203.0,2168.0
167,2015/05/01,2147.0,2144.234,2165.0,86500,2169.0,2133.0
168,2015/05/07,2219.0,2211.241,2160.0,206700,2229.0,2157.0
169,2015/05/08,2202.0,2202.585,2205.0,58500,2213.0,2187.0
170,2015/05/11,2219.0,2227.955,2221.0,106400,2245.0,2216.0
171,2015/05/12,2248.0,2237.801,2216.0,78500,2249.0,2214.0
172,2015/05/13,2264.0,2255.272,2249.0,69600,2269.0,2225.0
173,2015/05/14,2246.0,2252.033,2231.0,51000,2270.0,2231.0
174,2015/05/15,2530.0,2491.32,2400.0,740700,2545.0,2400.0
175,2015/05/18,2538.0,2525.538,2500.0,301000,2550.0,2478.0
176,2015/05/19,2587.0,2579.937,2550.0,327000,2611.0,2540.0
177,2015/05/20,2605.0,2615.589,2600.0,211600,2650.0,2587.0
178,2015/05/21,2743.0,2717.739,2640.0,307400,2753.0,2636.0
179,2015/05/22,2765.0,2767.599,2752.0,215100,2818.0,2698.0
180,2015/05/25,2854.0,2842.913,2784.0,212100,2879.0,2778.0
181,2015/05/26,2808.0,2833.473,2868.0,144600,2888.0,2804.0
182,2015/05/27,2876.0,2880.6,2830.0,312800,2933.0,2816.0
183,2015/05/28,2861.0,2863.69,2913.0,197000,2913.0,2833.0
184,2015/05/29,2890.0,2868.964,2859.0,153300,2897.0,2822.0
185,2015/06/01,2866.0,2852.401,2843.0,76500,2873.0,2831.0
186,2015/06/02,2818.0,2835.946,2866.0,103900,2866.0,2817.0
187,2015/06/03,2791.0,2790.467,2802.0,156000,2813.0,2755.0
188,2015/06/04,2841.0,2827.909,2804.0,99300,2848.0,2782.0
189,2015/06/05,2806.0,2810.51,2825.0,72000,2835.0,2797.0
190,2015/06/08,2808.0,2802.094,2806.0,67900,2821.0,2770.0
191,2015/06/09,2737.0,2764.734,2758.0,107400,2799.0,2736.0
192,2015/06/10,2713.0,2724.913,2728.0,155500,2759.0,2690.0
193,2015/06/11,2692.0,2674.316,2732.0,330000,2741.0,2633.0
194,2015/06/12,2688.0,2663.922,2649.0,310800,2704.0,2602.0
195,2015/06/15,2814.0,2799.554,2687.0,354400,2872.0,2679.0
196,2015/06/16,2853.0,2856.766,2812.0,208200,2890.0,2812.0
197,2015/06/17,2857.0,2862.473,2850.0,138800,2897.0,2832.0
198,2015/06/18,2846.0,2873.3,2870.0,105600,2925.0,2846.0
199,2015/06/19,2843.0,2847.047,2846.0,78500,2884.0,2825.0
200,2015/06/22,2821.0,2823.456,2843.0,149100,2880.0,2801.0
201,2015/06/23,2862.0,2850.67,2854.0,122400,2868.0,2825.0
202,2015/06/24,2878.0,2892.925,2888.0,119300,2915.0,2876.0
203,2015/06/25,2892.0,2898.763,2860.0,108900,2923.0,2857.0
204,2015/06/26,2849.0,2852.878,2920.0,102600,2920.0,2835.0
205,2015/06/29,2739.0,2744.829,2750.0,182200,2779.0,2699.0
206,2015/06/30,2756.0,2752.654,2740.0,210500,2803.0,2714.0
207,2015/07/01,2870.0,2850.585,2771.0,144900,2876.0,2756.0
208,2015/07/02,2858.0,2879.686,2890.0,103500,2920.0,2856.0
209,2015/07/03,2887.0,2872.916,2875.0,75400,2895.0,2836.0
210,2015/07/06,2808.0,2834.068,2871.0,105400,2882.0,2808.0
211,2015/07/07,2879.0,2882.529,2850.0,142900,2928.0,2843.0
212,2015/07/08,2751.0,2779.849,2857.0,116000,2858.0,2751.0
213,2015/07/09,2790.0,2729.746,2710.0,147400,2797.0,2638.0
214,2015/07/10,2721.0,2746.443,2790.0,131300,2814.0,2702.0
215,2015/07/13,2737.0,2727.748,2743.0,76500,2755.0,2698.0
216,2015/07/14,2909.0,2871.925,2820.0,196400,2917.0,2798.0
217,2015/07/15,2867.0,2866.438,2907.0,101900,2907.0,2841.0
218,2015/07/16,2877.0,2857.977,2867.0,79500,2887.0,2805.0
219,2015/07/17,2861.0,2857.542,2877.0,59400,2890.0,2838.0
220,2015/07/21,2852.0,2853.803,2872.0,59000,2886.0,2835.0
221,2015/07/22,2798.0,2799.86,2820.0,65200,2832.0,2781.0
222,2015/07/23,2808.0,2800.414,2810.0,46600,2822.0,2782.0
223,2015/07/24,2835.0,2830.193,2808.0,79900,2857.0,2804.0
224,2015/07/27,2789.0,2790.087,2835.0,71300,2835.0,2774.0
225,2015/07/28,2782.0,2769.596,2752.0,76000,2809.0,2724.0
226,2015/07/29,2763.0,2769.887,2800.0,73700,2810.0,2739.0
227,2015/07/30,2714.0,2739.559,2763.0,68000,2795.0,2703.0
228,2015/07/31,2741.0,2751.603,2764.0,159800,2810.0,2683.0
229,2015/08/03,2554.0,2542.849,2591.0,274800,2591.0,2510.0
230,2015/08/04,2564.0,2557.526,2554.0,173900,2608.0,2531.0
231,2015/08/05,2591.0,2585.618,2567.0,73500,2617.0,2550.0
232,2015/08/06,2664.0,2634.987,2613.0,124300,2675.0,2578.0
233,2015/08/07,2654.0,2650.531,2650.0,80800,2666.0,2622.0
234,2015/08/10,2718.0,2687.276,2660.0,60500,2720.0,2646.0
235,2015/08/11,2703.0,2703.301,2720.0,84400,2729.0,2677.0
236,2015/08/12,2638.0,2654.515,2654.0,75300,2689.0,2627.0
237,2015/08/13,2661.0,2645.882,2616.0,45900,2662.0,2616.0
238,2015/08/14,2639.0,2634.002,2643.0,55300,2648.0,2613.0
239,2015/08/17,2641.0,2627.009,2639.0,45300,2642.0,2605.0
240,2015/08/18,2668.0,2673.914,2636.0,76900,2700.0,2636.0
241,2015/08/19,2571.0,2594.168,2637.0,73400,2656.0,2571.0
242,2015/08/20,2528.0,2549.01,2571.0,50200,2582.0,2527.0
243,2015/08/21,2450.0,2465.177,2471.0,113500,2490.0,2446.0
244,2015/08/24,2304.0,2354.361,2358.0,93800,2412.0,2300.0
245,2015/08/25,2203.0,2244.097,2200.0,124600,2350.0,2160.0
246,2015/08/26,2266.0,2238.209,2204.0,98700,2287.0,2184.0
247,2015/08/27,2255.0,2281.476,2340.0,80200,2340.0,2251.0
248,2015/08/28,2337.0,2336.782,2337.0,60900,2357.0,2311.0
249,2015/08/31,2293.0,2287.411,2340.0,82000,2342.0,2256.0
250,2015/09/01,2195.0,2214.032,2284.0,138700,2285.0,2182.0
251,2015/09/02,2069.0,2088.549,2100.0,242800,2145.0,2060.0
252,2015/09/03,2192.0,2190.414,2169.0,244200,2228.0,2146.0
253,2015/09/04,2107.0,2134.64,2176.0,155300,2188.0,2100.0
254,2015/09/07,2122.0,2112.266,2080.0,98900,2158.0,2061.0
255,2015/09/08,2053.0,2084.782,2105.0,118400,2147.0,2049.0
256,2015/09/09,2153.0,2156.294,2161.0,159000,2190.0,2126.0
257,2015/09/10,2105.0,2104.786,2151.0,129900,2152.0,2075.0
258,2015/09/11,2120.0,2090.016,2056.0,116400,2140.0,2056.0
259,2015/09/14,2110.0,2124.415,2150.0,69100,2170.0,2102.0
260,2015/09/15,2140.0,2155.322,2130.0,72900,2177.0,2128.0
261,2015/09/16,2129.0,2139.419,2170.0,63500,2182.0,2117.0
262,2015/09/17,2210.0,2190.623,2147.0,92600,2216.0,2146.0
263,2015/09/18,2155.0,2159.075,2210.0,77500,2210.0,2146.0
264,2015/09/24,2056.0,2078.6,2119.0,145100,2121.0,2056.0
265,2015/09/25,2103.0,2072.187,2059.0,102900,2103.0,2047.0
266,2015/09/28,2114.0,2108.64,2102.0,75800,2127.0,2068.0
267,2015/09/29,2006.0,2028.665,2050.0,109700,2056.0,2005.0
268,2015/09/30,2087.0,2090.945,2047.0,103900,2116.0,2045.0
269,2015/10/01,2138.0,2131.979,2131.0,85300,2155.0,2109.0
270,2015/10/02,2149.0,2119.648,2095.0,85400,2152.0,2076.0
271,2015/10/05,2157.0,2149.017,2172.0,69100,2172.0,2122.0
272,2015/10/06,2157.0,2181.004,2158.0,128200,2226.0,2153.0
273,2015/10/07,2171.0,2161.082,2160.0,148100,2179.0,2137.0
274,2015/10/08,2171.0,2156.528,2148.0,89600,2176.0,2131.0
275,2015/10/09,2208.0,2195.389,2172.0,101400,2215.0,2172.0
276,2015/10/13,2194.0,2206.959,2210.0,71500,2237.0,2187.0
277,2015/10/14,2165.0,2162.982,2187.0,81000,2190.0,2140.0
278,2015/10/15,2213.0,2203.352,2165.0,75500,2224.0,2155.0
279,2015/10/16,2203.0,2223.871,2230.0,78300,2265.0,2200.0
280,2015/10/19,2174.0,2180.954,2210.0,63400,2210.0,2162.0
281,2015/10/20,2177.0,2170.603,2178.0,66700,2198.0,2151.0
282,2015/10/21,2249.0,2232.429,2178.0,77600,2249.0,2178.0
283,2015/10/22,2242.0,2251.857,2212.0,63600,2289.0,2200.0
284,2015/10/23,2293.0,2288.69,2293.0,66700,2297.0,2268.0
285,2015/10/26,2338.0,2351.914,2324.0,112100,2380.0,2310.0
286,2015/10/27,2298.0,2309.954,2337.0,69200,2346.0,2288.0
287,2015/10/28,2271.0,2269.4,2279.0,92400,2304.0,2251.0
288,2015/10/29,2338.0,2314.218,2302.0,119100,2338.0,2276.0
289,2015/10/30,2346.0,2335.818,2345.0,102600,2358.0,2291.0
290,2015/11/02,2078.0,2078.528,2030.0,281700,2125.0,2010.0
291,2015/11/04,2157.0,2142.785,2114.0,220000,2175.0,2114.0
292,2015/11/05,2147.0,2139.674,2157.0,120900,2161.0,2107.0
293,2015/11/06,2150.0,2147.303,2162.0,78000,2162.0,2133.0
294,2015/11/09,2171.0,2169.414,2170.0,130700,2184.0,2149.0
295,2015/11/10,2175.0,2161.29,2171.0,105500,2178.0,2125.0
296,2015/11/11,2181.0,2176.508,2165.0,86300,2196.0,2157.0
297,2015/11/12,2202.0,2198.43,2195.0,105500,2213.0,2175.0
298,2015/11/13,2197.0,2193.376,2196.0,81100,2205.0,2180.0
299,2015/11/16,2159.0,2153.515,2165.0,50500,2168.0,2132.0
300,2015/11/17,2171.0,2182.27,2161.0,123600,2202.0,2156.0
301,2015/11/18,2182.0,2183.93,2174.0,58400,2196.0,2170.0
302,2015/11/19,2195.0,2191.345,2199.0,82400,2203.0,2175.0
303,2015/11/20,2215.0,2206.316,2195.0,55100,2218.0,2190.0
304,2015/11/24,2207.0,2201.674,2205.0,70000,2215.0,2187.0
305,2015/11/25,2101.0,2117.839,2176.0,239600,2187.0,2101.0
306,2015/11/26,2110.0,2108.99,2112.0,109800,2124.0,2102.0
307,2015/11/27,2133.0,2138.947,2124.0,142500,2162.0,2112.0
308,2015/11/30,2134.0,2132.265,2139.0,63800,2148.0,2120.0
309,2015/12/01,2169.0,2151.753,2134.0,121700,2169.0,2116.0
310,2015/12/02,2151.0,2154.236,2169.0,61800,2169.0,2146.0
311,2015/12/03,2148.0,2135.698,2131.0,54900,2148.0,2123.0
312,2015/12/04,2097.0,2091.313,2110.0,174900,2115.0,2080.0
313,2015/12/07,2111.0,2117.77,2120.0,85600,2132.0,2110.0
314,2015/12/08,2099.0,2098.952,2115.0,78500,2125.0,2083.0
315,2015/12/09,2100.0,2103.825,2084.0,99800,2122.0,2079.0
316,2015/12/10,2080.0,2088.562,2100.0,112800,2109.0,2080.0
317,2015/12/11,2116.0,2111.137,2080.0,145700,2145.0,2080.0
318,2015/12/14,2087.0,2073.05,2080.0,91000,2089.0,2057.0
319,2015/12/15,2070.0,2074.482,2101.0,106500,2109.0,2055.0
320,2015/12/16,2122.0,2119.262,2088.0,82400,2137.0,2088.0
321,2015/12/17,2153.0,2165.372,2170.0,89700,2186.0,2145.0
322,2015/12/18,2114.0,2138.305,2153.0,96100,2183.0,2106.0
323,2015/12/21,2078.0,2071.772,2089.0,87300,2100.0,2052.0
324,2015/12/22,2080.0,2087.419,2080.0,77500,2108.0,2064.0
325,2015/12/24,2047.0,2064.961,2104.0,81200,2110.0,2042.0
326,2015/12/25,2036.0,2040.522,2040.0,95300,2057.0,2027.0
327,2015/12/28,2102.0,2093.521,2065.0,70000,2106.0,2065.0
328,2015/12/29,2136.0,2126.059,2102.0,56400,2140.0,2097.0
329,2015/12/30,2128.0,2134.662,2149.0,55300,2149.0,2122.0
330,2016/01/04,2085.0,2093.604,2123.0,54100,2140.0,2071.0
331,2016/01/05,2047.0,2061.535,2074.0,84100,2094.0,2042.0
332,2016/01/06,2036.0,2043.107,2064.0,89400,2082.0,2021.0
333,2016/01/07,1979.0,2001.381,2035.0,107400,2050.0,1977.0
334,2016/01/08,1956.0,1968.835,1970.0,88200,1996.0,1950.0
335,2016/01/12,1878.0,1905.751,1949.0,97700,1951.0,1875.0
336,2016/01/13,1960.0,1950.457,1949.0,55100,1963.0,1922.0
337,2016/01/14,1898.0,1892.941,1900.0,99900,1914.0,1869.0
338,2016/01/15,1903.0,1919.214,1937.0,91300,1959.0,1890.0
339,2016/01/18,1901.0,1874.862,1869.0,73900,1911.0,1826.0
340,2016/01/19,1915.0,1908.899,1885.0,62200,1939.0,1876.0
341,2016/01/20,1820.0,1863.593,1915.0,103400,1917.0,1819.0
342,2016/01/21,1804.0,1853.357,1829.0,93800,1905.0,1802.0
343,2016/01/22,1915.0,1882.664,1884.0,86800,1916.0,1845.0
344,2016/01/25,1952.0,1952.209,1995.0,66400,1995.0,1925.0
345,2016/01/26,1877.0,1887.695,1900.0,83700,1912.0,1868.0
346,2016/01/27,1960.0,1948.169,1894.0,84700,1993.0,1894.0
347,2016/01/28,1900.0,1919.383,1949.0,84800,1949.0,1900.0
348,2016/01/29,1970.0,1926.549,1920.0,75400,1970.0,1882.0
349,2016/02/01,2090.0,2054.607,1997.0,134700,2095.0,1976.0
350,2016/02/02,2062.0,2069.495,2049.0,86300,2094.0,2035.0
351,2016/02/03,2009.0,2006.388,2012.0,76100,2022.0,1990.0
352,2016/02/04,1957.0,1974.756,1976.0,75300,2002.0,1950.0
353,2016/02/05,1932.0,1927.186,1919.0,62000,1945.0,1908.0
354,2016/02/08,1950.0,1928.041,1892.0,61300,1969.0,1876.0
355,2016/02/09,1827.0,1846.462,1858.0,90900,1889.0,1820.0
356,2016/02/10,1793.0,1811.458,1850.0,91400,1883.0,1770.0
357,2016/02/12,1690.0,1716.593,1750.0,110000,1750.0,1680.0
358,2016/02/15,1834.0,1807.449,1780.0,63100,1848.0,1766.0
359,2016/02/16,1868.0,1876.818,1840.0,71600,1920.0,1828.0
360,2016/02/17,1827.0,1848.611,1854.0,49600,1915.0,1804.0
361,2016/02/18,1858.0,1864.975,1867.0,97100,1894.0,1835.0
362,2016/02/19,1823.0,1830.173,1858.0,71500,1873.0,1805.0
363,2016/02/22,1799.0,1808.345,1808.0,177200,1867.0,1784.0
364,2016/02/23,1832.0,1834.443,1834.0,87300,1862.0,1814.0
365,2016/02/24,1822.0,1832.473,1812.0,80800,1865.0,1810.0
366,2016/02/25,1856.0,1837.859,1836.0,83500,1869.0,1806.0
367,2016/02/26,1855.0,1856.35,1865.0,55500,1889.0,1835.0
368,2016/02/29,1848.0,1880.349,1891.0,60100,1914.0,1848.0
369,2016/03/01,1835.0,1830.633,1829.0,72700,1852.0,1795.0
370,2016/03/02,1923.0,1913.959,1880.0,76300,1938.0,1876.0
371,2016/03/03,1855.0,1879.849,1909.0,160000,1923.0,1849.0
372,2016/03/04,1904.0,1883.521,1846.0,150800,1920.0,1841.0
373,2016/03/07,1888.0,1893.734,1901.0,48800,1915.0,1876.0
374,2016/03/08,1859.0,1870.607,1890.0,58000,1910.0,1833.0
375,2016/03/09,1814.0,1814.51,1840.0,60400,1840.0,1791.0
376,2016/03/10,1845.0,1838.633,1824.0,88500,1857.0,1809.0
377,2016/03/11,1826.0,1820.735,1810.0,116600,1837.0,1806.0
378,2016/03/14,1860.0,1859.787,1856.0,84400,1872.0,1848.0
379,2016/03/15,1787.0,1798.65,1850.0,313400,1859.0,1780.0
380,2016/03/16,1771.0,1773.945,1769.0,141200,1786.0,1755.0
381,2016/03/17,1769.0,1775.386,1789.0,134900,1800.0,1752.0
382,2016/03/18,1761.0,1764.385,1769.0,154900,1785.0,1753.0
383,2016/03/22,1798.0,1797.476,1787.0,100000,1817.0,1780.0
384,2016/03/23,1785.0,1789.761,1809.0,66100,1815.0,1775.0
385,2016/03/24,1798.0,1790.268,1775.0,116900,1806.0,1759.0
386,2016/03/25,1809.0,1804.753,1799.0,70700,1812.0,1790.0
387,2016/03/28,1827.0,1821.057,1820.0,62700,1835.0,1800.0
388,2016/03/29,1827.0,1819.674,1812.0,58500,1833.0,1806.0
389,2016/03/30,1798.0,1802.37,1824.0,41100,1824.0,1793.0
390,2016/03/31,1794.0,1810.126,1801.0,90000,1835.0,1794.0
391,2016/04/01,1713.0,1731.091,1785.0,137400,1785.0,1707.0
392,2016/04/04,1703.0,1712.068,1719.0,69600,1750.0,1690.0
393,2016/04/05,1643.0,1663.499,1682.0,111800,1710.0,1642.0
394,2016/04/06,1628.0,1633.297,1641.0,90300,1658.0,1621.0
395,2016/04/07,1628.0,1629.865,1625.0,50300,1655.0,1614.0
396,2016/04/08,1675.0,1648.14,1606.0,95600,1696.0,1600.0
397,2016/04/11,1646.0,1647.897,1675.0,52400,1676.0,1624.0
398,2016/04/12,1671.0,1669.196,1642.0,50100,1680.0,1642.0
399,2016/04/13,1742.0,1726.68,1700.0,75000,1744.0,1699.0
400,2016/04/14,1805.0,1797.841,1769.0,139100,1818.0,1752.0
401,2016/04/15,1767.0,1772.139,1775.0,96700,1788.0,1759.0
402,2016/04/18,1749.0,1740.556,1726.0,70300,1762.0,1713.0
403,2016/04/19,1805.0,1798.05,1800.0,91500,1811.0,1779.0
404,2016/04/20,1773.0,1789.119,1808.0,88500,1818.0,1769.0
405,2016/04/21,1812.0,1800.526,1810.0,85800,1813.0,1782.0
406,2016/04/22,1815.0,1801.229,1800.0,112200,1816.0,1786.0
407,2016/04/25,1782.0,1789.257,1812.0,144500,1812.0,1778.0
408,2016/04/26,1756.0,1759.367,1776.0,110000,1776.0,1742.0
409,2016/04/27,1788.0,1795.688,1769.0,159200,1810.0,1755.0
410,2016/04/28,1769.0,1805.16,1811.0,169200,1850.0,1765.0
411,2016/05/02,1683.0,1682.611,1668.0,126300,1710.0,1668.0
412,2016/05/06,1661.0,1654.87,1680.0,93900,1680.0,1641.0
413,2016/05/09,1637.0,1649.76,1675.0,112600,1690.0,1637.0
414,2016/05/10,1670.0,1657.901,1637.0,121100,1682.0,1621.0
415,2016/05/11,1678.0,1684.988,1696.0,77200,1708.0,1669.0
416,2016/05/12,1691.0,1678.148,1652.0,66900,1691.0,1652.0
417,2016/05/13,1656.0,1672.327,1679.0,91500,1700.0,1653.0
418,2016/05/16,1610.0,1630.446,1648.0,164500,1667.0,1601.0
419,2016/05/17,1632.0,1624.515,1631.0,132200,1656.0,1612.0
420,2016/05/18,1601.0,1586.315,1614.0,291800,1628.0,1557.0
421,2016/05/19,1597.0,1598.627,1616.0,109700,1626.0,1585.0
422,2016/05/20,1596.0,1594.022,1592.0,81500,1604.0,1581.0
423,2016/05/23,1583.0,1575.491,1590.0,87300,1592.0,1560.0
424,2016/05/24,1571.0,1570.002,1581.0,124100,1582.0,1562.0
425,2016/05/25,1593.0,1592.013,1583.0,67300,1600.0,1583.0
426,2016/05/26,1572.0,1583.99,1595.0,72900,1607.0,1570.0
427,2016/05/27,1562.0,1562.303,1576.0,71600,1586.0,1554.0
428,2016/05/30,1578.0,1572.105,1561.0,74600,1579.0,1560.0
429,2016/05/31,1622.0,1609.012,1573.0,176900,1622.0,1571.0
430,2016/06/01,1620.0,1626.816,1622.0,100000,1647.0,1609.0
431,2016/06/02,1561.0,1568.25,1599.0,118800,1600.0,1556.0
432,2016/06/03,1539.0,1539.498,1553.0,107600,1553.0,1530.0
433,2016/06/06,1526.0,1511.378,1528.0,87800,1528.0,1489.0
434,2016/06/07,1517.0,1521.551,1535.0,49200,1545.0,1515.0
435,2016/06/08,1503.0,1496.231,1518.0,102400,1521.0,1485.0
436,2016/06/09,1507.0,1504.626,1503.0,43300,1514.0,1492.0
437,2016/06/10,1494.0,1500.906,1507.0,102000,1513.0,1487.0
438,2016/06/13,1425.0,1439.623,1466.0,76700,1466.0,1424.0
439,2016/06/14,1401.0,1410.059,1418.0,129600,1432.0,1396.0
440,2016/06/15,1383.0,1378.277,1391.0,190800,1409.0,1360.0
441,2016/06/16,1307.0,1328.701,1370.0,171400,1373.0,1305.0
442,2016/06/17,1337.0,1341.912,1326.0,86700,1354.0,1326.0
443,2016/06/20,1359.0,1365.558,1355.0,103000,1374.0,1355.0
444,2016/06/21,1344.0,1344.769,1353.0,92300,1357.0,1337.0
445,2016/06/22,1350.0,1345.526,1345.0,121100,1363.0,1332.0
446,2016/06/23,1363.0,1356.974,1336.0,46800,1367.0,1336.0
447,2016/06/24,1234.0,1270.844,1383.0,151700,1399.0,1221.0
448,2016/06/27,1238.0,1239.071,1251.0,79800,1267.0,1229.0
449,2016/06/28,1222.0,1214.457,1212.0,133200,1236.0,1183.0
450,2016/06/29,1264.0,1249.624,1227.0,105700,1268.0,1227.0
451,2016/06/30,1263.0,1278.575,1274.0,154400,1300.0,1261.0
452,2016/07/01,1266.0,1269.532,1268.0,37800,1281.0,1261.0
453,2016/07/04,1240.0,1250.042,1296.0,131800,1296.0,1233.0
454,2016/07/05,1255.0,1256.475,1270.0,115100,1274.0,1242.0
455,2016/07/06,1223.0,1222.58,1240.0,140000,1242.0,1207.0
456,2016/07/07,1223.0,1227.416,1217.0,107100,1244.0,1204.0
457,2016/07/08,1219.0,1229.442,1228.0,104000,1246.0,1216.0
458,2016/07/11,1253.0,1256.851,1236.0,190100,1275.0,1236.0
459,2016/07/12,1272.0,1276.501,1278.0,158400,1287.0,1265.0
460,2016/07/13,1307.0,1310.055,1309.0,106000,1320.0,1301.0
461,2016/07/14,1318.0,1315.463,1307.0,115900,1325.0,1294.0
462,2016/07/15,1349.0,1348.552,1325.0,99900,1365.0,1325.0
463,2016/07/19,1358.0,1354.37,1365.0,122100,1374.0,1337.0
464,2016/07/20,1359.0,1360.371,1350.0,237400,1378.0,1338.0
465,2016/07/21,1397.0,1390.213,1380.0,68000,1397.0,1380.0
466,2016/07/22,1383.0,1379.723,1370.0,103000,1397.0,1360.0
467,2016/07/25,1415.0,1411.218,1390.0,125300,1418.0,1386.0
468,2016/07/26,1397.0,1401.444,1413.0,202200,1420.0,1392.0
469,2016/07/27,1420.0,1393.8,1340.0,226400,1426.0,1336.0
470,2016/07/28,1414.0,1411.089,1405.0,114800,1420.0,1403.0
471,2016/07/29,1418.0,1415.184,1410.0,144100,1434.0,1384.0
472,2016/08/01,1332.0,1331.96,1350.0,158000,1351.0,1321.0
473,2016/08/02,1312.0,1312.142,1312.0,100800,1323.0,1303.0
474,2016/08/03,1294.0,1285.94,1285.0,174900,1301.0,1265.0
475,2016/08/04,1341.0,1324.759,1298.0,102500,1342.0,1298.0
476,2016/08/05,1328.0,1329.433,1348.0,105500,1353.0,1321.0
477,2016/08/08,1335.0,1331.089,1340.0,91300,1341.0,1324.0
478,2016/08/09,1324.0,1319.018,1327.0,92900,1331.0,1308.0
479,2016/08/10,1315.0,1312.474,1323.0,88600,1325.0,1302.0
480,2016/08/12,1319.0,1319.615,1319.0,66000,1325.0,1313.0
481,2016/08/15,1323.0,1325.386,1320.0,61600,1335.0,1315.0
482,2016/08/16,1298.0,1307.859,1322.0,88800,1322.0,1295.0
483,2016/08/17,1306.0,1297.143,1273.0,83500,1307.0,1272.0
484,2016/08/18,1283.0,1290.486,1297.0,98200,1303.0,1281.0
485,2016/08/19,1319.0,1310.256,1283.0,124400,1322.0,1277.0
486,2016/08/22,1333.0,1329.547,1324.0,81900,1340.0,1323.0
487,2016/08/23,1255.0,1277.681,1320.0,166800,1327.0,1254.0
488,2016/08/24,1258.0,1271.214,1272.0,72900,1287.0,1257.0
489,2016/08/25,1253.0,1248.155,1255.0,81300,1266.0,1232.0
490,2016/08/26,1236.0,1238.904,1245.0,61500,1248.0,1234.0
491,2016/08/29,1266.0,1268.113,1266.0,59100,1282.0,1260.0
492,2016/08/30,1269.0,1267.777,1265.0,29200,1273.0,1262.0
493,2016/08/31,1288.0,1275.116,1261.0,73600,1291.0,1260.0
494,2016/09/01,1282.0,1279.203,1282.0,66600,1284.0,1270.0
495,2016/09/02,1277.0,1271.289,1270.0,66000,1280.0,1264.0
496,2016/09/05,1284.0,1289.852,1292.0,56000,1300.0,1283.0
497,2016/09/06,1319.0,1307.78,1287.0,82800,1322.0,1286.0
498,2016/09/07,1304.0,1299.622,1300.0,58400,1307.0,1290.0
499,2016/09/08,1297.0,1300.695,1304.0,61600,1310.0,1291.0
500,2016/09/09,1301.0,1300.15,1297.0,72000,1310.0,1292.0
501,2016/09/12,1284.0,1285.239,1301.0,85300,1301.0,1277.0
502,2016/09/13,1303.0,1296.351,1290.0,108800,1309.0,1279.0
503,2016/09/14,1304.0,1308.928,1291.0,95300,1335.0,1291.0
504,2016/09/15,1311.0,1306.319,1302.0,77700,1315.0,1296.0
505,2016/09/16,1317.0,1315.948,1313.0,49900,1323.0,1309.0
506,2016/09/20,1341.0,1343.31,1317.0,130100,1366.0,1316.0
507,2016/09/21,1357.0,1336.163,1341.0,108100,1360.0,1317.0
508,2016/09/23,1345.0,1340.064,1357.0,65400,1362.0,1330.0
509,2016/09/26,1328.0,1339.433,1355.0,46900,1363.0,1326.0
510,2016/09/27,1348.0,1323.929,1328.0,100300,1349.0,1302.0
511,2016/09/28,1325.0,1316.202,1312.0,46600,1326.0,1307.0
512,2016/09/29,1356.0,1354.575,1347.0,92400,1365.0,1340.0
513,2016/09/30,1318.0,1315.716,1333.0,72800,1333.0,1302.0
514,2016/10/03,1330.0,1332.03,1321.0,43100,1342.0,1321.0
515,2016/10/04,1397.0,1391.264,1348.0,153200,1403.0,1346.0
516,2016/10/05,1411.0,1411.378,1398.0,92500,1424.0,1398.0
517,2016/10/06,1416.0,1418.921,1425.0,56700,1436.0,1411.0
518,2016/10/07,1420.0,1414.326,1425.0,50000,1425.0,1403.0
519,2016/10/11,1409.0,1411.658,1420.0,92200,1427.0,1400.0
520,2016/10/12,1397.0,1397.199,1398.0,44200,1408.0,1380.0
521,2016/10/13,1415.0,1405.997,1400.0,61500,1417.0,1397.0
522,2016/10/14,1396.0,1396.562,1410.0,104200,1413.0,1381.0
523,2016/10/17,1410.0,1405.664,1396.0,52600,1412.0,1396.0
524,2016/10/18,1436.0,1425.937,1412.0,53900,1437.0,1405.0
525,2016/10/19,1433.0,1428.241,1439.0,54000,1439.0,1421.0
526,2016/10/20,1434.0,1427.336,1428.0,57800,1434.0,1415.0
527,2016/10/21,1442.0,1441.796,1435.0,47500,1449.0,1431.0
528,2016/10/24,1447.0,1447.0,1450.0,75000,1457.0,1438.0
529,2016/10/25,1469.0,1470.839,1467.0,73300,1480.0,1464.0
530,2016/10/26,1472.0,1469.263,1471.0,81900,1474.0,1456.0
531,2016/10/27,1488.0,1483.674,1478.0,92700,1492.0,1468.0
532,2016/10/28,1542.0,1537.257,1495.0,284500,1559.0,1495.0
533,2016/10/31,1542.0,1549.345,1582.0,120000,1588.0,1530.0
534,2016/11/01,1493.0,1474.777,1435.0,161000,1495.0,1429.0
535,2016/11/02,1490.0,1490.205,1470.0,88800,1498.0,1466.0
536,2016/11/04,1495.0,1482.521,1475.0,76000,1499.0,1466.0
537,2016/11/07,1515.0,1514.502,1500.0,70100,1532.0,1500.0
538,2016/11/08,1513.0,1512.392,1510.0,61800,1521.0,1498.0
539,2016/11/09,1439.0,1475.679,1521.0,170900,1543.0,1422.0
540,2016/11/10,1552.0,1547.678,1545.0,83400,1556.0,1528.0
541,2016/11/11,1541.0,1550.095,1564.0,98600,1580.0,1531.0
542,2016/11/14,1569.0,1566.252,1557.0,62000,1574.0,1550.0
543,2016/11/15,1572.0,1561.619,1565.0,53300,1576.0,1546.0
544,2016/11/16,1571.0,1572.165,1590.0,47200,1595.0,1562.0
545,2016/11/17,1574.0,1570.823,1573.0,35500,1577.0,1557.0
546,2016/11/18,1599.0,1594.245,1595.0,53800,1600.0,1582.0
547,2016/11/21,1600.0,1606.938,1606.0,50200,1624.0,1600.0
548,2016/11/22,1611.0,1609.09,1605.0,35700,1615.0,1596.0
549,2016/11/24,1621.0,1622.634,1621.0,44800,1629.0,1615.0
550,2016/11/25,1620.0,1628.188,1629.0,138500,1657.0,1606.0
551,2016/11/28,1620.0,1611.137,1612.0,74500,1629.0,1600.0
552,2016/11/29,1608.0,1610.968,1620.0,83700,1623.0,1597.0
553,2016/11/30,1609.0,1609.453,1617.0,57400,1622.0,1600.0
554,2016/12/01,1624.0,1626.897,1633.0,63800,1639.0,1614.0
555,2016/12/02,1673.0,1651.368,1617.0,127100,1678.0,1613.0
556,2016/12/05,1603.0,1608.702,1649.0,105500,1649.0,1600.0
557,2016/12/06,1603.0,1606.805,1619.0,66700,1624.0,1598.0
558,2016/12/07,1616.0,1613.273,1618.0,58900,1624.0,1607.0
559,2016/12/08,1619.0,1617.2,1629.0,69500,1632.0,1610.0
560,2016/12/09,1669.0,1642.631,1615.0,110700,1675.0,1611.0
561,2016/12/12,1686.0,1680.375,1675.0,136800,1704.0,1640.0
562,2016/12/13,1639.0,1642.645,1649.0,106700,1656.0,1631.0
563,2016/12/14,1608.0,1612.273,1639.0,96300,1639.0,1605.0
564,2016/12/15,1632.0,1632.44,1609.0,87000,1643.0,1609.0
565,2016/12/16,1639.0,1643.861,1642.0,76300,1657.0,1633.0
566,2016/12/19,1657.0,1650.113,1647.0,68000,1660.0,1632.0
567,2016/12/20,1647.0,1644.794,1657.0,55700,1657.0,1637.0
568,2016/12/21,1624.0,1631.425,1654.0,53900,1654.0,1621.0
569,2016/12/22,1624.0,1622.87,1636.0,33900,1636.0,1614.0
570,2016/12/26,1619.0,1620.688,1624.0,42000,1631.0,1608.0
571,2016/12/27,1609.0,1608.392,1610.0,51600,1617.0,1595.0
572,2016/12/28,1629.0,1618.405,1606.0,28400,1629.0,1596.0
573,2016/12/29,1598.0,1596.817,1612.0,64900,1613.0,1586.0
574,2016/12/30,1595.0,1585.124,1596.0,52600,1602.0,1565.0
575,2017/01/04,1648.0,1623.383,1585.0,106300,1649.0,1572.0
576,2017/01/05,1633.0,1632.919,1637.0,70600,1647.0,1617.0
577,2017/01/06,1626.0,1624.626,1616.0,37700,1635.0,1614.0
578,2017/01/10,1603.0,1604.478,1626.0,82400,1626.0,1592.0
579,2017/01/11,1609.0,1611.027,1604.0,55100,1624.0,1585.0
580,2017/01/12,1603.0,1602.319,1610.0,38600,1615.0,1591.0
581,2017/01/13,1600.0,1599.549,1596.0,26400,1606.0,1590.0
582,2017/01/16,1595.0,1594.759,1592.0,38600,1607.0,1585.0
583,2017/01/17,1557.0,1569.146,1591.0,61500,1591.0,1557.0
584,2017/01/18,1574.0,1560.697,1545.0,41200,1579.0,1542.0
585,2017/01/19,1619.0,1605.94,1588.0,70200,1620.0,1581.0
586,2017/01/20,1607.0,1607.357,1616.0,38700,1620.0,1591.0
587,2017/01/23,1594.0,1593.121,1588.0,45300,1604.0,1580.0
588,2017/01/24,1557.0,1560.677,1575.0,58500,1575.0,1552.0
589,2017/01/25,1559.0,1561.855,1567.0,107300,1571.0,1556.0
590,2017/01/26,1565.0,1564.858,1580.0,120800,1580.0,1551.0
591,2017/01/27,1566.0,1567.306,1563.0,148900,1579.0,1558.0
592,2017/01/30,1552.0,1558.277,1565.0,71500,1570.0,1548.0
593,2017/01/31,1542.0,1539.034,1529.0,153600,1573.0,1511.0
594,2017/02/01,1548.0,1545.02,1538.0,71800,1553.0,1525.0
595,2017/02/02,1509.0,1517.463,1547.0,135700,1556.0,1505.0
596,2017/02/03,1514.0,1513.484,1503.0,63500,1522.0,1503.0
597,2017/02/06,1516.0,1513.839,1520.0,40400,1525.0,1506.0
598,2017/02/07,1514.0,1514.607,1502.0,57200,1521.0,1502.0
599,2017/02/08,1521.0,1512.609,1514.0,66300,1522.0,1504.0
600,2017/02/09,1509.0,1509.129,1516.0,58300,1520.0,1505.0
601,2017/02/10,1542.0,1537.015,1520.0,54700,1546.0,1520.0
602,2017/02/13,1556.0,1556.379,1558.0,37700,1561.0,1550.0
603,2017/02/14,1540.0,1549.251,1557.0,51000,1559.0,1540.0
604,2017/02/15,1591.0,1578.699,1558.0,64800,1594.0,1549.0
605,2017/02/16,1573.0,1579.066,1595.0,44200,1601.0,1571.0
606,2017/02/17,1577.0,1577.606,1576.0,40400,1586.0,1571.0
607,2017/02/20,1585.0,1582.224,1577.0,32200,1589.0,1572.0
608,2017/02/21,1584.0,1580.671,1585.0,48600,1589.0,1571.0
609,2017/02/22,1581.0,1578.805,1590.0,38900,1590.0,1573.0
610,2017/02/23,1593.0,1591.243,1588.0,49900,1601.0,1583.0
611,2017/02/24,1596.0,1594.952,1574.0,55700,1608.0,1572.0
612,2017/02/27,1564.0,1563.912,1580.0,71300,1580.0,1555.0
613,2017/02/28,1576.0,1583.78,1567.0,61700,1598.0,1564.0
614,2017/03/01,1587.0,1579.475,1575.0,70800,1589.0,1567.0
615,2017/03/02,1604.0,1610.035,1609.0,48400,1621.0,1602.0
616,2017/03/03,1591.0,1596.66,1609.0,61200,1619.0,1583.0
617,2017/03/06,1610.0,1605.984,1591.0,44800,1617.0,1586.0
618,2017/03/07,1609.0,1609.539,1605.0,39500,1616.0,1603.0
619,2017/03/08,1614.0,1611.882,1614.0,65900,1627.0,1601.0
620,2017/03/09,1598.0,1603.502,1620.0,64700,1627.0,1592.0
621,2017/03/10,1658.0,1640.342,1621.0,160600,1663.0,1620.0
622,2017/03/13,1663.0,1669.058,1665.0,55600,1685.0,1658.0
623,2017/03/14,1646.0,1648.039,1663.0,85700,1663.0,1641.0
624,2017/03/15,1654.0,1652.855,1646.0,47600,1662.0,1640.0
625,2017/03/16,1656.0,1651.794,1638.0,41200,1659.0,1636.0
626,2017/03/17,1655.0,1654.485,1656.0,87500,1674.0,1642.0
627,2017/03/21,1634.0,1640.619,1642.0,55600,1652.0,1633.0
628,2017/03/22,1597.0,1606.124,1625.0,73300,1629.0,1589.0
629,2017/03/23,1604.0,1606.675,1602.0,45500,1617.0,1598.0
630,2017/03/24,1594.0,1588.425,1608.0,78900,1614.0,1569.0
631,2017/03/27,1530.0,1534.703,1590.0,168300,1590.0,1509.0
632,2017/03/28,1578.0,1567.824,1551.0,83700,1578.0,1536.0
633,2017/03/29,1579.0,1571.444,1566.0,45700,1579.0,1558.0
634,2017/03/30,1549.0,1557.476,1579.0,74300,1579.0,1542.0
635,2017/03/31,1536.0,1550.905,1553.0,80100,1573.0,1536.0
636,2017/04/03,1530.0,1532.665,1530.0,48100,1545.0,1525.0
637,2017/04/04,1523.0,1517.142,1520.0,74800,1534.0,1500.0
638,2017/04/05,1539.0,1534.849,1512.0,125700,1547.0,1512.0
639,2017/04/06,1524.0,1525.669,1527.0,89100,1535.0,1522.0
640,2017/04/07,1543.0,1542.01,1534.0,81300,1551.0,1531.0
641,2017/04/10,1556.0,1556.364,1560.0,67900,1564.0,1544.0
642,2017/04/11,1539.0,1540.383,1543.0,55600,1550.0,1534.0
643,2017/04/12,1521.0,1519.413,1519.0,61300,1549.0,1513.0
644,2017/04/13,1516.0,1505.31,1505.0,71700,1516.0,1495.0
645,2017/04/14,1490.0,1496.706,1508.0,60900,1512.0,1486.0
646,2017/04/17,1500.0,1489.638,1480.0,53100,1500.0,1475.0
647,2017/04/18,1508.0,1504.338,1502.0,73700,1516.0,1499.0
648,2017/04/19,1508.0,1511.047,1498.0,60200,1520.0,1498.0
649,2017/04/20,1503.0,1507.705,1508.0,42000,1514.0,1503.0
650,2017/04/21,1529.0,1525.2,1512.0,42000,1534.0,1512.0
651,2017/04/24,1544.0,1542.324,1550.0,34900,1555.0,1534.0
652,2017/04/25,1566.0,1560.795,1538.0,50300,1571.0,1538.0
653,2017/04/26,1591.0,1586.575,1579.0,51300,1592.0,1572.0
654,2017/04/27,1595.0,1592.242,1589.0,49200,1596.0,1587.0
655,2017/04/28,1605.0,1600.48,1594.0,88300,1608.0,1587.0
656,2017/05/01,1625.0,1617.914,1605.0,80400,1625.0,1604.0
657,2017/05/02,1626.0,1626.77,1620.0,138000,1637.0,1606.0
658,2017/05/08,1713.0,1700.755,1645.0,322600,1732.0,1645.0
659,2017/05/09,1699.0,1702.672,1713.0,48400,1713.0,1698.0
660,2017/05/10,1731.0,1732.573,1699.0,163900,1760.0,1699.0
661,2017/05/11,1733.0,1732.377,1735.0,53100,1743.0,1724.0
662,2017/05/12,1718.0,1717.7,1723.0,82900,1729.0,1705.0
663,2017/05/15,1695.0,1694.215,1678.0,53500,1708.0,1661.0
664,2017/05/16,1794.0,1777.81,1705.0,255600,1803.0,1704.0
665,2017/05/17,1828.0,1816.093,1784.0,179200,1833.0,1781.0
666,2017/05/18,1809.0,1808.404,1801.0,99600,1822.0,1797.0
667,2017/05/19,1823.0,1807.476,1804.0,97400,1830.0,1776.0
668,2017/05/22,1829.0,1829.101,1827.0,55600,1837.0,1814.0
669,2017/05/23,1826.0,1835.122,1841.0,101200,1859.0,1819.0
670,2017/05/24,1851.0,1848.859,1849.0,73500,1862.0,1838.0
671,2017/05/25,1844.0,1844.457,1832.0,65500,1857.0,1828.0
672,2017/05/26,1812.0,1819.071,1837.0,48000,1844.0,1810.0
673,2017/05/29,1782.0,1791.517,1801.0,114500,1812.0,1779.0
674,2017/05/30,1809.0,1803.142,1784.0,59800,1815.0,1783.0
675,2017/05/31,1797.0,1797.831,1790.0,94200,1809.0,1784.0
676,2017/06/01,1814.0,1814.335,1803.0,77300,1822.0,1803.0
677,2017/06/02,1821.0,1832.387,1830.0,160500,1856.0,1814.0
678,2017/06/05,1837.0,1835.253,1818.0,73900,1847.0,1815.0
679,2017/06/06,1786.0,1799.133,1828.0,67100,1828.0,1785.0
680,2017/06/07,1799.0,1798.635,1781.0,49600,1808.0,1781.0
681,2017/06/08,1809.0,1807.123,1800.0,85700,1820.0,1787.0
682,2017/06/09,1810.0,1808.929,1803.0,81900,1824.0,1794.0
683,2017/06/12,1804.0,1805.707,1810.0,49500,1816.0,1796.0
684,2017/06/13,1795.0,1800.943,1800.0,33300,1811.0,1792.0
685,2017/06/14,1772.0,1782.958,1801.0,63900,1802.0,1772.0
686,2017/06/15,1758.0,1763.037,1766.0,54500,1776.0,1754.0
687,2017/06/16,1732.0,1743.215,1764.0,161200,1773.0,1729.0
688,2017/06/19,1766.0,1760.855,1735.0,82900,1773.0,1729.0
689,2017/06/20,1789.0,1792.082,1766.0,70600,1801.0,1766.0
690,2017/06/21,1773.0,1773.969,1775.0,55300,1781.0,1766.0
691,2017/06/22,1772.0,1772.019,1771.0,58800,1777.0,1764.0
692,2017/06/23,1782.0,1777.599,1771.0,48600,1794.0,1766.0
693,2017/06/26,1774.0,1774.513,1782.0,48500,1789.0,1767.0
694,2017/06/27,1778.0,1775.758,1768.0,50800,1784.0,1768.0
695,2017/06/28,1775.0,1774.603,1778.0,75000,1779.0,1767.0
696,2017/06/29,1775.0,1773.366,1778.0,106200,1793.0,1756.0
697,2017/06/30,1773.0,1772.485,1775.0,126700,1780.0,1750.0
698,2017/07/03,1786.0,1790.318,1776.0,56000,1807.0,1772.0
699,2017/07/04,1738.0,1755.741,1803.0,53600,1803.0,1732.0
700,2017/07/05,1757.0,1749.826,1725.0,83700,1773.0,1725.0
701,2017/07/06,1756.0,1753.728,1744.0,65500,1762.0,1738.0
702,2017/07/07,1751.0,1751.104,1733.0,48200,1757.0,1731.0
703,2017/07/10,1776.0,1783.035,1766.0,82500,1798.0,1762.0
704,2017/07/11,1786.0,1782.051,1773.0,31400,1789.0,1773.0
705,2017/07/12,1781.0,1784.247,1777.0,56400,1798.0,1771.0
706,2017/07/13,1786.0,1779.864,1790.0,35300,1790.0,1767.0
707,2017/07/14,1784.0,1782.192,1777.0,107400,1794.0,1770.0
708,2017/07/18,1800.0,1784.772,1775.0,70600,1802.0,1767.0
709,2017/07/19,1816.0,1811.377,1800.0,74800,1820.0,1794.0
710,2017/07/20,1819.0,1817.934,1816.0,37900,1825.0,1802.0
711,2017/07/21,1804.0,1802.404,1800.0,44800,1813.0,1795.0
712,2017/07/24,1801.0,1791.786,1790.0,50900,1802.0,1779.0
713,2017/07/25,1788.0,1793.617,1801.0,20900,1812.0,1785.0
714,2017/07/26,1788.0,1791.276,1803.0,41600,1811.0,1780.0
715,2017/07/27,1820.0,1819.309,1794.0,72100,1836.0,1794.0
716,2017/07/28,1806.0,1804.505,1821.0,39400,1823.0,1793.0
717,2017/07/31,1787.0,1789.451,1796.0,57200,1805.0,1774.0
718,2017/08/01,1689.0,1686.394,1680.0,151200,1698.0,1668.0
719,2017/08/02,1687.0,1689.369,1699.0,113100,1708.0,1680.0
720,2017/08/03,1690.0,1685.536,1696.0,82700,1701.0,1676.0
721,2017/08/04,1725.0,1717.448,1700.0,71000,1727.0,1687.0
722,2017/08/07,1756.0,1750.716,1737.0,96200,1763.0,1730.0
723,2017/08/08,1787.0,1777.511,1759.0,95500,1789.0,1759.0
724,2017/08/09,1746.0,1744.338,1782.0,107000,1782.0,1729.0
725,2017/08/10,1749.0,1744.277,1746.0,66500,1749.0,1733.0
726,2017/08/14,1720.0,1720.502,1731.0,69100,1733.0,1708.0
727,2017/08/15,1742.0,1741.155,1735.0,72100,1750.0,1727.0
728,2017/08/16,1756.0,1754.592,1744.0,58500,1760.0,1739.0
729,2017/08/17,1759.0,1757.663,1756.0,33500,1769.0,1748.0
730,2017/08/18,1740.0,1735.997,1727.0,76000,1746.0,1716.0
731,2017/08/21,1791.0,1777.445,1758.0,75500,1793.0,1754.0
732,2017/08/22,1851.0,1840.441,1792.0,137000,1860.0,1790.0
733,2017/08/23,1882.0,1877.672,1875.0,113500,1895.0,1864.0
734,2017/08/24,1916.0,1907.628,1880.0,133600,1920.0,1876.0
735,2017/08/25,1919.0,1923.155,1921.0,75400,1935.0,1910.0
736,2017/08/28,1944.0,1938.815,1925.0,134000,1950.0,1924.0
737,2017/08/29,1957.0,1951.677,1939.0,86300,1963.0,1925.0
738,2017/08/30,1972.0,1964.714,1964.0,109700,1978.0,1952.0
739,2017/08/31,1979.0,1983.384,1975.0,82600,1991.0,1969.0
740,2017/09/01,1992.0,1982.689,1990.0,80600,1993.0,1967.0
741,2017/09/04,1932.0,1946.179,1991.0,79900,1991.0,1931.0
742,2017/09/05,1905.0,1918.798,1926.0,89500,1951.0,1903.0
743,2017/09/06,1896.0,1894.591,1890.0,76100,1909.0,1879.0
744,2017/09/07,1911.0,1909.72,1920.0,61000,1925.0,1891.0
745,2017/09/08,1911.0,1913.249,1911.0,77200,1935.0,1904.0
746,2017/09/11,1931.0,1935.926,1921.0,80000,1945.0,1921.0
747,2017/09/12,1947.0,1945.413,1953.0,67300,1962.0,1937.0
748,2017/09/13,2010.0,1992.113,1960.0,117700,2012.0,1948.0
749,2017/09/14,1981.0,1985.989,2010.0,132300,2027.0,1967.0
750,2017/09/15,2045.0,2031.281,1995.0,111700,2046.0,1994.0
751,2017/09/19,2017.0,2020.839,2045.0,147600,2045.0,2000.0
752,2017/09/20,2001.0,2003.646,2017.0,96900,2017.0,1980.0
753,2017/09/21,1956.0,1962.831,1995.0,122300,1995.0,1952.0
754,2017/09/22,1949.0,1953.953,1973.0,69800,1977.0,1946.0
755,2017/09/25,1973.0,1969.152,1964.0,45500,1975.0,1951.0
756,2017/09/26,1989.0,1982.429,1971.0,59400,1993.0,1964.0
757,2017/09/27,1985.0,1982.574,1988.0,38000,1988.0,1970.0
758,2017/09/28,2005.0,2002.466,1993.0,94500,2014.0,1969.0
759,2017/09/29,1989.0,1997.896,2010.0,71800,2021.0,1987.0
760,2017/10/02,1984.0,1987.814,1996.0,46200,2004.0,1978.0
761,2017/10/03,2001.0,1996.392,2002.0,67900,2010.0,1984.0
762,2017/10/04,1976.0,1975.505,1995.0,67200,2001.0,1966.0
763,2017/10/05,1962.0,1961.528,1957.0,62500,1978.0,1952.0
764,2017/10/06,1956.0,1953.425,1967.0,79500,1970.0,1930.0
765,2017/10/10,1981.0,1964.916,1938.0,97400,1981.0,1938.0
766,2017/10/11,1957.0,1965.928,1983.0,90400,1992.0,1956.0
767,2017/10/12,1951.0,1957.599,1968.0,69800,1975.0,1946.0
768,2017/10/13,1967.0,1971.05,1960.0,134900,1980.0,1953.0
769,2017/10/16,1989.0,1989.968,1970.0,72400,1999.0,1968.0
770,2017/10/17,1989.0,1996.593,1984.0,71300,2009.0,1984.0
771,2017/10/18,1968.0,1965.971,1981.0,55200,1984.0,1957.0
772,2017/10/19,1966.0,1970.542,1971.0,41900,1988.0,1961.0
773,2017/10/20,1964.0,1963.163,1966.0,58200,1973.0,1949.0
774,2017/10/23,1961.0,1958.039,1950.0,120700,1967.0,1939.0
775,2017/10/24,2022.0,2003.191,1963.0,122600,2024.0,1963.0
776,2017/10/25,2060.0,2050.321,2033.0,132000,2069.0,2027.0
777,2017/10/26,2054.0,2055.308,2048.0,64000,2066.0,2039.0
778,2017/10/27,2060.0,2055.742,2040.0,89900,2066.0,2033.0
779,2017/10/30,1903.0,1928.55,2060.0,457800,2069.0,1835.0
780,2017/10/31,1938.0,1915.303,1903.0,311100,1952.0,1878.0
781,2017/11/01,1961.0,1952.366,1978.0,131000,1978.0,1936.0
782,2017/11/02,1945.0,1947.384,1965.0,57100,1965.0,1936.0
783,2017/11/06,1925.0,1936.013,1945.0,68600,1954.0,1922.0
784,2017/11/07,1944.0,1936.59,1925.0,81600,1949.0,1911.0
785,2017/11/08,1948.0,1939.141,1937.0,93000,1949.0,1926.0
786,2017/11/09,1936.0,1944.791,1954.0,140200,1969.0,1912.0
787,2017/11/10,1923.0,1922.78,1916.0,86400,1935.0,1913.0
788,2017/11/13,1924.0,1924.432,1923.0,55100,1937.0,1915.0
789,2017/11/14,1949.0,1955.407,1934.0,91200,1970.0,1932.0
790,2017/11/15,1853.0,1875.185,1939.0,104900,1939.0,1848.0
791,2017/11/16,1880.0,1868.213,1852.0,83400,1891.0,1839.0
792,2017/11/17,1857.0,1869.645,1895.0,80000,1901.0,1855.0
793,2017/11/20,1856.0,1855.349,1850.0,75000,1871.0,1839.0
794,2017/11/21,1881.0,1873.35,1852.0,69400,1888.0,1847.0
795,2017/11/22,1866.0,1858.136,1852.0,113500,1874.0,1848.0
796,2017/11/24,1869.0,1865.297,1851.0,31000,1876.0,1851.0
797,2017/11/27,1887.0,1879.841,1877.0,56100,1889.0,1864.0
798,2017/11/28,1870.0,1875.043,1894.0,61200,1898.0,1867.0
799,2017/11/29,1889.0,1883.92,1870.0,102200,1898.0,1870.0
800,2017/11/30,1849.0,1851.11,1883.0,95200,1883.0,1838.0
801,2017/12/01,1856.0,1857.865,1863.0,99100,1876.0,1851.0
802,2017/12/04,1817.0,1829.522,1861.0,77400,1864.0,1814.0
803,2017/12/05,1833.0,1821.963,1811.0,43400,1837.0,1802.0
804,2017/12/06,1801.0,1807.271,1811.0,55300,1827.0,1795.0
805,2017/12/07,1817.0,1816.547,1790.0,43500,1826.0,1790.0
806,2017/12/08,1845.0,1823.025,1802.0,71500,1847.0,1802.0
807,2017/12/11,1827.0,1823.695,1845.0,69800,1845.0,1807.0
808,2017/12/12,1789.0,1788.772,1807.0,134400,1815.0,1776.0
809,2017/12/13,1788.0,1791.051,1807.0,92500,1817.0,1778.0
810,2017/12/14,1800.0,1801.68,1792.0,61300,1812.0,1792.0
811,2017/12/15,1762.0,1765.717,1784.0,82100,1793.0,1755.0
812,2017/12/18,1785.0,1787.176,1763.0,54600,1799.0,1763.0
813,2017/12/19,1785.0,1787.224,1790.0,35700,1804.0,1780.0
814,2017/12/20,1787.0,1785.01,1785.0,61300,1798.0,1771.0
815,2017/12/21,1790.0,1783.686,1780.0,36900,1790.0,1773.0
816,2017/12/22,1797.0,1797.97,1790.0,46200,1805.0,1790.0
817,2017/12/25,1813.0,1806.092,1800.0,34800,1813.0,1797.0
818,2017/12/26,1826.0,1820.673,1814.0,56800,1828.0,1810.0
819,2017/12/27,1815.0,1815.487,1817.0,55600,1824.0,1804.0
820,2017/12/28,1796.0,1805.025,1814.0,36300,1818.0,1794.0
821,2017/12/29,1809.0,1808.756,1797.0,33200,1821.0,1797.0
822,2018/01/04,1802.0,1803.728,1822.0,89900,1828.0,1788.0
823,2018/01/05,1829.0,1829.585,1815.0,75600,1848.0,1815.0
824,2018/01/09,1815.0,1815.698,1833.0,74100,1833.0,1808.0
825,2018/01/10,1818.0,1819.479,1816.0,143700,1836.0,1801.0
826,2018/01/11,1830.0,1824.686,1810.0,111300,1836.0,1810.0
827,2018/01/12,1835.0,1831.93,1829.0,78400,1841.0,1817.0
828,2018/01/15,1892.0,1878.487,1855.0,102900,1897.0,1849.0
829,2018/01/16,1881.0,1878.811,1892.0,70800,1897.0,1867.0
830,2018/01/17,1864.0,1871.812,1876.0,92100,1894.0,1858.0
831,2018/01/18,1833.0,1846.308,1871.0,76000,1884.0,1832.0
832,2018/01/19,1831.0,1831.571,1833.0,70600,1844.0,1815.0
833,2018/01/22,1822.0,1820.042,1848.0,43300,1848.0,1811.0
834,2018/01/23,1819.0,1818.179,1820.0,65500,1824.0,1811.0
835,2018/01/24,1824.0,1826.436,1819.0,46100,1836.0,1815.0
836,2018/01/25,1829.0,1826.081,1824.0,55700,1833.0,1809.0
837,2018/01/26,1868.0,1870.831,1835.0,106600,1890.0,1833.0
838,2018/01/29,1966.0,1940.225,1870.0,247000,1973.0,1866.0
839,2018/01/30,1922.0,1919.514,1950.0,118100,1950.0,1904.0
840,2018/01/31,1869.0,1890.518,1904.0,98300,1921.0,1857.0
841,2018/02/01,1695.0,1700.692,1749.0,399000,1776.0,1675.0
842,2018/02/02,1743.0,1728.053,1710.0,238800,1748.0,1695.0
843,2018/02/05,1756.0,1737.812,1730.0,177700,1760.0,1697.0
844,2018/02/06,1780.0,1754.736,1682.0,379100,1796.0,1682.0
845,2018/02/07,1821.0,1843.795,1823.0,235400,1881.0,1820.0
846,2018/02/08,1804.0,1828.55,1825.0,121100,1862.0,1804.0
847,2018/02/09,1744.0,1741.735,1753.0,128900,1773.0,1722.0
848,2018/02/13,1742.0,1757.465,1772.0,132700,1794.0,1738.0
849,2018/02/14,1683.0,1705.559,1744.0,133000,1760.0,1680.0
850,2018/02/15,1688.0,1699.048,1691.0,91800,1721.0,1683.0
851,2018/02/16,1751.0,1752.265,1721.0,124900,1772.0,1713.0
852,2018/02/19,1795.0,1796.582,1780.0,70800,1813.0,1769.0
853,2018/02/20,1824.0,1813.657,1795.0,65800,1833.0,1778.0
854,2018/02/21,1868.0,1864.031,1828.0,93000,1880.0,1828.0
855,2018/02/22,1880.0,1875.579,1869.0,91600,1887.0,1860.0
856,2018/02/23,1874.0,1876.218,1890.0,66000,1894.0,1864.0
857,2018/02/26,1867.0,1863.023,1863.0,74500,1878.0,1842.0
858,2018/02/27,1854.0,1860.57,1882.0,79000,1900.0,1841.0
859,2018/02/28,1880.0,1894.137,1856.0,93400,1924.0,1856.0
860,2018/03/01,1847.0,1850.22,1864.0,81400,1869.0,1830.0
861,2018/03/02,1812.0,1814.359,1816.0,71300,1828.0,1805.0
862,2018/03/05,1768.0,1778.914,1810.0,64100,1817.0,1762.0
863,2018/03/06,1779.0,1794.342,1793.0,60500,1833.0,1774.0
864,2018/03/07,1631.0,1661.169,1707.0,482500,1727.0,1626.0
865,2018/03/08,1667.0,1663.274,1650.0,248200,1692.0,1645.0
866,2018/03/09,1676.0,1673.653,1677.0,148600,1697.0,1658.0
867,2018/03/12,1723.0,1715.806,1686.0,110400,1733.0,1685.0
868,2018/03/13,1733.0,1729.975,1720.0,87900,1750.0,1704.0
869,2018/03/14,1727.0,1719.535,1705.0,82500,1738.0,1694.0
870,2018/03/15,1698.0,1700.859,1712.0,70000,1728.0,1682.0
871,2018/03/16,1660.0,1668.595,1703.0,70400,1703.0,1658.0
872,2018/03/19,1682.0,1670.068,1661.0,73200,1690.0,1639.0
873,2018/03/20,1642.0,1632.404,1670.0,104300,1670.0,1614.0
874,2018/03/22,1652.0,1635.477,1650.0,105700,1660.0,1612.0
875,2018/03/23,1603.0,1604.5,1614.0,128500,1628.0,1597.0
876,2018/03/26,1587.0,1580.572,1596.0,90100,1598.0,1563.0
877,2018/03/27,1641.0,1633.628,1587.0,76600,1649.0,1587.0
878,2018/03/28,1630.0,1617.089,1624.0,44800,1633.0,1593.0
879,2018/03/29,1636.0,1635.297,1645.0,60700,1649.0,1620.0
880,2018/03/30,1650.0,1648.665,1655.0,49800,1663.0,1635.0
881,2018/04/02,1651.0,1658.459,1673.0,31800,1673.0,1650.0
882,2018/04/03,1656.0,1650.974,1627.0,42700,1664.0,1616.0
883,2018/04/04,1679.0,1682.6,1683.0,80700,1706.0,1664.0
884,2018/04/05,1690.0,1687.617,1679.0,66800,1700.0,1665.0
885,2018/04/06,1694.0,1693.011,1704.0,61600,1704.0,1675.0
886,2018/04/09,1704.0,1691.52,1694.0,44200,1705.0,1666.0
887,2018/04/10,1725.0,1719.113,1704.0,90500,1733.0,1701.0
888,2018/04/11,1734.0,1727.6,1729.0,38700,1740.0,1708.0
889,2018/04/12,1734.0,1737.663,1740.0,35600,1751.0,1723.0
890,2018/04/13,1752.0,1748.536,1737.0,57500,1754.0,1737.0
891,2018/04/16,1752.0,1750.518,1751.0,35700,1754.0,1741.0
892,2018/04/17,1744.0,1740.627,1752.0,29200,1754.0,1726.0
893,2018/04/18,1774.0,1765.964,1755.0,33300,1775.0,1741.0
894,2018/04/19,1802.0,1797.03,1783.0,50500,1807.0,1780.0
895,2018/04/20,1769.0,1778.017,1802.0,52900,1802.0,1762.0
896,2018/04/23,1757.0,1761.466,1769.0,22300,1780.0,1752.0
897,2018/04/24,1822.0,1805.238,1776.0,58800,1823.0,1768.0
898,2018/04/25,1834.0,1823.629,1808.0,31000,1835.0,1796.0
899,2018/04/26,1860.0,1855.811,1844.0,52300,1868.0,1830.0
900,2018/04/27,1883.0,1868.336,1869.0,48200,1884.0,1845.0
901,2018/05/01,1882.0,1878.303,1880.0,32300,1884.0,1862.0
902,2018/05/02,1876.0,1877.669,1871.0,37500,1887.0,1861.0
903,2018/05/07,1860.0,1855.507,1871.0,43600,1871.0,1845.0
904,2018/05/08,1880.0,1879.879,1865.0,51900,1892.0,1860.0
905,2018/05/09,1870.0,1870.456,1880.0,37500,1889.0,1858.0
906,2018/05/10,1887.0,1884.883,1870.0,47800,1899.0,1870.0
907,2018/05/11,1927.0,1911.486,1893.0,99600,1927.0,1891.0
908,2018/05/14,1854.0,1872.842,1900.0,142900,1920.0,1830.0
909,2018/05/15,2231.0,2213.824,2064.0,650100,2254.0,2056.0
910,2018/05/16,2152.0,2201.851,2227.0,362600,2238.0,2138.0
911,2018/05/17,2027.0,2005.134,2052.0,463200,2063.0,1956.0
912,2018/05/18,2019.0,2010.898,2020.0,169300,2038.0,1980.0
913,2018/05/21,2045.0,2033.798,2012.0,78800,2058.0,2004.0
914,2018/05/22,2009.0,2032.75,2045.0,131800,2084.0,2000.0
915,2018/05/23,2021.0,2018.561,2009.0,98300,2042.0,1997.0
916,2018/05/24,2009.0,2009.346,2006.0,71600,2037.0,1993.0
917,2018/05/25,1958.0,1966.317,1982.0,103900,1994.0,1953.0
918,2018/05/28,2010.0,1999.766,1963.0,70200,2022.0,1960.0
919,2018/05/29,2010.0,1999.114,1998.0,40200,2013.0,1978.0
920,2018/05/30,2001.0,1992.787,1969.0,61100,2008.0,1969.0
921,2018/05/31,2059.0,2039.309,2002.0,213700,2076.0,1973.0
922,2018/06/01,2022.0,2024.648,2024.0,104100,2045.0,2001.0
923,2018/06/04,2037.0,2034.331,2040.0,88000,2052.0,2018.0
924,2018/06/05,2024.0,2011.383,2036.0,90300,2036.0,1988.0
925,2018/06/06,2009.0,2007.747,2011.0,93300,2024.0,1990.0
926,2018/06/07,2076.0,2057.28,1996.0,85600,2077.0,1996.0
927,2018/06/08,2046.0,2050.096,2047.0,110000,2080.0,2028.0
928,2018/06/11,2070.0,2050.95,2056.0,104300,2082.0,2011.0
929,2018/06/12,2135.0,2124.742,2098.0,178000,2144.0,2086.0
930,2018/06/13,2014.0,2032.019,2035.0,559300,2065.0,2010.0
931,2018/06/14,2058.0,2038.294,2020.0,519000,2069.0,2002.0
932,2018/06/15,2045.0,2036.693,2058.0,220900,2058.0,2002.0
933,2018/06/18,2013.0,2035.184,2059.0,67500,2059.0,2013.0
934,2018/06/19,2084.0,2073.234,2063.0,183600,2094.0,2020.0
935,2018/06/20,2217.0,2195.743,2102.0,596200,2226.0,2102.0
936,2018/06/21,2207.0,2186.752,2181.0,276800,2210.0,2145.0
937,2018/06/22,2188.0,2176.721,2178.0,185700,2197.0,2128.0
938,2018/06/25,2144.0,2156.192,2172.0,114500,2181.0,2140.0
939,2018/06/26,2083.0,2090.926,2100.0,137300,2116.0,2077.0
940,2018/06/27,2134.0,2134.641,2114.0,156700,2153.0,2108.0
941,2018/06/28,2180.0,2173.215,2126.0,296400,2203.0,2120.0
942,2018/06/29,2214.0,2210.931,2207.0,190400,2230.0,2183.0
943,2018/07/02,2114.0,2146.539,2187.0,121800,2203.0,2111.0
944,2018/07/03,2144.0,2126.883,2127.0,157200,2146.0,2075.0
945,2018/07/04,2046.0,2065.589,2109.0,93500,2128.0,2040.0
946,2018/07/05,1980.0,1989.128,2028.0,96300,2028.0,1971.0
947,2018/07/06,1971.0,1951.981,1940.0,159300,1973.0,1922.0
948,2018/07/09,2040.0,2009.774,1972.0,117500,2040.0,1966.0
949,2018/07/10,2064.0,2072.574,2057.0,123400,2088.0,2055.0
950,2018/07/11,2044.0,2033.855,2041.0,69100,2056.0,2005.0
951,2018/07/12,2030.0,2038.951,2048.0,44400,2060.0,2027.0
952,2018/07/13,2055.0,2049.419,2022.0,49700,2068.0,2006.0
953,2018/07/17,2081.0,2073.163,2068.0,64500,2097.0,2038.0
954,2018/07/18,2086.0,2095.626,2085.0,41400,2121.0,2076.0
955,2018/07/19,2098.0,2101.052,2087.0,40600,2119.0,2087.0
956,2018/07/20,2116.0,2105.792,2092.0,56300,2120.0,2072.0
957,2018/07/23,2101.0,2108.939,2115.0,39600,2133.0,2094.0
958,2018/07/24,2107.0,2108.686,2109.0,18800,2120.0,2101.0
959,2018/07/25,2120.0,2118.314,2107.0,43000,2129.0,2098.0
960,2018/07/26,2132.0,2126.775,2126.0,44500,2144.0,2100.0
961,2018/07/27,2164.0,2165.145,2132.0,44800,2185.0,2132.0
962,2018/07/30,2100.0,2109.687,2114.0,72200,2152.0,2073.0
963,2018/07/31,1915.0,1930.185,1910.0,213800,1993.0,1910.0
964,2018/08/01,1945.0,1928.983,1919.0,133300,1960.0,1874.0
965,2018/08/02,1973.0,1979.312,1943.0,97900,2010.0,1937.0
966,2018/08/03,1933.0,1950.708,1976.0,42100,1978.0,1930.0
967,2018/08/06,1939.0,1953.982,1951.0,62200,1977.0,1933.0
968,2018/08/07,1937.0,1937.027,1940.0,48300,1961.0,1923.0
969,2018/08/08,1952.0,1956.641,1937.0,43500,1981.0,1937.0
970,2018/08/09,1979.0,1981.337,1952.0,73100,1996.0,1952.0
971,2018/08/10,1905.0,1926.524,1979.0,63800,1979.0,1900.0
972,2018/08/13,1855.0,1861.7,1880.0,78400,1898.0,1843.0
973,2018/08/14,1852.0,1845.496,1844.0,49600,1875.0,1823.0
974,2018/08/15,1866.0,1860.953,1852.0,60000,1878.0,1831.0
975,2018/08/16,1815.0,1819.138,1830.0,50900,1838.0,1807.0
976,2018/08/17,1838.0,1835.283,1820.0,29300,1849.0,1814.0
977,2018/08/20,1813.0,1823.694,1839.0,46400,1844.0,1812.0
978,2018/08/21,1799.0,1798.311,1813.0,41200,1813.0,1786.0
979,2018/08/22,1833.0,1825.862,1800.0,36100,1842.0,1798.0
980,2018/08/23,1835.0,1837.358,1833.0,31300,1854.0,1827.0
981,2018/08/24,1851.0,1846.366,1871.0,21300,1871.0,1832.0
982,2018/08/27,1875.0,1866.844,1848.0,40900,1883.0,1844.0
983,2018/08/28,1882.0,1879.841,1878.0,39100,1897.0,1863.0
984,2018/08/29,1895.0,1892.681,1875.0,34800,1906.0,1875.0
985,2018/08/30,1852.0,1857.185,1904.0,107300,1913.0,1828.0
986,2018/08/31,1886.0,1880.621,1841.0,68100,1901.0,1841.0
987,2018/09/03,1893.0,1884.882,1873.0,119000,1911.0,1843.0
988,2018/09/04,1885.0,1896.287,1902.0,102200,1923.0,1880.0
989,2018/09/05,1892.0,1887.357,1885.0,77000,1915.0,1853.0
990,2018/09/06,1840.0,1860.403,1887.0,139300,1904.0,1839.0
991,2018/09/07,1837.0,1829.479,1820.0,81400,1844.0,1813.0
992,2018/09/10,1881.0,1882.364,1840.0,76600,1900.0,1840.0
993,2018/09/11,1889.0,1889.678,1892.0,71400,1903.0,1870.0
994,2018/09/12,1885.0,1889.088,1922.0,70100,1949.0,1865.0
995,2018/09/13,1902.0,1897.031,1882.0,44800,1914.0,1875.0
996,2018/09/14,1958.0,1934.171,1911.0,93400,1962.0,1903.0
997,2018/09/18,1959.0,1954.909,1949.0,54100,1970.0,1914.0
998,2018/09/19,2012.0,2002.316,1962.0,79200,2033.0,1953.0
999,2018/09/20,2079.0,2075.013,2073.0,132600,2094.0,2059.0
1000,2018/09/21,2121.0,2106.458,2080.0,121700,2126.0,2057.0
1001,2018/09/25,2119.0,2112.555,2111.0,92400,2137.0,2090.0
1002,2018/09/26,2144.0,2119.838,2103.0,60300,2147.0,2078.0
1003,2018/09/27,2065.0,2079.609,2129.0,88700,2129.0,2062.0
1004,2018/09/28,2101.0,2100.057,2061.0,87700,2127.0,2043.0
1005,2018/10/01,2090.0,2078.05,2051.0,88400,2097.0,2051.0
1006,2018/10/02,2039.0,2059.369,2094.0,79900,2118.0,2033.0
1007,2018/10/03,1993.0,2008.977,2052.0,60800,2052.0,1952.0
1008,2018/10/04,1995.0,1992.41,2023.0,52900,2023.0,1967.0
1009,2018/10/05,1971.0,1977.024,1984.0,41700,1993.0,1964.0
1010,2018/10/09,1930.0,1932.923,1969.0,42900,1969.0,1921.0
1011,2018/10/10,1940.0,1935.145,1933.0,36500,1950.0,1913.0
1012,2018/10/11,1894.0,1884.841,1884.0,77200,1906.0,1856.0
1013,2018/10/12,1900.0,1897.008,1890.0,67000,1919.0,1864.0
1014,2018/10/15,1887.0,1896.375,1892.0,86700,1918.0,1884.0
1015,2018/10/16,1876.0,1868.236,1880.0,48300,1881.0,1854.0
1016,2018/10/17,1935.0,1923.164,1906.0,47600,1942.0,1892.0
1017,2018/10/18,1897.0,1910.954,1945.0,39400,1945.0,1897.0
1018,2018/10/19,1927.0,1919.363,1899.0,54000,1939.0,1892.0
1019,2018/10/22,1926.0,1923.905,1915.0,36800,1943.0,1899.0
1020,2018/10/23,1867.0,1885.863,1926.0,46000,1945.0,1867.0
1021,2018/10/24,1901.0,1898.391,1871.0,53500,1920.0,1871.0
1022,2018/10/25,1836.0,1855.791,1871.0,69000,1919.0,1833.0
1023,2018/10/26,1824.0,1828.027,1849.0,74200,1867.0,1805.0
1024,2018/10/29,1819.0,1838.955,1823.0,62700,1877.0,1814.0
1025,2018/10/30,1897.0,1878.281,1803.0,125400,1917.0,1784.0
1026,2018/10/31,1962.0,1902.996,1894.0,125300,1962.0,1861.0
1027,2018/11/01,2044.0,2114.177,2102.0,268000,2197.0,2038.0
1028,2018/11/02,1922.0,1933.921,2020.0,111700,2026.0,1885.0
1029,2018/11/05,1924.0,1927.109,1920.0,50400,1945.0,1890.0
1030,2018/11/06,2012.0,1996.524,1922.0,85200,2020.0,1922.0
1031,2018/11/07,2024.0,2046.456,2062.0,80700,2073.0,2015.0
1032,2018/11/08,2036.0,2053.809,2052.0,60700,2109.0,2028.0
1033,2018/11/09,2025.0,2035.451,2036.0,59700,2058.0,2022.0
1034,2018/11/12,2010.0,2011.628,2025.0,53000,2036.0,1977.0
1035,2018/11/13,1951.0,1954.122,1974.0,36900,1974.0,1942.0
1036,2018/11/14,1902.0,1919.747,1962.0,43900,1987.0,1901.0
1037,2018/11/15,1861.0,1866.504,1870.0,47400,1900.0,1853.0
1038,2018/11/16,1834.0,1840.725,1870.0,59600,1874.0,1819.0
1039,2018/11/19,1844.0,1847.093,1839.0,28000,1861.0,1836.0
1040,2018/11/20,1845.0,1838.699,1839.0,35900,1851.0,1803.0
1041,2018/11/21,1819.0,1811.315,1800.0,30500,1826.0,1793.0
1042,2018/11/22,1824.0,1817.271,1821.0,30600,1839.0,1797.0
1043,2018/11/26,1816.0,1817.548,1806.0,19700,1833.0,1800.0
1044,2018/11/27,1858.0,1850.975,1820.0,31500,1867.0,1820.0
1045,2018/11/28,1908.0,1894.397,1874.0,37800,1910.0,1865.0
1046,2018/11/29,1977.0,1971.563,1930.0,91300,1992.0,1930.0
1047,2018/11/30,1928.0,1937.572,1989.0,60800,1990.0,1921.0
1048,2018/12/03,1977.0,1972.426,1951.0,32600,1984.0,1951.0
1049,2018/12/04,1854.0,1873.032,1950.0,104800,1950.0,1833.0
1050,2018/12/05,1893.0,1890.551,1830.0,107600,1935.0,1830.0
1051,2018/12/06,1837.0,1837.938,1879.0,68800,1881.0,1821.0
1052,2018/12/07,1798.0,1808.879,1847.0,63400,1871.0,1791.0
1053,2018/12/10,2068.0,2040.683,1958.0,578600,2095.0,1947.0
1054,2018/12/11,2008.0,2034.219,2080.0,220800,2087.0,2005.0
1055,2018/12/12,1960.0,1965.84,2013.0,147400,2016.0,1942.0
1056,2018/12/13,2009.0,1998.401,1967.0,86100,2016.0,1945.0
1057,2018/12/14,1867.0,1909.97,1943.0,218400,1970.0,1861.0
1058,2018/12/17,1846.0,1853.26,1889.0,85800,1889.0,1835.0
1059,2018/12/18,1793.0,1803.023,1826.0,108800,1839.0,1784.0
1060,2018/12/19,1792.0,1790.36,1800.0,94700,1810.0,1765.0
1061,2018/12/20,1745.0,1754.976,1792.0,121900,1802.0,1732.0
1062,2018/12/21,1673.0,1680.405,1720.0,132200,1733.0,1650.0
1063,2018/12/25,1624.0,1647.106,1650.0,98800,1684.0,1616.0
1064,2018/12/26,1631.0,1633.525,1643.0,54500,1670.0,1614.0
1065,2018/12/27,1724.0,1715.446,1671.0,90900,1734.0,1671.0
1066,2018/12/28,1736.0,1733.452,1722.0,46900,1757.0,1718.0
1067,2019/01/04,1764.0,1760.056,1696.0,124500,1783.0,1692.0
1068,2019/01/07,1838.0,1842.903,1816.0,88600,1874.0,1816.0
1069,2019/01/08,1843.0,1843.88,1844.0,56500,1872.0,1829.0
1070,2019/01/09,1877.0,1893.979,1875.0,114100,1924.0,1868.0
1071,2019/01/10,1865.0,1875.695,1879.0,97800,1910.0,1862.0
1072,2019/01/11,1926.0,1923.645,1901.0,134600,1952.0,1878.0
1073,2019/01/15,1936.0,1924.435,1900.0,90200,1936.0,1894.0
1074,2019/01/16,1940.0,1943.487,1940.0,56100,1963.0,1931.0
1075,2019/01/17,1972.0,1976.47,1969.0,76400,1998.0,1967.0
1076,2019/01/18,1964.0,1965.027,1972.0,66900,1977.0,1951.0
1077,2019/01/21,1970.0,1965.588,1992.0,64800,1993.0,1949.0
1078,2019/01/22,1947.0,1948.545,1976.0,49200,1982.0,1928.0
1079,2019/01/23,1934.0,1935.866,1926.0,102200,1944.0,1922.0
1080,2019/01/24,1963.0,1958.677,1935.0,73600,1980.0,1926.0
1081,2019/01/25,1969.0,1974.91,1964.0,165500,1990.0,1956.0
1082,2019/01/28,1934.0,1949.084,1961.0,63400,1977.0,1934.0
1083,2019/01/29,1943.0,1931.933,1934.0,89400,1947.0,1916.0
1084,2019/01/30,1944.0,1965.478,1965.0,144500,1997.0,1940.0
1085,2019/01/31,1963.0,1987.374,1976.0,110700,2020.0,1962.0
1086,2019/02/01,2132.0,2133.961,2103.0,254200,2189.0,2090.0
1087,2019/02/04,2237.0,2222.939,2124.0,292600,2253.0,2116.0
1088,2019/02/05,2214.0,2216.786,2209.0,95100,2241.0,2199.0
1089,2019/02/06,2189.0,2202.224,2236.0,65500,2245.0,2184.0
1090,2019/02/07,2179.0,2173.711,2184.0,65100,2184.0,2153.0
1091,2019/02/08,2133.0,2133.77,2140.0,63400,2155.0,2122.0
1092,2019/02/12,2218.0,2204.683,2141.0,74200,2224.0,2141.0
1093,2019/02/13,2205.0,2199.835,2225.0,75300,2240.0,2172.0
1094,2019/02/14,2230.0,2214.069,2205.0,43200,2230.0,2194.0
1095,2019/02/15,2215.0,2209.89,2207.0,41800,2223.0,2194.0
1096,2019/02/18,2268.0,2257.815,2251.0,77300,2275.0,2241.0
1097,2019/02/19,2254.0,2263.907,2295.0,63100,2297.0,2251.0
1098,2019/02/20,2233.0,2234.556,2254.0,59700,2254.0,2223.0
1099,2019/02/21,2258.0,2251.928,2255.0,78100,2266.0,2240.0
1100,2019/02/22,2238.0,2242.653,2242.0,57000,2263.0,2228.0
1101,2019/02/25,2281.0,2270.379,2269.0,53100,2283.0,2249.0
1102,2019/02/26,2279.0,2280.929,2292.0,54700,2292.0,2267.0
1103,2019/02/27,2286.0,2286.021,2290.0,74600,2294.0,2272.0
1104,2019/02/28,2273.0,2278.246,2291.0,85700,2291.0,2269.0
1105,2019/03/01,2260.0,2267.018,2270.0,88400,2288.0,2254.0
1106,2019/03/04,2255.0,2261.617,2269.0,95800,2309.0,2240.0
1107,2019/03/05,2230.0,2228.652,2240.0,59800,2240.0,2221.0
1108,2019/03/06,2220.0,2217.481,2221.0,63000,2232.0,2203.0
1109,2019/03/07,2199.0,2197.609,2195.0,80300,2221.0,2190.0
1110,2019/03/08,2136.0,2155.946,2170.0,81300,2180.0,2133.0
1111,2019/03/11,2137.0,2137.214,2137.0,65100,2150.0,2119.0
1112,2019/03/12,2195.0,2180.286,2168.0,74900,2196.0,2158.0
1113,2019/03/13,2184.0,2174.113,2164.0,107200,2194.0,2138.0
1114,2019/03/14,2168.0,2173.112,2191.0,60100,2201.0,2157.0
1115,2019/03/15,2171.0,2177.581,2183.0,78700,2198.0,2170.0
1116,2019/03/18,2227.0,2214.376,2200.0,88500,2228.0,2195.0
1117,2019/03/19,2222.0,2222.2,2226.0,57500,2232.0,2213.0
1118,2019/03/20,2235.0,2220.514,2206.0,59000,2236.0,2186.0
1119,2019/03/22,2251.0,2243.594,2240.0,71200,2251.0,2226.0
1120,2019/03/25,2140.0,2150.111,2200.0,66900,2202.0,2133.0
1121,2019/03/26,2273.0,2257.435,2186.0,122200,2280.0,2182.0
1122,2019/03/27,2269.0,2257.666,2258.0,68600,2273.0,2231.0
1123,2019/03/28,2206.0,2209.439,2235.0,78800,2245.0,2192.0
1124,2019/03/29,2214.0,2211.804,2240.0,33600,2240.0,2199.0
1125,2019/04/01,2252.0,2253.994,2264.0,48300,2264.0,2244.0
1126,2019/04/02,2244.0,2253.683,2286.0,41300,2291.0,2240.0
1127,2019/04/03,2276.0,2256.431,2240.0,74300,2276.0,2222.0
1128,2019/04/04,2281.0,2294.07,2287.0,51800,2317.0,2276.0
1129,2019/04/05,2272.0,2272.002,2282.0,45600,2285.0,2261.0
1130,2019/04/08,2273.0,2274.159,2272.0,47300,2290.0,2261.0
1131,2019/04/09,2260.0,2255.635,2267.0,32600,2268.0,2238.0
1132,2019/04/10,2242.0,2227.738,2236.0,42400,2244.0,2210.0
1133,2019/04/11,2236.0,2240.529,2249.0,22300,2261.0,2231.0
1134,2019/04/12,2214.0,2216.819,2241.0,55800,2241.0,2208.0
1135,2019/04/15,2280.0,2281.283,2286.0,69600,2294.0,2265.0
1136,2019/04/16,2263.0,2262.256,2271.0,44200,2274.0,2251.0
1137,2019/04/17,2247.0,2245.137,2263.0,40300,2267.0,2226.0
1138,2019/04/18,2178.0,2193.375,2270.0,61600,2270.0,2168.0
1139,2019/04/19,2216.0,2215.61,2204.0,32300,2231.0,2196.0
1140,2019/04/22,2192.0,2190.26,2200.0,15400,2200.0,2182.0
1141,2019/04/23,2162.0,2161.302,2180.0,60700,2193.0,2147.0
1142,2019/04/24,2154.0,2164.253,2160.0,60100,2186.0,2149.0
1143,2019/04/25,2152.0,2143.563,2149.0,54700,2158.0,2121.0
1144,2019/04/26,2172.0,2163.164,2145.0,70300,2186.0,2124.0
1145,2019/05/07,2139.0,2158.23,2165.0,44800,2180.0,2138.0
1146,2019/05/08,2085.0,2095.32,2100.0,61500,2117.0,2082.0
1147,2019/05/09,2067.0,2064.359,2054.0,94700,2096.0,2032.0
1148,2019/05/10,2081.0,2076.935,2067.0,114500,2112.0,2044.0
1149,2019/05/13,2033.0,2049.482,2077.0,79700,2082.0,2033.0
1150,2019/05/14,2034.0,2016.775,2000.0,72000,2034.0,1988.0
1151,2019/05/15,2071.0,2058.777,2055.0,94600,2087.0,2021.0
1152,2019/05/16,2054.0,2106.477,2321.0,177300,2327.0,2024.0
1153,2019/05/17,2031.0,2035.866,2054.0,81100,2071.0,2008.0
1154,2019/05/20,2006.0,2017.044,2037.0,52000,2054.0,1999.0
1155,2019/05/21,1951.0,1955.899,1986.0,79800,1987.0,1945.0
1156,2019/05/22,1924.0,1928.332,1956.0,74000,1956.0,1909.0
1157,2019/05/23,1953.0,1942.25,1910.0,93200,1971.0,1910.0
1158,2019/05/24,1960.0,1958.162,1920.0,51100,1976.0,1911.0
1159,2019/05/27,1957.0,1963.721,1969.0,24000,1983.0,1954.0
1160,2019/05/28,1945.0,1946.137,1947.0,43100,1966.0,1939.0
1161,2019/05/29,1906.0,1906.364,1905.0,63400,1919.0,1890.0
1162,2019/05/30,1891.0,1890.654,1887.0,55200,1905.0,1872.0
1163,2019/05/31,1858.0,1857.395,1867.0,75500,1869.0,1841.0
1164,2019/06/03,1815.0,1814.377,1818.0,73300,1831.0,1800.0
1165,2019/06/04,1840.0,1817.914,1811.0,74100,1840.0,1790.0
1166,2019/06/05,1903.0,1902.1,1920.0,86700,1931.0,1885.0
1167,2019/06/06,1874.0,1884.129,1903.0,31900,1913.0,1874.0
1168,2019/06/07,1889.0,1882.277,1896.0,50500,1896.0,1867.0
1169,2019/06/10,1950.0,1937.012,1929.0,110400,1957.0,1917.0
1170,2019/06/11,1977.0,1966.908,1950.0,99800,1977.0,1945.0
1171,2019/06/12,2012.0,2004.187,1977.0,72300,2017.0,1971.0
1172,2019/06/13,1973.0,1980.173,2005.0,63000,2005.0,1965.0
1173,2019/06/14,2005.0,1990.471,1983.0,44200,2010.0,1960.0
1174,2019/06/17,1972.0,1976.232,1996.0,34000,1996.0,1963.0
1175,2019/06/18,1966.0,1974.807,1976.0,37300,1991.0,1965.0
1176,2019/06/19,2008.0,2007.145,1992.0,48400,2020.0,1992.0
1177,2019/06/20,1988.0,1996.697,2012.0,61700,2022.0,1978.0
1178,2019/06/21,1961.0,1968.549,1989.0,68700,1996.0,1961.0
1179,2019/06/24,1959.0,1961.072,1961.0,29100,1978.0,1955.0
1180,2019/06/25,1936.0,1938.34,1950.0,64700,1962.0,1926.0
1181,2019/06/26,1955.0,1965.945,1932.0,72800,2002.0,1929.0
1182,2019/06/27,2018.0,2005.477,1960.0,64200,2018.0,1960.0
1183,2019/06/28,2058.0,2050.41,2018.0,128100,2077.0,2018.0
1184,2019/07/01,2129.0,2117.449,2106.0,107700,2133.0,2095.0
1185,2019/07/02,2156.0,2150.773,2144.0,97900,2164.0,2131.0
1186,2019/07/03,2151.0,2164.461,2156.0,77300,2188.0,2143.0
1187,2019/07/04,2196.0,2184.054,2166.0,57300,2208.0,2157.0
1188,2019/07/05,2197.0,2197.781,2199.0,81900,2211.0,2172.0
1189,2019/07/08,2142.0,2162.514,2173.0,89500,2197.0,2142.0
1190,2019/07/09,2107.0,2126.641,2141.0,64400,2168.0,2107.0
1191,2019/07/10,2103.0,2105.612,2107.0,92000,2120.0,2087.0
1192,2019/07/11,2122.0,2121.972,2115.0,46200,2131.0,2108.0
1193,2019/07/12,2134.0,2143.654,2134.0,46000,2166.0,2129.0
1194,2019/07/16,2124.0,2125.842,2122.0,38700,2140.0,2118.0
1195,2019/07/17,2134.0,2129.245,2121.0,57100,2141.0,2110.0
1196,2019/07/18,2051.0,2061.992,2110.0,108000,2111.0,2042.0
1197,2019/07/19,2108.0,2107.593,2052.0,61200,2130.0,2052.0
1198,2019/07/22,2095.0,2100.177,2108.0,43600,2112.0,2091.0
1199,2019/07/23,2107.0,2105.218,2090.0,43100,2114.0,2090.0
1200,2019/07/24,2107.0,2110.755,2113.0,60400,2135.0,2097.0
1201,2019/07/25,2117.0,2115.404,2107.0,18800,2121.0,2102.0
1202,2019/07/26,2092.0,2088.438,2100.0,17600,2100.0,2074.0
1203,2019/07/29,2090.0,2087.905,2096.0,30400,2098.0,2058.0
1204,2019/07/30,2094.0,2091.726,2091.0,55500,2108.0,2077.0
1205,2019/07/31,2090.0,2083.982,2065.0,77200,2105.0,2062.0
1206,2019/08/01,2106.0,2097.058,2078.0,34300,2108.0,2076.0
1207,2019/08/02,2054.0,2049.916,2056.0,91700,2070.0,2020.0
1208,2019/08/05,1993.0,1995.244,2031.0,66800,2049.0,1961.0
1209,2019/08/06,1979.0,1956.78,1920.0,53100,1983.0,1920.0
1210,2019/08/07,1998.0,1991.384,1970.0,48200,2000.0,1969.0
1211,2019/08/08,2030.0,2024.498,1982.0,89000,2053.0,1970.0
1212,2019/08/09,2199.0,2173.158,2164.0,219100,2214.0,2117.0
1213,2019/08/13,2198.0,2188.064,2149.0,135400,2231.0,2128.0
1214,2019/08/14,2171.0,2176.33,2218.0,87400,2218.0,2157.0
1215,2019/08/15,2138.0,2120.77,2094.0,63000,2149.0,2083.0
1216,2019/08/16,2096.0,2112.583,2130.0,57500,2140.0,2096.0
1217,2019/08/19,2080.0,2087.091,2125.0,49700,2125.0,2069.0
1218,2019/08/20,2084.0,2075.534,2080.0,56800,2085.0,2053.0
1219,2019/08/21,2039.0,2037.925,2052.0,53300,2069.0,2024.0
1220,2019/08/22,1991.0,2000.911,2039.0,48200,2039.0,1986.0
1221,2019/08/23,1991.0,1981.373,1986.0,43400,1995.0,1964.0
