ds,yhat
2019-08-07,1236.1092876853265
2019-08-08,1233.139497849724
2019-08-09,1231.1568372503978
2019-08-13,1212.31984144904
2019-08-14,1200.4203518086183
2019-08-15,1189.6697441362332
2019-08-16,1182.8081546135359
2019-08-19,1182.2324771042033
2019-08-20,1180.3481634019968
2019-08-21,1174.1592871742794
2019-08-22,1164.1996205198332
2019-08-23,1152.911283540606
2019-08-26,1137.6713706575222
2019-08-27,1138.3611513533747
2019-08-28,1136.5769500468111
2019-08-29,1129.5752879443453
2019-08-30,1117.780089921317
2019-09-02,1090.2060363149217
2019-09-03,1090.1351092279606
2019-09-04,1090.9884781863134
2019-09-05,1089.435503039952
