ds,yhat
2019-08-22,720.0018299583988
2019-08-23,725.4075688071811
2019-08-26,727.1618774517154
2019-08-27,723.2293495873122
2019-08-28,722.2297502331758
2019-08-29,725.9475970035622
2019-08-30,732.911565548138
2019-09-02,739.2417266144471
2019-09-03,733.2267339246507
2019-09-04,726.9547223150354
2019-09-05,722.9752880041982
2019-09-06,721.9658777388915
2019-09-09,722.6000492128578
2019-09-10,719.9116734172158
2019-09-11,716.6089765968427
2019-09-12,714.7822891120978
2019-09-13,716.4293115298353
2019-09-17,748.2175264647138
2019-09-18,752.3654081034197
2019-09-19,754.826896547865
2019-09-20,758.6512293279843
