,Date,Close,VWAP,Open,Volume,High,Low
0,2014/08/25,2315.0,2300.504,2280.0,49600,2315.0,2275.0
1,2014/08/26,2300.0,2317.549,2335.0,61200,2335.0,2295.0
2,2014/08/27,2315.0,2305.857,2300.0,43200,2315.0,2295.0
3,2014/08/28,2300.0,2298.186,2310.0,43000,2315.0,2290.0
4,2014/08/29,2300.0,2303.257,2300.0,39000,2330.0,2285.0
5,2014/09/01,2340.0,2341.013,2320.0,81000,2360.0,2320.0
6,2014/09/02,2355.0,2353.284,2345.0,47200,2365.0,2345.0
7,2014/09/03,2340.0,2343.797,2355.0,64800,2365.0,2330.0
8,2014/09/04,2340.0,2345.885,2345.0,45200,2355.0,2335.0
9,2014/09/05,2320.0,2325.054,2340.0,37400,2340.0,2310.0
10,2014/09/08,2350.0,2347.401,2325.0,85400,2360.0,2325.0
11,2014/09/09,2365.0,2365.012,2350.0,88800,2375.0,2350.0
12,2014/09/10,2430.0,2401.749,2370.0,173800,2430.0,2365.0
13,2014/09/11,2410.0,2425.901,2440.0,68800,2455.0,2405.0
14,2014/09/12,2395.0,2413.243,2435.0,103000,2435.0,2380.0
15,2014/09/16,2410.0,2411.318,2395.0,66800,2425.0,2395.0
16,2014/09/17,2400.0,2410.342,2415.0,38000,2425.0,2400.0
17,2014/09/18,2445.0,2443.257,2440.0,130200,2460.0,2415.0
18,2014/09/19,2475.0,2469.69,2465.0,167600,2485.0,2455.0
19,2014/09/22,2465.0,2471.827,2490.0,72800,2495.0,2455.0
20,2014/09/24,2460.0,2457.051,2450.0,51200,2470.0,2440.0
21,2014/09/25,2525.0,2507.425,2490.0,93600,2525.0,2480.0
22,2014/09/26,2480.0,2496.504,2495.0,91800,2525.0,2475.0
23,2014/09/29,2510.0,2510.157,2500.0,51000,2520.0,2495.0
24,2014/09/30,2500.0,2492.853,2500.0,68000,2510.0,2470.0
25,2014/10/01,2470.0,2480.651,2500.0,53800,2500.0,2460.0
26,2014/10/02,2360.0,2380.353,2410.0,113400,2420.0,2360.0
27,2014/10/03,2370.0,2363.171,2350.0,118600,2380.0,2345.0
28,2014/10/06,2445.0,2445.398,2410.0,123200,2465.0,2375.0
29,2014/10/07,2390.0,2409.732,2420.0,85600,2440.0,2385.0
30,2014/10/08,2345.0,2342.054,2330.0,74000,2365.0,2330.0
31,2014/10/09,2310.0,2331.555,2350.0,68800,2360.0,2310.0
32,2014/10/10,2260.0,2266.42,2275.0,81000,2285.0,2250.0
33,2014/10/14,2185.0,2204.08,2190.0,190200,2245.0,2175.0
34,2014/10/15,2165.0,2171.032,2185.0,126000,2205.0,2135.0
35,2014/10/16,2110.0,2118.689,2125.0,93800,2135.0,2100.0
36,2014/10/17,2060.0,2082.597,2110.0,123600,2110.0,2060.0
37,2014/10/20,2120.0,2111.569,2125.0,172800,2130.0,2090.0
38,2014/10/21,2040.0,2067.166,2125.0,155600,2130.0,2035.0
39,2014/10/22,2120.0,2119.043,2110.0,117000,2135.0,2095.0
40,2014/10/23,2080.0,2090.845,2085.0,116000,2110.0,2070.0
41,2014/10/24,2120.0,2120.524,2115.0,97400,2135.0,2100.0
42,2014/10/27,2135.0,2134.699,2130.0,86200,2150.0,2120.0
43,2014/10/28,2115.0,2115.511,2120.0,74400,2140.0,2090.0
44,2014/10/29,2125.0,2124.099,2125.0,109800,2145.0,2110.0
45,2014/10/30,2135.0,2142.672,2125.0,110800,2155.0,2125.0
46,2014/10/31,2185.0,2162.941,2150.0,199600,2200.0,2135.0
47,2014/11/04,2350.0,2361.345,2345.0,327200,2395.0,2310.0
48,2014/11/05,2345.0,2343.412,2345.0,178800,2365.0,2320.0
49,2014/11/06,2360.0,2371.294,2345.0,214800,2395.0,2345.0
50,2014/11/07,2395.0,2392.34,2365.0,152600,2420.0,2365.0
51,2014/11/10,2375.0,2374.064,2375.0,75800,2390.0,2360.0
52,2014/11/11,2390.0,2385.451,2370.0,79800,2395.0,2365.0
53,2014/11/12,2360.0,2385.229,2400.0,96200,2415.0,2350.0
54,2014/11/13,2395.0,2378.181,2345.0,58800,2400.0,2345.0
55,2014/11/14,2415.0,2409.453,2420.0,78600,2425.0,2385.0
56,2014/11/17,2340.0,2365.688,2425.0,71200,2425.0,2340.0
57,2014/11/18,2385.0,2368.78,2330.0,84400,2395.0,2325.0
58,2014/11/19,2355.0,2370.398,2375.0,65400,2405.0,2350.0
59,2014/11/20,2325.0,2329.868,2360.0,91000,2360.0,2315.0
60,2014/11/21,2345.0,2333.806,2335.0,45200,2355.0,2315.0
61,2014/11/25,2380.0,2374.957,2350.0,69600,2390.0,2350.0
62,2014/11/26,2350.0,2373.911,2385.0,125800,2410.0,2345.0
63,2014/11/27,2305.0,2320.127,2350.0,118000,2355.0,2300.0
64,2014/11/28,2340.0,2328.329,2315.0,71800,2340.0,2305.0
65,2014/12/01,2335.0,2336.852,2350.0,90200,2350.0,2325.0
66,2014/12/02,2335.0,2324.566,2335.0,80600,2340.0,2310.0
67,2014/12/03,2355.0,2356.058,2350.0,122000,2370.0,2335.0
68,2014/12/04,2370.0,2376.224,2375.0,95600,2390.0,2355.0
69,2014/12/05,2410.0,2393.308,2380.0,128200,2415.0,2360.0
70,2014/12/08,2440.0,2437.386,2450.0,122400,2450.0,2415.0
71,2014/12/09,2475.0,2472.13,2440.0,160600,2495.0,2430.0
72,2014/12/10,2380.0,2386.51,2440.0,163600,2440.0,2355.0
73,2014/12/11,2325.0,2306.721,2305.0,177800,2325.0,2280.0
74,2014/12/12,2300.0,2304.125,2300.0,220600,2330.0,2280.0
75,2014/12/15,2270.0,2269.75,2295.0,175800,2300.0,2245.0
76,2014/12/16,2240.0,2239.777,2240.0,161000,2255.0,2230.0
77,2014/12/17,2270.0,2256.065,2240.0,123000,2280.0,2230.0
78,2014/12/18,2340.0,2334.714,2350.0,167800,2370.0,2310.0
79,2014/12/19,2370.0,2364.151,2385.0,114200,2385.0,2345.0
80,2014/12/22,2420.0,2404.188,2415.0,134200,2420.0,2385.0
81,2014/12/24,2420.0,2411.055,2430.0,145000,2435.0,2385.0
82,2014/12/25,2400.0,2397.409,2420.0,93400,2420.0,2375.0
83,2014/12/26,2420.0,2411.072,2415.0,81200,2425.0,2390.0
84,2014/12/29,2430.0,2425.865,2420.0,99400,2440.0,2410.0
85,2014/12/30,2405.0,2403.812,2410.0,60600,2415.0,2385.0
86,2015/01/05,2370.0,2379.411,2395.0,84800,2400.0,2365.0
87,2015/01/06,2300.0,2320.202,2325.0,99200,2350.0,2295.0
88,2015/01/07,2295.0,2294.303,2285.0,74600,2315.0,2270.0
89,2015/01/08,2375.0,2373.435,2310.0,161000,2395.0,2310.0
90,2015/01/09,2370.0,2386.164,2415.0,96200,2425.0,2335.0
91,2015/01/13,2320.0,2298.624,2330.0,109000,2330.0,2280.0
92,2015/01/14,2265.0,2283.161,2295.0,109800,2310.0,2260.0
93,2015/01/15,2265.0,2275.189,2265.0,127200,2305.0,2255.0
94,2015/01/16,2260.0,2244.939,2255.0,113800,2265.0,2225.0
95,2015/01/19,2260.0,2262.114,2255.0,88000,2275.0,2245.0
96,2015/01/20,2330.0,2313.248,2280.0,50800,2330.0,2270.0
97,2015/01/21,2280.0,2294.177,2315.0,48600,2315.0,2280.0
98,2015/01/22,2280.0,2276.033,2280.0,24200,2285.0,2270.0
99,2015/01/23,2305.0,2297.062,2290.0,61600,2315.0,2285.0
100,2015/01/26,2275.0,2268.629,2280.0,74400,2280.0,2255.0
101,2015/01/27,2300.0,2297.073,2280.0,71400,2320.0,2275.0
102,2015/01/28,2305.0,2298.398,2275.0,98600,2315.0,2275.0
103,2015/01/29,2250.0,2261.585,2280.0,118000,2295.0,2235.0
104,2015/01/30,2275.0,2269.805,2265.0,61600,2280.0,2260.0
105,2015/02/02,2230.0,2228.58,2250.0,151400,2255.0,2210.0
106,2015/02/03,2170.0,2173.441,2230.0,214200,2230.0,2145.0
107,2015/02/04,2220.0,2222.875,2185.0,106800,2240.0,2185.0
108,2015/02/05,2220.0,2227.889,2240.0,167200,2260.0,2200.0
109,2015/02/06,2220.0,2220.268,2230.0,123400,2245.0,2205.0
110,2015/02/09,2265.0,2257.283,2235.0,135800,2280.0,2230.0
111,2015/02/10,2245.0,2236.304,2245.0,140400,2250.0,2225.0
112,2015/02/12,2265.0,2261.319,2260.0,210000,2280.0,2240.0
113,2015/02/13,2270.0,2262.245,2255.0,88200,2275.0,2250.0
114,2015/02/16,2290.0,2295.668,2275.0,97400,2315.0,2275.0
115,2015/02/17,2305.0,2300.484,2290.0,97200,2320.0,2270.0
116,2015/02/18,2290.0,2287.28,2310.0,224600,2320.0,2270.0
117,2015/02/19,2265.0,2267.468,2280.0,201800,2285.0,2255.0
118,2015/02/20,2290.0,2281.799,2275.0,139000,2295.0,2265.0
119,2015/02/23,2295.0,2299.446,2300.0,191200,2310.0,2285.0
120,2015/02/24,2290.0,2287.396,2295.0,244200,2305.0,2270.0
121,2015/02/25,2365.0,2347.723,2300.0,396600,2370.0,2300.0
122,2015/02/26,2365.0,2381.439,2365.0,262800,2400.0,2355.0
123,2015/02/27,2320.0,2336.233,2350.0,205200,2370.0,2310.0
124,2015/03/02,2340.0,2342.912,2345.0,147000,2360.0,2325.0
125,2015/03/03,2325.0,2321.742,2350.0,120600,2350.0,2295.0
126,2015/03/04,2415.0,2380.615,2325.0,261800,2420.0,2310.0
127,2015/03/05,2465.0,2465.332,2415.0,398200,2490.0,2415.0
128,2015/03/06,2480.0,2463.242,2460.0,225200,2495.0,2430.0
129,2015/03/09,2480.0,2487.792,2480.0,163000,2515.0,2465.0
130,2015/03/10,2490.0,2481.698,2490.0,139000,2495.0,2465.0
131,2015/03/11,2485.0,2479.528,2450.0,131400,2495.0,2450.0
132,2015/03/12,2540.0,2537.169,2500.0,162800,2560.0,2500.0
133,2015/03/13,2555.0,2556.086,2560.0,176800,2565.0,2540.0
134,2015/03/16,2600.0,2595.293,2555.0,105800,2610.0,2555.0
135,2015/03/17,2620.0,2626.67,2630.0,113200,2650.0,2610.0
136,2015/03/18,2650.0,2646.607,2620.0,166200,2675.0,2615.0
137,2015/03/19,2680.0,2678.183,2675.0,146400,2695.0,2640.0
138,2015/03/20,2635.0,2631.785,2670.0,180400,2670.0,2605.0
139,2015/03/23,2630.0,2619.499,2635.0,97800,2635.0,2605.0
140,2015/03/24,2605.0,2610.966,2630.0,64200,2630.0,2600.0
141,2015/03/25,2600.0,2597.987,2615.0,108800,2640.0,2575.0
142,2015/03/26,2575.0,2583.49,2600.0,108600,2630.0,2560.0
143,2015/03/27,2550.0,2577.126,2550.0,135000,2640.0,2535.0
144,2015/03/30,2530.0,2515.137,2540.0,87800,2540.0,2475.0
145,2015/03/31,2530.0,2552.759,2545.0,112000,2600.0,2530.0
146,2015/04/01,2475.0,2486.87,2515.0,156200,2525.0,2460.0
147,2015/04/02,2525.0,2531.329,2480.0,91800,2560.0,2480.0
148,2015/04/03,2570.0,2565.854,2550.0,72600,2590.0,2540.0
149,2015/04/06,2540.0,2531.762,2520.0,66400,2550.0,2500.0
150,2015/04/07,2575.0,2586.27,2540.0,137000,2610.0,2540.0
151,2015/04/08,2600.0,2600.17,2600.0,106200,2635.0,2580.0
152,2015/04/09,2615.0,2612.191,2600.0,190800,2630.0,2585.0
153,2015/04/10,2630.0,2613.759,2635.0,165200,2640.0,2575.0
154,2015/04/13,2645.0,2641.947,2650.0,101200,2655.0,2630.0
155,2015/04/14,2675.0,2672.006,2660.0,169000,2695.0,2645.0
156,2015/04/15,2675.0,2675.143,2675.0,91000,2690.0,2655.0
157,2015/04/16,2685.0,2676.717,2680.0,93200,2695.0,2645.0
158,2015/04/17,2645.0,2647.675,2655.0,94200,2675.0,2620.0
159,2015/04/20,2615.0,2618.197,2615.0,61000,2635.0,2605.0
160,2015/04/21,2595.0,2605.446,2620.0,94200,2640.0,2580.0
161,2015/04/22,2650.0,2633.758,2620.0,66000,2650.0,2615.0
162,2015/04/23,2625.0,2625.538,2630.0,106000,2640.0,2615.0
163,2015/04/24,2625.0,2631.502,2625.0,44600,2650.0,2620.0
164,2015/04/27,2635.0,2620.519,2620.0,57800,2635.0,2590.0
165,2015/04/28,2670.0,2653.703,2620.0,95600,2670.0,2620.0
166,2015/04/30,2670.0,2698.038,2700.0,283800,2760.0,2665.0
167,2015/05/01,2645.0,2661.468,2675.0,132200,2710.0,2630.0
168,2015/05/07,2635.0,2645.326,2650.0,89000,2675.0,2625.0
169,2015/05/08,2660.0,2649.288,2655.0,77200,2660.0,2630.0
170,2015/05/11,2685.0,2679.619,2685.0,149400,2700.0,2645.0
171,2015/05/12,2680.0,2675.414,2660.0,82200,2695.0,2655.0
172,2015/05/13,2775.0,2741.218,2695.0,163400,2790.0,2690.0
173,2015/05/14,2685.0,2727.881,2770.0,134000,2780.0,2685.0
174,2015/05/15,2670.0,2686.152,2705.0,86800,2730.0,2665.0
175,2015/05/18,2695.0,2689.709,2675.0,65200,2705.0,2670.0
176,2015/05/19,2710.0,2705.496,2700.0,84800,2725.0,2685.0
177,2015/05/20,2690.0,2702.883,2725.0,95400,2735.0,2680.0
178,2015/05/21,2700.0,2700.734,2700.0,65400,2715.0,2685.0
179,2015/05/22,2695.0,2684.879,2700.0,41400,2700.0,2670.0
180,2015/05/25,2700.0,2691.037,2695.0,55000,2705.0,2675.0
181,2015/05/26,2685.0,2690.859,2685.0,39600,2705.0,2680.0
182,2015/05/27,2910.0,2848.256,2750.0,476400,2920.0,2730.0
183,2015/05/28,2920.0,2950.836,2975.0,317000,2995.0,2910.0
184,2015/05/29,2940.0,2916.886,2890.0,103400,2950.0,2880.0
185,2015/06/01,2975.0,2962.795,2955.0,84800,2980.0,2940.0
186,2015/06/02,3005.0,3004.762,2970.0,176600,3035.0,2970.0
187,2015/06/03,3030.0,3011.9,2995.0,131600,3035.0,2980.0
188,2015/06/04,3030.0,3019.039,3005.0,113400,3045.0,2970.0
189,2015/06/05,2980.0,2981.872,2995.0,128200,3020.0,2950.0
190,2015/06/08,2945.0,2946.6,2985.0,75000,2985.0,2925.0
191,2015/06/09,2850.0,2886.204,2925.0,75600,2930.0,2850.0
192,2015/06/10,2935.0,2959.476,2940.0,267000,3000.0,2905.0
193,2015/06/11,2975.0,2980.01,2965.0,107200,3000.0,2950.0
194,2015/06/12,3040.0,3014.606,3020.0,182800,3040.0,2980.0
195,2015/06/15,3120.0,3094.669,3065.0,235400,3125.0,3045.0
196,2015/06/16,3050.0,3059.039,3125.0,188200,3135.0,3005.0
197,2015/06/17,3035.0,3038.703,3075.0,63200,3075.0,3015.0
198,2015/06/18,2970.0,2987.475,3035.0,78000,3035.0,2970.0
199,2015/06/19,2935.0,2945.894,2985.0,116400,2990.0,2930.0
200,2015/06/22,2950.0,2938.054,2935.0,77600,2955.0,2915.0
201,2015/06/23,2975.0,2958.483,2965.0,53400,2975.0,2935.0
202,2015/06/24,2960.0,2961.482,2995.0,77600,2995.0,2945.0
203,2015/06/25,2915.0,2922.803,2955.0,74200,2955.0,2915.0
204,2015/06/26,2895.0,2889.3,2920.0,88600,2930.0,2870.0
205,2015/06/29,2785.0,2803.053,2765.0,133000,2840.0,2765.0
206,2015/06/30,2805.0,2790.378,2775.0,108600,2810.0,2765.0
207,2015/07/01,2840.0,2845.959,2795.0,92800,2870.0,2795.0
208,2015/07/02,2840.0,2855.354,2890.0,62200,2895.0,2830.0
209,2015/07/03,2835.0,2824.131,2830.0,41400,2840.0,2805.0
210,2015/07/06,2745.0,2756.523,2775.0,106400,2805.0,2735.0
211,2015/07/07,2750.0,2768.451,2760.0,96800,2810.0,2740.0
212,2015/07/08,2625.0,2674.619,2750.0,149400,2760.0,2625.0
213,2015/07/09,2595.0,2542.133,2530.0,117200,2605.0,2475.0
214,2015/07/10,2600.0,2625.413,2640.0,155200,2670.0,2585.0
215,2015/07/13,2575.0,2592.102,2615.0,158000,2635.0,2570.0
216,2015/07/14,2620.0,2630.489,2635.0,128800,2670.0,2605.0
217,2015/07/15,2565.0,2576.341,2620.0,191000,2625.0,2540.0
218,2015/07/16,2585.0,2561.334,2545.0,75000,2585.0,2525.0
219,2015/07/17,2550.0,2560.183,2575.0,54600,2585.0,2545.0
220,2015/07/21,2585.0,2589.79,2560.0,99800,2610.0,2560.0
221,2015/07/22,2560.0,2567.89,2595.0,61600,2595.0,2555.0
222,2015/07/23,2530.0,2539.484,2585.0,106600,2585.0,2515.0
223,2015/07/24,2480.0,2492.515,2520.0,65600,2525.0,2470.0
224,2015/07/27,2475.0,2474.249,2480.0,91800,2505.0,2460.0
225,2015/07/28,2435.0,2432.156,2475.0,79800,2475.0,2405.0
226,2015/07/29,2360.0,2378.005,2425.0,88200,2435.0,2360.0
227,2015/07/30,2360.0,2374.545,2355.0,151400,2420.0,2340.0
228,2015/07/31,2405.0,2385.03,2400.0,133400,2415.0,2355.0
229,2015/08/03,2470.0,2437.652,2445.0,220600,2490.0,2390.0
230,2015/08/04,2490.0,2492.646,2465.0,250600,2540.0,2455.0
231,2015/08/05,2435.0,2447.392,2450.0,138800,2480.0,2430.0
232,2015/08/06,2450.0,2452.64,2435.0,107600,2480.0,2430.0
233,2015/08/07,2545.0,2521.807,2430.0,173800,2550.0,2430.0
234,2015/08/10,2520.0,2508.798,2550.0,94000,2550.0,2485.0
235,2015/08/11,2555.0,2541.165,2530.0,123600,2565.0,2500.0
236,2015/08/12,2465.0,2492.167,2520.0,132000,2555.0,2460.0
237,2015/08/13,2490.0,2496.656,2450.0,146200,2525.0,2450.0
238,2015/08/14,2445.0,2457.382,2475.0,92800,2480.0,2440.0
239,2015/08/17,2395.0,2398.056,2435.0,150200,2445.0,2380.0
240,2015/08/18,2415.0,2412.07,2400.0,54600,2425.0,2395.0
241,2015/08/19,2380.0,2395.613,2405.0,83200,2420.0,2375.0
242,2015/08/20,2330.0,2343.479,2380.0,94000,2385.0,2325.0
243,2015/08/21,2235.0,2246.78,2280.0,206200,2280.0,2220.0
244,2015/08/24,2115.0,2151.595,2150.0,175600,2195.0,2110.0
245,2015/08/25,2035.0,2087.607,2035.0,191800,2175.0,2005.0
246,2015/08/26,2130.0,2110.79,2105.0,159600,2150.0,2065.0
247,2015/08/27,2125.0,2156.953,2210.0,134200,2210.0,2120.0
248,2015/08/28,2205.0,2216.935,2185.0,108000,2250.0,2185.0
249,2015/08/31,2175.0,2171.552,2235.0,112800,2235.0,2155.0
250,2015/09/01,2100.0,2123.448,2145.0,90200,2165.0,2095.0
251,2015/09/02,2035.0,2055.568,2055.0,158600,2085.0,2020.0
252,2015/09/03,2080.0,2094.236,2095.0,164800,2135.0,2065.0
253,2015/09/04,2030.0,2031.221,2095.0,94200,2095.0,2005.0
254,2015/09/07,2035.0,2026.411,2030.0,79400,2060.0,2000.0
255,2015/09/08,2035.0,2056.039,2050.0,82800,2085.0,2025.0
256,2015/09/09,2080.0,2069.043,2065.0,215200,2105.0,2055.0
257,2015/09/10,2055.0,2044.144,2040.0,114400,2065.0,2020.0
258,2015/09/11,2025.0,2026.13,2015.0,126600,2060.0,2010.0
259,2015/09/14,1995.0,2005.056,2045.0,143000,2045.0,1985.0
260,2015/09/15,1995.0,2013.557,2005.0,106000,2055.0,1990.0
261,2015/09/16,2005.0,2008.597,2015.0,96200,2025.0,1995.0
262,2015/09/17,2030.0,2029.433,2020.0,112800,2040.0,2015.0
263,2015/09/18,1980.0,1986.766,2020.0,204400,2025.0,1970.0
264,2015/09/24,1915.0,1924.082,1960.0,135000,1965.0,1900.0
265,2015/09/25,1915.0,1900.578,1915.0,173200,1930.0,1875.0
266,2015/09/28,1885.0,1889.103,1920.0,126000,1920.0,1870.0
267,2015/09/29,1810.0,1831.765,1860.0,152400,1860.0,1810.0
268,2015/09/30,1870.0,1864.307,1850.0,150000,1890.0,1840.0
269,2015/10/01,1930.0,1927.552,1910.0,134000,1950.0,1905.0
270,2015/10/02,1900.0,1903.358,1915.0,161400,1930.0,1880.0
271,2015/10/05,1975.0,1958.688,1925.0,124200,1980.0,1905.0
272,2015/10/06,1975.0,1998.544,1995.0,88600,2025.0,1975.0
273,2015/10/07,2075.0,2055.498,1995.0,170600,2090.0,1995.0
274,2015/10/08,2110.0,2122.3,2095.0,187000,2155.0,2090.0
275,2015/10/09,2160.0,2162.745,2135.0,147200,2185.0,2125.0
276,2015/10/13,1955.0,1956.982,2040.0,712600,2045.0,1920.0
277,2015/10/14,1970.0,1943.21,1940.0,345800,1970.0,1930.0
278,2015/10/15,1955.0,1951.55,1955.0,214200,1970.0,1940.0
279,2015/10/16,1950.0,1949.903,1955.0,185400,1965.0,1940.0
280,2015/10/19,1940.0,1941.369,1950.0,175400,1960.0,1920.0
281,2015/10/20,1950.0,1943.443,1940.0,76400,1955.0,1935.0
282,2015/10/21,2055.0,2018.861,1950.0,256200,2055.0,1945.0
283,2015/10/22,2070.0,2073.381,2040.0,154400,2100.0,2030.0
284,2015/10/23,2110.0,2119.964,2110.0,163800,2145.0,2105.0
285,2015/10/26,2145.0,2141.743,2135.0,213400,2155.0,2120.0
286,2015/10/27,2090.0,2103.422,2140.0,150200,2140.0,2085.0
287,2015/10/28,2105.0,2102.641,2105.0,96200,2115.0,2085.0
288,2015/10/29,2135.0,2118.602,2110.0,123000,2140.0,2100.0
289,2015/10/30,2095.0,2103.074,2110.0,119400,2130.0,2090.0
290,2015/11/02,2080.0,2078.298,2080.0,160400,2100.0,2040.0
291,2015/11/04,2140.0,2145.005,2080.0,229600,2165.0,2080.0
292,2015/11/05,2150.0,2144.557,2135.0,110600,2160.0,2125.0
293,2015/11/06,2185.0,2167.444,2150.0,141200,2190.0,2130.0
294,2015/11/09,2215.0,2205.514,2215.0,103200,2220.0,2190.0
295,2015/11/10,2250.0,2232.19,2200.0,141600,2260.0,2180.0
296,2015/11/11,2240.0,2234.559,2255.0,74800,2260.0,2220.0
297,2015/11/12,2235.0,2209.348,2225.0,139600,2235.0,2180.0
298,2015/11/13,2225.0,2215.314,2200.0,67000,2225.0,2195.0
299,2015/11/16,2190.0,2184.832,2200.0,130800,2200.0,2155.0
300,2015/11/17,2235.0,2243.426,2230.0,104200,2270.0,2220.0
301,2015/11/18,2220.0,2229.244,2250.0,91200,2260.0,2215.0
302,2015/11/19,2245.0,2243.462,2240.0,62400,2255.0,2220.0
303,2015/11/20,2240.0,2220.424,2225.0,101400,2240.0,2200.0
304,2015/11/24,2260.0,2252.149,2240.0,68400,2260.0,2230.0
305,2015/11/25,2250.0,2254.379,2265.0,135200,2300.0,2225.0
306,2015/11/26,2150.0,2160.804,2185.0,333600,2195.0,2145.0
307,2015/11/27,2110.0,2099.734,2145.0,353400,2150.0,2075.0
308,2015/11/30,2150.0,2124.957,2100.0,208400,2155.0,2085.0
309,2015/12/01,2190.0,2181.482,2155.0,178800,2200.0,2140.0
310,2015/12/02,2200.0,2193.055,2190.0,101800,2210.0,2170.0
311,2015/12/03,2190.0,2192.423,2210.0,167600,2210.0,2170.0
312,2015/12/04,2160.0,2165.14,2155.0,78800,2185.0,2155.0
313,2015/12/07,2170.0,2168.391,2170.0,121800,2185.0,2155.0
314,2015/12/08,2110.0,2115.759,2155.0,178000,2155.0,2090.0
315,2015/12/09,2080.0,2093.21,2085.0,124000,2125.0,2075.0
316,2015/12/10,2045.0,2056.859,2065.0,60800,2075.0,2045.0
317,2015/12/11,2085.0,2067.944,2040.0,128400,2090.0,2040.0
318,2015/12/14,2065.0,2066.532,2070.0,153400,2095.0,2050.0
319,2015/12/15,2010.0,2023.348,2075.0,134400,2075.0,1995.0
320,2015/12/16,2035.0,2038.878,2040.0,68600,2060.0,2025.0
321,2015/12/17,2070.0,2073.828,2075.0,128000,2100.0,2055.0
322,2015/12/18,2020.0,2038.497,2040.0,110400,2095.0,2015.0
323,2015/12/21,2005.0,1987.971,1980.0,90200,2015.0,1965.0
324,2015/12/22,1990.0,1988.814,2005.0,59000,2005.0,1980.0
325,2015/12/24,2005.0,2024.396,2000.0,72800,2065.0,2000.0
326,2015/12/25,1995.0,2001.08,2005.0,107400,2030.0,1985.0
327,2015/12/28,2035.0,2030.937,1980.0,114200,2060.0,1980.0
328,2015/12/29,2050.0,2041.038,2040.0,94400,2060.0,2005.0
329,2015/12/30,2060.0,2072.59,2060.0,66800,2095.0,2050.0
330,2016/01/04,2020.0,2040.592,2050.0,67600,2080.0,2015.0
331,2016/01/05,1995.0,2012.203,2005.0,128000,2045.0,1990.0
332,2016/01/06,1955.0,1963.008,1995.0,123000,2010.0,1940.0
333,2016/01/07,1890.0,1915.881,1950.0,92000,1950.0,1890.0
334,2016/01/08,1885.0,1891.054,1850.0,145200,1935.0,1840.0
335,2016/01/12,1805.0,1825.914,1865.0,153200,1865.0,1800.0
336,2016/01/13,1880.0,1866.379,1820.0,114600,1890.0,1815.0
337,2016/01/14,1900.0,1873.094,1840.0,164200,1925.0,1820.0
338,2016/01/15,1865.0,1872.093,1895.0,109400,1920.0,1850.0
339,2016/01/18,1840.0,1827.133,1800.0,84400,1850.0,1800.0
340,2016/01/19,1835.0,1823.59,1820.0,123400,1850.0,1800.0
341,2016/01/20,1755.0,1789.526,1830.0,179200,1840.0,1750.0
342,2016/01/21,1705.0,1747.229,1755.0,167800,1785.0,1705.0
343,2016/01/22,1815.0,1777.118,1755.0,134600,1815.0,1740.0
344,2016/01/25,1835.0,1839.57,1895.0,74400,1895.0,1800.0
345,2016/01/26,1755.0,1787.065,1835.0,71200,1835.0,1755.0
346,2016/01/27,1825.0,1817.546,1785.0,87200,1840.0,1785.0
347,2016/01/28,1795.0,1795.385,1800.0,67600,1810.0,1780.0
348,2016/01/29,1825.0,1791.819,1775.0,175400,1830.0,1730.0
349,2016/02/01,2020.0,1992.456,1935.0,342000,2025.0,1925.0
350,2016/02/02,1925.0,1976.65,2025.0,241200,2045.0,1920.0
351,2016/02/03,1810.0,1822.366,1850.0,200400,1870.0,1800.0
352,2016/02/04,1860.0,1842.885,1770.0,166400,1880.0,1765.0
353,2016/02/05,1865.0,1854.53,1825.0,110600,1880.0,1825.0
354,2016/02/08,1900.0,1883.327,1825.0,104600,1920.0,1825.0
355,2016/02/09,1810.0,1817.231,1830.0,169000,1850.0,1800.0
356,2016/02/10,1730.0,1751.049,1820.0,150600,1820.0,1705.0
357,2016/02/12,1610.0,1646.489,1665.0,174000,1680.0,1610.0
358,2016/02/15,1790.0,1757.839,1715.0,126800,1800.0,1700.0
359,2016/02/16,1810.0,1813.043,1765.0,89400,1835.0,1765.0
360,2016/02/17,1860.0,1868.362,1800.0,208800,1905.0,1800.0
361,2016/02/18,1915.0,1921.11,1915.0,92800,1935.0,1895.0
362,2016/02/19,1880.0,1882.249,1880.0,61800,1915.0,1865.0
363,2016/02/22,1850.0,1851.026,1860.0,70200,1885.0,1830.0
364,2016/02/23,1810.0,1830.245,1850.0,110200,1880.0,1805.0
365,2016/02/24,1775.0,1782.84,1800.0,88400,1805.0,1765.0
366,2016/02/25,1800.0,1800.574,1760.0,130800,1835.0,1760.0
367,2016/02/26,1780.0,1790.383,1825.0,115000,1840.0,1765.0
368,2016/02/29,1790.0,1816.67,1815.0,106000,1850.0,1790.0
369,2016/03/01,1740.0,1754.025,1785.0,96400,1795.0,1740.0
370,2016/03/02,1790.0,1786.411,1795.0,237400,1805.0,1770.0
371,2016/03/03,1795.0,1801.547,1785.0,199800,1835.0,1780.0
372,2016/03/04,1760.0,1764.123,1760.0,313400,1800.0,1730.0
373,2016/03/07,1755.0,1755.661,1755.0,304200,1790.0,1740.0
374,2016/03/08,1715.0,1723.615,1745.0,173200,1750.0,1700.0
375,2016/03/09,1690.0,1678.438,1695.0,143400,1695.0,1665.0
376,2016/03/10,1715.0,1716.326,1700.0,101800,1730.0,1700.0
377,2016/03/11,1735.0,1714.344,1690.0,128000,1735.0,1675.0
378,2016/03/14,1755.0,1760.367,1755.0,98200,1775.0,1755.0
379,2016/03/15,1760.0,1757.424,1740.0,195600,1770.0,1740.0
380,2016/03/16,1765.0,1747.936,1755.0,118200,1770.0,1725.0
381,2016/03/17,1760.0,1766.102,1785.0,99800,1795.0,1735.0
382,2016/03/18,1735.0,1744.416,1765.0,140400,1785.0,1720.0
383,2016/03/22,1790.0,1776.636,1755.0,170600,1790.0,1755.0
384,2016/03/23,1780.0,1780.508,1800.0,110200,1815.0,1765.0
385,2016/03/24,1740.0,1750.367,1775.0,70800,1775.0,1740.0
386,2016/03/25,1755.0,1740.844,1740.0,96000,1760.0,1715.0
387,2016/03/28,1785.0,1772.935,1780.0,77000,1785.0,1760.0
388,2016/03/29,1765.0,1757.635,1755.0,85400,1780.0,1745.0
389,2016/03/30,1730.0,1738.236,1765.0,65200,1765.0,1720.0
390,2016/03/31,1730.0,1735.226,1735.0,84000,1750.0,1720.0
391,2016/04/01,1670.0,1686.571,1735.0,159200,1735.0,1660.0
392,2016/04/04,1665.0,1668.449,1675.0,87000,1700.0,1645.0
393,2016/04/05,1585.0,1597.335,1650.0,99800,1650.0,1580.0
394,2016/04/06,1565.0,1573.94,1570.0,85800,1595.0,1560.0
395,2016/04/07,1585.0,1585.357,1580.0,64400,1610.0,1570.0
396,2016/04/08,1640.0,1607.167,1555.0,94600,1650.0,1555.0
397,2016/04/11,1615.0,1613.713,1640.0,86200,1645.0,1595.0
398,2016/04/12,1685.0,1672.305,1610.0,89400,1690.0,1610.0
399,2016/04/13,1720.0,1716.622,1685.0,59800,1735.0,1685.0
400,2016/04/14,1790.0,1771.729,1750.0,113400,1790.0,1730.0
401,2016/04/15,1755.0,1761.783,1770.0,51600,1780.0,1745.0
402,2016/04/18,1695.0,1695.994,1700.0,61400,1710.0,1680.0
403,2016/04/19,1755.0,1751.521,1740.0,57200,1765.0,1730.0
404,2016/04/20,1760.0,1766.068,1770.0,100200,1790.0,1745.0
405,2016/04/21,1780.0,1774.785,1780.0,69800,1790.0,1760.0
406,2016/04/22,1775.0,1767.793,1765.0,122800,1785.0,1755.0
407,2016/04/25,1770.0,1776.608,1790.0,85200,1800.0,1760.0
408,2016/04/26,1755.0,1750.693,1750.0,67800,1770.0,1735.0
409,2016/04/27,1690.0,1707.073,1740.0,173200,1750.0,1690.0
410,2016/04/28,1655.0,1691.9,1715.0,130000,1730.0,1655.0
411,2016/05/02,1720.0,1716.598,1700.0,354200,1745.0,1680.0
412,2016/05/06,1700.0,1699.113,1715.0,145400,1730.0,1680.0
413,2016/05/09,1720.0,1716.734,1715.0,188600,1735.0,1700.0
414,2016/05/10,1730.0,1727.016,1725.0,230200,1740.0,1705.0
415,2016/05/11,1745.0,1753.217,1745.0,134600,1775.0,1735.0
416,2016/05/12,1710.0,1717.094,1720.0,108400,1730.0,1705.0
417,2016/05/13,1660.0,1675.355,1715.0,169200,1715.0,1655.0
418,2016/05/16,1630.0,1657.544,1655.0,136000,1680.0,1630.0
419,2016/05/17,1665.0,1657.414,1650.0,110600,1665.0,1645.0
420,2016/05/18,1675.0,1672.208,1670.0,114600,1680.0,1655.0
421,2016/05/19,1670.0,1668.772,1690.0,68400,1690.0,1655.0
422,2016/05/20,1670.0,1668.21,1660.0,72600,1680.0,1655.0
423,2016/05/23,1660.0,1655.564,1675.0,211200,1675.0,1640.0
424,2016/05/24,1665.0,1662.736,1660.0,112200,1675.0,1650.0
425,2016/05/25,1675.0,1680.796,1680.0,179800,1690.0,1670.0
426,2016/05/26,1705.0,1708.31,1700.0,142000,1720.0,1695.0
427,2016/05/27,1725.0,1713.334,1715.0,174600,1725.0,1700.0
428,2016/05/30,1740.0,1737.844,1730.0,180400,1745.0,1725.0
429,2016/05/31,1840.0,1812.778,1745.0,535600,1840.0,1745.0
430,2016/06/01,1850.0,1851.564,1825.0,248800,1880.0,1815.0
431,2016/06/02,1850.0,1855.786,1890.0,281400,1910.0,1830.0
432,2016/06/03,1855.0,1874.923,1900.0,272000,1920.0,1840.0
433,2016/06/06,1810.0,1792.753,1800.0,160200,1820.0,1765.0
434,2016/06/07,1790.0,1791.418,1780.0,127000,1820.0,1780.0
435,2016/06/08,1765.0,1760.816,1770.0,126200,1780.0,1745.0
436,2016/06/09,1745.0,1749.237,1760.0,97000,1760.0,1735.0
437,2016/06/10,1715.0,1723.083,1735.0,82400,1745.0,1700.0
438,2016/06/13,1650.0,1671.797,1710.0,86800,1710.0,1645.0
439,2016/06/14,1630.0,1631.124,1640.0,63200,1655.0,1620.0
440,2016/06/15,1625.0,1620.485,1605.0,185600,1640.0,1590.0
441,2016/06/16,1555.0,1577.127,1620.0,112400,1625.0,1555.0
442,2016/06/17,1615.0,1604.736,1565.0,291800,1625.0,1565.0
443,2016/06/20,1725.0,1743.721,1735.0,296200,1805.0,1710.0
444,2016/06/21,1750.0,1747.075,1725.0,223200,1780.0,1705.0
445,2016/06/22,1785.0,1770.989,1740.0,250800,1795.0,1720.0
446,2016/06/23,1825.0,1791.948,1750.0,182800,1825.0,1750.0
447,2016/06/24,1650.0,1718.57,1820.0,204800,1825.0,1635.0
448,2016/06/27,1615.0,1637.693,1700.0,183800,1700.0,1600.0
449,2016/06/28,1560.0,1559.921,1590.0,227200,1595.0,1535.0
450,2016/06/29,1575.0,1574.943,1580.0,193200,1590.0,1560.0
451,2016/06/30,1540.0,1559.303,1590.0,397200,1600.0,1535.0
452,2016/07/01,1560.0,1558.433,1570.0,168400,1575.0,1540.0
453,2016/07/04,1565.0,1552.03,1545.0,206400,1565.0,1515.0
454,2016/07/05,1540.0,1536.472,1565.0,143400,1565.0,1525.0
455,2016/07/06,1495.0,1497.413,1530.0,211400,1530.0,1480.0
456,2016/07/07,1465.0,1480.934,1485.0,151000,1510.0,1460.0
457,2016/07/08,1460.0,1470.225,1475.0,133600,1490.0,1455.0
458,2016/07/11,1545.0,1528.609,1500.0,162400,1555.0,1495.0
459,2016/07/12,1620.0,1608.092,1575.0,246800,1630.0,1575.0
460,2016/07/13,1665.0,1674.516,1675.0,268600,1700.0,1650.0
461,2016/07/14,1665.0,1658.451,1665.0,65200,1675.0,1635.0
462,2016/07/15,1700.0,1701.073,1665.0,159400,1730.0,1645.0
463,2016/07/19,1725.0,1724.187,1720.0,302600,1755.0,1685.0
464,2016/07/20,1695.0,1691.44,1725.0,196600,1725.0,1675.0
465,2016/07/21,1720.0,1720.123,1705.0,106200,1735.0,1705.0
466,2016/07/22,1735.0,1716.7,1705.0,119400,1735.0,1690.0
467,2016/07/25,1765.0,1770.838,1750.0,167200,1785.0,1750.0
468,2016/07/26,1705.0,1718.971,1770.0,87400,1770.0,1690.0
469,2016/07/27,1760.0,1753.24,1730.0,107400,1775.0,1725.0
470,2016/07/28,1740.0,1735.163,1735.0,67600,1755.0,1710.0
471,2016/07/29,1730.0,1721.814,1725.0,81600,1755.0,1700.0
472,2016/08/01,1675.0,1679.437,1695.0,136600,1700.0,1665.0
473,2016/08/02,1635.0,1644.798,1665.0,118800,1665.0,1620.0
474,2016/08/03,1655.0,1642.068,1620.0,129600,1655.0,1615.0
475,2016/08/04,1730.0,1704.803,1670.0,96400,1735.0,1660.0
476,2016/08/05,1720.0,1719.439,1710.0,98000,1745.0,1700.0
477,2016/08/08,1590.0,1562.461,1560.0,675000,1605.0,1515.0
478,2016/08/09,1600.0,1598.236,1590.0,192200,1635.0,1575.0
479,2016/08/10,1580.0,1588.636,1600.0,243400,1615.0,1570.0
480,2016/08/12,1595.0,1594.867,1595.0,120000,1605.0,1575.0
481,2016/08/15,1590.0,1591.141,1595.0,71000,1605.0,1580.0
482,2016/08/16,1565.0,1572.085,1585.0,145800,1595.0,1560.0
483,2016/08/17,1590.0,1575.575,1550.0,111400,1595.0,1550.0
484,2016/08/18,1580.0,1575.964,1580.0,104800,1590.0,1560.0
485,2016/08/19,1610.0,1604.656,1565.0,119000,1620.0,1565.0
486,2016/08/22,1615.0,1613.127,1625.0,64600,1625.0,1600.0
487,2016/08/23,1620.0,1613.36,1600.0,115200,1625.0,1595.0
488,2016/08/24,1580.0,1591.258,1615.0,254400,1630.0,1570.0
489,2016/08/25,1580.0,1580.62,1580.0,101600,1585.0,1570.0
490,2016/08/26,1565.0,1577.247,1585.0,282600,1590.0,1560.0
491,2016/08/29,1640.0,1625.684,1600.0,188600,1650.0,1595.0
492,2016/08/30,1680.0,1666.67,1625.0,99400,1680.0,1625.0
493,2016/08/31,1705.0,1699.288,1670.0,91200,1710.0,1670.0
494,2016/09/01,1720.0,1710.716,1690.0,97800,1730.0,1685.0
495,2016/09/02,1725.0,1716.356,1720.0,82600,1730.0,1700.0
496,2016/09/05,1730.0,1739.667,1725.0,87000,1750.0,1725.0
497,2016/09/06,1730.0,1729.208,1735.0,40400,1735.0,1720.0
498,2016/09/07,1710.0,1701.979,1715.0,104600,1715.0,1690.0
499,2016/09/08,1695.0,1697.017,1700.0,59000,1705.0,1685.0
500,2016/09/09,1720.0,1710.899,1695.0,51200,1720.0,1695.0
501,2016/09/12,1725.0,1710.755,1700.0,53000,1730.0,1690.0
502,2016/09/13,1690.0,1694.294,1740.0,102000,1740.0,1680.0
503,2016/09/14,1655.0,1661.564,1675.0,100400,1685.0,1650.0
504,2016/09/15,1630.0,1630.039,1655.0,102800,1655.0,1615.0
505,2016/09/16,1645.0,1644.171,1640.0,79600,1655.0,1635.0
506,2016/09/20,1655.0,1650.733,1615.0,106400,1675.0,1615.0
507,2016/09/21,1705.0,1679.492,1670.0,96400,1705.0,1645.0
508,2016/09/23,1745.0,1730.924,1720.0,133200,1745.0,1705.0
509,2016/09/26,1720.0,1724.087,1750.0,83200,1750.0,1710.0
510,2016/09/27,1740.0,1715.48,1705.0,108400,1740.0,1680.0
511,2016/09/28,1720.0,1715.4,1710.0,50000,1725.0,1705.0
512,2016/09/29,1755.0,1744.901,1720.0,110400,1760.0,1720.0
513,2016/09/30,1725.0,1727.788,1745.0,86800,1745.0,1720.0
514,2016/10/03,1715.0,1723.812,1750.0,60600,1750.0,1705.0
515,2016/10/04,1725.0,1728.598,1730.0,59200,1735.0,1720.0
516,2016/10/05,1785.0,1769.504,1730.0,151000,1790.0,1725.0
517,2016/10/06,1820.0,1819.173,1805.0,102800,1835.0,1805.0
518,2016/10/07,1795.0,1789.87,1795.0,84600,1805.0,1780.0
519,2016/10/11,1800.0,1807.569,1795.0,65000,1825.0,1790.0
520,2016/10/12,1805.0,1800.418,1780.0,69400,1815.0,1775.0
521,2016/10/13,1765.0,1779.01,1805.0,80800,1815.0,1760.0
522,2016/10/14,1730.0,1728.111,1745.0,172000,1750.0,1710.0
523,2016/10/17,1770.0,1761.397,1740.0,86600,1770.0,1730.0
524,2016/10/18,1785.0,1775.948,1765.0,72800,1785.0,1760.0
525,2016/10/19,1785.0,1784.648,1790.0,54000,1795.0,1775.0
526,2016/10/20,1830.0,1811.954,1775.0,117200,1830.0,1775.0
527,2016/10/21,1855.0,1846.046,1830.0,114800,1855.0,1825.0
528,2016/10/24,1865.0,1858.189,1855.0,94400,1865.0,1845.0
529,2016/10/25,1880.0,1882.891,1875.0,126600,1905.0,1865.0
530,2016/10/26,1865.0,1866.133,1885.0,78600,1885.0,1855.0
531,2016/10/27,1865.0,1864.377,1870.0,57800,1880.0,1850.0
532,2016/10/28,1910.0,1908.964,1875.0,264400,1920.0,1875.0
533,2016/10/31,1900.0,1899.804,1920.0,81600,1920.0,1890.0
534,2016/11/01,1925.0,1909.673,1885.0,73400,1925.0,1880.0
535,2016/11/02,1905.0,1908.36,1910.0,101200,1925.0,1895.0
536,2016/11/04,1840.0,1843.67,1880.0,99200,1880.0,1830.0
537,2016/11/07,1895.0,1881.278,1860.0,100200,1900.0,1850.0
538,2016/11/08,1870.0,1876.166,1885.0,89200,1890.0,1860.0
539,2016/11/09,1860.0,1940.458,1925.0,458400,2025.0,1850.0
540,2016/11/10,2040.0,2008.244,1980.0,205600,2040.0,1965.0
541,2016/11/11,2140.0,2113.673,2065.0,254600,2140.0,2065.0
542,2016/11/14,2185.0,2172.654,2150.0,162400,2190.0,2135.0
543,2016/11/15,2160.0,2170.956,2190.0,192600,2210.0,2150.0
544,2016/11/16,2200.0,2195.719,2185.0,306000,2210.0,2180.0
545,2016/11/17,2155.0,2161.935,2185.0,196400,2185.0,2145.0
546,2016/11/18,2190.0,2191.391,2195.0,158200,2210.0,2175.0
547,2016/11/21,2190.0,2194.974,2225.0,115800,2225.0,2180.0
548,2016/11/22,2190.0,2194.383,2190.0,171800,2210.0,2185.0
549,2016/11/24,2205.0,2210.29,2225.0,228000,2230.0,2200.0
550,2016/11/25,2185.0,2196.777,2230.0,251000,2230.0,2165.0
551,2016/11/28,2200.0,2194.517,2195.0,283600,2215.0,2170.0
552,2016/11/29,2155.0,2159.848,2175.0,217000,2185.0,2145.0
553,2016/11/30,2150.0,2155.324,2160.0,216400,2185.0,2135.0
554,2016/12/01,2240.0,2242.337,2215.0,258000,2270.0,2200.0
555,2016/12/02,2225.0,2218.108,2230.0,140600,2235.0,2200.0
556,2016/12/05,2215.0,2203.023,2200.0,253400,2215.0,2175.0
557,2016/12/06,2340.0,2330.102,2285.0,275600,2360.0,2270.0
558,2016/12/07,2380.0,2375.714,2365.0,241000,2385.0,2355.0
559,2016/12/08,2395.0,2388.651,2420.0,113400,2420.0,2365.0
560,2016/12/09,2445.0,2422.823,2415.0,176800,2445.0,2390.0
561,2016/12/12,2415.0,2419.286,2465.0,159600,2480.0,2370.0
562,2016/12/13,2370.0,2362.344,2375.0,150200,2375.0,2340.0
563,2016/12/14,2375.0,2369.307,2370.0,102400,2380.0,2350.0
564,2016/12/15,2390.0,2394.406,2400.0,101000,2425.0,2380.0
565,2016/12/16,2400.0,2403.962,2410.0,104000,2415.0,2390.0
566,2016/12/19,2375.0,2370.768,2395.0,118600,2395.0,2355.0
567,2016/12/20,2385.0,2371.302,2370.0,53000,2385.0,2355.0
568,2016/12/21,2360.0,2370.179,2380.0,72600,2395.0,2350.0
569,2016/12/22,2360.0,2354.956,2370.0,68400,2370.0,2335.0
570,2016/12/26,2360.0,2365.839,2375.0,94200,2380.0,2345.0
571,2016/12/27,2360.0,2350.603,2320.0,79600,2370.0,2315.0
572,2016/12/28,2320.0,2308.68,2320.0,215800,2335.0,2255.0
573,2016/12/29,2315.0,2315.111,2295.0,135200,2345.0,2290.0
574,2016/12/30,2345.0,2338.218,2290.0,164400,2370.0,2285.0
575,2017/01/04,2420.0,2397.608,2345.0,172200,2420.0,2340.0
576,2017/01/05,2400.0,2409.0,2440.0,180000,2460.0,2385.0
577,2017/01/06,2425.0,2403.977,2380.0,137800,2425.0,2375.0
578,2017/01/10,2370.0,2370.743,2415.0,111800,2415.0,2350.0
579,2017/01/11,2385.0,2381.925,2360.0,80000,2395.0,2360.0
580,2017/01/12,2380.0,2381.315,2385.0,73800,2400.0,2365.0
581,2017/01/13,2380.0,2374.22,2360.0,65400,2385.0,2360.0
582,2017/01/16,2315.0,2323.601,2355.0,83600,2370.0,2300.0
583,2017/01/17,2325.0,2324.757,2315.0,110800,2345.0,2305.0
584,2017/01/18,2355.0,2333.174,2335.0,108400,2360.0,2305.0
585,2017/01/19,2390.0,2385.615,2370.0,166000,2420.0,2370.0
586,2017/01/20,2565.0,2502.83,2370.0,477800,2570.0,2370.0
587,2017/01/23,2490.0,2566.139,2600.0,316200,2640.0,2485.0
588,2017/01/24,2365.0,2381.792,2460.0,291400,2460.0,2340.0
589,2017/01/25,2510.0,2456.139,2400.0,321400,2525.0,2380.0
590,2017/01/26,2505.0,2500.133,2535.0,218000,2540.0,2465.0
591,2017/01/27,2465.0,2462.787,2475.0,146400,2480.0,2450.0
592,2017/01/30,2500.0,2501.751,2490.0,159400,2535.0,2470.0
593,2017/01/31,2460.0,2454.711,2445.0,90000,2465.0,2445.0
594,2017/02/01,2495.0,2473.047,2435.0,119800,2500.0,2410.0
595,2017/02/02,2430.0,2452.915,2505.0,89200,2505.0,2425.0
596,2017/02/03,2445.0,2447.265,2435.0,72400,2465.0,2435.0
597,2017/02/06,2470.0,2455.595,2460.0,67200,2470.0,2430.0
598,2017/02/07,2425.0,2418.022,2430.0,120800,2440.0,2405.0
599,2017/02/08,2480.0,2447.123,2425.0,180400,2495.0,2385.0
600,2017/02/09,2405.0,2408.231,2450.0,169600,2450.0,2385.0
601,2017/02/10,2440.0,2430.336,2430.0,134000,2445.0,2415.0
602,2017/02/13,2450.0,2444.042,2455.0,100200,2460.0,2425.0
603,2017/02/14,2440.0,2450.693,2450.0,115400,2475.0,2435.0
604,2017/02/15,2475.0,2458.731,2470.0,153600,2480.0,2435.0
605,2017/02/16,2545.0,2523.626,2470.0,215400,2550.0,2465.0
606,2017/02/17,2505.0,2500.751,2530.0,158600,2530.0,2485.0
607,2017/02/20,2455.0,2453.025,2490.0,81000,2490.0,2435.0
608,2017/02/21,2450.0,2442.989,2460.0,102400,2460.0,2425.0
609,2017/02/22,2465.0,2455.365,2485.0,90400,2485.0,2440.0
610,2017/02/23,2530.0,2511.298,2475.0,197200,2540.0,2450.0
611,2017/02/24,2435.0,2443.409,2500.0,168400,2500.0,2425.0
612,2017/02/27,2385.0,2376.021,2410.0,142000,2410.0,2350.0
613,2017/02/28,2405.0,2410.931,2385.0,109600,2435.0,2385.0
614,2017/03/01,2430.0,2417.558,2420.0,86000,2435.0,2390.0
615,2017/03/02,2530.0,2510.627,2475.0,177200,2535.0,2475.0
616,2017/03/03,2645.0,2553.856,2580.0,2042800,2715.0,2360.0
617,2017/03/06,2580.0,2618.558,2635.0,268400,2680.0,2575.0
618,2017/03/07,2530.0,2546.688,2575.0,193800,2585.0,2525.0
619,2017/03/08,2530.0,2528.897,2525.0,139600,2545.0,2515.0
620,2017/03/09,2540.0,2533.487,2540.0,132800,2550.0,2510.0
621,2017/03/10,2545.0,2543.358,2540.0,110800,2565.0,2530.0
622,2017/03/13,2520.0,2533.111,2545.0,155600,2560.0,2515.0
623,2017/03/14,2500.0,2508.961,2520.0,85600,2525.0,2490.0
624,2017/03/15,2465.0,2469.294,2475.0,89200,2490.0,2450.0
625,2017/03/16,2460.0,2456.072,2440.0,102600,2475.0,2435.0
626,2017/03/17,2455.0,2459.127,2460.0,197000,2470.0,2440.0
627,2017/03/21,2450.0,2451.68,2450.0,127400,2470.0,2435.0
628,2017/03/22,2335.0,2353.748,2395.0,215600,2395.0,2330.0
629,2017/03/23,2320.0,2330.101,2350.0,208200,2375.0,2310.0
630,2017/03/24,2320.0,2325.342,2330.0,157800,2340.0,2315.0
631,2017/03/27,2290.0,2292.621,2295.0,236200,2325.0,2280.0
632,2017/03/28,2305.0,2300.092,2305.0,174200,2310.0,2290.0
633,2017/03/29,2285.0,2290.048,2315.0,146400,2320.0,2270.0
634,2017/03/30,2295.0,2287.954,2285.0,207200,2305.0,2255.0
635,2017/03/31,2260.0,2274.125,2300.0,123400,2305.0,2250.0
636,2017/04/03,2265.0,2276.026,2300.0,153000,2300.0,2260.0
637,2017/04/04,2245.0,2249.323,2265.0,159400,2280.0,2220.0
638,2017/04/05,2275.0,2260.879,2245.0,193400,2275.0,2230.0
639,2017/04/06,2210.0,2229.149,2265.0,162200,2270.0,2205.0
640,2017/04/07,2260.0,2248.478,2235.0,209600,2270.0,2220.0
641,2017/04/10,2310.0,2293.766,2290.0,145800,2315.0,2270.0
642,2017/04/11,2285.0,2281.533,2320.0,152000,2320.0,2260.0
643,2017/04/12,2225.0,2229.098,2245.0,167400,2260.0,2210.0
644,2017/04/13,2190.0,2182.292,2190.0,165400,2195.0,2165.0
645,2017/04/14,2185.0,2178.495,2175.0,101000,2195.0,2150.0
646,2017/04/17,2170.0,2158.733,2155.0,87600,2175.0,2135.0
647,2017/04/18,2190.0,2196.923,2215.0,65000,2225.0,2180.0
648,2017/04/19,2185.0,2180.218,2170.0,87400,2200.0,2165.0
649,2017/04/20,2190.0,2184.175,2160.0,127200,2205.0,2155.0
650,2017/04/21,2235.0,2222.59,2230.0,106200,2235.0,2200.0
651,2017/04/24,2235.0,2250.567,2275.0,83000,2280.0,2230.0
652,2017/04/25,2290.0,2271.64,2240.0,124400,2295.0,2220.0
653,2017/04/26,2345.0,2329.781,2315.0,105000,2345.0,2310.0
654,2017/04/27,2325.0,2319.14,2320.0,103400,2330.0,2295.0
655,2017/04/28,2315.0,2329.225,2340.0,169000,2350.0,2315.0
656,2017/05/01,2315.0,2318.872,2340.0,70000,2345.0,2310.0
657,2017/05/02,2345.0,2342.02,2330.0,120800,2360.0,2325.0
658,2017/05/08,2435.0,2413.065,2380.0,325000,2440.0,2365.0
659,2017/05/09,2450.0,2432.081,2440.0,265800,2455.0,2400.0
660,2017/05/10,2460.0,2467.46,2470.0,163400,2485.0,2450.0
661,2017/05/11,2535.0,2526.181,2515.0,286200,2550.0,2500.0
662,2017/05/12,2555.0,2539.16,2520.0,256000,2560.0,2515.0
663,2017/05/15,2460.0,2466.715,2470.0,224000,2485.0,2455.0
664,2017/05/16,2470.0,2458.941,2465.0,278400,2475.0,2435.0
665,2017/05/17,2425.0,2420.887,2460.0,216600,2460.0,2395.0
666,2017/05/18,2345.0,2348.418,2400.0,206000,2400.0,2330.0
667,2017/05/19,2350.0,2333.079,2340.0,178000,2360.0,2305.0
668,2017/05/22,2385.0,2374.149,2375.0,119800,2390.0,2350.0
669,2017/05/23,2390.0,2384.197,2395.0,198000,2400.0,2365.0
670,2017/05/24,2435.0,2426.236,2415.0,178000,2440.0,2405.0
671,2017/05/25,2445.0,2454.58,2460.0,197400,2470.0,2430.0
672,2017/05/26,2475.0,2476.593,2500.0,235400,2505.0,2455.0
673,2017/05/29,2465.0,2464.025,2485.0,88200,2485.0,2445.0
674,2017/05/30,2445.0,2437.648,2460.0,98200,2460.0,2415.0
675,2017/05/31,2440.0,2439.342,2445.0,101800,2450.0,2430.0
676,2017/06/01,2510.0,2489.34,2450.0,195400,2515.0,2450.0
677,2017/06/02,2590.0,2563.578,2520.0,199000,2590.0,2515.0
678,2017/06/05,2545.0,2542.648,2575.0,125000,2575.0,2525.0
679,2017/06/06,2530.0,2538.512,2550.0,229800,2565.0,2520.0
680,2017/06/07,2550.0,2539.466,2530.0,237600,2555.0,2515.0
681,2017/06/08,2530.0,2525.048,2525.0,295400,2545.0,2485.0
682,2017/06/09,2545.0,2514.71,2480.0,241400,2550.0,2470.0
683,2017/06/12,2525.0,2518.428,2540.0,137400,2540.0,2505.0
684,2017/06/13,2540.0,2541.952,2545.0,121400,2565.0,2530.0
685,2017/06/14,2495.0,2516.451,2550.0,84800,2555.0,2495.0
686,2017/06/15,2520.0,2519.561,2500.0,161600,2555.0,2500.0
687,2017/06/16,2535.0,2528.684,2500.0,247000,2550.0,2500.0
688,2017/06/19,2540.0,2530.383,2530.0,222000,2550.0,2510.0
689,2017/06/20,2590.0,2587.93,2575.0,374400,2610.0,2570.0
690,2017/06/21,2585.0,2577.249,2580.0,131200,2590.0,2550.0
691,2017/06/22,2525.0,2540.269,2555.0,82000,2575.0,2525.0
692,2017/06/23,2530.0,2522.167,2525.0,84000,2530.0,2510.0
693,2017/06/26,2525.0,2529.273,2520.0,56400,2550.0,2515.0
694,2017/06/27,2560.0,2550.017,2540.0,59000,2560.0,2525.0
695,2017/06/28,2560.0,2564.84,2560.0,155800,2580.0,2555.0
696,2017/06/29,2560.0,2557.774,2570.0,84000,2585.0,2540.0
697,2017/06/30,2520.0,2515.645,2525.0,94600,2540.0,2500.0
698,2017/07/03,2525.0,2534.172,2540.0,67600,2550.0,2520.0
699,2017/07/04,2510.0,2526.432,2560.0,93600,2565.0,2505.0
700,2017/07/05,2570.0,2542.896,2525.0,96000,2570.0,2500.0
701,2017/07/06,2550.0,2556.301,2570.0,93800,2575.0,2535.0
702,2017/07/07,2575.0,2565.128,2535.0,93800,2575.0,2530.0
703,2017/07/10,2550.0,2557.607,2595.0,103200,2595.0,2540.0
704,2017/07/11,2585.0,2576.704,2570.0,72200,2590.0,2555.0
705,2017/07/12,2580.0,2575.695,2585.0,43200,2585.0,2560.0
706,2017/07/13,2550.0,2558.266,2585.0,39200,2585.0,2535.0
707,2017/07/14,2590.0,2584.359,2565.0,93600,2590.0,2560.0
708,2017/07/18,2585.0,2583.401,2595.0,98800,2595.0,2570.0
709,2017/07/19,2550.0,2548.825,2565.0,77400,2570.0,2530.0
710,2017/07/20,2585.0,2573.923,2550.0,62200,2590.0,2540.0
711,2017/07/21,2700.0,2660.434,2585.0,306800,2700.0,2585.0
712,2017/07/24,2690.0,2668.283,2700.0,125800,2700.0,2640.0
713,2017/07/25,2655.0,2670.41,2660.0,85400,2690.0,2645.0
714,2017/07/26,2640.0,2654.945,2665.0,109000,2685.0,2630.0
715,2017/07/27,2655.0,2646.858,2645.0,108200,2670.0,2625.0
716,2017/07/28,2675.0,2661.655,2640.0,300400,2675.0,2615.0
717,2017/07/31,2620.0,2617.329,2655.0,227600,2655.0,2600.0
718,2017/08/01,2635.0,2632.847,2625.0,109600,2655.0,2610.0
719,2017/08/02,2735.0,2702.807,2650.0,166000,2735.0,2630.0
720,2017/08/03,2795.0,2762.004,2730.0,161200,2795.0,2710.0
721,2017/08/04,2785.0,2771.027,2750.0,117800,2795.0,2735.0
722,2017/08/07,2670.0,2676.755,2695.0,281000,2705.0,2635.0
723,2017/08/08,2665.0,2674.853,2680.0,101600,2690.0,2665.0
724,2017/08/09,2605.0,2615.867,2680.0,100400,2680.0,2595.0
725,2017/08/10,2580.0,2591.103,2610.0,107000,2625.0,2565.0
726,2017/08/14,2480.0,2501.824,2545.0,139800,2545.0,2480.0
727,2017/08/15,2520.0,2530.35,2515.0,102800,2550.0,2515.0
728,2017/08/16,2530.0,2530.836,2520.0,68200,2550.0,2505.0
729,2017/08/17,2530.0,2528.786,2520.0,42000,2540.0,2510.0
730,2017/08/18,2480.0,2493.044,2515.0,96600,2515.0,2475.0
731,2017/08/21,2495.0,2485.782,2475.0,103600,2505.0,2465.0
732,2017/08/22,2550.0,2542.562,2505.0,105000,2560.0,2505.0
733,2017/08/23,2550.0,2559.582,2590.0,98000,2590.0,2545.0
734,2017/08/24,2515.0,2526.672,2535.0,135800,2545.0,2510.0
735,2017/08/25,2555.0,2539.082,2510.0,131800,2565.0,2495.0
736,2017/08/28,2555.0,2553.854,2575.0,105600,2590.0,2535.0
737,2017/08/29,2640.0,2619.208,2560.0,198200,2650.0,2530.0
738,2017/08/30,2645.0,2630.648,2625.0,114200,2645.0,2610.0
739,2017/08/31,2650.0,2646.707,2650.0,58600,2670.0,2630.0
740,2017/09/01,2650.0,2647.401,2640.0,95800,2665.0,2620.0
741,2017/09/04,2595.0,2603.461,2635.0,70800,2645.0,2585.0
742,2017/09/05,2570.0,2591.268,2580.0,113600,2620.0,2565.0
743,2017/09/06,2620.0,2608.982,2565.0,131600,2630.0,2550.0
744,2017/09/07,2680.0,2665.713,2615.0,117800,2685.0,2610.0
745,2017/09/08,2675.0,2676.826,2680.0,119400,2700.0,2650.0
746,2017/09/11,2695.0,2704.151,2710.0,128400,2735.0,2680.0
747,2017/09/12,2860.0,2818.354,2740.0,223600,2865.0,2725.0
748,2017/09/13,2905.0,2891.021,2860.0,147000,2915.0,2855.0
749,2017/09/14,2940.0,2924.875,2900.0,159800,2955.0,2880.0
750,2017/09/15,2990.0,2968.897,2925.0,160400,2990.0,2925.0
751,2017/09/19,3020.0,3023.875,3040.0,218600,3085.0,2990.0
752,2017/09/20,3030.0,3032.468,3030.0,125200,3060.0,3015.0
753,2017/09/21,2985.0,2997.053,3020.0,124200,3025.0,2985.0
754,2017/09/22,2960.0,2970.67,3010.0,134400,3015.0,2955.0
755,2017/09/25,2965.0,2960.497,2960.0,137000,2990.0,2940.0
756,2017/09/26,2970.0,2948.871,2955.0,157600,2970.0,2905.0
757,2017/09/27,2970.0,2984.224,3000.0,131400,3045.0,2960.0
758,2017/09/28,3020.0,3005.943,3000.0,122000,3040.0,2975.0
759,2017/09/29,3070.0,3055.608,3050.0,182600,3070.0,3030.0
760,2017/10/02,3140.0,3131.805,3105.0,212800,3155.0,3105.0
761,2017/10/03,3125.0,3163.22,3215.0,275200,3230.0,3105.0
762,2017/10/04,3145.0,3151.863,3150.0,179800,3175.0,3125.0
763,2017/10/05,3090.0,3105.58,3150.0,126000,3150.0,3080.0
764,2017/10/06,3100.0,3086.142,3075.0,281200,3110.0,3055.0
765,2017/10/10,3180.0,3147.511,3125.0,181200,3180.0,3090.0
766,2017/10/11,3245.0,3228.572,3210.0,265400,3255.0,3180.0
767,2017/10/12,3280.0,3274.853,3270.0,277600,3305.0,3235.0
768,2017/10/13,3295.0,3279.543,3310.0,190400,3320.0,3245.0
769,2017/10/16,3290.0,3283.254,3260.0,197600,3310.0,3225.0
770,2017/10/17,3265.0,3262.233,3270.0,226600,3295.0,3230.0
771,2017/10/18,3225.0,3226.733,3255.0,166200,3265.0,3205.0
772,2017/10/19,3510.0,3472.329,3425.0,778400,3565.0,3410.0
773,2017/10/20,3470.0,3496.357,3540.0,482800,3560.0,3450.0
774,2017/10/23,3470.0,3469.219,3500.0,362200,3505.0,3420.0
775,2017/10/24,3485.0,3475.297,3465.0,390800,3495.0,3420.0
776,2017/10/25,3450.0,3472.56,3490.0,241800,3515.0,3440.0
777,2017/10/26,3460.0,3470.657,3450.0,185800,3495.0,3445.0
778,2017/10/27,3480.0,3465.94,3475.0,120200,3485.0,3445.0
779,2017/10/30,3470.0,3467.225,3480.0,187000,3485.0,3450.0
780,2017/10/31,3500.0,3487.948,3450.0,229000,3505.0,3445.0
781,2017/11/01,3510.0,3481.303,3490.0,361600,3510.0,3430.0
782,2017/11/02,3585.0,3569.112,3535.0,308400,3600.0,3520.0
783,2017/11/06,3550.0,3561.208,3585.0,169800,3595.0,3535.0
784,2017/11/07,3655.0,3650.904,3595.0,502600,3800.0,3575.0
785,2017/11/08,4040.0,3987.852,3880.0,1323800,4120.0,3800.0
786,2017/11/09,3875.0,3901.627,3965.0,625800,3980.0,3790.0
787,2017/11/10,3825.0,3803.025,3800.0,233400,3830.0,3750.0
788,2017/11/13,3765.0,3774.028,3775.0,142000,3815.0,3750.0
789,2017/11/14,3730.0,3742.423,3745.0,154800,3765.0,3720.0
790,2017/11/15,3630.0,3640.573,3690.0,221600,3695.0,3605.0
791,2017/11/16,3640.0,3631.596,3610.0,169800,3670.0,3605.0
792,2017/11/17,3705.0,3713.903,3775.0,278000,3790.0,3665.0
793,2017/11/20,3770.0,3742.672,3710.0,373200,3785.0,3690.0
794,2017/11/21,3935.0,3877.207,3795.0,383400,3935.0,3770.0
795,2017/11/22,4160.0,4081.661,4005.0,646200,4170.0,3965.0
796,2017/11/24,4230.0,4183.817,4120.0,366000,4255.0,4100.0
797,2017/11/27,4145.0,4126.668,4235.0,325000,4240.0,4060.0
798,2017/11/28,4080.0,4103.24,4140.0,206800,4160.0,4075.0
799,2017/11/29,4095.0,4132.436,4155.0,224200,4205.0,4080.0
800,2017/11/30,3965.0,3981.355,4080.0,292400,4080.0,3925.0
801,2017/12/01,3980.0,3996.043,4035.0,259800,4065.0,3955.0
802,2017/12/04,4045.0,4039.6,4055.0,267400,4070.0,3945.0
803,2017/12/05,4045.0,4048.987,4045.0,213200,4080.0,4010.0
804,2017/12/06,3910.0,3937.825,3985.0,254200,4020.0,3880.0
805,2017/12/07,4010.0,3982.283,3980.0,279000,4020.0,3945.0
806,2017/12/08,3980.0,3985.132,3980.0,234800,4050.0,3955.0
807,2017/12/11,3995.0,3983.986,4020.0,181400,4025.0,3950.0
808,2017/12/12,4020.0,4054.866,4015.0,260200,4115.0,4005.0
809,2017/12/13,3935.0,3969.776,4025.0,218200,4040.0,3930.0
810,2017/12/14,3990.0,3986.658,3935.0,190600,4010.0,3935.0
811,2017/12/15,3895.0,3919.81,3990.0,410000,3990.0,3880.0
812,2017/12/18,4030.0,3979.325,3970.0,302200,4040.0,3925.0
813,2017/12/19,4040.0,4039.196,4100.0,92000,4100.0,4005.0
814,2017/12/20,4115.0,4043.043,4040.0,312200,4115.0,3990.0
815,2017/12/21,4105.0,4090.221,4115.0,126800,4115.0,4050.0
816,2017/12/22,4235.0,4213.342,4125.0,307000,4275.0,4115.0
817,2017/12/25,4325.0,4273.403,4235.0,225400,4350.0,4165.0
818,2017/12/26,4270.0,4312.215,4350.0,229800,4405.0,4260.0
819,2017/12/27,4225.0,4245.165,4245.0,109200,4275.0,4225.0
820,2017/12/28,4185.0,4202.936,4230.0,83800,4240.0,4175.0
821,2017/12/29,4205.0,4216.672,4210.0,129800,4245.0,4185.0
822,2018/01/04,4390.0,4330.83,4290.0,195200,4390.0,4270.0
823,2018/01/05,4480.0,4455.4,4450.0,155000,4485.0,4415.0
824,2018/01/09,4520.0,4480.662,4475.0,195000,4520.0,4415.0
825,2018/01/10,4485.0,4499.165,4520.0,149600,4545.0,4460.0
826,2018/01/11,4450.0,4460.983,4450.0,230000,4510.0,4405.0
827,2018/01/12,4480.0,4485.163,4480.0,227000,4520.0,4460.0
828,2018/01/15,4470.0,4486.642,4555.0,92000,4560.0,4455.0
829,2018/01/16,4490.0,4463.346,4475.0,133600,4495.0,4420.0
830,2018/01/17,4535.0,4510.06,4470.0,151600,4545.0,4460.0
831,2018/01/18,4475.0,4527.613,4595.0,164600,4605.0,4465.0
832,2018/01/19,4600.0,4552.056,4495.0,119200,4600.0,4480.0
833,2018/01/22,4555.0,4538.821,4575.0,159400,4575.0,4510.0
834,2018/01/23,4565.0,4559.85,4595.0,119800,4595.0,4545.0
835,2018/01/24,4465.0,4484.225,4550.0,162600,4560.0,4430.0
836,2018/01/25,4445.0,4445.521,4465.0,142000,4485.0,4420.0
837,2018/01/26,4485.0,4474.418,4480.0,110000,4500.0,4455.0
838,2018/01/29,4570.0,4543.135,4495.0,174200,4590.0,4465.0
839,2018/01/30,4515.0,4544.384,4600.0,152600,4620.0,4490.0
840,2018/01/31,4455.0,4485.431,4495.0,178600,4555.0,4445.0
841,2018/02/01,4645.0,4587.272,4480.0,175200,4650.0,4480.0
842,2018/02/02,4555.0,4558.261,4600.0,105800,4625.0,4520.0
843,2018/02/05,4375.0,4398.622,4415.0,190800,4455.0,4360.0
844,2018/02/06,4055.0,4037.356,4145.0,294600,4160.0,3905.0
845,2018/02/07,4020.0,4115.099,4315.0,252600,4340.0,3995.0
846,2018/02/08,3890.0,3931.257,3975.0,503800,4040.0,3760.0
847,2018/02/09,3725.0,3711.906,3690.0,249200,3765.0,3650.0
848,2018/02/13,3635.0,3685.035,3795.0,312400,3795.0,3620.0
849,2018/02/14,3540.0,3578.834,3650.0,254600,3690.0,3495.0
850,2018/02/15,3680.0,3651.202,3545.0,223000,3710.0,3545.0
851,2018/02/16,3715.0,3701.307,3705.0,162200,3735.0,3625.0
852,2018/02/19,3860.0,3819.58,3750.0,152200,3870.0,3715.0
853,2018/02/20,3830.0,3814.794,3900.0,174600,3900.0,3750.0
854,2018/02/21,3860.0,3853.842,3890.0,127800,3895.0,3805.0
855,2018/02/22,3805.0,3792.874,3840.0,112400,3840.0,3740.0
856,2018/02/23,3865.0,3843.423,3830.0,81800,3870.0,3805.0
857,2018/02/26,3880.0,3881.11,3915.0,126200,3935.0,3830.0
858,2018/02/27,3930.0,3929.909,3910.0,99000,3955.0,3905.0
859,2018/02/28,3860.0,3888.293,3915.0,121800,3945.0,3860.0
860,2018/03/01,3720.0,3727.172,3795.0,198000,3800.0,3680.0
861,2018/03/02,3675.0,3669.046,3625.0,163400,3700.0,3605.0
862,2018/03/05,3545.0,3567.944,3635.0,110400,3645.0,3525.0
863,2018/03/06,3660.0,3652.718,3620.0,158600,3700.0,3615.0
864,2018/03/07,3710.0,3719.009,3740.0,314600,3765.0,3655.0
865,2018/03/08,3730.0,3726.298,3820.0,238800,3820.0,3695.0
866,2018/03/09,3800.0,3797.726,3805.0,347400,3860.0,3740.0
867,2018/03/12,4025.0,3990.391,3875.0,348400,4030.0,3865.0
868,2018/03/13,3960.0,3938.469,3965.0,209000,3975.0,3880.0
869,2018/03/14,4005.0,4001.332,3925.0,256000,4050.0,3910.0
870,2018/03/15,3965.0,3949.494,4005.0,142200,4005.0,3895.0
871,2018/03/16,3860.0,3880.837,4015.0,317800,4040.0,3845.0
872,2018/03/19,3740.0,3750.289,3785.0,294000,3835.0,3690.0
873,2018/03/20,3755.0,3747.237,3700.0,305400,3805.0,3685.0
874,2018/03/22,3770.0,3761.757,3755.0,210600,3800.0,3720.0
875,2018/03/23,3550.0,3566.309,3650.0,278200,3650.0,3535.0
876,2018/03/26,3590.0,3542.104,3500.0,136400,3590.0,3480.0
877,2018/03/27,3730.0,3701.008,3655.0,134000,3740.0,3645.0
878,2018/03/28,3615.0,3623.165,3690.0,109000,3690.0,3580.0
879,2018/03/29,3635.0,3643.457,3690.0,105000,3705.0,3590.0
880,2018/03/30,3740.0,3740.576,3725.0,151200,3790.0,3715.0
881,2018/04/02,3775.0,3782.742,3775.0,97400,3810.0,3725.0
882,2018/04/03,3645.0,3649.987,3675.0,219600,3710.0,3610.0
883,2018/04/04,3600.0,3632.808,3705.0,278200,3755.0,3575.0
884,2018/04/05,3615.0,3615.848,3670.0,107400,3680.0,3565.0
885,2018/04/06,3495.0,3537.075,3615.0,242400,3635.0,3495.0
886,2018/04/09,3490.0,3481.391,3485.0,176200,3520.0,3430.0
887,2018/04/10,3575.0,3534.753,3470.0,173800,3600.0,3455.0
888,2018/04/11,3685.0,3668.778,3610.0,197200,3710.0,3610.0
889,2018/04/12,3495.0,3540.887,3615.0,195000,3645.0,3495.0
890,2018/04/13,3605.0,3590.259,3545.0,119600,3625.0,3540.0
891,2018/04/16,3580.0,3577.977,3620.0,110200,3640.0,3535.0
892,2018/04/17,3555.0,3566.007,3580.0,57600,3615.0,3540.0
893,2018/04/18,3635.0,3591.947,3570.0,194200,3645.0,3535.0
894,2018/04/19,3680.0,3685.082,3650.0,109600,3725.0,3635.0
895,2018/04/20,3635.0,3627.645,3635.0,89600,3655.0,3600.0
896,2018/04/23,3670.0,3684.414,3680.0,51200,3715.0,3660.0
897,2018/04/24,3780.0,3756.021,3705.0,153800,3785.0,3700.0
898,2018/04/25,3725.0,3706.175,3730.0,96200,3735.0,3675.0
899,2018/04/26,3685.0,3700.383,3725.0,86200,3750.0,3665.0
900,2018/04/27,3640.0,3627.803,3685.0,94200,3700.0,3595.0
901,2018/05/01,3585.0,3587.914,3620.0,73800,3630.0,3555.0
902,2018/05/02,3615.0,3604.495,3600.0,114800,3640.0,3585.0
903,2018/05/07,3580.0,3566.809,3590.0,56400,3590.0,3545.0
904,2018/05/08,3600.0,3604.288,3560.0,75800,3630.0,3560.0
905,2018/05/09,3630.0,3603.098,3610.0,118800,3635.0,3575.0
906,2018/05/10,3110.0,3106.782,3245.0,971200,3245.0,3050.0
907,2018/05/11,3090.0,3089.112,3105.0,488800,3130.0,3060.0
908,2018/05/14,3055.0,3031.067,3065.0,386400,3065.0,3000.0
909,2018/05/15,3190.0,3121.682,3045.0,494800,3210.0,3025.0
910,2018/05/16,3235.0,3185.358,3150.0,380000,3240.0,3075.0
911,2018/05/17,3365.0,3341.822,3255.0,327200,3385.0,3245.0
912,2018/05/18,3320.0,3343.351,3365.0,269200,3395.0,3310.0
913,2018/05/21,3405.0,3396.21,3375.0,190200,3420.0,3360.0
914,2018/05/22,3375.0,3429.86,3450.0,307600,3560.0,3360.0
915,2018/05/23,3355.0,3373.471,3400.0,147800,3425.0,3340.0
916,2018/05/24,3245.0,3243.28,3340.0,254000,3340.0,3200.0
917,2018/05/25,3185.0,3206.047,3225.0,141400,3285.0,3165.0
918,2018/05/28,3175.0,3206.1,3235.0,86400,3250.0,3170.0
919,2018/05/29,3095.0,3107.843,3160.0,236400,3165.0,3080.0
920,2018/05/30,3010.0,3010.222,3000.0,216400,3035.0,2965.0
921,2018/05/31,3045.0,3034.6,3075.0,234600,3080.0,3005.0
922,2018/06/01,3025.0,3015.495,3015.0,143400,3040.0,2990.0
923,2018/06/04,3045.0,3040.59,3045.0,140800,3065.0,3020.0
924,2018/06/05,3035.0,3035.66,3070.0,172800,3075.0,3005.0
925,2018/06/06,3020.0,3025.637,3020.0,143000,3045.0,3010.0
926,2018/06/07,3055.0,3038.21,3030.0,215000,3060.0,3015.0
927,2018/06/08,2940.0,2965.79,3015.0,468400,3025.0,2930.0
928,2018/06/11,2975.0,2971.311,2955.0,245600,3000.0,2925.0
929,2018/06/12,2945.0,2943.404,2975.0,214200,2975.0,2925.0
930,2018/06/13,2935.0,2914.02,2930.0,257000,2940.0,2885.0
931,2018/06/14,2840.0,2854.083,2890.0,357400,2915.0,2825.0
932,2018/06/15,2855.0,2851.849,2850.0,273200,2875.0,2820.0
933,2018/06/18,2760.0,2777.068,2840.0,183800,2840.0,2745.0
934,2018/06/19,2700.0,2731.156,2740.0,198200,2785.0,2690.0
935,2018/06/20,2710.0,2649.628,2680.0,263400,2710.0,2595.0
936,2018/06/21,2705.0,2711.738,2695.0,211200,2745.0,2685.0
937,2018/06/22,2645.0,2639.91,2660.0,278400,2675.0,2610.0
938,2018/06/25,2615.0,2647.737,2630.0,211600,2700.0,2615.0
939,2018/06/26,2640.0,2633.413,2575.0,257000,2690.0,2575.0
940,2018/06/27,2670.0,2674.753,2655.0,275400,2700.0,2640.0
941,2018/06/28,2620.0,2619.508,2645.0,330800,2650.0,2595.0
942,2018/06/29,2645.0,2643.507,2630.0,379600,2670.0,2605.0
943,2018/07/02,2650.0,2717.798,2680.0,277000,2775.0,2650.0
944,2018/07/03,2670.0,2670.785,2700.0,295800,2735.0,2620.0
945,2018/07/04,2610.0,2629.827,2645.0,208000,2660.0,2610.0
946,2018/07/05,2605.0,2606.647,2610.0,233800,2645.0,2585.0
947,2018/07/06,2660.0,2658.686,2625.0,280000,2675.0,2620.0
948,2018/07/09,2680.0,2659.302,2665.0,131800,2685.0,2620.0
949,2018/07/10,2710.0,2715.196,2720.0,158200,2730.0,2695.0
950,2018/07/11,2645.0,2634.17,2650.0,208400,2660.0,2605.0
951,2018/07/12,2635.0,2617.364,2610.0,230600,2645.0,2585.0
952,2018/07/13,2685.0,2679.521,2665.0,156600,2705.0,2645.0
953,2018/07/17,2605.0,2624.426,2675.0,263000,2675.0,2595.0
954,2018/07/18,2635.0,2644.112,2630.0,164400,2665.0,2615.0
955,2018/07/19,2675.0,2672.981,2660.0,163400,2700.0,2640.0
956,2018/07/20,2635.0,2635.816,2675.0,154400,2675.0,2605.0
957,2018/07/23,2615.0,2620.55,2610.0,123600,2645.0,2605.0
958,2018/07/24,2680.0,2655.63,2640.0,181000,2680.0,2640.0
959,2018/07/25,2680.0,2686.712,2715.0,163600,2725.0,2660.0
960,2018/07/26,2710.0,2706.216,2705.0,116000,2725.0,2695.0
961,2018/07/27,2750.0,2739.975,2740.0,120000,2750.0,2720.0
962,2018/07/30,2745.0,2754.79,2780.0,137800,2785.0,2740.0
963,2018/07/31,2725.0,2730.262,2740.0,252200,2760.0,2715.0
964,2018/08/01,2765.0,2763.475,2765.0,113400,2775.0,2745.0
965,2018/08/02,2705.0,2719.798,2760.0,192400,2770.0,2685.0
966,2018/08/03,2700.0,2696.305,2705.0,141000,2710.0,2675.0
967,2018/08/06,2690.0,2704.311,2700.0,184200,2745.0,2675.0
968,2018/08/07,2765.0,2735.256,2700.0,277400,2770.0,2685.0
969,2018/08/08,2835.0,2818.153,2780.0,291800,2850.0,2765.0
970,2018/08/09,2815.0,2785.051,2800.0,217800,2820.0,2735.0
971,2018/08/10,2380.0,2453.482,2545.0,1015600,2560.0,2330.0
972,2018/08/13,2375.0,2375.286,2345.0,433800,2415.0,2335.0
973,2018/08/14,2420.0,2400.155,2375.0,219600,2430.0,2355.0
974,2018/08/15,2395.0,2404.933,2435.0,343000,2445.0,2380.0
975,2018/08/16,2390.0,2366.041,2355.0,276800,2400.0,2325.0
976,2018/08/17,2420.0,2415.359,2400.0,164400,2440.0,2390.0
977,2018/08/20,2410.0,2421.747,2420.0,137400,2455.0,2410.0
978,2018/08/21,2390.0,2380.806,2395.0,203600,2425.0,2355.0
979,2018/08/22,2475.0,2455.262,2380.0,263400,2490.0,2380.0
980,2018/08/23,2435.0,2451.209,2465.0,102600,2475.0,2435.0
981,2018/08/24,2440.0,2435.141,2440.0,85000,2445.0,2420.0
982,2018/08/27,2510.0,2499.752,2470.0,137000,2520.0,2460.0
983,2018/08/28,2540.0,2557.521,2545.0,142800,2580.0,2540.0
984,2018/08/29,2600.0,2595.723,2540.0,174400,2625.0,2540.0
985,2018/08/30,2630.0,2633.99,2650.0,162400,2660.0,2610.0
986,2018/08/31,2605.0,2599.335,2580.0,109800,2630.0,2565.0
987,2018/09/03,2540.0,2546.744,2565.0,129600,2590.0,2525.0
988,2018/09/04,2540.0,2541.676,2535.0,105600,2570.0,2515.0
989,2018/09/05,2525.0,2524.229,2535.0,147800,2560.0,2495.0
990,2018/09/06,2495.0,2498.98,2500.0,119600,2520.0,2485.0
991,2018/09/07,2470.0,2464.679,2475.0,152600,2485.0,2450.0
992,2018/09/10,2475.0,2480.412,2470.0,126200,2500.0,2470.0
993,2018/09/11,2465.0,2479.131,2480.0,134600,2505.0,2460.0
994,2018/09/12,2395.0,2407.528,2460.0,217600,2465.0,2380.0
995,2018/09/13,2400.0,2415.434,2385.0,200600,2445.0,2375.0
996,2018/09/14,2470.0,2468.371,2410.0,248600,2520.0,2410.0
997,2018/09/18,2515.0,2504.289,2500.0,206600,2520.0,2475.0
998,2018/09/19,2575.0,2565.719,2555.0,197600,2585.0,2525.0
999,2018/09/20,2595.0,2597.085,2600.0,178000,2620.0,2570.0
1000,2018/09/21,2750.0,2669.863,2605.0,444800,2750.0,2585.0
1001,2018/09/25,2685.0,2683.512,2730.0,329200,2735.0,2660.0
1002,2018/09/26,2648.0,2620.386,2641.0,218500,2652.0,2580.0
1003,2018/09/27,2527.0,2570.856,2620.0,408900,2627.0,2525.0
1004,2018/09/28,2541.0,2551.431,2577.0,163000,2577.0,2531.0
1005,2018/10/01,2570.0,2573.469,2551.0,105200,2594.0,2545.0
1006,2018/10/02,2572.0,2583.912,2593.0,164700,2619.0,2566.0
1007,2018/10/03,2471.0,2495.995,2531.0,304300,2531.0,2467.0
1008,2018/10/04,2495.0,2505.063,2505.0,218500,2538.0,2487.0
1009,2018/10/05,2442.0,2454.895,2459.0,131200,2479.0,2440.0
1010,2018/10/09,2327.0,2336.361,2400.0,260900,2404.0,2312.0
1011,2018/10/10,2320.0,2301.984,2327.0,356700,2329.0,2270.0
1012,2018/10/11,2210.0,2196.952,2134.0,275600,2229.0,2134.0
1013,2018/10/12,2248.0,2239.722,2200.0,191700,2268.0,2198.0
1014,2018/10/15,2200.0,2208.234,2243.0,197400,2244.0,2196.0
1015,2018/10/16,2216.0,2191.566,2183.0,177100,2217.0,2161.0
1016,2018/10/17,2240.0,2242.322,2215.0,287300,2272.0,2211.0
1017,2018/10/18,2143.0,2174.113,2225.0,379300,2231.0,2134.0
1018,2018/10/19,2139.0,2122.305,2101.0,239700,2143.0,2097.0
1019,2018/10/22,2147.0,2124.316,2108.0,211700,2157.0,2090.0
1020,2018/10/23,2074.0,2100.992,2140.0,236000,2141.0,2074.0
1021,2018/10/24,2085.0,2084.215,2081.0,181800,2105.0,2061.0
1022,2018/10/25,2000.0,2005.642,2016.0,210000,2022.0,1992.0
1023,2018/10/26,1983.0,1991.054,2025.0,198900,2033.0,1958.0
1024,2018/10/29,1986.0,1998.161,1999.0,182900,2025.0,1982.0
1025,2018/10/30,2075.0,2054.193,1970.0,228400,2090.0,1970.0
1026,2018/10/31,2142.0,2115.354,2105.0,183200,2142.0,2075.0
1027,2018/11/01,2111.0,2097.496,2115.0,362900,2122.0,2066.0
1028,2018/11/02,2217.0,2184.09,2131.0,306200,2219.0,2128.0
1029,2018/11/05,2204.0,2208.727,2191.0,148400,2236.0,2174.0
1030,2018/11/06,2218.0,2226.574,2225.0,244700,2242.0,2207.0
1031,2018/11/07,2206.0,2225.15,2218.0,134500,2258.0,2194.0
1032,2018/11/08,2181.0,2197.904,2255.0,205400,2257.0,2162.0
1033,2018/11/09,2022.0,1996.269,1962.0,626600,2033.0,1958.0
1034,2018/11/12,2004.0,2015.907,2020.0,277300,2054.0,1982.0
1035,2018/11/13,1950.0,1940.564,1993.0,367800,1995.0,1915.0
1036,2018/11/14,1948.0,1943.855,1940.0,428900,1987.0,1909.0
1037,2018/11/15,1944.0,1942.436,1938.0,300400,1965.0,1930.0
1038,2018/11/16,1913.0,1924.484,1960.0,207500,1970.0,1906.0
1039,2018/11/19,1912.0,1900.386,1903.0,401100,1921.0,1866.0
1040,2018/11/20,1912.0,1900.35,1883.0,182600,1918.0,1865.0
1041,2018/11/21,1919.0,1901.267,1870.0,177400,1927.0,1859.0
1042,2018/11/22,1882.0,1890.695,1931.0,202800,1933.0,1868.0
1043,2018/11/26,1908.0,1896.219,1879.0,132100,1915.0,1868.0
1044,2018/11/27,1948.0,1943.163,1920.0,277300,1967.0,1901.0
1045,2018/11/28,1973.0,1962.948,1948.0,125000,1974.0,1941.0
1046,2018/11/29,1982.0,1989.176,1998.0,117600,2009.0,1972.0
1047,2018/11/30,1984.0,1980.63,1972.0,133200,1993.0,1964.0
1048,2018/12/03,2027.0,2040.234,2019.0,219100,2067.0,2011.0
1049,2018/12/04,2000.0,2009.428,2027.0,183200,2035.0,1991.0
1050,2018/12/05,1953.0,1948.779,1951.0,229400,1968.0,1927.0
1051,2018/12/06,1907.0,1903.81,1950.0,215200,1950.0,1887.0
1052,2018/12/07,1893.0,1882.292,1877.0,438600,1904.0,1856.0
1053,2018/12/10,1919.0,1903.757,1876.0,289500,1937.0,1861.0
1054,2018/12/11,1889.0,1904.804,1903.0,392300,1932.0,1888.0
1055,2018/12/12,1922.0,1926.986,1900.0,292600,1959.0,1875.0
1056,2018/12/13,2007.0,1989.97,1952.0,292000,2011.0,1938.0
1057,2018/12/14,1980.0,1981.433,1990.0,312700,1999.0,1956.0
1058,2018/12/17,1947.0,1979.613,1995.0,348100,2033.0,1943.0
1059,2018/12/18,1941.0,1947.04,1929.0,329200,1980.0,1909.0
1060,2018/12/19,1921.0,1918.32,1931.0,293500,1941.0,1894.0
1061,2018/12/20,1870.0,1868.131,1888.0,376300,1903.0,1839.0
1062,2018/12/21,1893.0,1876.103,1861.0,526300,1895.0,1851.0
1063,2018/12/25,1828.0,1832.291,1813.0,391700,1856.0,1801.0
1064,2018/12/26,1848.0,1852.029,1859.0,364200,1888.0,1826.0
1065,2018/12/27,1929.0,1906.753,1917.0,357500,1940.0,1868.0
1066,2018/12/28,1965.0,1961.485,1931.0,251600,1985.0,1924.0
1067,2019/01/04,1852.0,1836.765,1915.0,443800,1915.0,1782.0
1068,2019/01/07,1983.0,1972.499,1932.0,310100,2002.0,1924.0
1069,2019/01/08,2015.0,2019.722,2008.0,211900,2043.0,1995.0
1070,2019/01/09,2034.0,2022.365,2039.0,166000,2045.0,2008.0
1071,2019/01/10,2056.0,2042.431,2027.0,243800,2056.0,2017.0
1072,2019/01/11,2065.0,2065.367,2065.0,167100,2093.0,2041.0
1073,2019/01/15,2124.0,2102.219,2050.0,230500,2125.0,2043.0
1074,2019/01/16,2096.0,2104.673,2127.0,165500,2133.0,2086.0
1075,2019/01/17,2074.0,2090.839,2105.0,109100,2139.0,2065.0
1076,2019/01/18,2146.0,2134.396,2097.0,177900,2153.0,2076.0
1077,2019/01/21,2173.0,2178.384,2174.0,125700,2199.0,2166.0
1078,2019/01/22,2165.0,2174.671,2182.0,156000,2204.0,2152.0
1079,2019/01/23,2127.0,2132.277,2130.0,143900,2159.0,2104.0
1080,2019/01/24,2145.0,2129.925,2116.0,117800,2146.0,2100.0
1081,2019/01/25,2204.0,2193.337,2160.0,167000,2206.0,2149.0
1082,2019/01/28,2206.0,2213.918,2226.0,97900,2245.0,2184.0
1083,2019/01/29,2177.0,2160.16,2141.0,77500,2187.0,2132.0
1084,2019/01/30,2162.0,2175.021,2204.0,105400,2208.0,2160.0
1085,2019/01/31,2181.0,2191.814,2190.0,100500,2230.0,2174.0
1086,2019/02/01,2168.0,2175.925,2174.0,106100,2199.0,2166.0
1087,2019/02/04,2216.0,2208.017,2199.0,123800,2217.0,2188.0
1088,2019/02/05,2229.0,2218.512,2211.0,130400,2230.0,2189.0
1089,2019/02/06,2221.0,2224.188,2232.0,88800,2239.0,2213.0
1090,2019/02/07,2187.0,2183.319,2216.0,139000,2217.0,2159.0
1091,2019/02/08,2074.0,2106.638,2140.0,193600,2167.0,2065.0
1092,2019/02/12,2182.0,2164.508,2101.0,213200,2190.0,2093.0
1093,2019/02/13,2235.0,2242.772,2196.0,214000,2266.0,2194.0
1094,2019/02/14,2238.0,2237.88,2235.0,111500,2261.0,2212.0
1095,2019/02/15,2212.0,2214.517,2229.0,102300,2235.0,2198.0
1096,2019/02/18,2321.0,2308.966,2273.0,228100,2334.0,2273.0
1097,2019/02/19,2262.0,2278.666,2322.0,160500,2322.0,2256.0
1098,2019/02/20,2315.0,2297.867,2260.0,148400,2318.0,2248.0
1099,2019/02/21,2292.0,2299.759,2310.0,133700,2310.0,2282.0
1100,2019/02/22,2281.0,2280.485,2268.0,142800,2294.0,2254.0
1101,2019/02/25,2301.0,2298.329,2303.0,64700,2315.0,2284.0
1102,2019/02/26,2304.0,2302.323,2317.0,83600,2320.0,2283.0
1103,2019/02/27,2281.0,2281.124,2288.0,114700,2298.0,2268.0
1104,2019/02/28,2262.0,2258.719,2266.0,135200,2274.0,2238.0
1105,2019/03/01,2279.0,2293.064,2279.0,132500,2305.0,2268.0
1106,2019/03/04,2327.0,2334.095,2310.0,133200,2346.0,2298.0
1107,2019/03/05,2317.0,2318.3,2327.0,159700,2345.0,2295.0
1108,2019/03/06,2311.0,2310.289,2318.0,97600,2323.0,2298.0
1109,2019/03/07,2273.0,2269.541,2274.0,131900,2289.0,2255.0
1110,2019/03/08,2212.0,2228.059,2234.0,220800,2255.0,2200.0
1111,2019/03/11,2221.0,2220.973,2216.0,111100,2245.0,2206.0
1112,2019/03/12,2241.0,2249.416,2252.0,130600,2269.0,2238.0
1113,2019/03/13,2185.0,2208.649,2215.0,138900,2234.0,2185.0
1114,2019/03/14,2137.0,2161.627,2165.0,193300,2191.0,2133.0
1115,2019/03/15,2147.0,2154.652,2166.0,236200,2185.0,2134.0
1116,2019/03/18,2211.0,2204.771,2187.0,128900,2228.0,2178.0
1117,2019/03/19,2213.0,2209.581,2211.0,78100,2221.0,2187.0
1118,2019/03/20,2223.0,2220.046,2220.0,56100,2229.0,2211.0
1119,2019/03/22,2226.0,2222.366,2224.0,70000,2250.0,2197.0
1120,2019/03/25,2156.0,2141.448,2151.0,122600,2158.0,2126.0
1121,2019/03/26,2240.0,2219.884,2186.0,129900,2240.0,2180.0
1122,2019/03/27,2240.0,2236.934,2223.0,87200,2252.0,2203.0
1123,2019/03/28,2217.0,2206.586,2206.0,124100,2228.0,2181.0
1124,2019/03/29,2227.0,2226.108,2227.0,86200,2236.0,2208.0
1125,2019/04/01,2290.0,2295.427,2257.0,144500,2315.0,2257.0
1126,2019/04/02,2300.0,2307.186,2315.0,140600,2334.0,2292.0
1127,2019/04/03,2370.0,2346.193,2286.0,134000,2373.0,2283.0
1128,2019/04/04,2388.0,2404.618,2374.0,183600,2438.0,2370.0
1129,2019/04/05,2440.0,2424.702,2388.0,103600,2443.0,2388.0
1130,2019/04/08,2401.0,2409.713,2424.0,109100,2437.0,2397.0
1131,2019/04/09,2416.0,2402.268,2386.0,93900,2421.0,2375.0
1132,2019/04/10,2376.0,2374.939,2377.0,51100,2394.0,2352.0
1133,2019/04/11,2363.0,2366.294,2358.0,28900,2383.0,2347.0
1134,2019/04/12,2376.0,2372.746,2366.0,54800,2388.0,2356.0
1135,2019/04/15,2433.0,2429.86,2426.0,80400,2446.0,2415.0
1136,2019/04/16,2420.0,2417.785,2425.0,62700,2434.0,2405.0
1137,2019/04/17,2459.0,2450.372,2421.0,81500,2459.0,2420.0
1138,2019/04/18,2427.0,2444.019,2460.0,118900,2480.0,2419.0
1139,2019/04/19,2501.0,2499.759,2485.0,132400,2517.0,2485.0
1140,2019/04/22,2509.0,2504.385,2486.0,119800,2521.0,2462.0
1141,2019/04/23,2508.0,2509.012,2525.0,99400,2536.0,2492.0
1142,2019/04/24,2516.0,2522.4,2539.0,98700,2545.0,2505.0
1143,2019/04/25,2542.0,2530.488,2508.0,114200,2543.0,2490.0
1144,2019/04/26,2526.0,2515.095,2519.0,146500,2536.0,2491.0
1145,2019/05/07,2458.0,2485.734,2512.0,234200,2542.0,2456.0
1146,2019/05/08,2326.0,2342.459,2359.0,240400,2374.0,2315.0
1147,2019/05/09,2277.0,2296.051,2315.0,305200,2355.0,2269.0
1148,2019/05/10,2480.0,2471.635,2527.0,604800,2540.0,2427.0
1149,2019/05/13,2374.0,2409.122,2448.0,279900,2472.0,2373.0
1150,2019/05/14,2379.0,2366.26,2303.0,241300,2422.0,2285.0
1151,2019/05/15,2392.0,2381.316,2395.0,120300,2419.0,2346.0
1152,2019/05/16,2364.0,2359.413,2385.0,105900,2386.0,2333.0
1153,2019/05/17,2453.0,2439.734,2414.0,192400,2455.0,2405.0
1154,2019/05/20,2394.0,2399.333,2442.0,113700,2456.0,2373.0
1155,2019/05/21,2325.0,2329.243,2363.0,111000,2366.0,2315.0
1156,2019/05/22,2374.0,2363.428,2362.0,132300,2400.0,2341.0
1157,2019/05/23,2296.0,2301.215,2337.0,103700,2337.0,2282.0
1158,2019/05/24,2282.0,2271.273,2268.0,78100,2296.0,2231.0
1159,2019/05/27,2257.0,2266.158,2295.0,58800,2310.0,2248.0
1160,2019/05/28,2273.0,2257.498,2248.0,98600,2275.0,2226.0
1161,2019/05/29,2243.0,2234.588,2227.0,78200,2252.0,2209.0
1162,2019/05/30,2283.0,2265.253,2223.0,90000,2286.0,2223.0
1163,2019/05/31,2283.0,2275.245,2261.0,96400,2299.0,2227.0
1164,2019/06/03,2207.0,2220.192,2275.0,109400,2276.0,2190.0
1165,2019/06/04,2239.0,2221.368,2177.0,66100,2239.0,2177.0
1166,2019/06/05,2322.0,2318.084,2315.0,85300,2344.0,2295.0
1167,2019/06/06,2310.0,2321.844,2340.0,71700,2340.0,2310.0
1168,2019/06/07,2347.0,2340.802,2337.0,209300,2366.0,2315.0
1169,2019/06/10,2427.0,2408.555,2389.0,82200,2428.0,2382.0
1170,2019/06/11,2456.0,2442.917,2420.0,113100,2461.0,2406.0
1171,2019/06/12,2442.0,2460.904,2450.0,166200,2508.0,2430.0
1172,2019/06/13,2397.0,2401.33,2417.0,83300,2431.0,2380.0
1173,2019/06/14,2401.0,2394.465,2404.0,95300,2420.0,2359.0
1174,2019/06/17,2413.0,2404.033,2401.0,174800,2437.0,2375.0
1175,2019/06/18,2394.0,2402.203,2405.0,164700,2433.0,2382.0
1176,2019/06/19,2463.0,2445.232,2413.0,181200,2473.0,2395.0
1177,2019/06/20,2457.0,2447.679,2436.0,84600,2460.0,2423.0
1178,2019/06/21,2421.0,2430.999,2468.0,306500,2480.0,2413.0
1179,2019/06/24,2430.0,2425.756,2429.0,84500,2447.0,2412.0
1180,2019/06/25,2448.0,2456.328,2421.0,143200,2474.0,2421.0
1181,2019/06/26,2392.0,2404.006,2410.0,113500,2434.0,2389.0
1182,2019/06/27,2462.0,2428.33,2385.0,224200,2462.0,2374.0
1183,2019/06/28,2472.0,2467.485,2436.0,151900,2483.0,2424.0
1184,2019/07/01,2563.0,2543.919,2531.0,189000,2564.0,2513.0
1185,2019/07/02,2558.0,2556.183,2546.0,194200,2567.0,2534.0
1186,2019/07/03,2480.0,2487.429,2544.0,123900,2544.0,2467.0
1187,2019/07/04,2472.0,2478.04,2495.0,92100,2499.0,2469.0
1188,2019/07/05,2479.0,2475.945,2477.0,82300,2488.0,2465.0
1189,2019/07/08,2481.0,2482.988,2481.0,120600,2493.0,2471.0
1190,2019/07/09,2392.0,2409.701,2465.0,169300,2466.0,2376.0
1191,2019/07/10,2386.0,2382.055,2392.0,134000,2397.0,2341.0
1192,2019/07/11,2418.0,2411.252,2391.0,91900,2426.0,2371.0
1193,2019/07/12,2380.0,2388.96,2419.0,92600,2427.0,2378.0
1194,2019/07/16,2362.0,2363.138,2367.0,106500,2392.0,2345.0
1195,2019/07/17,2391.0,2400.106,2353.0,131900,2421.0,2353.0
1196,2019/07/18,2321.0,2334.829,2367.0,137600,2382.0,2318.0
1197,2019/07/19,2375.0,2372.743,2344.0,93100,2397.0,2333.0
1198,2019/07/22,2378.0,2383.625,2377.0,63500,2413.0,2371.0
1199,2019/07/23,2395.0,2400.615,2375.0,66400,2422.0,2375.0
1200,2019/07/24,2432.0,2436.261,2430.0,130900,2451.0,2426.0
1201,2019/07/25,2489.0,2479.688,2446.0,187000,2508.0,2439.0
1202,2019/07/26,2451.0,2450.771,2475.0,110600,2475.0,2434.0
1203,2019/07/29,2404.0,2413.187,2447.0,100100,2447.0,2404.0
1204,2019/07/30,2455.0,2446.305,2432.0,143800,2458.0,2423.0
1205,2019/07/31,2414.0,2433.34,2416.0,167000,2461.0,2414.0
1206,2019/08/01,2198.0,2195.513,2214.0,549200,2264.0,2117.0
1207,2019/08/02,2055.0,2083.421,2138.0,301200,2146.0,2042.0
1208,2019/08/05,2016.0,2013.543,2051.0,246600,2055.0,1976.0
1209,2019/08/06,2030.0,1999.742,1954.0,283200,2030.0,1940.0
1210,2019/08/07,2019.0,2021.039,2031.0,203600,2045.0,1998.0
1211,2019/08/08,2029.0,2027.137,2014.0,146900,2045.0,2002.0
1212,2019/08/09,2031.0,2030.273,2044.0,182900,2060.0,2014.0
1213,2019/08/13,2031.0,2016.983,2000.0,189100,2041.0,1971.0
1214,2019/08/14,2033.0,2042.688,2075.0,132300,2087.0,2028.0
1215,2019/08/15,2016.0,1999.397,1968.0,110700,2022.0,1964.0
1216,2019/08/16,2012.0,2020.286,2012.0,247600,2038.0,2001.0
1217,2019/08/19,2011.0,2011.176,2028.0,153400,2030.0,1990.0
1218,2019/08/20,2015.0,2015.436,2012.0,242500,2034.0,1997.0
1219,2019/08/21,2015.0,2006.409,1990.0,267400,2026.0,1985.0
1220,2019/08/22,1991.0,2006.564,2017.0,161500,2039.0,1989.0
1221,2019/08/23,2002.0,1995.516,1986.0,153200,2007.0,1958.0
