,Date,Close,VWAP,Open,Volume,High,Low
0,2014/08/25,838.0,860.934,844.0,21300,879.0,838.0
1,2014/08/26,850.0,858.922,868.0,10200,870.0,833.0
2,2014/08/27,849.0,845.551,845.0,10700,860.0,834.0
3,2014/08/28,840.0,843.138,849.0,2900,849.0,835.0
4,2014/08/29,848.0,834.772,830.0,5700,848.0,830.0
5,2014/09/01,840.0,844.281,836.0,3200,852.0,836.0
6,2014/09/02,835.0,831.517,840.0,6000,840.0,825.0
7,2014/09/03,820.0,825.26,826.0,5000,830.0,820.0
8,2014/09/04,819.0,820.435,815.0,4600,836.0,815.0
9,2014/09/05,824.0,820.977,829.0,4400,829.0,811.0
10,2014/09/08,826.0,820.625,816.0,2400,830.0,816.0
11,2014/09/09,827.0,826.93,829.0,5700,834.0,821.0
12,2014/09/10,820.0,817.737,821.0,1900,825.0,814.0
13,2014/09/11,822.0,819.805,819.0,7700,833.0,816.0
14,2014/09/12,814.0,813.972,822.0,7100,822.0,810.0
15,2014/09/16,816.0,839.257,859.0,20600,867.0,811.0
16,2014/09/17,847.0,835.858,816.0,11300,848.0,815.0
17,2014/09/18,825.0,817.613,844.0,12400,844.0,801.0
18,2014/09/19,830.0,828.005,844.0,19800,845.0,800.0
19,2014/09/22,815.0,823.0,835.0,3700,835.0,815.0
20,2014/09/24,820.0,812.242,815.0,6600,829.0,804.0
21,2014/09/25,821.0,820.097,820.0,3100,826.0,814.0
22,2014/09/26,812.0,805.76,819.0,7900,819.0,800.0
23,2014/09/29,810.0,807.619,812.0,2100,812.0,805.0
24,2014/09/30,815.0,814.832,811.0,10100,822.0,811.0
25,2014/10/01,802.0,811.802,815.0,9600,822.0,802.0
26,2014/10/02,796.0,799.309,800.0,12300,806.0,790.0
27,2014/10/03,830.0,811.644,795.0,10400,830.0,791.0
28,2014/10/06,830.0,823.605,829.0,8600,830.0,815.0
29,2014/10/07,821.0,824.387,826.0,6200,826.0,816.0
30,2014/10/08,802.0,801.559,806.0,3400,806.0,797.0
31,2014/10/09,793.0,792.769,802.0,3900,808.0,776.0
32,2014/10/10,766.0,761.627,769.0,6700,779.0,750.0
33,2014/10/14,736.0,729.173,751.0,8100,751.0,720.0
34,2014/10/15,735.0,731.585,736.0,13000,744.0,705.0
35,2014/10/16,727.0,721.901,705.0,18100,738.0,694.0
36,2014/10/17,708.0,716.339,721.0,12100,730.0,697.0
37,2014/10/20,723.0,733.118,738.0,1700,738.0,721.0
38,2014/10/21,730.0,726.118,728.0,1700,735.0,720.0
39,2014/10/22,747.0,741.857,730.0,1400,750.0,730.0
40,2014/10/23,767.0,756.609,747.0,6900,770.0,745.0
41,2014/10/24,753.0,756.939,750.0,6600,781.0,741.0
42,2014/10/27,751.0,751.944,765.0,1800,765.0,746.0
43,2014/10/28,725.0,722.958,721.0,4800,731.0,721.0
44,2014/10/29,733.0,730.875,727.0,800,739.0,727.0
45,2014/10/30,739.0,743.939,739.0,4900,750.0,739.0
46,2014/10/31,752.0,757.219,752.0,7300,762.0,752.0
47,2014/11/04,744.0,772.763,795.0,11400,798.0,738.0
48,2014/11/05,758.0,752.571,744.0,2800,760.0,744.0
49,2014/11/06,757.0,759.74,758.0,5000,769.0,755.0
50,2014/11/07,750.0,740.502,758.0,20700,760.0,725.0
51,2014/11/10,762.0,748.265,739.0,3400,762.0,739.0
52,2014/11/11,760.0,758.175,767.0,8000,767.0,749.0
53,2014/11/12,747.0,747.127,760.0,7900,760.0,740.0
54,2014/11/13,754.0,747.781,741.0,7300,755.0,738.0
55,2014/11/14,753.0,744.713,740.0,8700,755.0,738.0
56,2014/11/17,755.0,755.25,753.0,7200,760.0,749.0
57,2014/11/18,752.0,751.987,744.0,7900,761.0,744.0
58,2014/11/19,743.0,747.302,760.0,4300,760.0,740.0
59,2014/11/20,893.0,882.923,740.0,30000,893.0,740.0
60,2014/11/21,1043.0,1043.0,1043.0,39100,1043.0,1043.0
61,2014/11/25,1343.0,1343.0,1343.0,133400,1343.0,1343.0
62,2014/11/26,1225.0,1284.991,1313.0,1155500,1430.0,1171.0
63,2014/11/27,1085.0,1119.653,1170.0,240300,1170.0,1075.0
64,2014/11/28,1024.0,1022.91,1071.0,176100,1084.0,997.0
65,2014/12/01,1086.0,1058.619,1054.0,364200,1130.0,1001.0
66,2014/12/02,1002.0,1022.488,1050.0,86900,1050.0,1002.0
67,2014/12/03,966.0,975.13,980.0,83100,1002.0,960.0
68,2014/12/04,935.0,944.84,956.0,43100,960.0,935.0
69,2014/12/05,960.0,970.438,965.0,64200,990.0,946.0
70,2014/12/08,911.0,932.174,951.0,28700,959.0,911.0
71,2014/12/09,938.0,921.818,902.0,25800,943.0,900.0
72,2014/12/10,920.0,922.899,914.0,14900,938.0,910.0
73,2014/12/11,910.0,916.378,912.0,9000,930.0,908.0
74,2014/12/12,892.0,897.223,910.0,17500,919.0,881.0
75,2014/12/15,879.0,890.747,878.0,8700,906.0,874.0
76,2014/12/16,863.0,860.44,863.0,14100,879.0,855.0
77,2014/12/17,878.0,871.119,853.0,8400,888.0,853.0
78,2014/12/18,878.0,883.268,887.0,12700,893.0,878.0
79,2014/12/19,878.0,878.452,893.0,21000,898.0,859.0
80,2014/12/22,808.0,818.624,870.0,72600,870.0,800.0
81,2014/12/24,797.0,802.788,804.0,28300,810.0,797.0
82,2014/12/25,773.0,768.517,796.0,62300,797.0,744.0
83,2014/12/26,794.0,787.424,773.0,17700,800.0,771.0
84,2014/12/29,818.0,813.283,809.0,27600,831.0,797.0
85,2014/12/30,800.0,804.596,810.0,13600,811.0,800.0
86,2015/01/05,819.0,817.33,802.0,20300,832.0,801.0
87,2015/01/06,814.0,813.807,814.0,9300,819.0,808.0
88,2015/01/07,812.0,812.947,808.0,7600,820.0,808.0
89,2015/01/08,826.0,814.197,810.0,11700,826.0,810.0
90,2015/01/09,825.0,838.51,826.0,24100,858.0,821.0
91,2015/01/13,822.0,825.485,825.0,9900,839.0,815.0
92,2015/01/14,810.0,808.067,820.0,8900,820.0,799.0
93,2015/01/15,795.0,796.61,809.0,5900,809.0,794.0
94,2015/01/16,765.0,776.897,790.0,14500,793.0,761.0
95,2015/01/19,764.0,766.818,775.0,6600,775.0,760.0
96,2015/01/20,796.0,789.362,773.0,11600,809.0,770.0
97,2015/01/21,850.0,825.764,807.0,29200,850.0,781.0
98,2015/01/22,869.0,842.748,844.0,24200,869.0,818.0
99,2015/01/23,807.0,811.336,824.0,30700,824.0,800.0
100,2015/01/26,805.0,806.647,805.0,3400,811.0,805.0
101,2015/01/27,806.0,813.22,806.0,4100,825.0,806.0
102,2015/01/28,809.0,809.939,807.0,3300,815.0,807.0
103,2015/01/29,805.0,808.522,809.0,4600,816.0,804.0
104,2015/01/30,805.0,807.364,805.0,4400,818.0,805.0
105,2015/02/02,805.0,807.08,805.0,7500,812.0,805.0
106,2015/02/03,806.0,810.208,810.0,12500,816.0,805.0
107,2015/02/04,810.0,812.091,805.0,5500,818.0,803.0
108,2015/02/05,815.0,812.787,810.0,4700,818.0,808.0
109,2015/02/06,810.0,812.362,815.0,4700,816.0,810.0
110,2015/02/09,821.0,822.686,811.0,7000,833.0,811.0
111,2015/02/10,827.0,829.667,819.0,4800,839.0,819.0
112,2015/02/12,831.0,828.628,838.0,5100,838.0,823.0
113,2015/02/13,825.0,822.444,821.0,3600,835.0,818.0
114,2015/02/16,826.0,820.49,831.0,5100,831.0,818.0
115,2015/02/17,830.0,819.76,819.0,5000,830.0,815.0
116,2015/02/18,820.0,828.361,832.0,13300,832.0,816.0
117,2015/02/19,825.0,823.439,825.0,4100,833.0,815.0
118,2015/02/20,825.0,819.824,826.0,9100,835.0,810.0
119,2015/02/23,812.0,816.191,817.0,4200,822.0,810.0
120,2015/02/24,811.0,815.197,813.0,7600,824.0,809.0
121,2015/02/25,815.0,813.833,814.0,3000,816.0,812.0
122,2015/02/26,814.0,815.435,814.0,2300,820.0,814.0
123,2015/02/27,822.0,821.867,812.0,4500,830.0,811.0
124,2015/03/02,824.0,825.627,830.0,13400,830.0,819.0
125,2015/03/03,819.0,819.231,829.0,2600,829.0,814.0
126,2015/03/04,820.0,821.735,827.0,6800,831.0,814.0
127,2015/03/05,823.0,821.455,820.0,2200,828.0,820.0
128,2015/03/06,820.0,821.469,823.0,3200,824.0,820.0
129,2015/03/09,818.0,814.813,820.0,1600,820.0,811.0
130,2015/03/10,968.0,945.701,840.0,79800,968.0,840.0
131,2015/03/11,896.0,933.832,956.0,291200,1000.0,889.0
132,2015/03/12,862.0,879.364,905.0,41500,905.0,862.0
133,2015/03/13,853.0,856.408,857.0,21100,870.0,846.0
134,2015/03/16,870.0,863.281,873.0,12800,873.0,846.0
135,2015/03/17,862.0,861.986,858.0,14300,881.0,855.0
136,2015/03/18,879.0,879.541,883.0,17200,888.0,870.0
137,2015/03/19,873.0,869.38,871.0,14200,882.0,862.0
138,2015/03/20,864.0,868.256,873.0,3900,873.0,864.0
139,2015/03/23,872.0,867.615,865.0,2600,872.0,865.0
140,2015/03/24,820.0,840.743,874.0,17900,876.0,818.0
141,2015/03/25,826.0,823.544,825.0,23700,830.0,819.0
142,2015/03/26,812.0,813.3,823.0,13000,823.0,805.0
143,2015/03/27,811.0,814.373,813.0,5100,824.0,809.0
144,2015/03/30,815.0,809.188,805.0,4800,815.0,805.0
145,2015/03/31,813.0,810.889,811.0,2700,814.0,807.0
146,2015/04/01,812.0,811.667,809.0,1500,815.0,809.0
147,2015/04/02,818.0,816.029,813.0,3500,822.0,811.0
148,2015/04/03,827.0,828.802,821.0,8600,833.0,821.0
149,2015/04/06,848.0,833.929,827.0,5600,848.0,825.0
150,2015/04/07,835.0,838.462,848.0,5200,848.0,824.0
151,2015/04/08,837.0,834.115,840.0,6100,840.0,824.0
152,2015/04/09,829.0,831.395,835.0,4300,842.0,827.0
153,2015/04/10,827.0,836.275,829.0,16700,850.0,826.0
154,2015/04/13,823.0,824.69,820.0,2900,830.0,820.0
155,2015/04/14,829.0,832.474,823.0,3800,839.0,823.0
156,2015/04/15,832.0,829.696,826.0,2300,834.0,826.0
157,2015/04/16,825.0,826.107,830.0,2800,830.0,822.0
158,2015/04/17,820.0,819.825,822.0,12600,824.0,815.0
159,2015/04/20,817.0,816.92,818.0,2500,818.0,815.0
160,2015/04/21,818.0,816.5,817.0,2600,826.0,815.0
161,2015/04/22,821.0,820.296,817.0,2700,827.0,816.0
162,2015/04/23,826.0,826.438,822.0,3200,829.0,822.0
163,2015/04/24,821.0,874.546,916.0,129600,967.0,816.0
164,2015/04/27,822.0,825.133,821.0,6000,834.0,821.0
165,2015/04/28,828.0,823.634,823.0,4100,828.0,822.0
166,2015/04/30,821.0,822.71,829.0,3100,829.0,821.0
167,2015/05/01,799.0,813.06,820.0,21600,821.0,788.0
168,2015/05/07,780.0,798.105,792.0,30600,844.0,780.0
169,2015/05/08,780.0,778.64,782.0,11100,785.0,772.0
170,2015/05/11,780.0,784.218,785.0,5500,789.0,780.0
171,2015/05/12,775.0,775.368,780.0,3800,780.0,770.0
172,2015/05/13,772.0,775.097,772.0,7200,779.0,771.0
173,2015/05/14,768.0,770.67,772.0,10600,779.0,768.0
174,2015/05/15,779.0,772.649,768.0,3700,783.0,768.0
175,2015/05/18,779.0,781.347,779.0,7500,790.0,772.0
176,2015/05/19,795.0,789.011,786.0,9200,797.0,777.0
177,2015/05/20,807.0,802.921,802.0,17700,816.0,795.0
178,2015/05/21,810.0,807.806,801.0,13900,816.0,801.0
179,2015/05/22,808.0,806.438,817.0,8000,817.0,800.0
180,2015/05/25,804.0,804.863,805.0,5100,810.0,803.0
181,2015/05/26,799.0,799.0,804.0,5200,804.0,796.0
182,2015/05/27,791.0,791.507,790.0,7500,798.0,790.0
183,2015/05/28,795.0,793.623,791.0,10600,801.0,791.0
184,2015/05/29,793.0,795.783,796.0,6900,801.0,793.0
185,2015/06/01,785.0,788.099,790.0,11100,792.0,784.0
186,2015/06/02,779.0,780.647,781.0,9900,785.0,778.0
187,2015/06/03,789.0,780.159,779.0,4400,789.0,778.0
188,2015/06/04,785.0,787.828,783.0,5800,793.0,781.0
189,2015/06/05,788.0,785.885,782.0,2600,792.0,781.0
190,2015/06/08,782.0,788.262,788.0,4200,795.0,781.0
191,2015/06/09,780.0,782.575,782.0,4000,785.0,780.0
192,2015/06/10,785.0,779.688,779.0,3200,787.0,778.0
193,2015/06/11,780.0,784.276,790.0,2900,790.0,780.0
194,2015/06/12,792.0,786.918,781.0,8500,794.0,780.0
195,2015/06/15,790.0,790.808,792.0,2600,792.0,789.0
196,2015/06/16,777.0,782.259,790.0,5800,790.0,777.0
197,2015/06/17,778.0,778.737,778.0,1900,780.0,778.0
198,2015/06/18,786.0,792.373,785.0,10200,804.0,778.0
199,2015/06/19,790.0,797.098,800.0,8200,800.0,790.0
200,2015/06/22,798.0,796.867,798.0,3000,798.0,795.0
201,2015/06/23,796.0,799.871,800.0,6200,802.0,796.0
202,2015/06/24,796.0,798.541,802.0,3700,802.0,795.0
203,2015/06/25,792.0,784.5,789.0,2800,792.0,780.0
204,2015/06/26,792.0,788.044,787.0,2300,793.0,785.0
205,2015/06/29,780.0,780.546,782.0,3300,783.0,776.0
206,2015/06/30,786.0,780.222,777.0,6300,786.0,775.0
207,2015/07/01,796.0,792.73,792.0,3700,797.0,789.0
208,2015/07/02,783.0,784.255,792.0,5100,792.0,780.0
209,2015/07/03,777.0,776.412,780.0,5100,780.0,775.0
210,2015/07/06,769.0,768.71,770.0,3100,772.0,764.0
211,2015/07/07,768.0,767.267,769.0,3000,775.0,765.0
212,2015/07/08,756.0,760.197,777.0,7600,777.0,755.0
213,2015/07/09,725.0,727.908,750.0,13100,750.0,710.0
214,2015/07/10,728.0,733.267,739.0,1500,739.0,723.0
215,2015/07/13,728.0,731.464,728.0,2800,737.0,727.0
216,2015/07/14,747.0,738.8,729.0,5500,747.0,729.0
217,2015/07/15,747.0,751.133,748.0,4500,757.0,743.0
218,2015/07/16,755.0,750.135,754.0,3700,755.0,746.0
219,2015/07/17,763.0,758.346,755.0,2600,765.0,754.0
220,2015/07/21,761.0,757.667,763.0,3900,765.0,756.0
221,2015/07/22,755.0,755.095,755.0,2100,756.0,755.0
222,2015/07/23,750.0,729.425,725.0,27300,755.0,725.0
223,2015/07/24,745.0,741.099,745.0,8100,754.0,731.0
224,2015/07/27,728.0,732.483,742.0,2900,742.0,728.0
225,2015/07/28,742.0,737.563,728.0,6400,760.0,726.0
226,2015/07/29,731.0,736.324,741.0,3400,745.0,731.0
227,2015/07/30,727.0,729.526,731.0,5700,743.0,725.0
228,2015/07/31,727.0,729.571,741.0,2800,741.0,727.0
229,2015/08/03,727.0,731.167,739.0,600,739.0,727.0
230,2015/08/04,718.0,724.836,730.0,6100,731.0,718.0
231,2015/08/05,714.0,716.224,718.0,7600,724.0,714.0
232,2015/08/06,716.0,718.594,714.0,3200,724.0,714.0
233,2015/08/07,715.0,717.111,720.0,3600,720.0,715.0
234,2015/08/10,712.0,712.577,712.0,5200,720.0,711.0
235,2015/08/11,710.0,711.088,712.0,9100,717.0,710.0
236,2015/08/12,703.0,709.94,710.0,5000,719.0,703.0
237,2015/08/13,701.0,703.0,701.0,3800,709.0,700.0
238,2015/08/14,701.0,702.385,700.0,2600,707.0,700.0
239,2015/08/17,699.0,700.477,701.0,4400,703.0,699.0
240,2015/08/18,698.0,700.514,708.0,3500,708.0,698.0
241,2015/08/19,696.0,698.919,700.0,7400,708.0,695.0
242,2015/08/20,691.0,693.476,696.0,4200,702.0,691.0
243,2015/08/21,660.0,670.081,687.0,8700,687.0,651.0
244,2015/08/24,561.0,603.358,640.0,22100,640.0,561.0
245,2015/08/25,555.0,537.93,501.0,15700,608.0,501.0
246,2015/08/26,556.0,555.993,550.0,13300,567.0,550.0
247,2015/08/27,560.0,564.336,554.0,14900,590.0,554.0
248,2015/08/28,573.0,573.407,570.0,9100,580.0,565.0
249,2015/08/31,595.0,599.023,595.0,8600,609.0,590.0
250,2015/09/01,580.0,595.364,610.0,5500,610.0,580.0
251,2015/09/02,565.0,568.106,573.0,4700,578.0,555.0
252,2015/09/03,578.0,575.571,591.0,2800,591.0,567.0
253,2015/09/04,550.0,556.864,560.0,5900,561.0,550.0
254,2015/09/07,541.0,541.491,528.0,11000,580.0,520.0
255,2015/09/08,524.0,532.518,534.0,5600,541.0,524.0
256,2015/09/09,539.0,536.173,540.0,5200,549.0,530.0
257,2015/09/10,533.0,529.574,524.0,6100,536.0,524.0
258,2015/09/11,550.0,548.425,532.0,12700,556.0,532.0
259,2015/09/14,539.0,555.788,550.0,8000,568.0,539.0
260,2015/09/15,639.0,625.86,559.0,105400,639.0,550.0
261,2015/09/16,598.0,629.274,669.0,128500,670.0,580.0
262,2015/09/17,580.0,596.771,625.0,21400,626.0,580.0
263,2015/09/18,575.0,584.202,584.0,9900,602.0,574.0
264,2015/09/24,565.0,571.385,570.0,2600,576.0,565.0
265,2015/09/25,569.0,574.828,570.0,2900,590.0,565.0
266,2015/09/28,571.0,581.684,586.0,1900,586.0,571.0
267,2015/09/29,671.0,652.945,591.0,155900,671.0,567.0
268,2015/09/30,635.0,626.062,631.0,121700,655.0,604.0
269,2015/10/01,622.0,652.057,675.0,47400,679.0,611.0
270,2015/10/02,606.0,611.647,621.0,17000,621.0,605.0
271,2015/10/05,622.0,618.844,613.0,17900,633.0,610.0
272,2015/10/06,618.0,639.571,639.0,26100,665.0,617.0
273,2015/10/07,642.0,624.82,622.0,16700,650.0,616.0
274,2015/10/08,742.0,717.428,635.0,135900,742.0,620.0
275,2015/10/09,703.0,704.089,712.0,159900,734.0,683.0
276,2015/10/13,705.0,739.932,733.0,82100,784.0,705.0
277,2015/10/14,666.0,679.641,706.0,33700,706.0,663.0
278,2015/10/15,666.0,667.352,670.0,18200,678.0,655.0
279,2015/10/16,666.0,667.835,680.0,12700,680.0,656.0
280,2015/10/19,645.0,651.521,669.0,14000,669.0,642.0
281,2015/10/20,656.0,646.75,645.0,11200,656.0,636.0
282,2015/10/21,676.0,666.951,664.0,16400,677.0,657.0
283,2015/10/22,674.0,681.155,689.0,14800,689.0,671.0
284,2015/10/23,628.0,630.238,625.0,44200,648.0,614.0
285,2015/10/26,642.0,641.516,630.0,9300,648.0,630.0
286,2015/10/27,620.0,628.986,642.0,7300,642.0,619.0
287,2015/10/28,624.0,628.87,629.0,4600,636.0,624.0
288,2015/10/29,624.0,628.362,624.0,6900,638.0,624.0
289,2015/10/30,626.0,621.753,624.0,7300,626.0,616.0
290,2015/11/02,617.0,618.553,624.0,3800,624.0,616.0
291,2015/11/04,596.0,601.094,617.0,11700,617.0,596.0
292,2015/11/05,605.0,600.902,606.0,5100,610.0,593.0
293,2015/11/06,631.0,624.524,598.0,14700,651.0,596.0
294,2015/11/09,634.0,640.688,650.0,18900,651.0,622.0
295,2015/11/10,625.0,630.938,636.0,1600,636.0,624.0
296,2015/11/11,635.0,628.326,622.0,4300,640.0,622.0
297,2015/11/12,628.0,635.08,641.0,2500,641.0,627.0
298,2015/11/13,614.0,614.146,615.0,5500,619.0,608.0
299,2015/11/16,614.0,608.025,600.0,4000,620.0,600.0
300,2015/11/17,615.0,618.139,613.0,3600,625.0,608.0
301,2015/11/18,606.0,609.571,613.0,4900,615.0,602.0
302,2015/11/19,615.0,623.02,615.0,20400,644.0,613.0
303,2015/11/20,615.0,618.04,615.0,5000,624.0,615.0
304,2015/11/24,625.0,622.231,617.0,6500,628.0,617.0
305,2015/11/25,626.0,625.962,623.0,2600,630.0,623.0
306,2015/11/26,623.0,628.02,634.0,5000,634.0,620.0
307,2015/11/27,615.0,618.091,621.0,4400,622.0,615.0
308,2015/11/30,619.0,617.214,617.0,2800,619.0,616.0
309,2015/12/01,616.0,616.776,615.0,5800,620.0,615.0
310,2015/12/02,618.0,614.421,615.0,12600,618.0,613.0
311,2015/12/03,616.0,616.8,620.0,7500,620.0,613.0
312,2015/12/04,610.0,613.421,616.0,10700,621.0,610.0
313,2015/12/07,615.0,611.473,610.0,5500,615.0,610.0
314,2015/12/08,607.0,608.26,611.0,12700,611.0,607.0
315,2015/12/09,607.0,606.987,607.0,7900,611.0,606.0
316,2015/12/10,604.0,608.887,614.0,11500,615.0,602.0
317,2015/12/11,604.0,603.262,605.0,6500,607.0,601.0
318,2015/12/14,591.0,593.608,596.0,5100,598.0,590.0
319,2015/12/15,579.0,583.952,591.0,6300,591.0,579.0
320,2015/12/16,577.0,578.493,579.0,6900,587.0,576.0
321,2015/12/17,577.0,586.849,600.0,7300,600.0,576.0
322,2015/12/18,562.0,565.177,561.0,13000,570.0,561.0
323,2015/12/21,531.0,530.198,532.0,30300,538.0,525.0
324,2015/12/22,514.0,523.307,531.0,34200,531.0,510.0
325,2015/12/24,486.0,496.253,510.0,36300,510.0,486.0
326,2015/12/25,470.0,468.683,471.0,45100,483.0,462.0
327,2015/12/28,489.0,491.09,494.0,13400,500.0,472.0
328,2015/12/29,499.0,489.182,481.0,5500,499.0,480.0
329,2015/12/30,505.0,522.163,500.0,15300,545.0,500.0
330,2016/01/04,515.0,509.0,502.0,4600,518.0,502.0
331,2016/01/05,514.0,510.795,502.0,3900,514.0,502.0
332,2016/01/06,505.0,508.025,510.0,4000,511.0,505.0
333,2016/01/07,500.0,523.546,532.0,14100,545.0,500.0
334,2016/01/08,600.0,587.921,507.0,69800,600.0,502.0
335,2016/01/12,563.0,566.003,570.0,65600,580.0,545.0
336,2016/01/13,537.0,537.188,557.0,18600,559.0,521.0
337,2016/01/14,530.0,528.691,542.0,4200,542.0,525.0
338,2016/01/15,521.0,535.181,526.0,11600,545.0,521.0
339,2016/01/18,492.0,484.355,491.0,20000,495.0,472.0
340,2016/01/19,502.0,499.707,501.0,4100,504.0,496.0
341,2016/01/20,462.0,470.713,500.0,10800,500.0,459.0
342,2016/01/21,435.0,445.13,454.0,16900,454.0,433.0
343,2016/01/22,442.0,428.011,433.0,26400,443.0,422.0
344,2016/01/25,466.0,449.974,442.0,11400,466.0,439.0
345,2016/01/26,447.0,447.0,466.0,8500,466.0,440.0
346,2016/01/27,449.0,450.652,450.0,8900,458.0,446.0
347,2016/01/28,442.0,435.611,450.0,13100,451.0,422.0
348,2016/01/29,444.0,449.035,448.0,14200,460.0,435.0
349,2016/02/01,441.0,455.125,459.0,26500,472.0,441.0
350,2016/02/02,485.0,471.664,449.0,56600,498.0,449.0
351,2016/02/03,465.0,465.69,485.0,18400,485.0,454.0
352,2016/02/04,465.0,451.0,467.0,16400,480.0,440.0
353,2016/02/05,454.0,453.583,449.0,4800,459.0,444.0
354,2016/02/08,455.0,447.167,449.0,2400,455.0,441.0
355,2016/02/09,435.0,429.973,443.0,10900,443.0,420.0
356,2016/02/10,422.0,428.441,441.0,5900,441.0,421.0
357,2016/02/12,400.0,398.639,400.0,13300,404.0,385.0
358,2016/02/15,393.0,400.121,411.0,8300,422.0,392.0
359,2016/02/16,401.0,400.571,396.0,7700,410.0,394.0
360,2016/02/17,393.0,397.837,397.0,14700,402.0,391.0
361,2016/02/18,408.0,407.158,402.0,5700,417.0,400.0
362,2016/02/19,414.0,409.736,412.0,14000,419.0,392.0
363,2016/02/22,431.0,427.462,421.0,3900,435.0,420.0
364,2016/02/23,423.0,425.857,439.0,4900,439.0,420.0
365,2016/02/24,424.0,415.621,423.0,2900,424.0,410.0
366,2016/02/25,425.0,420.88,416.0,2500,426.0,416.0
367,2016/02/26,427.0,438.013,431.0,7900,450.0,416.0
368,2016/02/29,432.0,464.383,427.0,29000,490.0,426.0
369,2016/03/01,480.0,464.14,440.0,14300,480.0,440.0
370,2016/03/02,472.0,466.55,478.0,6000,478.0,458.0
371,2016/03/03,472.0,470.614,472.0,4400,479.0,461.0
372,2016/03/04,478.0,476.688,472.0,1600,480.0,472.0
373,2016/03/07,477.0,479.602,480.0,11800,492.0,473.0
374,2016/03/08,478.0,481.735,490.0,3400,490.0,476.0
375,2016/03/09,475.0,477.849,485.0,5300,485.0,475.0
376,2016/03/10,478.0,479.516,487.0,3100,487.0,475.0
377,2016/03/11,483.0,478.826,471.0,2300,486.0,471.0
378,2016/03/14,483.0,488.922,488.0,7700,495.0,481.0
379,2016/03/15,496.0,492.462,485.0,6500,499.0,485.0
380,2016/03/16,487.0,493.56,500.0,2500,500.0,486.0
381,2016/03/17,497.0,497.339,494.0,6500,501.0,490.0
382,2016/03/18,488.0,489.308,491.0,1300,496.0,487.0
383,2016/03/22,501.0,499.63,488.0,5400,501.0,488.0
384,2016/03/23,505.0,501.657,500.0,6700,512.0,499.0
385,2016/03/24,498.0,500.825,505.0,5700,505.0,498.0
386,2016/03/25,500.0,500.154,505.0,1300,505.0,498.0
387,2016/03/28,501.0,500.867,500.0,3000,503.0,495.0
388,2016/03/29,525.0,515.463,500.0,5400,526.0,500.0
389,2016/03/30,525.0,520.787,527.0,9400,528.0,504.0
390,2016/03/31,517.0,514.811,509.0,3700,520.0,507.0
391,2016/04/01,499.0,493.688,509.0,8000,510.0,488.0
392,2016/04/04,500.0,500.064,507.0,6300,507.0,496.0
393,2016/04/05,488.0,492.163,503.0,4900,503.0,478.0
394,2016/04/06,473.0,472.167,470.0,4800,485.0,469.0
395,2016/04/07,489.0,480.582,466.0,5500,498.0,466.0
396,2016/04/08,509.0,484.875,473.0,2400,518.0,465.0
397,2016/04/11,522.0,519.122,519.0,7400,525.0,506.0
398,2016/04/12,516.0,514.103,522.0,7800,522.0,506.0
399,2016/04/13,518.0,555.529,515.0,55200,601.0,515.0
400,2016/04/14,540.0,537.063,527.0,8000,552.0,521.0
401,2016/04/15,551.0,557.622,540.0,23800,575.0,533.0
402,2016/04/18,576.0,566.678,550.0,20800,594.0,536.0
403,2016/04/19,645.0,628.33,583.0,131900,669.0,582.0
404,2016/04/20,589.0,619.459,655.0,93000,660.0,589.0
405,2016/04/21,581.0,603.849,595.0,42900,630.0,581.0
406,2016/04/22,681.0,667.409,650.0,310200,681.0,612.0
407,2016/04/25,605.0,648.058,691.0,181800,693.0,601.0
408,2016/04/26,563.0,583.487,605.0,65100,610.0,556.0
409,2016/04/27,565.0,562.088,550.0,30700,579.0,550.0
410,2016/04/28,566.0,563.192,573.0,17200,576.0,548.0
411,2016/05/02,548.0,542.65,556.0,12300,556.0,530.0
412,2016/05/06,570.0,554.167,541.0,18000,578.0,536.0
413,2016/05/09,574.0,579.137,580.0,13100,590.0,570.0
414,2016/05/10,575.0,577.5,576.0,10200,585.0,570.0
415,2016/05/11,580.0,575.093,575.0,5400,583.0,567.0
416,2016/05/12,575.0,576.026,580.0,7800,586.0,568.0
417,2016/05/13,558.0,568.247,579.0,7300,579.0,557.0
418,2016/05/16,561.0,563.39,559.0,7700,573.0,559.0
419,2016/05/17,556.0,555.769,552.0,5200,565.0,552.0
420,2016/05/18,535.0,547.185,556.0,8100,556.0,532.0
421,2016/05/19,510.0,518.633,515.0,17700,540.0,505.0
422,2016/05/20,510.0,510.981,513.0,5300,520.0,502.0
423,2016/05/23,511.0,512.432,506.0,4400,524.0,506.0
424,2016/05/24,512.0,513.346,520.0,2600,520.0,510.0
425,2016/05/25,520.0,518.511,508.0,9400,534.0,508.0
426,2016/05/26,512.0,513.791,520.0,4300,521.0,510.0
427,2016/05/27,504.0,502.833,508.0,4200,515.0,495.0
428,2016/05/30,558.0,571.656,505.0,119500,604.0,505.0
429,2016/05/31,545.0,541.922,540.0,17900,555.0,536.0
430,2016/06/01,534.0,538.38,554.0,5000,554.0,531.0
431,2016/06/02,530.0,526.243,530.0,7000,532.0,522.0
432,2016/06/03,542.0,544.194,540.0,9300,556.0,523.0
433,2016/06/06,552.0,552.13,555.0,5400,555.0,548.0
434,2016/06/07,550.0,549.782,554.0,8700,555.0,531.0
435,2016/06/08,650.0,639.729,565.0,197000,650.0,540.0
436,2016/06/09,620.0,628.422,643.0,126800,647.0,609.0
437,2016/06/10,600.0,636.849,620.0,109100,691.0,593.0
438,2016/06/13,584.0,589.677,600.0,13600,600.0,581.0
439,2016/06/14,541.0,555.665,562.0,18200,570.0,541.0
440,2016/06/15,562.0,557.241,561.0,5400,562.0,542.0
441,2016/06/16,528.0,541.326,560.0,14400,565.0,526.0
442,2016/06/17,530.0,529.5,528.0,7000,534.0,525.0
443,2016/06/20,560.0,547.825,532.0,4000,560.0,532.0
444,2016/06/21,569.0,579.385,575.0,11700,597.0,569.0
445,2016/06/22,588.0,634.789,570.0,130400,669.0,570.0
446,2016/06/23,570.0,586.158,595.0,22200,605.0,566.0
447,2016/06/24,520.0,540.21,570.0,28100,588.0,502.0
448,2016/06/27,515.0,513.729,500.0,15500,530.0,500.0
449,2016/06/28,536.0,523.526,512.0,7800,543.0,511.0
450,2016/06/29,580.0,581.382,543.0,15700,600.0,543.0
451,2016/06/30,589.0,596.991,600.0,10500,613.0,580.0
452,2016/07/01,597.0,601.24,605.0,9600,610.0,580.0
453,2016/07/04,589.0,596.054,587.0,5600,614.0,587.0
454,2016/07/05,602.0,601.941,589.0,3400,607.0,589.0
455,2016/07/06,606.0,612.846,600.0,7800,618.0,600.0
456,2016/07/07,595.0,600.661,606.0,6200,610.0,591.0
457,2016/07/08,596.0,595.583,604.0,6000,605.0,582.0
458,2016/07/11,626.0,614.718,593.0,12400,626.0,593.0
459,2016/07/12,640.0,630.926,625.0,12200,644.0,623.0
460,2016/07/13,650.0,659.761,644.0,28400,671.0,644.0
461,2016/07/14,677.0,666.016,642.0,18700,678.0,636.0
462,2016/07/15,750.0,740.037,699.0,332800,777.0,677.0
463,2016/07/19,749.0,721.34,705.0,62300,750.0,703.0
464,2016/07/20,873.0,867.336,820.0,371200,899.0,777.0
465,2016/07/21,816.0,824.312,850.0,186000,850.0,786.0
466,2016/07/22,715.0,743.206,760.0,95500,769.0,715.0
467,2016/07/25,705.0,718.422,726.0,24200,726.0,705.0
468,2016/07/26,685.0,695.299,696.0,16400,712.0,685.0
469,2016/07/27,654.0,672.238,695.0,18500,695.0,654.0
470,2016/07/28,631.0,628.963,636.0,32100,639.0,612.0
471,2016/07/29,614.0,619.435,631.0,13800,631.0,610.0
472,2016/08/01,650.0,638.346,597.0,20500,666.0,597.0
473,2016/08/02,628.0,632.522,630.0,4600,642.0,627.0
474,2016/08/03,624.0,636.602,650.0,8800,650.0,624.0
475,2016/08/04,618.0,627.746,630.0,6300,634.0,616.0
476,2016/08/05,615.0,612.708,630.0,9600,631.0,606.0
477,2016/08/08,615.0,615.0,615.0,3300,620.0,612.0
478,2016/08/09,615.0,616.1,615.0,2000,622.0,615.0
479,2016/08/10,615.0,614.615,611.0,2600,621.0,611.0
480,2016/08/12,687.0,680.903,685.0,25700,687.0,665.0
481,2016/08/15,690.0,698.643,688.0,14300,715.0,688.0
482,2016/08/16,698.0,701.017,695.0,5800,710.0,695.0
483,2016/08/17,698.0,703.206,715.0,3400,715.0,698.0
484,2016/08/18,702.0,699.069,700.0,10100,710.0,690.0
485,2016/08/19,703.0,713.613,710.0,8000,720.0,703.0
486,2016/08/22,708.0,703.963,713.0,2700,713.0,700.0
487,2016/08/23,695.0,697.81,702.0,4200,703.0,691.0
488,2016/08/24,695.0,691.563,690.0,1600,695.0,690.0
489,2016/08/25,695.0,672.083,695.0,6000,695.0,639.0
490,2016/08/26,681.0,694.111,700.0,900,700.0,681.0
491,2016/08/29,670.0,671.214,681.0,1400,681.0,662.0
492,2016/08/30,656.0,662.875,667.0,2400,669.0,655.0
493,2016/08/31,658.0,664.296,676.0,2700,691.0,650.0
494,2016/09/01,655.0,651.0,650.0,2500,655.0,650.0
495,2016/09/02,645.0,650.548,652.0,6200,660.0,645.0
496,2016/09/05,639.0,660.03,685.0,6700,685.0,635.0
497,2016/09/06,633.0,633.152,635.0,4600,640.0,630.0
498,2016/09/07,635.0,637.273,633.0,1100,642.0,633.0
499,2016/09/08,630.0,633.719,637.0,5700,647.0,630.0
500,2016/09/09,640.0,644.355,630.0,3100,655.0,630.0
501,2016/09/12,632.0,641.924,643.0,6600,661.0,632.0
502,2016/09/13,631.0,630.8,630.0,2500,632.0,630.0
503,2016/09/14,610.0,619.118,630.0,9300,630.0,607.0
504,2016/09/15,600.0,601.286,603.0,12600,609.0,598.0
505,2016/09/16,600.0,600.429,600.0,1400,602.0,600.0
506,2016/09/20,601.0,591.24,588.0,5000,601.0,581.0
507,2016/09/21,588.0,589.348,590.0,2300,592.0,585.0
508,2016/09/23,605.0,616.682,588.0,11000,640.0,588.0
509,2016/09/26,617.0,614.44,608.0,2500,620.0,608.0
510,2016/09/27,609.0,610.07,610.0,4300,612.0,606.0
511,2016/09/28,635.0,625.99,600.0,19400,647.0,598.0
512,2016/09/29,643.0,637.128,637.0,7800,643.0,630.0
513,2016/09/30,630.0,632.92,643.0,2500,643.0,630.0
514,2016/10/03,633.0,626.0,630.0,2200,633.0,620.0
515,2016/10/04,621.0,632.556,640.0,5400,640.0,621.0
516,2016/10/05,628.0,626.447,621.0,3800,639.0,621.0
517,2016/10/06,650.0,637.644,628.0,20800,651.0,628.0
518,2016/10/07,617.0,625.493,640.0,15000,640.0,617.0
519,2016/10/11,617.0,620.628,621.0,4300,633.0,617.0
520,2016/10/12,614.0,605.967,615.0,6000,624.0,600.0
521,2016/10/13,606.0,605.952,614.0,2100,614.0,603.0
522,2016/10/14,605.0,611.525,611.0,4000,619.0,605.0
523,2016/10/17,605.0,603.618,603.0,3400,609.0,602.0
524,2016/10/18,615.0,614.0,610.0,3700,618.0,610.0
525,2016/10/19,618.0,620.395,620.0,3800,627.0,613.0
526,2016/10/20,646.0,634.643,629.0,18200,647.0,620.0
527,2016/10/21,656.0,713.893,706.0,449500,746.0,656.0
528,2016/10/24,627.0,637.744,648.0,47300,650.0,621.0
529,2016/10/25,618.0,617.773,622.0,11900,623.0,611.0
530,2016/10/26,614.0,616.523,614.0,17800,629.0,607.0
531,2016/10/27,610.0,611.136,614.0,11800,618.0,606.0
532,2016/10/28,613.0,609.378,607.0,3700,613.0,607.0
533,2016/10/31,612.0,610.163,611.0,4900,613.0,608.0
534,2016/11/01,606.0,603.765,609.0,15300,612.0,598.0
535,2016/11/02,596.0,598.328,600.0,6700,604.0,593.0
536,2016/11/04,576.0,583.462,596.0,9300,596.0,564.0
537,2016/11/07,580.0,580.333,572.0,3600,594.0,572.0
538,2016/11/08,573.0,577.739,581.0,11500,585.0,572.0
539,2016/11/09,549.0,542.032,572.0,15600,575.0,520.0
540,2016/11/10,560.0,563.712,559.0,11100,577.0,550.0
541,2016/11/11,551.0,556.375,562.0,5600,566.0,550.0
542,2016/11/14,544.0,538.35,551.0,10300,551.0,526.0
543,2016/11/15,540.0,541.639,544.0,6100,546.0,540.0
544,2016/11/16,541.0,537.689,540.0,9000,545.0,533.0
545,2016/11/17,561.0,555.607,548.0,5600,566.0,544.0
546,2016/11/18,564.0,562.911,562.0,5600,566.0,556.0
547,2016/11/21,573.0,575.572,574.0,16600,584.0,570.0
548,2016/11/22,567.0,567.551,564.0,4900,573.0,564.0
549,2016/11/24,569.0,569.774,573.0,5300,573.0,569.0
550,2016/11/25,563.0,564.056,570.0,7200,570.0,560.0
551,2016/11/28,568.0,565.432,565.0,4400,568.0,562.0
552,2016/11/29,571.0,569.533,569.0,4500,574.0,566.0
553,2016/11/30,573.0,575.97,568.0,10000,579.0,568.0
554,2016/12/01,580.0,577.329,573.0,7000,580.0,573.0
555,2016/12/02,581.0,580.804,582.0,5100,584.0,579.0
556,2016/12/05,584.0,582.836,585.0,11000,586.0,571.0
557,2016/12/06,570.0,572.232,585.0,24600,588.0,558.0
558,2016/12/07,566.0,565.901,570.0,17200,570.0,560.0
559,2016/12/08,560.0,560.664,561.0,12800,563.0,559.0
560,2016/12/09,556.0,557.744,559.0,9000,563.0,555.0
561,2016/12/12,560.0,560.385,559.0,3900,563.0,559.0
562,2016/12/13,564.0,561.63,560.0,2700,564.0,558.0
563,2016/12/14,563.0,564.483,564.0,2900,568.0,563.0
564,2016/12/15,565.0,556.915,560.0,4700,565.0,550.0
565,2016/12/16,568.0,562.667,565.0,8400,568.0,557.0
566,2016/12/19,560.0,559.25,558.0,7600,564.0,557.0
567,2016/12/20,558.0,557.901,556.0,8100,560.0,556.0
568,2016/12/21,550.0,553.257,558.0,22200,558.0,549.0
569,2016/12/22,549.0,546.84,552.0,28800,554.0,541.0
570,2016/12/26,542.0,543.77,548.0,26100,549.0,540.0
571,2016/12/27,544.0,544.107,541.0,12100,548.0,541.0
572,2016/12/28,557.0,557.667,554.0,8700,560.0,553.0
573,2016/12/29,559.0,558.074,556.0,5400,563.0,555.0
574,2016/12/30,566.0,564.324,559.0,6800,567.0,559.0
575,2017/01/04,568.0,565.443,568.0,12200,568.0,562.0
576,2017/01/05,584.0,573.923,571.0,10400,584.0,568.0
577,2017/01/06,585.0,586.975,589.0,11900,590.0,584.0
578,2017/01/10,595.0,593.068,592.0,8800,595.0,591.0
579,2017/01/11,592.0,594.027,601.0,7400,601.0,590.0
580,2017/01/12,578.0,584.567,589.0,15000,589.0,578.0
581,2017/01/13,575.0,578.636,580.0,2200,583.0,575.0
582,2017/01/16,570.0,568.128,576.0,7800,577.0,555.0
583,2017/01/17,568.0,569.087,566.0,2300,572.0,565.0
584,2017/01/18,568.0,556.852,560.0,18200,568.0,549.0
585,2017/01/19,565.0,565.62,567.0,7900,569.0,563.0
586,2017/01/20,561.0,557.75,555.0,6000,562.0,554.0
587,2017/01/23,569.0,572.377,580.0,5300,580.0,566.0
588,2017/01/24,570.0,570.726,573.0,5100,576.0,568.0
589,2017/01/25,573.0,576.083,574.0,4800,579.0,569.0
590,2017/01/26,570.0,570.456,580.0,9000,580.0,561.0
591,2017/01/27,564.0,563.209,567.0,15800,580.0,554.0
592,2017/01/30,575.0,566.954,559.0,13100,575.0,559.0
593,2017/01/31,590.0,587.251,583.0,22300,597.0,578.0
594,2017/02/01,590.0,593.568,598.0,19000,599.0,588.0
595,2017/02/02,606.0,603.085,590.0,18800,612.0,590.0
596,2017/02/03,598.0,603.019,601.0,5300,608.0,598.0
597,2017/02/06,598.0,600.51,606.0,5100,606.0,598.0
598,2017/02/07,593.0,594.8,604.0,2500,604.0,591.0
599,2017/02/08,592.0,592.333,595.0,1500,595.0,590.0
600,2017/02/09,610.0,605.174,595.0,30400,616.0,594.0
601,2017/02/10,611.0,613.368,618.0,7600,618.0,611.0
602,2017/02/13,657.0,673.432,611.0,138300,711.0,609.0
603,2017/02/14,629.0,642.974,667.0,22800,672.0,621.0
604,2017/02/15,627.0,631.878,635.0,4900,638.0,626.0
605,2017/02/16,626.0,627.816,625.0,8700,635.0,623.0
606,2017/02/17,629.0,632.9,635.0,4000,636.0,629.0
607,2017/02/20,623.0,627.099,630.0,7100,635.0,621.0
608,2017/02/21,629.0,631.014,626.0,7100,638.0,625.0
609,2017/02/22,630.0,629.391,629.0,6400,634.0,628.0
610,2017/02/23,627.0,628.1,631.0,3000,631.0,622.0
611,2017/02/24,619.0,623.577,627.0,10400,632.0,617.0
612,2017/02/27,618.0,622.627,629.0,5900,629.0,618.0
613,2017/02/28,621.0,622.8,625.0,500,625.0,621.0
614,2017/03/01,621.0,621.75,622.0,2400,622.0,621.0
615,2017/03/02,615.0,617.483,624.0,2900,625.0,614.0
616,2017/03/03,612.0,613.75,613.0,4400,623.0,610.0
617,2017/03/06,603.0,601.844,610.0,17900,610.0,598.0
618,2017/03/07,651.0,689.15,615.0,814900,703.0,615.0
619,2017/03/08,621.0,623.713,631.0,100900,642.0,612.0
620,2017/03/09,615.0,620.278,631.0,21200,633.0,614.0
621,2017/03/10,675.0,675.847,619.0,219000,715.0,619.0
622,2017/03/13,652.0,649.313,645.0,44700,670.0,642.0
623,2017/03/14,654.0,662.129,677.0,15500,677.0,648.0
624,2017/03/15,633.0,643.651,663.0,12600,663.0,633.0
625,2017/03/16,634.0,633.321,630.0,8400,645.0,630.0
626,2017/03/17,634.0,637.528,644.0,10600,647.0,631.0
627,2017/03/21,645.0,664.421,694.0,88000,695.0,643.0
628,2017/03/22,657.0,672.89,635.0,151100,718.0,634.0
629,2017/03/23,650.0,652.628,650.0,19100,668.0,647.0
630,2017/03/24,646.0,646.935,648.0,10800,655.0,644.0
631,2017/03/27,646.0,658.808,666.0,17200,666.0,646.0
632,2017/03/28,647.0,642.344,646.0,9600,654.0,636.0
633,2017/03/29,650.0,646.55,650.0,8000,660.0,638.0
634,2017/03/30,650.0,656.465,660.0,21300,665.0,641.0
635,2017/03/31,645.0,640.493,645.0,20300,655.0,631.0
636,2017/04/03,643.0,650.437,658.0,13500,658.0,640.0
637,2017/04/04,620.0,631.521,642.0,18800,648.0,617.0
638,2017/04/05,623.0,624.805,638.0,8700,642.0,615.0
639,2017/04/06,596.0,600.554,620.0,22200,620.0,592.0
640,2017/04/07,594.0,589.531,592.0,9600,596.0,583.0
641,2017/04/10,606.0,602.348,594.0,2300,606.0,594.0
642,2017/04/11,601.0,597.796,600.0,4400,606.0,590.0
643,2017/04/12,581.0,589.569,601.0,13000,601.0,581.0
644,2017/04/13,575.0,572.459,580.0,6100,580.0,562.0
645,2017/04/14,555.0,562.571,565.0,4200,567.0,555.0
646,2017/04/17,600.0,592.427,557.0,15700,617.0,556.0
647,2017/04/18,616.0,608.574,590.0,5400,617.0,590.0
648,2017/04/19,610.0,618.769,620.0,13000,631.0,606.0
649,2017/04/20,631.0,621.888,609.0,23300,631.0,603.0
650,2017/04/21,608.0,609.743,620.0,23300,620.0,600.0
651,2017/04/24,600.0,637.713,620.0,96900,687.0,597.0
652,2017/04/25,604.0,607.396,604.0,10600,620.0,604.0
653,2017/04/26,616.0,605.473,605.0,5500,616.0,600.0
654,2017/04/27,610.0,610.727,617.0,1100,617.0,608.0
655,2017/04/28,600.0,601.526,606.0,7600,608.0,600.0
656,2017/05/01,594.0,599.826,600.0,4600,606.0,594.0
657,2017/05/02,595.0,594.571,594.0,1400,596.0,594.0
658,2017/05/08,603.0,603.528,609.0,3600,609.0,600.0
659,2017/05/09,605.0,602.574,605.0,6800,606.0,600.0
660,2017/05/10,614.0,609.83,601.0,5300,625.0,597.0
661,2017/05/11,613.0,614.329,612.0,7300,625.0,605.0
662,2017/05/12,605.0,606.467,608.0,1500,610.0,603.0
663,2017/05/15,603.0,602.833,606.0,4800,606.0,600.0
664,2017/05/16,600.0,604.086,606.0,3500,611.0,600.0
665,2017/05/17,600.0,601.471,600.0,5100,609.0,600.0
666,2017/05/18,601.0,598.739,600.0,2300,601.0,597.0
667,2017/05/19,604.0,601.091,602.0,1100,604.0,600.0
668,2017/05/22,605.0,605.813,606.0,4800,607.0,604.0
669,2017/05/23,608.0,608.963,606.0,2700,615.0,606.0
670,2017/05/24,609.0,608.483,609.0,2900,610.0,605.0
671,2017/05/25,603.0,604.231,610.0,7800,611.0,600.0
672,2017/05/26,606.0,605.923,605.0,1300,607.0,605.0
673,2017/05/29,604.0,602.0,606.0,8000,606.0,596.0
674,2017/05/30,598.0,599.677,599.0,3100,601.0,598.0
675,2017/05/31,594.0,595.14,595.0,5700,598.0,594.0
676,2017/06/01,600.0,597.053,596.0,1900,600.0,596.0
677,2017/06/02,600.0,601.0,597.0,1000,605.0,597.0
678,2017/06/05,603.0,600.301,605.0,7300,605.0,595.0
679,2017/06/06,598.0,599.923,603.0,2600,603.0,598.0
680,2017/06/07,600.0,599.275,605.0,5100,605.0,597.0
681,2017/06/08,602.0,596.055,598.0,14600,602.0,588.0
682,2017/06/09,599.0,600.52,600.0,2500,602.0,599.0
683,2017/06/12,611.0,611.517,612.0,24200,619.0,599.0
684,2017/06/13,644.0,635.447,611.0,71100,652.0,606.0
685,2017/06/14,633.0,634.471,640.0,21000,650.0,625.0
686,2017/06/15,630.0,632.619,640.0,11800,644.0,622.0
687,2017/06/16,624.0,621.442,623.0,10400,627.0,616.0
688,2017/06/19,634.0,629.539,624.0,11700,639.0,624.0
689,2017/06/20,632.0,655.696,670.0,66500,673.0,630.0
690,2017/06/21,645.0,639.439,630.0,22100,645.0,630.0
691,2017/06/22,653.0,655.266,647.0,12400,660.0,645.0
692,2017/06/23,625.0,635.652,651.0,23300,653.0,618.0
693,2017/06/26,621.0,624.74,627.0,10400,633.0,618.0
694,2017/06/27,620.0,625.152,622.0,4600,632.0,620.0
695,2017/06/28,720.0,720.0,720.0,57900,720.0,720.0
696,2017/06/29,870.0,863.108,855.0,527000,870.0,852.0
697,2017/06/30,1020.0,983.557,960.0,1660500,1020.0,920.0
698,2017/07/03,1320.0,1320.0,1320.0,44200,1320.0,1320.0
699,2017/07/04,1510.0,1542.876,1620.0,2860600,1620.0,1324.0
700,2017/07/05,1408.0,1541.644,1585.0,2048500,1764.0,1360.0
701,2017/07/06,1217.0,1262.363,1318.0,852600,1350.0,1187.0
702,2017/07/07,1185.0,1239.628,1170.0,1184700,1390.0,1137.0
703,2017/07/10,1144.0,1139.13,1155.0,296100,1177.0,1106.0
704,2017/07/11,1157.0,1130.872,1117.0,192400,1166.0,1107.0
705,2017/07/12,1180.0,1168.251,1136.0,385400,1227.0,1115.0
706,2017/07/13,1192.0,1279.804,1261.0,871600,1399.0,1174.0
707,2017/07/14,1149.0,1137.1,1149.0,212500,1173.0,1113.0
708,2017/07/18,1071.0,1088.309,1127.0,278700,1141.0,1046.0
709,2017/07/19,1092.0,1096.303,1108.0,104800,1135.0,1070.0
710,2017/07/20,1188.0,1170.524,1116.0,376300,1229.0,1092.0
711,2017/07/21,1230.0,1188.023,1180.0,301600,1234.0,1130.0
712,2017/07/24,1210.0,1285.094,1209.0,591300,1368.0,1200.0
713,2017/07/25,1189.0,1188.162,1219.0,135900,1225.0,1154.0
714,2017/07/26,1195.0,1200.444,1200.0,74300,1220.0,1176.0
715,2017/07/27,1224.0,1216.694,1210.0,99100,1237.0,1190.0
716,2017/07/28,1141.0,1182.296,1235.0,141800,1252.0,1140.0
717,2017/07/31,1046.0,1063.726,1144.0,190500,1154.0,1012.0
718,2017/08/01,960.0,977.825,1016.0,180600,1016.0,948.0
719,2017/08/02,972.0,987.498,990.0,149500,1018.0,966.0
720,2017/08/03,949.0,961.616,998.0,78600,998.0,935.0
721,2017/08/04,968.0,960.387,942.0,47800,977.0,937.0
722,2017/08/07,910.0,932.773,955.0,76300,980.0,910.0
723,2017/08/08,920.0,920.197,925.0,31500,931.0,910.0
724,2017/08/09,929.0,895.092,905.0,91100,930.0,868.0
725,2017/08/10,910.0,906.457,929.0,53400,929.0,891.0
726,2017/08/14,904.0,891.933,887.0,43200,912.0,886.0
727,2017/08/15,898.0,899.397,902.0,22700,909.0,892.0
728,2017/08/16,936.0,926.827,895.0,48100,948.0,894.0
729,2017/08/17,915.0,914.599,911.0,28900,924.0,909.0
730,2017/08/18,894.0,908.79,903.0,47700,945.0,892.0
731,2017/08/21,903.0,906.128,910.0,25800,921.0,892.0
732,2017/08/22,923.0,914.846,902.0,31900,927.0,901.0
733,2017/08/23,943.0,938.014,930.0,58200,950.0,925.0
734,2017/08/24,934.0,929.712,928.0,30900,936.0,920.0
735,2017/08/25,915.0,920.983,929.0,17800,929.0,913.0
736,2017/08/28,931.0,932.857,925.0,38400,944.0,914.0
737,2017/08/29,917.0,916.314,916.0,27400,928.0,906.0
738,2017/08/30,905.0,910.494,918.0,23900,926.0,902.0
739,2017/08/31,908.0,911.988,910.0,25200,924.0,901.0
740,2017/09/01,1058.0,1006.42,919.0,372000,1058.0,911.0
741,2017/09/04,1237.0,1215.792,1190.0,2153400,1320.0,1113.0
742,2017/09/05,1142.0,1138.295,1220.0,593600,1225.0,1025.0
743,2017/09/06,1119.0,1107.053,1052.0,199000,1159.0,1050.0
744,2017/09/07,1125.0,1176.612,1131.0,446600,1244.0,1082.0
745,2017/09/08,1130.0,1134.052,1120.0,133600,1162.0,1112.0
746,2017/09/11,1240.0,1239.326,1190.0,474400,1296.0,1155.0
747,2017/09/12,1335.0,1285.153,1269.0,373900,1335.0,1216.0
748,2017/09/13,1300.0,1392.285,1344.0,874200,1481.0,1250.0
749,2017/09/14,1410.0,1363.96,1329.0,572100,1427.0,1260.0
750,2017/09/15,1398.0,1400.725,1380.0,344900,1449.0,1352.0
751,2017/09/19,1394.0,1392.389,1420.0,205200,1430.0,1355.0
752,2017/09/20,1299.0,1308.624,1385.0,328700,1391.0,1261.0
753,2017/09/21,1599.0,1501.183,1270.0,1166200,1599.0,1265.0
754,2017/09/22,1385.0,1435.504,1523.0,1487200,1527.0,1360.0
755,2017/09/25,1309.0,1347.948,1371.0,348300,1400.0,1309.0
756,2017/09/26,1319.0,1346.601,1308.0,457900,1415.0,1272.0
757,2017/09/27,1347.0,1363.75,1340.0,273000,1420.0,1320.0
758,2017/09/28,1400.0,1386.834,1370.0,292000,1419.0,1348.0
759,2017/09/29,1500.0,1495.909,1430.0,894200,1575.0,1415.0
760,2017/10/02,1504.0,1526.711,1485.0,404100,1570.0,1482.0
761,2017/10/03,1539.0,1546.181,1521.0,694000,1610.0,1456.0
762,2017/10/04,1520.0,1538.068,1513.0,311900,1579.0,1500.0
763,2017/10/05,1430.0,1453.528,1521.0,354400,1525.0,1399.0
764,2017/10/06,1408.0,1425.835,1430.0,133500,1449.0,1404.0
765,2017/10/10,1434.0,1429.046,1407.0,86300,1460.0,1401.0
766,2017/10/11,1423.0,1417.727,1422.0,63800,1447.0,1400.0
767,2017/10/12,1317.0,1356.884,1423.0,220300,1424.0,1303.0
768,2017/10/13,1290.0,1238.467,1290.0,423100,1320.0,1180.0
769,2017/10/16,1277.0,1276.616,1295.0,82000,1301.0,1237.0
770,2017/10/17,1204.0,1231.196,1287.0,179700,1287.0,1196.0
771,2017/10/18,1235.0,1254.378,1205.0,168700,1295.0,1204.0
772,2017/10/19,1300.0,1277.206,1300.0,274700,1325.0,1222.0
773,2017/10/20,1190.0,1173.826,1121.0,425500,1238.0,1120.0
774,2017/10/23,1304.0,1256.633,1188.0,189100,1310.0,1185.0
775,2017/10/24,1509.0,1532.824,1282.0,2447200,1604.0,1261.0
776,2017/10/25,1360.0,1440.82,1460.0,968900,1544.0,1350.0
777,2017/10/26,1371.0,1344.756,1330.0,185600,1380.0,1310.0
778,2017/10/27,1314.0,1348.58,1345.0,151100,1390.0,1314.0
779,2017/10/30,1318.0,1348.846,1310.0,204400,1390.0,1310.0
780,2017/10/31,1304.0,1314.198,1346.0,161900,1349.0,1280.0
781,2017/11/01,1320.0,1329.331,1301.0,190900,1360.0,1301.0
782,2017/11/02,1293.0,1307.335,1316.0,107800,1340.0,1291.0
783,2017/11/06,1307.0,1304.766,1290.0,127600,1336.0,1265.0
784,2017/11/07,1365.0,1427.692,1350.0,859300,1535.0,1343.0
785,2017/11/08,1328.0,1334.546,1348.0,189700,1381.0,1312.0
786,2017/11/09,1308.0,1302.53,1327.0,166500,1327.0,1270.0
787,2017/11/10,1290.0,1297.792,1300.0,80800,1326.0,1280.0
788,2017/11/13,1299.0,1301.586,1314.0,48800,1325.0,1290.0
789,2017/11/14,1314.0,1313.686,1309.0,80800,1350.0,1286.0
790,2017/11/15,1255.0,1277.258,1314.0,102700,1314.0,1250.0
791,2017/11/16,1295.0,1267.684,1240.0,46500,1295.0,1237.0
792,2017/11/17,1304.0,1300.012,1282.0,125900,1328.0,1274.0
793,2017/11/20,1349.0,1346.615,1304.0,134700,1365.0,1304.0
794,2017/11/21,1367.0,1348.801,1350.0,73400,1370.0,1333.0
795,2017/11/22,1391.0,1391.322,1360.0,150000,1419.0,1353.0
796,2017/11/24,1449.0,1449.028,1430.0,295800,1478.0,1425.0
797,2017/11/27,1417.0,1440.501,1459.0,207600,1490.0,1393.0
798,2017/11/28,1417.0,1419.806,1435.0,98800,1453.0,1403.0
799,2017/11/29,1390.0,1424.138,1415.0,172200,1469.0,1368.0
800,2017/11/30,1414.0,1433.702,1480.0,154200,1480.0,1393.0
801,2017/12/01,1397.0,1404.157,1414.0,63000,1422.0,1395.0
802,2017/12/04,1391.0,1420.422,1400.0,159900,1459.0,1390.0
803,2017/12/05,1344.0,1365.552,1400.0,95300,1400.0,1340.0
804,2017/12/06,1314.0,1326.444,1325.0,124900,1369.0,1296.0
805,2017/12/07,1384.0,1355.382,1328.0,90000,1384.0,1322.0
806,2017/12/08,1360.0,1365.128,1371.0,45400,1376.0,1351.0
807,2017/12/11,1399.0,1390.914,1370.0,66000,1413.0,1364.0
808,2017/12/12,1354.0,1375.763,1400.0,62000,1408.0,1352.0
809,2017/12/13,1330.0,1339.503,1355.0,61100,1372.0,1315.0
810,2017/12/14,1324.0,1332.256,1327.0,59300,1363.0,1306.0
811,2017/12/15,1301.0,1305.854,1309.0,76700,1338.0,1292.0
812,2017/12/18,1291.0,1290.889,1292.0,56900,1311.0,1272.0
813,2017/12/19,1327.0,1318.727,1296.0,72500,1347.0,1285.0
814,2017/12/20,1322.0,1338.225,1331.0,39600,1358.0,1321.0
815,2017/12/21,1341.0,1323.702,1327.0,29900,1345.0,1303.0
816,2017/12/22,1390.0,1418.491,1341.0,636100,1490.0,1340.0
817,2017/12/25,1350.0,1363.573,1378.0,111800,1393.0,1350.0
818,2017/12/26,1336.0,1351.218,1364.0,94800,1383.0,1329.0
819,2017/12/27,1338.0,1346.037,1336.0,56200,1370.0,1330.0
820,2017/12/28,1316.0,1320.278,1329.0,60100,1339.0,1310.0
821,2017/12/29,1315.0,1317.529,1306.0,45400,1328.0,1306.0
822,2018/01/04,1337.0,1335.819,1320.0,61200,1355.0,1320.0
823,2018/01/05,1351.0,1344.891,1347.0,61400,1364.0,1323.0
824,2018/01/09,1420.0,1400.902,1378.0,234200,1428.0,1352.0
825,2018/01/10,1435.0,1421.087,1402.0,142200,1453.0,1387.0
826,2018/01/11,1420.0,1439.124,1425.0,135200,1472.0,1400.0
827,2018/01/12,1459.0,1447.862,1420.0,78800,1464.0,1420.0
828,2018/01/15,1510.0,1494.185,1480.0,250900,1528.0,1451.0
829,2018/01/16,1418.0,1507.858,1535.0,485300,1626.0,1412.0
830,2018/01/17,1357.0,1380.906,1425.0,212900,1425.0,1354.0
831,2018/01/18,1356.0,1362.735,1365.0,130500,1392.0,1325.0
832,2018/01/19,1340.0,1338.741,1355.0,98400,1366.0,1320.0
833,2018/01/22,1435.0,1412.692,1330.0,372600,1473.0,1313.0
834,2018/01/23,1399.0,1392.142,1395.0,163200,1420.0,1365.0
835,2018/01/24,1371.0,1386.048,1399.0,74700,1403.0,1371.0
836,2018/01/25,1357.0,1366.673,1382.0,75600,1387.0,1356.0
837,2018/01/26,1390.0,1413.413,1394.0,241600,1450.0,1387.0
838,2018/01/29,1369.0,1376.078,1375.0,64200,1397.0,1358.0
839,2018/01/30,1335.0,1339.124,1367.0,117600,1384.0,1309.0
840,2018/01/31,1326.0,1332.734,1325.0,52600,1357.0,1304.0
841,2018/02/01,1354.0,1338.942,1327.0,37600,1354.0,1317.0
842,2018/02/02,1323.0,1328.507,1343.0,69000,1350.0,1317.0
843,2018/02/05,1306.0,1294.762,1289.0,72800,1318.0,1273.0
844,2018/02/06,1090.0,1086.263,1126.0,322200,1197.0,1006.0
845,2018/02/07,1124.0,1165.514,1190.0,103600,1200.0,1116.0
846,2018/02/08,1175.0,1160.846,1130.0,50600,1187.0,1130.0
847,2018/02/09,1126.0,1087.687,1046.0,79800,1150.0,1041.0
848,2018/02/13,1113.0,1120.954,1143.0,35000,1155.0,1100.0
849,2018/02/14,1088.0,1074.457,1100.0,56000,1129.0,1033.0
850,2018/02/15,1130.0,1121.553,1085.0,33100,1146.0,1085.0
851,2018/02/16,1151.0,1144.665,1127.0,24800,1163.0,1127.0
852,2018/02/19,1214.0,1199.146,1181.0,29500,1218.0,1180.0
853,2018/02/20,1208.0,1208.394,1203.0,16500,1222.0,1198.0
854,2018/02/21,1258.0,1240.997,1203.0,60100,1262.0,1201.0
855,2018/02/22,1226.0,1238.803,1251.0,21300,1256.0,1226.0
856,2018/02/23,1218.0,1221.241,1222.0,17400,1245.0,1210.0
857,2018/02/26,1240.0,1241.464,1231.0,16800,1252.0,1221.0
858,2018/02/27,1215.0,1234.862,1258.0,22500,1277.0,1214.0
859,2018/02/28,1245.0,1232.853,1220.0,17000,1250.0,1208.0
860,2018/03/01,1216.0,1225.606,1230.0,47200,1249.0,1212.0
861,2018/03/02,1174.0,1174.393,1170.0,28500,1193.0,1160.0
862,2018/03/05,1093.0,1126.063,1158.0,46000,1165.0,1084.0
863,2018/03/06,1141.0,1143.399,1149.0,14800,1158.0,1130.0
864,2018/03/07,1178.0,1150.267,1127.0,23600,1182.0,1110.0
865,2018/03/08,1232.0,1212.333,1177.0,27600,1240.0,1167.0
866,2018/03/09,1381.0,1395.97,1280.0,864000,1505.0,1257.0
867,2018/03/12,1394.0,1402.817,1400.0,263800,1466.0,1350.0
868,2018/03/13,1410.0,1417.949,1409.0,120000,1449.0,1390.0
869,2018/03/14,1410.0,1387.68,1410.0,82100,1410.0,1363.0
870,2018/03/15,1363.0,1373.022,1400.0,78300,1408.0,1353.0
871,2018/03/16,1312.0,1318.568,1350.0,127500,1367.0,1295.0
872,2018/03/19,1221.0,1229.171,1275.0,212100,1293.0,1168.0
873,2018/03/20,1238.0,1233.716,1203.0,48300,1255.0,1200.0
874,2018/03/22,1260.0,1254.122,1226.0,39300,1279.0,1226.0
875,2018/03/23,1158.0,1190.969,1199.0,114800,1249.0,1140.0
876,2018/03/26,1187.0,1151.167,1147.0,87800,1205.0,1090.0
877,2018/03/27,1279.0,1260.071,1211.0,108700,1314.0,1206.0
878,2018/03/28,1325.0,1351.586,1296.0,264300,1437.0,1275.0
879,2018/03/29,1291.0,1313.771,1339.0,93400,1349.0,1272.0
880,2018/03/30,1380.0,1347.483,1309.0,214100,1400.0,1297.0
881,2018/04/02,1352.0,1389.752,1380.0,131600,1424.0,1351.0
882,2018/04/03,1347.0,1333.463,1341.0,66500,1354.0,1302.0
883,2018/04/04,1374.0,1392.164,1376.0,173000,1432.0,1351.0
884,2018/04/05,1328.0,1342.703,1382.0,61600,1384.0,1323.0
885,2018/04/06,1304.0,1300.35,1331.0,64100,1331.0,1272.0
886,2018/04/09,1296.0,1290.995,1300.0,43700,1309.0,1270.0
887,2018/04/10,1310.0,1305.787,1326.0,28100,1332.0,1286.0
888,2018/04/11,1250.0,1270.288,1309.0,45200,1312.0,1250.0
889,2018/04/12,1263.0,1263.402,1251.0,26100,1277.0,1250.0
890,2018/04/13,1240.0,1244.992,1276.0,26000,1276.0,1236.0
891,2018/04/16,1191.0,1204.344,1243.0,50300,1243.0,1190.0
892,2018/04/17,1162.0,1166.119,1200.0,98900,1228.0,1111.0
893,2018/04/18,1198.0,1165.33,1154.0,43900,1203.0,1120.0
894,2018/04/19,1197.0,1202.777,1209.0,32700,1218.0,1185.0
895,2018/04/20,1153.0,1154.426,1137.0,57500,1196.0,1131.0
896,2018/04/23,1200.0,1187.852,1159.0,47200,1224.0,1150.0
897,2018/04/24,1168.0,1183.828,1204.0,33700,1205.0,1164.0
898,2018/04/25,1155.0,1168.108,1159.0,24100,1190.0,1150.0
899,2018/04/26,1164.0,1160.714,1162.0,19200,1174.0,1151.0
900,2018/04/27,1142.0,1151.857,1164.0,21700,1164.0,1142.0
901,2018/05/01,1111.0,1113.993,1142.0,53000,1143.0,1100.0
902,2018/05/02,1139.0,1135.349,1121.0,19800,1146.0,1121.0
903,2018/05/07,1156.0,1151.424,1152.0,19800,1164.0,1131.0
904,2018/05/08,1174.0,1171.581,1161.0,32900,1186.0,1156.0
905,2018/05/09,1140.0,1152.51,1178.0,24900,1178.0,1132.0
906,2018/05/10,1132.0,1139.022,1151.0,17900,1151.0,1130.0
907,2018/05/11,1125.0,1122.402,1130.0,18900,1134.0,1115.0
908,2018/05/14,1121.0,1131.835,1145.0,13900,1145.0,1121.0
909,2018/05/15,1119.0,1116.551,1125.0,13800,1127.0,1111.0
910,2018/05/16,1143.0,1110.367,1114.0,31100,1144.0,1082.0
911,2018/05/17,1125.0,1142.527,1143.0,29400,1164.0,1118.0
912,2018/05/18,1119.0,1121.521,1129.0,12100,1134.0,1115.0
913,2018/05/21,1170.0,1150.682,1125.0,38100,1179.0,1125.0
914,2018/05/22,1178.0,1169.205,1171.0,24900,1182.0,1156.0
915,2018/05/23,1146.0,1160.41,1169.0,17800,1179.0,1144.0
916,2018/05/24,1121.0,1134.847,1171.0,22900,1171.0,1117.0
917,2018/05/25,1122.0,1124.322,1102.0,20200,1161.0,1102.0
918,2018/05/28,1130.0,1130.0,1123.0,3500,1133.0,1123.0
919,2018/05/29,1125.0,1133.32,1153.0,10300,1153.0,1125.0
920,2018/05/30,1112.0,1108.912,1102.0,12500,1122.0,1102.0
921,2018/05/31,1090.0,1102.164,1114.0,20700,1122.0,1089.0
922,2018/06/01,1090.0,1096.566,1098.0,14500,1105.0,1084.0
923,2018/06/04,1008.0,1031.279,1083.0,64600,1090.0,1001.0
924,2018/06/05,1002.0,1009.551,1016.0,22500,1029.0,994.0
925,2018/06/06,1003.0,1002.508,1003.0,13000,1018.0,999.0
926,2018/06/07,1009.0,1015.948,1010.0,17200,1032.0,1004.0
927,2018/06/08,1017.0,1015.871,1018.0,10100,1022.0,1004.0
928,2018/06/11,1019.0,1023.0,1021.0,9600,1031.0,1017.0
929,2018/06/12,1015.0,1015.535,1019.0,17000,1025.0,1010.0
930,2018/06/13,1024.0,1022.049,1027.0,4100,1027.0,1016.0
931,2018/06/14,1030.0,1034.31,1026.0,18400,1045.0,1026.0
932,2018/06/15,1017.0,1017.608,1028.0,7900,1028.0,1012.0
933,2018/06/18,1009.0,991.365,1016.0,34500,1016.0,969.0
934,2018/06/19,952.0,971.444,1007.0,39000,1007.0,951.0
935,2018/06/20,953.0,938.0,952.0,35400,956.0,923.0
936,2018/06/21,973.0,976.539,961.0,23200,994.0,959.0
937,2018/06/22,939.0,954.412,960.0,24500,980.0,933.0
938,2018/06/25,888.0,912.135,935.0,23800,939.0,885.0
939,2018/06/26,870.0,868.134,897.0,32200,898.0,838.0
940,2018/06/27,886.0,873.817,871.0,17500,886.0,866.0
941,2018/06/28,853.0,862.077,872.0,20800,873.0,853.0
942,2018/06/29,872.0,868.318,855.0,8800,880.0,855.0
943,2018/07/02,858.0,874.916,897.0,14300,897.0,853.0
944,2018/07/03,841.0,849.171,857.0,14600,866.0,839.0
945,2018/07/04,812.0,820.329,833.0,24000,835.0,804.0
946,2018/07/05,778.0,794.822,804.0,32500,820.0,777.0
947,2018/07/06,837.0,818.467,779.0,31900,850.0,779.0
948,2018/07/09,847.0,837.661,833.0,12100,849.0,827.0
949,2018/07/10,867.0,861.233,850.0,11600,867.0,850.0
950,2018/07/11,848.0,847.982,867.0,11200,867.0,833.0
951,2018/07/12,853.0,852.973,842.0,7400,860.0,838.0
952,2018/07/13,858.0,857.862,854.0,5800,863.0,854.0
953,2018/07/17,836.0,837.262,857.0,6100,857.0,832.0
954,2018/07/18,884.0,868.364,837.0,13200,884.0,837.0
955,2018/07/19,1034.0,1013.576,929.0,245200,1034.0,895.0
956,2018/07/20,931.0,971.498,980.0,157300,1009.0,931.0
957,2018/07/23,900.0,899.433,916.0,35100,916.0,891.0
958,2018/07/24,901.0,898.088,900.0,15900,909.0,886.0
959,2018/07/25,924.0,908.205,897.0,19000,926.0,889.0
960,2018/07/26,917.0,916.044,928.0,9200,928.0,906.0
961,2018/07/27,902.0,908.644,920.0,5900,920.0,902.0
962,2018/07/30,884.0,883.67,887.0,11500,899.0,878.0
963,2018/07/31,875.0,876.726,872.0,7300,889.0,868.0
964,2018/08/01,897.0,886.676,873.0,3700,897.0,873.0
965,2018/08/02,913.0,908.667,900.0,7800,919.0,900.0
966,2018/08/03,913.0,910.49,906.0,5100,915.0,903.0
967,2018/08/06,889.0,896.983,899.0,5900,902.0,889.0
968,2018/08/07,882.0,888.745,889.0,5100,904.0,881.0
969,2018/08/08,894.0,888.548,882.0,3100,894.0,879.0
970,2018/08/09,896.0,893.281,895.0,3200,899.0,886.0
971,2018/08/10,896.0,898.917,898.0,7200,909.0,884.0
972,2018/08/13,867.0,875.602,910.0,9800,910.0,853.0
973,2018/08/14,881.0,879.8,867.0,3000,894.0,867.0
974,2018/08/15,877.0,881.429,874.0,1400,890.0,874.0
975,2018/08/16,856.0,856.061,864.0,9900,868.0,832.0
976,2018/08/17,842.0,846.918,852.0,7300,853.0,842.0
977,2018/08/20,826.0,836.444,850.0,8100,850.0,826.0
978,2018/08/21,803.0,803.418,818.0,12200,818.0,796.0
979,2018/08/22,815.0,809.478,789.0,9000,831.0,789.0
980,2018/08/23,845.0,836.569,820.0,10200,845.0,820.0
981,2018/08/24,863.0,853.021,840.0,9600,865.0,834.0
982,2018/08/27,879.0,873.635,870.0,10400,885.0,857.0
983,2018/08/28,916.0,904.933,880.0,28300,929.0,880.0
984,2018/08/29,900.0,908.379,928.0,8700,928.0,888.0
985,2018/08/30,913.0,909.141,895.0,9200,923.0,884.0
986,2018/08/31,923.0,921.786,905.0,11700,934.0,905.0
987,2018/09/03,905.0,907.6,911.0,7500,929.0,905.0
988,2018/09/04,892.0,896.161,903.0,5600,907.0,891.0
989,2018/09/05,877.0,887.938,892.0,4800,900.0,877.0
990,2018/09/06,842.0,851.539,866.0,10400,875.0,839.0
991,2018/09/07,867.0,834.418,827.0,5500,867.0,825.0
992,2018/09/10,867.0,850.852,852.0,2700,867.0,844.0
993,2018/09/11,873.0,868.455,864.0,5500,874.0,856.0
994,2018/09/12,863.0,872.558,888.0,4300,888.0,851.0
995,2018/09/13,840.0,846.147,856.0,6800,858.0,840.0
996,2018/09/14,841.0,838.857,833.0,4900,845.0,833.0
997,2018/09/18,853.0,848.154,836.0,5200,861.0,836.0
998,2018/09/19,897.0,973.404,913.0,311300,1003.0,891.0
999,2018/09/20,883.0,896.359,888.0,32600,938.0,874.0
1000,2018/09/21,916.0,917.875,905.0,54400,956.0,886.0
1001,2018/09/25,913.0,925.046,931.0,19500,940.0,912.0
1002,2018/09/26,919.0,918.418,920.0,7900,930.0,909.0
1003,2018/09/27,901.0,920.253,925.0,16600,937.0,901.0
1004,2018/09/28,906.0,913.843,915.0,10800,925.0,906.0
1005,2018/10/01,905.0,903.697,907.0,14200,913.0,895.0
1006,2018/10/02,887.0,896.4,916.0,16500,916.0,887.0
1007,2018/10/03,886.0,880.056,885.0,9000,886.0,866.0
1008,2018/10/04,867.0,873.92,876.0,7500,881.0,867.0
1009,2018/10/05,851.0,865.127,863.0,6300,881.0,851.0
1010,2018/10/09,842.0,844.326,841.0,4300,855.0,840.0
1011,2018/10/10,825.0,832.393,845.0,11700,849.0,821.0
1012,2018/10/11,810.0,802.919,810.0,17200,810.0,784.0
1013,2018/10/12,818.0,837.279,810.0,10400,879.0,810.0
1014,2018/10/15,814.0,825.756,819.0,4500,849.0,811.0
1015,2018/10/16,813.0,813.103,807.0,3900,825.0,807.0
1016,2018/10/17,824.0,821.452,820.0,4200,827.0,819.0
1017,2018/10/18,819.0,822.182,819.0,8800,830.0,819.0
1018,2018/10/19,873.0,864.564,822.0,49500,910.0,821.0
1019,2018/10/22,880.0,892.842,858.0,25300,925.0,858.0
1020,2018/10/23,903.0,895.962,871.0,26300,915.0,871.0
1021,2018/10/24,904.0,921.107,908.0,32800,945.0,903.0
1022,2018/10/25,869.0,871.13,880.0,24700,890.0,850.0
1023,2018/10/26,835.0,836.832,854.0,33400,867.0,810.0
1024,2018/10/29,841.0,851.794,820.0,24700,897.0,806.0
1025,2018/10/30,825.0,826.309,840.0,12300,840.0,815.0
1026,2018/10/31,824.0,834.287,826.0,10100,850.0,822.0
1027,2018/11/01,820.0,820.14,819.0,8600,830.0,815.0
1028,2018/11/02,859.0,852.17,865.0,15900,869.0,828.0
1029,2018/11/05,835.0,846.276,851.0,9800,863.0,833.0
1030,2018/11/06,845.0,849.047,842.0,6400,860.0,842.0
1031,2018/11/07,866.0,859.133,836.0,9800,879.0,836.0
1032,2018/11/08,883.0,873.814,867.0,10200,883.0,856.0
1033,2018/11/09,853.0,859.679,873.0,19600,875.0,841.0
1034,2018/11/12,836.0,837.116,847.0,9500,861.0,827.0
1035,2018/11/13,822.0,821.0,820.0,12700,845.0,812.0
1036,2018/11/14,817.0,822.907,816.0,5400,844.0,816.0
1037,2018/11/15,816.0,819.72,820.0,5000,827.0,816.0
1038,2018/11/16,822.0,823.822,820.0,18000,837.0,812.0
1039,2018/11/19,823.0,824.857,833.0,5600,836.0,822.0
1040,2018/11/20,811.0,818.232,823.0,5600,832.0,811.0
1041,2018/11/21,809.0,807.495,803.0,9700,832.0,802.0
1042,2018/11/22,811.0,800.48,794.0,12300,812.0,794.0
1043,2018/11/26,807.0,808.971,807.0,7000,816.0,804.0
1044,2018/11/27,802.0,801.771,807.0,7000,808.0,799.0
1045,2018/11/28,809.0,805.232,803.0,12500,817.0,795.0
1046,2018/11/29,807.0,814.44,809.0,14100,822.0,806.0
1047,2018/11/30,800.0,801.546,806.0,8800,807.0,798.0
1048,2018/12/03,805.0,809.121,805.0,18200,820.0,802.0
1049,2018/12/04,801.0,809.051,805.0,7900,815.0,801.0
1050,2018/12/05,793.0,797.283,800.0,19100,805.0,790.0
1051,2018/12/06,787.0,786.716,793.0,20100,799.0,780.0
1052,2018/12/07,785.0,791.393,792.0,8900,795.0,785.0
1053,2018/12/10,760.0,768.427,779.0,13600,780.0,751.0
1054,2018/12/11,762.0,761.594,758.0,6900,767.0,758.0
1055,2018/12/12,772.0,767.873,764.0,11000,778.0,761.0
1056,2018/12/13,768.0,770.095,771.0,7400,781.0,760.0
1057,2018/12/14,771.0,766.607,760.0,16300,785.0,759.0
1058,2018/12/17,758.0,754.294,751.0,21400,764.0,751.0
1059,2018/12/18,742.0,741.551,747.0,15600,750.0,730.0
1060,2018/12/19,732.0,741.757,757.0,22200,757.0,731.0
1061,2018/12/20,663.0,697.751,720.0,28100,720.0,657.0
1062,2018/12/21,647.0,665.673,692.0,19900,692.0,644.0
1063,2018/12/25,551.0,564.207,577.0,76000,588.0,551.0
1064,2018/12/26,569.0,580.169,601.0,17800,601.0,552.0
1065,2018/12/27,626.0,599.769,582.0,29000,631.0,582.0
1066,2018/12/28,613.0,600.575,596.0,8700,615.0,588.0
1067,2019/01/04,620.0,613.281,573.0,32400,662.0,573.0
1068,2019/01/07,631.0,639.752,650.0,11300,650.0,626.0
1069,2019/01/08,660.0,661.714,635.0,17100,684.0,635.0
1070,2019/01/09,760.0,760.0,760.0,7000,760.0,760.0
1071,2019/01/10,910.0,910.0,910.0,9200,910.0,910.0
1072,2019/01/11,1060.0,1060.0,1060.0,26300,1060.0,1060.0
1073,2019/01/15,1030.0,1130.441,1047.0,1577100,1247.0,997.0
1074,2019/01/16,1047.0,1056.503,1000.0,646700,1127.0,985.0
1075,2019/01/17,1013.0,1035.228,1070.0,222700,1091.0,1005.0
1076,2019/01/18,951.0,974.575,1025.0,175500,1025.0,945.0
1077,2019/01/21,874.0,920.388,960.0,205600,968.0,874.0
1078,2019/01/22,846.0,857.427,889.0,100300,889.0,832.0
1079,2019/01/23,865.0,882.045,831.0,212100,928.0,829.0
1080,2019/01/24,911.0,893.779,880.0,134100,913.0,870.0
1081,2019/01/25,867.0,876.491,866.0,150300,905.0,854.0
1082,2019/01/28,848.0,861.311,863.0,70500,897.0,834.0
1083,2019/01/29,844.0,821.034,826.0,102800,844.0,800.0
1084,2019/01/30,765.0,772.896,810.0,135100,815.0,732.0
1085,2019/01/31,777.0,775.917,780.0,54500,792.0,760.0
1086,2019/02/01,768.0,761.46,762.0,43900,782.0,747.0
1087,2019/02/04,805.0,789.122,775.0,102800,813.0,758.0
1088,2019/02/05,813.0,811.69,819.0,66500,839.0,793.0
1089,2019/02/06,813.0,806.438,814.0,48900,830.0,791.0
1090,2019/02/07,773.0,777.606,805.0,72900,806.0,756.0
1091,2019/02/08,742.0,742.32,751.0,47200,762.0,730.0
1092,2019/02/12,756.0,743.292,738.0,59000,758.0,715.0
1093,2019/02/13,751.0,749.455,760.0,38900,766.0,740.0
1094,2019/02/14,742.0,741.023,743.0,34300,751.0,734.0
1095,2019/02/15,734.0,740.579,732.0,28000,762.0,730.0
1096,2019/02/18,764.0,752.308,740.0,45500,770.0,735.0
1097,2019/02/19,804.0,788.73,773.0,113400,819.0,754.0
1098,2019/02/20,796.0,794.394,799.0,57900,807.0,783.0
1099,2019/02/21,788.0,792.874,807.0,43500,817.0,778.0
1100,2019/02/22,788.0,778.296,782.0,50400,788.0,767.0
1101,2019/02/25,797.0,806.465,793.0,144700,830.0,771.0
1102,2019/02/26,788.0,794.449,804.0,128800,820.0,780.0
1103,2019/02/27,865.0,865.949,799.0,583200,908.0,781.0
1104,2019/02/28,835.0,861.441,894.0,204100,894.0,826.0
1105,2019/03/01,889.0,865.943,840.0,178600,889.0,831.0
1106,2019/03/04,1039.0,1038.775,1039.0,190400,1039.0,1024.0
1107,2019/03/05,932.0,989.765,1034.0,1166100,1061.0,930.0
1108,2019/03/06,945.0,979.164,977.0,1465500,1030.0,934.0
1109,2019/03/07,903.0,912.606,937.0,354100,937.0,896.0
1110,2019/03/08,831.0,843.779,878.0,387600,878.0,818.0
1111,2019/03/11,855.0,851.798,833.0,292200,882.0,815.0
1112,2019/03/12,878.0,878.402,879.0,227000,907.0,861.0
1113,2019/03/13,963.0,932.159,888.0,758900,980.0,882.0
1114,2019/03/14,928.0,963.004,991.0,508300,1018.0,920.0
1115,2019/03/15,893.0,905.098,913.0,238000,935.0,885.0
1116,2019/03/18,904.0,903.321,884.0,177700,935.0,875.0
1117,2019/03/19,929.0,912.557,902.0,132600,930.0,888.0
1118,2019/03/20,916.0,916.614,930.0,127900,933.0,902.0
1119,2019/03/22,851.0,874.708,902.0,247300,908.0,850.0
1120,2019/03/25,793.0,799.388,806.0,294800,835.0,771.0
1121,2019/03/26,775.0,793.57,791.0,170100,814.0,774.0
1122,2019/03/27,812.0,806.906,797.0,165000,826.0,789.0
1123,2019/03/28,784.0,791.947,801.0,117400,804.0,782.0
1124,2019/03/29,744.0,755.598,781.0,316600,781.0,726.0
1125,2019/04/01,760.0,762.246,739.0,131900,782.0,738.0
1126,2019/04/02,745.0,753.91,773.0,102000,775.0,740.0
1127,2019/04/03,760.0,756.57,743.0,71700,774.0,736.0
1128,2019/04/04,762.0,768.243,762.0,85100,785.0,749.0
1129,2019/04/05,789.0,772.889,766.0,73700,796.0,748.0
1130,2019/04/08,799.0,793.164,800.0,79100,809.0,780.0
1131,2019/04/09,798.0,792.634,808.0,98800,808.0,768.0
1132,2019/04/10,804.0,809.168,788.0,108200,828.0,784.0
1133,2019/04/11,792.0,795.428,799.0,58600,806.0,784.0
1134,2019/04/12,759.0,763.246,791.0,128900,791.0,755.0
1135,2019/04/15,747.0,737.185,729.0,139700,752.0,727.0
1136,2019/04/16,763.0,766.525,755.0,138000,784.0,752.0
1137,2019/04/17,767.0,762.103,774.0,69600,774.0,750.0
1138,2019/04/18,784.0,770.97,770.0,139400,787.0,756.0
1139,2019/04/19,751.0,753.525,739.0,302600,780.0,735.0
1140,2019/04/22,765.0,760.079,750.0,64900,771.0,745.0
1141,2019/04/23,758.0,762.147,765.0,64500,777.0,750.0
1142,2019/04/24,754.0,759.0,771.0,37800,771.0,749.0
1143,2019/04/25,761.0,763.1,759.0,32000,769.0,757.0
1144,2019/04/26,755.0,754.323,764.0,50800,764.0,744.0
1145,2019/05/07,785.0,776.739,764.0,78000,786.0,756.0
1146,2019/05/08,772.0,759.435,770.0,46200,773.0,747.0
1147,2019/05/09,742.0,747.1,763.0,80800,773.0,735.0
1148,2019/05/10,742.0,741.989,752.0,63500,760.0,727.0
1149,2019/05/13,722.0,725.163,738.0,57200,739.0,716.0
1150,2019/05/14,705.0,694.643,682.0,95700,717.0,678.0
1151,2019/05/15,722.0,715.724,715.0,58700,735.0,696.0
1152,2019/05/16,711.0,715.608,718.0,41300,731.0,704.0
1153,2019/05/17,737.0,732.023,726.0,38800,741.0,717.0
1154,2019/05/20,734.0,738.11,735.0,46200,751.0,725.0
1155,2019/05/21,720.0,721.915,734.0,16400,734.0,716.0
1156,2019/05/22,734.0,732.777,722.0,46600,742.0,722.0
1157,2019/05/23,697.0,713.08,735.0,79800,741.0,687.0
1158,2019/05/24,698.0,690.795,679.0,68300,707.0,677.0
1159,2019/05/27,701.0,712.55,722.0,70600,728.0,697.0
1160,2019/05/28,726.0,718.264,710.0,24600,727.0,704.0
1161,2019/05/29,760.0,795.194,725.0,1352000,876.0,703.0
1162,2019/05/30,737.0,766.466,751.0,551500,802.0,732.0
1163,2019/05/31,706.0,714.055,726.0,135800,728.0,705.0
1164,2019/06/03,688.0,695.811,705.0,75700,707.0,686.0
1165,2019/06/04,706.0,694.481,691.0,65100,706.0,684.0
1166,2019/06/05,704.0,705.351,709.0,49800,715.0,698.0
1167,2019/06/06,708.0,718.96,703.0,87000,734.0,702.0
1168,2019/06/07,724.0,723.547,720.0,28500,730.0,706.0
1169,2019/06/10,721.0,730.888,739.0,75300,743.0,719.0
1170,2019/06/11,737.0,727.442,726.0,41200,741.0,716.0
1171,2019/06/12,720.0,720.139,736.0,23700,736.0,712.0
1172,2019/06/13,723.0,718.383,724.0,23500,725.0,709.0
1173,2019/06/14,739.0,732.649,723.0,36200,740.0,722.0
1174,2019/06/17,735.0,740.242,742.0,26900,752.0,732.0
1175,2019/06/18,727.0,725.763,735.0,17700,738.0,720.0
1176,2019/06/19,733.0,729.767,729.0,23200,744.0,724.0
1177,2019/06/20,749.0,737.132,729.0,41600,749.0,724.0
1178,2019/06/21,747.0,747.65,742.0,26600,759.0,740.0
1179,2019/06/24,730.0,733.631,741.0,27400,747.0,727.0
1180,2019/06/25,695.0,699.299,730.0,112400,730.0,680.0
1181,2019/06/26,710.0,701.006,696.0,63200,711.0,692.0
1182,2019/06/27,699.0,702.39,707.0,25400,708.0,699.0
1183,2019/06/28,714.0,715.16,700.0,42500,725.0,697.0
1184,2019/07/01,732.0,729.146,722.0,26000,735.0,717.0
1185,2019/07/02,748.0,742.61,730.0,52600,753.0,727.0
1186,2019/07/03,737.0,739.172,753.0,43600,759.0,725.0
1187,2019/07/04,722.0,729.502,737.0,32500,741.0,722.0
1188,2019/07/05,747.0,737.751,737.0,40200,750.0,722.0
1189,2019/07/08,748.0,749.137,757.0,59300,761.0,738.0
1190,2019/07/09,742.0,741.366,747.0,23800,751.0,734.0
1191,2019/07/10,757.0,753.405,742.0,35100,758.0,736.0
1192,2019/07/11,907.0,907.0,907.0,48600,907.0,907.0
1193,2019/07/12,788.0,848.334,921.0,1815400,935.0,783.0
1194,2019/07/16,770.0,773.388,777.0,245700,789.0,758.0
1195,2019/07/17,786.0,772.75,763.0,127900,796.0,758.0
1196,2019/07/18,769.0,769.446,783.0,156800,787.0,760.0
1197,2019/07/19,762.0,755.383,750.0,132500,771.0,743.0
1198,2019/07/22,763.0,779.568,771.0,116500,793.0,762.0
1199,2019/07/23,767.0,776.162,774.0,56900,789.0,765.0
1200,2019/07/24,773.0,766.363,774.0,63600,777.0,752.0
1201,2019/07/25,765.0,766.003,774.0,35300,775.0,761.0
1202,2019/07/26,764.0,760.36,761.0,32800,768.0,755.0
1203,2019/07/29,744.0,751.19,762.0,74100,766.0,742.0
1204,2019/07/30,746.0,750.544,752.0,38600,758.0,743.0
1205,2019/07/31,747.0,743.552,750.0,34400,751.0,738.0
1206,2019/08/01,749.0,753.264,745.0,39000,761.0,740.0
1207,2019/08/02,729.0,732.979,750.0,57000,750.0,719.0
1208,2019/08/05,704.0,705.102,729.0,89400,729.0,693.0
1209,2019/08/06,703.0,692.287,675.0,85300,715.0,672.0
1210,2019/08/07,705.0,707.788,706.0,33500,716.0,699.0
1211,2019/08/08,715.0,711.544,706.0,27000,721.0,702.0
1212,2019/08/09,716.0,720.473,730.0,22200,730.0,716.0
1213,2019/08/13,708.0,708.809,701.0,22000,717.0,701.0
1214,2019/08/14,712.0,713.409,720.0,15900,722.0,706.0
1215,2019/08/15,701.0,700.54,697.0,49800,709.0,689.0
1216,2019/08/16,708.0,713.755,705.0,25300,721.0,705.0
1217,2019/08/19,730.0,729.454,716.0,44900,740.0,711.0
1218,2019/08/20,716.0,724.889,730.0,70300,744.0,710.0
1219,2019/08/21,715.0,716.61,714.0,19500,722.0,713.0
1220,2019/08/22,708.0,708.044,717.0,24800,717.0,702.0
1221,2019/08/23,709.0,707.464,704.0,19400,714.0,699.0
