,Date,Close,VWAP,Open,Volume,High,Low
0,2015/10/01,898.0,927.891,874.0,4669900,1024.0,850.0
1,2015/10/02,868.0,863.999,928.0,3650900,931.0,832.0
2,2015/10/05,888.0,866.625,867.0,2543900,890.0,842.0
3,2015/10/06,898.0,901.011,900.0,2865300,914.0,884.0
4,2015/10/07,918.0,910.222,900.0,3845300,929.0,890.0
5,2015/10/08,917.0,918.155,915.0,1851200,925.0,907.0
6,2015/10/09,902.0,907.282,922.0,1215300,930.0,896.0
7,2015/10/13,905.0,897.195,900.0,1797100,908.0,883.0
8,2015/10/14,898.0,896.583,910.0,961900,914.0,888.0
9,2015/10/15,901.0,896.509,898.0,981000,905.0,888.0
10,2015/10/16,898.0,904.798,905.0,1300000,917.0,894.0
11,2015/10/19,881.0,884.683,896.0,818200,897.0,876.0
12,2015/10/20,890.0,890.915,896.0,742000,898.0,885.0
13,2015/10/21,892.0,891.083,890.0,661100,894.0,886.0
14,2015/10/22,892.0,893.463,896.0,713900,900.0,889.0
15,2015/10/23,917.0,916.129,907.0,1042700,926.0,906.0
16,2015/10/26,926.0,937.079,930.0,799800,960.0,924.0
17,2015/10/27,951.0,941.697,930.0,999900,951.0,923.0
18,2015/10/28,934.0,944.3,952.0,807700,977.0,930.0
19,2015/10/29,925.0,923.439,923.0,1461900,935.0,910.0
20,2015/10/30,928.0,930.076,940.0,1035600,944.0,917.0
21,2015/11/02,895.0,899.31,913.0,650200,914.0,892.0
22,2015/11/04,898.0,895.475,908.0,681900,909.0,885.0
23,2015/11/05,911.0,908.915,908.0,432400,918.0,895.0
24,2015/11/06,916.0,918.784,921.0,598500,936.0,904.0
25,2015/11/09,915.0,915.302,911.0,861400,924.0,910.0
26,2015/11/10,923.0,919.282,914.0,639200,928.0,908.0
27,2015/11/11,934.0,936.311,917.0,661200,946.0,915.0
28,2015/11/12,921.0,923.421,937.0,645500,937.0,918.0
29,2015/11/13,899.0,903.887,915.0,725700,916.0,897.0
30,2015/11/16,890.0,888.129,886.0,371800,894.0,875.0
31,2015/11/17,888.0,890.225,890.0,574700,895.0,886.0
32,2015/11/18,895.0,894.147,893.0,621700,899.0,884.0
33,2015/11/19,914.0,916.388,910.0,697400,929.0,907.0
34,2015/11/20,928.0,920.333,919.0,506900,928.0,908.0
35,2015/11/24,936.0,934.754,940.0,826700,950.0,920.0
36,2015/11/25,932.0,932.228,940.0,733200,945.0,924.0
37,2015/11/26,932.0,929.484,917.0,718000,933.0,917.0
38,2015/11/27,931.0,926.372,925.0,707300,932.0,918.0
39,2015/11/30,936.0,929.952,930.0,3132600,936.0,908.0
40,2015/12/01,916.0,916.477,917.0,1071700,929.0,908.0
41,2015/12/02,894.0,900.901,916.0,1000100,916.0,891.0
42,2015/12/03,876.0,882.072,909.0,938400,909.0,872.0
43,2015/12/04,861.0,856.714,857.0,1005900,864.0,847.0
44,2015/12/07,870.0,869.964,862.0,651100,877.0,862.0
45,2015/12/08,868.0,866.848,878.0,555100,878.0,861.0
46,2015/12/09,863.0,862.06,866.0,574500,867.0,853.0
47,2015/12/10,845.0,849.897,864.0,577800,864.0,844.0
48,2015/12/11,855.0,849.325,845.0,861000,859.0,845.0
49,2015/12/14,838.0,834.126,830.0,586200,843.0,826.0
50,2015/12/15,817.0,822.637,838.0,659200,839.0,817.0
51,2015/12/16,828.0,827.393,821.0,837400,839.0,820.0
52,2015/12/17,826.0,831.013,843.0,926300,845.0,822.0
53,2015/12/18,832.0,827.229,826.0,2058200,844.0,810.0
54,2015/12/21,812.0,812.013,830.0,847800,832.0,803.0
55,2015/12/22,818.0,813.937,804.0,620500,821.0,800.0
56,2015/12/24,814.0,821.017,829.0,568300,834.0,814.0
57,2015/12/25,792.0,797.829,800.0,659800,811.0,791.0
58,2015/12/28,802.0,800.602,797.0,379500,803.0,796.0
59,2015/12/29,853.0,840.201,806.0,1287500,862.0,806.0
60,2015/12/30,847.0,854.135,860.0,530200,869.0,844.0
61,2016/01/04,815.0,822.321,832.0,508000,847.0,811.0
62,2016/01/05,811.0,811.606,812.0,439700,818.0,807.0
63,2016/01/06,796.0,796.831,809.0,469600,815.0,788.0
64,2016/01/07,791.0,795.84,806.0,560500,812.0,790.0
65,2016/01/08,780.0,784.089,785.0,617900,793.0,778.0
66,2016/01/12,751.0,759.755,768.0,884000,781.0,751.0
67,2016/01/13,778.0,779.411,761.0,707900,797.0,760.0
68,2016/01/14,756.0,750.416,750.0,667500,760.0,739.0
69,2016/01/15,756.0,760.284,776.0,522500,780.0,748.0
70,2016/01/18,746.0,744.168,745.0,267500,750.0,733.0
71,2016/01/19,746.0,746.19,746.0,557100,764.0,733.0
72,2016/01/20,729.0,740.049,755.0,659500,759.0,726.0
73,2016/01/21,694.0,712.011,728.0,656100,737.0,694.0
74,2016/01/22,733.0,720.581,711.0,567000,736.0,697.0
75,2016/01/25,738.0,738.068,745.0,311400,747.0,730.0
76,2016/01/26,719.0,718.445,715.0,498100,727.0,708.0
77,2016/01/27,743.0,742.91,734.0,409300,752.0,734.0
78,2016/01/28,736.0,740.217,739.0,420300,752.0,734.0
79,2016/01/29,744.0,736.639,741.0,1016000,758.0,706.0
80,2016/02/01,723.0,725.499,757.0,1373100,760.0,715.0
81,2016/02/02,709.0,718.164,710.0,823100,733.0,706.0
82,2016/02/03,683.0,685.936,699.0,492400,704.0,678.0
83,2016/02/04,674.0,679.108,673.0,798100,690.0,669.0
84,2016/02/05,673.0,671.054,667.0,993000,683.0,664.0
85,2016/02/08,668.0,668.461,660.0,684800,679.0,660.0
86,2016/02/09,651.0,642.838,650.0,1267000,656.0,625.0
87,2016/02/10,597.0,611.898,658.0,1869100,663.0,591.0
88,2016/02/12,577.0,585.433,571.0,1413000,602.0,568.0
89,2016/02/15,630.0,629.267,637.0,1273000,638.0,614.0
90,2016/02/16,632.0,639.617,627.0,1207100,656.0,623.0
91,2016/02/17,637.0,639.769,632.0,1152000,657.0,629.0
92,2016/02/18,677.0,671.98,650.0,1853600,705.0,645.0
93,2016/02/19,666.0,662.407,675.0,921200,677.0,651.0
94,2016/02/22,659.0,650.945,663.0,1402100,665.0,637.0
95,2016/02/23,652.0,655.286,663.0,1055000,668.0,647.0
96,2016/02/24,650.0,648.059,632.0,953400,662.0,632.0
97,2016/02/25,666.0,663.989,642.0,837300,672.0,642.0
98,2016/02/26,652.0,656.666,669.0,704700,676.0,647.0
99,2016/02/29,657.0,662.093,657.0,1431000,673.0,652.0
100,2016/03/01,631.0,635.198,637.0,1581100,653.0,627.0
101,2016/03/02,639.0,632.609,639.0,1330100,641.0,622.0
102,2016/03/03,662.0,662.522,646.0,991700,672.0,646.0
103,2016/03/04,675.0,671.595,662.0,964100,678.0,655.0
104,2016/03/07,686.0,682.977,677.0,717900,686.0,675.0
105,2016/03/08,682.0,683.245,682.0,1002300,692.0,679.0
106,2016/03/09,654.0,663.318,676.0,1012300,688.0,651.0
107,2016/03/10,657.0,652.986,656.0,790100,661.0,641.0
108,2016/03/11,672.0,659.92,647.0,1016100,675.0,646.0
109,2016/03/14,687.0,689.932,682.0,547000,699.0,682.0
110,2016/03/15,687.0,686.653,687.0,602000,698.0,677.0
111,2016/03/16,679.0,682.55,687.0,492300,697.0,675.0
112,2016/03/17,688.0,687.146,683.0,820100,696.0,677.0
113,2016/03/18,679.0,681.832,692.0,1562600,710.0,668.0
114,2016/03/22,689.0,690.194,689.0,634500,704.0,674.0
115,2016/03/23,680.0,684.772,691.0,596100,698.0,677.0
116,2016/03/24,660.0,661.929,675.0,922300,680.0,657.0
117,2016/03/25,663.0,659.996,655.0,769300,669.0,643.0
118,2016/03/28,681.0,679.397,676.0,803100,686.0,671.0
119,2016/03/29,678.0,682.829,676.0,975000,702.0,673.0
120,2016/03/30,657.0,663.163,677.0,682500,678.0,655.0
121,2016/03/31,649.0,654.568,660.0,1446600,664.0,649.0
122,2016/04/01,614.0,619.538,646.0,1117900,649.0,612.0
123,2016/04/04,601.0,602.784,612.0,1404200,617.0,596.0
124,2016/04/05,580.0,584.369,599.0,781100,599.0,579.0
125,2016/04/06,567.0,569.547,577.0,1199800,580.0,565.0
126,2016/04/07,569.0,567.709,564.0,751300,573.0,559.0
127,2016/04/08,577.0,572.245,559.0,1091200,588.0,553.0
128,2016/04/11,555.0,555.628,565.0,1000900,568.0,550.0
129,2016/04/12,576.0,573.704,555.0,1569100,581.0,552.0
130,2016/04/13,590.0,585.373,576.0,1189800,591.0,573.0
131,2016/04/14,602.0,598.73,598.0,1511600,604.0,588.0
132,2016/04/15,596.0,594.149,593.0,1288000,608.0,578.0
133,2016/04/18,574.0,572.475,567.0,1035700,578.0,564.0
134,2016/04/19,605.0,601.266,593.0,804200,607.0,590.0
135,2016/04/20,604.0,606.879,610.0,835800,619.0,600.0
136,2016/04/21,615.0,612.706,620.0,812200,620.0,608.0
137,2016/04/22,635.0,627.702,607.0,2026800,645.0,602.0
138,2016/04/25,639.0,629.771,635.0,1512500,639.0,618.0
139,2016/04/26,628.0,624.562,631.0,735900,633.0,616.0
140,2016/04/27,623.0,620.166,624.0,1238900,629.0,614.0
141,2016/04/28,582.0,600.842,630.0,1818800,635.0,581.0
142,2016/05/02,554.0,551.962,552.0,1276200,563.0,546.0
143,2016/05/06,550.0,548.991,554.0,1051900,564.0,544.0
144,2016/05/09,549.0,548.699,547.0,863400,553.0,541.0
145,2016/05/10,558.0,552.78,549.0,1164900,560.0,541.0
146,2016/05/11,554.0,557.794,558.0,952500,567.0,551.0
147,2016/05/12,546.0,545.274,549.0,1026000,554.0,541.0
148,2016/05/13,533.0,541.036,546.0,895300,552.0,532.0
149,2016/05/16,530.0,534.866,524.0,898900,553.0,524.0
150,2016/05/17,536.0,532.186,538.0,649500,543.0,524.0
151,2016/05/18,547.0,543.906,536.0,909200,549.0,534.0
152,2016/05/19,557.0,558.115,555.0,1118200,565.0,552.0
153,2016/05/20,558.0,555.629,553.0,657300,561.0,551.0
154,2016/05/23,554.0,548.866,555.0,1037100,559.0,541.0
155,2016/05/24,547.0,549.2,551.0,478300,553.0,546.0
156,2016/05/25,554.0,554.223,557.0,621600,563.0,551.0
157,2016/05/26,555.0,557.688,564.0,598900,565.0,554.0
158,2016/05/27,558.0,555.669,557.0,326200,558.0,552.0
159,2016/05/30,562.0,556.775,560.0,603800,563.0,549.0
160,2016/05/31,598.0,587.274,567.0,1758400,598.0,565.0
161,2016/06/01,578.0,579.641,589.0,943300,590.0,574.0
162,2016/06/02,552.0,557.219,566.0,750300,569.0,551.0
163,2016/06/03,554.0,551.979,550.0,500700,560.0,549.0
164,2016/06/06,542.0,539.091,541.0,595300,544.0,535.0
165,2016/06/07,547.0,545.754,541.0,324300,549.0,540.0
166,2016/06/08,552.0,551.603,551.0,604400,559.0,545.0
167,2016/06/09,539.0,539.555,544.0,509500,547.0,536.0
168,2016/06/10,529.0,531.01,540.0,1018700,541.0,521.0
169,2016/06/13,506.0,511.58,529.0,656200,529.0,504.0
170,2016/06/14,500.0,500.573,506.0,702000,506.0,496.0
171,2016/06/15,506.0,507.397,500.0,594000,513.0,500.0
172,2016/06/16,492.0,497.884,507.0,736900,510.0,491.0
173,2016/06/17,500.0,502.088,506.0,1715200,514.0,496.0
174,2016/06/20,535.0,529.47,520.0,1078600,538.0,509.0
175,2016/06/21,535.0,534.563,539.0,862900,540.0,527.0
176,2016/06/22,517.0,519.199,532.0,743300,532.0,513.0
177,2016/06/23,529.0,525.001,519.0,718100,534.0,512.0
178,2016/06/24,479.0,495.538,529.0,1205100,533.0,476.0
179,2016/06/27,488.0,487.89,495.0,625600,495.0,479.0
180,2016/06/28,491.0,488.696,483.0,755300,499.0,472.0
181,2016/06/29,502.0,499.21,498.0,573400,502.0,489.0
182,2016/06/30,506.0,510.493,507.0,782200,520.0,503.0
183,2016/07/01,522.0,520.612,526.0,665800,526.0,509.0
184,2016/07/04,516.0,517.291,519.0,480300,523.0,511.0
185,2016/07/05,503.0,503.783,510.0,507700,511.0,501.0
186,2016/07/06,489.0,490.154,500.0,817200,501.0,484.0
187,2016/07/07,481.0,484.26,482.0,709700,497.0,479.0
188,2016/07/08,487.0,489.116,489.0,1069500,497.0,484.0
189,2016/07/11,519.0,514.219,500.0,908500,525.0,497.0
190,2016/07/12,541.0,540.18,524.0,1305400,549.0,522.0
191,2016/07/13,550.0,549.759,551.0,1120500,556.0,536.0
192,2016/07/14,553.0,553.301,557.0,800300,560.0,548.0
193,2016/07/15,569.0,568.545,559.0,729500,578.0,553.0
194,2016/07/19,570.0,572.286,579.0,826100,580.0,567.0
195,2016/07/20,565.0,563.721,574.0,716300,576.0,554.0
196,2016/07/21,562.0,566.044,580.0,641300,584.0,555.0
197,2016/07/22,543.0,547.378,548.0,642100,557.0,541.0
198,2016/07/25,554.0,555.49,553.0,916700,567.0,551.0
199,2016/07/26,553.0,551.478,554.0,784900,558.0,542.0
200,2016/07/27,565.0,561.98,563.0,1251000,567.0,553.0
201,2016/07/28,520.0,523.902,548.0,1708000,554.0,514.0
202,2016/07/29,572.0,559.843,521.0,2136400,588.0,518.0
203,2016/08/01,601.0,589.771,577.0,1600100,607.0,563.0
204,2016/08/02,566.0,577.952,591.0,867300,598.0,566.0
205,2016/08/03,546.0,546.918,545.0,925000,555.0,538.0
206,2016/08/04,567.0,560.096,550.0,920400,570.0,543.0
207,2016/08/05,561.0,560.772,557.0,755200,573.0,554.0
208,2016/08/08,587.0,583.782,580.0,1048900,589.0,572.0
209,2016/08/09,587.0,590.884,580.0,813300,602.0,578.0
210,2016/08/10,561.0,559.838,558.0,1090300,569.0,548.0
211,2016/08/12,571.0,569.641,567.0,1030400,580.0,555.0
212,2016/08/15,565.0,570.951,571.0,466100,587.0,565.0
213,2016/08/16,555.0,560.27,567.0,585000,570.0,553.0
214,2016/08/17,543.0,539.936,543.0,1655200,547.0,532.0
215,2016/08/18,539.0,544.596,540.0,1465900,564.0,533.0
216,2016/08/19,553.0,550.529,543.0,984500,557.0,540.0
217,2016/08/22,556.0,553.23,550.0,529700,558.0,545.0
218,2016/08/23,546.0,552.391,554.0,1064100,563.0,545.0
219,2016/08/24,555.0,556.637,552.0,1051100,562.0,549.0
220,2016/08/25,568.0,568.079,557.0,965800,573.0,556.0
221,2016/08/26,560.0,567.587,575.0,1167100,578.0,560.0
222,2016/08/29,580.0,581.074,585.0,1152600,585.0,576.0
223,2016/08/30,569.0,576.075,586.0,3969800,598.0,566.0
224,2016/08/31,613.0,604.294,589.0,2176600,616.0,586.0
225,2016/09/01,626.0,627.363,617.0,1009500,637.0,617.0
226,2016/09/02,621.0,619.117,623.0,585000,624.0,608.0
227,2016/09/05,620.0,624.689,630.0,596000,634.0,618.0
228,2016/09/06,632.0,630.494,626.0,755300,634.0,625.0
229,2016/09/07,635.0,625.628,622.0,923800,636.0,616.0
230,2016/09/08,624.0,623.055,630.0,733400,633.0,616.0
231,2016/09/09,617.0,617.616,621.0,836000,623.0,609.0
232,2016/09/12,605.0,605.722,615.0,821700,617.0,598.0
233,2016/09/13,600.0,596.677,607.0,785900,608.0,588.0
234,2016/09/14,603.0,597.655,590.0,1010700,605.0,579.0
235,2016/09/15,592.0,592.733,596.0,1033300,599.0,587.0
236,2016/09/16,628.0,619.584,599.0,1032500,630.0,597.0
237,2016/09/20,641.0,641.101,625.0,1597100,651.0,621.0
238,2016/09/21,705.0,668.054,640.0,2479200,706.0,618.0
239,2016/09/23,715.0,706.97,691.0,1974300,718.0,680.0
240,2016/09/26,717.0,716.745,714.0,1725200,724.0,704.0
241,2016/09/27,700.0,690.246,704.0,1792400,706.0,671.0
242,2016/09/28,685.0,684.001,695.0,1240400,698.0,675.0
243,2016/09/29,699.0,697.33,693.0,1223000,705.0,685.0
244,2016/09/30,684.0,685.281,683.0,1485200,693.0,670.0
245,2016/10/03,686.0,691.64,694.0,708200,703.0,685.0
246,2016/10/04,693.0,689.523,687.0,1134500,698.0,674.0
247,2016/10/05,696.0,697.113,699.0,1151800,705.0,687.0
248,2016/10/06,684.0,691.812,700.0,978800,702.0,683.0
249,2016/10/07,686.0,684.915,685.0,679700,691.0,680.0
250,2016/10/11,677.0,679.647,680.0,1077800,691.0,674.0
251,2016/10/12,669.0,673.466,671.0,1300300,682.0,665.0
252,2016/10/13,665.0,668.756,677.0,1256300,686.0,662.0
253,2016/10/14,667.0,665.462,666.0,1164100,674.0,658.0
254,2016/10/17,672.0,673.33,669.0,920600,682.0,667.0
255,2016/10/18,670.0,673.792,672.0,1163100,682.0,669.0
256,2016/10/19,678.0,676.353,672.0,1013800,681.0,670.0
257,2016/10/20,693.0,688.631,681.0,1215400,693.0,680.0
258,2016/10/21,694.0,694.005,695.0,1187800,699.0,683.0
259,2016/10/24,701.0,697.238,694.0,1067300,702.0,685.0
260,2016/10/25,699.0,703.014,701.0,784900,714.0,696.0
261,2016/10/26,695.0,693.23,696.0,790800,702.0,686.0
262,2016/10/27,697.0,695.202,685.0,789000,700.0,685.0
263,2016/10/28,702.0,702.891,707.0,2634900,714.0,699.0
264,2016/10/31,699.0,696.016,698.0,1061400,701.0,685.0
265,2016/11/01,694.0,696.874,703.0,716200,708.0,690.0
266,2016/11/02,673.0,674.813,680.0,943200,684.0,669.0
267,2016/11/04,666.0,665.015,665.0,1145600,671.0,656.0
268,2016/11/07,675.0,678.995,676.0,610900,690.0,674.0
269,2016/11/08,680.0,683.053,680.0,562100,690.0,678.0
270,2016/11/09,640.0,651.082,690.0,1237800,695.0,628.0
271,2016/11/10,701.0,696.596,690.0,1018600,703.0,680.0
272,2016/11/11,704.0,712.942,710.0,1349300,734.0,700.0
273,2016/11/14,732.0,724.753,719.0,1080400,735.0,707.0
274,2016/11/15,713.0,718.609,725.0,914000,734.0,708.0
275,2016/11/16,726.0,719.409,725.0,1226500,729.0,709.0
276,2016/11/17,740.0,729.763,720.0,1401600,741.0,715.0
277,2016/11/18,744.0,745.32,755.0,1147300,761.0,739.0
278,2016/11/21,760.0,756.753,758.0,856800,761.0,743.0
279,2016/11/22,759.0,756.268,760.0,710700,760.0,749.0
280,2016/11/24,758.0,757.024,774.0,907700,774.0,749.0
281,2016/11/25,755.0,750.214,760.0,1221500,762.0,741.0
282,2016/11/28,765.0,761.812,752.0,1187500,768.0,744.0
283,2016/11/29,759.0,760.066,756.0,1054600,770.0,752.0
284,2016/11/30,753.0,752.837,757.0,2086700,760.0,747.0
285,2016/12/01,768.0,771.492,769.0,1529200,788.0,763.0
286,2016/12/02,783.0,785.654,766.0,1874400,800.0,766.0
287,2016/12/05,769.0,769.053,771.0,1062000,778.0,765.0
288,2016/12/06,774.0,776.043,777.0,896900,785.0,769.0
289,2016/12/07,795.0,789.443,772.0,1090300,796.0,772.0
290,2016/12/08,810.0,805.544,802.0,1113300,812.0,797.0
291,2016/12/09,823.0,819.595,819.0,1324800,824.0,810.0
292,2016/12/12,813.0,814.074,830.0,1216000,834.0,793.0
293,2016/12/13,818.0,815.549,813.0,1364300,822.0,805.0
294,2016/12/14,814.0,814.327,820.0,667700,823.0,807.0
295,2016/12/15,824.0,823.309,816.0,994000,834.0,815.0
296,2016/12/16,842.0,840.626,838.0,1345700,847.0,829.0
297,2016/12/19,836.0,835.501,844.0,509400,845.0,831.0
298,2016/12/20,832.0,832.472,839.0,640000,839.0,826.0
299,2016/12/21,821.0,822.138,817.0,996900,835.0,814.0
300,2016/12/22,817.0,816.488,816.0,514100,821.0,813.0
301,2016/12/26,806.0,808.273,820.0,428900,820.0,803.0
302,2016/12/27,804.0,807.08,806.0,344200,814.0,800.0
303,2016/12/28,807.0,807.377,808.0,499300,813.0,804.0
304,2016/12/29,797.0,798.454,808.0,776000,810.0,794.0
305,2016/12/30,793.0,791.949,795.0,486000,799.0,784.0
306,2017/01/04,823.0,818.004,801.0,811500,824.0,797.0
307,2017/01/05,820.0,817.966,824.0,809000,826.0,810.0
308,2017/01/06,809.0,806.963,805.0,482900,811.0,802.0
309,2017/01/10,798.0,800.401,810.0,588300,813.0,794.0
310,2017/01/11,802.0,801.654,797.0,419600,805.0,792.0
311,2017/01/12,793.0,793.199,802.0,759900,802.0,788.0
312,2017/01/13,793.0,792.466,793.0,718100,799.0,787.0
313,2017/01/16,781.0,788.028,793.0,412100,803.0,781.0
314,2017/01/17,774.0,774.49,777.0,649000,782.0,767.0
315,2017/01/18,779.0,774.358,777.0,587000,782.0,764.0
316,2017/01/19,795.0,792.792,790.0,538700,800.0,785.0
317,2017/01/20,786.0,788.35,794.0,593400,795.0,784.0
318,2017/01/23,774.0,775.7,776.0,361700,780.0,772.0
319,2017/01/24,762.0,762.45,768.0,522700,770.0,759.0
320,2017/01/25,777.0,776.595,776.0,503900,784.0,773.0
321,2017/01/26,799.0,797.165,787.0,555800,801.0,786.0
322,2017/01/27,800.0,802.348,804.0,632400,816.0,798.0
323,2017/01/30,798.0,795.768,792.0,511400,802.0,788.0
324,2017/01/31,780.0,783.032,790.0,894900,792.0,777.0
325,2017/02/01,786.0,780.388,764.0,653300,790.0,763.0
326,2017/02/02,768.0,772.782,789.0,799900,789.0,765.0
327,2017/02/03,790.0,787.087,764.0,856700,798.0,764.0
328,2017/02/06,795.0,798.762,802.0,632900,809.0,792.0
329,2017/02/07,796.0,795.479,785.0,467800,802.0,782.0
330,2017/02/08,802.0,797.668,795.0,465300,803.0,789.0
331,2017/02/09,793.0,793.838,802.0,292500,803.0,790.0
332,2017/02/10,815.0,807.223,800.0,1114000,818.0,789.0
333,2017/02/13,812.0,819.416,830.0,933800,838.0,812.0
334,2017/02/14,795.0,802.456,813.0,618700,820.0,794.0
335,2017/02/15,809.0,810.79,808.0,526100,819.0,807.0
336,2017/02/16,809.0,811.142,810.0,532000,821.0,805.0
337,2017/02/17,795.0,795.664,801.0,589500,802.0,792.0
338,2017/02/20,794.0,791.544,791.0,538400,797.0,782.0
339,2017/02/21,793.0,792.808,794.0,436800,798.0,789.0
340,2017/02/22,801.0,799.697,800.0,636300,802.0,793.0
341,2017/02/23,787.0,786.679,802.0,467800,804.0,780.0
342,2017/02/24,781.0,781.942,777.0,509000,790.0,776.0
343,2017/02/27,761.0,763.032,771.0,687700,775.0,757.0
344,2017/02/28,769.0,768.755,765.0,962800,776.0,762.0
345,2017/03/01,772.0,769.736,771.0,638900,775.0,763.0
346,2017/03/02,775.0,779.042,787.0,484200,788.0,774.0
347,2017/03/03,773.0,771.616,767.0,501800,777.0,767.0
348,2017/03/06,778.0,777.416,768.0,372600,784.0,767.0
349,2017/03/07,778.0,777.347,779.0,515100,782.0,772.0
350,2017/03/08,770.0,768.946,776.0,407300,776.0,763.0
351,2017/03/09,772.0,770.657,776.0,372000,778.0,767.0
352,2017/03/10,789.0,785.379,783.0,1161100,793.0,781.0
353,2017/03/13,783.0,782.828,786.0,564500,789.0,780.0
354,2017/03/14,765.0,768.648,783.0,578600,783.0,765.0
355,2017/03/15,761.0,758.701,760.0,577500,764.0,747.0
356,2017/03/16,751.0,752.986,752.0,670000,759.0,749.0
357,2017/03/17,753.0,752.068,748.0,984400,757.0,744.0
358,2017/03/21,745.0,748.178,753.0,530200,758.0,745.0
359,2017/03/22,713.0,718.734,730.0,1061300,733.0,711.0
360,2017/03/23,687.0,689.319,708.0,1836900,709.0,679.0
361,2017/03/24,707.0,703.921,687.0,939700,711.0,687.0
362,2017/03/27,698.0,696.784,695.0,911800,700.0,692.0
363,2017/03/28,710.0,709.078,708.0,918400,716.0,704.0
364,2017/03/29,706.0,704.15,713.0,742400,713.0,696.0
365,2017/03/30,697.0,699.209,700.0,512500,705.0,694.0
366,2017/03/31,681.0,689.629,705.0,981300,710.0,681.0
367,2017/04/03,684.0,684.347,687.0,715500,690.0,677.0
368,2017/04/04,674.0,673.51,680.0,840100,681.0,669.0
369,2017/04/05,665.0,664.63,673.0,1204400,677.0,657.0
370,2017/04/06,656.0,656.647,663.0,965100,663.0,651.0
371,2017/04/07,661.0,665.84,665.0,1164100,675.0,658.0
372,2017/04/10,666.0,659.56,661.0,1722600,670.0,648.0
373,2017/04/11,670.0,666.795,655.0,1290500,673.0,650.0
374,2017/04/12,670.0,669.11,667.0,1136800,674.0,664.0
375,2017/04/13,662.0,660.166,660.0,990200,668.0,652.0
376,2017/04/14,670.0,666.616,659.0,747500,674.0,653.0
377,2017/04/17,664.0,659.793,664.0,767400,666.0,650.0
378,2017/04/18,669.0,672.626,672.0,1088100,681.0,665.0
379,2017/04/19,677.0,669.444,662.0,1166700,680.0,654.0
380,2017/04/20,685.0,684.77,675.0,901700,692.0,672.0
381,2017/04/21,686.0,689.116,692.0,614400,702.0,683.0
382,2017/04/24,695.0,698.33,700.0,548300,704.0,693.0
383,2017/04/25,703.0,703.307,696.0,514200,707.0,695.0
384,2017/04/26,713.0,709.423,710.0,739400,713.0,700.0
385,2017/04/27,718.0,715.102,711.0,615300,719.0,709.0
386,2017/04/28,694.0,698.763,714.0,823100,715.0,694.0
387,2017/05/01,698.0,694.223,695.0,447400,701.0,686.0
388,2017/05/02,713.0,710.968,702.0,645700,717.0,698.0
389,2017/05/08,734.0,731.421,724.0,840400,736.0,723.0
390,2017/05/09,727.0,728.748,729.0,501500,734.0,727.0
391,2017/05/10,732.0,730.626,728.0,617700,733.0,728.0
392,2017/05/11,733.0,731.272,734.0,893100,737.0,725.0
393,2017/05/12,752.0,754.883,735.0,1594600,769.0,734.0
394,2017/05/15,741.0,737.349,737.0,805000,743.0,728.0
395,2017/05/16,747.0,746.105,750.0,487600,753.0,741.0
396,2017/05/17,736.0,734.62,737.0,489100,737.0,730.0
397,2017/05/18,711.0,712.504,726.0,678500,728.0,706.0
398,2017/05/19,712.0,710.176,712.0,811400,716.0,701.0
399,2017/05/22,706.0,707.05,715.0,536200,715.0,704.0
400,2017/05/23,697.0,699.822,706.0,654100,707.0,695.0
401,2017/05/24,714.0,712.686,706.0,680800,720.0,703.0
402,2017/05/25,715.0,715.187,713.0,443200,718.0,711.0
403,2017/05/26,707.0,709.838,714.0,359200,717.0,707.0
404,2017/05/29,701.0,701.895,708.0,447700,710.0,699.0
405,2017/05/30,693.0,693.485,698.0,591300,702.0,690.0
406,2017/05/31,681.0,681.55,686.0,1176400,689.0,678.0
407,2017/06/01,696.0,693.709,682.0,640900,699.0,679.0
408,2017/06/02,717.0,713.66,700.0,665900,720.0,698.0
409,2017/06/05,708.0,703.143,707.0,446200,709.0,695.0
410,2017/06/06,702.0,706.363,699.0,605700,711.0,699.0
411,2017/06/07,704.0,703.281,701.0,428800,707.0,698.0
412,2017/06/08,701.0,703.511,707.0,885500,711.0,700.0
413,2017/06/09,702.0,697.643,694.0,1464200,705.0,691.0
414,2017/06/12,695.0,700.847,702.0,660600,710.0,695.0
415,2017/06/13,704.0,703.229,695.0,711400,708.0,693.0
416,2017/06/14,696.0,698.412,704.0,827700,707.0,694.0
417,2017/06/15,687.0,691.052,696.0,547600,701.0,687.0
418,2017/06/16,693.0,693.01,693.0,1313700,700.0,688.0
419,2017/06/19,706.0,704.787,698.0,662800,709.0,697.0
420,2017/06/20,709.0,713.015,718.0,1013700,719.0,707.0
421,2017/06/21,693.0,693.895,698.0,754300,698.0,692.0
422,2017/06/22,696.0,695.334,693.0,653700,698.0,690.0
423,2017/06/23,694.0,693.892,699.0,436000,700.0,689.0
424,2017/06/26,694.0,693.391,693.0,302100,697.0,688.0
425,2017/06/27,705.0,705.46,695.0,778100,711.0,694.0
426,2017/06/28,710.0,708.537,707.0,822700,714.0,705.0
427,2017/06/29,710.0,711.014,715.0,979700,722.0,708.0
428,2017/06/30,709.0,706.803,706.0,928800,710.0,700.0
429,2017/07/03,713.0,710.758,710.0,957500,717.0,703.0
430,2017/07/04,710.0,712.227,718.0,552400,721.0,708.0
431,2017/07/05,733.0,726.784,711.0,1243300,735.0,711.0
432,2017/07/06,734.0,733.66,733.0,812000,738.0,727.0
433,2017/07/07,729.0,729.743,727.0,563100,735.0,727.0
434,2017/07/10,729.0,730.015,734.0,392400,735.0,728.0
435,2017/07/11,734.0,733.803,728.0,369800,736.0,728.0
436,2017/07/12,727.0,729.158,734.0,496400,738.0,725.0
437,2017/07/13,717.0,718.054,730.0,379300,730.0,715.0
438,2017/07/14,724.0,722.159,719.0,375400,726.0,716.0
439,2017/07/18,720.0,716.892,720.0,441100,722.0,710.0
440,2017/07/19,714.0,715.036,720.0,385100,720.0,710.0
441,2017/07/20,722.0,719.895,717.0,504700,725.0,711.0
442,2017/07/21,717.0,716.268,721.0,330100,721.0,711.0
443,2017/07/24,712.0,709.629,713.0,363300,713.0,705.0
444,2017/07/25,708.0,709.075,706.0,235900,715.0,706.0
445,2017/07/26,706.0,707.044,713.0,463900,716.0,703.0
446,2017/07/27,703.0,704.696,700.0,565200,710.0,696.0
447,2017/07/28,697.0,698.095,701.0,594900,705.0,694.0
448,2017/07/31,693.0,696.115,697.0,703900,701.0,693.0
449,2017/08/01,702.0,700.618,696.0,537200,703.0,695.0
450,2017/08/02,705.0,705.264,705.0,461000,708.0,700.0
451,2017/08/03,698.0,699.731,705.0,393300,707.0,696.0
452,2017/08/04,704.0,701.127,697.0,446200,705.0,693.0
453,2017/08/07,709.0,710.378,706.0,504700,714.0,706.0
454,2017/08/08,706.0,705.277,710.0,376100,711.0,700.0
455,2017/08/09,705.0,706.233,710.0,484900,712.0,703.0
456,2017/08/10,713.0,709.185,705.0,643600,714.0,699.0
457,2017/08/14,694.0,697.682,704.0,543600,706.0,694.0
458,2017/08/15,709.0,711.261,703.0,611100,718.0,702.0
459,2017/08/16,695.0,696.956,702.0,493800,705.0,694.0
460,2017/08/17,687.0,688.316,695.0,468500,695.0,685.0
461,2017/08/18,675.0,676.126,677.0,452600,679.0,675.0
462,2017/08/21,668.0,671.322,681.0,413300,681.0,668.0
463,2017/08/22,666.0,667.452,667.0,343300,671.0,664.0
464,2017/08/23,660.0,662.255,674.0,483900,675.0,658.0
465,2017/08/24,662.0,666.005,664.0,521900,674.0,662.0
466,2017/08/25,660.0,662.447,666.0,340900,668.0,660.0
467,2017/08/28,655.0,654.676,660.0,588800,661.0,650.0
468,2017/08/29,653.0,651.689,650.0,411800,656.0,646.0
469,2017/08/30,654.0,653.91,658.0,631700,660.0,651.0
470,2017/08/31,670.0,674.746,664.0,1036900,686.0,664.0
471,2017/09/01,672.0,670.85,679.0,616700,680.0,665.0
472,2017/09/04,655.0,659.467,667.0,464100,671.0,654.0
473,2017/09/05,649.0,651.411,655.0,365800,658.0,648.0
474,2017/09/06,639.0,639.296,642.0,388200,644.0,636.0
475,2017/09/07,640.0,640.532,644.0,339400,645.0,638.0
476,2017/09/08,613.0,621.436,630.0,1618500,632.0,608.0
477,2017/09/11,609.0,614.33,623.0,1646000,629.0,606.0
478,2017/09/12,621.0,617.042,613.0,1663200,623.0,611.0
479,2017/09/13,630.0,630.88,629.0,683100,638.0,627.0
480,2017/09/14,634.0,637.01,636.0,695700,643.0,634.0
481,2017/09/15,641.0,638.44,630.0,1324200,643.0,627.0
482,2017/09/19,665.0,660.906,644.0,1091500,669.0,644.0
483,2017/09/20,663.0,662.633,665.0,925000,670.0,659.0
484,2017/09/21,671.0,675.872,672.0,798300,683.0,671.0
485,2017/09/22,673.0,672.026,674.0,598400,679.0,666.0
486,2017/09/25,678.0,678.048,675.0,538600,682.0,674.0
487,2017/09/26,679.0,676.457,678.0,608700,681.0,672.0
488,2017/09/27,669.0,665.509,677.0,892100,677.0,658.0
489,2017/09/28,689.0,684.672,679.0,890300,691.0,676.0
490,2017/09/29,692.0,691.8,690.0,726300,695.0,685.0
491,2017/10/02,689.0,690.048,694.0,509700,698.0,684.0
492,2017/10/03,690.0,689.001,687.0,397800,693.0,685.0
493,2017/10/04,693.0,693.59,692.0,522400,699.0,689.0
494,2017/10/05,688.0,688.385,693.0,499500,695.0,684.0
495,2017/10/06,695.0,697.113,693.0,643900,703.0,693.0
496,2017/10/10,691.0,689.386,694.0,526900,694.0,684.0
497,2017/10/11,693.0,693.305,693.0,439800,696.0,690.0
498,2017/10/12,681.0,683.497,696.0,723000,696.0,678.0
499,2017/10/13,684.0,679.55,675.0,812300,684.0,672.0
500,2017/10/16,686.0,684.322,679.0,1000900,690.0,676.0
501,2017/10/17,689.0,688.599,694.0,758900,697.0,684.0
502,2017/10/18,693.0,690.482,688.0,604900,694.0,684.0
503,2017/10/19,694.0,694.026,698.0,425400,698.0,690.0
504,2017/10/20,688.0,690.553,690.0,781600,695.0,688.0
505,2017/10/23,699.0,698.88,698.0,949300,702.0,691.0
506,2017/10/24,703.0,701.265,700.0,805700,704.0,696.0
507,2017/10/25,706.0,706.791,705.0,974500,710.0,701.0
508,2017/10/26,704.0,706.309,706.0,571300,712.0,704.0
509,2017/10/27,723.0,721.3,708.0,927800,729.0,704.0
510,2017/10/30,727.0,725.344,724.0,1541400,730.0,718.0
511,2017/10/31,717.0,717.594,722.0,648400,722.0,714.0
512,2017/11/01,720.0,716.45,720.0,1106700,721.0,708.0
513,2017/11/02,731.0,726.684,728.0,903400,736.0,716.0
514,2017/11/06,723.0,723.619,732.0,1242500,736.0,715.0
515,2017/11/07,730.0,724.698,719.0,923100,731.0,717.0
516,2017/11/08,703.0,706.174,722.0,1788700,725.0,698.0
517,2017/11/09,706.0,706.138,708.0,1198400,713.0,699.0
518,2017/11/10,694.0,695.56,697.0,775800,703.0,690.0
519,2017/11/13,685.0,685.186,692.0,677700,692.0,682.0
520,2017/11/14,679.0,680.313,689.0,754500,690.0,676.0
521,2017/11/15,664.0,662.96,675.0,1715000,680.0,652.0
522,2017/11/16,671.0,669.891,666.0,1006100,676.0,663.0
523,2017/11/17,666.0,667.233,675.0,999400,675.0,662.0
524,2017/11/20,664.0,661.597,658.0,626300,664.0,656.0
525,2017/11/21,660.0,662.336,666.0,715300,668.0,660.0
526,2017/11/22,660.0,657.343,658.0,899100,660.0,653.0
527,2017/11/24,655.0,654.328,656.0,705600,658.0,650.0
528,2017/11/27,653.0,655.428,659.0,521200,661.0,652.0
529,2017/11/28,646.0,648.739,655.0,528900,656.0,645.0
530,2017/11/29,653.0,653.255,656.0,790100,660.0,649.0
531,2017/11/30,664.0,663.168,656.0,2116500,668.0,652.0
532,2017/12/01,671.0,669.427,673.0,928900,676.0,663.0
533,2017/12/04,664.0,667.091,675.0,520900,677.0,662.0
534,2017/12/05,674.0,669.814,660.0,654500,676.0,660.0
535,2017/12/06,657.0,658.369,668.0,1340700,669.0,653.0
536,2017/12/07,657.0,660.074,661.0,1416200,665.0,656.0
537,2017/12/08,660.0,656.104,650.0,1550200,662.0,649.0
538,2017/12/11,673.0,669.724,666.0,724500,673.0,666.0
539,2017/12/12,688.0,684.447,677.0,874300,689.0,677.0
540,2017/12/13,708.0,703.731,695.0,1680500,711.0,691.0
541,2017/12/14,703.0,699.543,705.0,952200,705.0,683.0
542,2017/12/15,691.0,691.769,699.0,1118600,699.0,686.0
543,2017/12/18,703.0,703.602,701.0,965500,708.0,699.0
544,2017/12/19,698.0,700.253,708.0,418400,708.0,696.0
545,2017/12/20,705.0,704.881,702.0,915300,710.0,693.0
546,2017/12/21,690.0,693.598,702.0,683600,702.0,687.0
547,2017/12/22,689.0,690.821,690.0,712200,698.0,687.0
548,2017/12/25,685.0,685.624,690.0,316500,692.0,683.0
549,2017/12/26,688.0,687.144,683.0,434200,690.0,682.0
550,2017/12/27,688.0,689.349,687.0,264000,693.0,686.0
551,2017/12/28,678.0,680.47,687.0,848200,689.0,676.0
552,2017/12/29,682.0,682.885,679.0,492300,687.0,677.0
553,2018/01/04,714.0,707.456,693.0,1214800,714.0,692.0
554,2018/01/05,714.0,712.694,718.0,771700,720.0,707.0
555,2018/01/09,713.0,711.112,715.0,706400,717.0,706.0
556,2018/01/10,724.0,722.329,718.0,1189900,729.0,713.0
557,2018/01/11,718.0,714.479,712.0,1070600,718.0,704.0
558,2018/01/12,706.0,705.726,713.0,1103000,718.0,700.0
559,2018/01/15,713.0,710.7,707.0,815400,714.0,704.0
560,2018/01/16,703.0,704.578,714.0,687800,714.0,701.0
561,2018/01/17,690.0,689.431,695.0,1118100,695.0,681.0
562,2018/01/18,689.0,691.443,700.0,1485300,703.0,683.0
563,2018/01/19,678.0,680.265,693.0,1011900,693.0,675.0
564,2018/01/22,674.0,674.178,678.0,805400,678.0,671.0
565,2018/01/23,686.0,682.651,678.0,833100,687.0,675.0
566,2018/01/24,685.0,683.273,683.0,783400,687.0,679.0
567,2018/01/25,671.0,673.251,678.0,1939400,678.0,670.0
568,2018/01/26,668.0,671.009,669.0,982300,677.0,668.0
569,2018/01/29,664.0,664.28,663.0,1040500,670.0,656.0
570,2018/01/30,657.0,658.671,663.0,1073500,664.0,655.0
571,2018/01/31,653.0,659.222,657.0,1303700,669.0,652.0
572,2018/02/01,673.0,666.129,653.0,2222400,675.0,650.0
573,2018/02/02,672.0,672.736,676.0,1170700,679.0,666.0
574,2018/02/05,660.0,660.301,662.0,1010800,668.0,655.0
575,2018/02/06,625.0,621.866,637.0,1642200,643.0,609.0
576,2018/02/07,624.0,633.816,635.0,1526800,653.0,622.0
577,2018/02/08,627.0,626.513,630.0,1089100,634.0,620.0
578,2018/02/09,615.0,611.398,609.0,1034100,618.0,606.0
579,2018/02/13,605.0,611.031,621.0,1320100,623.0,603.0
580,2018/02/14,604.0,604.657,615.0,1141200,618.0,601.0
581,2018/02/15,608.0,609.322,610.0,734100,615.0,604.0
582,2018/02/16,611.0,611.995,614.0,695700,618.0,607.0
583,2018/02/19,629.0,628.222,620.0,904400,634.0,620.0
584,2018/02/20,620.0,621.418,628.0,821100,629.0,616.0
585,2018/02/21,611.0,613.077,622.0,915600,622.0,609.0
586,2018/02/22,599.0,601.431,607.0,974600,610.0,597.0
587,2018/02/23,602.0,602.344,600.0,875600,607.0,597.0
588,2018/02/26,607.0,607.343,604.0,626200,611.0,604.0
589,2018/02/27,609.0,608.036,610.0,813600,611.0,603.0
590,2018/02/28,600.0,601.516,605.0,1406000,608.0,598.0
591,2018/03/01,582.0,583.937,589.0,1560500,592.0,580.0
592,2018/03/02,570.0,569.808,570.0,1233400,576.0,566.0
593,2018/03/05,568.0,566.265,562.0,972500,571.0,561.0
594,2018/03/06,574.0,578.944,575.0,1003900,586.0,574.0
595,2018/03/07,560.0,562.52,567.0,1332600,571.0,558.0
596,2018/03/08,555.0,560.442,565.0,1432000,575.0,553.0
597,2018/03/09,548.0,553.421,561.0,1721300,561.0,545.0
598,2018/03/12,558.0,553.308,551.0,1201200,558.0,548.0
599,2018/03/13,550.0,548.211,554.0,2141700,556.0,544.0
600,2018/03/14,549.0,550.289,547.0,1252800,556.0,546.0
601,2018/03/15,536.0,538.167,547.0,1168200,547.0,534.0
602,2018/03/16,538.0,539.181,534.0,2064700,546.0,534.0
603,2018/03/19,534.0,534.055,535.0,913000,540.0,531.0
604,2018/03/20,539.0,537.758,532.0,1088400,544.0,531.0
605,2018/03/22,541.0,540.162,540.0,1321700,544.0,536.0
606,2018/03/23,520.0,521.799,531.0,1360500,531.0,518.0
607,2018/03/26,522.0,517.809,512.0,1309800,522.0,512.0
608,2018/03/27,536.0,535.024,529.0,1679900,540.0,529.0
609,2018/03/28,531.0,527.713,525.0,1392400,531.0,520.0
610,2018/03/29,526.0,525.557,532.0,1611900,537.0,519.0
611,2018/03/30,526.0,525.574,527.0,1406200,533.0,521.0
612,2018/04/02,519.0,523.79,522.0,951500,530.0,519.0
613,2018/04/03,509.0,510.303,512.0,1682800,514.0,506.0
614,2018/04/04,512.0,510.757,507.0,1864100,514.0,502.0
615,2018/04/05,527.0,526.605,519.0,1409400,533.0,518.0
616,2018/04/06,522.0,521.561,517.0,1319100,527.0,514.0
617,2018/04/09,525.0,526.655,525.0,1390900,533.0,523.0
618,2018/04/10,518.0,513.897,520.0,2709300,521.0,505.0
619,2018/04/11,524.0,524.498,525.0,1644100,531.0,521.0
620,2018/04/12,523.0,524.471,525.0,1968200,532.0,517.0
621,2018/04/13,528.0,528.637,523.0,1833700,533.0,521.0
622,2018/04/16,533.0,533.292,533.0,1614300,541.0,529.0
623,2018/04/17,523.0,524.013,529.0,1360100,529.0,520.0
624,2018/04/18,533.0,531.847,531.0,2566300,535.0,526.0
625,2018/04/19,535.0,537.131,532.0,1820500,544.0,528.0
626,2018/04/20,533.0,533.872,541.0,1872000,548.0,528.0
627,2018/04/23,536.0,536.082,535.0,1627300,540.0,531.0
628,2018/04/24,555.0,550.381,543.0,1757800,556.0,542.0
629,2018/04/25,553.0,551.665,549.0,1865000,556.0,545.0
630,2018/04/26,540.0,543.974,554.0,2021000,558.0,537.0
631,2018/04/27,538.0,539.682,541.0,1851400,545.0,535.0
632,2018/05/01,524.0,527.205,534.0,2283300,536.0,522.0
633,2018/05/02,531.0,530.477,530.0,1310500,535.0,523.0
634,2018/05/07,536.0,533.412,536.0,1154300,537.0,527.0
635,2018/05/08,542.0,541.84,536.0,1830200,547.0,531.0
636,2018/05/09,563.0,556.213,547.0,3077500,565.0,545.0
637,2018/05/10,556.0,558.435,565.0,1792600,566.0,554.0
638,2018/05/11,560.0,559.172,546.0,2100900,570.0,544.0
639,2018/05/14,550.0,550.365,552.0,2130000,559.0,547.0
640,2018/05/15,558.0,556.454,553.0,3575600,565.0,544.0
641,2018/05/16,557.0,556.499,555.0,2989500,562.0,548.0
642,2018/05/17,559.0,560.773,559.0,1621900,564.0,558.0
643,2018/05/18,567.0,567.028,568.0,1804600,571.0,562.0
644,2018/05/21,560.0,562.289,567.0,2074100,567.0,559.0
645,2018/05/22,563.0,563.189,560.0,1925800,567.0,555.0
646,2018/05/23,552.0,553.218,560.0,2306200,561.0,549.0
647,2018/05/24,537.0,539.895,550.0,2203500,550.0,535.0
648,2018/05/25,534.0,534.526,534.0,2328300,541.0,530.0
649,2018/05/28,531.0,529.818,530.0,1841200,535.0,524.0
650,2018/05/29,527.0,527.791,528.0,1996000,534.0,525.0
651,2018/05/30,514.0,512.618,517.0,2891900,517.0,508.0
652,2018/05/31,521.0,519.874,514.0,30781100,524.0,507.0
653,2018/06/01,520.0,521.04,515.0,3153100,529.0,511.0
654,2018/06/04,547.0,540.71,527.0,2549800,549.0,526.0
655,2018/06/05,545.0,541.28,542.0,1363700,545.0,532.0
656,2018/06/06,527.0,531.512,538.0,2179800,541.0,527.0
657,2018/06/07,531.0,533.513,535.0,1294700,538.0,530.0
658,2018/06/08,527.0,529.315,528.0,1938900,534.0,526.0
659,2018/06/11,542.0,538.6,529.0,1964700,545.0,526.0
660,2018/06/12,544.0,543.372,546.0,1957400,547.0,536.0
661,2018/06/13,541.0,541.689,544.0,1529500,546.0,534.0
662,2018/06/14,545.0,542.334,538.0,1458000,548.0,529.0
663,2018/06/15,543.0,546.138,550.0,2553100,556.0,541.0
664,2018/06/18,532.0,534.812,540.0,810600,544.0,530.0
665,2018/06/19,519.0,523.039,533.0,1302900,533.0,518.0
666,2018/06/20,524.0,519.735,523.0,1737900,525.0,511.0
667,2018/06/21,514.0,518.52,520.0,1581100,527.0,514.0
668,2018/06/22,522.0,516.951,508.0,2643000,524.0,503.0
669,2018/06/25,522.0,525.54,522.0,1085200,536.0,520.0
670,2018/06/26,533.0,528.653,519.0,865200,535.0,518.0
671,2018/06/27,532.0,530.748,533.0,826700,536.0,525.0
672,2018/06/28,530.0,529.874,532.0,1468800,535.0,526.0
673,2018/06/29,535.0,534.047,533.0,892500,536.0,528.0
674,2018/07/02,524.0,526.743,531.0,1049900,534.0,522.0
675,2018/07/03,520.0,520.103,530.0,1132400,531.0,514.0
676,2018/07/04,509.0,512.15,515.0,981400,519.0,508.0
677,2018/07/05,498.0,499.823,504.0,1643100,505.0,496.0
678,2018/07/06,507.0,505.455,500.0,1139100,510.0,497.0
679,2018/07/09,517.0,515.883,511.0,699800,519.0,510.0
680,2018/07/10,519.0,522.209,524.0,916000,528.0,519.0
681,2018/07/11,514.0,512.376,515.0,1018700,516.0,507.0
682,2018/07/12,514.0,517.257,524.0,969800,524.0,514.0
683,2018/07/13,514.0,515.242,519.0,1215100,520.0,512.0
684,2018/07/17,519.0,518.411,514.0,1357200,525.0,508.0
685,2018/07/18,522.0,524.14,526.0,789100,529.0,521.0
686,2018/07/19,525.0,523.371,526.0,1089600,527.0,518.0
687,2018/07/20,522.0,523.087,527.0,888600,527.0,519.0
688,2018/07/23,550.0,545.755,530.0,1706800,552.0,530.0
689,2018/07/24,551.0,554.374,560.0,1269600,564.0,548.0
690,2018/07/25,551.0,553.686,553.0,466500,559.0,551.0
691,2018/07/26,560.0,559.622,557.0,1147300,563.0,554.0
692,2018/07/27,573.0,569.097,561.0,1141700,573.0,561.0
693,2018/07/30,590.0,586.783,580.0,2072500,593.0,576.0
694,2018/07/31,572.0,584.758,592.0,3103800,605.0,568.0
695,2018/08/01,594.0,585.34,579.0,1752200,597.0,569.0
696,2018/08/02,590.0,594.152,597.0,1837700,602.0,586.0
697,2018/08/03,578.0,583.953,586.0,1549400,591.0,577.0
698,2018/08/06,567.0,568.647,568.0,1334900,578.0,564.0
699,2018/08/07,570.0,568.093,567.0,856000,572.0,564.0
700,2018/08/08,567.0,569.22,568.0,1102900,576.0,566.0
701,2018/08/09,555.0,556.782,562.0,1047500,564.0,553.0
702,2018/08/10,543.0,545.328,555.0,1484300,556.0,539.0
703,2018/08/13,527.0,528.71,533.0,1012300,536.0,524.0
704,2018/08/14,532.0,530.248,526.0,614700,535.0,523.0
705,2018/08/15,526.0,525.002,530.0,937100,534.0,519.0
706,2018/08/16,531.0,527.28,522.0,962000,533.0,517.0
707,2018/08/17,539.0,537.853,537.0,840800,543.0,529.0
708,2018/08/20,543.0,541.999,541.0,926400,544.0,539.0
709,2018/08/21,540.0,539.172,535.0,921700,543.0,532.0
710,2018/08/22,536.0,538.102,538.0,950400,542.0,535.0
711,2018/08/23,531.0,534.591,537.0,2405700,544.0,530.0
712,2018/08/24,530.0,530.266,532.0,941400,533.0,527.0
713,2018/08/27,536.0,533.425,526.0,1181900,540.0,526.0
714,2018/08/28,536.0,538.282,540.0,852300,544.0,534.0
715,2018/08/29,544.0,544.64,544.0,1552700,552.0,540.0
716,2018/08/30,542.0,542.458,543.0,1520400,548.0,537.0
717,2018/08/31,540.0,541.133,540.0,1396800,545.0,538.0
718,2018/09/03,533.0,533.21,536.0,1051000,538.0,528.0
719,2018/09/04,530.0,532.704,534.0,726600,537.0,530.0
720,2018/09/05,533.0,532.164,529.0,687400,536.0,528.0
721,2018/09/06,530.0,531.281,534.0,613100,535.0,529.0
722,2018/09/07,525.0,523.881,526.0,804400,527.0,520.0
723,2018/09/10,536.0,534.043,525.0,931900,539.0,524.0
724,2018/09/11,532.0,532.236,536.0,539400,537.0,529.0
725,2018/09/12,523.0,523.14,531.0,893300,533.0,517.0
726,2018/09/13,530.0,530.732,523.0,652900,535.0,523.0
727,2018/09/14,530.0,530.62,531.0,1368300,537.0,527.0
728,2018/09/18,536.0,534.762,526.0,1367100,540.0,525.0
729,2018/09/19,547.0,544.099,540.0,1377500,548.0,538.0
730,2018/09/20,549.0,548.866,551.0,1457900,554.0,542.0
731,2018/09/21,563.0,561.199,556.0,1630900,567.0,553.0
732,2018/09/25,561.0,559.274,563.0,1442500,565.0,555.0
733,2018/09/26,549.0,549.377,552.0,1292300,558.0,543.0
734,2018/09/27,539.0,542.039,542.0,1122000,548.0,539.0
735,2018/09/28,540.0,542.927,545.0,1849700,550.0,539.0
736,2018/10/01,544.0,543.242,538.0,1810100,549.0,535.0
737,2018/10/02,554.0,554.594,551.0,1396700,559.0,549.0
738,2018/10/03,554.0,553.361,553.0,1400500,558.0,548.0
739,2018/10/04,556.0,558.007,559.0,1443200,564.0,554.0
740,2018/10/05,557.0,556.038,550.0,1135100,559.0,550.0
741,2018/10/09,545.0,547.42,553.0,1154700,557.0,542.0
742,2018/10/10,554.0,551.715,542.0,1136100,558.0,542.0
743,2018/10/11,531.0,532.048,537.0,1607800,543.0,524.0
744,2018/10/12,522.0,521.949,527.0,1123200,528.0,519.0
745,2018/10/15,512.0,511.303,516.0,1260200,516.0,505.0
746,2018/10/16,509.0,507.941,508.0,835800,512.0,505.0
747,2018/10/17,513.0,512.955,513.0,878800,517.0,509.0
748,2018/10/18,511.0,514.76,517.0,1031200,523.0,509.0
749,2018/10/19,510.0,507.828,505.0,921900,512.0,502.0
750,2018/10/22,510.0,510.304,508.0,709800,515.0,504.0
751,2018/10/23,501.0,502.558,505.0,854700,509.0,500.0
752,2018/10/24,498.0,498.128,502.0,1219900,502.0,492.0
753,2018/10/25,483.0,483.956,486.0,875300,489.0,480.0
754,2018/10/26,486.0,485.64,483.0,1371900,491.0,481.0
755,2018/10/29,486.0,485.814,487.0,846000,491.0,481.0
756,2018/10/30,497.0,495.187,488.0,929800,498.0,488.0
757,2018/10/31,499.0,498.396,498.0,990200,503.0,493.0
758,2018/11/01,506.0,505.355,502.0,838100,510.0,499.0
759,2018/11/02,506.0,504.523,512.0,914100,512.0,496.0
760,2018/11/05,503.0,506.466,505.0,626100,512.0,503.0
761,2018/11/06,512.0,511.97,510.0,424900,515.0,506.0
762,2018/11/07,515.0,520.932,520.0,1219600,534.0,512.0
763,2018/11/08,533.0,534.969,529.0,827400,541.0,529.0
764,2018/11/09,535.0,537.365,534.0,490500,542.0,534.0
765,2018/11/12,537.0,535.707,532.0,408300,539.0,530.0
766,2018/11/13,523.0,523.023,529.0,708200,529.0,518.0
767,2018/11/14,522.0,524.712,531.0,629800,534.0,521.0
768,2018/11/15,518.0,515.785,515.0,939200,520.0,511.0
769,2018/11/16,514.0,515.102,519.0,716000,522.0,511.0
770,2018/11/19,503.0,504.257,514.0,1130700,517.0,499.0
771,2018/11/20,507.0,506.232,504.0,525500,511.0,503.0
772,2018/11/21,499.0,496.437,494.0,596800,500.0,492.0
773,2018/11/22,499.0,497.862,500.0,461800,502.0,493.0
774,2018/11/26,500.0,499.556,498.0,378400,503.0,496.0
775,2018/11/27,515.0,512.3,509.0,642100,516.0,506.0
776,2018/11/28,515.0,514.612,517.0,1044700,519.0,508.0
777,2018/11/29,529.0,527.739,522.0,673800,531.0,522.0
778,2018/11/30,531.0,529.13,526.0,727100,533.0,522.0
779,2018/12/03,532.0,531.112,535.0,742200,535.0,525.0
780,2018/12/04,510.0,515.242,526.0,912800,526.0,510.0
781,2018/12/05,493.0,495.464,496.0,899400,501.0,492.0
782,2018/12/06,488.0,487.352,490.0,875400,491.0,482.0
783,2018/12/07,490.0,487.762,488.0,986500,490.0,484.0
784,2018/12/10,484.0,487.176,495.0,1073000,495.0,481.0
785,2018/12/11,489.0,486.924,488.0,1185700,490.0,484.0
786,2018/12/12,494.0,494.323,492.0,1536000,498.0,491.0
787,2018/12/13,496.0,498.694,499.0,1443700,503.0,495.0
788,2018/12/14,477.0,484.017,489.0,1584400,490.0,476.0
789,2018/12/17,475.0,478.163,477.0,875100,485.0,475.0
790,2018/12/18,462.0,463.539,471.0,1106400,471.0,460.0
791,2018/12/19,449.0,453.16,461.0,1464500,462.0,446.0
792,2018/12/20,436.0,438.691,446.0,1305700,448.0,433.0
793,2018/12/21,422.0,421.507,430.0,1477100,430.0,417.0
794,2018/12/25,405.0,404.366,406.0,1340300,407.0,401.0
795,2018/12/26,406.0,407.279,407.0,1322000,412.0,402.0
796,2018/12/27,420.0,420.147,415.0,1411100,425.0,414.0
797,2018/12/28,416.0,417.032,420.0,1345700,421.0,413.0
798,2019/01/04,411.0,408.663,408.0,1640000,411.0,404.0
799,2019/01/07,415.0,418.561,419.0,1305800,426.0,414.0
800,2019/01/08,419.0,421.071,423.0,2353700,426.0,418.0
801,2019/01/09,423.0,421.507,422.0,840000,425.0,418.0
802,2019/01/10,420.0,420.224,420.0,909800,423.0,418.0
803,2019/01/11,424.0,423.785,424.0,822800,429.0,421.0
804,2019/01/15,419.0,418.999,416.0,1423600,425.0,413.0
805,2019/01/16,418.0,417.739,417.0,1087600,420.0,416.0
806,2019/01/17,421.0,423.626,422.0,886300,430.0,420.0
807,2019/01/18,429.0,428.171,425.0,701900,432.0,423.0
808,2019/01/21,438.0,439.54,437.0,710600,443.0,434.0
809,2019/01/22,434.0,433.75,440.0,527800,440.0,431.0
810,2019/01/23,433.0,433.078,430.0,694900,437.0,428.0
811,2019/01/24,443.0,439.917,434.0,796800,443.0,433.0
812,2019/01/25,441.0,441.49,440.0,560700,444.0,438.0
813,2019/01/28,432.0,434.644,440.0,385900,440.0,432.0
814,2019/01/29,432.0,431.434,434.0,520500,438.0,429.0
815,2019/01/30,429.0,429.482,435.0,625100,436.0,426.0
816,2019/01/31,443.0,441.085,437.0,813700,444.0,435.0
817,2019/02/01,430.0,432.85,442.0,717800,442.0,429.0
818,2019/02/04,442.0,441.778,438.0,686100,445.0,436.0
819,2019/02/05,445.0,443.75,440.0,684200,446.0,439.0
820,2019/02/06,447.0,447.908,450.0,560500,451.0,443.0
821,2019/02/07,441.0,440.307,444.0,650000,446.0,437.0
822,2019/02/08,431.0,432.032,437.0,613600,437.0,430.0
823,2019/02/12,451.0,448.471,438.0,884700,453.0,435.0
824,2019/02/13,459.0,456.306,461.0,734700,461.0,449.0
825,2019/02/14,455.0,453.837,451.0,639300,457.0,450.0
826,2019/02/15,452.0,450.769,451.0,606500,454.0,442.0
827,2019/02/18,463.0,464.553,468.0,615600,470.0,461.0
828,2019/02/19,460.0,457.325,463.0,705200,464.0,451.0
829,2019/02/20,460.0,461.313,463.0,756100,466.0,459.0
830,2019/02/21,463.0,461.53,464.0,405200,466.0,456.0
831,2019/02/22,451.0,454.123,459.0,394000,459.0,451.0
832,2019/02/25,456.0,456.016,456.0,423900,459.0,453.0
833,2019/02/26,448.0,448.692,459.0,736200,460.0,442.0
834,2019/02/27,439.0,441.462,451.0,930800,454.0,437.0
835,2019/02/28,452.0,449.559,444.0,1057200,454.0,440.0
836,2019/03/01,463.0,462.171,457.0,969500,465.0,457.0
837,2019/03/04,471.0,471.107,471.0,1056500,474.0,467.0
838,2019/03/05,480.0,476.657,471.0,853800,480.0,470.0
839,2019/03/06,475.0,475.554,475.0,849100,480.0,472.0
840,2019/03/07,470.0,468.6,470.0,739500,472.0,465.0
841,2019/03/08,461.0,463.643,466.0,1584800,468.0,457.0
842,2019/03/11,463.0,461.646,463.0,777900,466.0,457.0
843,2019/03/12,475.0,474.234,470.0,847800,479.0,465.0
844,2019/03/13,458.0,462.015,467.0,1072300,470.0,456.0
845,2019/03/14,462.0,464.386,464.0,963000,472.0,461.0
846,2019/03/15,488.0,484.105,467.0,1935900,489.0,467.0
847,2019/03/18,488.0,486.468,488.0,908900,488.0,483.0
848,2019/03/19,485.0,487.673,492.0,1088300,493.0,484.0
849,2019/03/20,496.0,490.98,489.0,1151500,496.0,485.0
850,2019/03/22,481.0,484.791,489.0,3346600,493.0,481.0
851,2019/03/25,468.0,469.306,480.0,1135500,480.0,465.0
852,2019/03/26,485.0,481.591,471.0,1513700,486.0,471.0
853,2019/03/27,465.0,466.619,474.0,1194000,475.0,463.0
854,2019/03/28,455.0,455.871,463.0,755800,464.0,452.0
855,2019/03/29,450.0,450.57,457.0,694400,458.0,448.0
856,2019/04/01,465.0,465.565,462.0,901700,470.0,459.0
857,2019/04/02,476.0,475.705,479.0,821600,479.0,473.0
858,2019/04/03,483.0,482.028,479.0,947900,486.0,475.0
859,2019/04/04,481.0,481.024,482.0,357400,484.0,478.0
860,2019/04/05,483.0,482.977,481.0,610600,487.0,480.0
861,2019/04/08,473.0,475.659,475.0,916700,486.0,473.0
862,2019/04/09,461.0,462.372,468.0,684900,470.0,459.0
863,2019/04/10,454.0,453.443,455.0,591900,456.0,450.0
864,2019/04/11,455.0,454.19,455.0,690400,458.0,449.0
865,2019/04/12,459.0,459.247,462.0,821800,464.0,455.0
866,2019/04/15,472.0,473.3,472.0,798300,479.0,469.0
867,2019/04/16,457.0,460.367,464.0,598200,467.0,456.0
868,2019/04/17,461.0,460.617,461.0,542800,465.0,457.0
869,2019/04/18,457.0,458.185,461.0,391600,465.0,455.0
870,2019/04/19,453.0,454.561,456.0,337400,459.0,452.0
871,2019/04/22,451.0,448.027,447.0,305100,452.0,444.0
872,2019/04/23,457.0,456.765,453.0,788600,459.0,452.0
873,2019/04/24,440.0,443.615,456.0,764700,456.0,438.0
874,2019/04/25,445.0,442.732,441.0,662100,446.0,434.0
875,2019/04/26,447.0,444.588,439.0,548000,449.0,436.0
876,2019/05/07,443.0,441.365,443.0,888300,446.0,438.0
877,2019/05/08,434.0,432.883,435.0,658700,437.0,430.0
878,2019/05/09,427.0,427.473,427.0,863400,431.0,423.0
879,2019/05/10,426.0,426.747,430.0,767300,433.0,421.0
880,2019/05/13,426.0,424.306,421.0,507100,428.0,418.0
881,2019/05/14,422.0,418.82,418.0,818600,423.0,411.0
882,2019/05/15,432.0,427.491,425.0,611100,432.0,421.0
883,2019/05/16,435.0,434.083,435.0,592900,436.0,429.0
884,2019/05/17,438.0,438.929,443.0,584600,444.0,436.0
885,2019/05/20,439.0,439.867,446.0,760800,446.0,436.0
886,2019/05/21,440.0,438.507,435.0,575700,442.0,433.0
887,2019/05/22,441.0,440.771,443.0,513200,443.0,438.0
888,2019/05/23,435.0,435.716,437.0,619600,441.0,434.0
889,2019/05/24,435.0,432.48,429.0,708800,437.0,424.0
890,2019/05/27,435.0,434.249,434.0,328100,436.0,430.0
891,2019/05/28,435.0,435.246,434.0,846700,438.0,432.0
892,2019/05/29,431.0,431.137,429.0,579700,435.0,428.0
893,2019/05/30,432.0,430.591,425.0,583900,434.0,425.0
894,2019/05/31,429.0,426.729,428.0,926600,430.0,421.0
895,2019/06/03,421.0,420.774,421.0,398700,423.0,418.0
896,2019/06/04,424.0,423.144,425.0,694400,426.0,421.0
897,2019/06/05,442.0,439.319,432.0,709700,443.0,430.0
898,2019/06/06,438.0,440.135,439.0,575100,444.0,437.0
899,2019/06/07,438.0,438.687,443.0,436100,443.0,435.0
900,2019/06/10,441.0,440.921,439.0,396200,444.0,437.0
901,2019/06/11,446.0,444.897,444.0,496000,446.0,443.0
902,2019/06/12,449.0,449.199,448.0,512800,453.0,446.0
903,2019/06/13,447.0,445.725,449.0,881000,449.0,440.0
904,2019/06/14,436.0,436.433,439.0,1087100,439.0,430.0
905,2019/06/17,430.0,432.098,436.0,623800,436.0,430.0
906,2019/06/18,424.0,426.786,430.0,677800,432.0,423.0
907,2019/06/19,433.0,430.819,430.0,781800,434.0,427.0
908,2019/06/20,430.0,430.418,431.0,599200,432.0,428.0
909,2019/06/21,424.0,424.96,425.0,1011000,428.0,423.0
910,2019/06/24,423.0,424.295,423.0,621400,427.0,423.0
911,2019/06/25,425.0,426.0,426.0,1630100,431.0,423.0
912,2019/06/26,420.0,423.854,429.0,760600,429.0,420.0
913,2019/06/27,432.0,428.568,424.0,665800,432.0,423.0
914,2019/06/28,426.0,426.546,424.0,593100,432.0,423.0
915,2019/07/01,434.0,433.223,435.0,690200,436.0,430.0
916,2019/07/02,439.0,437.263,436.0,430500,440.0,433.0
917,2019/07/03,434.0,433.266,434.0,479700,436.0,431.0
918,2019/07/04,433.0,431.868,434.0,559400,435.0,429.0
919,2019/07/05,433.0,433.714,434.0,324000,437.0,432.0
920,2019/07/08,436.0,436.863,436.0,553300,441.0,434.0
921,2019/07/09,436.0,436.665,436.0,522900,441.0,433.0
922,2019/07/10,437.0,436.706,436.0,645900,439.0,434.0
923,2019/07/11,444.0,440.896,440.0,449500,444.0,435.0
924,2019/07/12,443.0,442.603,445.0,363000,446.0,439.0
925,2019/07/16,443.0,441.086,438.0,306600,443.0,437.0
926,2019/07/17,433.0,435.044,442.0,1116700,442.0,432.0
927,2019/07/18,420.0,422.999,429.0,1290100,430.0,419.0
928,2019/07/19,425.0,423.368,422.0,872900,428.0,417.0
929,2019/07/22,422.0,421.152,422.0,851400,425.0,419.0
930,2019/07/23,422.0,423.178,420.0,621500,427.0,419.0
931,2019/07/24,424.0,423.772,426.0,549900,426.0,421.0
932,2019/07/25,425.0,425.217,425.0,461900,427.0,423.0
933,2019/07/26,423.0,423.01,421.0,675800,426.0,420.0
934,2019/07/29,421.0,420.669,421.0,585600,423.0,417.0
935,2019/07/30,417.0,418.301,422.0,582900,425.0,415.0
936,2019/07/31,414.0,414.062,413.0,841900,417.0,410.0
937,2019/08/01,412.0,413.164,415.0,752900,416.0,411.0
938,2019/08/02,398.0,399.798,405.0,966800,405.0,397.0
939,2019/08/05,392.0,391.123,395.0,1221200,395.0,387.0
940,2019/08/06,391.0,386.446,385.0,982100,392.0,380.0
941,2019/08/07,406.0,403.702,396.0,1221400,410.0,395.0
942,2019/08/08,401.0,394.672,401.0,1425400,402.0,378.0
943,2019/08/09,395.0,397.304,403.0,769300,404.0,395.0
944,2019/08/13,394.0,391.317,390.0,751300,394.0,385.0
945,2019/08/14,396.0,396.242,397.0,725200,399.0,394.0
946,2019/08/15,388.0,386.148,385.0,773500,388.0,382.0
947,2019/08/16,399.0,395.763,391.0,1192300,400.0,389.0
948,2019/08/19,399.0,399.566,401.0,518600,402.0,397.0
949,2019/08/20,403.0,402.299,403.0,694000,405.0,399.0
950,2019/08/21,402.0,400.007,397.0,643400,404.0,396.0
951,2019/08/22,407.0,405.752,407.0,582000,407.0,402.0
952,2019/08/23,408.0,408.191,407.0,414800,410.0,406.0
