,Date,Close,VWAP,Open,Volume,High,Low
0,2014/08/25,756.0,759.698,757.0,188300,775.0,752.0
1,2014/08/26,769.0,773.246,774.0,289400,779.0,762.0
2,2014/08/27,772.0,764.75,763.0,168400,775.0,752.0
3,2014/08/28,788.0,782.363,778.0,125300,797.0,765.0
4,2014/08/29,812.0,802.476,789.0,185000,818.0,778.0
5,2014/09/01,839.0,822.877,820.0,254900,845.0,796.0
6,2014/09/02,822.0,843.266,845.0,346800,869.0,818.0
7,2014/09/03,804.0,815.473,826.0,247500,838.0,800.0
8,2014/09/04,796.0,793.249,796.0,195100,812.0,782.0
9,2014/09/05,779.0,784.193,798.0,108100,803.0,764.0
10,2014/09/08,825.0,814.961,777.0,231700,834.0,767.0
11,2014/09/09,816.0,822.153,830.0,91300,833.0,810.0
12,2014/09/10,811.0,805.341,815.0,80900,816.0,790.0
13,2014/09/11,812.0,805.07,809.0,58300,815.0,793.0
14,2014/09/12,810.0,810.425,813.0,102900,816.0,800.0
15,2014/09/16,812.0,800.457,808.0,151100,823.0,780.0
16,2014/09/17,812.0,814.023,824.0,189900,827.0,804.0
17,2014/09/18,863.0,847.136,819.0,385100,874.0,808.0
18,2014/09/19,898.0,894.839,890.0,401600,914.0,883.0
19,2014/09/22,966.0,947.532,907.0,560300,988.0,905.0
20,2014/09/24,937.0,951.991,950.0,350300,984.0,927.0
21,2014/09/25,1004.0,994.184,945.0,671500,1013.0,940.0
22,2014/09/26,1007.0,1017.667,995.0,392700,1047.0,987.0
23,2014/09/29,1086.0,1072.658,1015.0,477500,1098.0,1015.0
24,2014/09/30,1094.0,1080.496,1079.0,507700,1123.0,1053.0
25,2014/10/01,1152.0,1168.432,1100.0,1213400,1217.0,1100.0
26,2014/10/02,1045.0,1071.04,1080.0,753800,1137.0,1031.0
27,2014/10/03,1037.0,1052.953,1035.0,375200,1089.0,1029.0
28,2014/10/06,1054.0,1052.069,1051.0,256700,1078.0,1024.0
29,2014/10/07,992.0,1016.0,1062.0,301000,1065.0,990.0
30,2014/10/08,991.0,984.972,968.0,274300,1003.0,953.0
31,2014/10/09,942.0,962.644,997.0,261200,1003.0,938.0
32,2014/10/10,945.0,924.312,920.0,330400,955.0,903.0
33,2014/10/14,904.0,906.995,908.0,335900,923.0,881.0
34,2014/10/15,928.0,920.982,913.0,211900,942.0,899.0
35,2014/10/16,876.0,892.934,893.0,279000,918.0,872.0
36,2014/10/17,830.0,847.6,875.0,389300,897.0,821.0
37,2014/10/20,901.0,889.517,888.0,226700,908.0,865.0
38,2014/10/21,928.0,919.024,903.0,245500,941.0,902.0
39,2014/10/22,938.0,951.788,973.0,236200,980.0,931.0
40,2014/10/23,925.0,927.387,927.0,148700,947.0,910.0
41,2014/10/24,916.0,933.362,951.0,199900,964.0,911.0
42,2014/10/27,916.0,928.342,926.0,196100,958.0,913.0
43,2014/10/28,898.0,900.602,915.0,197800,921.0,886.0
44,2014/10/29,904.0,913.704,904.0,165600,926.0,895.0
45,2014/10/30,953.0,944.782,919.0,238000,966.0,912.0
46,2014/10/31,959.0,951.468,961.0,236500,971.0,933.0
47,2014/11/04,990.0,984.86,1000.0,313000,1022.0,956.0
48,2014/11/05,971.0,964.661,973.0,205800,980.0,952.0
49,2014/11/06,938.0,949.093,978.0,164200,978.0,923.0
50,2014/11/07,953.0,946.784,937.0,81300,962.0,930.0
51,2014/11/10,957.0,951.479,953.0,69800,961.0,940.0
52,2014/11/11,966.0,958.551,952.0,89500,972.0,941.0
53,2014/11/12,982.0,977.871,968.0,132900,986.0,961.0
54,2014/11/13,1012.0,1006.856,990.0,201300,1021.0,987.0
55,2014/11/14,1015.0,1009.029,1010.0,267500,1025.0,990.0
56,2014/11/17,943.0,966.87,995.0,237600,1005.0,941.0
57,2014/11/18,969.0,966.569,949.0,139400,979.0,949.0
58,2014/11/19,956.0,958.2,970.0,160200,975.0,942.0
59,2014/11/20,1003.0,990.829,973.0,211500,1015.0,955.0
60,2014/11/21,999.0,994.318,1005.0,87500,1005.0,982.0
61,2014/11/25,1034.0,1020.102,1004.0,217000,1044.0,993.0
62,2014/11/26,1041.0,1057.015,1049.0,258200,1076.0,1032.0
63,2014/11/27,1044.0,1047.937,1048.0,84000,1056.0,1040.0
64,2014/11/28,1041.0,1052.145,1048.0,112100,1072.0,1033.0
65,2014/12/01,1083.0,1071.299,1041.0,133800,1086.0,1041.0
66,2014/12/02,1069.0,1074.788,1083.0,102700,1087.0,1065.0
67,2014/12/03,1049.0,1070.017,1070.0,161700,1093.0,1045.0
68,2014/12/04,1033.0,1045.514,1048.0,111400,1066.0,1033.0
69,2014/12/05,1128.0,1102.992,1049.0,419900,1138.0,1049.0
70,2014/12/08,1093.0,1108.524,1135.0,239300,1136.0,1085.0
71,2014/12/09,1079.0,1092.985,1080.0,250100,1129.0,1065.0
72,2014/12/10,1033.0,1045.709,1049.0,215700,1072.0,1025.0
73,2014/12/11,1038.0,1024.334,999.0,195300,1052.0,990.0
74,2014/12/12,988.0,1017.243,1028.0,351000,1047.0,984.0
75,2014/12/15,978.0,993.384,990.0,322900,1028.0,975.0
76,2014/12/16,952.0,957.053,970.0,215400,972.0,940.0
77,2014/12/17,989.0,993.958,960.0,171700,1018.0,960.0
78,2014/12/18,1009.0,1014.827,1019.0,135900,1035.0,996.0
79,2014/12/19,1009.0,1027.425,1035.0,145400,1065.0,1002.0
80,2014/12/22,1013.0,1006.598,1021.0,136400,1021.0,994.0
81,2014/12/24,1009.0,1006.726,1008.0,109100,1017.0,996.0
82,2014/12/25,1002.0,1003.629,1010.0,63800,1012.0,997.0
83,2014/12/26,1008.0,1007.692,1002.0,117300,1019.0,996.0
84,2014/12/29,1017.0,1016.122,1011.0,154100,1030.0,997.0
85,2014/12/30,1002.0,1015.376,1032.0,102200,1038.0,997.0
86,2015/01/05,989.0,994.873,1000.0,163400,1019.0,972.0
87,2015/01/06,965.0,970.735,962.0,105600,986.0,956.0
88,2015/01/07,963.0,965.645,960.0,79800,979.0,957.0
89,2015/01/08,982.0,976.391,970.0,80000,993.0,966.0
90,2015/01/09,960.0,966.958,980.0,111100,989.0,953.0
91,2015/01/13,958.0,948.191,950.0,82100,960.0,930.0
92,2015/01/14,966.0,959.263,961.0,87000,972.0,941.0
93,2015/01/15,982.0,970.925,973.0,103600,990.0,951.0
94,2015/01/16,928.0,925.031,955.0,224000,956.0,906.0
95,2015/01/19,943.0,932.28,940.0,105700,945.0,918.0
96,2015/01/20,951.0,946.978,949.0,77900,953.0,937.0
97,2015/01/21,944.0,943.15,951.0,56700,952.0,930.0
98,2015/01/22,945.0,943.982,941.0,54900,955.0,935.0
99,2015/01/23,970.0,962.935,950.0,54100,973.0,947.0
100,2015/01/26,962.0,962.48,954.0,54200,970.0,954.0
101,2015/01/27,950.0,960.829,970.0,175300,986.0,933.0
102,2015/01/28,956.0,955.814,948.0,80800,963.0,942.0
103,2015/01/29,976.0,973.137,953.0,187500,982.0,945.0
104,2015/01/30,943.0,950.89,978.0,174800,983.0,937.0
105,2015/02/02,908.0,914.098,930.0,230100,931.0,901.0
106,2015/02/03,900.0,904.959,908.0,154100,923.0,897.0
107,2015/02/04,919.0,918.933,906.0,75700,926.0,903.0
108,2015/02/05,902.0,908.591,919.0,56500,923.0,902.0
109,2015/02/06,899.0,900.826,906.0,99000,910.0,897.0
110,2015/02/09,871.0,881.322,900.0,213900,904.0,868.0
111,2015/02/10,857.0,856.337,863.0,201400,871.0,842.0
112,2015/02/12,839.0,851.909,860.0,190200,870.0,839.0
113,2015/02/13,866.0,865.531,850.0,444800,894.0,835.0
114,2015/02/16,787.0,803.115,851.0,802000,851.0,783.0
115,2015/02/17,788.0,788.723,788.0,290000,800.0,781.0
116,2015/02/18,814.0,820.304,807.0,331800,840.0,805.0
117,2015/02/19,880.0,864.91,818.0,717400,899.0,817.0
118,2015/02/20,901.0,896.647,880.0,552900,918.0,863.0
119,2015/02/23,900.0,887.843,901.0,405700,917.0,870.0
120,2015/02/24,883.0,881.657,885.0,223200,893.0,875.0
121,2015/02/25,884.0,893.807,890.0,198300,915.0,878.0
122,2015/02/26,873.0,874.518,881.0,146600,890.0,868.0
123,2015/02/27,866.0,860.36,860.0,196300,868.0,851.0
124,2015/03/02,889.0,891.302,877.0,247000,905.0,877.0
125,2015/03/03,873.0,873.616,883.0,135800,889.0,862.0
126,2015/03/04,847.0,852.16,867.0,181900,873.0,844.0
127,2015/03/05,831.0,835.673,840.0,187000,844.0,830.0
128,2015/03/06,834.0,832.614,830.0,158400,842.0,823.0
129,2015/03/09,851.0,850.462,834.0,207300,862.0,829.0
130,2015/03/10,842.0,847.99,859.0,206000,870.0,836.0
131,2015/03/11,858.0,859.274,840.0,256900,880.0,840.0
132,2015/03/12,852.0,855.083,858.0,213200,872.0,844.0
133,2015/03/13,854.0,855.508,853.0,170500,863.0,845.0
134,2015/03/16,858.0,856.578,858.0,143000,864.0,848.0
135,2015/03/17,862.0,863.086,861.0,164400,868.0,856.0
136,2015/03/18,850.0,859.633,858.0,218000,883.0,842.0
137,2015/03/19,844.0,839.679,838.0,149100,851.0,828.0
138,2015/03/20,868.0,861.984,844.0,187800,876.0,844.0
139,2015/03/23,874.0,874.297,870.0,154100,883.0,868.0
140,2015/03/24,878.0,871.294,874.0,107400,880.0,860.0
141,2015/03/25,860.0,862.819,863.0,150600,883.0,856.0
142,2015/03/26,848.0,848.852,859.0,141600,859.0,843.0
143,2015/03/27,836.0,838.683,848.0,123900,851.0,829.0
144,2015/03/30,829.0,830.473,836.0,121600,841.0,825.0
145,2015/03/31,831.0,837.454,833.0,91900,849.0,830.0
146,2015/04/01,826.0,822.24,831.0,113300,832.0,811.0
147,2015/04/02,833.0,831.291,821.0,109600,846.0,820.0
148,2015/04/03,835.0,817.673,831.0,217400,840.0,809.0
149,2015/04/06,836.0,827.685,836.0,190000,838.0,814.0
150,2015/04/07,863.0,851.571,840.0,294900,866.0,834.0
151,2015/04/08,903.0,898.345,880.0,468000,909.0,878.0
152,2015/04/09,917.0,912.933,918.0,396200,922.0,892.0
153,2015/04/10,918.0,914.432,921.0,321400,925.0,894.0
154,2015/04/13,951.0,950.155,937.0,338900,969.0,935.0
155,2015/04/14,957.0,958.006,955.0,228000,968.0,946.0
156,2015/04/15,958.0,954.511,967.0,133500,968.0,948.0
157,2015/04/16,969.0,952.476,948.0,171400,970.0,940.0
158,2015/04/17,968.0,968.241,977.0,201700,980.0,956.0
159,2015/04/20,962.0,959.19,954.0,167300,969.0,947.0
160,2015/04/21,932.0,937.192,951.0,226500,957.0,924.0
161,2015/04/22,944.0,947.743,934.0,187000,965.0,934.0
162,2015/04/23,943.0,939.777,945.0,125700,948.0,932.0
163,2015/04/24,945.0,943.669,943.0,75900,950.0,936.0
164,2015/04/27,975.0,964.931,948.0,181400,977.0,941.0
165,2015/04/28,959.0,963.767,967.0,382900,978.0,956.0
166,2015/04/30,950.0,956.479,960.0,97100,969.0,948.0
167,2015/05/01,940.0,938.687,940.0,99400,949.0,932.0
168,2015/05/07,934.0,942.866,940.0,76800,959.0,931.0
169,2015/05/08,936.0,932.344,931.0,96600,941.0,926.0
170,2015/05/11,940.0,946.193,948.0,75600,955.0,938.0
171,2015/05/12,954.0,950.844,943.0,123700,963.0,938.0
172,2015/05/13,956.0,956.967,945.0,87900,967.0,945.0
173,2015/05/14,933.0,932.969,955.0,164400,964.0,923.0
174,2015/05/15,952.0,955.221,931.0,308200,970.0,931.0
175,2015/05/18,1001.0,993.366,980.0,438000,1008.0,976.0
176,2015/05/19,999.0,999.386,1010.0,178500,1017.0,989.0
177,2015/05/20,976.0,985.658,1002.0,202000,1007.0,970.0
178,2015/05/21,980.0,978.53,984.0,104800,988.0,971.0
179,2015/05/22,1011.0,1005.471,990.0,201700,1014.0,988.0
180,2015/05/25,1022.0,1023.561,1021.0,159600,1034.0,1012.0
181,2015/05/26,1028.0,1026.545,1030.0,117300,1038.0,1014.0
182,2015/05/27,1008.0,1011.948,1017.0,68700,1019.0,1007.0
183,2015/05/28,1024.0,1020.453,1011.0,136300,1028.0,1011.0
184,2015/05/29,1018.0,1018.609,1019.0,63100,1024.0,1010.0
185,2015/06/01,1016.0,1016.663,1017.0,76500,1020.0,1011.0
186,2015/06/02,1025.0,1019.092,1016.0,96600,1029.0,1010.0
187,2015/06/03,1019.0,1024.933,1029.0,74900,1030.0,1016.0
188,2015/06/04,1039.0,1037.25,1030.0,97300,1044.0,1028.0
189,2015/06/05,1059.0,1048.289,1035.0,143100,1064.0,1032.0
190,2015/06/08,1085.0,1079.062,1060.0,157600,1089.0,1060.0
191,2015/06/09,1044.0,1061.157,1090.0,147000,1093.0,1032.0
192,2015/06/10,1040.0,1047.172,1041.0,70300,1058.0,1037.0
193,2015/06/11,1096.0,1086.103,1060.0,160500,1097.0,1060.0
194,2015/06/12,1120.0,1108.901,1099.0,217800,1126.0,1083.0
195,2015/06/15,1086.0,1099.861,1110.0,136300,1117.0,1081.0
196,2015/06/16,1062.0,1069.269,1080.0,74800,1084.0,1060.0
197,2015/06/17,1018.0,1028.395,1058.0,254600,1058.0,1014.0
198,2015/06/18,1004.0,1007.952,1009.0,92800,1024.0,1001.0
199,2015/06/19,995.0,998.444,1010.0,143300,1013.0,991.0
200,2015/06/22,1011.0,1008.59,998.0,64400,1021.0,998.0
201,2015/06/23,1009.0,1003.615,1012.0,100200,1013.0,996.0
202,2015/06/24,1004.0,1007.283,1010.0,54100,1016.0,1002.0
203,2015/06/25,986.0,986.695,995.0,205800,1004.0,974.0
204,2015/06/26,987.0,986.44,989.0,84100,999.0,974.0
205,2015/06/29,960.0,967.633,970.0,89700,978.0,960.0
206,2015/06/30,993.0,983.182,955.0,121100,995.0,955.0
207,2015/07/01,1008.0,1003.626,998.0,62600,1012.0,991.0
208,2015/07/02,1029.0,1020.905,1015.0,201600,1035.0,1004.0
209,2015/07/03,1032.0,1038.857,1028.0,158500,1053.0,1024.0
210,2015/07/06,1003.0,1005.812,1002.0,116200,1020.0,995.0
211,2015/07/07,1057.0,1046.567,1009.0,174200,1066.0,1009.0
212,2015/07/08,997.0,1023.762,1068.0,178600,1068.0,996.0
213,2015/07/09,1010.0,971.992,962.0,205100,1016.0,927.0
214,2015/07/10,982.0,987.188,1007.0,96300,1007.0,969.0
215,2015/07/13,994.0,992.687,987.0,34500,1000.0,987.0
216,2015/07/14,999.0,1006.725,1015.0,79900,1020.0,993.0
217,2015/07/15,1019.0,1010.976,1002.0,67200,1019.0,998.0
218,2015/07/16,1052.0,1051.617,1035.0,161400,1063.0,1030.0
219,2015/07/17,1044.0,1048.64,1061.0,87700,1072.0,1034.0
220,2015/07/21,1060.0,1062.904,1068.0,64300,1074.0,1055.0
221,2015/07/22,1032.0,1039.247,1052.0,56300,1052.0,1030.0
222,2015/07/23,1041.0,1033.267,1034.0,43100,1041.0,1025.0
223,2015/07/24,1051.0,1051.589,1038.0,43100,1060.0,1038.0
224,2015/07/27,1017.0,1021.8,1031.0,54900,1036.0,1010.0
225,2015/07/28,1022.0,1016.837,1015.0,34300,1027.0,1008.0
226,2015/07/29,1028.0,1019.315,1027.0,68600,1039.0,1001.0
227,2015/07/30,1055.0,1049.991,1046.0,83900,1059.0,1034.0
228,2015/07/31,1054.0,1053.974,1059.0,41900,1060.0,1047.0
229,2015/08/03,1054.0,1056.036,1054.0,33300,1064.0,1050.0
230,2015/08/04,1016.0,1021.464,1048.0,102600,1048.0,1012.0
231,2015/08/05,1045.0,1043.819,1030.0,90700,1056.0,1016.0
232,2015/08/06,1063.0,1058.975,1057.0,126300,1068.0,1045.0
233,2015/08/07,1067.0,1057.766,1064.0,117600,1072.0,1042.0
234,2015/08/10,1098.0,1095.869,1075.0,169300,1110.0,1070.0
235,2015/08/11,1122.0,1119.158,1107.0,174300,1135.0,1093.0
236,2015/08/12,1037.0,1045.525,1101.0,632900,1146.0,991.0
237,2015/08/13,1052.0,1030.717,1027.0,283000,1052.0,1011.0
238,2015/08/14,1022.0,1031.436,1052.0,249600,1072.0,1012.0
239,2015/08/17,1015.0,1021.864,1025.0,184200,1047.0,1008.0
240,2015/08/18,1020.0,1014.673,1015.0,169800,1028.0,1002.0
241,2015/08/19,1011.0,1005.875,1019.0,133800,1023.0,998.0
242,2015/08/20,984.0,996.777,1011.0,153200,1015.0,983.0
243,2015/08/21,988.0,989.069,960.0,204300,1007.0,960.0
244,2015/08/24,915.0,946.29,965.0,184100,979.0,914.0
245,2015/08/25,858.0,864.384,840.0,321900,908.0,817.0
246,2015/08/26,875.0,865.962,863.0,143400,877.0,851.0
247,2015/08/27,888.0,891.538,890.0,151600,906.0,880.0
248,2015/08/28,919.0,911.482,920.0,122800,924.0,900.0
249,2015/08/31,934.0,923.765,921.0,140100,937.0,906.0
250,2015/09/01,922.0,937.095,930.0,219500,952.0,919.0
251,2015/09/02,876.0,887.759,877.0,195700,906.0,870.0
252,2015/09/03,881.0,892.293,900.0,101000,911.0,877.0
253,2015/09/04,910.0,911.4,907.0,258100,925.0,896.0
254,2015/09/07,874.0,884.551,899.0,134900,910.0,868.0
255,2015/09/08,872.0,871.375,872.0,119600,884.0,864.0
256,2015/09/09,931.0,914.55,900.0,91500,931.0,900.0
257,2015/09/10,906.0,906.873,905.0,113400,918.0,893.0
258,2015/09/11,947.0,928.407,906.0,133900,954.0,902.0
259,2015/09/14,946.0,950.889,960.0,72900,965.0,936.0
260,2015/09/15,925.0,935.983,946.0,40100,956.0,922.0
261,2015/09/16,939.0,956.822,939.0,133600,982.0,933.0
262,2015/09/17,987.0,979.478,968.0,177900,990.0,953.0
263,2015/09/18,987.0,991.304,985.0,234700,1006.0,974.0
264,2015/09/24,958.0,964.208,968.0,179700,983.0,945.0
265,2015/09/25,979.0,971.942,959.0,124800,997.0,956.0
266,2015/09/28,1019.0,1008.963,979.0,218300,1022.0,973.0
267,2015/09/29,967.0,976.344,1000.0,133300,1005.0,963.0
268,2015/09/30,993.0,996.5,988.0,155500,1011.0,986.0
269,2015/10/01,991.0,987.614,997.0,113600,1000.0,969.0
270,2015/10/02,980.0,973.635,992.0,108400,992.0,962.0
271,2015/10/05,984.0,984.129,989.0,54900,993.0,978.0
272,2015/10/06,1006.0,1004.526,993.0,122400,1015.0,991.0
273,2015/10/07,1083.0,1059.963,1017.0,328700,1087.0,1012.0
274,2015/10/08,1038.0,1046.407,1053.0,110100,1065.0,1036.0
275,2015/10/09,1054.0,1047.425,1031.0,132200,1054.0,1031.0
276,2015/10/13,1074.0,1071.055,1057.0,110300,1083.0,1053.0
277,2015/10/14,1036.0,1055.095,1080.0,117300,1086.0,1034.0
278,2015/10/15,1067.0,1066.384,1062.0,91000,1079.0,1050.0
279,2015/10/16,1053.0,1066.704,1076.0,93100,1088.0,1045.0
280,2015/10/19,1059.0,1063.844,1055.0,57200,1074.0,1053.0
281,2015/10/20,1060.0,1078.055,1070.0,113600,1095.0,1060.0
282,2015/10/21,1084.0,1086.659,1055.0,113600,1095.0,1055.0
283,2015/10/22,1066.0,1069.461,1076.0,138300,1097.0,1057.0
284,2015/10/23,1066.0,1071.306,1088.0,93300,1095.0,1059.0
285,2015/10/26,1081.0,1093.696,1070.0,179500,1108.0,1070.0
286,2015/10/27,1096.0,1105.445,1090.0,132700,1117.0,1090.0
287,2015/10/28,1097.0,1094.355,1096.0,84700,1107.0,1077.0
288,2015/10/29,1124.0,1117.69,1097.0,148800,1128.0,1097.0
289,2015/10/30,1122.0,1131.454,1130.0,112300,1146.0,1116.0
290,2015/11/02,1110.0,1109.525,1112.0,89700,1119.0,1092.0
291,2015/11/04,1104.0,1123.337,1125.0,115300,1148.0,1103.0
292,2015/11/05,1120.0,1115.826,1121.0,78700,1129.0,1100.0
293,2015/11/06,1094.0,1103.472,1120.0,146800,1143.0,1084.0
294,2015/11/09,1076.0,1086.05,1085.0,142600,1116.0,1072.0
295,2015/11/10,1067.0,1072.349,1073.0,81100,1082.0,1060.0
296,2015/11/11,1091.0,1084.217,1070.0,87900,1098.0,1065.0
297,2015/11/12,1069.0,1073.444,1073.0,77700,1088.0,1066.0
298,2015/11/13,1122.0,1084.967,1060.0,214500,1128.0,1037.0
299,2015/11/16,1163.0,1142.728,1122.0,319500,1171.0,1090.0
300,2015/11/17,1188.0,1182.448,1192.0,137200,1194.0,1160.0
301,2015/11/18,1185.0,1191.652,1197.0,204300,1205.0,1175.0
302,2015/11/19,1181.0,1179.48,1183.0,207900,1200.0,1156.0
303,2015/11/20,1165.0,1165.23,1178.0,178800,1178.0,1153.0
304,2015/11/24,1173.0,1168.786,1166.0,154500,1179.0,1153.0
305,2015/11/25,1187.0,1190.476,1173.0,224800,1207.0,1165.0
306,2015/11/26,1185.0,1178.949,1185.0,98200,1194.0,1167.0
307,2015/11/27,1171.0,1184.408,1199.0,140100,1199.0,1168.0
308,2015/11/30,1186.0,1178.93,1179.0,211200,1186.0,1166.0
309,2015/12/01,1176.0,1185.325,1184.0,232300,1200.0,1169.0
310,2015/12/02,1193.0,1175.761,1166.0,170500,1200.0,1156.0
311,2015/12/03,1222.0,1209.196,1183.0,381800,1226.0,1183.0
312,2015/12/04,1134.0,1144.013,1191.0,622900,1191.0,1115.0
313,2015/12/07,1074.0,1093.636,1149.0,723200,1151.0,1070.0
314,2015/12/08,1081.0,1077.133,1070.0,381000,1095.0,1051.0
315,2015/12/09,1016.0,1031.027,1065.0,446600,1068.0,1013.0
316,2015/12/10,999.0,998.412,1003.0,381800,1007.0,986.0
317,2015/12/11,999.0,995.933,995.0,290700,1007.0,981.0
318,2015/12/14,983.0,978.112,976.0,314700,990.0,965.0
319,2015/12/15,957.0,970.329,998.0,284600,998.0,955.0
320,2015/12/16,956.0,964.312,971.0,281500,982.0,953.0
321,2015/12/17,983.0,985.156,980.0,288700,997.0,977.0
322,2015/12/18,958.0,965.985,972.0,386000,986.0,953.0
323,2015/12/21,944.0,934.583,941.0,299800,949.0,924.0
324,2015/12/22,948.0,948.331,935.0,194000,963.0,935.0
325,2015/12/24,939.0,944.85,957.0,268200,966.0,936.0
326,2015/12/25,940.0,935.05,939.0,205200,943.0,923.0
327,2015/12/28,949.0,945.303,923.0,129500,959.0,923.0
328,2015/12/29,952.0,949.595,946.0,135700,966.0,933.0
329,2015/12/30,947.0,949.405,963.0,125800,964.0,939.0
330,2016/01/04,917.0,927.742,952.0,141600,952.0,913.0
331,2016/01/05,924.0,913.971,902.0,201100,931.0,902.0
332,2016/01/06,905.0,904.893,910.0,139700,929.0,892.0
333,2016/01/07,884.0,892.34,893.0,181000,917.0,877.0
334,2016/01/08,906.0,902.833,872.0,203500,927.0,871.0
335,2016/01/12,830.0,852.263,886.0,302000,886.0,828.0
336,2016/01/13,859.0,863.108,840.0,252500,874.0,840.0
337,2016/01/14,848.0,837.858,830.0,223900,854.0,823.0
338,2016/01/15,842.0,855.857,873.0,144400,880.0,838.0
339,2016/01/18,798.0,805.87,812.0,330000,820.0,791.0
340,2016/01/19,827.0,818.331,801.0,187300,834.0,799.0
341,2016/01/20,758.0,782.769,829.0,357100,833.0,752.0
342,2016/01/21,719.0,746.938,750.0,507800,774.0,715.0
343,2016/01/22,781.0,754.398,740.0,375900,783.0,728.0
344,2016/01/25,811.0,804.338,811.0,295800,815.0,786.0
345,2016/01/26,769.0,787.338,800.0,210400,808.0,766.0
346,2016/01/27,796.0,793.695,780.0,117300,807.0,780.0
347,2016/01/28,815.0,805.947,799.0,199100,818.0,784.0
348,2016/01/29,830.0,814.865,823.0,296600,840.0,785.0
349,2016/02/01,876.0,866.618,852.0,251300,885.0,851.0
350,2016/02/02,903.0,908.619,890.0,432300,924.0,888.0
351,2016/02/03,844.0,855.035,877.0,167500,877.0,841.0
352,2016/02/04,827.0,834.805,844.0,110500,850.0,824.0
353,2016/02/05,811.0,811.537,815.0,91300,827.0,796.0
354,2016/02/08,821.0,814.718,787.0,136500,831.0,786.0
355,2016/02/09,764.0,770.804,785.0,162100,795.0,750.0
356,2016/02/10,714.0,723.812,767.0,289500,772.0,687.0
357,2016/02/12,638.0,635.195,619.0,513400,669.0,616.0
358,2016/02/15,675.0,658.104,651.0,511800,682.0,634.0
359,2016/02/16,674.0,683.792,655.0,505000,707.0,652.0
360,2016/02/17,674.0,680.408,665.0,213100,706.0,655.0
361,2016/02/18,708.0,705.699,705.0,151800,714.0,693.0
362,2016/02/19,680.0,681.609,697.0,142200,697.0,671.0
363,2016/02/22,646.0,651.923,666.0,325900,670.0,636.0
364,2016/02/23,648.0,652.315,654.0,221900,664.0,643.0
365,2016/02/24,648.0,651.205,653.0,171300,668.0,636.0
366,2016/02/25,689.0,678.719,652.0,220600,691.0,652.0
367,2016/02/26,689.0,692.293,700.0,213500,712.0,677.0
368,2016/02/29,733.0,722.658,700.0,434000,738.0,692.0
369,2016/03/01,634.0,627.896,678.0,1944200,680.0,592.0
370,2016/03/02,680.0,657.163,654.0,902000,680.0,638.0
371,2016/03/03,677.0,687.862,690.0,938500,725.0,655.0
372,2016/03/04,711.0,700.42,686.0,539700,717.0,679.0
373,2016/03/07,728.0,735.609,745.0,587100,750.0,724.0
374,2016/03/08,710.0,710.224,727.0,434000,728.0,700.0
375,2016/03/09,682.0,686.888,701.0,455400,703.0,676.0
376,2016/03/10,688.0,691.641,690.0,380800,708.0,686.0
377,2016/03/11,703.0,689.787,685.0,446000,705.0,671.0
378,2016/03/14,717.0,717.638,717.0,217400,727.0,710.0
379,2016/03/15,715.0,719.161,729.0,296600,735.0,707.0
380,2016/03/16,708.0,709.956,715.0,135300,718.0,704.0
381,2016/03/17,712.0,713.733,709.0,239800,725.0,704.0
382,2016/03/18,716.0,712.8,709.0,177300,722.0,707.0
383,2016/03/22,738.0,731.848,729.0,331200,739.0,723.0
384,2016/03/23,728.0,732.292,745.0,196900,745.0,724.0
385,2016/03/24,712.0,715.148,725.0,255000,729.0,709.0
386,2016/03/25,732.0,719.889,709.0,278500,734.0,703.0
387,2016/03/28,735.0,732.016,732.0,189100,744.0,721.0
388,2016/03/29,738.0,730.376,727.0,172800,740.0,719.0
389,2016/03/30,736.0,732.924,733.0,236500,743.0,723.0
390,2016/03/31,760.0,754.683,740.0,340800,767.0,740.0
391,2016/04/01,722.0,728.051,772.0,417500,772.0,716.0
392,2016/04/04,685.0,690.475,704.0,441400,708.0,679.0
393,2016/04/05,652.0,666.125,686.0,299400,686.0,650.0
394,2016/04/06,639.0,639.942,651.0,363100,657.0,627.0
395,2016/04/07,639.0,640.679,637.0,185700,654.0,628.0
396,2016/04/08,662.0,651.054,629.0,267600,673.0,623.0
397,2016/04/11,671.0,658.628,662.0,153100,672.0,646.0
398,2016/04/12,683.0,683.526,678.0,141300,692.0,672.0
399,2016/04/13,687.0,687.188,688.0,184200,693.0,679.0
400,2016/04/14,695.0,689.188,695.0,346200,698.0,678.0
401,2016/04/15,691.0,687.208,687.0,247800,696.0,680.0
402,2016/04/18,658.0,661.694,672.0,155000,672.0,652.0
403,2016/04/19,693.0,690.105,676.0,192300,699.0,675.0
404,2016/04/20,714.0,716.515,700.0,238300,732.0,699.0
405,2016/04/21,721.0,720.849,727.0,146100,727.0,713.0
406,2016/04/22,734.0,723.979,715.0,217300,734.0,709.0
407,2016/04/25,723.0,726.602,742.0,147200,742.0,716.0
408,2016/04/26,707.0,707.614,715.0,154800,719.0,695.0
409,2016/04/27,704.0,703.576,707.0,120400,711.0,697.0
410,2016/04/28,684.0,701.114,705.0,189300,724.0,680.0
411,2016/05/02,665.0,660.167,665.0,198100,670.0,652.0
412,2016/05/06,659.0,661.002,671.0,109800,679.0,653.0
413,2016/05/09,669.0,671.103,669.0,109000,676.0,667.0
414,2016/05/10,695.0,685.395,669.0,149900,697.0,667.0
415,2016/05/11,690.0,691.618,700.0,74300,700.0,687.0
416,2016/05/12,697.0,690.562,679.0,121200,699.0,677.0
417,2016/05/13,796.0,756.519,704.0,830600,797.0,690.0
418,2016/05/16,740.0,754.951,786.0,537100,789.0,730.0
419,2016/05/17,818.0,797.197,740.0,560300,832.0,740.0
420,2016/05/18,833.0,830.98,817.0,416300,845.0,801.0
421,2016/05/19,823.0,821.186,831.0,206800,837.0,806.0
422,2016/05/20,850.0,847.496,827.0,216400,858.0,822.0
423,2016/05/23,847.0,845.706,850.0,107600,855.0,832.0
424,2016/05/24,864.0,865.002,851.0,196000,873.0,851.0
425,2016/05/25,862.0,863.971,868.0,109100,878.0,856.0
426,2016/05/26,840.0,848.331,868.0,110400,868.0,836.0
427,2016/05/27,844.0,847.604,848.0,91300,855.0,837.0
428,2016/05/30,847.0,846.655,848.0,53100,854.0,840.0
429,2016/05/31,845.0,845.1,841.0,55800,851.0,841.0
430,2016/06/01,843.0,845.319,841.0,84400,856.0,835.0
431,2016/06/02,818.0,822.387,830.0,101600,834.0,813.0
432,2016/06/03,818.0,819.857,818.0,102100,834.0,812.0
433,2016/06/06,806.0,803.201,814.0,97100,814.0,792.0
434,2016/06/07,818.0,816.945,802.0,129800,824.0,802.0
435,2016/06/08,825.0,819.708,819.0,80500,826.0,811.0
436,2016/06/09,821.0,826.586,835.0,73200,838.0,818.0
437,2016/06/10,815.0,816.627,821.0,95000,826.0,809.0
438,2016/06/13,769.0,780.31,794.0,130100,799.0,767.0
439,2016/06/14,735.0,743.865,759.0,131400,773.0,729.0
440,2016/06/15,763.0,758.346,752.0,141500,775.0,749.0
441,2016/06/16,725.0,733.65,771.0,84000,773.0,713.0
442,2016/06/17,719.0,721.905,733.0,136100,743.0,707.0
443,2016/06/20,756.0,751.874,734.0,64900,765.0,734.0
444,2016/06/21,763.0,758.241,753.0,45200,768.0,744.0
445,2016/06/22,742.0,745.436,749.0,66500,761.0,735.0
446,2016/06/23,757.0,752.498,742.0,42800,764.0,742.0
447,2016/06/24,688.0,702.577,770.0,179200,775.0,670.0
448,2016/06/27,707.0,700.833,707.0,77600,720.0,691.0
449,2016/06/28,722.0,712.613,695.0,139100,733.0,685.0
450,2016/06/29,736.0,736.797,744.0,57600,744.0,725.0
451,2016/06/30,731.0,742.715,762.0,49900,762.0,730.0
452,2016/07/01,726.0,730.667,734.0,57000,744.0,723.0
453,2016/07/04,744.0,739.518,729.0,42700,750.0,727.0
454,2016/07/05,744.0,742.64,753.0,57000,753.0,736.0
455,2016/07/06,733.0,726.654,745.0,89800,745.0,711.0
456,2016/07/07,725.0,727.147,726.0,107200,742.0,722.0
457,2016/07/08,693.0,703.954,732.0,87000,732.0,691.0
458,2016/07/11,729.0,727.53,718.0,83100,737.0,712.0
459,2016/07/12,736.0,743.378,744.0,89400,749.0,734.0
460,2016/07/13,731.0,738.632,749.0,101300,753.0,723.0
461,2016/07/14,746.0,743.637,737.0,99500,750.0,730.0
462,2016/07/15,750.0,748.575,761.0,109200,761.0,738.0
463,2016/07/19,745.0,740.146,751.0,92200,753.0,731.0
464,2016/07/20,745.0,748.914,750.0,68300,760.0,740.0
465,2016/07/21,747.0,748.316,755.0,42400,755.0,743.0
466,2016/07/22,731.0,732.466,735.0,51700,743.0,722.0
467,2016/07/25,717.0,721.374,731.0,105500,740.0,712.0
468,2016/07/26,689.0,692.655,706.0,192900,708.0,683.0
469,2016/07/27,699.0,700.579,699.0,94900,710.0,694.0
470,2016/07/28,688.0,691.731,705.0,120500,709.0,685.0
471,2016/07/29,713.0,702.742,688.0,104400,716.0,688.0
472,2016/08/01,702.0,702.753,714.0,95000,716.0,696.0
473,2016/08/02,694.0,695.932,695.0,131700,706.0,688.0
474,2016/08/03,676.0,679.631,680.0,172000,690.0,673.0
475,2016/08/04,678.0,674.795,675.0,123100,689.0,667.0
476,2016/08/05,670.0,670.767,678.0,138800,680.0,668.0
477,2016/08/08,678.0,677.96,675.0,116200,684.0,674.0
478,2016/08/09,693.0,689.491,682.0,129200,695.0,682.0
479,2016/08/10,677.0,680.097,698.0,192900,698.0,672.0
480,2016/08/12,737.0,720.594,687.0,518600,754.0,678.0
481,2016/08/15,798.0,786.937,760.0,512000,811.0,755.0
482,2016/08/16,783.0,792.51,800.0,265600,813.0,775.0
483,2016/08/17,799.0,786.974,769.0,227100,800.0,769.0
484,2016/08/18,785.0,793.223,792.0,188100,807.0,780.0
485,2016/08/19,824.0,811.901,793.0,257500,824.0,793.0
486,2016/08/22,851.0,845.069,840.0,228500,853.0,825.0
487,2016/08/23,847.0,849.116,855.0,250100,859.0,835.0
488,2016/08/24,882.0,875.16,851.0,323400,885.0,851.0
489,2016/08/25,924.0,913.757,895.0,370200,927.0,895.0
490,2016/08/26,924.0,928.025,924.0,304900,954.0,914.0
491,2016/08/29,970.0,961.837,954.0,373700,972.0,942.0
492,2016/08/30,973.0,970.343,959.0,221900,977.0,953.0
493,2016/08/31,999.0,994.836,988.0,334600,1000.0,984.0
494,2016/09/01,986.0,991.503,999.0,347600,1005.0,976.0
495,2016/09/02,962.0,965.298,977.0,249400,982.0,951.0
496,2016/09/05,978.0,975.809,972.0,183400,992.0,955.0
497,2016/09/06,963.0,964.957,969.0,156800,974.0,956.0
498,2016/09/07,987.0,977.243,949.0,155800,993.0,945.0
499,2016/09/08,987.0,984.775,989.0,78700,990.0,974.0
500,2016/09/09,996.0,993.848,992.0,131900,1000.0,979.0
501,2016/09/12,987.0,982.545,977.0,91500,993.0,974.0
502,2016/09/13,980.0,974.688,990.0,115000,990.0,966.0
503,2016/09/14,917.0,925.048,954.0,383300,957.0,909.0
504,2016/09/15,923.0,916.725,917.0,197300,925.0,901.0
505,2016/09/16,937.0,933.82,925.0,162300,944.0,915.0
506,2016/09/20,922.0,919.794,930.0,177300,931.0,910.0
507,2016/09/21,947.0,928.929,918.0,127500,949.0,908.0
508,2016/09/23,943.0,942.373,961.0,138800,961.0,932.0
509,2016/09/26,930.0,932.073,940.0,85100,940.0,926.0
510,2016/09/27,934.0,914.913,920.0,174600,934.0,897.0
511,2016/09/28,922.0,915.502,923.0,108200,929.0,908.0
512,2016/09/29,918.0,916.342,922.0,112400,925.0,909.0
513,2016/09/30,899.0,901.13,901.0,136700,910.0,894.0
514,2016/10/03,912.0,913.374,897.0,97800,925.0,897.0
515,2016/10/04,916.0,909.169,914.0,90700,916.0,901.0
516,2016/10/05,915.0,920.78,920.0,97800,932.0,910.0
517,2016/10/06,934.0,931.881,924.0,116400,939.0,913.0
518,2016/10/07,911.0,915.217,935.0,62600,935.0,907.0
519,2016/10/11,900.0,903.412,906.0,93700,920.0,896.0
520,2016/10/12,873.0,879.515,892.0,101400,892.0,871.0
521,2016/10/13,892.0,888.536,879.0,148400,896.0,877.0
522,2016/10/14,909.0,905.363,894.0,128300,918.0,891.0
523,2016/10/17,923.0,919.251,919.0,102900,924.0,911.0
524,2016/10/18,898.0,897.198,919.0,134700,919.0,892.0
525,2016/10/19,924.0,912.825,898.0,169200,924.0,896.0
526,2016/10/20,924.0,926.178,921.0,91400,934.0,918.0
527,2016/10/21,899.0,903.927,925.0,145900,925.0,896.0
528,2016/10/24,913.0,910.782,905.0,50000,917.0,901.0
529,2016/10/25,919.0,917.612,911.0,91500,923.0,911.0
530,2016/10/26,906.0,903.891,914.0,92800,921.0,898.0
531,2016/10/27,929.0,923.96,909.0,113600,933.0,905.0
532,2016/10/28,920.0,919.736,934.0,93700,934.0,910.0
533,2016/10/31,931.0,929.157,920.0,118400,937.0,919.0
534,2016/11/01,906.0,905.388,923.0,93600,923.0,897.0
535,2016/11/02,918.0,905.587,897.0,157000,919.0,892.0
536,2016/11/04,901.0,894.07,910.0,100900,910.0,884.0
537,2016/11/07,932.0,923.916,917.0,114000,932.0,912.0
538,2016/11/08,932.0,937.821,938.0,99800,950.0,931.0
539,2016/11/09,879.0,887.65,945.0,156300,945.0,865.0
540,2016/11/10,933.0,927.944,909.0,166000,938.0,909.0
541,2016/11/11,927.0,930.286,939.0,67800,948.0,920.0
542,2016/11/14,949.0,956.13,932.0,201500,987.0,932.0
543,2016/11/15,890.0,900.794,950.0,301300,956.0,883.0
544,2016/11/16,886.0,886.875,900.0,221000,905.0,881.0
545,2016/11/17,884.0,877.938,885.0,156900,891.0,872.0
546,2016/11/18,885.0,884.375,884.0,119600,889.0,878.0
547,2016/11/21,894.0,893.44,896.0,63600,897.0,889.0
548,2016/11/22,895.0,894.564,898.0,72900,898.0,889.0
549,2016/11/24,891.0,891.237,900.0,111100,900.0,886.0
550,2016/11/25,884.0,881.916,894.0,152600,894.0,874.0
551,2016/11/28,888.0,880.099,884.0,81800,888.0,874.0
552,2016/11/29,908.0,900.261,883.0,141400,908.0,878.0
553,2016/11/30,899.0,899.741,908.0,214800,912.0,892.0
554,2016/12/01,888.0,889.063,906.0,194100,907.0,884.0
555,2016/12/02,882.0,878.988,887.0,232500,887.0,873.0
556,2016/12/05,843.0,851.896,881.0,549100,881.0,840.0
557,2016/12/06,837.0,834.968,845.0,318200,851.0,828.0
558,2016/12/07,860.0,856.514,837.0,195100,863.0,837.0
559,2016/12/08,862.0,855.106,859.0,182900,862.0,846.0
560,2016/12/09,878.0,871.614,867.0,177600,879.0,862.0
561,2016/12/12,873.0,871.74,884.0,244900,888.0,862.0
562,2016/12/13,884.0,880.755,871.0,116500,886.0,870.0
563,2016/12/14,880.0,883.996,886.0,139600,893.0,876.0
564,2016/12/15,887.0,885.935,890.0,112000,890.0,881.0
565,2016/12/16,881.0,876.599,886.0,151000,889.0,869.0
566,2016/12/19,860.0,864.765,875.0,182400,878.0,856.0
567,2016/12/20,880.0,872.744,859.0,141900,881.0,858.0
568,2016/12/21,855.0,861.39,870.0,231700,874.0,853.0
569,2016/12/22,847.0,844.062,855.0,223900,855.0,840.0
570,2016/12/26,839.0,840.75,846.0,256500,853.0,837.0
571,2016/12/27,841.0,838.436,838.0,218000,844.0,834.0
572,2016/12/28,828.0,824.693,825.0,163300,830.0,815.0
573,2016/12/29,821.0,817.737,820.0,210400,826.0,807.0
574,2016/12/30,815.0,810.252,821.0,206300,822.0,803.0
575,2017/01/04,869.0,854.148,825.0,361800,869.0,825.0
576,2017/01/05,852.0,850.368,866.0,163800,866.0,845.0
577,2017/01/06,846.0,844.902,838.0,108400,851.0,836.0
578,2017/01/10,834.0,836.301,846.0,173300,846.0,829.0
579,2017/01/11,821.0,825.312,838.0,129700,838.0,821.0
580,2017/01/12,824.0,819.855,822.0,183400,830.0,809.0
581,2017/01/13,823.0,821.901,819.0,71700,829.0,816.0
582,2017/01/16,812.0,815.231,828.0,126200,828.0,807.0
583,2017/01/17,796.0,798.291,805.0,246800,807.0,792.0
584,2017/01/18,794.0,784.77,791.0,166700,796.0,777.0
585,2017/01/19,808.0,806.382,806.0,124100,813.0,797.0
586,2017/01/20,799.0,799.11,806.0,119100,806.0,793.0
587,2017/01/23,801.0,797.974,795.0,106400,805.0,790.0
588,2017/01/24,826.0,822.55,806.0,268200,838.0,806.0
589,2017/01/25,815.0,817.449,828.0,170100,834.0,811.0
590,2017/01/26,809.0,810.973,820.0,139500,820.0,804.0
591,2017/01/27,811.0,806.851,810.0,161900,813.0,797.0
592,2017/01/30,818.0,809.669,806.0,180200,824.0,794.0
593,2017/01/31,807.0,806.772,807.0,148900,815.0,800.0
594,2017/02/01,805.0,802.107,800.0,144200,810.0,797.0
595,2017/02/02,793.0,800.887,808.0,122900,820.0,793.0
596,2017/02/03,778.0,782.799,793.0,254600,797.0,775.0
597,2017/02/06,775.0,774.583,784.0,212200,786.0,770.0
598,2017/02/07,776.0,773.511,775.0,89200,778.0,769.0
599,2017/02/08,786.0,783.004,775.0,95400,797.0,775.0
600,2017/02/09,787.0,789.307,785.0,102600,798.0,784.0
601,2017/02/10,798.0,795.964,795.0,95100,799.0,790.0
602,2017/02/13,802.0,798.507,800.0,139200,805.0,791.0
603,2017/02/14,835.0,811.011,805.0,463400,835.0,781.0
604,2017/02/15,866.0,866.808,842.0,761600,877.0,839.0
605,2017/02/16,810.0,819.454,856.0,412800,856.0,807.0
606,2017/02/17,814.0,811.931,808.0,344900,822.0,801.0
607,2017/02/20,833.0,826.258,812.0,232400,834.0,812.0
608,2017/02/21,829.0,828.561,831.0,95600,833.0,825.0
609,2017/02/22,840.0,833.82,823.0,186700,840.0,823.0
610,2017/02/23,847.0,854.561,845.0,243700,868.0,842.0
611,2017/02/24,847.0,850.209,845.0,143400,859.0,837.0
612,2017/02/27,817.0,822.813,834.0,214800,839.0,816.0
613,2017/02/28,816.0,820.202,825.0,227500,834.0,812.0
614,2017/03/01,813.0,808.555,818.0,157900,819.0,801.0
615,2017/03/02,856.0,847.785,828.0,375200,858.0,828.0
616,2017/03/03,843.0,855.341,859.0,186100,863.0,842.0
617,2017/03/06,821.0,825.566,840.0,152300,840.0,820.0
618,2017/03/07,845.0,848.79,822.0,392300,860.0,822.0
619,2017/03/08,877.0,871.168,845.0,459500,883.0,845.0
620,2017/03/09,893.0,892.457,883.0,468800,903.0,879.0
621,2017/03/10,866.0,878.483,899.0,229100,900.0,864.0
622,2017/03/13,888.0,885.116,866.0,208200,898.0,864.0
623,2017/03/14,889.0,893.197,891.0,218900,903.0,885.0
624,2017/03/15,860.0,870.498,895.0,276700,895.0,859.0
625,2017/03/16,855.0,854.901,850.0,391000,866.0,845.0
626,2017/03/17,843.0,845.103,852.0,336300,852.0,836.0
627,2017/03/21,854.0,849.486,840.0,205000,860.0,834.0
628,2017/03/22,819.0,827.717,835.0,219400,841.0,818.0
629,2017/03/23,808.0,813.204,820.0,184200,826.0,806.0
630,2017/03/24,806.0,804.966,805.0,258200,811.0,802.0
631,2017/03/27,816.0,815.921,806.0,293500,821.0,805.0
632,2017/03/28,828.0,824.724,824.0,150500,828.0,819.0
633,2017/03/29,837.0,833.948,839.0,184300,839.0,823.0
634,2017/03/30,818.0,828.451,837.0,219500,841.0,817.0
635,2017/03/31,804.0,812.295,826.0,223500,833.0,804.0
636,2017/04/03,806.0,802.827,809.0,347400,814.0,792.0
637,2017/04/04,789.0,797.182,812.0,299900,823.0,783.0
638,2017/04/05,784.0,787.809,796.0,239100,801.0,780.0
639,2017/04/06,778.0,776.529,784.0,211600,786.0,769.0
640,2017/04/07,803.0,800.235,788.0,392500,815.0,787.0
641,2017/04/10,804.0,809.741,811.0,143900,819.0,803.0
642,2017/04/11,809.0,810.178,806.0,170700,817.0,800.0
643,2017/04/12,801.0,805.893,800.0,248000,821.0,796.0
644,2017/04/13,789.0,788.203,795.0,213700,798.0,783.0
645,2017/04/14,775.0,778.343,782.0,157800,788.0,773.0
646,2017/04/17,785.0,780.378,777.0,82200,785.0,775.0
647,2017/04/18,777.0,777.466,785.0,209100,793.0,772.0
648,2017/04/19,776.0,773.668,776.0,156800,778.0,769.0
649,2017/04/20,783.0,782.897,782.0,128300,789.0,774.0
650,2017/04/21,781.0,782.496,787.0,94000,788.0,778.0
651,2017/04/24,781.0,779.813,787.0,122800,788.0,775.0
652,2017/04/25,795.0,792.743,786.0,218600,798.0,781.0
653,2017/04/26,805.0,804.346,805.0,212800,812.0,799.0
654,2017/04/27,816.0,811.768,810.0,181500,816.0,805.0
655,2017/04/28,804.0,806.9,819.0,144700,819.0,803.0
656,2017/05/01,833.0,821.308,802.0,278300,836.0,802.0
657,2017/05/02,831.0,832.784,833.0,158900,837.0,826.0
658,2017/05/08,840.0,840.52,839.0,165300,847.0,832.0
659,2017/05/09,836.0,842.602,840.0,198100,849.0,834.0
660,2017/05/10,843.0,843.902,836.0,159500,851.0,834.0
661,2017/05/11,829.0,838.037,842.0,421000,862.0,821.0
662,2017/05/12,824.0,818.377,831.0,194000,831.0,809.0
663,2017/05/15,814.0,816.639,818.0,99900,821.0,813.0
664,2017/05/16,827.0,824.996,824.0,202300,832.0,820.0
665,2017/05/17,820.0,820.491,823.0,106800,827.0,817.0
666,2017/05/18,805.0,802.227,805.0,168600,810.0,797.0
667,2017/05/19,804.0,798.853,804.0,189900,808.0,792.0
668,2017/05/22,806.0,808.142,805.0,209700,817.0,802.0
669,2017/05/23,803.0,805.254,809.0,258200,813.0,798.0
670,2017/05/24,801.0,801.107,811.0,258800,811.0,798.0
671,2017/05/25,817.0,814.918,800.0,304200,827.0,800.0
672,2017/05/26,807.0,809.555,818.0,116300,818.0,806.0
673,2017/05/29,803.0,804.504,813.0,101200,813.0,801.0
674,2017/05/30,804.0,800.646,801.0,117000,806.0,797.0
675,2017/05/31,802.0,800.802,799.0,105400,805.0,798.0
676,2017/06/01,805.0,802.87,799.0,95400,806.0,798.0
677,2017/06/02,817.0,814.784,806.0,191500,819.0,804.0
678,2017/06/05,815.0,817.832,817.0,90500,826.0,812.0
679,2017/06/06,797.0,805.88,812.0,120800,820.0,796.0
680,2017/06/07,793.0,792.344,797.0,172500,798.0,789.0
681,2017/06/08,787.0,788.842,793.0,153500,797.0,785.0
682,2017/06/09,788.0,788.769,789.0,131400,796.0,786.0
683,2017/06/12,789.0,789.383,787.0,96900,794.0,786.0
684,2017/06/13,794.0,791.485,787.0,77400,794.0,787.0
685,2017/06/14,807.0,808.999,806.0,155400,815.0,805.0
686,2017/06/15,816.0,816.072,811.0,210800,825.0,807.0
687,2017/06/16,824.0,822.722,817.0,310900,826.0,813.0
688,2017/06/19,839.0,835.682,825.0,281400,843.0,824.0
689,2017/06/20,853.0,850.535,840.0,272900,857.0,837.0
690,2017/06/21,845.0,853.517,853.0,208400,861.0,845.0
691,2017/06/22,875.0,882.259,862.0,560500,896.0,861.0
692,2017/06/23,866.0,877.591,870.0,331100,894.0,859.0
693,2017/06/26,878.0,880.431,870.0,164800,887.0,867.0
694,2017/06/27,884.0,886.037,883.0,141800,890.0,881.0
695,2017/06/28,880.0,883.675,885.0,142900,893.0,877.0
696,2017/06/29,897.0,894.993,890.0,309100,904.0,885.0
697,2017/06/30,891.0,891.718,890.0,138000,898.0,886.0
698,2017/07/03,898.0,895.243,885.0,147600,902.0,883.0
699,2017/07/04,893.0,900.485,898.0,169600,908.0,890.0
700,2017/07/05,898.0,895.234,893.0,109100,902.0,884.0
701,2017/07/06,892.0,894.549,890.0,88000,903.0,890.0
702,2017/07/07,870.0,876.37,882.0,164700,887.0,868.0
703,2017/07/10,869.0,869.43,867.0,64000,873.0,863.0
704,2017/07/11,876.0,874.945,873.0,51300,879.0,871.0
705,2017/07/12,861.0,866.557,876.0,56600,876.0,861.0
706,2017/07/13,846.0,850.212,860.0,127100,860.0,844.0
707,2017/07/14,847.0,846.227,844.0,105100,852.0,839.0
708,2017/07/18,857.0,855.646,860.0,130800,864.0,849.0
709,2017/07/19,839.0,840.774,852.0,173600,854.0,837.0
710,2017/07/20,846.0,845.965,839.0,56300,852.0,839.0
711,2017/07/21,852.0,849.956,845.0,81000,854.0,842.0
712,2017/07/24,855.0,851.269,853.0,83300,856.0,846.0
713,2017/07/25,848.0,853.299,859.0,85200,860.0,847.0
714,2017/07/26,848.0,851.247,846.0,63100,860.0,845.0
715,2017/07/27,851.0,855.117,857.0,73400,862.0,850.0
716,2017/07/28,841.0,841.373,848.0,62500,850.0,834.0
717,2017/07/31,842.0,842.57,843.0,86900,847.0,837.0
718,2017/08/01,842.0,838.628,843.0,110600,846.0,832.0
719,2017/08/02,867.0,858.988,842.0,167400,868.0,841.0
720,2017/08/03,873.0,871.625,867.0,136100,885.0,862.0
721,2017/08/04,882.0,878.907,879.0,149700,887.0,865.0
722,2017/08/07,890.0,892.192,892.0,187200,900.0,884.0
723,2017/08/08,896.0,893.12,890.0,119400,897.0,887.0
724,2017/08/09,885.0,883.632,894.0,109100,894.0,877.0
725,2017/08/10,864.0,874.074,872.0,182600,893.0,853.0
726,2017/08/14,791.0,795.825,838.0,407600,841.0,776.0
727,2017/08/15,781.0,782.473,790.0,306300,792.0,777.0
728,2017/08/16,790.0,789.674,783.0,144400,795.0,782.0
729,2017/08/17,786.0,780.159,787.0,199800,788.0,769.0
730,2017/08/18,774.0,774.396,779.0,176200,779.0,771.0
731,2017/08/21,780.0,780.452,784.0,79800,784.0,777.0
732,2017/08/22,778.0,775.622,779.0,98100,779.0,772.0
733,2017/08/23,771.0,774.433,784.0,100800,784.0,770.0
734,2017/08/24,778.0,773.167,771.0,107900,779.0,766.0
735,2017/08/25,782.0,781.011,778.0,98500,786.0,774.0
736,2017/08/28,792.0,791.85,792.0,222000,800.0,782.0
737,2017/08/29,789.0,785.923,786.0,101300,790.0,781.0
738,2017/08/30,791.0,790.022,790.0,120900,796.0,785.0
739,2017/08/31,805.0,800.739,792.0,156200,810.0,789.0
740,2017/09/01,806.0,803.152,809.0,137700,809.0,794.0
741,2017/09/04,786.0,793.375,803.0,100100,808.0,785.0
742,2017/09/05,772.0,776.497,786.0,122900,788.0,770.0
743,2017/09/06,767.0,765.594,766.0,111200,771.0,761.0
744,2017/09/07,769.0,769.002,782.0,141300,782.0,763.0
745,2017/09/08,765.0,764.447,765.0,106300,768.0,761.0
746,2017/09/11,777.0,780.156,777.0,101400,787.0,774.0
747,2017/09/12,785.0,784.193,784.0,71600,788.0,779.0
748,2017/09/13,787.0,787.108,785.0,54600,790.0,784.0
749,2017/09/14,782.0,782.795,784.0,63900,788.0,779.0
750,2017/09/15,779.0,778.806,778.0,68600,784.0,775.0
751,2017/09/19,786.0,787.363,785.0,130400,792.0,782.0
752,2017/09/20,784.0,783.111,786.0,95200,789.0,780.0
753,2017/09/21,795.0,793.668,788.0,119700,797.0,785.0
754,2017/09/22,793.0,795.56,796.0,145600,805.0,790.0
755,2017/09/25,806.0,809.675,801.0,135500,819.0,801.0
756,2017/09/26,819.0,814.894,807.0,133000,819.0,807.0
757,2017/09/27,828.0,825.703,822.0,99000,829.0,821.0
758,2017/09/28,863.0,859.842,837.0,272500,872.0,836.0
759,2017/09/29,872.0,869.329,861.0,155200,874.0,855.0
760,2017/10/02,869.0,869.055,874.0,118000,875.0,863.0
761,2017/10/03,909.0,901.437,874.0,272600,910.0,874.0
762,2017/10/04,903.0,910.292,910.0,201300,926.0,903.0
763,2017/10/05,891.0,895.231,900.0,80200,903.0,889.0
764,2017/10/06,911.0,908.435,903.0,139700,914.0,898.0
765,2017/10/10,905.0,914.005,915.0,255600,926.0,902.0
766,2017/10/11,909.0,908.206,905.0,92700,915.0,901.0
767,2017/10/12,910.0,916.283,911.0,72200,922.0,910.0
768,2017/10/13,903.0,904.386,900.0,101900,911.0,899.0
769,2017/10/16,888.0,889.924,900.0,103900,900.0,885.0
770,2017/10/17,879.0,877.534,880.0,139200,886.0,872.0
771,2017/10/18,865.0,864.883,872.0,148200,884.0,860.0
772,2017/10/19,874.0,871.115,867.0,107600,876.0,866.0
773,2017/10/20,863.0,868.304,878.0,71300,878.0,863.0
774,2017/10/23,877.0,871.292,864.0,100200,879.0,863.0
775,2017/10/24,887.0,898.809,907.0,408000,907.0,870.0
776,2017/10/25,866.0,874.57,887.0,97500,888.0,864.0
777,2017/10/26,873.0,871.773,868.0,59000,877.0,865.0
778,2017/10/27,884.0,881.561,880.0,81500,887.0,877.0
779,2017/10/30,883.0,881.279,885.0,90300,887.0,877.0
780,2017/10/31,894.0,889.846,880.0,92600,895.0,877.0
781,2017/11/01,885.0,888.013,890.0,81900,895.0,885.0
782,2017/11/02,890.0,889.564,893.0,72400,894.0,885.0
783,2017/11/06,890.0,888.035,886.0,73400,892.0,883.0
784,2017/11/07,892.0,887.309,885.0,103900,892.0,880.0
785,2017/11/08,892.0,888.289,887.0,60600,893.0,881.0
786,2017/11/09,900.0,896.561,900.0,156300,904.0,886.0
787,2017/11/10,824.0,855.09,883.0,551300,917.0,811.0
788,2017/11/13,860.0,834.148,819.0,418600,865.0,800.0
789,2017/11/14,872.0,860.726,864.0,146500,874.0,841.0
790,2017/11/15,836.0,843.098,868.0,210100,873.0,830.0
791,2017/11/16,838.0,839.537,843.0,87100,849.0,834.0
792,2017/11/17,846.0,843.702,850.0,84800,859.0,834.0
793,2017/11/20,858.0,850.507,846.0,100400,860.0,836.0
794,2017/11/21,868.0,865.0,860.0,103600,873.0,849.0
795,2017/11/22,868.0,865.054,874.0,81400,874.0,859.0
796,2017/11/24,887.0,878.78,857.0,122900,889.0,856.0
797,2017/11/27,901.0,899.34,891.0,270400,910.0,886.0
798,2017/11/28,951.0,945.196,910.0,446300,961.0,910.0
799,2017/11/29,984.0,973.768,961.0,301800,986.0,960.0
800,2017/11/30,994.0,995.243,992.0,229800,1005.0,984.0
801,2017/12/01,997.0,998.664,981.0,193000,1008.0,981.0
802,2017/12/04,1004.0,1006.512,1000.0,163400,1018.0,988.0
803,2017/12/05,999.0,999.874,992.0,177400,1010.0,990.0
804,2017/12/06,984.0,983.602,984.0,159600,998.0,971.0
805,2017/12/07,985.0,985.211,985.0,116000,994.0,978.0
806,2017/12/08,995.0,979.328,958.0,138500,995.0,958.0
807,2017/12/11,1016.0,1012.607,990.0,237300,1025.0,990.0
808,2017/12/12,1013.0,1017.197,1016.0,113900,1030.0,1011.0
809,2017/12/13,1023.0,1024.761,1022.0,105400,1033.0,1019.0
810,2017/12/14,1026.0,1028.484,1030.0,157500,1040.0,1021.0
811,2017/12/15,1038.0,1030.823,1017.0,236600,1042.0,1013.0
812,2017/12/18,1074.0,1067.76,1058.0,247000,1080.0,1047.0
813,2017/12/19,1089.0,1083.759,1067.0,205900,1093.0,1061.0
814,2017/12/20,1111.0,1104.284,1100.0,139700,1116.0,1080.0
815,2017/12/21,1121.0,1114.787,1114.0,140500,1124.0,1101.0
816,2017/12/22,1121.0,1116.125,1121.0,642800,1129.0,1084.0
817,2017/12/25,1125.0,1128.778,1130.0,181100,1144.0,1120.0
818,2017/12/26,1139.0,1136.085,1136.0,134600,1142.0,1129.0
819,2017/12/27,1139.0,1133.903,1114.0,181300,1147.0,1105.0
820,2017/12/28,1131.0,1140.695,1129.0,199900,1164.0,1121.0
821,2017/12/29,1130.0,1130.794,1139.0,99000,1154.0,1118.0
822,2018/01/04,1161.0,1162.975,1156.0,378200,1197.0,1147.0
823,2018/01/05,1203.0,1215.06,1171.0,414100,1254.0,1171.0
824,2018/01/09,1152.0,1164.896,1223.0,384700,1233.0,1138.0
825,2018/01/10,1133.0,1127.557,1138.0,368400,1145.0,1106.0
826,2018/01/11,1129.0,1123.968,1122.0,462400,1142.0,1110.0
827,2018/01/12,1144.0,1133.535,1116.0,210600,1150.0,1116.0
828,2018/01/15,1155.0,1156.717,1145.0,162800,1171.0,1145.0
829,2018/01/16,1136.0,1157.039,1165.0,187700,1177.0,1136.0
830,2018/01/17,1115.0,1116.568,1131.0,106400,1131.0,1108.0
831,2018/01/18,1123.0,1131.242,1128.0,93800,1141.0,1120.0
832,2018/01/19,1135.0,1136.196,1126.0,102400,1143.0,1125.0
833,2018/01/22,1158.0,1153.29,1147.0,123500,1160.0,1145.0
834,2018/01/23,1171.0,1177.824,1160.0,107400,1188.0,1160.0
835,2018/01/24,1155.0,1160.157,1169.0,75700,1170.0,1154.0
836,2018/01/25,1139.0,1145.202,1148.0,51500,1153.0,1139.0
837,2018/01/26,1160.0,1158.343,1140.0,79500,1171.0,1140.0
838,2018/01/29,1169.0,1166.572,1166.0,63600,1178.0,1148.0
839,2018/01/30,1159.0,1156.279,1155.0,111900,1174.0,1142.0
840,2018/01/31,1134.0,1146.096,1150.0,159000,1168.0,1134.0
841,2018/02/01,1173.0,1162.604,1137.0,135500,1180.0,1136.0
842,2018/02/02,1188.0,1174.408,1160.0,97500,1190.0,1151.0
843,2018/02/05,1155.0,1151.39,1154.0,155600,1168.0,1132.0
844,2018/02/06,1071.0,1052.008,1050.0,320100,1084.0,1022.0
845,2018/02/07,1070.0,1092.787,1101.0,132800,1140.0,1064.0
846,2018/02/08,1087.0,1084.008,1085.0,75700,1095.0,1068.0
847,2018/02/09,1061.0,1052.89,1035.0,94900,1066.0,1035.0
848,2018/02/13,1134.0,1107.142,1062.0,492800,1143.0,1039.0
849,2018/02/14,1170.0,1174.968,1140.0,420100,1197.0,1140.0
850,2018/02/15,1210.0,1198.983,1180.0,301400,1225.0,1144.0
851,2018/02/16,1189.0,1195.176,1203.0,128500,1212.0,1174.0
852,2018/02/19,1248.0,1239.255,1201.0,210500,1263.0,1192.0
853,2018/02/20,1269.0,1267.045,1248.0,157400,1285.0,1247.0
854,2018/02/21,1299.0,1296.797,1270.0,174500,1315.0,1270.0
855,2018/02/22,1339.0,1335.922,1321.0,423500,1364.0,1298.0
856,2018/02/23,1430.0,1409.067,1352.0,494800,1430.0,1352.0
857,2018/02/26,1426.0,1426.558,1430.0,249100,1455.0,1406.0
858,2018/02/27,1438.0,1433.157,1450.0,225100,1463.0,1416.0
859,2018/02/28,1487.0,1482.414,1438.0,348000,1513.0,1436.0
860,2018/03/01,1478.0,1466.229,1475.0,176400,1487.0,1440.0
861,2018/03/02,1474.0,1469.327,1448.0,183700,1486.0,1420.0
862,2018/03/05,1516.0,1515.655,1468.0,340700,1551.0,1461.0
863,2018/03/06,1450.0,1504.895,1529.0,484600,1559.0,1447.0
864,2018/03/07,1455.0,1460.836,1450.0,239700,1489.0,1436.0
865,2018/03/08,1444.0,1457.621,1471.0,132200,1478.0,1441.0
866,2018/03/09,1454.0,1453.825,1439.0,257400,1469.0,1422.0
867,2018/03/12,1462.0,1472.782,1465.0,282000,1511.0,1446.0
868,2018/03/13,1496.0,1477.406,1456.0,235000,1506.0,1430.0
869,2018/03/14,1472.0,1474.117,1466.0,155000,1491.0,1454.0
870,2018/03/15,1432.0,1442.155,1477.0,121000,1480.0,1430.0
871,2018/03/16,1414.0,1417.553,1433.0,124800,1438.0,1407.0
872,2018/03/19,1379.0,1387.249,1405.0,102600,1414.0,1370.0
873,2018/03/20,1398.0,1394.025,1364.0,93300,1414.0,1358.0
874,2018/03/22,1395.0,1388.957,1388.0,112000,1401.0,1371.0
875,2018/03/23,1335.0,1337.559,1350.0,118100,1362.0,1324.0
876,2018/03/26,1324.0,1304.727,1310.0,111100,1330.0,1279.0
877,2018/03/27,1393.0,1387.084,1350.0,111500,1405.0,1345.0
878,2018/03/28,1364.0,1370.229,1392.0,72200,1400.0,1347.0
879,2018/03/29,1369.0,1364.676,1380.0,79600,1380.0,1348.0
880,2018/03/30,1383.0,1382.723,1383.0,63900,1395.0,1372.0
881,2018/04/02,1401.0,1402.261,1390.0,54800,1416.0,1382.0
882,2018/04/03,1402.0,1397.519,1380.0,67200,1411.0,1372.0
883,2018/04/04,1414.0,1414.534,1406.0,70100,1427.0,1395.0
884,2018/04/05,1399.0,1401.462,1430.0,50000,1430.0,1387.0
885,2018/04/06,1383.0,1381.307,1392.0,80600,1392.0,1369.0
886,2018/04/09,1408.0,1402.079,1405.0,120900,1409.0,1378.0
887,2018/04/10,1377.0,1373.125,1404.0,134000,1404.0,1353.0
888,2018/04/11,1374.0,1369.291,1379.0,75400,1381.0,1352.0
889,2018/04/12,1338.0,1346.326,1355.0,83100,1364.0,1332.0
890,2018/04/13,1334.0,1335.593,1339.0,64600,1351.0,1323.0
891,2018/04/16,1313.0,1315.356,1333.0,55600,1334.0,1303.0
892,2018/04/17,1281.0,1276.807,1288.0,191100,1313.0,1237.0
893,2018/04/18,1365.0,1339.39,1290.0,194200,1368.0,1265.0
894,2018/04/19,1374.0,1366.781,1350.0,141400,1390.0,1350.0
895,2018/04/20,1358.0,1369.293,1370.0,79600,1388.0,1341.0
896,2018/04/23,1364.0,1367.739,1350.0,80900,1386.0,1348.0
897,2018/04/24,1352.0,1355.412,1364.0,43200,1372.0,1347.0
898,2018/04/25,1367.0,1361.443,1352.0,42900,1372.0,1347.0
899,2018/04/26,1383.0,1374.438,1367.0,53700,1386.0,1352.0
900,2018/04/27,1365.0,1362.156,1384.0,77800,1384.0,1345.0
901,2018/05/01,1356.0,1344.191,1365.0,111500,1365.0,1321.0
902,2018/05/02,1353.0,1347.408,1356.0,44900,1361.0,1332.0
903,2018/05/07,1358.0,1358.129,1355.0,37200,1368.0,1348.0
904,2018/05/08,1360.0,1361.491,1350.0,48700,1378.0,1347.0
905,2018/05/09,1366.0,1364.06,1366.0,84700,1374.0,1342.0
906,2018/05/10,1429.0,1427.157,1378.0,235900,1462.0,1363.0
907,2018/05/11,1411.0,1319.243,1378.0,387000,1442.0,1262.0
908,2018/05/14,1380.0,1391.062,1412.0,115500,1433.0,1359.0
909,2018/05/15,1315.0,1322.507,1384.0,127500,1392.0,1300.0
910,2018/05/16,1312.0,1310.764,1314.0,53400,1325.0,1303.0
911,2018/05/17,1324.0,1319.171,1312.0,32100,1326.0,1307.0
912,2018/05/18,1346.0,1339.268,1325.0,52600,1351.0,1312.0
913,2018/05/21,1405.0,1425.051,1397.0,233700,1462.0,1391.0
914,2018/05/22,1376.0,1386.786,1413.0,90900,1413.0,1368.0
915,2018/05/23,1388.0,1383.476,1372.0,95800,1397.0,1356.0
916,2018/05/24,1328.0,1339.893,1381.0,86800,1394.0,1315.0
917,2018/05/25,1337.0,1325.293,1313.0,139000,1344.0,1305.0
918,2018/05/28,1278.0,1295.204,1337.0,107300,1337.0,1278.0
919,2018/05/29,1302.0,1297.278,1282.0,63000,1311.0,1282.0
920,2018/05/30,1280.0,1278.628,1281.0,51000,1289.0,1267.0
921,2018/05/31,1269.0,1277.315,1300.0,106000,1302.0,1261.0
922,2018/06/01,1294.0,1294.996,1280.0,69800,1303.0,1271.0
923,2018/06/04,1273.0,1289.364,1309.0,136600,1309.0,1271.0
924,2018/06/05,1263.0,1264.033,1296.0,126200,1300.0,1246.0
925,2018/06/06,1290.0,1292.497,1280.0,70900,1307.0,1271.0
926,2018/06/07,1332.0,1325.931,1329.0,107300,1337.0,1312.0
927,2018/06/08,1303.0,1303.991,1313.0,76400,1315.0,1289.0
928,2018/06/11,1302.0,1286.168,1301.0,99900,1307.0,1267.0
929,2018/06/12,1304.0,1303.563,1315.0,62400,1317.0,1295.0
930,2018/06/13,1346.0,1341.775,1306.0,94600,1355.0,1304.0
931,2018/06/14,1312.0,1321.916,1341.0,45400,1341.0,1311.0
932,2018/06/15,1286.0,1285.56,1300.0,72800,1303.0,1272.0
933,2018/06/18,1274.0,1270.526,1293.0,49100,1293.0,1260.0
934,2018/06/19,1241.0,1253.692,1260.0,83000,1280.0,1237.0
935,2018/06/20,1239.0,1227.355,1250.0,78300,1250.0,1200.0
936,2018/06/21,1218.0,1226.228,1242.0,66100,1256.0,1216.0
937,2018/06/22,1208.0,1210.347,1207.0,97400,1224.0,1201.0
938,2018/06/25,1204.0,1224.308,1210.0,309900,1264.0,1196.0
939,2018/06/26,1226.0,1217.553,1176.0,243800,1245.0,1176.0
940,2018/06/27,1216.0,1215.836,1214.0,81300,1230.0,1197.0
941,2018/06/28,1193.0,1194.066,1215.0,247400,1236.0,1177.0
942,2018/06/29,1217.0,1201.798,1199.0,183000,1224.0,1171.0
943,2018/07/02,1205.0,1227.178,1218.0,132500,1260.0,1199.0
944,2018/07/03,1238.0,1228.292,1204.0,93400,1239.0,1204.0
945,2018/07/04,1236.0,1234.672,1226.0,61000,1248.0,1217.0
946,2018/07/05,1184.0,1201.225,1244.0,59100,1244.0,1178.0
947,2018/07/06,1207.0,1195.36,1197.0,85500,1210.0,1175.0
948,2018/07/09,1227.0,1216.241,1216.0,37700,1230.0,1196.0
949,2018/07/10,1199.0,1210.672,1227.0,44200,1231.0,1199.0
950,2018/07/11,1200.0,1189.607,1183.0,87800,1206.0,1166.0
951,2018/07/12,1258.0,1255.743,1210.0,151100,1279.0,1209.0
952,2018/07/13,1256.0,1259.895,1265.0,67300,1274.0,1246.0
953,2018/07/17,1303.0,1293.473,1280.0,118900,1310.0,1266.0
954,2018/07/18,1330.0,1321.518,1315.0,87600,1347.0,1299.0
955,2018/07/19,1308.0,1316.793,1330.0,89700,1335.0,1301.0
956,2018/07/20,1331.0,1325.099,1308.0,75700,1338.0,1305.0
957,2018/07/23,1328.0,1333.946,1329.0,136500,1356.0,1308.0
958,2018/07/24,1322.0,1329.59,1331.0,108800,1350.0,1310.0
959,2018/07/25,1319.0,1321.263,1335.0,72900,1335.0,1311.0
960,2018/07/26,1357.0,1343.864,1320.0,94400,1361.0,1317.0
961,2018/07/27,1381.0,1376.889,1366.0,70400,1386.0,1352.0
962,2018/07/30,1381.0,1374.964,1382.0,82400,1386.0,1360.0
963,2018/07/31,1331.0,1337.961,1378.0,123300,1378.0,1306.0
964,2018/08/01,1357.0,1352.897,1335.0,55100,1367.0,1335.0
965,2018/08/02,1331.0,1352.482,1358.0,86100,1375.0,1330.0
966,2018/08/03,1284.0,1295.128,1318.0,81900,1323.0,1278.0
967,2018/08/06,1254.0,1273.682,1289.0,98100,1289.0,1252.0
968,2018/08/07,1268.0,1257.198,1250.0,42900,1268.0,1241.0
969,2018/08/08,1270.0,1277.077,1273.0,54600,1286.0,1267.0
970,2018/08/09,1289.0,1276.523,1284.0,57800,1289.0,1259.0
971,2018/08/10,1277.0,1274.663,1286.0,250900,1334.0,1212.0
972,2018/08/13,1382.0,1355.656,1330.0,234200,1386.0,1319.0
973,2018/08/14,1322.0,1326.81,1385.0,133000,1386.0,1302.0
974,2018/08/15,1301.0,1301.83,1315.0,87100,1323.0,1289.0
975,2018/08/16,1269.0,1268.641,1287.0,74400,1295.0,1254.0
976,2018/08/17,1291.0,1287.085,1280.0,46900,1299.0,1279.0
977,2018/08/20,1253.0,1272.307,1300.0,67700,1315.0,1245.0
978,2018/08/21,1294.0,1273.832,1265.0,99300,1296.0,1253.0
979,2018/08/22,1318.0,1320.316,1299.0,118400,1341.0,1286.0
980,2018/08/23,1328.0,1327.038,1330.0,78700,1346.0,1313.0
981,2018/08/24,1358.0,1349.701,1345.0,89600,1369.0,1326.0
982,2018/08/27,1314.0,1345.657,1360.0,121400,1389.0,1311.0
983,2018/08/28,1359.0,1349.033,1327.0,70400,1364.0,1324.0
984,2018/08/29,1346.0,1356.103,1374.0,35100,1377.0,1344.0
985,2018/08/30,1362.0,1359.069,1354.0,44800,1377.0,1340.0
986,2018/08/31,1362.0,1363.646,1359.0,44300,1374.0,1347.0
987,2018/09/03,1319.0,1325.337,1352.0,48400,1352.0,1310.0
988,2018/09/04,1334.0,1324.892,1313.0,48900,1341.0,1308.0
989,2018/09/05,1327.0,1317.491,1325.0,96700,1332.0,1298.0
990,2018/09/06,1340.0,1330.063,1320.0,69800,1344.0,1303.0
991,2018/09/07,1395.0,1378.534,1351.0,216800,1403.0,1348.0
992,2018/09/10,1452.0,1445.455,1425.0,190000,1456.0,1421.0
993,2018/09/11,1434.0,1449.861,1469.0,131200,1485.0,1433.0
994,2018/09/12,1438.0,1421.294,1449.0,129400,1449.0,1401.0
995,2018/09/13,1460.0,1449.744,1441.0,149900,1466.0,1430.0
996,2018/09/14,1454.0,1457.381,1460.0,166400,1472.0,1440.0
997,2018/09/18,1511.0,1503.994,1475.0,224100,1529.0,1461.0
998,2018/09/19,1529.0,1527.431,1518.0,305300,1537.0,1493.0
999,2018/09/20,1571.0,1556.147,1531.0,127600,1577.0,1511.0
1000,2018/09/21,1628.0,1613.024,1580.0,189600,1637.0,1580.0
1001,2018/09/25,1590.0,1589.924,1620.0,190100,1620.0,1563.0
1002,2018/09/26,1601.0,1596.289,1579.0,73600,1608.0,1579.0
1003,2018/09/27,1615.0,1630.195,1635.0,118000,1648.0,1613.0
1004,2018/09/28,1605.0,1611.828,1610.0,81400,1642.0,1597.0
1005,2018/10/01,1576.0,1580.093,1565.0,76400,1600.0,1561.0
1006,2018/10/02,1561.0,1574.756,1577.0,89300,1607.0,1561.0
1007,2018/10/03,1533.0,1538.281,1550.0,126500,1569.0,1520.0
1008,2018/10/04,1546.0,1536.303,1533.0,117200,1553.0,1513.0
1009,2018/10/05,1548.0,1554.022,1550.0,90400,1565.0,1544.0
1010,2018/10/09,1521.0,1529.643,1531.0,91300,1553.0,1517.0
1011,2018/10/10,1533.0,1539.012,1520.0,89800,1558.0,1515.0
1012,2018/10/11,1481.0,1475.687,1480.0,210000,1493.0,1442.0
1013,2018/10/12,1504.0,1501.456,1480.0,123200,1524.0,1475.0
1014,2018/10/15,1505.0,1521.485,1500.0,124800,1546.0,1491.0
1015,2018/10/16,1505.0,1499.694,1500.0,79600,1510.0,1478.0
1016,2018/10/17,1525.0,1525.71,1541.0,78000,1542.0,1512.0
1017,2018/10/18,1541.0,1557.488,1536.0,92700,1580.0,1535.0
1018,2018/10/19,1536.0,1525.958,1517.0,54700,1550.0,1500.0
1019,2018/10/22,1497.0,1504.615,1510.0,62000,1526.0,1487.0
1020,2018/10/23,1476.0,1493.116,1507.0,132000,1511.0,1471.0
1021,2018/10/24,1516.0,1508.82,1488.0,93200,1540.0,1472.0
1022,2018/10/25,1433.0,1448.27,1476.0,99200,1476.0,1429.0
1023,2018/10/26,1411.0,1424.286,1483.0,119000,1483.0,1403.0
1024,2018/10/29,1400.0,1410.546,1409.0,128300,1430.0,1398.0
1025,2018/10/30,1417.0,1409.504,1399.0,158000,1423.0,1386.0
1026,2018/10/31,1430.0,1433.046,1436.0,135900,1460.0,1415.0
1027,2018/11/01,1443.0,1443.047,1430.0,110400,1464.0,1413.0
1028,2018/11/02,1458.0,1447.927,1450.0,112800,1465.0,1426.0
1029,2018/11/05,1432.0,1441.772,1460.0,105100,1464.0,1426.0
1030,2018/11/06,1446.0,1447.624,1432.0,63800,1460.0,1432.0
1031,2018/11/07,1430.0,1440.692,1463.0,126400,1463.0,1424.0
1032,2018/11/08,1443.0,1443.206,1450.0,98800,1451.0,1435.0
1033,2018/11/09,1462.0,1463.332,1444.0,80500,1476.0,1444.0
1034,2018/11/12,1425.0,1436.496,1462.0,66300,1462.0,1425.0
1035,2018/11/13,1339.0,1288.484,1413.0,777700,1465.0,1155.0
1036,2018/11/14,1338.0,1318.98,1340.0,287700,1345.0,1283.0
1037,2018/11/15,1409.0,1384.399,1334.0,505700,1419.0,1322.0
1038,2018/11/16,1367.0,1377.966,1409.0,344600,1409.0,1361.0
1039,2018/11/19,1358.0,1363.888,1353.0,102600,1386.0,1348.0
1040,2018/11/20,1336.0,1347.64,1350.0,94000,1371.0,1331.0
1041,2018/11/21,1336.0,1331.059,1331.0,97800,1349.0,1295.0
1042,2018/11/22,1384.0,1381.044,1366.0,158400,1395.0,1341.0
1043,2018/11/26,1416.0,1407.674,1370.0,217400,1426.0,1367.0
1044,2018/11/27,1451.0,1457.23,1426.0,173600,1476.0,1425.0
1045,2018/11/28,1416.0,1419.032,1441.0,122700,1462.0,1403.0
1046,2018/11/29,1409.0,1414.336,1428.0,100100,1444.0,1398.0
1047,2018/11/30,1369.0,1372.398,1416.0,499100,1416.0,1353.0
1048,2018/12/03,1406.0,1400.527,1360.0,193500,1423.0,1352.0
1049,2018/12/04,1386.0,1393.87,1400.0,116200,1415.0,1385.0
1050,2018/12/05,1400.0,1396.247,1367.0,119100,1411.0,1362.0
1051,2018/12/06,1382.0,1380.244,1385.0,126100,1398.0,1354.0
1052,2018/12/07,1417.0,1405.833,1387.0,127400,1427.0,1375.0
1053,2018/12/10,1382.0,1382.393,1399.0,99300,1408.0,1368.0
1054,2018/12/11,1421.0,1412.093,1395.0,142200,1430.0,1381.0
1055,2018/12/12,1472.0,1462.029,1438.0,152300,1489.0,1417.0
1056,2018/12/13,1486.0,1483.529,1480.0,143600,1505.0,1465.0
1057,2018/12/14,1472.0,1483.038,1480.0,221700,1496.0,1456.0
1058,2018/12/17,1474.0,1465.57,1461.0,87700,1482.0,1433.0
1059,2018/12/18,1431.0,1430.771,1453.0,115900,1453.0,1413.0
1060,2018/12/19,1446.0,1438.196,1431.0,89100,1449.0,1406.0
1061,2018/12/20,1370.0,1387.008,1443.0,107200,1443.0,1362.0
1062,2018/12/21,1340.0,1331.986,1349.0,182300,1360.0,1314.0
1063,2018/12/25,1298.0,1304.754,1370.0,127800,1378.0,1275.0
1064,2018/12/26,1318.0,1315.308,1283.0,147000,1335.0,1281.0
1065,2018/12/27,1395.0,1386.972,1359.0,140700,1402.0,1354.0
1066,2018/12/28,1418.0,1420.036,1402.0,86200,1435.0,1400.0
1067,2019/01/04,1398.0,1388.43,1399.0,105200,1402.0,1372.0
1068,2019/01/07,1430.0,1435.798,1438.0,123700,1459.0,1421.0
1069,2019/01/08,1425.0,1431.572,1427.0,63300,1445.0,1408.0
1070,2019/01/09,1463.0,1469.922,1455.0,77700,1489.0,1454.0
1071,2019/01/10,1493.0,1494.463,1441.0,321200,1512.0,1428.0
1072,2019/01/11,1509.0,1503.941,1513.0,47300,1516.0,1486.0
1073,2019/01/15,1532.0,1522.01,1485.0,58100,1538.0,1475.0
1074,2019/01/16,1558.0,1553.024,1532.0,100400,1566.0,1523.0
1075,2019/01/17,1571.0,1572.102,1568.0,158400,1583.0,1558.0
1076,2019/01/18,1584.0,1585.361,1585.0,83400,1595.0,1577.0
1077,2019/01/21,1590.0,1595.88,1585.0,111000,1611.0,1583.0
1078,2019/01/22,1571.0,1577.456,1550.0,119100,1595.0,1526.0
1079,2019/01/23,1545.0,1552.196,1539.0,99900,1575.0,1534.0
1080,2019/01/24,1543.0,1546.755,1541.0,153000,1567.0,1524.0
1081,2019/01/25,1572.0,1564.731,1549.0,168000,1585.0,1525.0
1082,2019/01/28,1557.0,1561.848,1574.0,74500,1575.0,1546.0
1083,2019/01/29,1570.0,1559.769,1536.0,104200,1574.0,1525.0
1084,2019/01/30,1558.0,1570.933,1575.0,116600,1599.0,1558.0
1085,2019/01/31,1593.0,1587.89,1561.0,91200,1597.0,1560.0
1086,2019/02/01,1579.0,1589.571,1599.0,93200,1619.0,1576.0
1087,2019/02/04,1592.0,1594.187,1608.0,108700,1619.0,1582.0
1088,2019/02/05,1611.0,1610.076,1600.0,198300,1632.0,1590.0
1089,2019/02/06,1628.0,1628.762,1630.0,122900,1637.0,1613.0
1090,2019/02/07,1646.0,1644.566,1628.0,241300,1654.0,1619.0
1091,2019/02/08,1658.0,1646.487,1623.0,193700,1658.0,1612.0
1092,2019/02/12,1641.0,1630.691,1649.0,226000,1649.0,1585.0
1093,2019/02/13,1745.0,1700.113,1650.0,551800,1754.0,1630.0
1094,2019/02/14,1856.0,1824.116,1740.0,613300,1874.0,1740.0
1095,2019/02/15,1917.0,1895.678,1841.0,500400,1924.0,1836.0
1096,2019/02/18,1973.0,1969.739,1929.0,365400,1998.0,1929.0
1097,2019/02/19,1995.0,1990.626,1968.0,296400,2008.0,1948.0
1098,2019/02/20,1947.0,1946.356,1975.0,393100,1975.0,1926.0
1099,2019/02/21,1981.0,1969.759,1962.0,198600,1982.0,1950.0
1100,2019/02/22,1933.0,1941.818,1954.0,182600,1964.0,1924.0
1101,2019/02/25,1872.0,1887.565,1927.0,401200,1936.0,1861.0
1102,2019/02/26,1881.0,1890.623,1880.0,167700,1912.0,1872.0
1103,2019/02/27,1846.0,1843.375,1868.0,231200,1872.0,1825.0
1104,2019/02/28,1823.0,1834.036,1864.0,185100,1868.0,1822.0
1105,2019/03/01,1833.0,1832.534,1816.0,191400,1855.0,1778.0
1106,2019/03/04,1841.0,1836.528,1845.0,143500,1854.0,1811.0
1107,2019/03/05,1825.0,1824.657,1827.0,110200,1838.0,1811.0
1108,2019/03/06,1833.0,1831.96,1812.0,119900,1844.0,1806.0
1109,2019/03/07,1832.0,1827.376,1826.0,162000,1836.0,1815.0
1110,2019/03/08,1794.0,1808.734,1806.0,144600,1840.0,1787.0
1111,2019/03/11,1817.0,1824.304,1802.0,177700,1846.0,1802.0
1112,2019/03/12,1817.0,1833.844,1822.0,287600,1873.0,1809.0
1113,2019/03/13,1852.0,1849.504,1823.0,181200,1860.0,1818.0
1114,2019/03/14,1858.0,1871.354,1869.0,165400,1901.0,1857.0
1115,2019/03/15,1849.0,1868.058,1885.0,476100,1908.0,1844.0
1116,2019/03/18,1814.0,1832.72,1876.0,121100,1884.0,1810.0
1117,2019/03/19,1804.0,1810.537,1792.0,106900,1834.0,1789.0
1118,2019/03/20,1804.0,1804.169,1806.0,72600,1816.0,1793.0
1119,2019/03/22,1776.0,1781.12,1803.0,117900,1819.0,1761.0
1120,2019/03/25,1719.0,1727.968,1763.0,154900,1763.0,1706.0
1121,2019/03/26,1787.0,1777.356,1743.0,149800,1791.0,1736.0
1122,2019/03/27,1787.0,1790.806,1802.0,127500,1812.0,1777.0
1123,2019/03/28,1836.0,1822.135,1784.0,167900,1842.0,1776.0
1124,2019/03/29,1861.0,1850.857,1834.0,123400,1865.0,1815.0
1125,2019/04/01,1897.0,1891.231,1880.0,157300,1901.0,1874.0
1126,2019/04/02,1911.0,1912.834,1919.0,186600,1936.0,1902.0
1127,2019/04/03,1917.0,1911.126,1900.0,53800,1919.0,1890.0
1128,2019/04/04,1881.0,1891.068,1920.0,61400,1920.0,1868.0
1129,2019/04/05,1919.0,1913.135,1904.0,69100,1921.0,1894.0
1130,2019/04/08,1929.0,1927.703,1920.0,75700,1936.0,1915.0
1131,2019/04/09,1956.0,1949.026,1925.0,124200,1966.0,1921.0
1132,2019/04/10,1940.0,1933.362,1928.0,60800,1946.0,1917.0
1133,2019/04/11,1947.0,1949.723,1947.0,57400,1958.0,1941.0
1134,2019/04/12,1947.0,1940.236,1948.0,37300,1949.0,1926.0
1135,2019/04/15,1973.0,1974.454,1961.0,103900,1993.0,1961.0
1136,2019/04/16,1948.0,1953.591,1970.0,50400,1971.0,1939.0
1137,2019/04/17,1927.0,1932.105,1953.0,67000,1955.0,1921.0
1138,2019/04/18,1923.0,1924.737,1927.0,71100,1942.0,1915.0
1139,2019/04/19,1890.0,1901.791,1942.0,73500,1942.0,1888.0
1140,2019/04/22,1877.0,1866.62,1885.0,69000,1885.0,1845.0
1141,2019/04/23,1889.0,1878.78,1870.0,60400,1891.0,1860.0
1142,2019/04/24,1865.0,1872.264,1888.0,52600,1894.0,1863.0
1143,2019/04/25,1870.0,1861.144,1885.0,76200,1885.0,1831.0
1144,2019/04/26,1876.0,1869.428,1870.0,57700,1883.0,1846.0
1145,2019/05/07,1874.0,1878.984,1866.0,116900,1899.0,1862.0
1146,2019/05/08,1796.0,1811.269,1859.0,133100,1863.0,1796.0
1147,2019/05/09,1829.0,1808.474,1795.0,153300,1836.0,1758.0
1148,2019/05/10,1712.0,1804.038,1845.0,530900,1987.0,1668.0
1149,2019/05/13,1739.0,1727.665,1687.0,218800,1765.0,1644.0
1150,2019/05/14,1787.0,1748.492,1730.0,228600,1791.0,1710.0
1151,2019/05/15,1833.0,1813.768,1800.0,95000,1836.0,1784.0
1152,2019/05/16,1816.0,1814.074,1830.0,67800,1843.0,1790.0
1153,2019/05/17,1806.0,1805.913,1834.0,81900,1834.0,1796.0
1154,2019/05/20,1774.0,1778.662,1804.0,50000,1827.0,1767.0
1155,2019/05/21,1741.0,1746.316,1769.0,50000,1770.0,1733.0
1156,2019/05/22,1759.0,1757.153,1741.0,60200,1765.0,1735.0
1157,2019/05/23,1740.0,1751.251,1759.0,45500,1779.0,1739.0
1158,2019/05/24,1753.0,1742.66,1745.0,110600,1768.0,1716.0
1159,2019/05/27,1754.0,1750.458,1753.0,24700,1763.0,1738.0
1160,2019/05/28,1751.0,1745.123,1750.0,71000,1753.0,1729.0
1161,2019/05/29,1735.0,1737.943,1733.0,42200,1760.0,1728.0
1162,2019/05/30,1699.0,1696.537,1724.0,92400,1724.0,1678.0
1163,2019/05/31,1693.0,1692.474,1693.0,95200,1708.0,1670.0
1164,2019/06/03,1649.0,1652.094,1668.0,98700,1674.0,1636.0
1165,2019/06/04,1614.0,1618.862,1655.0,88400,1655.0,1606.0
1166,2019/06/05,1638.0,1636.078,1648.0,96400,1648.0,1620.0
1167,2019/06/06,1619.0,1618.6,1640.0,79000,1641.0,1606.0
1168,2019/06/07,1529.0,1556.653,1601.0,490600,1602.0,1529.0
1169,2019/06/10,1600.0,1574.713,1559.0,229600,1600.0,1538.0
1170,2019/06/11,1592.0,1579.064,1589.0,88800,1592.0,1558.0
1171,2019/06/12,1565.0,1569.738,1591.0,126900,1595.0,1552.0
1172,2019/06/13,1545.0,1545.288,1562.0,89800,1564.0,1534.0
1173,2019/06/14,1522.0,1528.556,1550.0,99500,1551.0,1517.0
1174,2019/06/17,1515.0,1516.21,1515.0,95700,1530.0,1502.0
1175,2019/06/18,1442.0,1457.778,1512.0,246800,1515.0,1435.0
1176,2019/06/19,1494.0,1485.064,1460.0,138600,1498.0,1450.0
1177,2019/06/20,1463.0,1462.066,1475.0,131400,1483.0,1445.0
1178,2019/06/21,1450.0,1463.123,1471.0,138800,1487.0,1450.0
1179,2019/06/24,1514.0,1515.079,1480.0,349300,1538.0,1470.0
1180,2019/06/25,1525.0,1557.38,1589.0,553300,1629.0,1516.0
1181,2019/06/26,1518.0,1529.21,1519.0,173600,1555.0,1498.0
1182,2019/06/27,1547.0,1535.354,1529.0,111200,1549.0,1513.0
1183,2019/06/28,1521.0,1523.599,1545.0,111500,1550.0,1505.0
1184,2019/07/01,1568.0,1557.956,1553.0,111900,1573.0,1539.0
1185,2019/07/02,1621.0,1603.796,1575.0,155700,1625.0,1569.0
1186,2019/07/03,1602.0,1607.479,1609.0,136000,1621.0,1590.0
1187,2019/07/04,1608.0,1604.922,1596.0,61300,1614.0,1596.0
1188,2019/07/05,1597.0,1599.327,1608.0,87200,1610.0,1591.0
1189,2019/07/08,1604.0,1609.686,1602.0,136400,1623.0,1595.0
1190,2019/07/09,1563.0,1570.038,1599.0,179500,1606.0,1554.0
1191,2019/07/10,1528.0,1531.613,1548.0,122500,1548.0,1523.0
1192,2019/07/11,1540.0,1529.757,1528.0,62500,1540.0,1515.0
1193,2019/07/12,1513.0,1519.673,1546.0,97900,1546.0,1508.0
1194,2019/07/16,1474.0,1476.759,1500.0,168400,1500.0,1466.0
1195,2019/07/17,1515.0,1509.405,1491.0,112200,1521.0,1489.0
1196,2019/07/18,1461.0,1474.099,1505.0,137100,1505.0,1458.0
1197,2019/07/19,1519.0,1500.5,1466.0,99400,1520.0,1459.0
1198,2019/07/22,1534.0,1537.968,1524.0,108300,1551.0,1519.0
1199,2019/07/23,1545.0,1542.352,1530.0,62800,1550.0,1530.0
1200,2019/07/24,1567.0,1571.902,1562.0,160400,1591.0,1550.0
1201,2019/07/25,1629.0,1618.357,1599.0,199300,1646.0,1579.0
1202,2019/07/26,1629.0,1621.388,1621.0,105100,1640.0,1601.0
1203,2019/07/29,1623.0,1632.682,1640.0,129800,1655.0,1616.0
1204,2019/07/30,1664.0,1651.08,1628.0,297300,1670.0,1621.0
1205,2019/07/31,1611.0,1613.857,1642.0,171400,1650.0,1593.0
1206,2019/08/01,1645.0,1626.942,1590.0,133900,1650.0,1571.0
1207,2019/08/02,1592.0,1592.697,1605.0,155500,1611.0,1574.0
1208,2019/08/05,1540.0,1532.152,1581.0,132400,1581.0,1503.0
1209,2019/08/06,1545.0,1526.369,1490.0,115200,1550.0,1490.0
1210,2019/08/07,1537.0,1532.125,1551.0,91300,1551.0,1519.0
1211,2019/08/08,1552.0,1551.483,1537.0,113900,1567.0,1531.0
1212,2019/08/09,1538.0,1579.5,1588.0,248600,1635.0,1526.0
1213,2019/08/13,1537.0,1532.418,1559.0,154700,1560.0,1504.0
1214,2019/08/14,1519.0,1493.992,1541.0,280400,1549.0,1455.0
1215,2019/08/15,1472.0,1464.038,1469.0,268200,1486.0,1450.0
1216,2019/08/16,1514.0,1504.287,1468.0,137800,1517.0,1468.0
1217,2019/08/19,1502.0,1495.338,1521.0,137600,1540.0,1475.0
1218,2019/08/20,1476.0,1472.781,1492.0,157800,1492.0,1461.0
1219,2019/08/21,1473.0,1472.834,1471.0,114500,1481.0,1462.0
1220,2019/08/22,1474.0,1474.966,1493.0,126100,1493.0,1466.0
1221,2019/08/23,1472.0,1472.912,1490.0,72500,1490.0,1462.0
