ds,yhat
2019-07-16,700.5497902810081
2019-07-17,700.9094614749499
2019-07-18,698.3565480395489
2019-07-19,695.0068762616386
2019-07-22,694.1211127889883
2019-07-23,694.7319422260676
2019-07-24,694.1425063153782
2019-07-25,692.4917035642345
2019-07-26,690.2362305321946
2019-07-29,682.2001068683212
2019-07-30,680.2300428658522
2019-07-31,678.9008606821899
2019-08-01,677.1658588199232
2019-08-02,673.4477550920464
2019-08-05,652.922691845038
2019-08-06,650.5859497725158
2019-08-07,652.2345660566838
2019-08-08,655.0646569743876
2019-08-09,655.4010772305071
