ds,yhat
2019-08-22,1887.2711411441217
2019-08-23,1874.007748688702
2019-08-26,1863.268918438613
2019-08-27,1859.1427044063942
2019-08-28,1853.5707797302916
2019-08-29,1848.7856561147562
2019-08-30,1844.4631809400112
2019-09-02,1807.0895130786346
2019-09-03,1791.7662701065847
2019-09-04,1783.5802409623325
2019-09-05,1782.4189729229738
2019-09-06,1782.7588040157484
2019-09-09,1767.3204849143501
2019-09-10,1772.7740908981043
2019-09-11,1788.4522110691871
2019-09-12,1806.6715656716303
2019-09-13,1817.6699477877107
2019-09-17,1824.873871936671
2019-09-18,1844.0673034698852
2019-09-19,1861.5462323298111
2019-09-20,1869.7829114454266
