,Date,Close,VWAP,Open,Volume,High,Low
0,2014/08/25,486.5,477.702,460.5,1434400,490.5,457.5
1,2014/08/26,468.5,473.346,485.0,977000,485.5,462.5
2,2014/08/27,468.0,464.618,468.5,675200,475.0,458.0
3,2014/08/28,456.0,461.105,468.5,435600,471.5,455.5
4,2014/08/29,460.5,455.904,457.0,426200,462.0,450.5
5,2014/09/01,465.0,460.381,458.0,337600,468.5,456.0
6,2014/09/02,462.5,465.581,466.5,375800,470.0,462.0
7,2014/09/03,461.5,463.857,462.5,310800,469.5,459.5
8,2014/09/04,450.0,456.303,461.0,335800,465.5,450.0
9,2014/09/05,452.0,448.64,453.0,529600,458.0,441.5
10,2014/09/08,463.0,449.571,452.0,444400,463.0,442.5
11,2014/09/09,458.5,459.672,460.0,255800,465.0,455.5
12,2014/09/10,446.5,448.452,449.0,350400,454.5,445.5
13,2014/09/11,473.5,465.271,450.0,1119600,473.5,450.0
14,2014/09/12,456.5,459.244,467.0,530400,469.5,453.0
15,2014/09/16,450.0,452.164,456.5,290400,458.0,447.5
16,2014/09/17,450.5,453.832,457.5,417400,461.0,448.5
17,2014/09/18,455.5,453.549,454.0,231400,455.5,450.5
18,2014/09/19,482.0,474.656,460.0,1535400,487.0,456.5
19,2014/09/22,528.0,512.797,478.0,3929200,537.0,478.0
20,2014/09/24,497.0,501.854,515.0,1873800,520.0,491.5
21,2014/09/25,468.5,479.977,500.0,1345200,504.0,467.5
22,2014/09/26,458.0,460.806,465.0,1199400,467.0,455.0
23,2014/09/29,454.0,456.859,465.0,1336000,475.0,450.5
24,2014/09/30,435.0,442.821,453.5,1282000,453.5,435.0
25,2014/10/01,408.5,420.579,438.0,1152400,439.0,408.5
26,2014/10/02,390.5,395.645,390.0,1169000,410.0,389.0
27,2014/10/03,394.5,388.592,393.5,1339000,401.5,381.0
28,2014/10/06,411.5,401.834,402.0,1039600,413.0,392.0
29,2014/10/07,393.0,403.695,404.0,769000,417.5,392.0
30,2014/10/08,388.0,385.368,384.5,690600,390.5,378.0
31,2014/10/09,385.0,401.07,393.0,2175800,421.5,382.5
32,2014/10/10,394.0,379.94,377.5,1087200,400.0,371.5
33,2014/10/14,401.5,396.714,380.0,979400,408.5,379.0
34,2014/10/15,410.0,403.116,405.0,646800,410.0,392.0
35,2014/10/16,387.0,393.583,395.5,729800,404.5,387.0
36,2014/10/17,364.5,376.62,391.0,734000,394.0,361.0
37,2014/10/20,395.0,389.195,385.0,754600,396.5,380.0
38,2014/10/21,383.0,387.087,390.0,517600,396.0,378.5
39,2014/10/22,400.0,394.153,394.0,597400,401.0,383.0
40,2014/10/23,396.5,395.87,397.5,308800,402.0,389.0
41,2014/10/24,386.0,388.803,399.0,503800,402.0,382.0
42,2014/10/27,382.0,387.032,390.5,353800,393.0,382.0
43,2014/10/28,383.5,385.279,382.0,319400,390.0,381.5
44,2014/10/29,376.5,380.244,385.0,472200,388.5,375.5
45,2014/10/30,352.5,360.342,376.0,1083200,377.5,347.0
46,2014/10/31,371.0,362.401,350.0,1089000,378.5,347.5
47,2014/11/04,378.0,382.667,393.5,832000,394.5,371.0
48,2014/11/05,396.5,386.236,376.0,511200,396.5,371.5
49,2014/11/06,418.5,426.746,397.5,2785400,458.0,397.5
50,2014/11/07,406.0,412.182,428.5,1054800,428.5,403.0
51,2014/11/10,401.5,405.188,406.0,608200,416.0,400.0
52,2014/11/11,410.5,411.917,405.0,874400,419.0,403.5
53,2014/11/12,404.5,409.958,417.0,435600,417.0,403.5
54,2014/11/13,394.0,392.429,400.0,637600,403.0,388.0
55,2014/11/14,370.0,376.104,388.0,1191400,393.5,365.5
56,2014/11/17,371.5,371.794,362.5,1249400,382.0,361.0
57,2014/11/18,388.0,379.005,370.5,1011600,390.5,364.0
58,2014/11/19,400.0,392.237,390.5,942600,400.0,379.5
59,2014/11/20,395.0,402.197,404.0,845200,409.0,395.0
60,2014/11/21,406.0,401.931,400.0,576600,409.5,390.0
61,2014/11/25,398.0,401.66,406.0,407800,407.5,397.5
62,2014/11/26,394.5,396.394,398.0,452000,405.0,392.5
63,2014/11/27,386.0,387.071,393.0,610200,395.0,382.5
64,2014/11/28,396.0,392.098,385.0,470200,398.5,385.0
65,2014/12/01,400.5,399.084,391.0,571400,403.0,390.0
66,2014/12/02,419.0,414.524,400.5,1377600,424.5,398.5
67,2014/12/03,414.0,429.125,421.0,2617800,449.0,407.5
68,2014/12/04,395.0,403.504,407.0,1175600,422.0,395.0
69,2014/12/05,391.5,391.533,393.5,707200,398.0,385.5
70,2014/12/08,391.0,388.751,391.5,825400,394.5,384.0
71,2014/12/09,378.0,381.404,383.5,920200,386.5,378.0
72,2014/12/10,371.0,371.329,370.0,796600,378.0,369.0
73,2014/12/11,378.5,374.867,373.5,328000,379.5,370.0
74,2014/12/12,377.0,380.737,385.0,341400,385.0,375.0
75,2014/12/15,364.5,371.262,378.5,503200,379.0,363.0
76,2014/12/16,352.5,355.027,359.0,815800,360.0,352.5
77,2014/12/17,351.5,354.478,350.0,414000,360.5,350.0
78,2014/12/18,359.0,358.483,358.5,562800,362.5,353.0
79,2014/12/19,356.5,357.504,356.5,653600,360.5,355.0
80,2014/12/22,356.5,355.583,356.5,562200,359.0,353.0
81,2014/12/24,348.0,351.005,356.5,1186400,357.5,347.0
82,2014/12/25,347.5,348.884,345.0,1228000,355.5,343.0
83,2014/12/26,369.0,361.628,346.5,817600,369.0,346.5
84,2014/12/29,374.5,372.867,374.0,688200,380.0,368.0
85,2014/12/30,362.5,366.529,371.0,394200,375.0,361.5
86,2015/01/05,368.0,367.147,361.0,418800,374.5,359.0
87,2015/01/06,356.5,360.141,359.0,308400,367.0,356.0
88,2015/01/07,352.5,355.552,356.5,440800,362.0,350.5
89,2015/01/08,356.5,355.027,355.5,424400,359.0,352.5
90,2015/01/09,351.5,353.229,356.5,411400,361.0,348.5
91,2015/01/13,345.0,347.215,347.0,405200,353.5,344.0
92,2015/01/14,332.0,335.289,340.5,831000,346.0,327.5
93,2015/01/15,330.0,330.547,329.0,404600,335.0,327.5
94,2015/01/16,326.0,322.148,327.0,643200,327.5,315.5
95,2015/01/19,341.0,332.236,328.5,355800,344.5,323.0
96,2015/01/20,333.0,338.118,344.0,281200,347.5,332.5
97,2015/01/21,329.5,332.301,335.5,219600,338.5,327.0
98,2015/01/22,325.0,325.747,330.5,171800,330.5,323.5
99,2015/01/23,332.0,327.721,329.0,307000,333.5,321.0
100,2015/01/26,355.0,347.279,333.5,758000,359.0,330.0
101,2015/01/27,346.0,346.339,353.0,245800,353.0,343.0
102,2015/01/28,340.0,339.618,342.5,268400,346.0,335.0
103,2015/01/29,331.5,336.386,336.0,257600,342.5,331.5
104,2015/01/30,339.0,334.352,334.0,177200,339.0,331.5
105,2015/02/02,331.5,333.217,337.5,205800,338.0,330.0
106,2015/02/03,325.0,328.263,331.5,214600,333.0,325.0
107,2015/02/04,322.5,324.195,327.5,251800,328.0,322.5
108,2015/02/05,317.5,318.0,320.5,400600,322.0,311.0
109,2015/02/06,318.5,322.002,318.5,498800,331.5,316.5
110,2015/02/09,334.0,330.513,328.5,572800,336.5,325.0
111,2015/02/10,334.0,333.928,339.0,344200,339.0,330.0
112,2015/02/12,332.5,332.527,335.0,358000,336.5,329.0
113,2015/02/13,321.0,322.257,327.0,580000,331.5,318.0
114,2015/02/16,330.0,327.015,323.0,598600,334.5,317.5
115,2015/02/17,323.0,325.874,327.0,356200,331.0,322.5
116,2015/02/18,320.0,322.607,328.0,417800,328.0,319.0
117,2015/02/19,319.0,321.743,323.0,342200,325.0,319.0
118,2015/02/20,324.0,325.826,323.5,433200,330.0,322.0
119,2015/02/23,321.5,323.637,326.0,494600,330.0,320.5
120,2015/02/24,323.0,334.479,330.0,2298600,346.5,321.0
121,2015/02/25,321.0,322.437,323.0,629400,327.5,320.0
122,2015/02/26,322.0,323.117,324.0,507400,326.5,320.5
123,2015/02/27,323.0,323.102,323.0,374000,325.5,321.0
124,2015/03/02,325.0,325.085,328.0,355600,328.5,323.0
125,2015/03/03,318.5,322.725,328.5,780000,330.5,318.5
126,2015/03/04,326.5,322.887,318.0,499000,327.0,318.0
127,2015/03/05,332.5,332.901,325.5,1011800,339.0,325.0
128,2015/03/06,335.5,332.633,333.0,437200,336.0,330.0
129,2015/03/09,344.0,340.199,337.5,890200,345.0,336.5
130,2015/03/10,331.0,335.568,342.5,933400,344.0,327.5
131,2015/03/11,330.0,330.334,330.0,513000,335.0,326.5
132,2015/03/12,339.5,339.423,332.5,693200,343.0,332.0
133,2015/03/13,355.5,351.225,345.0,1672800,357.5,342.5
134,2015/03/16,367.0,368.445,358.0,2106200,379.5,357.0
135,2015/03/17,347.0,352.626,359.5,1785000,363.5,345.0
136,2015/03/18,344.0,341.957,345.0,822000,354.0,335.0
137,2015/03/19,338.5,337.995,342.0,545800,343.0,334.5
138,2015/03/20,346.5,343.98,340.5,561600,351.0,337.0
139,2015/03/23,344.5,346.058,349.0,584400,354.5,341.5
140,2015/03/24,342.0,340.74,342.0,216400,343.5,339.0
141,2015/03/25,336.5,342.134,345.0,497000,347.0,335.5
142,2015/03/26,326.5,328.729,334.0,906600,335.0,323.0
143,2015/03/27,325.0,326.313,324.0,524200,333.0,321.0
144,2015/03/30,327.0,326.127,324.5,223600,328.0,324.0
145,2015/03/31,340.5,337.53,334.5,814200,345.0,329.0
146,2015/04/01,328.5,331.66,336.0,682200,340.0,327.0
147,2015/04/02,331.0,330.998,330.0,241000,333.5,327.5
148,2015/04/03,334.0,334.501,332.0,386800,337.5,332.0
149,2015/04/06,345.0,340.057,334.5,379400,345.0,332.5
150,2015/04/07,345.0,348.724,350.0,648600,354.5,343.0
151,2015/04/08,348.5,346.62,345.0,299800,350.0,343.0
152,2015/04/09,345.0,347.506,348.5,375600,353.0,342.0
153,2015/04/10,343.5,343.668,345.0,222000,347.0,342.0
154,2015/04/13,357.5,346.139,342.5,796000,357.5,337.5
155,2015/04/14,366.5,362.189,357.0,1216600,369.0,351.5
156,2015/04/15,375.5,370.888,370.0,1238200,379.0,360.0
157,2015/04/16,372.5,377.018,379.0,851800,388.5,367.5
158,2015/04/17,356.5,364.886,370.0,862200,376.5,355.5
159,2015/04/20,346.5,350.45,350.5,438400,357.5,346.5
160,2015/04/21,354.0,350.782,353.5,300400,354.0,346.5
161,2015/04/22,356.0,353.62,355.0,278400,358.5,349.0
162,2015/04/23,348.0,351.395,357.5,415600,359.5,345.5
163,2015/04/24,345.0,345.774,347.5,289400,350.0,343.5
164,2015/04/27,352.0,347.667,345.0,235000,354.0,343.0
165,2015/04/28,345.0,345.905,350.0,326400,350.5,341.5
166,2015/04/30,339.0,339.541,342.0,442000,346.5,335.0
167,2015/05/01,332.5,333.726,335.0,424400,337.0,331.5
168,2015/05/07,332.0,332.239,329.0,187600,335.5,328.5
169,2015/05/08,340.0,337.807,334.5,202200,343.0,334.5
170,2015/05/11,344.5,342.783,344.0,195600,345.0,339.5
171,2015/05/12,339.0,339.668,340.5,190800,343.0,337.5
172,2015/05/13,338.5,338.893,337.0,125800,341.5,336.5
173,2015/05/14,335.5,335.252,335.5,309000,337.5,333.0
174,2015/05/15,336.0,335.537,339.5,275400,339.5,332.5
175,2015/05/18,355.0,352.924,349.5,1117800,357.5,344.5
176,2015/05/19,349.5,350.641,350.0,372200,352.5,349.0
177,2015/05/20,341.0,345.86,350.5,413600,352.0,341.0
178,2015/05/21,347.5,345.729,342.5,338600,349.0,342.5
179,2015/05/22,350.0,350.67,348.0,464400,353.5,347.5
180,2015/05/25,345.0,346.14,350.5,270400,350.5,343.5
181,2015/05/26,339.0,338.258,344.0,803200,344.0,331.5
182,2015/05/27,335.5,336.929,338.0,250600,339.5,335.0
183,2015/05/28,334.0,334.886,336.0,356000,339.5,333.0
184,2015/05/29,336.5,334.818,334.0,315000,338.0,332.5
185,2015/06/01,336.0,336.664,334.5,233000,340.0,334.0
186,2015/06/02,336.0,335.578,335.0,273200,339.5,334.0
187,2015/06/03,335.5,334.501,335.0,268600,336.0,333.5
188,2015/06/04,334.5,334.733,333.5,387600,336.5,333.0
189,2015/06/05,334.0,334.07,333.5,224800,336.5,332.5
190,2015/06/08,335.0,334.779,334.5,213200,336.0,333.5
191,2015/06/09,334.5,336.521,334.5,454000,341.5,333.0
192,2015/06/10,333.5,333.67,335.0,190600,336.5,331.5
193,2015/06/11,343.5,343.061,338.5,586400,348.5,337.5
194,2015/06/12,344.5,345.525,343.5,584400,349.5,340.0
195,2015/06/15,352.5,349.576,342.5,416800,353.0,342.5
196,2015/06/16,345.5,353.543,355.0,753200,359.5,345.5
197,2015/06/17,366.0,358.227,348.0,1652400,366.5,346.0
198,2015/06/18,356.0,358.142,365.0,795200,365.0,353.0
199,2015/06/19,348.0,351.22,360.0,610800,360.0,345.0
200,2015/06/22,350.0,352.645,354.0,364800,357.0,348.5
201,2015/06/23,360.5,357.229,355.5,669000,362.0,351.5
202,2015/06/24,413.0,397.003,363.5,6897400,435.5,363.5
203,2015/06/25,382.5,401.554,402.5,4844400,422.5,378.0
204,2015/06/26,424.5,429.539,397.5,10672600,448.0,392.5
205,2015/06/29,438.0,441.757,402.0,13542000,468.5,400.5
206,2015/06/30,445.5,451.846,453.0,9236000,471.5,426.5
207,2015/07/01,439.5,434.976,448.5,3454000,448.5,422.0
208,2015/07/02,417.5,424.702,435.5,2329600,444.0,413.5
209,2015/07/03,422.0,412.65,418.0,2556600,428.5,398.5
210,2015/07/06,395.0,407.98,418.0,2390400,430.5,386.0
211,2015/07/07,400.0,399.192,403.0,985000,408.5,391.0
212,2015/07/08,377.0,383.476,400.0,1337800,401.0,373.5
213,2015/07/09,385.5,364.501,360.0,2098800,389.5,340.0
214,2015/07/10,379.5,391.471,387.5,1718600,404.5,376.0
215,2015/07/13,391.0,391.605,390.5,876800,398.0,385.0
216,2015/07/14,397.5,398.948,399.0,1157800,404.0,392.5
217,2015/07/15,397.0,395.854,397.0,464800,400.5,391.5
218,2015/07/16,411.5,410.672,399.0,1546200,420.0,397.0
219,2015/07/17,409.5,411.131,411.5,632800,419.0,406.5
220,2015/07/21,429.0,424.748,414.5,1322600,430.0,413.0
221,2015/07/22,416.5,419.469,423.0,771200,426.0,414.5
222,2015/07/23,410.0,413.674,420.0,555200,424.0,407.5
223,2015/07/24,420.0,412.78,408.0,608800,420.5,402.5
224,2015/07/27,398.5,404.884,415.5,674200,416.5,394.0
225,2015/07/28,401.5,395.811,390.0,427600,405.0,387.0
226,2015/07/29,399.0,396.494,395.0,233400,400.5,393.0
227,2015/07/30,391.5,392.857,401.0,427200,401.5,387.0
228,2015/07/31,390.0,390.57,390.5,261600,394.0,387.5
229,2015/08/03,381.0,386.669,392.5,368800,396.5,377.0
230,2015/08/04,365.0,371.234,378.0,534800,381.0,363.0
231,2015/08/05,378.0,370.087,360.0,595400,381.0,359.5
232,2015/08/06,367.5,372.258,377.5,289200,377.5,367.0
233,2015/08/07,369.5,370.655,368.5,177800,374.0,368.5
234,2015/08/10,375.0,373.697,372.5,264000,376.5,369.5
235,2015/08/11,397.5,390.654,380.0,845000,398.5,379.5
236,2015/08/12,390.0,389.781,392.5,572800,400.0,383.0
237,2015/08/13,361.0,362.937,366.0,1288400,373.5,353.5
238,2015/08/14,349.5,351.097,359.5,1110200,361.0,344.0
239,2015/08/17,355.5,354.419,352.5,316800,359.0,351.5
240,2015/08/18,350.0,348.781,351.0,619400,355.0,343.0
241,2015/08/19,343.5,344.832,349.5,634600,349.5,341.5
242,2015/08/20,344.0,344.773,344.5,401800,348.0,342.5
243,2015/08/21,333.5,336.102,337.5,936400,345.5,330.5
244,2015/08/24,290.0,302.592,322.5,1578600,323.5,283.5
245,2015/08/25,267.0,277.49,266.5,1590600,298.5,254.5
246,2015/08/26,289.0,280.444,280.0,940800,289.0,272.0
247,2015/08/27,282.0,289.435,296.5,821600,298.0,281.5
248,2015/08/28,290.5,290.369,292.0,777000,294.5,285.0
249,2015/08/31,300.5,294.23,294.0,741200,302.5,289.5
250,2015/09/01,285.0,290.975,296.5,930800,297.5,283.0
251,2015/09/02,274.0,276.913,275.0,792400,284.0,271.5
252,2015/09/03,277.0,277.747,279.0,581600,283.0,274.5
253,2015/09/04,262.0,265.164,277.5,700200,278.5,255.5
254,2015/09/07,265.0,261.395,257.0,344200,268.5,255.0
255,2015/09/08,255.0,260.86,266.5,519400,270.5,254.5
256,2015/09/09,274.0,268.931,268.5,500000,275.0,262.5
257,2015/09/10,266.5,265.458,264.5,415800,273.0,260.5
258,2015/09/11,265.5,266.3,264.0,448800,271.0,261.0
259,2015/09/14,259.5,265.373,272.5,474200,273.0,259.5
260,2015/09/15,262.0,263.392,262.5,218200,267.0,260.5
261,2015/09/16,263.5,260.656,264.5,270800,264.5,258.5
262,2015/09/17,274.0,269.745,265.5,425400,276.0,263.5
263,2015/09/18,267.5,266.768,269.0,254600,272.0,263.5
264,2015/09/24,262.5,264.713,267.0,335800,272.5,261.5
265,2015/09/25,268.5,262.589,264.5,251000,268.5,259.0
266,2015/09/28,273.0,270.371,272.5,194600,273.0,265.5
267,2015/09/29,264.0,266.54,270.5,452200,271.0,263.0
268,2015/09/30,275.5,270.965,270.0,224400,277.5,266.5
269,2015/10/01,274.5,279.742,279.5,480800,285.0,273.5
270,2015/10/02,296.5,289.917,272.5,802600,298.0,272.5
271,2015/10/05,310.0,304.75,298.5,914400,313.0,295.5
272,2015/10/06,306.0,305.46,312.0,839000,314.5,296.0
273,2015/10/07,307.5,307.538,304.0,296600,312.5,302.0
274,2015/10/08,299.0,301.177,303.5,283800,307.0,296.0
275,2015/10/09,312.0,305.456,300.0,394600,312.0,298.0
276,2015/10/13,313.5,312.411,311.5,308200,317.5,305.5
277,2015/10/14,310.5,313.955,318.5,345400,318.5,305.5
278,2015/10/15,309.0,310.742,305.5,242200,317.5,304.5
279,2015/10/16,310.0,310.672,307.5,160600,315.0,307.5
280,2015/10/19,309.0,308.744,310.0,176800,311.0,306.0
281,2015/10/20,308.0,308.381,310.0,183800,311.5,304.5
282,2015/10/21,311.0,309.684,308.5,189000,313.0,305.5
283,2015/10/22,310.5,311.199,309.0,121800,314.0,308.5
284,2015/10/23,327.5,320.258,312.0,637600,328.5,312.0
285,2015/10/26,337.0,336.352,332.5,641200,342.0,329.5
286,2015/10/27,325.0,327.734,335.0,545800,337.0,318.5
287,2015/10/28,332.5,332.365,327.5,373400,339.0,327.5
288,2015/10/29,349.5,345.833,336.5,1043600,352.5,333.0
289,2015/10/30,342.5,342.304,345.5,474000,352.5,335.0
290,2015/11/02,340.5,340.994,337.0,171400,347.5,336.0
291,2015/11/04,328.5,333.763,340.0,447400,344.5,322.5
292,2015/11/05,328.5,324.13,328.5,412200,330.5,318.5
293,2015/11/06,328.0,325.955,328.0,163000,332.0,322.5
294,2015/11/09,326.5,328.832,327.5,182600,334.5,325.5
295,2015/11/10,338.5,336.367,325.5,297600,342.0,325.5
296,2015/11/11,336.5,337.124,335.0,221400,341.0,332.5
297,2015/11/12,335.5,333.888,335.5,114800,337.0,332.0
298,2015/11/13,321.0,323.174,325.5,393000,331.0,319.0
299,2015/11/16,351.5,344.916,319.0,1424400,358.0,318.5
300,2015/11/17,350.5,355.656,359.0,899600,367.5,346.5
301,2015/11/18,362.5,360.583,357.5,857800,366.0,350.0
302,2015/11/19,358.0,360.868,365.0,551600,367.0,352.0
303,2015/11/20,373.0,365.69,356.5,951400,376.5,340.0
304,2015/11/24,368.0,372.242,367.0,552800,382.0,365.0
305,2015/11/25,372.5,368.323,368.0,235800,372.5,363.0
306,2015/11/26,375.5,375.948,373.5,336400,379.5,372.5
307,2015/11/27,368.5,372.15,374.5,218600,376.0,366.0
308,2015/11/30,383.5,380.373,369.5,612600,387.5,369.5
309,2015/12/01,385.0,383.951,383.5,371200,388.5,378.5
310,2015/12/02,392.5,392.116,384.0,665200,395.0,384.0
311,2015/12/03,387.5,386.718,390.0,307600,390.5,381.0
312,2015/12/04,390.5,390.21,380.0,556600,396.0,379.0
313,2015/12/07,399.5,398.955,395.5,574400,402.0,395.0
314,2015/12/08,412.0,406.993,400.0,985400,416.0,396.5
315,2015/12/09,390.0,395.115,407.0,600000,407.0,386.0
316,2015/12/10,369.0,374.408,382.5,494200,383.0,369.0
317,2015/12/11,386.5,380.62,375.0,360000,386.5,371.5
318,2015/12/14,372.0,372.786,369.5,423800,378.5,369.5
319,2015/12/15,345.0,355.047,372.5,728000,376.0,339.0
320,2015/12/16,345.5,351.825,354.0,477400,359.0,343.0
321,2015/12/17,348.5,348.667,350.0,261000,352.0,345.5
322,2015/12/18,339.0,345.088,343.5,499800,354.0,334.5
323,2015/12/21,336.0,332.581,333.0,382200,339.0,328.0
324,2015/12/22,328.5,332.344,337.5,233400,339.5,328.5
325,2015/12/24,312.0,320.469,328.0,515600,333.0,312.0
326,2015/12/25,312.0,311.547,304.5,621800,324.0,304.5
327,2015/12/28,335.0,328.069,312.0,429400,338.5,312.0
328,2015/12/29,335.0,334.541,332.5,296000,338.5,329.5
329,2015/12/30,332.5,333.614,337.0,216400,341.5,329.5
330,2016/01/04,336.5,336.938,335.0,284000,346.0,330.0
331,2016/01/05,326.0,327.606,332.0,237600,335.0,321.0
332,2016/01/06,320.5,322.99,327.0,175000,331.0,317.5
333,2016/01/07,311.5,316.953,321.0,214600,325.0,311.5
334,2016/01/08,315.0,313.842,309.5,187600,324.0,306.5
335,2016/01/12,292.0,296.11,306.5,516400,307.5,283.5
336,2016/01/13,300.0,297.696,297.0,393000,302.5,293.5
337,2016/01/14,293.5,287.102,291.0,281200,295.0,280.5
338,2016/01/15,282.0,289.759,290.5,340800,308.0,278.0
339,2016/01/18,273.0,269.323,263.5,385800,277.0,263.0
340,2016/01/19,284.5,278.645,271.0,228200,287.5,270.5
341,2016/01/20,268.5,275.78,289.5,326800,290.0,267.5
342,2016/01/21,255.5,264.157,265.0,379400,276.0,252.5
343,2016/01/22,277.5,271.128,265.0,261000,278.5,261.0
344,2016/01/25,285.0,280.937,279.0,282000,286.0,275.5
345,2016/01/26,277.0,278.455,275.5,157600,284.5,275.5
346,2016/01/27,285.5,286.05,286.5,214800,288.0,283.0
347,2016/01/28,287.0,289.439,285.0,232000,296.0,284.5
348,2016/01/29,291.5,287.949,288.0,236600,297.5,281.0
349,2016/02/01,307.5,304.819,306.0,296400,309.0,300.0
350,2016/02/02,305.0,307.77,307.5,303400,311.5,304.5
351,2016/02/03,296.0,295.923,297.0,302600,305.0,290.0
352,2016/02/04,299.0,298.023,295.5,365000,302.5,292.0
353,2016/02/05,290.5,294.878,298.5,277800,300.0,288.5
354,2016/02/08,295.5,290.394,286.0,199600,298.0,281.0
355,2016/02/09,280.0,284.483,290.5,341800,292.0,276.5
356,2016/02/10,260.5,268.159,283.5,292800,286.0,256.5
357,2016/02/12,232.5,241.653,242.0,521400,251.0,232.5
358,2016/02/15,269.0,264.367,266.5,472800,272.0,250.0
359,2016/02/16,280.0,281.79,270.0,431600,289.0,270.0
360,2016/02/17,271.5,278.106,281.0,275400,290.0,265.5
361,2016/02/18,275.5,277.436,279.5,134200,280.5,273.0
362,2016/02/19,270.5,268.844,274.5,154600,274.5,265.0
363,2016/02/22,290.5,283.555,269.0,357200,293.5,268.5
364,2016/02/23,286.0,287.733,291.0,251200,295.5,282.5
365,2016/02/24,283.0,284.065,281.0,383800,292.0,279.5
366,2016/02/25,311.5,307.343,287.5,925000,319.0,284.5
367,2016/02/26,328.0,320.35,313.0,767400,331.0,310.0
368,2016/02/29,326.5,328.298,325.5,387800,334.5,318.5
369,2016/03/01,362.5,353.481,328.5,1647800,370.0,322.5
370,2016/03/02,365.5,362.828,362.5,828200,372.0,351.5
371,2016/03/03,361.0,361.87,367.5,358800,368.5,356.5
372,2016/03/04,367.5,362.414,361.0,470200,371.0,352.0
373,2016/03/07,369.5,368.201,367.5,241200,372.5,362.5
374,2016/03/08,370.0,365.781,370.5,407000,372.0,357.5
375,2016/03/09,379.0,374.239,366.5,564400,387.0,361.0
376,2016/03/10,381.5,379.506,379.0,309000,383.5,374.0
377,2016/03/11,385.5,388.316,380.0,529000,396.5,377.5
378,2016/03/14,397.0,396.576,393.0,638600,399.5,390.5
379,2016/03/15,396.0,398.772,397.5,496800,403.0,393.0
380,2016/03/16,384.5,391.233,399.0,510200,400.0,381.5
381,2016/03/17,368.5,374.131,387.5,536600,390.0,366.0
382,2016/03/18,383.0,376.778,363.0,495000,386.5,363.0
383,2016/03/22,386.5,386.961,382.0,319400,394.0,382.0
384,2016/03/23,390.0,390.456,392.5,298600,395.0,385.0
385,2016/03/24,387.5,388.085,390.0,223800,391.0,385.0
386,2016/03/25,397.0,388.927,389.5,491200,399.0,378.0
387,2016/03/28,382.5,387.656,395.5,313800,397.0,379.5
388,2016/03/29,385.5,382.238,382.5,270200,387.0,376.0
389,2016/03/30,375.5,377.63,380.5,449400,386.5,371.0
390,2016/03/31,379.5,374.377,377.0,292600,381.0,368.0
391,2016/04/01,367.5,372.367,380.0,476600,384.5,366.5
392,2016/04/04,380.5,376.179,370.0,365000,384.5,364.0
393,2016/04/05,358.5,362.159,375.0,511400,377.0,352.0
394,2016/04/06,359.5,353.657,351.0,291400,362.0,345.5
395,2016/04/07,382.5,377.787,358.5,735800,385.5,351.5
396,2016/04/08,383.5,375.627,375.0,397400,388.5,366.5
397,2016/04/11,394.0,388.484,388.0,461800,396.0,383.0
398,2016/04/12,408.0,411.649,397.5,1366400,435.5,397.5
399,2016/04/13,409.5,411.802,410.5,449200,420.0,402.5
400,2016/04/14,416.0,417.324,418.5,586600,422.0,411.5
401,2016/04/15,411.5,413.427,413.5,348400,420.0,410.5
402,2016/04/18,409.0,404.967,402.5,469200,414.0,395.0
403,2016/04/19,430.0,425.077,414.5,789400,432.5,411.0
404,2016/04/20,430.0,437.592,448.5,1200400,449.0,420.0
405,2016/04/21,446.5,445.022,437.5,1077800,450.5,433.5
406,2016/04/22,477.5,466.928,452.5,2330600,478.0,451.5
407,2016/04/25,450.5,465.483,480.0,1261200,485.0,444.5
408,2016/04/26,414.0,420.84,435.5,1171000,442.0,405.5
409,2016/04/27,412.0,413.204,418.0,537600,422.5,405.0
410,2016/04/28,401.0,404.452,415.0,473200,417.5,391.0
411,2016/05/02,396.5,391.945,378.5,385000,406.5,377.5
412,2016/05/06,418.5,415.043,396.0,664800,424.0,396.0
413,2016/05/09,442.0,438.281,431.0,730000,443.5,428.5
414,2016/05/10,430.0,432.642,444.0,431200,446.5,426.0
415,2016/05/11,433.0,431.277,433.0,267000,437.0,426.0
416,2016/05/12,450.5,447.958,436.0,742600,459.0,433.5
417,2016/05/13,441.0,447.309,458.0,588600,463.0,427.0
418,2016/05/16,498.5,485.324,452.0,4869000,510.0,446.5
419,2016/05/17,488.0,496.037,500.5,2105000,520.5,475.0
420,2016/05/18,481.5,507.679,515.0,5346600,542.5,462.5
421,2016/05/19,461.5,463.185,475.0,1449400,480.0,452.5
422,2016/05/20,498.0,492.653,457.0,2200000,514.5,456.5
423,2016/05/23,502.5,500.545,505.5,1507600,512.5,483.5
424,2016/05/24,522.5,529.859,505.0,4114200,550.0,497.0
425,2016/05/25,517.0,526.183,532.5,1318800,549.0,514.0
426,2016/05/26,489.5,491.004,510.5,1661000,514.0,465.5
427,2016/05/27,475.5,479.296,483.5,1030000,497.0,469.5
428,2016/05/30,530.5,518.558,494.0,3234800,536.0,486.5
429,2016/05/31,560.0,557.415,549.0,6748800,572.5,536.5
430,2016/06/01,557.5,552.163,559.5,2486400,564.5,541.0
431,2016/06/02,551.5,550.636,547.0,1996800,568.0,533.0
432,2016/06/03,573.0,566.32,551.5,2516800,580.0,542.5
433,2016/06/06,586.0,574.287,563.5,2455600,587.5,559.0
434,2016/06/07,582.5,583.658,589.5,1689200,592.0,575.5
435,2016/06/08,579.5,570.503,576.5,1413800,585.0,550.0
436,2016/06/09,613.0,610.942,585.0,3804600,629.5,582.5
437,2016/06/10,607.5,605.327,605.0,1230200,617.0,598.0
438,2016/06/13,601.5,594.127,599.0,1129600,605.0,575.5
439,2016/06/14,555.5,563.975,591.5,1803200,598.0,533.0
440,2016/06/15,560.5,558.262,540.5,1193000,571.5,540.5
441,2016/06/16,528.5,536.476,564.0,1330200,576.5,521.5
442,2016/06/17,524.0,531.903,549.5,944200,556.5,514.0
443,2016/06/20,551.0,551.281,520.0,1019000,570.0,520.0
444,2016/06/21,589.5,577.858,553.5,1158200,591.0,544.0
445,2016/06/22,544.0,563.212,587.0,1566600,597.0,538.5
446,2016/06/23,527.0,517.731,529.0,1215600,536.5,503.5
447,2016/06/24,486.0,499.407,546.5,1848400,547.5,452.5
448,2016/06/27,531.0,517.238,488.5,1002600,542.5,488.5
449,2016/06/28,516.0,516.908,516.0,1006600,535.0,500.0
450,2016/06/29,526.5,530.935,527.0,1070000,542.5,520.0
451,2016/06/30,538.5,532.251,527.5,717800,546.0,522.0
452,2016/07/01,584.5,577.032,541.0,1485400,588.5,541.0
453,2016/07/04,612.0,603.74,579.0,1493400,617.5,572.5
454,2016/07/05,607.5,605.772,624.5,1134200,625.0,581.0
455,2016/07/06,618.0,618.96,590.0,2029800,645.0,588.0
456,2016/07/07,643.0,643.306,635.0,2245400,655.5,628.0
457,2016/07/08,673.5,658.472,650.0,3216000,682.5,619.0
458,2016/07/11,640.0,653.685,680.0,2077600,687.5,632.0
459,2016/07/12,653.5,651.31,661.5,1199600,669.0,635.5
460,2016/07/13,663.5,657.056,660.0,698400,672.5,645.5
461,2016/07/14,670.0,672.845,662.5,943800,686.5,654.5
462,2016/07/15,618.5,631.799,661.0,1227600,675.0,612.0
463,2016/07/19,594.5,603.164,632.5,1093400,632.5,587.5
464,2016/07/20,604.5,599.613,581.5,525000,610.5,579.5
465,2016/07/21,581.5,588.486,605.0,719600,610.0,577.0
466,2016/07/22,577.0,576.475,575.5,589400,599.5,562.5
467,2016/07/25,596.0,596.869,582.5,505800,609.0,577.5
468,2016/07/26,612.0,608.838,594.5,819600,621.0,594.0
469,2016/07/27,635.0,633.832,617.5,1621600,646.5,610.5
470,2016/07/28,567.5,590.752,626.0,1169400,628.0,567.5
471,2016/07/29,538.5,534.026,556.0,1583200,557.5,513.0
472,2016/08/01,580.5,545.566,526.0,1636400,583.0,516.0
473,2016/08/02,556.0,564.241,572.0,783800,587.5,553.0
474,2016/08/03,530.0,537.058,542.0,563200,564.0,527.5
475,2016/08/04,501.5,508.972,526.0,1252200,534.0,499.5
476,2016/08/05,509.0,507.069,513.0,888200,524.0,494.5
477,2016/08/08,501.0,510.033,524.0,423400,524.0,501.0
478,2016/08/09,537.5,530.127,506.0,1071800,550.0,501.5
479,2016/08/10,543.0,544.236,522.5,1035400,557.0,521.0
480,2016/08/12,537.0,537.145,545.0,657200,549.5,525.5
481,2016/08/15,569.5,564.211,537.0,757600,577.5,535.5
482,2016/08/16,592.0,583.968,575.0,906000,593.5,571.0
483,2016/08/17,558.5,575.244,600.0,717800,600.0,553.5
484,2016/08/18,541.5,547.178,565.0,367400,565.5,539.0
485,2016/08/19,566.5,559.377,551.0,537400,568.5,544.5
486,2016/08/22,586.5,569.806,565.0,549200,587.5,550.0
487,2016/08/23,579.5,586.897,589.5,466200,599.5,576.0
488,2016/08/24,599.0,591.087,580.0,557800,603.0,578.0
489,2016/08/25,594.0,601.533,595.0,573800,609.0,592.0
490,2016/08/26,566.5,574.522,595.0,327600,595.0,565.5
491,2016/08/29,571.5,552.335,566.5,813000,571.5,534.5
492,2016/08/30,582.0,584.833,571.5,568800,595.5,571.0
493,2016/08/31,575.5,578.856,594.5,324600,594.5,567.5
494,2016/09/01,576.0,572.84,570.5,196600,581.0,566.0
495,2016/09/02,576.5,578.723,585.5,290000,590.0,571.0
496,2016/09/05,570.5,571.707,576.0,194400,580.0,565.5
497,2016/09/06,577.5,577.615,570.0,217600,584.5,568.5
498,2016/09/07,600.0,594.257,576.5,773200,602.0,573.5
499,2016/09/08,584.0,588.008,600.0,449000,600.0,575.5
500,2016/09/09,579.5,580.107,590.0,268000,590.0,573.0
501,2016/09/12,556.5,561.242,570.0,450400,576.5,550.5
502,2016/09/13,563.0,557.79,560.0,530200,569.0,543.5
503,2016/09/14,531.0,540.38,555.0,479400,555.0,530.5
504,2016/09/15,540.0,534.021,531.0,337600,540.0,527.0
505,2016/09/16,529.0,527.774,540.0,299000,540.0,521.0
506,2016/09/20,529.0,524.386,524.0,293200,531.0,518.0
507,2016/09/21,535.0,531.439,523.5,390200,547.5,521.0
508,2016/09/23,553.0,550.4,537.5,368800,558.0,537.0
509,2016/09/26,563.5,564.448,555.0,385200,572.0,554.5
510,2016/09/27,575.0,570.087,554.5,455600,581.0,552.5
511,2016/09/28,584.5,582.287,572.0,401400,589.0,572.0
512,2016/09/29,590.0,585.018,584.5,367400,591.0,572.0
513,2016/09/30,567.5,575.195,580.0,275000,586.5,567.0
514,2016/10/03,556.5,561.742,570.0,284800,579.5,554.0
515,2016/10/04,613.0,603.947,599.0,1714200,617.0,584.5
516,2016/10/05,616.5,620.195,620.0,988400,634.5,607.5
517,2016/10/06,607.0,603.944,618.5,358400,618.5,591.5
518,2016/10/07,594.5,596.769,607.5,281400,610.0,589.0
519,2016/10/11,599.5,603.292,590.0,204800,611.0,590.0
520,2016/10/12,583.0,589.572,595.0,240800,603.5,578.0
521,2016/10/13,589.5,584.439,587.0,203400,591.5,575.5
522,2016/10/14,582.0,581.215,584.0,223200,589.5,577.0
523,2016/10/17,573.0,572.717,578.0,208600,580.5,568.0
524,2016/10/18,578.0,577.342,567.0,239200,582.5,567.0
525,2016/10/19,594.0,591.149,576.0,396000,595.0,576.0
526,2016/10/20,584.0,588.953,595.0,270000,600.0,580.0
527,2016/10/21,571.0,577.879,587.0,154800,588.5,570.5
528,2016/10/24,566.5,572.428,571.0,134600,582.5,565.5
529,2016/10/25,563.0,563.646,563.5,196400,570.5,558.5
530,2016/10/26,574.0,572.804,566.0,143600,577.0,561.5
531,2016/10/27,563.0,565.77,570.0,134200,573.5,561.0
532,2016/10/28,563.0,558.573,563.0,203200,566.0,553.5
533,2016/10/31,567.0,566.392,569.0,169000,571.5,562.5
534,2016/11/01,566.0,562.794,560.5,193600,569.5,556.0
535,2016/11/02,549.0,553.225,556.0,249400,563.5,548.0
536,2016/11/04,546.5,541.648,550.0,297400,550.0,529.0
537,2016/11/07,532.5,532.571,549.0,341600,550.5,527.5
538,2016/11/08,543.0,542.81,535.0,167000,548.5,535.0
539,2016/11/09,511.5,515.438,548.5,450000,553.5,497.5
540,2016/11/10,535.5,533.826,541.5,251600,541.5,526.0
541,2016/11/11,549.0,542.704,544.5,351200,551.5,531.0
542,2016/11/14,535.0,549.452,566.0,466400,567.0,532.5
543,2016/11/15,510.0,512.73,532.5,684000,533.0,505.0
544,2016/11/16,538.0,528.807,515.0,409800,539.0,511.0
545,2016/11/17,517.5,517.527,530.5,649600,534.5,512.0
546,2016/11/18,519.5,521.014,524.0,463200,529.0,514.5
547,2016/11/21,517.5,510.908,519.5,562200,528.0,502.0
548,2016/11/22,511.0,511.242,512.0,354000,517.0,508.0
549,2016/11/24,510.5,516.805,520.0,435200,523.0,509.5
550,2016/11/25,501.0,502.996,510.0,560000,513.0,499.0
551,2016/11/28,510.0,505.249,501.0,340800,512.0,496.0
552,2016/11/29,500.5,501.346,505.5,398400,510.0,498.0
553,2016/11/30,486.0,489.915,499.0,1266800,501.5,486.0
554,2016/12/01,458.5,460.658,478.5,1765000,480.5,453.0
555,2016/12/02,434.5,439.396,455.5,1539800,457.5,430.5
556,2016/12/05,444.0,442.739,433.0,983200,449.0,430.0
557,2016/12/06,434.5,442.044,450.0,708400,451.0,432.5
558,2016/12/07,432.0,434.368,439.5,691800,444.5,426.5
559,2016/12/08,426.0,429.924,432.0,510800,437.5,425.5
560,2016/12/09,428.0,426.955,424.0,565400,437.0,420.0
561,2016/12/12,435.5,429.757,430.5,689200,435.5,421.0
562,2016/12/13,453.5,449.094,437.5,1081000,460.0,434.5
563,2016/12/14,459.5,468.467,468.5,1321200,477.0,459.5
564,2016/12/15,444.5,448.38,458.0,853400,458.5,440.5
565,2016/12/16,446.5,451.589,452.0,957400,461.0,443.5
566,2016/12/19,441.5,444.139,447.5,562400,452.0,438.5
567,2016/12/20,443.0,437.988,435.0,632800,445.0,433.5
568,2016/12/21,436.0,437.169,445.0,703200,446.0,432.5
569,2016/12/22,428.5,428.032,433.0,867200,434.5,424.5
570,2016/12/26,449.5,441.016,430.0,831800,449.5,427.5
571,2016/12/27,462.0,458.801,456.5,968400,465.0,447.0
572,2016/12/28,464.5,471.745,462.0,976200,480.5,460.5
573,2016/12/29,464.5,458.67,465.0,617400,468.0,449.5
574,2016/12/30,474.0,469.705,457.0,672600,475.0,455.5
575,2017/01/04,467.0,471.553,479.0,1045200,483.5,460.5
576,2017/01/05,481.0,478.339,472.0,888400,484.5,468.0
577,2017/01/06,487.0,480.44,476.5,725400,487.5,474.0
578,2017/01/10,489.0,485.06,487.5,748000,490.5,480.5
579,2017/01/11,477.5,482.945,490.0,481800,490.0,477.5
580,2017/01/12,468.0,467.432,472.5,572600,475.0,463.0
581,2017/01/13,485.0,480.338,464.0,803400,485.5,462.5
582,2017/01/16,484.0,486.764,487.0,563000,492.0,482.0
583,2017/01/17,481.5,481.451,484.5,416000,489.0,475.5
584,2017/01/18,482.5,480.0,479.0,420000,484.5,472.5
585,2017/01/19,467.0,472.77,482.5,589800,482.5,466.5
586,2017/01/20,469.5,471.559,470.0,376200,478.5,467.0
587,2017/01/23,480.5,480.272,470.5,537800,485.5,470.0
588,2017/01/24,470.0,476.025,479.0,319400,484.0,470.0
589,2017/01/25,483.5,480.836,477.5,429800,486.0,474.5
590,2017/01/26,484.5,486.802,489.0,415400,490.5,482.0
591,2017/01/27,484.5,486.941,487.5,412600,490.5,480.5
592,2017/01/30,505.0,499.28,486.5,779000,507.0,486.5
593,2017/01/31,506.0,503.249,494.0,776400,509.0,491.5
594,2017/02/01,495.0,496.169,501.5,669000,503.0,490.0
595,2017/02/02,513.0,509.351,501.5,864600,516.0,498.0
596,2017/02/03,503.5,513.651,519.0,748200,524.5,502.0
597,2017/02/06,509.5,508.677,509.0,350400,512.5,505.5
598,2017/02/07,503.5,506.333,509.5,399400,511.5,501.5
599,2017/02/08,518.5,512.3,505.5,401400,521.0,504.0
600,2017/02/09,510.0,513.913,523.0,417800,523.5,508.5
601,2017/02/10,523.5,517.322,519.0,491600,524.0,511.5
602,2017/02/13,480.5,490.06,514.0,1952200,514.0,476.5
603,2017/02/14,509.0,500.451,492.5,1154200,512.0,489.0
604,2017/02/15,498.0,501.926,509.5,461800,511.5,496.5
605,2017/02/16,497.5,502.432,499.0,593600,510.0,495.5
606,2017/02/17,497.5,496.498,498.0,455800,503.5,488.0
607,2017/02/20,508.5,510.699,507.5,727400,517.5,504.5
608,2017/02/21,502.5,501.956,508.5,440000,510.0,498.0
609,2017/02/22,502.5,499.81,505.0,493400,507.5,495.5
610,2017/02/23,499.0,499.097,500.5,291200,504.0,495.5
611,2017/02/24,520.5,512.435,492.5,1163200,521.0,492.0
612,2017/02/27,505.0,509.241,515.0,593600,519.0,504.5
613,2017/02/28,499.5,502.84,505.0,607600,513.0,499.0
614,2017/03/01,511.0,503.508,498.5,513600,511.0,496.0
615,2017/03/02,504.5,507.444,514.0,312200,514.0,503.5
616,2017/03/03,519.0,515.95,505.0,717800,522.0,503.5
617,2017/03/06,538.5,534.315,520.5,1180600,542.5,520.5
618,2017/03/07,540.0,537.318,540.0,832200,548.0,528.5
619,2017/03/08,549.0,538.406,540.0,834400,549.5,526.5
620,2017/03/09,547.5,552.136,551.0,968600,563.0,540.5
621,2017/03/10,539.0,539.67,547.5,603800,550.0,533.0
622,2017/03/13,528.5,530.965,536.0,561200,538.0,526.0
623,2017/03/14,555.0,543.573,525.0,883400,560.0,524.0
624,2017/03/15,537.0,540.704,555.0,763400,557.0,529.5
625,2017/03/16,549.5,544.823,535.0,578200,550.0,535.0
626,2017/03/17,540.0,539.092,546.0,431000,548.0,534.0
627,2017/03/21,565.0,558.571,539.5,1039600,567.5,537.0
628,2017/03/22,570.5,566.622,555.0,934800,576.0,551.0
629,2017/03/23,583.0,580.832,575.0,1016800,591.5,567.0
630,2017/03/24,585.5,590.774,591.5,1112200,599.5,581.5
631,2017/03/27,589.5,588.764,584.0,660400,596.5,576.0
632,2017/03/28,589.5,589.046,589.5,377000,595.0,584.5
633,2017/03/29,606.5,602.45,589.5,1033400,615.0,587.5
634,2017/03/30,601.0,602.296,614.0,620200,614.0,595.0
635,2017/03/31,607.5,608.59,609.0,457000,614.5,598.0
636,2017/04/03,596.0,602.346,600.0,541800,612.5,594.5
637,2017/04/04,574.5,572.099,589.5,1104800,592.5,540.5
638,2017/04/05,566.0,566.773,573.5,413000,586.5,551.0
639,2017/04/06,555.5,553.881,565.0,692600,569.0,545.5
640,2017/04/07,558.5,562.97,557.5,734000,580.0,530.5
641,2017/04/10,562.5,561.896,559.5,369400,569.5,556.0
642,2017/04/11,571.5,568.032,567.5,504600,577.0,555.5
643,2017/04/12,545.5,546.575,563.0,582400,569.5,517.0
644,2017/04/13,558.0,552.177,540.5,470200,564.0,531.0
645,2017/04/14,561.5,567.785,553.5,945000,584.0,545.5
646,2017/04/17,600.0,588.842,561.5,779400,600.0,561.5
647,2017/04/18,601.5,608.597,619.0,826400,620.0,598.0
648,2017/04/19,606.5,609.153,606.0,467800,614.5,602.0
649,2017/04/20,604.0,604.924,605.0,262800,610.0,599.0
650,2017/04/21,592.0,594.616,604.0,482800,604.5,587.5
651,2017/04/24,598.0,599.075,600.0,209800,602.5,594.5
652,2017/04/25,590.0,593.992,597.5,222600,602.5,589.0
653,2017/04/26,608.5,605.913,592.5,583800,613.5,590.5
654,2017/04/27,625.0,622.145,614.0,758600,629.5,609.0
655,2017/04/28,619.5,621.174,625.0,383600,625.5,614.0
656,2017/05/01,619.0,622.281,625.5,446600,629.5,615.0
657,2017/05/02,637.0,630.784,624.5,754000,638.5,619.0
658,2017/05/08,647.0,647.48,648.5,648800,652.0,640.5
659,2017/05/09,648.0,652.461,645.0,715400,662.5,640.5
660,2017/05/10,649.5,647.917,648.0,423200,652.5,643.5
661,2017/05/11,650.5,648.994,650.0,545600,652.0,644.5
662,2017/05/12,654.0,648.206,650.0,579000,657.5,631.0
663,2017/05/15,756.0,739.724,671.0,4754200,782.5,671.0
664,2017/05/16,774.0,771.454,750.0,2149000,784.5,747.0
665,2017/05/17,775.5,774.886,775.0,952000,790.0,759.0
666,2017/05/18,771.5,765.26,747.5,890600,777.5,745.0
667,2017/05/19,741.5,752.761,782.5,1011400,787.0,736.0
668,2017/05/22,744.0,742.557,743.0,864400,755.0,732.5
669,2017/05/23,740.0,750.959,749.5,516800,764.5,738.0
670,2017/05/24,798.5,805.629,775.0,6973400,860.5,766.0
671,2017/05/25,798.5,802.298,795.0,1384400,820.5,789.0
672,2017/05/26,781.5,781.815,790.5,906600,792.5,770.0
673,2017/05/29,782.5,786.008,780.0,684200,798.5,771.0
674,2017/05/30,782.5,780.034,782.5,627200,792.5,765.0
675,2017/05/31,775.0,770.277,781.0,879400,790.5,754.0
676,2017/06/01,779.5,775.041,778.5,358200,782.5,767.0
677,2017/06/02,749.5,759.687,772.5,773000,775.0,745.0
678,2017/06/05,786.5,780.515,748.0,1055400,793.0,745.5
679,2017/06/06,796.5,793.991,794.0,1426800,807.0,772.5
680,2017/06/07,810.0,801.253,798.5,912600,813.0,780.0
681,2017/06/08,822.0,817.858,804.0,1561600,832.0,798.5
682,2017/06/09,811.0,814.485,830.0,651800,830.0,805.5
683,2017/06/12,808.0,805.47,805.5,692000,817.0,790.5
684,2017/06/13,803.0,814.818,825.0,999400,837.5,798.0
685,2017/06/14,816.0,816.261,803.0,771600,823.0,803.0
686,2017/06/15,812.5,817.151,812.5,557200,827.0,810.5
687,2017/06/16,817.5,814.28,813.5,495800,824.0,803.0
688,2017/06/19,880.0,861.429,825.0,2142200,888.0,825.0
689,2017/06/20,901.5,895.853,875.5,1373200,915.5,875.0
690,2017/06/21,910.0,898.143,892.5,903600,910.0,884.5
691,2017/06/22,912.0,922.391,917.5,906200,939.0,904.5
692,2017/06/23,900.0,910.649,925.0,1569000,938.0,878.5
693,2017/06/26,885.0,887.335,900.0,985400,907.0,878.5
694,2017/06/27,880.0,872.741,892.0,1152600,894.0,859.0
695,2017/06/28,835.5,848.24,870.0,1575000,874.0,828.5
696,2017/06/29,842.5,839.631,848.5,862200,852.5,826.5
697,2017/06/30,818.5,827.798,830.0,1080400,844.5,814.0
698,2017/07/03,837.5,851.396,831.5,1531000,867.5,830.5
699,2017/07/04,792.0,810.173,849.0,1343800,849.5,790.5
700,2017/07/05,807.0,800.383,786.0,821400,812.5,776.5
701,2017/07/06,797.0,799.361,807.0,437800,811.0,791.5
702,2017/07/07,805.0,794.605,791.5,375600,805.0,783.0
703,2017/07/10,815.0,811.565,825.0,785000,827.0,796.0
704,2017/07/11,827.0,819.267,809.5,438800,829.5,805.0
705,2017/07/12,810.5,820.351,825.5,445400,831.5,810.5
706,2017/07/13,813.5,813.208,815.5,291800,820.0,808.0
707,2017/07/14,807.0,810.605,808.5,261400,820.0,805.5
708,2017/07/18,794.0,796.304,810.5,508600,817.5,785.0
709,2017/07/19,823.0,815.841,794.0,565200,828.5,794.0
710,2017/07/20,825.0,831.071,827.0,689000,843.0,818.5
711,2017/07/21,824.5,824.521,819.0,366000,834.5,818.0
712,2017/07/24,853.5,847.831,825.0,1054600,862.5,823.5
713,2017/07/25,857.5,868.621,865.5,1409400,882.5,854.0
714,2017/07/26,864.5,851.537,860.5,827000,864.5,839.5
715,2017/07/27,846.5,856.497,865.0,762600,869.0,846.5
716,2017/07/28,816.0,825.205,841.0,575800,845.0,813.0
717,2017/07/31,805.0,802.972,805.5,663400,816.0,792.5
718,2017/08/01,767.5,778.926,802.0,959600,803.5,762.5
719,2017/08/02,794.0,786.227,770.0,744000,796.5,770.0
720,2017/08/03,765.5,773.768,785.5,668600,793.5,761.0
721,2017/08/04,777.5,773.138,759.0,380400,781.5,757.5
722,2017/08/07,785.0,785.572,784.0,403000,792.0,775.5
723,2017/08/08,804.0,803.154,792.0,474200,811.5,790.5
724,2017/08/09,795.5,796.53,815.0,610200,817.5,785.0
725,2017/08/10,844.5,852.437,815.5,2695800,880.0,800.5
726,2017/08/14,844.5,838.417,842.5,534600,846.5,822.0
727,2017/08/15,852.5,853.112,850.0,530600,863.5,847.0
728,2017/08/16,862.0,855.005,855.0,570600,862.0,849.0
729,2017/08/17,866.0,866.983,870.0,504200,873.5,862.5
730,2017/08/18,864.0,868.435,875.0,655400,878.5,858.0
731,2017/08/21,865.0,865.788,870.0,404600,872.5,858.0
732,2017/08/22,847.0,848.776,855.0,528800,858.5,837.5
733,2017/08/23,871.5,864.983,855.5,439400,873.5,849.0
734,2017/08/24,864.5,865.618,870.0,260400,870.5,859.0
735,2017/08/25,867.0,868.11,870.0,263400,872.5,860.5
736,2017/08/28,901.0,887.701,870.5,931600,901.5,861.0
737,2017/08/29,904.5,901.619,892.5,832400,914.0,887.0
738,2017/08/30,877.5,878.772,910.0,881200,910.0,853.5
739,2017/08/31,866.0,863.289,877.5,550400,877.5,853.0
740,2017/09/01,887.5,875.01,880.0,654200,887.5,860.5
741,2017/09/04,854.5,863.0,877.5,653400,882.0,853.0
742,2017/09/05,788.5,809.251,853.5,1285400,857.0,780.0
743,2017/09/06,809.5,798.914,780.0,749800,818.0,768.0
744,2017/09/07,783.5,790.585,806.5,861800,810.0,772.5
745,2017/09/08,775.0,779.355,783.5,547200,796.5,770.5
746,2017/09/11,787.0,788.756,795.0,497200,799.5,782.0
747,2017/09/12,816.5,804.736,800.0,546200,816.5,790.0
748,2017/09/13,816.0,811.547,825.0,489800,825.0,802.0
749,2017/09/14,805.0,805.429,819.0,522000,819.0,794.5
750,2017/09/15,810.5,810.147,801.0,383400,821.0,801.0
751,2017/09/19,831.5,823.711,818.5,430600,831.5,814.5
752,2017/09/20,822.0,826.148,834.5,287600,837.0,820.5
753,2017/09/21,819.0,816.552,816.5,475000,823.5,809.5
754,2017/09/22,800.5,801.301,810.5,425800,819.0,794.0
755,2017/09/25,806.0,806.865,802.5,191000,814.0,801.0
756,2017/09/26,804.5,797.666,803.5,281800,804.5,790.5
757,2017/09/27,813.0,812.682,809.0,342600,819.0,807.0
758,2017/09/28,818.0,815.167,815.0,223200,819.5,810.0
759,2017/09/29,821.5,823.162,815.0,343000,829.5,814.0
760,2017/10/02,792.5,799.018,820.5,741800,824.0,790.0
761,2017/10/03,810.0,800.423,801.0,557000,810.0,788.5
762,2017/10/04,795.5,797.051,807.5,441200,808.5,791.0
763,2017/10/05,773.5,780.153,794.5,549600,795.5,770.0
764,2017/10/06,756.0,754.836,773.0,998400,773.5,743.0
765,2017/10/10,750.5,746.888,746.5,693600,754.0,741.0
766,2017/10/11,739.0,743.808,750.5,731400,757.5,736.0
767,2017/10/12,754.0,756.426,742.5,648200,764.5,742.5
768,2017/10/13,742.5,742.493,754.0,566200,755.5,737.5
769,2017/10/16,739.0,738.343,748.0,354200,748.0,732.0
770,2017/10/17,724.5,725.391,742.0,601200,742.0,715.5
771,2017/10/18,730.0,734.986,727.5,365800,741.5,727.5
772,2017/10/19,719.5,724.62,732.5,249400,735.5,718.5
773,2017/10/20,722.5,719.907,717.5,243600,728.5,715.5
774,2017/10/23,736.5,730.798,725.0,413600,739.0,716.5
775,2017/10/24,735.5,731.215,740.0,420600,740.0,725.5
776,2017/10/25,748.5,748.085,742.5,565600,753.5,739.0
777,2017/10/26,734.5,739.729,747.5,375400,750.0,733.0
778,2017/10/27,762.0,753.627,738.5,449200,762.0,736.0
779,2017/10/30,775.0,771.624,770.0,598800,779.5,763.5
780,2017/10/31,779.0,772.805,773.5,517600,779.5,763.5
781,2017/11/01,810.0,797.97,785.0,1203800,812.5,778.0
782,2017/11/02,797.5,802.451,804.5,1002000,817.0,789.0
783,2017/11/06,795.5,805.425,800.0,747200,815.5,794.0
784,2017/11/07,784.5,782.72,804.0,788200,804.0,770.5
785,2017/11/08,795.0,784.084,785.5,423000,795.0,775.0
786,2017/11/09,806.0,800.561,794.0,836200,808.5,787.0
787,2017/11/10,829.0,816.955,801.0,983600,830.0,799.5
788,2017/11/13,854.5,866.493,885.0,2347000,885.0,846.0
789,2017/11/14,835.0,836.105,840.0,753200,849.0,825.5
790,2017/11/15,788.5,805.411,826.5,1051600,836.5,779.0
791,2017/11/16,775.0,781.305,783.0,904000,802.5,771.0
792,2017/11/17,757.0,761.625,782.5,1175600,790.0,752.5
793,2017/11/20,778.0,765.721,752.5,766600,779.5,745.0
794,2017/11/21,785.5,788.535,792.5,446600,794.5,782.0
795,2017/11/22,780.5,788.779,792.5,417400,797.5,779.0
796,2017/11/24,786.5,781.235,775.0,428600,786.5,772.0
797,2017/11/27,817.5,811.32,800.0,717400,821.5,796.0
798,2017/11/28,832.0,829.112,825.0,964200,842.0,808.5
799,2017/11/29,840.0,833.793,836.5,430600,840.0,826.0
800,2017/11/30,849.0,833.147,835.0,607800,849.0,813.5
801,2017/12/01,840.0,844.376,849.0,416400,849.5,837.0
802,2017/12/04,816.0,829.133,841.5,550000,846.5,815.5
803,2017/12/05,800.0,798.33,810.0,555200,812.5,788.5
804,2017/12/06,792.0,799.001,796.5,402800,817.0,785.5
805,2017/12/07,798.0,792.919,790.0,461600,799.0,787.5
806,2017/12/08,817.5,810.989,809.0,445000,819.5,795.5
807,2017/12/11,855.5,844.191,828.0,751800,859.0,821.5
808,2017/12/12,854.0,857.317,863.5,609400,870.0,845.0
809,2017/12/13,867.5,861.967,855.0,337200,867.5,854.5
810,2017/12/14,861.5,864.442,861.0,317200,873.0,858.0
811,2017/12/15,849.0,849.209,861.5,446000,862.0,839.5
812,2017/12/18,894.5,878.652,854.5,1004600,897.0,854.0
813,2017/12/19,931.5,915.907,900.0,1278800,935.0,893.0
814,2017/12/20,928.5,930.984,932.0,1006000,943.5,914.0
815,2017/12/21,950.0,938.559,926.5,704200,952.0,922.0
816,2017/12/22,955.5,950.505,945.0,756400,961.0,931.5
817,2017/12/25,930.0,933.897,950.0,664600,950.0,919.5
818,2017/12/26,939.0,932.13,915.0,543600,945.5,912.0
819,2017/12/27,941.0,942.127,915.0,557000,955.0,915.0
820,2017/12/28,919.0,928.334,945.0,504100,945.0,902.0
821,2017/12/29,902.0,911.258,918.0,409500,927.0,898.0
822,2018/01/04,1015.0,1005.796,998.0,2587500,1040.0,952.0
823,2018/01/05,975.0,991.676,1031.0,1874700,1031.0,965.0
824,2018/01/09,957.0,948.99,973.0,1278300,976.0,936.0
825,2018/01/10,948.0,946.944,962.0,721800,962.0,936.0
826,2018/01/11,936.0,936.153,941.0,844800,947.0,925.0
827,2018/01/12,939.0,944.709,940.0,659100,958.0,935.0
828,2018/01/15,973.0,958.276,950.0,617500,976.0,936.0
829,2018/01/16,1000.0,989.753,972.0,1032800,1007.0,958.0
830,2018/01/17,1030.0,1015.996,989.0,1144500,1034.0,982.0
831,2018/01/18,1054.0,1059.042,1051.0,1838300,1076.0,1034.0
832,2018/01/19,1064.0,1062.595,1050.0,1071800,1076.0,1049.0
833,2018/01/22,1090.0,1074.252,1065.0,1101700,1090.0,1041.0
834,2018/01/23,1114.0,1115.772,1111.0,1209800,1136.0,1091.0
835,2018/01/24,1174.0,1164.065,1130.0,1915500,1190.0,1124.0
836,2018/01/25,1174.0,1163.707,1155.0,801900,1179.0,1145.0
837,2018/01/26,1170.0,1168.741,1190.0,630300,1190.0,1152.0
838,2018/01/29,1158.0,1159.866,1180.0,598800,1185.0,1139.0
839,2018/01/30,1122.0,1125.643,1149.0,1055300,1169.0,1090.0
840,2018/01/31,1131.0,1137.63,1119.0,715900,1156.0,1104.0
841,2018/02/01,1172.0,1160.628,1140.0,526700,1174.0,1135.0
842,2018/02/02,1166.0,1164.697,1173.0,411200,1180.0,1142.0
843,2018/02/05,1125.0,1132.62,1106.0,979700,1162.0,1105.0
844,2018/02/06,1081.0,1058.185,1048.0,2043200,1089.0,1033.0
845,2018/02/07,1082.0,1104.558,1156.0,1104000,1160.0,1068.0
846,2018/02/08,1100.0,1088.671,1084.0,1144100,1108.0,1068.0
847,2018/02/09,1069.0,1054.984,1040.0,1298700,1077.0,1031.0
848,2018/02/13,1019.0,1046.842,1087.0,1196900,1095.0,1000.0
849,2018/02/14,972.0,959.41,1005.0,1928700,1006.0,917.0
850,2018/02/15,1032.0,1010.131,990.0,835800,1032.0,985.0
851,2018/02/16,1046.0,1035.483,1040.0,755600,1060.0,1014.0
852,2018/02/19,1081.0,1065.94,1061.0,561600,1081.0,1049.0
853,2018/02/20,1053.0,1068.297,1083.0,574800,1098.0,1045.0
854,2018/02/21,1176.0,1135.926,1070.0,2012200,1177.0,1065.0
855,2018/02/22,1192.0,1188.542,1183.0,1362700,1219.0,1165.0
856,2018/02/23,1195.0,1187.966,1207.0,528100,1217.0,1166.0
857,2018/02/26,1204.0,1213.916,1215.0,713400,1235.0,1195.0
858,2018/02/27,1149.0,1164.766,1194.0,931500,1215.0,1136.0
859,2018/02/28,1169.0,1157.555,1136.0,485100,1172.0,1135.0
860,2018/03/01,1141.0,1137.904,1169.0,554200,1171.0,1122.0
861,2018/03/02,1136.0,1120.283,1111.0,634300,1150.0,1086.0
862,2018/03/05,1073.0,1085.671,1136.0,793000,1150.0,1041.0
863,2018/03/06,1108.0,1113.647,1110.0,526800,1136.0,1097.0
864,2018/03/07,1107.0,1104.494,1100.0,412100,1123.0,1086.0
865,2018/03/08,1145.0,1133.52,1111.0,438900,1148.0,1109.0
866,2018/03/09,1163.0,1170.072,1179.0,685200,1193.0,1136.0
867,2018/03/12,1133.0,1138.297,1175.0,638900,1179.0,1117.0
868,2018/03/13,1150.0,1145.536,1117.0,394000,1158.0,1116.0
869,2018/03/14,1131.0,1129.438,1126.0,272600,1142.0,1124.0
870,2018/03/15,1160.0,1143.972,1135.0,336100,1160.0,1124.0
871,2018/03/16,1136.0,1139.724,1160.0,330300,1168.0,1126.0
872,2018/03/19,1092.0,1095.815,1124.0,384300,1124.0,1061.0
873,2018/03/20,1080.0,1068.845,1051.0,387600,1090.0,1050.0
874,2018/03/22,1065.0,1071.65,1081.0,570400,1096.0,1053.0
875,2018/03/23,965.0,959.773,969.0,4768500,973.0,934.0
876,2018/03/26,979.0,972.86,975.0,2252600,981.0,956.0
877,2018/03/27,994.0,996.468,992.0,1891000,1007.0,987.0
878,2018/03/28,987.0,985.561,981.0,727800,998.0,972.0
879,2018/03/29,962.0,973.697,999.0,1305000,999.0,959.0
880,2018/03/30,980.0,980.18,984.0,995400,987.0,972.0
881,2018/04/02,982.0,985.776,990.0,1010300,992.0,976.0
882,2018/04/03,971.0,968.618,969.0,1236900,978.0,958.0
883,2018/04/04,961.0,963.29,970.0,990700,972.0,957.0
884,2018/04/05,975.0,975.971,980.0,600900,984.0,965.0
885,2018/04/06,970.0,972.547,990.0,800700,990.0,965.0
886,2018/04/09,978.0,980.439,975.0,641800,989.0,974.0
887,2018/04/10,974.0,973.501,979.0,526600,981.0,966.0
888,2018/04/11,930.0,942.554,976.0,1173200,978.0,922.0
889,2018/04/12,932.0,938.848,930.0,782500,954.0,926.0
890,2018/04/13,858.0,878.08,932.0,2129400,935.0,856.0
891,2018/04/16,842.0,840.778,858.0,1653400,860.0,825.0
892,2018/04/17,832.0,819.655,842.0,2961500,845.0,787.0
893,2018/04/18,856.0,855.796,847.0,1084300,868.0,835.0
894,2018/04/19,845.0,845.149,856.0,889300,860.0,830.0
895,2018/04/20,866.0,866.274,838.0,1103000,883.0,836.0
896,2018/04/23,885.0,873.38,879.0,805100,889.0,859.0
897,2018/04/24,877.0,880.671,889.0,779900,893.0,871.0
898,2018/04/25,872.0,877.79,877.0,436400,888.0,870.0
899,2018/04/26,872.0,871.775,875.0,573200,883.0,858.0
900,2018/04/27,878.0,878.48,877.0,583400,890.0,867.0
901,2018/05/01,882.0,877.849,877.0,440600,887.0,868.0
902,2018/05/02,888.0,886.927,885.0,483500,893.0,880.0
903,2018/05/07,895.0,898.96,903.0,551200,907.0,891.0
904,2018/05/08,927.0,915.398,896.0,699700,930.0,891.0
905,2018/05/09,936.0,939.081,928.0,888200,954.0,922.0
906,2018/05/10,914.0,926.516,941.0,674500,944.0,913.0
907,2018/05/11,942.0,927.932,925.0,883400,948.0,916.0
908,2018/05/14,901.0,909.5,960.0,2067800,960.0,856.0
909,2018/05/15,901.0,900.174,904.0,650800,913.0,890.0
910,2018/05/16,897.0,899.597,895.0,543600,913.0,886.0
911,2018/05/17,907.0,894.819,891.0,892100,914.0,877.0
912,2018/05/18,923.0,912.833,908.0,318500,923.0,901.0
913,2018/05/21,958.0,948.327,935.0,1004700,964.0,926.0
914,2018/05/22,949.0,958.003,959.0,813700,975.0,942.0
915,2018/05/23,930.0,934.151,948.0,491400,952.0,922.0
916,2018/05/24,933.0,931.757,935.0,425200,944.0,923.0
917,2018/05/25,915.0,913.892,922.0,579900,927.0,907.0
918,2018/05/28,916.0,921.249,920.0,335400,931.0,912.0
919,2018/05/29,900.0,895.381,913.0,876800,913.0,881.0
920,2018/05/30,890.0,892.02,874.0,451100,905.0,874.0
921,2018/05/31,935.0,923.488,901.0,1007700,935.0,901.0
922,2018/06/01,882.0,890.136,925.0,1155700,925.0,876.0
923,2018/06/04,878.0,872.392,886.0,655600,887.0,859.0
924,2018/06/05,893.0,893.278,878.0,757800,905.0,876.0
925,2018/06/06,865.0,869.27,888.0,605500,889.0,861.0
926,2018/06/07,885.0,879.709,872.0,442100,887.0,867.0
927,2018/06/08,879.0,878.591,875.0,415500,887.0,874.0
928,2018/06/11,890.0,889.15,875.0,589400,907.0,875.0
929,2018/06/12,905.0,898.85,905.0,727400,905.0,889.0
930,2018/06/13,897.0,889.084,901.0,907400,901.0,871.0
931,2018/06/14,886.0,887.983,884.0,348400,896.0,881.0
932,2018/06/15,869.0,871.123,881.0,620500,885.0,862.0
933,2018/06/18,849.0,847.424,863.0,755400,868.0,832.0
934,2018/06/19,805.0,816.102,835.0,1183600,836.0,801.0
935,2018/06/20,801.0,784.33,814.0,1796600,815.0,759.0
936,2018/06/21,869.0,860.98,846.0,4582000,886.0,841.0
937,2018/06/22,863.0,862.482,860.0,1259200,872.0,848.0
938,2018/06/25,818.0,839.449,876.0,1594100,881.0,810.0
939,2018/06/26,845.0,820.865,809.0,1339500,846.0,801.0
940,2018/06/27,841.0,842.311,840.0,829100,853.0,830.0
941,2018/06/28,855.0,846.611,850.0,723900,859.0,834.0
942,2018/06/29,886.0,873.798,860.0,1242800,888.0,852.0
943,2018/07/02,849.0,859.808,886.0,1019600,887.0,841.0
944,2018/07/03,857.0,852.414,856.0,940800,868.0,841.0
945,2018/07/04,842.0,833.288,842.0,817500,847.0,822.0
946,2018/07/05,834.0,843.005,847.0,899300,863.0,826.0
947,2018/07/06,856.0,848.305,832.0,649000,860.0,832.0
948,2018/07/09,871.0,868.645,860.0,777700,878.0,856.0
949,2018/07/10,890.0,884.037,877.0,1123100,897.0,864.0
950,2018/07/11,880.0,880.848,885.0,864400,893.0,871.0
951,2018/07/12,884.0,886.898,875.0,468800,895.0,873.0
952,2018/07/13,982.0,972.722,933.0,4118500,1008.0,933.0
953,2018/07/17,984.0,982.404,984.0,1490200,990.0,960.0
954,2018/07/18,966.0,981.837,990.0,1562200,1002.0,960.0
955,2018/07/19,947.0,954.872,958.0,689700,975.0,942.0
956,2018/07/20,958.0,949.562,940.0,612700,968.0,921.0
957,2018/07/23,936.0,942.846,951.0,507900,957.0,934.0
958,2018/07/24,940.0,946.135,944.0,604300,960.0,934.0
959,2018/07/25,950.0,945.536,947.0,533200,953.0,938.0
960,2018/07/26,953.0,958.253,950.0,757300,970.0,947.0
961,2018/07/27,933.0,928.667,954.0,1041800,958.0,912.0
962,2018/07/30,904.0,905.92,933.0,2714000,934.0,891.0
963,2018/07/31,883.0,880.751,901.0,1336600,911.0,862.0
964,2018/08/01,860.0,869.519,886.0,1131100,900.0,855.0
965,2018/08/02,848.0,848.284,856.0,980000,861.0,832.0
966,2018/08/03,867.0,861.264,849.0,1127100,887.0,842.0
967,2018/08/06,868.0,875.099,863.0,1035000,885.0,863.0
968,2018/08/07,855.0,853.124,863.0,885000,871.0,840.0
969,2018/08/08,867.0,861.185,854.0,639200,867.0,854.0
970,2018/08/09,885.0,873.807,865.0,791900,885.0,865.0
971,2018/08/10,847.0,862.943,887.0,1043800,891.0,845.0
972,2018/08/13,796.0,789.93,805.0,1767900,810.0,761.0
973,2018/08/14,827.0,828.899,816.0,926300,845.0,816.0
974,2018/08/15,818.0,821.845,822.0,671500,837.0,814.0
975,2018/08/16,800.0,801.826,803.0,663500,816.0,795.0
976,2018/08/17,805.0,806.441,803.0,551700,819.0,799.0
977,2018/08/20,799.0,801.255,806.0,600300,811.0,795.0
978,2018/08/21,777.0,783.994,791.0,634200,796.0,774.0
979,2018/08/22,786.0,778.479,766.0,589200,792.0,761.0
980,2018/08/23,811.0,806.032,796.0,633700,814.0,792.0
981,2018/08/24,821.0,815.187,806.0,325800,823.0,806.0
982,2018/08/27,824.0,824.483,826.0,781400,832.0,816.0
983,2018/08/28,804.0,810.74,831.0,590800,834.0,799.0
984,2018/08/29,802.0,806.186,804.0,452500,817.0,800.0
985,2018/08/30,832.0,825.75,810.0,875200,835.0,806.0
986,2018/08/31,822.0,825.183,816.0,625300,833.0,815.0
987,2018/09/03,809.0,815.191,825.0,396200,827.0,807.0
988,2018/09/04,801.0,805.371,810.0,425800,813.0,801.0
989,2018/09/05,808.0,809.6,806.0,406000,821.0,801.0
990,2018/09/06,790.0,791.772,800.0,651000,804.0,785.0
991,2018/09/07,784.0,783.517,780.0,410100,792.0,777.0
992,2018/09/10,767.0,774.85,775.0,595200,789.0,767.0
993,2018/09/11,749.0,752.116,772.0,1172900,773.0,745.0
994,2018/09/12,756.0,751.425,745.0,549200,758.0,745.0
995,2018/09/13,748.0,750.417,755.0,785600,765.0,741.0
996,2018/09/14,784.0,771.464,750.0,776500,786.0,749.0
997,2018/09/18,790.0,782.693,777.0,508200,799.0,766.0
998,2018/09/19,800.0,801.856,800.0,712500,808.0,795.0
999,2018/09/20,807.0,806.497,811.0,547500,812.0,799.0
1000,2018/09/21,809.0,811.979,809.0,601500,820.0,805.0
1001,2018/09/25,822.0,819.784,808.0,591900,825.0,808.0
1002,2018/09/26,831.0,835.953,830.0,855500,846.0,826.0
1003,2018/09/27,819.0,829.995,833.0,698600,845.0,818.0
1004,2018/09/28,839.0,837.651,831.0,562300,843.0,831.0
1005,2018/10/01,865.0,858.57,847.0,940800,866.0,845.0
1006,2018/10/02,862.0,865.477,868.0,921100,878.0,856.0
1007,2018/10/03,871.0,868.936,865.0,677000,877.0,863.0
1008,2018/10/04,883.0,882.277,880.0,1109900,894.0,873.0
1009,2018/10/05,859.0,861.439,878.0,695400,878.0,847.0
1010,2018/10/09,795.0,801.697,830.0,1445900,832.0,777.0
1011,2018/10/10,790.0,791.579,801.0,763200,805.0,778.0
1012,2018/10/11,744.0,739.254,720.0,1014200,758.0,719.0
1013,2018/10/12,761.0,752.383,740.0,705400,765.0,737.0
1014,2018/10/15,762.0,762.024,768.0,529800,772.0,750.0
1015,2018/10/16,755.0,756.851,757.0,599800,777.0,745.0
1016,2018/10/17,785.0,778.197,764.0,436500,788.0,762.0
1017,2018/10/18,757.0,770.867,790.0,497500,790.0,757.0
1018,2018/10/19,752.0,750.811,745.0,396900,760.0,742.0
1019,2018/10/22,764.0,755.25,748.0,385200,769.0,742.0
1020,2018/10/23,749.0,754.397,755.0,344700,765.0,746.0
1021,2018/10/24,739.0,747.225,752.0,490400,758.0,739.0
1022,2018/10/25,674.0,690.837,709.0,1023700,714.0,674.0
1023,2018/10/26,651.0,660.808,687.0,987900,696.0,642.0
1024,2018/10/29,632.0,642.619,646.0,1169600,659.0,630.0
1025,2018/10/30,663.0,640.581,616.0,1323700,669.0,613.0
1026,2018/10/31,697.0,687.499,677.0,752200,701.0,673.0
1027,2018/11/01,690.0,693.607,701.0,618900,705.0,683.0
1028,2018/11/02,725.0,713.561,695.0,549400,727.0,695.0
1029,2018/11/05,729.0,731.239,714.0,482500,740.0,710.0
1030,2018/11/06,706.0,713.363,728.0,464600,730.0,704.0
1031,2018/11/07,717.0,714.399,708.0,477800,725.0,694.0
1032,2018/11/08,734.0,735.166,732.0,375700,743.0,724.0
1033,2018/11/09,719.0,723.598,724.0,332700,737.0,716.0
1034,2018/11/12,711.0,718.423,720.0,420100,727.0,709.0
1035,2018/11/13,705.0,697.3,683.0,698300,711.0,680.0
1036,2018/11/14,704.0,717.145,717.0,755500,732.0,704.0
1037,2018/11/15,649.0,659.641,693.0,1728100,699.0,645.0
1038,2018/11/16,641.0,647.474,656.0,1069100,662.0,636.0
1039,2018/11/19,672.0,659.393,642.0,709500,672.0,640.0
1040,2018/11/20,651.0,661.958,662.0,785700,685.0,647.0
1041,2018/11/21,641.0,642.775,633.0,781600,656.0,624.0
1042,2018/11/22,647.0,639.987,645.0,568400,648.0,627.0
1043,2018/11/26,632.0,634.932,638.0,967500,648.0,628.0
1044,2018/11/27,658.0,657.152,642.0,839200,667.0,641.0
1045,2018/11/28,660.0,661.47,656.0,562800,672.0,652.0
1046,2018/11/29,666.0,667.983,670.0,696300,677.0,661.0
1047,2018/11/30,669.0,665.658,667.0,526100,672.0,658.0
1048,2018/12/03,683.0,678.445,685.0,725400,688.0,664.0
1049,2018/12/04,674.0,685.868,691.0,653700,700.0,672.0
1050,2018/12/05,660.0,661.354,656.0,513000,674.0,652.0
1051,2018/12/06,634.0,635.166,652.0,772500,657.0,623.0
1052,2018/12/07,614.0,618.059,634.0,1172700,641.0,602.0
1053,2018/12/10,577.0,580.612,594.0,1062100,598.0,572.0
1054,2018/12/11,568.0,575.827,583.0,643700,589.0,565.0
1055,2018/12/12,585.0,574.842,570.0,847900,587.0,557.0
1056,2018/12/13,602.0,597.462,591.0,553500,605.0,586.0
1057,2018/12/14,568.0,576.156,593.0,580500,594.0,567.0
1058,2018/12/17,553.0,556.513,558.0,825800,570.0,548.0
1059,2018/12/18,526.0,534.303,535.0,892900,548.0,525.0
1060,2018/12/19,537.0,539.926,525.0,912900,554.0,524.0
1061,2018/12/20,520.0,520.59,527.0,1030200,540.0,509.0
1062,2018/12/21,513.0,506.598,515.0,1822200,521.0,496.0
1063,2018/12/25,469.0,480.429,477.0,1493400,495.0,469.0
1064,2018/12/26,491.0,495.836,485.0,1157700,509.0,483.0
1065,2018/12/27,521.0,523.4,535.0,964300,535.0,513.0
1066,2018/12/28,507.0,507.128,515.0,754400,521.0,498.0
1067,2019/01/04,489.0,484.664,485.0,602000,490.0,478.0
1068,2019/01/07,546.0,535.697,518.0,1060000,548.0,516.0
1069,2019/01/08,544.0,548.222,555.0,832600,555.0,541.0
1070,2019/01/09,541.0,545.783,558.0,533300,563.0,534.0
1071,2019/01/10,526.0,528.563,534.0,426700,538.0,521.0
1072,2019/01/11,535.0,534.781,530.0,498500,542.0,526.0
1073,2019/01/15,548.0,543.103,534.0,373600,550.0,528.0
1074,2019/01/16,555.0,551.575,550.0,516000,558.0,543.0
1075,2019/01/17,560.0,555.507,566.0,477700,566.0,546.0
1076,2019/01/18,567.0,566.05,565.0,322800,570.0,558.0
1077,2019/01/21,563.0,568.569,580.0,573200,583.0,560.0
1078,2019/01/22,554.0,558.071,563.0,460000,573.0,551.0
1079,2019/01/23,545.0,543.05,544.0,594800,552.0,536.0
1080,2019/01/24,557.0,549.961,541.0,408000,559.0,538.0
1081,2019/01/25,563.0,565.254,560.0,543400,571.0,559.0
1082,2019/01/28,558.0,559.842,564.0,436500,566.0,552.0
1083,2019/01/29,561.0,553.097,551.0,575300,564.0,546.0
1084,2019/01/30,548.0,555.428,555.0,854500,567.0,548.0
1085,2019/01/31,569.0,563.293,558.0,660200,572.0,554.0
1086,2019/02/01,575.0,570.687,567.0,434600,578.0,561.0
1087,2019/02/04,595.0,586.992,576.0,542400,597.0,570.0
1088,2019/02/05,601.0,597.536,600.0,654400,602.0,589.0
1089,2019/02/06,592.0,590.997,605.0,587000,607.0,583.0
1090,2019/02/07,574.0,577.859,592.0,525200,594.0,572.0
1091,2019/02/08,554.0,557.982,561.0,639400,568.0,552.0
1092,2019/02/12,562.0,553.919,555.0,1166300,569.0,542.0
1093,2019/02/13,588.0,583.739,572.0,702400,593.0,569.0
1094,2019/02/14,688.0,675.473,648.0,2189800,688.0,642.0
1095,2019/02/15,702.0,700.421,685.0,3050800,714.0,683.0
1096,2019/02/18,676.0,682.86,714.0,1471600,719.0,667.0
1097,2019/02/19,675.0,678.622,673.0,810000,690.0,671.0
1098,2019/02/20,664.0,664.35,677.0,792600,681.0,654.0
1099,2019/02/21,669.0,677.779,664.0,947500,688.0,664.0
1100,2019/02/22,651.0,650.959,668.0,986400,669.0,642.0
1101,2019/02/25,659.0,659.099,654.0,505600,663.0,654.0
1102,2019/02/26,643.0,645.685,658.0,696200,659.0,636.0
1103,2019/02/27,644.0,642.383,641.0,533500,647.0,636.0
1104,2019/02/28,639.0,637.069,640.0,554400,647.0,632.0
1105,2019/03/01,636.0,637.619,639.0,862100,650.0,628.0
1106,2019/03/04,644.0,645.758,653.0,498500,653.0,640.0
1107,2019/03/05,645.0,642.557,640.0,410300,649.0,632.0
1108,2019/03/06,664.0,655.503,645.0,677200,665.0,638.0
1109,2019/03/07,645.0,649.675,665.0,582800,669.0,641.0
1110,2019/03/08,598.0,606.555,627.0,1200200,631.0,595.0
1111,2019/03/11,607.0,598.732,596.0,628200,608.0,585.0
1112,2019/03/12,628.0,626.866,620.0,567200,635.0,617.0
1113,2019/03/13,624.0,624.326,628.0,868100,640.0,615.0
1114,2019/03/14,609.0,613.555,618.0,525300,633.0,606.0
1115,2019/03/15,617.0,619.128,607.0,1550500,630.0,607.0
1116,2019/03/18,615.0,615.233,615.0,430300,624.0,611.0
1117,2019/03/19,589.0,594.157,612.0,859100,614.0,583.0
1118,2019/03/20,577.0,582.93,588.0,1099000,596.0,574.0
1119,2019/03/22,576.0,580.87,578.0,702800,594.0,574.0
1120,2019/03/25,559.0,559.616,561.0,609300,563.0,556.0
1121,2019/03/26,570.0,570.509,569.0,502100,579.0,565.0
1122,2019/03/27,581.0,580.981,571.0,534200,589.0,569.0
1123,2019/03/28,567.0,563.525,575.0,871600,575.0,558.0
1124,2019/03/29,585.0,580.76,574.0,490400,588.0,573.0
1125,2019/04/01,579.0,585.546,591.0,691100,594.0,575.0
1126,2019/04/02,567.0,568.535,587.0,742600,590.0,558.0
1127,2019/04/03,585.0,577.983,568.0,463000,586.0,564.0
1128,2019/04/04,580.0,584.91,590.0,340500,593.0,578.0
1129,2019/04/05,566.0,572.478,577.0,911500,586.0,562.0
1130,2019/04/08,574.0,568.982,567.0,457500,574.0,563.0
1131,2019/04/09,554.0,559.108,566.0,1051800,573.0,553.0
1132,2019/04/10,542.0,545.362,550.0,1074400,554.0,537.0
1133,2019/04/11,556.0,555.667,543.0,791500,564.0,543.0
1134,2019/04/12,544.0,545.625,554.0,669500,554.0,539.0
1135,2019/04/15,566.0,561.086,554.0,765500,567.0,552.0
1136,2019/04/16,557.0,558.383,559.0,598900,563.0,552.0
1137,2019/04/17,563.0,555.185,551.0,747300,564.0,547.0
1138,2019/04/18,542.0,546.838,558.0,899300,558.0,540.0
1139,2019/04/19,542.0,542.287,538.0,494700,549.0,538.0
1140,2019/04/22,539.0,540.544,539.0,565400,551.0,534.0
1141,2019/04/23,544.0,541.501,538.0,524600,547.0,535.0
1142,2019/04/24,557.0,557.707,548.0,836100,565.0,545.0
1143,2019/04/25,556.0,559.454,560.0,885500,568.0,556.0
1144,2019/04/26,577.0,575.113,585.0,1111400,587.0,562.0
1145,2019/05/07,580.0,580.055,580.0,780500,585.0,577.0
1146,2019/05/08,600.0,592.512,578.0,1096300,600.0,578.0
1147,2019/05/09,575.0,587.418,606.0,958200,607.0,573.0
1148,2019/05/10,578.0,573.176,572.0,839200,590.0,560.0
1149,2019/05/13,547.0,547.332,570.0,1088700,570.0,538.0
1150,2019/05/14,544.0,533.708,528.0,1226200,549.0,512.0
1151,2019/05/15,644.0,626.607,594.0,2676800,644.0,589.0
1152,2019/05/16,644.0,650.691,654.0,4459800,670.0,632.0
1153,2019/05/17,666.0,664.941,650.0,1589000,673.0,650.0
1154,2019/05/20,661.0,671.892,680.0,1302100,689.0,660.0
1155,2019/05/21,660.0,660.819,660.0,732900,668.0,652.0
1156,2019/05/22,640.0,650.209,668.0,1055300,673.0,636.0
1157,2019/05/23,644.0,638.85,635.0,839000,646.0,628.0
1158,2019/05/24,639.0,637.276,628.0,720800,648.0,628.0
1159,2019/05/27,660.0,653.467,647.0,650000,661.0,640.0
1160,2019/05/28,697.0,684.825,680.0,1495400,699.0,664.0
1161,2019/05/29,709.0,703.707,690.0,1618300,718.0,685.0
1162,2019/05/30,712.0,707.163,706.0,958700,715.0,692.0
1163,2019/05/31,711.0,709.132,710.0,652200,719.0,701.0
1164,2019/06/03,707.0,711.343,706.0,866000,725.0,698.0
1165,2019/06/04,703.0,707.458,713.0,1087100,725.0,698.0
1166,2019/06/05,739.0,731.678,723.0,1202100,745.0,706.0
1167,2019/06/06,737.0,747.494,746.0,1065300,759.0,735.0
1168,2019/06/07,766.0,753.885,738.0,1092000,768.0,732.0
1169,2019/06/10,784.0,782.482,777.0,1334600,792.0,770.0
1170,2019/06/11,761.0,768.113,776.0,819900,778.0,758.0
1171,2019/06/12,765.0,768.574,763.0,694200,775.0,756.0
1172,2019/06/13,759.0,752.329,758.0,681800,764.0,737.0
1173,2019/06/14,798.0,789.688,762.0,1452400,804.0,758.0
1174,2019/06/17,802.0,798.153,798.0,622700,804.0,790.0
1175,2019/06/18,791.0,796.496,806.0,908200,812.0,787.0
1176,2019/06/19,806.0,803.237,810.0,655700,810.0,793.0
1177,2019/06/20,799.0,802.264,805.0,572300,811.0,794.0
1178,2019/06/21,800.0,795.53,798.0,511300,801.0,790.0
1179,2019/06/24,771.0,778.147,793.0,625400,796.0,771.0
1180,2019/06/25,777.0,782.955,779.0,498700,793.0,774.0
1181,2019/06/26,775.0,769.654,765.0,402600,778.0,757.0
1182,2019/06/27,787.0,780.842,775.0,414300,788.0,766.0
1183,2019/06/28,788.0,786.829,789.0,319400,792.0,783.0
1184,2019/07/01,781.0,792.801,802.0,758600,813.0,775.0
1185,2019/07/02,801.0,794.342,778.0,515400,804.0,775.0
1186,2019/07/03,785.0,787.416,800.0,457100,803.0,782.0
1187,2019/07/04,796.0,793.588,793.0,289000,798.0,789.0
1188,2019/07/05,796.0,796.051,796.0,308800,801.0,791.0
1189,2019/07/08,787.0,790.704,791.0,310100,799.0,786.0
1190,2019/07/09,776.0,780.973,782.0,435100,792.0,772.0
1191,2019/07/10,791.0,784.763,772.0,415300,796.0,765.0
1192,2019/07/11,827.0,821.72,794.0,1394400,838.0,782.0
1193,2019/07/12,787.0,804.958,835.0,877100,838.0,786.0
1194,2019/07/16,788.0,788.399,782.0,444500,796.0,769.0
1195,2019/07/17,793.0,786.439,786.0,787400,800.0,773.0
1196,2019/07/18,799.0,800.86,788.0,651900,809.0,786.0
1197,2019/07/19,805.0,814.449,808.0,645100,826.0,802.0
1198,2019/07/22,779.0,783.059,799.0,554600,799.0,775.0
1199,2019/07/23,782.0,784.989,786.0,459200,797.0,779.0
1200,2019/07/24,793.0,789.696,779.0,394600,797.0,779.0
1201,2019/07/25,796.0,796.921,794.0,386500,802.0,785.0
1202,2019/07/26,784.0,785.303,794.0,675500,800.0,778.0
1203,2019/07/29,783.0,784.419,784.0,528300,799.0,773.0
1204,2019/07/30,787.0,787.105,782.0,261000,794.0,782.0
1205,2019/07/31,790.0,787.275,783.0,280100,792.0,780.0
1206,2019/08/01,810.0,804.067,790.0,721900,812.0,790.0
1207,2019/08/02,789.0,794.911,800.0,814800,808.0,785.0
1208,2019/08/05,761.0,763.08,783.0,1058600,788.0,741.0
1209,2019/08/06,763.0,753.083,726.0,597700,770.0,726.0
1210,2019/08/07,792.0,786.209,774.0,879900,796.0,771.0
1211,2019/08/08,664.0,681.315,720.0,2687600,726.0,663.0
1212,2019/08/09,674.0,683.234,665.0,1137900,705.0,665.0
1213,2019/08/13,659.0,659.816,664.0,858700,673.0,648.0
1214,2019/08/14,657.0,657.57,659.0,555000,665.0,651.0
1215,2019/08/15,632.0,632.768,635.0,839200,638.0,627.0
1216,2019/08/16,621.0,622.939,626.0,660200,628.0,617.0
1217,2019/08/19,636.0,628.786,625.0,581800,638.0,620.0
1218,2019/08/20,641.0,636.715,631.0,435400,643.0,628.0
1219,2019/08/21,647.0,646.439,636.0,413000,652.0,636.0
1220,2019/08/22,644.0,648.856,650.0,355300,656.0,643.0
1221,2019/08/23,622.0,620.065,634.0,1112600,638.0,611.0
