,Date,Close,VWAP,Open,Volume,High,Low
0,2014/08/25,674.0,672.268,676.0,115300,681.0,663.0
1,2014/08/26,686.0,682.589,675.0,116900,689.0,673.0
2,2014/08/27,705.0,700.506,692.0,207800,707.0,692.0
3,2014/08/28,719.0,715.461,710.0,233600,729.0,708.0
4,2014/08/29,728.0,726.464,711.0,189000,740.0,711.0
5,2014/09/01,749.0,744.574,737.0,186200,756.0,732.0
6,2014/09/02,757.0,754.486,752.0,152200,759.0,750.0
7,2014/09/03,752.0,752.048,750.0,86100,757.0,749.0
8,2014/09/04,756.0,752.186,753.0,115100,757.0,746.0
9,2014/09/05,784.0,776.849,760.0,255500,788.0,759.0
10,2014/09/08,779.0,788.152,795.0,184400,803.0,776.0
11,2014/09/09,804.0,798.377,778.0,232400,814.0,775.0
12,2014/09/10,763.0,767.18,789.0,331100,794.0,757.0
13,2014/09/11,742.0,748.727,763.0,231400,766.0,742.0
14,2014/09/12,761.0,750.962,735.0,286400,768.0,727.0
15,2014/09/16,758.0,765.175,776.0,100000,776.0,755.0
16,2014/09/17,752.0,761.817,762.0,74200,774.0,751.0
17,2014/09/18,783.0,779.892,763.0,226500,790.0,757.0
18,2014/09/19,796.0,790.226,780.0,187900,798.0,771.0
19,2014/09/22,794.0,790.784,795.0,71400,795.0,783.0
20,2014/09/24,791.0,789.459,793.0,44000,794.0,785.0
21,2014/09/25,806.0,803.742,800.0,134600,815.0,792.0
22,2014/09/26,826.0,823.671,791.0,277200,865.0,789.0
23,2014/09/29,830.0,829.461,830.0,126900,838.0,819.0
24,2014/09/30,842.0,832.643,821.0,122500,847.0,819.0
25,2014/10/01,832.0,842.285,838.0,115300,852.0,831.0
26,2014/10/02,789.0,799.836,807.0,144200,815.0,786.0
27,2014/10/03,795.0,804.76,790.0,115000,821.0,790.0
28,2014/10/06,813.0,809.888,810.0,72200,815.0,804.0
29,2014/10/07,799.0,807.161,811.0,70200,816.0,795.0
30,2014/10/08,782.0,778.337,775.0,100700,791.0,769.0
31,2014/10/09,759.0,770.171,788.0,79200,793.0,759.0
32,2014/10/10,739.0,733.316,730.0,103600,743.0,725.0
33,2014/10/14,711.0,713.841,713.0,93900,723.0,700.0
34,2014/10/15,724.0,720.989,714.0,34700,725.0,714.0
35,2014/10/16,727.0,727.553,707.0,84500,739.0,707.0
36,2014/10/17,727.0,739.925,731.0,89300,755.0,727.0
37,2014/10/20,759.0,753.672,757.0,71700,760.0,745.0
38,2014/10/21,741.0,747.392,762.0,58900,762.0,734.0
39,2014/10/22,772.0,761.627,750.0,101800,774.0,750.0
40,2014/10/23,800.0,790.849,772.0,141300,804.0,767.0
41,2014/10/24,787.0,792.247,822.0,141100,822.0,776.0
42,2014/10/27,781.0,777.427,787.0,80800,793.0,763.0
43,2014/10/28,774.0,761.553,766.0,330800,787.0,733.0
44,2014/10/29,791.0,793.07,780.0,117300,799.0,780.0
45,2014/10/30,775.0,782.681,786.0,94100,795.0,770.0
46,2014/10/31,806.0,797.522,778.0,131300,809.0,778.0
47,2014/11/04,802.0,800.767,815.0,262700,828.0,788.0
48,2014/11/05,795.0,786.34,795.0,209800,797.0,773.0
49,2014/11/06,775.0,786.081,788.0,146300,802.0,770.0
50,2014/11/07,757.0,761.81,768.0,155900,768.0,755.0
51,2014/11/10,755.0,756.873,757.0,87400,765.0,752.0
52,2014/11/11,753.0,752.333,758.0,53100,759.0,746.0
53,2014/11/12,734.0,745.595,756.0,134700,762.0,734.0
54,2014/11/13,754.0,746.715,734.0,101600,755.0,731.0
55,2014/11/14,748.0,754.137,769.0,84100,770.0,744.0
56,2014/11/17,722.0,728.88,739.0,104300,742.0,720.0
57,2014/11/18,749.0,743.607,733.0,68200,751.0,733.0
58,2014/11/19,746.0,750.601,749.0,58700,755.0,746.0
59,2014/11/20,749.0,749.466,750.0,96600,759.0,743.0
60,2014/11/21,743.0,739.888,750.0,116300,750.0,735.0
61,2014/11/25,761.0,746.295,757.0,408900,762.0,736.0
62,2014/11/26,779.0,774.237,764.0,128100,781.0,762.0
63,2014/11/27,781.0,781.486,782.0,81700,785.0,776.0
64,2014/11/28,774.0,770.79,776.0,112600,778.0,766.0
65,2014/12/01,770.0,769.027,774.0,104200,774.0,763.0
66,2014/12/02,787.0,781.389,780.0,83500,788.0,774.0
67,2014/12/03,778.0,783.519,792.0,108200,793.0,775.0
68,2014/12/04,793.0,787.437,784.0,91800,794.0,777.0
69,2014/12/05,800.0,797.697,797.0,81800,800.0,790.0
70,2014/12/08,809.0,811.793,816.0,145500,816.0,804.0
71,2014/12/09,782.0,794.08,800.0,70300,805.0,781.0
72,2014/12/10,772.0,778.503,781.0,91300,794.0,760.0
73,2014/12/11,769.0,765.323,762.0,43000,773.0,758.0
74,2014/12/12,788.0,789.212,776.0,116600,800.0,776.0
75,2014/12/15,772.0,780.494,776.0,62400,793.0,772.0
76,2014/12/16,753.0,757.712,768.0,71500,772.0,751.0
77,2014/12/17,759.0,761.078,750.0,60200,774.0,750.0
78,2014/12/18,770.0,775.197,774.0,45600,782.0,769.0
79,2014/12/19,772.0,778.349,784.0,57900,788.0,770.0
80,2014/12/22,780.0,778.943,786.0,40400,786.0,775.0
81,2014/12/24,761.0,773.041,792.0,117800,792.0,759.0
82,2014/12/25,766.0,766.192,770.0,52500,773.0,760.0
83,2014/12/26,774.0,771.888,760.0,34700,778.0,760.0
84,2014/12/29,778.0,769.838,776.0,46800,779.0,757.0
85,2014/12/30,765.0,765.888,771.0,40300,772.0,763.0
86,2015/01/05,762.0,765.469,770.0,35000,770.0,761.0
87,2015/01/06,738.0,746.757,756.0,78900,756.0,738.0
88,2015/01/07,731.0,731.79,725.0,64200,738.0,725.0
89,2015/01/08,739.0,739.419,735.0,41100,744.0,734.0
90,2015/01/09,740.0,740.031,737.0,42500,746.0,735.0
91,2015/01/13,735.0,734.796,734.0,64300,740.0,732.0
92,2015/01/14,714.0,721.617,738.0,92000,739.0,709.0
93,2015/01/15,735.0,730.111,727.0,39500,736.0,722.0
94,2015/01/16,718.0,716.874,720.0,43800,726.0,712.0
95,2015/01/19,718.0,719.282,719.0,20200,724.0,717.0
96,2015/01/20,736.0,728.582,720.0,36800,736.0,719.0
97,2015/01/21,726.0,730.544,738.0,31800,738.0,725.0
98,2015/01/22,728.0,722.956,729.0,29300,729.0,718.0
99,2015/01/23,728.0,731.195,728.0,27700,738.0,728.0
100,2015/01/26,729.0,725.51,720.0,19800,730.0,719.0
101,2015/01/27,740.0,734.803,738.0,25900,740.0,726.0
102,2015/01/28,724.0,727.859,734.0,43300,737.0,722.0
103,2015/01/29,722.0,723.835,725.0,24300,728.0,721.0
104,2015/01/30,729.0,727.542,723.0,27500,730.0,723.0
105,2015/02/02,731.0,731.245,723.0,37600,736.0,722.0
106,2015/02/03,721.0,723.307,729.0,63600,731.0,720.0
107,2015/02/04,729.0,727.828,732.0,113800,746.0,711.0
108,2015/02/05,680.0,681.479,680.0,227900,701.0,674.0
109,2015/02/06,680.0,684.858,690.0,155400,691.0,677.0
110,2015/02/09,680.0,679.218,686.0,81100,688.0,675.0
111,2015/02/10,673.0,672.026,675.0,116400,676.0,670.0
112,2015/02/12,668.0,673.005,679.0,111900,680.0,668.0
113,2015/02/13,670.0,670.812,669.0,52000,678.0,669.0
114,2015/02/16,670.0,672.405,680.0,81400,680.0,669.0
115,2015/02/17,674.0,672.772,668.0,114900,679.0,666.0
116,2015/02/18,671.0,675.072,675.0,136400,678.0,671.0
117,2015/02/19,677.0,673.407,671.0,121000,678.0,670.0
118,2015/02/20,696.0,686.692,677.0,157600,697.0,676.0
119,2015/02/23,701.0,702.331,707.0,104600,708.0,698.0
120,2015/02/24,698.0,698.526,700.0,89100,701.0,696.0
121,2015/02/25,696.0,697.202,698.0,68200,701.0,695.0
122,2015/02/26,701.0,699.264,695.0,163300,705.0,694.0
123,2015/02/27,698.0,698.507,701.0,84500,703.0,695.0
124,2015/03/02,705.0,706.754,703.0,118400,710.0,703.0
125,2015/03/03,697.0,700.941,710.0,127900,711.0,695.0
126,2015/03/04,698.0,696.84,697.0,110600,700.0,694.0
127,2015/03/05,698.0,696.478,696.0,80000,700.0,694.0
128,2015/03/06,693.0,694.575,697.0,129100,698.0,692.0
129,2015/03/09,699.0,697.88,695.0,125200,704.0,694.0
130,2015/03/10,702.0,702.726,706.0,115500,707.0,699.0
131,2015/03/11,716.0,708.939,698.0,164300,716.0,697.0
132,2015/03/12,723.0,720.396,720.0,139200,725.0,710.0
133,2015/03/13,728.0,726.751,728.0,226700,730.0,720.0
134,2015/03/16,732.0,727.28,724.0,143400,732.0,721.0
135,2015/03/17,726.0,726.838,734.0,143400,737.0,721.0
136,2015/03/18,718.0,720.149,721.0,131200,725.0,717.0
137,2015/03/19,713.0,712.835,716.0,106700,718.0,708.0
138,2015/03/20,713.0,711.473,710.0,79500,714.0,709.0
139,2015/03/23,713.0,713.794,715.0,87300,718.0,710.0
140,2015/03/24,712.0,711.006,713.0,100600,713.0,710.0
141,2015/03/25,711.0,710.592,712.0,69300,713.0,708.0
142,2015/03/26,706.0,702.702,708.0,127900,708.0,698.0
143,2015/03/27,686.0,690.393,691.0,115000,701.0,681.0
144,2015/03/30,682.0,680.332,685.0,86700,685.0,676.0
145,2015/03/31,678.0,683.734,692.0,113800,693.0,675.0
146,2015/04/01,674.0,674.746,680.0,146700,681.0,666.0
147,2015/04/02,687.0,687.43,680.0,96400,695.0,677.0
148,2015/04/03,698.0,694.264,695.0,63600,698.0,686.0
149,2015/04/06,689.0,690.924,699.0,64700,699.0,686.0
150,2015/04/07,690.0,691.255,696.0,43900,697.0,687.0
151,2015/04/08,691.0,692.988,690.0,57900,697.0,689.0
152,2015/04/09,687.0,688.034,693.0,62300,693.0,684.0
153,2015/04/10,688.0,686.603,691.0,52700,691.0,683.0
154,2015/04/13,683.0,683.837,686.0,47900,688.0,682.0
155,2015/04/14,685.0,682.515,680.0,82500,688.0,680.0
156,2015/04/15,679.0,681.944,686.0,67500,687.0,678.0
157,2015/04/16,683.0,680.15,680.0,74700,684.0,677.0
158,2015/04/17,681.0,682.687,683.0,83600,687.0,679.0
159,2015/04/20,675.0,678.126,683.0,79200,684.0,675.0
160,2015/04/21,680.0,676.796,677.0,80000,682.0,672.0
161,2015/04/22,682.0,680.522,684.0,78800,684.0,677.0
162,2015/04/23,685.0,684.462,684.0,53700,688.0,681.0
163,2015/04/24,684.0,684.897,688.0,49400,690.0,681.0
164,2015/04/27,686.0,684.437,683.0,40700,688.0,680.0
165,2015/04/28,686.0,684.965,686.0,47900,687.0,683.0
166,2015/04/30,678.0,678.471,685.0,65000,685.0,676.0
167,2015/05/01,674.0,670.602,671.0,86400,676.0,667.0
168,2015/05/07,667.0,670.293,675.0,59800,678.0,667.0
169,2015/05/08,650.0,660.191,667.0,151500,675.0,646.0
170,2015/05/11,634.0,641.533,650.0,250500,654.0,634.0
171,2015/05/12,632.0,629.519,633.0,206000,634.0,627.0
172,2015/05/13,635.0,634.709,633.0,105500,639.0,629.0
173,2015/05/14,638.0,638.877,637.0,108500,641.0,636.0
174,2015/05/15,625.0,630.176,638.0,139400,640.0,625.0
175,2015/05/18,626.0,624.266,627.0,97900,627.0,622.0
176,2015/05/19,628.0,629.319,624.0,100000,634.0,624.0
177,2015/05/20,629.0,626.759,630.0,104500,631.0,624.0
178,2015/05/21,624.0,625.817,629.0,130700,632.0,624.0
179,2015/05/22,627.0,622.932,625.0,132000,627.0,619.0
180,2015/05/25,635.0,629.549,628.0,159800,637.0,624.0
181,2015/05/26,633.0,635.934,639.0,92500,641.0,632.0
182,2015/05/27,635.0,633.684,629.0,68100,638.0,628.0
183,2015/05/28,641.0,639.924,639.0,128000,642.0,637.0
184,2015/05/29,633.0,632.307,640.0,166200,640.0,629.0
185,2015/06/01,633.0,633.812,632.0,81400,637.0,629.0
186,2015/06/02,629.0,628.861,629.0,172800,634.0,625.0
187,2015/06/03,624.0,624.157,625.0,181300,627.0,621.0
188,2015/06/04,626.0,624.004,622.0,171200,627.0,621.0
189,2015/06/05,627.0,627.307,624.0,143500,631.0,621.0
190,2015/06/08,626.0,628.221,628.0,129200,633.0,623.0
191,2015/06/09,619.0,621.14,623.0,168900,625.0,618.0
192,2015/06/10,620.0,618.162,618.0,156500,623.0,615.0
193,2015/06/11,614.0,616.696,621.0,160600,622.0,614.0
194,2015/06/12,607.0,609.43,611.0,242000,614.0,605.0
195,2015/06/15,605.0,602.191,605.0,264200,607.0,599.0
196,2015/06/16,601.0,602.143,605.0,82300,605.0,601.0
197,2015/06/17,597.0,597.265,601.0,167500,601.0,594.0
198,2015/06/18,599.0,598.361,594.0,174300,605.0,592.0
199,2015/06/19,629.0,622.337,599.0,764200,629.0,596.0
200,2015/06/22,613.0,612.181,629.0,219400,629.0,603.0
201,2015/06/23,621.0,615.423,613.0,241700,621.0,610.0
202,2015/06/24,623.0,621.761,621.0,124100,625.0,616.0
203,2015/06/25,615.0,615.59,621.0,124700,621.0,612.0
204,2015/06/26,603.0,605.103,614.0,135500,614.0,602.0
205,2015/06/29,628.0,632.022,631.0,626900,647.0,618.0
206,2015/06/30,616.0,618.798,632.0,334700,635.0,605.0
207,2015/07/01,616.0,618.828,623.0,122900,631.0,613.0
208,2015/07/02,612.0,612.553,620.0,107500,620.0,609.0
209,2015/07/03,607.0,608.518,613.0,88200,613.0,606.0
210,2015/07/06,591.0,591.349,601.0,209900,601.0,582.0
211,2015/07/07,592.0,595.434,595.0,122700,602.0,592.0
212,2015/07/08,573.0,579.804,590.0,191500,590.0,572.0
213,2015/07/09,566.0,553.27,562.0,195300,568.0,535.0
214,2015/07/10,561.0,563.77,572.0,97600,572.0,558.0
215,2015/07/13,564.0,563.294,564.0,55100,567.0,560.0
216,2015/07/14,578.0,577.388,572.0,76600,582.0,571.0
217,2015/07/15,575.0,575.998,580.0,64500,580.0,571.0
218,2015/07/16,580.0,573.708,575.0,121400,581.0,567.0
219,2015/07/17,574.0,574.749,578.0,69800,578.0,571.0
220,2015/07/21,568.0,570.29,572.0,85600,576.0,567.0
221,2015/07/22,562.0,563.348,568.0,67800,568.0,561.0
222,2015/07/23,560.0,557.785,562.0,81500,563.0,555.0
223,2015/07/24,557.0,557.668,560.0,64800,560.0,555.0
224,2015/07/27,554.0,554.634,557.0,61800,558.0,551.0
225,2015/07/28,556.0,553.107,550.0,89100,558.0,545.0
226,2015/07/29,555.0,554.685,557.0,52700,560.0,550.0
227,2015/07/30,562.0,563.579,556.0,64400,570.0,555.0
228,2015/07/31,592.0,584.221,570.0,224500,602.0,564.0
229,2015/08/03,599.0,600.989,598.0,164700,610.0,587.0
230,2015/08/04,599.0,598.065,599.0,83300,602.0,592.0
231,2015/08/05,599.0,598.308,598.0,95600,603.0,590.0
232,2015/08/06,599.0,598.895,600.0,80000,602.0,595.0
233,2015/08/07,599.0,597.687,595.0,99000,602.0,594.0
234,2015/08/10,599.0,595.087,595.0,84800,601.0,586.0
235,2015/08/11,616.0,611.055,600.0,185800,619.0,598.0
236,2015/08/12,616.0,613.162,609.0,111700,619.0,605.0
237,2015/08/13,607.0,609.088,614.0,87200,614.0,601.0
238,2015/08/14,613.0,609.629,610.0,57600,614.0,604.0
239,2015/08/17,613.0,613.165,614.0,99900,616.0,610.0
240,2015/08/18,616.0,614.485,616.0,87300,617.0,612.0
241,2015/08/19,611.0,612.549,617.0,42800,617.0,609.0
242,2015/08/20,604.0,605.916,610.0,46200,610.0,603.0
243,2015/08/21,577.0,585.098,596.0,85400,597.0,575.0
244,2015/08/24,536.0,543.017,547.0,155700,565.0,531.0
245,2015/08/25,492.0,505.49,498.0,292900,528.0,491.0
246,2015/08/26,497.0,492.143,496.0,143000,500.0,485.0
247,2015/08/27,490.0,497.944,505.0,179800,512.0,490.0
248,2015/08/28,529.0,522.28,516.0,171900,537.0,505.0
249,2015/08/31,531.0,529.924,530.0,111300,543.0,520.0
250,2015/09/01,505.0,515.41,524.0,84300,525.0,502.0
251,2015/09/02,488.0,493.371,495.0,115800,499.0,487.0
252,2015/09/03,478.0,484.871,490.0,146800,501.0,475.0
253,2015/09/04,464.0,467.033,481.0,158400,482.0,455.0
254,2015/09/07,456.0,458.538,456.0,110100,471.0,452.0
255,2015/09/08,442.0,445.596,455.0,175800,459.0,439.0
256,2015/09/09,495.0,473.776,458.0,258800,496.0,457.0
257,2015/09/10,488.0,482.328,479.0,103900,489.0,475.0
258,2015/09/11,488.0,486.864,492.0,112800,492.0,475.0
259,2015/09/14,482.0,485.292,494.0,73400,494.0,480.0
260,2015/09/15,485.0,485.48,487.0,71600,489.0,481.0
261,2015/09/16,512.0,507.23,491.0,185600,515.0,488.0
262,2015/09/17,512.0,511.211,509.0,74300,516.0,509.0
263,2015/09/18,499.0,499.725,503.0,66500,504.0,495.0
264,2015/09/24,467.0,474.912,491.0,111900,497.0,466.0
265,2015/09/25,474.0,465.67,463.0,103000,477.0,458.0
266,2015/09/28,485.0,479.695,478.0,90100,488.0,466.0
267,2015/09/29,467.0,475.968,482.0,133900,487.0,465.0
268,2015/09/30,470.0,473.773,474.0,51900,482.0,468.0
269,2015/10/01,487.0,484.993,477.0,40500,490.0,476.0
270,2015/10/02,482.0,480.468,486.0,26900,486.0,477.0
271,2015/10/05,494.0,491.234,490.0,35900,495.0,482.0
272,2015/10/06,500.0,500.808,500.0,80200,507.0,495.0
273,2015/10/07,509.0,503.872,492.0,96000,510.0,491.0
274,2015/10/08,502.0,504.211,505.0,35600,510.0,498.0
275,2015/10/09,508.0,504.85,501.0,69400,508.0,497.0
276,2015/10/13,512.0,508.888,507.0,76700,515.0,501.0
277,2015/10/14,491.0,493.851,511.0,61700,511.0,488.0
278,2015/10/15,499.0,496.531,490.0,70300,506.0,486.0
279,2015/10/16,494.0,499.708,500.0,80800,509.0,492.0
280,2015/10/19,488.0,491.113,495.0,54700,502.0,486.0
281,2015/10/20,496.0,493.692,494.0,29500,499.0,488.0
282,2015/10/21,518.0,510.042,503.0,121500,518.0,501.0
283,2015/10/22,509.0,510.7,515.0,33700,516.0,505.0
284,2015/10/23,514.0,515.489,515.0,61000,519.0,512.0
285,2015/10/26,526.0,523.311,520.0,58300,527.0,518.0
286,2015/10/27,516.0,520.729,527.0,30200,527.0,515.0
287,2015/10/28,519.0,515.724,516.0,38800,520.0,511.0
288,2015/10/29,525.0,522.689,525.0,45300,527.0,519.0
289,2015/10/30,515.0,520.487,524.0,48900,529.0,513.0
290,2015/11/02,519.0,517.611,508.0,58600,527.0,508.0
291,2015/11/04,528.0,526.374,522.0,53000,530.0,520.0
292,2015/11/05,523.0,525.209,530.0,80900,534.0,515.0
293,2015/11/06,530.0,529.046,520.0,57000,535.0,520.0
294,2015/11/09,538.0,535.398,535.0,49200,538.0,529.0
295,2015/11/10,544.0,539.688,530.0,59600,549.0,529.0
296,2015/11/11,554.0,549.842,543.0,51200,556.0,538.0
297,2015/11/12,560.0,558.117,555.0,45400,562.0,554.0
298,2015/11/13,554.0,551.915,548.0,79800,558.0,548.0
299,2015/11/16,551.0,549.311,552.0,31200,554.0,541.0
300,2015/11/17,556.0,556.548,554.0,37400,560.0,553.0
301,2015/11/18,552.0,556.487,560.0,46200,564.0,550.0
302,2015/11/19,553.0,555.527,560.0,33200,561.0,552.0
303,2015/11/20,555.0,553.94,558.0,25100,558.0,550.0
304,2015/11/24,557.0,553.333,549.0,35100,559.0,546.0
305,2015/11/25,547.0,552.302,557.0,38700,557.0,547.0
306,2015/11/26,541.0,544.186,547.0,43600,550.0,540.0
307,2015/11/27,534.0,536.61,535.0,54900,542.0,529.0
308,2015/11/30,536.0,532.225,531.0,67900,538.0,525.0
309,2015/12/01,535.0,536.197,536.0,27400,538.0,534.0
310,2015/12/02,532.0,533.708,535.0,42500,537.0,531.0
311,2015/12/03,532.0,535.028,534.0,46400,538.0,532.0
312,2015/12/04,523.0,523.477,530.0,72100,530.0,518.0
313,2015/12/07,525.0,527.645,529.0,35500,530.0,525.0
314,2015/12/08,526.0,523.975,527.0,27500,528.0,518.0
315,2015/12/09,516.0,516.764,526.0,45700,526.0,511.0
316,2015/12/10,504.0,509.387,516.0,39300,516.0,503.0
317,2015/12/11,499.0,497.039,493.0,126800,502.0,493.0
318,2015/12/14,493.0,491.391,491.0,54800,496.0,487.0
319,2015/12/15,484.0,487.477,493.0,55400,493.0,483.0
320,2015/12/16,493.0,490.788,487.0,56500,495.0,486.0
321,2015/12/17,498.0,493.419,490.0,79400,499.0,489.0
322,2015/12/18,489.0,491.876,494.0,55000,499.0,488.0
323,2015/12/21,480.0,479.227,481.0,52000,484.0,475.0
324,2015/12/22,481.0,482.458,474.0,56500,488.0,474.0
325,2015/12/24,478.0,481.078,482.0,60500,492.0,476.0
326,2015/12/25,467.0,471.796,479.0,79900,479.0,462.0
327,2015/12/28,489.0,482.143,463.0,36400,490.0,463.0
328,2015/12/29,490.0,488.68,488.0,35000,495.0,481.0
329,2015/12/30,492.0,495.729,497.0,26600,500.0,491.0
330,2016/01/04,482.0,486.734,487.0,24800,496.0,481.0
331,2016/01/05,480.0,483.056,483.0,35500,488.0,477.0
332,2016/01/06,481.0,479.679,484.0,56000,484.0,475.0
333,2016/01/07,474.0,473.884,480.0,43200,480.0,469.0
334,2016/01/08,466.0,470.719,470.0,42700,481.0,465.0
335,2016/01/12,460.0,456.236,462.0,102700,462.0,450.0
336,2016/01/13,484.0,480.094,464.0,59700,490.0,464.0
337,2016/01/14,465.0,466.077,465.0,62400,473.0,462.0
338,2016/01/15,462.0,466.302,473.0,37400,473.0,457.0
339,2016/01/18,456.0,455.694,450.0,55500,463.0,447.0
340,2016/01/19,457.0,455.482,454.0,30900,465.0,448.0
341,2016/01/20,438.0,445.018,452.0,62400,458.0,438.0
342,2016/01/21,416.0,433.003,430.0,76800,449.0,416.0
343,2016/01/22,449.0,441.985,430.0,64800,451.0,427.0
344,2016/01/25,457.0,455.153,465.0,66600,465.0,449.0
345,2016/01/26,442.0,443.646,445.0,22900,448.0,440.0
346,2016/01/27,454.0,450.802,449.0,19200,457.0,445.0
347,2016/01/28,465.0,463.002,452.0,44000,468.0,450.0
348,2016/01/29,476.0,468.974,465.0,60700,477.0,458.0
349,2016/02/01,489.0,485.301,484.0,29900,489.0,480.0
350,2016/02/02,478.0,482.068,484.0,30900,489.0,476.0
351,2016/02/03,466.0,466.385,475.0,35300,475.0,463.0
352,2016/02/04,477.0,471.802,456.0,35900,490.0,451.0
353,2016/02/05,476.0,478.816,488.0,55900,488.0,467.0
354,2016/02/08,490.0,484.911,468.0,78600,493.0,468.0
355,2016/02/09,467.0,468.182,468.0,59800,477.0,461.0
356,2016/02/10,444.0,452.413,465.0,64400,468.0,441.0
357,2016/02/12,416.0,423.102,418.0,74400,438.0,412.0
358,2016/02/15,452.0,440.77,424.0,38200,457.0,423.0
359,2016/02/16,458.0,456.931,446.0,42000,465.0,445.0
360,2016/02/17,454.0,455.277,451.0,34000,465.0,449.0
361,2016/02/18,460.0,463.399,465.0,32800,469.0,460.0
362,2016/02/19,443.0,444.214,459.0,53700,459.0,438.0
363,2016/02/22,431.0,432.379,440.0,68600,444.0,428.0
364,2016/02/23,427.0,429.39,429.0,36900,440.0,424.0
365,2016/02/24,421.0,423.637,424.0,33300,431.0,417.0
366,2016/02/25,430.0,428.914,429.0,37000,431.0,422.0
367,2016/02/26,435.0,434.025,429.0,27600,438.0,429.0
368,2016/02/29,412.0,424.081,438.0,110800,442.0,412.0
369,2016/03/01,414.0,415.032,413.0,47200,420.0,411.0
370,2016/03/02,427.0,427.68,429.0,72200,431.0,422.0
371,2016/03/03,430.0,428.606,425.0,25900,431.0,425.0
372,2016/03/04,431.0,430.861,430.0,36600,433.0,426.0
373,2016/03/07,435.0,436.718,434.0,41200,442.0,433.0
374,2016/03/08,432.0,432.212,434.0,31600,438.0,427.0
375,2016/03/09,422.0,422.91,430.0,53300,430.0,416.0
376,2016/03/10,433.0,432.767,428.0,48400,438.0,426.0
377,2016/03/11,432.0,431.878,433.0,50800,435.0,427.0
378,2016/03/14,442.0,441.98,440.0,44000,448.0,438.0
379,2016/03/15,445.0,447.56,441.0,36100,453.0,440.0
380,2016/03/16,448.0,449.492,444.0,45100,454.0,444.0
381,2016/03/17,447.0,449.896,453.0,28700,457.0,443.0
382,2016/03/18,442.0,441.868,446.0,32500,451.0,438.0
383,2016/03/22,460.0,459.6,452.0,62000,468.0,451.0
384,2016/03/23,457.0,456.338,459.0,21600,460.0,452.0
385,2016/03/24,455.0,455.515,455.0,41400,459.0,451.0
386,2016/03/25,459.0,462.885,463.0,39900,469.0,455.0
387,2016/03/28,463.0,460.547,457.0,34200,464.0,457.0
388,2016/03/29,460.0,457.209,451.0,34900,465.0,451.0
389,2016/03/30,453.0,456.899,459.0,17800,460.0,453.0
390,2016/03/31,460.0,460.403,453.0,48900,467.0,453.0
391,2016/04/01,443.0,450.607,460.0,64900,461.0,443.0
392,2016/04/04,456.0,456.788,446.0,50900,462.0,445.0
393,2016/04/05,454.0,452.626,454.0,37700,458.0,446.0
394,2016/04/06,452.0,453.221,451.0,53500,459.0,447.0
395,2016/04/07,456.0,454.832,451.0,33400,462.0,446.0
396,2016/04/08,464.0,465.057,448.0,84300,475.0,447.0
397,2016/04/11,469.0,467.081,463.0,64100,473.0,463.0
398,2016/04/12,477.0,477.753,475.0,40400,480.0,472.0
399,2016/04/13,488.0,484.004,481.0,26100,488.0,477.0
400,2016/04/14,495.0,492.685,490.0,63700,495.0,490.0
401,2016/04/15,497.0,496.994,490.0,53100,501.0,485.0
402,2016/04/18,498.0,495.745,497.0,37300,500.0,489.0
403,2016/04/19,504.0,503.505,502.0,63800,510.0,499.0
404,2016/04/20,503.0,506.46,506.0,44600,510.0,501.0
405,2016/04/21,504.0,503.767,507.0,63100,509.0,499.0
406,2016/04/22,511.0,506.772,497.0,58000,514.0,497.0
407,2016/04/25,518.0,513.793,513.0,43400,519.0,505.0
408,2016/04/26,505.0,507.069,516.0,37900,516.0,503.0
409,2016/04/27,511.0,508.75,507.0,52800,514.0,499.0
410,2016/04/28,496.0,504.777,508.0,49800,514.0,495.0
411,2016/05/02,475.0,471.093,470.0,77600,483.0,463.0
412,2016/05/06,489.0,482.502,482.0,52200,490.0,472.0
413,2016/05/09,556.0,535.939,491.0,186500,559.0,491.0
414,2016/05/10,522.0,534.339,566.0,231500,566.0,520.0
415,2016/05/11,545.0,542.809,533.0,131300,554.0,531.0
416,2016/05/12,548.0,539.313,539.0,82200,551.0,531.0
417,2016/05/13,541.0,542.566,549.0,45900,550.0,534.0
418,2016/05/16,527.0,533.387,540.0,49900,540.0,527.0
419,2016/05/17,527.0,527.768,527.0,74200,533.0,524.0
420,2016/05/18,516.0,515.951,527.0,53000,527.0,508.0
421,2016/05/19,509.0,511.401,518.0,36400,519.0,507.0
422,2016/05/20,510.0,507.516,509.0,31400,512.0,502.0
423,2016/05/23,505.0,510.32,510.0,44100,518.0,505.0
424,2016/05/24,492.0,495.307,501.0,67400,503.0,489.0
425,2016/05/25,493.0,492.432,492.0,59300,497.0,490.0
426,2016/05/26,490.0,492.411,493.0,44300,499.0,490.0
427,2016/05/27,485.0,489.753,493.0,25100,496.0,483.0
428,2016/05/30,522.0,515.059,493.0,118400,529.0,491.0
429,2016/05/31,536.0,528.474,519.0,74200,537.0,518.0
430,2016/06/01,537.0,536.87,528.0,66300,544.0,528.0
431,2016/06/02,516.0,520.82,530.0,47200,531.0,516.0
432,2016/06/03,518.0,515.75,512.0,65500,530.0,508.0
433,2016/06/06,507.0,512.05,517.0,68600,524.0,505.0
434,2016/06/07,520.0,515.896,510.0,58900,521.0,506.0
435,2016/06/08,530.0,523.844,524.0,57100,530.0,517.0
436,2016/06/09,534.0,535.927,533.0,124200,541.0,530.0
437,2016/06/10,539.0,541.123,544.0,134100,544.0,535.0
438,2016/06/13,525.0,532.193,536.0,93600,537.0,525.0
439,2016/06/14,530.0,527.794,525.0,111500,534.0,516.0
440,2016/06/15,519.0,529.698,530.0,166900,540.0,518.0
441,2016/06/16,523.0,527.554,537.0,121500,537.0,518.0
442,2016/06/17,486.0,522.504,527.0,203100,540.0,486.0
443,2016/06/20,513.0,510.385,516.0,197300,519.0,506.0
444,2016/06/21,530.0,526.41,513.0,124500,535.0,513.0
445,2016/06/22,535.0,530.51,530.0,153200,539.0,519.0
446,2016/06/23,548.0,549.561,539.0,176800,559.0,535.0
447,2016/06/24,525.0,538.456,558.0,197800,559.0,517.0
448,2016/06/27,524.0,530.918,525.0,157000,540.0,522.0
449,2016/06/28,536.0,530.361,522.0,138700,540.0,507.0
450,2016/06/29,558.0,553.818,544.0,138100,560.0,544.0
451,2016/06/30,574.0,574.922,563.0,143300,580.0,563.0
452,2016/07/01,582.0,582.189,585.0,103400,586.0,576.0
453,2016/07/04,571.0,574.139,582.0,121600,589.0,564.0
454,2016/07/05,604.0,592.834,580.0,217700,604.0,574.0
455,2016/07/06,600.0,597.29,594.0,157600,604.0,590.0
456,2016/07/07,608.0,604.938,603.0,174700,610.0,597.0
457,2016/07/08,609.0,612.264,616.0,187800,618.0,605.0
458,2016/07/11,617.0,619.428,609.0,138800,627.0,609.0
459,2016/07/12,628.0,629.68,627.0,133400,634.0,627.0
460,2016/07/13,626.0,628.966,635.0,153200,635.0,623.0
461,2016/07/14,627.0,628.199,630.0,111500,633.0,623.0
462,2016/07/15,612.0,615.466,627.0,76200,630.0,606.0
463,2016/07/19,629.0,624.098,612.0,95700,630.0,612.0
464,2016/07/20,615.0,617.912,619.0,43400,623.0,614.0
465,2016/07/21,630.0,627.802,622.0,45500,630.0,620.0
466,2016/07/22,617.0,619.0,623.0,19800,627.0,614.0
467,2016/07/25,611.0,613.229,615.0,71100,623.0,608.0
468,2016/07/26,594.0,593.665,606.0,60600,607.0,584.0
469,2016/07/27,608.0,608.955,599.0,123000,618.0,599.0
470,2016/07/28,607.0,607.428,608.0,52600,613.0,603.0
471,2016/07/29,555.0,571.46,600.0,215000,606.0,550.0
472,2016/08/01,506.0,514.84,537.0,169100,540.0,503.0
473,2016/08/02,494.0,496.696,506.0,115800,506.0,492.0
474,2016/08/03,480.0,487.749,502.0,83800,502.0,478.0
475,2016/08/04,482.0,481.976,495.0,79900,495.0,475.0
476,2016/08/05,485.0,485.4,489.0,46800,489.0,482.0
477,2016/08/08,493.0,492.158,495.0,63300,500.0,487.0
478,2016/08/09,502.0,497.857,491.0,54000,505.0,489.0
479,2016/08/10,495.0,496.123,502.0,44000,502.0,490.0
480,2016/08/12,510.0,503.629,495.0,74100,513.0,492.0
481,2016/08/15,498.0,502.131,510.0,39800,510.0,498.0
482,2016/08/16,483.0,487.849,496.0,64200,496.0,482.0
483,2016/08/17,486.0,485.271,480.0,42500,490.0,480.0
484,2016/08/18,476.0,479.067,482.0,28200,485.0,476.0
485,2016/08/19,481.0,481.86,477.0,15000,485.0,477.0
486,2016/08/22,482.0,481.669,482.0,17200,486.0,478.0
487,2016/08/23,469.0,472.995,485.0,59100,486.0,468.0
488,2016/08/24,472.0,473.3,474.0,28300,476.0,471.0
489,2016/08/25,476.0,475.62,474.0,28400,478.0,471.0
490,2016/08/26,461.0,463.132,474.0,34100,474.0,460.0
491,2016/08/29,482.0,478.945,477.0,42000,484.0,472.0
492,2016/08/30,472.0,474.286,483.0,30100,483.0,470.0
493,2016/08/31,481.0,480.175,477.0,27500,482.0,474.0
494,2016/09/01,481.0,480.412,481.0,16500,482.0,477.0
495,2016/09/02,476.0,476.428,480.0,30400,481.0,473.0
496,2016/09/05,481.0,480.122,478.0,24700,483.0,476.0
497,2016/09/06,480.0,478.694,480.0,39200,481.0,476.0
498,2016/09/07,489.0,483.915,481.0,49200,490.0,478.0
499,2016/09/08,503.0,503.75,507.0,113500,508.0,498.0
500,2016/09/09,507.0,515.185,520.0,112500,524.0,498.0
501,2016/09/12,521.0,513.199,504.0,72400,523.0,497.0
502,2016/09/13,514.0,513.07,516.0,44200,520.0,506.0
503,2016/09/14,513.0,513.683,511.0,42300,518.0,506.0
504,2016/09/15,509.0,509.273,513.0,54500,513.0,506.0
505,2016/09/16,520.0,517.724,509.0,40900,520.0,507.0
506,2016/09/20,516.0,517.162,513.0,44400,522.0,511.0
507,2016/09/21,525.0,518.323,512.0,58800,525.0,506.0
508,2016/09/23,573.0,568.258,565.0,385200,579.0,546.0
509,2016/09/26,578.0,580.411,574.0,189200,593.0,573.0
510,2016/09/27,603.0,588.449,584.0,203900,603.0,573.0
511,2016/09/28,617.0,614.886,600.0,185700,622.0,600.0
512,2016/09/29,641.0,638.345,630.0,309400,648.0,622.0
513,2016/09/30,669.0,664.363,643.0,545800,679.0,638.0
514,2016/10/03,665.0,657.31,665.0,363000,669.0,637.0
515,2016/10/04,645.0,646.322,655.0,293500,660.0,634.0
516,2016/10/05,619.0,626.649,643.0,229500,643.0,616.0
517,2016/10/06,640.0,633.126,625.0,284300,645.0,616.0
518,2016/10/07,602.0,607.452,610.0,238400,620.0,601.0
519,2016/10/11,580.0,588.162,600.0,223500,608.0,578.0
520,2016/10/12,594.0,584.298,570.0,291000,598.0,564.0
521,2016/10/13,585.0,578.806,574.0,251600,587.0,565.0
522,2016/10/14,584.0,580.243,582.0,110300,589.0,569.0
523,2016/10/17,601.0,598.613,584.0,76700,604.0,584.0
524,2016/10/18,610.0,602.86,600.0,60500,611.0,593.0
525,2016/10/19,596.0,598.043,604.0,81200,605.0,592.0
526,2016/10/20,605.0,600.026,598.0,128600,605.0,589.0
527,2016/10/21,603.0,602.431,602.0,55200,608.0,596.0
528,2016/10/24,612.0,607.719,604.0,40200,613.0,600.0
529,2016/10/25,607.0,605.742,613.0,90700,613.0,600.0
530,2016/10/26,631.0,624.114,607.0,157100,635.0,602.0
531,2016/10/27,629.0,629.434,635.0,64500,637.0,624.0
532,2016/10/28,627.0,626.739,630.0,60500,630.0,622.0
533,2016/10/31,636.0,634.542,630.0,115600,641.0,625.0
534,2016/11/01,649.0,641.972,637.0,115300,649.0,633.0
535,2016/11/02,651.0,649.877,643.0,146100,659.0,635.0
536,2016/11/04,665.0,659.407,651.0,211900,665.0,651.0
537,2016/11/07,695.0,690.68,672.0,261100,698.0,672.0
538,2016/11/08,698.0,700.835,695.0,181600,709.0,694.0
539,2016/11/09,672.0,689.693,704.0,296300,710.0,665.0
540,2016/11/10,669.0,669.246,665.0,225000,685.0,658.0
541,2016/11/11,691.0,697.043,685.0,169100,708.0,680.0
542,2016/11/14,721.0,721.925,710.0,208000,729.0,710.0
543,2016/11/15,714.0,717.493,728.0,102000,728.0,705.0
544,2016/11/16,711.0,710.743,715.0,76200,716.0,707.0
545,2016/11/17,721.0,715.777,704.0,67400,723.0,702.0
546,2016/11/18,735.0,731.763,724.0,122000,736.0,721.0
547,2016/11/21,727.0,730.162,730.0,61900,736.0,727.0
548,2016/11/22,731.0,730.879,732.0,50400,735.0,723.0
549,2016/11/24,743.0,739.51,735.0,76700,745.0,732.0
550,2016/11/25,763.0,758.743,745.0,160800,769.0,745.0
551,2016/11/28,758.0,753.417,753.0,48000,760.0,747.0
552,2016/11/29,742.0,740.086,754.0,101800,754.0,733.0
553,2016/11/30,766.0,741.149,732.0,231600,775.0,706.0
554,2016/12/01,763.0,777.696,760.0,172500,797.0,760.0
555,2016/12/02,746.0,752.019,758.0,85600,769.0,742.0
556,2016/12/05,738.0,739.764,744.0,51600,746.0,734.0
557,2016/12/06,753.0,750.808,742.0,75400,755.0,742.0
558,2016/12/07,794.0,789.546,768.0,222100,797.0,766.0
559,2016/12/08,787.0,791.63,798.0,160800,805.0,771.0
560,2016/12/09,859.0,840.483,803.0,552700,864.0,801.0
561,2016/12/12,850.0,837.526,845.0,467400,863.0,814.0
562,2016/12/13,805.0,807.526,808.0,454600,834.0,789.0
563,2016/12/14,827.0,825.328,809.0,188500,833.0,809.0
564,2016/12/15,847.0,847.43,832.0,234600,854.0,828.0
565,2016/12/16,859.0,862.619,851.0,170700,873.0,850.0
566,2016/12/19,857.0,849.351,851.0,170300,862.0,825.0
567,2016/12/20,860.0,861.483,858.0,89800,870.0,854.0
568,2016/12/21,840.0,847.475,851.0,97300,859.0,838.0
569,2016/12/22,851.0,845.972,838.0,77800,855.0,830.0
570,2016/12/26,838.0,845.21,852.0,49900,857.0,838.0
571,2016/12/27,810.0,810.03,827.0,219100,827.0,800.0
572,2016/12/28,823.0,813.654,801.0,142200,825.0,801.0
573,2016/12/29,823.0,821.612,822.0,81100,829.0,811.0
574,2016/12/30,847.0,835.224,820.0,101900,848.0,811.0
575,2017/01/04,850.0,849.858,848.0,111600,859.0,842.0
576,2017/01/05,837.0,841.037,850.0,114700,850.0,833.0
577,2017/01/06,815.0,815.055,831.0,206700,831.0,808.0
578,2017/01/10,824.0,818.407,810.0,114800,828.0,809.0
579,2017/01/11,836.0,830.886,825.0,99800,841.0,817.0
580,2017/01/12,836.0,836.659,834.0,116400,846.0,826.0
581,2017/01/13,827.0,827.409,830.0,56200,833.0,820.0
582,2017/01/16,811.0,811.776,815.0,49100,824.0,805.0
583,2017/01/17,784.0,791.061,806.0,114300,807.0,782.0
584,2017/01/18,789.0,782.518,777.0,92800,793.0,766.0
585,2017/01/19,798.0,801.92,804.0,74800,813.0,795.0
586,2017/01/20,807.0,805.563,795.0,57200,811.0,794.0
587,2017/01/23,795.0,797.446,799.0,34300,801.0,794.0
588,2017/01/24,785.0,787.36,792.0,36900,797.0,782.0
589,2017/01/25,799.0,796.42,797.0,43600,801.0,790.0
590,2017/01/26,824.0,825.179,807.0,86800,831.0,807.0
591,2017/01/27,814.0,818.32,830.0,45700,830.0,807.0
592,2017/01/30,826.0,823.302,821.0,48700,830.0,814.0
593,2017/01/31,812.0,809.751,811.0,78400,821.0,801.0
594,2017/02/01,812.0,807.071,801.0,98300,821.0,783.0
595,2017/02/02,802.0,768.54,812.0,385900,821.0,708.0
596,2017/02/03,715.0,734.701,772.0,268100,781.0,710.0
597,2017/02/06,658.0,668.888,718.0,515500,718.0,653.0
598,2017/02/07,687.0,677.885,661.0,518500,694.0,652.0
599,2017/02/08,690.0,690.103,691.0,129000,694.0,684.0
600,2017/02/09,683.0,678.469,690.0,148200,690.0,667.0
601,2017/02/10,691.0,686.786,689.0,156500,693.0,680.0
602,2017/02/13,704.0,701.258,697.0,109700,707.0,696.0
603,2017/02/14,718.0,722.169,708.0,168800,736.0,708.0
604,2017/02/15,707.0,712.278,722.0,143100,731.0,703.0
605,2017/02/16,714.0,708.938,704.0,108200,715.0,702.0
606,2017/02/17,722.0,720.174,714.0,71700,727.0,712.0
607,2017/02/20,717.0,716.053,718.0,36100,721.0,713.0
608,2017/02/21,723.0,716.747,713.0,97000,726.0,704.0
609,2017/02/22,721.0,718.027,725.0,88400,726.0,711.0
610,2017/02/23,718.0,715.292,721.0,60600,724.0,709.0
611,2017/02/24,709.0,710.695,714.0,75400,721.0,706.0
612,2017/02/27,699.0,699.011,705.0,114700,708.0,690.0
613,2017/02/28,708.0,711.264,705.0,80700,716.0,705.0
614,2017/03/01,725.0,721.817,711.0,116100,728.0,705.0
615,2017/03/02,725.0,728.91,730.0,94200,735.0,723.0
616,2017/03/03,720.0,720.961,720.0,53200,726.0,714.0
617,2017/03/06,737.0,725.223,717.0,138800,739.0,708.0
618,2017/03/07,768.0,763.516,739.0,300900,777.0,738.0
619,2017/03/08,747.0,750.821,763.0,131100,763.0,742.0
620,2017/03/09,733.0,736.591,747.0,100200,748.0,733.0
621,2017/03/10,736.0,736.302,737.0,83400,743.0,730.0
622,2017/03/13,747.0,750.116,739.0,179800,759.0,734.0
623,2017/03/14,734.0,736.552,750.0,78600,750.0,733.0
624,2017/03/15,738.0,736.693,734.0,63600,743.0,732.0
625,2017/03/16,740.0,737.363,735.0,95600,744.0,726.0
626,2017/03/17,741.0,739.531,740.0,49700,742.0,733.0
627,2017/03/21,743.0,738.444,737.0,50700,746.0,733.0
628,2017/03/22,730.0,732.946,732.0,141100,742.0,728.0
629,2017/03/23,728.0,727.124,730.0,96600,733.0,719.0
630,2017/03/24,724.0,724.231,737.0,141300,737.0,717.0
631,2017/03/27,711.0,709.593,714.0,95300,716.0,700.0
632,2017/03/28,720.0,719.424,720.0,101400,730.0,716.0
633,2017/03/29,735.0,724.854,716.0,115300,737.0,713.0
634,2017/03/30,730.0,730.131,733.0,77800,739.0,722.0
635,2017/03/31,714.0,722.332,731.0,85500,732.0,714.0
636,2017/04/03,694.0,698.661,716.0,116300,717.0,691.0
637,2017/04/04,638.0,652.167,686.0,326700,686.0,631.0
638,2017/04/05,632.0,631.694,638.0,272800,645.0,622.0
639,2017/04/06,624.0,625.235,627.0,151000,638.0,618.0
640,2017/04/07,624.0,627.947,624.0,205400,636.0,623.0
641,2017/04/10,643.0,643.101,632.0,92200,649.0,630.0
642,2017/04/11,645.0,642.685,638.0,137200,648.0,631.0
643,2017/04/12,639.0,637.158,638.0,79800,642.0,632.0
644,2017/04/13,647.0,638.706,631.0,160400,650.0,625.0
645,2017/04/14,630.0,631.784,643.0,55000,643.0,627.0
646,2017/04/17,632.0,626.954,630.0,82400,635.0,619.0
647,2017/04/18,642.0,642.689,642.0,62300,654.0,636.0
648,2017/04/19,642.0,644.219,642.0,76400,651.0,641.0
649,2017/04/20,643.0,644.914,646.0,71300,650.0,642.0
650,2017/04/21,669.0,662.32,649.0,105900,671.0,649.0
651,2017/04/24,664.0,662.919,674.0,93400,676.0,654.0
652,2017/04/25,675.0,675.68,667.0,103200,682.0,666.0
653,2017/04/26,679.0,683.071,680.0,131900,691.0,679.0
654,2017/04/27,686.0,681.897,673.0,133500,691.0,667.0
655,2017/04/28,681.0,685.308,686.0,48400,695.0,680.0
656,2017/05/01,678.0,679.155,683.0,58100,684.0,674.0
657,2017/05/02,686.0,684.196,679.0,98500,688.0,679.0
658,2017/05/08,697.0,697.967,699.0,76600,700.0,693.0
659,2017/05/09,700.0,698.722,700.0,173800,703.0,683.0
660,2017/05/10,642.0,661.127,705.0,315100,708.0,642.0
661,2017/05/11,662.0,660.603,653.0,294400,672.0,650.0
662,2017/05/12,681.0,672.221,662.0,201500,681.0,657.0
663,2017/05/15,664.0,664.905,671.0,161800,677.0,662.0
664,2017/05/16,668.0,663.637,661.0,133700,672.0,658.0
665,2017/05/17,714.0,712.253,723.0,342400,729.0,703.0
666,2017/05/18,690.0,688.513,706.0,260700,706.0,676.0
667,2017/05/19,686.0,685.529,694.0,163500,694.0,681.0
668,2017/05/22,696.0,690.717,686.0,144400,698.0,677.0
669,2017/05/23,705.0,696.622,696.0,153600,707.0,685.0
670,2017/05/24,708.0,706.002,710.0,92200,711.0,698.0
671,2017/05/25,708.0,707.8,707.0,103600,715.0,694.0
672,2017/05/26,684.0,690.498,706.0,73900,707.0,683.0
673,2017/05/29,686.0,681.527,685.0,91100,687.0,676.0
674,2017/05/30,684.0,679.089,686.0,101100,686.0,671.0
675,2017/05/31,674.0,677.756,683.0,92700,686.0,671.0
676,2017/06/01,689.0,684.269,670.0,111000,692.0,667.0
677,2017/06/02,731.0,717.714,691.0,279900,734.0,690.0
678,2017/06/05,722.0,722.683,730.0,115800,732.0,715.0
679,2017/06/06,712.0,721.447,725.0,144100,733.0,711.0
680,2017/06/07,735.0,736.483,717.0,177400,747.0,715.0
681,2017/06/08,719.0,728.614,733.0,107600,742.0,719.0
682,2017/06/09,723.0,722.531,722.0,77200,732.0,712.0
683,2017/06/12,736.0,745.594,721.0,208600,762.0,721.0
684,2017/06/13,745.0,749.673,741.0,152800,760.0,738.0
685,2017/06/14,738.0,742.85,743.0,103100,754.0,736.0
686,2017/06/15,730.0,736.108,744.0,87900,749.0,730.0
687,2017/06/16,733.0,740.245,732.0,246000,755.0,732.0
688,2017/06/19,742.0,749.512,734.0,117600,762.0,734.0
689,2017/06/20,746.0,745.897,744.0,69700,749.0,738.0
690,2017/06/21,748.0,751.481,746.0,64200,756.0,746.0
691,2017/06/22,761.0,770.504,760.0,179000,789.0,760.0
692,2017/06/23,738.0,747.972,764.0,126900,769.0,736.0
693,2017/06/26,733.0,740.616,740.0,88200,749.0,733.0
694,2017/06/27,760.0,754.061,742.0,126600,762.0,738.0
695,2017/06/28,779.0,780.492,767.0,182800,794.0,767.0
696,2017/06/29,790.0,789.748,784.0,145900,806.0,779.0
697,2017/06/30,778.0,781.148,789.0,212000,797.0,775.0
698,2017/07/03,802.0,801.402,793.0,146100,810.0,789.0
699,2017/07/04,797.0,807.09,805.0,308000,824.0,796.0
700,2017/07/05,810.0,804.694,804.0,187800,813.0,791.0
701,2017/07/06,798.0,803.11,815.0,66300,815.0,797.0
702,2017/07/07,789.0,795.538,798.0,87000,805.0,788.0
703,2017/07/10,797.0,798.688,798.0,66400,808.0,793.0
704,2017/07/11,791.0,792.654,796.0,97200,802.0,785.0
705,2017/07/12,779.0,781.003,790.0,79700,790.0,778.0
706,2017/07/13,774.0,775.976,779.0,90500,782.0,771.0
707,2017/07/14,786.0,786.835,771.0,82300,794.0,771.0
708,2017/07/18,782.0,784.519,789.0,62100,793.0,778.0
709,2017/07/19,769.0,767.76,779.0,107300,779.0,763.0
710,2017/07/20,786.0,779.147,777.0,47100,787.0,768.0
711,2017/07/21,785.0,783.397,783.0,42300,787.0,777.0
712,2017/07/24,789.0,784.509,782.0,54600,792.0,777.0
713,2017/07/25,816.0,810.184,792.0,170800,823.0,787.0
714,2017/07/26,840.0,843.583,830.0,369700,861.0,829.0
715,2017/07/27,904.0,898.332,885.0,485700,911.0,876.0
716,2017/07/28,855.0,859.755,844.0,412900,879.0,843.0
717,2017/07/31,889.0,896.181,900.0,859400,926.0,860.0
718,2017/08/01,807.0,827.78,851.0,482900,856.0,800.0
719,2017/08/02,772.0,770.563,801.0,389100,801.0,760.0
720,2017/08/03,794.0,791.011,779.0,229300,799.0,778.0
721,2017/08/04,794.0,783.688,766.0,165100,798.0,762.0
722,2017/08/07,782.0,787.561,800.0,72900,803.0,779.0
723,2017/08/08,788.0,781.879,779.0,151500,792.0,766.0
724,2017/08/09,768.0,770.141,788.0,119900,788.0,762.0
725,2017/08/10,768.0,770.344,760.0,84800,781.0,760.0
726,2017/08/14,748.0,747.924,753.0,112400,758.0,739.0
727,2017/08/15,740.0,741.218,751.0,135000,751.0,736.0
728,2017/08/16,738.0,735.806,736.0,107600,743.0,729.0
729,2017/08/17,758.0,753.077,736.0,115000,759.0,736.0
730,2017/08/18,743.0,740.415,740.0,74900,744.0,736.0
731,2017/08/21,750.0,746.092,750.0,85700,751.0,738.0
732,2017/08/22,742.0,740.057,750.0,64700,750.0,734.0
733,2017/08/23,739.0,740.984,752.0,68900,757.0,737.0
734,2017/08/24,744.0,741.227,735.0,57300,745.0,735.0
735,2017/08/25,750.0,749.845,747.0,80400,757.0,744.0
736,2017/08/28,746.0,750.306,752.0,51300,758.0,745.0
737,2017/08/29,730.0,728.097,736.0,150300,736.0,720.0
738,2017/08/30,750.0,740.376,730.0,116500,751.0,726.0
739,2017/08/31,737.0,744.378,753.0,127400,761.0,734.0
740,2017/09/01,739.0,733.381,738.0,89400,740.0,728.0
741,2017/09/04,739.0,750.115,738.0,177000,771.0,738.0
742,2017/09/05,729.0,733.72,740.0,71400,747.0,726.0
743,2017/09/06,726.0,724.843,722.0,70900,732.0,718.0
744,2017/09/07,738.0,740.354,736.0,66300,748.0,734.0
745,2017/09/08,736.0,737.929,739.0,102200,743.0,729.0
746,2017/09/11,734.0,729.626,737.0,148200,738.0,724.0
747,2017/09/12,734.0,734.565,742.0,97900,747.0,728.0
748,2017/09/13,752.0,756.304,737.0,157100,776.0,737.0
749,2017/09/14,752.0,751.17,748.0,41700,758.0,746.0
750,2017/09/15,768.0,762.681,750.0,81600,769.0,750.0
751,2017/09/19,783.0,774.235,775.0,176300,783.0,762.0
752,2017/09/20,776.0,779.215,784.0,78300,787.0,773.0
753,2017/09/21,781.0,777.302,774.0,95400,785.0,773.0
754,2017/09/22,774.0,771.377,781.0,63400,781.0,763.0
755,2017/09/25,782.0,778.414,781.0,94300,784.0,770.0
756,2017/09/26,816.0,808.956,785.0,242400,818.0,780.0
757,2017/09/27,813.0,812.246,812.0,195000,829.0,804.0
758,2017/09/28,816.0,814.986,818.0,133800,824.0,807.0
759,2017/09/29,804.0,807.566,816.0,50000,817.0,803.0
760,2017/10/02,831.0,827.945,819.0,105800,838.0,815.0
761,2017/10/03,858.0,856.439,840.0,230800,867.0,840.0
762,2017/10/04,860.0,860.544,859.0,189200,867.0,855.0
763,2017/10/05,863.0,860.336,859.0,119800,866.0,857.0
764,2017/10/06,859.0,859.784,858.0,203300,863.0,855.0
765,2017/10/10,868.0,865.345,859.0,108800,872.0,855.0
766,2017/10/11,865.0,866.628,868.0,79300,879.0,864.0
767,2017/10/12,866.0,866.33,865.0,128000,873.0,863.0
768,2017/10/13,868.0,858.863,860.0,169300,871.0,840.0
769,2017/10/16,880.0,869.109,862.0,127100,883.0,849.0
770,2017/10/17,862.0,862.019,874.0,85700,874.0,855.0
771,2017/10/18,828.0,836.656,850.0,132100,857.0,826.0
772,2017/10/19,808.0,807.305,822.0,209800,822.0,801.0
773,2017/10/20,794.0,791.174,800.0,210800,801.0,777.0
774,2017/10/23,799.0,800.601,799.0,125200,806.0,795.0
775,2017/10/24,805.0,805.373,795.0,228500,822.0,791.0
776,2017/10/25,835.0,833.447,805.0,251300,845.0,805.0
777,2017/10/26,831.0,831.16,829.0,86400,840.0,820.0
778,2017/10/27,845.0,844.554,835.0,88800,854.0,834.0
779,2017/10/30,857.0,850.014,839.0,195900,860.0,833.0
780,2017/10/31,833.0,853.128,875.0,397100,880.0,809.0
781,2017/11/01,864.0,851.603,833.0,191100,869.0,816.0
782,2017/11/02,869.0,866.09,857.0,90300,875.0,847.0
783,2017/11/06,1014.0,1009.954,944.0,1362000,1019.0,937.0
784,2017/11/07,994.0,1007.437,986.0,864800,1039.0,974.0
785,2017/11/08,1013.0,1005.678,982.0,253700,1020.0,967.0
786,2017/11/09,998.0,1016.275,998.0,292000,1042.0,989.0
787,2017/11/10,987.0,992.628,985.0,138400,1010.0,984.0
788,2017/11/13,979.0,983.617,987.0,75900,994.0,976.0
789,2017/11/14,976.0,982.274,985.0,63900,998.0,974.0
790,2017/11/15,946.0,957.721,970.0,168100,974.0,946.0
791,2017/11/16,939.0,935.089,936.0,134400,944.0,922.0
792,2017/11/17,930.0,940.463,940.0,115900,967.0,928.0
793,2017/11/20,945.0,945.651,930.0,133300,961.0,926.0
794,2017/11/21,974.0,981.244,965.0,208100,996.0,960.0
795,2017/11/22,989.0,993.336,978.0,233400,1005.0,976.0
796,2017/11/24,989.0,989.255,990.0,78900,996.0,977.0
797,2017/11/27,964.0,965.15,987.0,88500,987.0,956.0
798,2017/11/28,945.0,955.465,960.0,103800,971.0,942.0
799,2017/11/29,950.0,950.553,945.0,45400,957.0,944.0
800,2017/11/30,944.0,946.534,950.0,94900,954.0,942.0
801,2017/12/01,940.0,936.224,944.0,113200,956.0,925.0
802,2017/12/04,920.0,926.135,938.0,71100,946.0,916.0
803,2017/12/05,926.0,921.81,910.0,96400,930.0,905.0
804,2017/12/06,907.0,909.152,916.0,70200,921.0,903.0
805,2017/12/07,903.0,901.881,903.0,78400,917.0,894.0
806,2017/12/08,937.0,926.745,900.0,153200,943.0,900.0
807,2017/12/11,937.0,941.19,938.0,120800,952.0,929.0
808,2017/12/12,938.0,945.418,947.0,75800,963.0,935.0
809,2017/12/13,925.0,927.162,945.0,64800,945.0,919.0
810,2017/12/14,921.0,919.242,921.0,75100,927.0,908.0
811,2017/12/15,921.0,916.162,917.0,109100,927.0,905.0
812,2017/12/18,922.0,922.839,930.0,121200,942.0,915.0
813,2017/12/19,1000.0,996.548,927.0,502400,1023.0,927.0
814,2017/12/20,1065.0,1068.069,1035.0,590900,1091.0,1034.0
815,2017/12/21,1065.0,1059.448,1060.0,211400,1071.0,1046.0
816,2017/12/22,1072.0,1072.338,1065.0,126300,1079.0,1065.0
817,2017/12/25,1056.0,1065.364,1075.0,139900,1077.0,1054.0
818,2017/12/26,1014.0,1019.485,1046.0,283600,1050.0,1005.0
819,2017/12/27,1018.0,1026.597,1015.0,79600,1038.0,1014.0
820,2017/12/28,997.0,1006.66,1023.0,94000,1032.0,995.0
821,2017/12/29,998.0,998.93,1000.0,110600,1012.0,993.0
822,2018/01/04,1000.0,1000.472,1013.0,189700,1029.0,992.0
823,2018/01/05,1029.0,1028.946,1015.0,120800,1037.0,1015.0
824,2018/01/09,1032.0,1040.09,1040.0,239400,1054.0,1026.0
825,2018/01/10,1052.0,1043.495,1039.0,138500,1060.0,1023.0
826,2018/01/11,1031.0,1032.9,1030.0,113300,1042.0,1024.0
827,2018/01/12,1046.0,1044.658,1029.0,128100,1054.0,1028.0
828,2018/01/15,1063.0,1064.731,1061.0,134200,1078.0,1056.0
829,2018/01/16,1074.0,1078.261,1063.0,168900,1088.0,1063.0
830,2018/01/17,1051.0,1052.94,1072.0,109000,1072.0,1037.0
831,2018/01/18,1050.0,1047.425,1051.0,148300,1064.0,1034.0
832,2018/01/19,1056.0,1055.089,1051.0,85100,1064.0,1048.0
833,2018/01/22,1061.0,1054.845,1050.0,81200,1064.0,1037.0
834,2018/01/23,1090.0,1087.479,1065.0,130200,1095.0,1065.0
835,2018/01/24,1122.0,1120.537,1091.0,197800,1145.0,1091.0
836,2018/01/25,1076.0,1079.127,1107.0,199400,1107.0,1063.0
837,2018/01/26,1070.0,1068.985,1071.0,67200,1079.0,1060.0
838,2018/01/29,1062.0,1058.857,1070.0,94800,1076.0,1048.0
839,2018/01/30,1057.0,1062.548,1062.0,62400,1077.0,1054.0
840,2018/01/31,1044.0,1047.562,1043.0,75500,1059.0,1035.0
841,2018/02/01,1054.0,1049.879,1041.0,73500,1063.0,1031.0
842,2018/02/02,1031.0,1029.078,1038.0,131300,1049.0,1014.0
843,2018/02/05,991.0,996.504,1013.0,90300,1017.0,985.0
844,2018/02/06,926.0,930.383,940.0,311500,958.0,876.0
845,2018/02/07,914.0,940.291,965.0,145000,998.0,913.0
846,2018/02/08,950.0,956.265,974.0,165500,974.0,934.0
847,2018/02/09,947.0,946.492,948.0,218300,968.0,922.0
848,2018/02/13,919.0,931.559,966.0,171400,966.0,917.0
849,2018/02/14,890.0,899.636,915.0,168000,924.0,881.0
850,2018/02/15,908.0,907.098,893.0,102700,919.0,890.0
851,2018/02/16,902.0,909.92,918.0,98800,922.0,901.0
852,2018/02/19,917.0,918.905,917.0,157300,931.0,900.0
853,2018/02/20,912.0,907.807,917.0,149200,922.0,895.0
854,2018/02/21,929.0,932.484,917.0,139700,945.0,916.0
855,2018/02/22,913.0,918.804,931.0,71000,935.0,908.0
856,2018/02/23,940.0,932.788,910.0,131900,943.0,908.0
857,2018/02/26,948.0,947.747,948.0,116400,955.0,941.0
858,2018/02/27,961.0,962.575,958.0,77600,968.0,958.0
859,2018/02/28,964.0,964.946,956.0,106300,976.0,955.0
860,2018/03/01,953.0,950.263,950.0,134000,958.0,938.0
861,2018/03/02,937.0,939.691,936.0,100700,949.0,924.0
862,2018/03/05,912.0,916.549,931.0,86300,936.0,908.0
863,2018/03/06,916.0,925.106,925.0,71500,938.0,911.0
864,2018/03/07,909.0,908.59,908.0,129600,915.0,901.0
865,2018/03/08,916.0,914.043,923.0,69100,923.0,909.0
866,2018/03/09,918.0,920.706,919.0,119600,931.0,910.0
867,2018/03/12,939.0,934.533,929.0,65100,944.0,925.0
868,2018/03/13,951.0,946.29,937.0,74200,953.0,936.0
869,2018/03/14,933.0,936.732,939.0,82600,944.0,930.0
870,2018/03/15,950.0,949.667,944.0,86500,959.0,936.0
871,2018/03/16,944.0,945.12,956.0,81800,957.0,935.0
872,2018/03/19,934.0,937.803,941.0,75600,957.0,927.0
873,2018/03/20,949.0,940.893,930.0,71600,949.0,926.0
874,2018/03/22,927.0,923.212,940.0,150700,942.0,912.0
875,2018/03/23,865.0,877.52,912.0,164700,912.0,857.0
876,2018/03/26,866.0,852.778,858.0,181700,866.0,841.0
877,2018/03/27,904.0,887.739,876.0,376700,914.0,873.0
878,2018/03/28,884.0,878.746,880.0,246300,887.0,863.0
879,2018/03/29,879.0,879.591,891.0,121100,905.0,868.0
880,2018/03/30,895.0,898.078,893.0,103900,907.0,890.0
881,2018/04/02,886.0,891.749,900.0,59300,903.0,885.0
882,2018/04/03,888.0,885.628,883.0,60000,895.0,869.0
883,2018/04/04,884.0,884.374,889.0,79100,892.0,876.0
884,2018/04/05,895.0,896.604,893.0,86800,905.0,883.0
885,2018/04/06,885.0,891.798,896.0,46600,904.0,883.0
886,2018/04/09,884.0,879.641,885.0,92400,889.0,873.0
887,2018/04/10,900.0,891.43,884.0,79800,906.0,867.0
888,2018/04/11,913.0,913.406,903.0,81500,923.0,900.0
889,2018/04/12,903.0,906.772,918.0,30200,918.0,898.0
890,2018/04/13,911.0,908.239,909.0,116700,917.0,899.0
891,2018/04/16,904.0,904.13,910.0,34600,916.0,896.0
892,2018/04/17,890.0,893.67,900.0,46700,908.0,886.0
893,2018/04/18,897.0,896.385,897.0,22600,904.0,883.0
894,2018/04/19,908.0,907.574,898.0,35200,914.0,897.0
895,2018/04/20,923.0,920.358,908.0,52200,927.0,902.0
896,2018/04/23,914.0,913.216,916.0,29200,920.0,909.0
897,2018/04/24,931.0,924.087,919.0,63200,932.0,910.0
898,2018/04/25,929.0,921.13,919.0,35500,929.0,911.0
899,2018/04/26,967.0,953.393,931.0,104200,967.0,929.0
900,2018/04/27,945.0,945.925,965.0,49600,965.0,934.0
901,2018/05/01,947.0,941.256,938.0,55400,949.0,926.0
902,2018/05/02,929.0,926.932,941.0,57000,942.0,921.0
903,2018/05/07,967.0,952.247,935.0,98900,967.0,931.0
904,2018/05/08,1117.0,1075.297,967.0,594700,1117.0,964.0
905,2018/05/09,1214.0,1178.544,1101.0,1176300,1227.0,1071.0
906,2018/05/10,1199.0,1204.662,1220.0,368400,1232.0,1172.0
907,2018/05/11,1189.0,1193.379,1193.0,177700,1218.0,1167.0
908,2018/05/14,1186.0,1179.1,1177.0,126700,1198.0,1165.0
909,2018/05/15,1158.0,1166.453,1187.0,171800,1188.0,1154.0
910,2018/05/16,1156.0,1162.886,1168.0,125200,1188.0,1153.0
911,2018/05/17,1173.0,1176.408,1157.0,125200,1196.0,1157.0
912,2018/05/18,1173.0,1173.708,1165.0,75700,1180.0,1161.0
913,2018/05/21,1204.0,1206.931,1173.0,134500,1226.0,1173.0
914,2018/05/22,1200.0,1189.631,1197.0,103600,1206.0,1171.0
915,2018/05/23,1198.0,1212.453,1200.0,114900,1232.0,1196.0
916,2018/05/24,1179.0,1185.173,1205.0,65900,1214.0,1175.0
917,2018/05/25,1162.0,1166.309,1168.0,48800,1179.0,1153.0
918,2018/05/28,1151.0,1154.515,1156.0,34200,1167.0,1147.0
919,2018/05/29,1129.0,1123.437,1136.0,106700,1143.0,1106.0
920,2018/05/30,1140.0,1132.431,1109.0,77000,1143.0,1108.0
921,2018/05/31,1163.0,1152.617,1139.0,140700,1175.0,1131.0
922,2018/06/01,1121.0,1122.601,1153.0,149000,1153.0,1105.0
923,2018/06/04,1156.0,1158.214,1144.0,107900,1180.0,1144.0
924,2018/06/05,1228.0,1227.938,1176.0,403700,1254.0,1176.0
925,2018/06/06,1210.0,1213.475,1238.0,144800,1239.0,1193.0
926,2018/06/07,1217.0,1217.15,1215.0,81200,1234.0,1206.0
927,2018/06/08,1189.0,1190.088,1208.0,110300,1210.0,1175.0
928,2018/06/11,1196.0,1199.074,1192.0,128300,1226.0,1189.0
929,2018/06/12,1243.0,1237.213,1230.0,331500,1266.0,1184.0
930,2018/06/13,1305.0,1290.66,1242.0,267600,1318.0,1240.0
931,2018/06/14,1263.0,1270.257,1287.0,138900,1295.0,1258.0
932,2018/06/15,1239.0,1239.182,1251.0,166200,1259.0,1221.0
933,2018/06/18,1213.0,1213.177,1228.0,94600,1246.0,1202.0
934,2018/06/19,1217.0,1225.186,1213.0,112200,1253.0,1207.0
935,2018/06/20,1343.0,1316.297,1258.0,675900,1355.0,1245.0
936,2018/06/21,1333.0,1342.204,1373.0,335300,1392.0,1309.0
937,2018/06/22,1332.0,1313.389,1315.0,216000,1339.0,1297.0
938,2018/06/25,1315.0,1322.006,1326.0,100200,1348.0,1312.0
939,2018/06/26,1310.0,1303.555,1291.0,191400,1317.0,1265.0
940,2018/06/27,1314.0,1312.697,1307.0,182900,1333.0,1280.0
941,2018/06/28,1288.0,1288.1,1309.0,272700,1325.0,1268.0
942,2018/06/29,1267.0,1258.626,1278.0,198400,1282.0,1235.0
943,2018/07/02,1195.0,1203.901,1248.0,249400,1257.0,1182.0
944,2018/07/03,1191.0,1188.094,1200.0,115500,1211.0,1174.0
945,2018/07/04,1184.0,1174.213,1183.0,133200,1193.0,1149.0
946,2018/07/05,1196.0,1199.079,1200.0,289400,1221.0,1188.0
947,2018/07/06,1199.0,1186.633,1198.0,170000,1199.0,1170.0
948,2018/07/09,1218.0,1199.417,1189.0,154400,1223.0,1145.0
949,2018/07/10,1196.0,1202.679,1224.0,203200,1224.0,1188.0
950,2018/07/11,1174.0,1164.362,1187.0,150100,1187.0,1140.0
951,2018/07/12,1213.0,1212.127,1180.0,173800,1225.0,1180.0
952,2018/07/13,1224.0,1230.942,1227.0,121300,1248.0,1220.0
953,2018/07/17,1199.0,1201.245,1194.0,156300,1214.0,1185.0
954,2018/07/18,1221.0,1221.064,1210.0,119700,1237.0,1199.0
955,2018/07/19,1242.0,1240.168,1221.0,106300,1254.0,1209.0
956,2018/07/20,1243.0,1256.696,1242.0,164200,1286.0,1238.0
957,2018/07/23,1226.0,1225.077,1231.0,63900,1245.0,1213.0
958,2018/07/24,1282.0,1280.311,1258.0,163700,1295.0,1256.0
959,2018/07/25,1289.0,1286.068,1292.0,137800,1307.0,1268.0
960,2018/07/26,1339.0,1330.485,1300.0,148300,1355.0,1300.0
961,2018/07/27,1361.0,1356.756,1356.0,97800,1369.0,1321.0
962,2018/07/30,1348.0,1358.223,1354.0,127200,1380.0,1332.0
963,2018/07/31,1375.0,1366.586,1336.0,209200,1384.0,1328.0
964,2018/08/01,1391.0,1388.028,1375.0,193200,1405.0,1366.0
965,2018/08/02,1410.0,1414.129,1391.0,255600,1444.0,1391.0
966,2018/08/03,1183.0,1257.333,1411.0,900000,1441.0,1158.0
967,2018/08/06,1149.0,1131.336,1181.0,557200,1182.0,1086.0
968,2018/08/07,1187.0,1184.574,1156.0,301300,1205.0,1156.0
969,2018/08/08,1289.0,1285.125,1234.0,319600,1319.0,1233.0
970,2018/08/09,1345.0,1343.483,1292.0,262900,1358.0,1281.0
971,2018/08/10,1297.0,1316.633,1341.0,295100,1364.0,1293.0
972,2018/08/13,1209.0,1221.268,1246.0,190600,1267.0,1199.0
973,2018/08/14,1217.0,1209.012,1220.0,147200,1235.0,1186.0
974,2018/08/15,1173.0,1188.31,1220.0,165000,1241.0,1167.0
975,2018/08/16,1171.0,1180.994,1173.0,140600,1199.0,1161.0
976,2018/08/17,1197.0,1195.171,1186.0,113800,1213.0,1181.0
977,2018/08/20,1145.0,1152.497,1181.0,118100,1181.0,1143.0
978,2018/08/21,1141.0,1149.337,1144.0,86000,1171.0,1134.0
979,2018/08/22,1171.0,1165.819,1143.0,127400,1177.0,1143.0
980,2018/08/23,1175.0,1178.312,1179.0,61900,1194.0,1170.0
981,2018/08/24,1197.0,1196.11,1191.0,68900,1207.0,1181.0
982,2018/08/27,1227.0,1223.503,1220.0,59400,1232.0,1208.0
983,2018/08/28,1272.0,1276.806,1270.0,180300,1293.0,1255.0
984,2018/08/29,1297.0,1289.863,1274.0,89200,1304.0,1273.0
985,2018/08/30,1322.0,1325.365,1306.0,146400,1342.0,1306.0
986,2018/08/31,1323.0,1329.482,1314.0,163600,1342.0,1311.0
987,2018/09/03,1278.0,1286.142,1315.0,116500,1315.0,1268.0
988,2018/09/04,1282.0,1273.578,1267.0,106400,1288.0,1249.0
989,2018/09/05,1267.0,1267.286,1288.0,74900,1297.0,1249.0
990,2018/09/06,1251.0,1250.765,1259.0,47700,1269.0,1242.0
991,2018/09/07,1217.0,1218.406,1238.0,109000,1245.0,1207.0
992,2018/09/10,1216.0,1214.965,1218.0,79000,1223.0,1201.0
993,2018/09/11,1195.0,1199.602,1209.0,116400,1214.0,1191.0
994,2018/09/12,1180.0,1186.806,1192.0,113200,1214.0,1173.0
995,2018/09/13,1206.0,1200.58,1180.0,114200,1220.0,1178.0
996,2018/09/14,1233.0,1229.207,1226.0,146100,1241.0,1215.0
997,2018/09/18,1280.0,1266.405,1245.0,120100,1286.0,1236.0
998,2018/09/19,1333.0,1320.695,1310.0,213200,1337.0,1300.0
999,2018/09/20,1370.0,1368.135,1347.0,210200,1378.0,1347.0
1000,2018/09/21,1413.0,1405.025,1361.0,173300,1419.0,1361.0
1001,2018/09/25,1409.0,1396.378,1413.0,137200,1414.0,1381.0
1002,2018/09/26,1469.0,1457.339,1409.0,136700,1486.0,1393.0
1003,2018/09/27,1432.0,1438.842,1462.0,119300,1462.0,1423.0
1004,2018/09/28,1482.0,1478.944,1450.0,177000,1507.0,1436.0
1005,2018/10/01,1489.0,1490.136,1469.0,117000,1509.0,1454.0
1006,2018/10/02,1466.0,1468.408,1483.0,118800,1489.0,1458.0
1007,2018/10/03,1402.0,1414.668,1446.0,266900,1464.0,1378.0
1008,2018/10/04,1435.0,1441.224,1432.0,109700,1479.0,1415.0
1009,2018/10/05,1406.0,1410.603,1414.0,80000,1424.0,1391.0
1010,2018/10/09,1376.0,1379.023,1370.0,105900,1395.0,1366.0
1011,2018/10/10,1381.0,1382.764,1396.0,57700,1401.0,1365.0
1012,2018/10/11,1315.0,1313.182,1300.0,109900,1332.0,1295.0
1013,2018/10/12,1339.0,1339.287,1317.0,109600,1367.0,1317.0
1014,2018/10/15,1296.0,1303.761,1300.0,129100,1329.0,1293.0
1015,2018/10/16,1309.0,1305.991,1315.0,93400,1334.0,1277.0
1016,2018/10/17,1333.0,1335.732,1352.0,43700,1352.0,1318.0
1017,2018/10/18,1307.0,1313.429,1331.0,49900,1338.0,1304.0
1018,2018/10/19,1268.0,1268.562,1285.0,84400,1286.0,1262.0
1019,2018/10/22,1282.0,1273.975,1267.0,43900,1292.0,1252.0
1020,2018/10/23,1230.0,1235.692,1264.0,97900,1266.0,1221.0
1021,2018/10/24,1235.0,1231.373,1240.0,63600,1245.0,1205.0
1022,2018/10/25,1184.0,1189.414,1177.0,146400,1254.0,1155.0
1023,2018/10/26,1151.0,1155.642,1200.0,123600,1200.0,1129.0
1024,2018/10/29,1129.0,1146.082,1146.0,80600,1174.0,1125.0
1025,2018/10/30,1170.0,1170.737,1124.0,158400,1198.0,1124.0
1026,2018/10/31,1345.0,1285.029,1189.0,676800,1389.0,1189.0
1027,2018/11/01,1300.0,1296.514,1285.0,360300,1337.0,1224.0
1028,2018/11/02,1270.0,1278.239,1312.0,300400,1324.0,1232.0
1029,2018/11/05,1272.0,1268.95,1260.0,143400,1283.0,1244.0
1030,2018/11/06,1291.0,1293.004,1301.0,83900,1319.0,1278.0
1031,2018/11/07,1262.0,1283.305,1290.0,169400,1320.0,1251.0
1032,2018/11/08,1274.0,1282.075,1311.0,126600,1312.0,1267.0
1033,2018/11/09,1303.0,1299.8,1275.0,103900,1316.0,1274.0
1034,2018/11/12,1293.0,1296.131,1291.0,35800,1314.0,1282.0
1035,2018/11/13,1276.0,1266.958,1281.0,87500,1284.0,1240.0
1036,2018/11/14,1247.0,1253.123,1276.0,74900,1284.0,1244.0
1037,2018/11/15,1228.0,1233.953,1230.0,31700,1250.0,1225.0
1038,2018/11/16,1204.0,1209.298,1228.0,67500,1240.0,1196.0
1039,2018/11/19,1230.0,1222.0,1205.0,43200,1236.0,1195.0
1040,2018/11/20,1224.0,1218.454,1215.0,44500,1229.0,1201.0
1041,2018/11/21,1224.0,1212.676,1200.0,62700,1226.0,1176.0
1042,2018/11/22,1220.0,1211.267,1228.0,95800,1237.0,1191.0
1043,2018/11/26,1231.0,1226.252,1209.0,30200,1237.0,1201.0
1044,2018/11/27,1219.0,1227.151,1242.0,87500,1255.0,1211.0
1045,2018/11/28,1236.0,1234.604,1219.0,93400,1250.0,1210.0
1046,2018/11/29,1281.0,1282.862,1266.0,91400,1294.0,1252.0
1047,2018/11/30,1310.0,1302.495,1292.0,109400,1320.0,1278.0
1048,2018/12/03,1310.0,1316.007,1312.0,91500,1341.0,1303.0
1049,2018/12/04,1282.0,1293.974,1326.0,56600,1334.0,1278.0
1050,2018/12/05,1251.0,1247.224,1249.0,66100,1263.0,1223.0
1051,2018/12/06,1242.0,1241.713,1244.0,77700,1263.0,1228.0
1052,2018/12/07,1205.0,1212.953,1243.0,85000,1260.0,1197.0
1053,2018/12/10,1171.0,1193.56,1219.0,85600,1219.0,1171.0
1054,2018/12/11,1121.0,1129.953,1165.0,146900,1165.0,1118.0
1055,2018/12/12,1121.0,1124.756,1129.0,99300,1139.0,1114.0
1056,2018/12/13,1152.0,1145.016,1122.0,70400,1173.0,1120.0
1057,2018/12/14,1169.0,1161.905,1156.0,184100,1194.0,1122.0
1058,2018/12/17,1122.0,1142.171,1164.0,60800,1182.0,1122.0
1059,2018/12/18,1060.0,1073.939,1096.0,71600,1100.0,1057.0
1060,2018/12/19,1064.0,1067.591,1060.0,66700,1089.0,1048.0
1061,2018/12/20,994.0,1008.587,1050.0,128900,1051.0,983.0
1062,2018/12/21,978.0,986.595,956.0,181900,1022.0,954.0
1063,2018/12/25,939.0,945.856,950.0,98400,962.0,928.0
1064,2018/12/26,991.0,983.74,953.0,123400,1003.0,953.0
1065,2018/12/27,1027.0,1017.66,1005.0,85800,1028.0,997.0
1066,2018/12/28,1062.0,1066.657,1024.0,101500,1086.0,1024.0
1067,2019/01/04,983.0,990.787,1018.0,108800,1028.0,974.0
1068,2019/01/07,1018.0,1024.482,1017.0,126000,1044.0,1011.0
1069,2019/01/08,1048.0,1030.475,1021.0,101100,1051.0,994.0
1070,2019/01/09,1092.0,1084.096,1048.0,137100,1099.0,1035.0
1071,2019/01/10,1137.0,1132.721,1096.0,242200,1150.0,1084.0
1072,2019/01/11,1091.0,1102.107,1157.0,212300,1160.0,1088.0
1073,2019/01/15,1117.0,1095.604,1071.0,107000,1120.0,1060.0
1074,2019/01/16,1093.0,1092.65,1117.0,64000,1117.0,1076.0
1075,2019/01/17,1077.0,1076.751,1086.0,73200,1098.0,1064.0
1076,2019/01/18,1095.0,1094.856,1076.0,58200,1106.0,1076.0
1077,2019/01/21,1089.0,1096.344,1102.0,51500,1111.0,1086.0
1078,2019/01/22,1083.0,1081.578,1097.0,33200,1097.0,1071.0
1079,2019/01/23,1075.0,1077.255,1075.0,44400,1087.0,1063.0
1080,2019/01/24,1085.0,1083.828,1075.0,86600,1096.0,1060.0
1081,2019/01/25,1107.0,1098.095,1077.0,98900,1111.0,1063.0
1082,2019/01/28,1087.0,1097.462,1109.0,39600,1118.0,1087.0
1083,2019/01/29,1091.0,1089.117,1093.0,62300,1104.0,1074.0
1084,2019/01/30,1059.0,1068.992,1100.0,79200,1100.0,1059.0
1085,2019/01/31,1130.0,1124.76,1089.0,109400,1138.0,1089.0
1086,2019/02/01,1107.0,1116.11,1123.0,55400,1130.0,1103.0
1087,2019/02/04,1227.0,1190.252,1120.0,149000,1235.0,1120.0
1088,2019/02/05,1196.0,1201.491,1230.0,194600,1230.0,1176.0
1089,2019/02/06,1356.0,1297.359,1196.0,456200,1363.0,1172.0
1090,2019/02/07,1381.0,1349.313,1380.0,513800,1389.0,1304.0
1091,2019/02/08,1300.0,1314.65,1342.0,193600,1343.0,1296.0
1092,2019/02/12,1312.0,1309.707,1321.0,202500,1337.0,1290.0
1093,2019/02/13,1376.0,1356.392,1336.0,134300,1379.0,1328.0
1094,2019/02/14,1366.0,1359.52,1380.0,89700,1384.0,1338.0
1095,2019/02/15,1349.0,1340.164,1330.0,92800,1354.0,1315.0
1096,2019/02/18,1389.0,1383.54,1371.0,102400,1414.0,1366.0
1097,2019/02/19,1394.0,1388.917,1376.0,83400,1406.0,1366.0
1098,2019/02/20,1372.0,1381.776,1395.0,70600,1407.0,1368.0
1099,2019/02/21,1426.0,1415.858,1395.0,162200,1431.0,1376.0
1100,2019/02/22,1466.0,1452.176,1423.0,170000,1472.0,1411.0
1101,2019/02/25,1464.0,1476.483,1477.0,180000,1523.0,1453.0
1102,2019/02/26,1415.0,1420.314,1445.0,155700,1445.0,1409.0
1103,2019/02/27,1408.0,1400.664,1411.0,192900,1420.0,1374.0
1104,2019/02/28,1386.0,1393.364,1393.0,142200,1407.0,1373.0
1105,2019/03/01,1402.0,1401.044,1392.0,72800,1425.0,1391.0
1106,2019/03/04,1452.0,1439.825,1425.0,177200,1459.0,1409.0
1107,2019/03/05,1403.0,1410.515,1426.0,138900,1440.0,1397.0
1108,2019/03/06,1399.0,1403.92,1403.0,108100,1421.0,1382.0
1109,2019/03/07,1361.0,1368.055,1373.0,121300,1389.0,1352.0
1110,2019/03/08,1270.0,1291.823,1316.0,174800,1332.0,1266.0
1111,2019/03/11,1282.0,1279.236,1275.0,137600,1292.0,1264.0
1112,2019/03/12,1285.0,1291.204,1303.0,71000,1305.0,1282.0
1113,2019/03/13,1233.0,1242.597,1269.0,139300,1271.0,1222.0
1114,2019/03/14,1211.0,1214.01,1214.0,190400,1230.0,1200.0
1115,2019/03/15,1234.0,1235.348,1223.0,147600,1255.0,1223.0
1116,2019/03/18,1227.0,1225.53,1241.0,143300,1243.0,1200.0
1117,2019/03/19,1238.0,1235.146,1239.0,75800,1242.0,1220.0
1118,2019/03/20,1232.0,1232.464,1241.0,106400,1246.0,1218.0
1119,2019/03/22,1219.0,1224.297,1245.0,147400,1248.0,1208.0
1120,2019/03/25,1165.0,1173.24,1182.0,176900,1182.0,1160.0
1121,2019/03/26,1223.0,1205.577,1193.0,258800,1223.0,1181.0
1122,2019/03/27,1274.0,1254.334,1242.0,213500,1275.0,1223.0
1123,2019/03/28,1201.0,1208.461,1224.0,204700,1226.0,1197.0
1124,2019/03/29,1205.0,1199.547,1208.0,98700,1217.0,1186.0
1125,2019/04/01,1237.0,1240.095,1224.0,207000,1258.0,1223.0
1126,2019/04/02,1236.0,1236.267,1238.0,202200,1250.0,1215.0
1127,2019/04/03,1329.0,1300.358,1244.0,244500,1330.0,1234.0
1128,2019/04/04,1342.0,1340.108,1329.0,96700,1355.0,1309.0
1129,2019/04/05,1339.0,1338.691,1343.0,98800,1351.0,1320.0
1130,2019/04/08,1336.0,1349.633,1354.0,95700,1383.0,1327.0
1131,2019/04/09,1335.0,1335.4,1327.0,75600,1350.0,1320.0
1132,2019/04/10,1318.0,1319.555,1310.0,53500,1334.0,1310.0
1133,2019/04/11,1307.0,1314.711,1324.0,45000,1346.0,1301.0
1134,2019/04/12,1315.0,1311.715,1317.0,36500,1318.0,1300.0
1135,2019/04/15,1323.0,1329.206,1337.0,113700,1358.0,1316.0
1136,2019/04/16,1293.0,1293.541,1293.0,149400,1323.0,1272.0
1137,2019/04/17,1275.0,1276.594,1281.0,147600,1303.0,1265.0
1138,2019/04/18,1286.0,1277.687,1282.0,92300,1287.0,1252.0
1139,2019/04/19,1280.0,1285.315,1300.0,36200,1304.0,1273.0
1140,2019/04/22,1245.0,1251.884,1265.0,90300,1272.0,1243.0
1141,2019/04/23,1249.0,1241.994,1243.0,106700,1256.0,1226.0
1142,2019/04/24,1252.0,1258.404,1256.0,81100,1274.0,1250.0
1143,2019/04/25,1256.0,1258.943,1257.0,68600,1273.0,1251.0
1144,2019/04/26,1247.0,1237.211,1244.0,66800,1249.0,1222.0
1145,2019/05/07,1227.0,1237.988,1268.0,144800,1271.0,1220.0
1146,2019/05/08,1189.0,1197.315,1227.0,173300,1230.0,1182.0
1147,2019/05/09,1236.0,1215.949,1191.0,454200,1274.0,1156.0
1148,2019/05/10,1304.0,1293.266,1252.0,412400,1331.0,1205.0
1149,2019/05/13,1235.0,1275.243,1281.0,266800,1329.0,1234.0
1150,2019/05/14,1188.0,1164.992,1165.0,224900,1195.0,1120.0
1151,2019/05/15,1242.0,1220.586,1203.0,131000,1243.0,1190.0
1152,2019/05/16,1198.0,1203.698,1239.0,83000,1239.0,1193.0
1153,2019/05/17,1192.0,1194.329,1210.0,83900,1217.0,1183.0
1154,2019/05/20,1156.0,1166.125,1192.0,74500,1208.0,1152.0
1155,2019/05/21,1144.0,1139.606,1148.0,69100,1154.0,1126.0
1156,2019/05/22,1160.0,1161.859,1150.0,99400,1173.0,1150.0
1157,2019/05/23,1169.0,1160.942,1155.0,83200,1174.0,1135.0
1158,2019/05/24,1129.0,1136.089,1154.0,76300,1154.0,1128.0
1159,2019/05/27,1108.0,1112.629,1125.0,52600,1125.0,1105.0
1160,2019/05/28,1126.0,1117.279,1111.0,73900,1126.0,1107.0
1161,2019/05/29,1148.0,1139.3,1119.0,104100,1155.0,1110.0
1162,2019/05/30,1164.0,1161.366,1135.0,145800,1186.0,1134.0
1163,2019/05/31,1146.0,1145.431,1152.0,75500,1159.0,1135.0
1164,2019/06/03,1101.0,1102.473,1118.0,88100,1123.0,1090.0
1165,2019/06/04,1125.0,1107.727,1117.0,67500,1125.0,1089.0
1166,2019/06/05,1183.0,1175.698,1175.0,74600,1189.0,1155.0
1167,2019/06/06,1140.0,1146.27,1170.0,77000,1175.0,1136.0
1168,2019/06/07,1155.0,1147.175,1140.0,55600,1158.0,1136.0
1169,2019/06/10,1176.0,1170.224,1180.0,42800,1180.0,1151.0
1170,2019/06/11,1163.0,1164.362,1165.0,143100,1171.0,1148.0
1171,2019/06/12,1187.0,1186.887,1170.0,95500,1197.0,1170.0
1172,2019/06/13,1182.0,1179.78,1174.0,108100,1192.0,1158.0
1173,2019/06/14,1194.0,1197.766,1196.0,87000,1211.0,1186.0
1174,2019/06/17,1162.0,1169.387,1185.0,43700,1187.0,1162.0
1175,2019/06/18,1125.0,1133.851,1160.0,95100,1161.0,1121.0
1176,2019/06/19,1190.0,1176.595,1148.0,113800,1195.0,1145.0
1177,2019/06/20,1177.0,1179.222,1185.0,68900,1194.0,1170.0
1178,2019/06/21,1180.0,1185.435,1193.0,80500,1206.0,1173.0
1179,2019/06/24,1177.0,1172.764,1179.0,37700,1183.0,1163.0
1180,2019/06/25,1157.0,1163.957,1179.0,53500,1185.0,1154.0
1181,2019/06/26,1103.0,1110.042,1145.0,125200,1147.0,1100.0
1182,2019/06/27,1123.0,1119.705,1110.0,85000,1129.0,1109.0
1183,2019/06/28,1141.0,1132.573,1121.0,98100,1141.0,1115.0
1184,2019/07/01,1210.0,1188.094,1170.0,66900,1210.0,1165.0
1185,2019/07/02,1200.0,1194.119,1191.0,84300,1210.0,1172.0
1186,2019/07/03,1150.0,1154.366,1186.0,94400,1187.0,1145.0
1187,2019/07/04,1172.0,1170.52,1159.0,53800,1180.0,1155.0
1188,2019/07/05,1181.0,1176.832,1188.0,47500,1194.0,1169.0
1189,2019/07/08,1152.0,1162.985,1180.0,58600,1180.0,1151.0
1190,2019/07/09,1133.0,1138.304,1157.0,68200,1157.0,1129.0
1191,2019/07/10,1134.0,1134.122,1138.0,99700,1143.0,1127.0
1192,2019/07/11,1139.0,1134.436,1134.0,80100,1143.0,1126.0
1193,2019/07/12,1173.0,1165.468,1149.0,106600,1183.0,1146.0
1194,2019/07/16,1152.0,1158.659,1172.0,98600,1179.0,1152.0
1195,2019/07/17,1123.0,1144.292,1157.0,119600,1176.0,1118.0
1196,2019/07/18,1081.0,1094.582,1122.0,90400,1126.0,1076.0
1197,2019/07/19,1128.0,1116.719,1088.0,60900,1136.0,1085.0
1198,2019/07/22,1125.0,1128.782,1128.0,51400,1145.0,1122.0
1199,2019/07/23,1138.0,1138.141,1137.0,44700,1145.0,1125.0
1200,2019/07/24,1141.0,1140.318,1146.0,42100,1154.0,1133.0
1201,2019/07/25,1134.0,1139.697,1156.0,64300,1156.0,1133.0
1202,2019/07/26,1130.0,1123.809,1121.0,62300,1133.0,1110.0
1203,2019/07/29,1135.0,1128.829,1121.0,72900,1140.0,1115.0
1204,2019/07/30,1137.0,1138.032,1135.0,76200,1147.0,1130.0
1205,2019/07/31,1122.0,1126.607,1116.0,124300,1139.0,1116.0
1206,2019/08/01,1074.0,1077.239,1106.0,192600,1106.0,1063.0
1207,2019/08/02,1022.0,1030.943,1051.0,125900,1057.0,1011.0
1208,2019/08/05,1076.0,1046.005,1019.0,469400,1120.0,964.0
1209,2019/08/06,1026.0,1026.661,1054.0,264800,1063.0,988.0
1210,2019/08/07,1007.0,1008.598,1021.0,114800,1027.0,999.0
1211,2019/08/08,1004.0,1006.533,1018.0,101300,1018.0,1001.0
1212,2019/08/09,1020.0,1022.988,1017.0,68600,1032.0,1014.0
1213,2019/08/13,1003.0,988.436,993.0,112700,1005.0,970.0
1214,2019/08/14,1018.0,1023.301,1027.0,89800,1034.0,1014.0
1215,2019/08/15,1012.0,1000.822,983.0,59400,1012.0,978.0
1216,2019/08/16,1006.0,1011.069,999.0,34900,1023.0,999.0
1217,2019/08/19,1033.0,1033.912,1024.0,53200,1043.0,1021.0
1218,2019/08/20,1056.0,1051.423,1035.0,47800,1056.0,1035.0
1219,2019/08/21,1105.0,1100.061,1054.0,298400,1130.0,1054.0
1220,2019/08/22,1147.0,1153.083,1130.0,352400,1175.0,1129.0
1221,2019/08/23,1190.0,1189.801,1161.0,482800,1205.0,1152.0
