ds,yhat
2019-07-16,528.629608850082
2019-07-17,527.6017558729468
2019-07-18,528.5774038405877
2019-07-19,532.6880941964009
2019-07-22,532.1884279004671
2019-07-23,524.1321158048113
2019-07-24,519.7658997367212
2019-07-25,522.9443764311434
2019-07-26,531.5534273440485
2019-07-29,537.6526847652049
2019-07-30,534.9689853767272
2019-07-31,538.0139554225651
2019-08-01,546.1641835190879
2019-08-02,553.2231852293452
2019-08-05,531.5224138583152
2019-08-06,523.6759205802692
2019-08-07,523.6489802079875
2019-08-08,528.9189704633624
2019-08-09,534.0137322105088
