ds,yhat
2019-07-16,1689.8388856622375
2019-07-17,1661.6491931053054
2019-07-18,1631.4293567081297
2019-07-19,1616.5974092970844
2019-07-22,1647.7288037252865
2019-07-23,1640.4034461088927
2019-07-24,1623.8336300878746
2019-07-25,1613.5551064365627
2019-07-26,1619.6992351333627
2019-07-29,1670.8169128416969
2019-07-30,1675.8150195098708
2019-07-31,1682.881181951404
2019-08-01,1698.3653080671388
2019-08-02,1719.9720845263714
2019-08-05,1769.462451470665
2019-08-06,1790.3263353386822
2019-08-07,1819.6162215762013
2019-08-08,1849.4716337747805
2019-08-09,1868.8555610672936
