ds,yhat
2019-07-16,1463.913269786326
2019-07-17,1445.7609362904611
2019-07-18,1429.484080929846
2019-07-19,1421.2271643577212
2019-07-22,1420.670836200195
2019-07-23,1416.846496540634
2019-07-24,1412.6796324401814
2019-07-25,1410.3075868592775
2019-07-26,1409.60412061755
2019-07-29,1410.7031984289674
2019-07-30,1414.5271680521187
2019-07-31,1418.8318600300543
2019-08-01,1420.0295842412852
2019-08-02,1416.4890013356326
2019-08-05,1422.596837608933
2019-08-06,1442.0339199292532
2019-08-07,1462.153584158581
2019-08-08,1474.6797880664005
2019-08-09,1477.9105702162296
