,DateTime,Open,High,Low,Close,VWAP,Trades,Volume,DS
0,2019/11/19 9:03:00,808.0,813.0,808.0,813.0,808.357,2,1400.0,2019-11-19 09:03:00
1,2019/11/19 9:07:00,810.0,810.0,808.0,808.0,809.0,2,400.0,2019-11-19 09:07:00
2,2019/11/19 9:20:00,810.0,810.0,810.0,810.0,810.0,1,200.0,2019-11-19 09:20:00
3,2019/11/19 9:34:00,811.0,811.0,810.0,810.0,810.333,2,300.0,2019-11-19 09:34:00
4,2019/11/19 9:36:00,818.0,818.0,818.0,818.0,818.0,1,100.0,2019-11-19 09:36:00
5,2019/11/19 11:04:00,810.0,810.0,810.0,810.0,810.0,1,1300.0,2019-11-19 11:04:00
6,2019/11/19 11:14:00,810.0,810.0,810.0,810.0,810.0,2,300.0,2019-11-19 11:14:00
7,2019/11/19 11:29:00,810.0,810.0,808.0,808.0,809.0,3,300.0,2019-11-19 11:29:00
8,2019/11/19 12:30:00,809.0,809.0,809.0,809.0,809.0,1,700.0,2019-11-19 12:30:00
9,2019/11/19 12:32:00,809.0,809.0,809.0,809.0,809.0,1,100.0,2019-11-19 12:32:00
10,2019/11/19 13:16:00,811.0,811.0,811.0,811.0,811.0,1,100.0,2019-11-19 13:16:00
11,2019/11/19 13:26:00,811.0,811.0,811.0,811.0,811.0,1,100.0,2019-11-19 13:26:00
12,2019/11/19 13:29:00,811.0,811.0,811.0,811.0,811.0,1,100.0,2019-11-19 13:29:00
13,2019/11/19 14:14:00,815.0,815.0,815.0,815.0,815.0,1,100.0,2019-11-19 14:14:00
14,2019/11/19 14:34:00,817.0,817.0,817.0,817.0,817.0,1,100.0,2019-11-19 14:34:00
15,2019/11/19 14:41:00,810.0,810.0,810.0,810.0,810.0,1,100.0,2019-11-19 14:41:00
16,2019/11/19 14:53:00,810.0,810.0,810.0,810.0,810.0,1,100.0,2019-11-19 14:53:00
17,2019/11/19 14:54:00,810.0,810.0,809.0,809.0,809.5,2,200.0,2019-11-19 14:54:00
18,2019/11/19 14:56:00,810.0,810.0,809.0,809.0,809.333,2,300.0,2019-11-19 14:56:00
19,2019/11/19 14:57:00,810.0,810.0,809.0,809.0,809.333,2,300.0,2019-11-19 14:57:00
20,2019/11/19 14:58:00,810.0,810.0,808.0,808.0,809.0,3,300.0,2019-11-19 14:58:00
21,2019/11/19 14:59:00,810.0,810.0,808.0,808.0,808.6,4,500.0,2019-11-19 14:59:00
22,2019/11/19 15:00:00,808.0,808.0,808.0,808.0,808.0,1,300.0,2019-11-19 15:00:00
