,Date,Close,VWAP,Open,Volume,High,Low
0,2018/02/23,0.0,0.0,0.0,0,0.0,0.0
1,2018/02/26,6200.0,5516.588,5380.0,1093700,6200.0,5200.0
2,2018/02/27,5860.0,6257.707,5800.0,2877900,6970.0,5560.0
3,2018/02/28,5790.0,6111.697,5960.0,1297100,6450.0,5690.0
4,2018/03/01,5850.0,5900.827,5710.0,654600,6100.0,5710.0
5,2018/03/02,5370.0,5491.939,5750.0,302300,5770.0,5300.0
6,2018/03/05,4610.0,4778.339,5300.0,285000,5320.0,4425.0
7,2018/03/06,4485.0,4721.906,4890.0,134300,4965.0,4480.0
8,2018/03/07,4255.0,4321.981,4480.0,102200,4485.0,4240.0
9,2018/03/08,4400.0,4479.837,4325.0,202400,4660.0,4310.0
10,2018/03/09,4450.0,4521.428,4515.0,97700,4660.0,4410.0
11,2018/03/12,4295.0,4400.627,4520.0,56600,4540.0,4260.0
12,2018/03/13,4350.0,4326.984,4300.0,91000,4400.0,4260.0
13,2018/03/14,4475.0,4430.336,4325.0,81800,4530.0,4300.0
14,2018/03/15,4515.0,4453.565,4500.0,46000,4525.0,4385.0
15,2018/03/16,4955.0,5007.537,4865.0,446200,5170.0,4815.0
16,2018/03/19,4535.0,4617.997,4775.0,133800,4805.0,4515.0
17,2018/03/20,4250.0,4310.197,4325.0,121900,4435.0,4250.0
18,2018/03/22,4100.0,4177.016,4270.0,76400,4330.0,4040.0
19,2018/03/23,3755.0,3803.841,3840.0,79400,3925.0,3725.0
20,2018/03/26,3860.0,3904.274,3965.0,90200,3980.0,3800.0
21,2018/03/27,4070.0,4086.554,4050.0,69200,4135.0,4000.0
22,2018/03/28,4245.0,4161.453,4000.0,64700,4290.0,3860.0
23,2018/03/29,4240.0,4264.088,4275.0,31800,4310.0,4210.0
24,2018/03/30,4175.0,4216.529,4295.0,39900,4295.0,4125.0
25,2018/04/02,4265.0,4229.257,4200.0,30300,4280.0,4170.0
26,2018/04/03,4135.0,4145.081,4165.0,31000,4200.0,4100.0
27,2018/04/04,3880.0,3972.491,4135.0,56600,4135.0,3880.0
28,2018/04/05,3985.0,3972.772,3980.0,35900,4070.0,3850.0
29,2018/04/06,4010.0,4026.957,4080.0,20700,4085.0,3955.0
30,2018/04/09,4010.0,3938.405,3910.0,11600,4010.0,3880.0
31,2018/04/10,4025.0,4004.64,4030.0,12500,4070.0,3960.0
32,2018/04/11,3890.0,3939.476,4025.0,14300,4025.0,3890.0
33,2018/04/12,3815.0,3850.158,3890.0,12700,3900.0,3805.0
34,2018/04/13,3820.0,3830.899,3835.0,8900,3890.0,3800.0
35,2018/04/16,3720.0,3765.03,3825.0,16800,3840.0,3705.0
36,2018/04/17,3775.0,3633.127,3785.0,30700,3785.0,3510.0
37,2018/04/18,3830.0,3791.223,3810.0,9400,3840.0,3720.0
38,2018/04/19,3770.0,3824.695,3850.0,13100,3895.0,3770.0
39,2018/04/20,3755.0,3755.948,3815.0,5800,3815.0,3730.0
40,2018/04/23,3690.0,3699.567,3745.0,10400,3750.0,3620.0
41,2018/04/24,3700.0,3714.0,3660.0,6500,3750.0,3660.0
42,2018/04/25,3655.0,3678.254,3700.0,6300,3700.0,3645.0
43,2018/04/26,3665.0,3660.926,3660.0,5400,3695.0,3635.0
44,2018/04/27,3590.0,3603.585,3665.0,10600,3685.0,3585.0
45,2018/05/01,3590.0,3558.902,3525.0,8200,3595.0,3520.0
46,2018/05/02,3485.0,3504.519,3520.0,10400,3530.0,3480.0
47,2018/05/07,3525.0,3506.971,3520.0,10400,3525.0,3485.0
48,2018/05/08,3565.0,3557.353,3580.0,6800,3590.0,3540.0
49,2018/05/09,3580.0,3562.786,3545.0,7000,3610.0,3510.0
50,2018/05/10,3590.0,3579.583,3600.0,3600,3600.0,3560.0
51,2018/05/11,3740.0,3691.593,3590.0,18200,3770.0,3570.0
52,2018/05/14,3870.0,3811.61,3810.0,29200,3870.0,3725.0
53,2018/05/15,3770.0,3782.472,3870.0,18000,3870.0,3740.0
54,2018/05/16,3555.0,3561.417,3690.0,24700,3690.0,3495.0
55,2018/05/17,3525.0,3524.518,3570.0,16600,3590.0,3510.0
56,2018/05/18,3565.0,3563.482,3535.0,11200,3610.0,3510.0
57,2018/05/21,3655.0,3627.281,3565.0,11400,3670.0,3560.0
58,2018/05/22,3715.0,3706.02,3720.0,9800,3735.0,3675.0
59,2018/05/23,3625.0,3629.947,3645.0,9500,3675.0,3600.0
60,2018/05/24,3635.0,3595.41,3600.0,6100,3635.0,3575.0
61,2018/05/25,3580.0,3596.932,3570.0,4400,3635.0,3570.0
62,2018/05/28,3715.0,3701.202,3580.0,12900,3770.0,3580.0
63,2018/05/29,3650.0,3687.8,3755.0,7500,3755.0,3640.0
64,2018/05/30,3620.0,3611.27,3610.0,6300,3640.0,3600.0
65,2018/05/31,3565.0,3587.143,3675.0,4900,3675.0,3550.0
66,2018/06/01,3660.0,3621.739,3585.0,4600,3675.0,3565.0
67,2018/06/04,3720.0,3706.782,3695.0,8700,3745.0,3665.0
68,2018/06/05,3710.0,3695.855,3740.0,7600,3745.0,3635.0
69,2018/06/06,3600.0,3622.374,3685.0,13900,3685.0,3580.0
70,2018/06/07,3650.0,3631.316,3640.0,5700,3650.0,3610.0
71,2018/06/08,3600.0,3608.947,3650.0,5700,3650.0,3595.0
72,2018/06/11,3680.0,3654.023,3630.0,8700,3690.0,3630.0
73,2018/06/12,3685.0,3690.0,3680.0,5800,3710.0,3670.0
74,2018/06/13,3895.0,3807.61,3705.0,29500,3900.0,3700.0
75,2018/06/14,3940.0,3919.268,3935.0,39600,3960.0,3865.0
76,2018/06/15,3530.0,3562.397,3520.0,68000,3650.0,3510.0
77,2018/06/18,3330.0,3398.746,3530.0,34300,3530.0,3305.0
78,2018/06/19,3015.0,3029.056,3300.0,69400,3300.0,2947.0
79,2018/06/20,2986.0,2948.399,2984.0,24800,2995.0,2910.0
80,2018/06/21,3080.0,3061.007,2946.0,15100,3145.0,2945.0
81,2018/06/22,3140.0,3135.376,3005.0,17300,3200.0,3005.0
82,2018/06/25,3050.0,3122.653,3180.0,9800,3190.0,3035.0
83,2018/06/26,3170.0,3145.341,3050.0,13500,3225.0,2980.0
84,2018/06/27,3285.0,3256.506,3180.0,8300,3310.0,3180.0
85,2018/06/28,3240.0,3249.623,3215.0,5300,3285.0,3215.0
86,2018/06/29,3275.0,3270.49,3285.0,5100,3295.0,3250.0
87,2018/07/02,3020.0,3102.051,3280.0,19500,3280.0,2911.0
88,2018/07/03,3060.0,3054.578,3020.0,7100,3085.0,3020.0
89,2018/07/04,3095.0,3098.6,3060.0,7500,3170.0,3050.0
90,2018/07/05,2936.0,3025.774,3120.0,9300,3140.0,2936.0
91,2018/07/06,3020.0,3013.781,2980.0,3200,3065.0,2974.0
92,2018/07/09,3025.0,3031.923,3035.0,5200,3135.0,3005.0
93,2018/07/10,3025.0,3050.968,3060.0,3100,3085.0,3020.0
94,2018/07/11,2984.0,2999.778,3075.0,2700,3075.0,2946.0
95,2018/07/12,3015.0,3027.462,3015.0,2600,3120.0,2984.0
96,2018/07/13,2970.0,2971.6,3015.0,3500,3015.0,2948.0
97,2018/07/17,2950.0,2965.559,2970.0,3400,3015.0,2950.0
98,2018/07/18,2965.0,2969.871,2951.0,3100,2997.0,2951.0
99,2018/07/19,2940.0,2948.581,2977.0,3100,2977.0,2940.0
100,2018/07/20,2913.0,2920.6,2930.0,5000,2948.0,2913.0
101,2018/07/23,2833.0,2858.769,2910.0,3900,2910.0,2800.0
102,2018/07/24,2730.0,2786.862,2831.0,13000,2833.0,2730.0
103,2018/07/25,2713.0,2690.919,2730.0,18400,2730.0,2627.0
104,2018/07/26,2704.0,2696.231,2713.0,5200,2713.0,2660.0
105,2018/07/27,2681.0,2697.2,2720.0,5000,2720.0,2681.0
106,2018/07/30,2645.0,2667.793,2690.0,8200,2700.0,2630.0
107,2018/07/31,2548.0,2573.174,2674.0,9200,2674.0,2541.0
108,2018/08/01,2488.0,2507.651,2541.0,8300,2541.0,2487.0
109,2018/08/02,2448.0,2464.103,2465.0,6800,2487.0,2445.0
110,2018/08/03,2450.0,2467.881,2450.0,8400,2500.0,2441.0
111,2018/08/06,2440.0,2453.28,2451.0,2500,2461.0,2440.0
112,2018/08/07,2290.0,2306.5,2440.0,14400,2440.0,2224.0
113,2018/08/08,2214.0,2234.397,2269.0,12100,2269.0,2214.0
114,2018/08/09,2290.0,2291.043,2217.0,16400,2347.0,2217.0
115,2018/08/10,2277.0,2291.943,2291.0,5300,2310.0,2277.0
116,2018/08/13,2203.0,2222.143,2290.0,5600,2290.0,2194.0
117,2018/08/14,2230.0,2262.512,2303.0,4300,2309.0,2220.0
118,2018/08/15,2138.0,2170.817,2230.0,7100,2230.0,2135.0
119,2018/08/16,2042.0,2065.146,2100.0,5500,2101.0,2039.0
120,2018/08/17,2103.0,2088.373,2079.0,5100,2139.0,2051.0
121,2018/08/20,2023.0,2028.094,2013.0,5300,2063.0,2013.0
122,2018/08/21,1986.0,1994.296,2002.0,4400,2030.0,1984.0
123,2018/08/22,2010.0,2008.467,1986.0,4500,2030.0,1986.0
124,2018/08/23,2030.0,2021.767,2015.0,6000,2045.0,1994.0
125,2018/08/24,2514.0,2385.176,2038.0,69900,2528.0,2038.0
126,2018/08/27,2405.0,2445.642,2539.0,36600,2539.0,2361.0
127,2018/08/28,2640.0,2653.81,2405.0,52500,2880.0,2405.0
128,2018/08/29,2750.0,2704.414,2590.0,31900,2772.0,2586.0
129,2018/08/30,2866.0,2892.694,2850.0,53000,2980.0,2800.0
130,2018/08/31,2826.0,2823.185,2840.0,16200,2860.0,2765.0
131,2018/09/03,2705.0,2700.995,2826.0,19600,2826.0,2600.0
132,2018/09/04,2605.0,2619.291,2700.0,11700,2700.0,2572.0
133,2018/09/05,2562.0,2550.859,2521.0,7800,2599.0,2521.0
134,2018/09/06,2404.0,2433.264,2471.0,11000,2490.0,2394.0
135,2018/09/07,2401.0,2250.418,2262.0,30400,2401.0,2140.0
136,2018/09/10,2641.0,2586.957,2445.0,20800,2678.0,2445.0
137,2018/09/11,2635.0,2678.094,2714.0,17100,2725.0,2611.0
138,2018/09/12,2515.0,2546.142,2650.0,12700,2650.0,2500.0
139,2018/09/13,2478.0,2454.664,2465.0,10700,2500.0,2336.0
140,2018/09/14,2640.0,2598.577,2555.0,19400,2640.0,2535.0
141,2018/09/18,2510.0,2500.744,2490.0,18000,2559.0,2452.0
142,2018/09/19,2475.0,2519.235,2500.0,16600,2577.0,2450.0
143,2018/09/20,2496.0,2487.583,2476.0,9600,2524.0,2455.0
144,2018/09/21,2490.0,2490.362,2473.0,5800,2520.0,2473.0
145,2018/09/25,2465.0,2462.99,2490.0,10300,2491.0,2429.0
146,2018/09/26,2436.0,2434.275,2438.0,6900,2452.0,2412.0
147,2018/09/27,2301.0,2376.779,2425.0,14500,2431.0,2300.0
148,2018/09/28,2370.0,2360.155,2315.0,18100,2371.0,2315.0
149,2018/10/01,2445.0,2432.079,2346.0,6300,2490.0,2346.0
150,2018/10/02,2380.0,2401.376,2438.0,10100,2466.0,2346.0
151,2018/10/03,2319.0,2349.936,2375.0,6200,2375.0,2317.0
152,2018/10/04,2346.0,2334.522,2322.0,4600,2366.0,2320.0
153,2018/10/05,2216.0,2264.336,2320.0,10700,2336.0,2200.0
154,2018/10/09,2109.0,2146.915,2166.0,8200,2197.0,2100.0
155,2018/10/10,2182.0,2162.128,2150.0,3900,2191.0,2143.0
156,2018/10/11,2110.0,2072.592,2100.0,15200,2132.0,2003.0
157,2018/10/12,2117.0,2058.443,2031.0,6100,2178.0,2013.0
158,2018/10/15,2234.0,2215.091,2159.0,6600,2251.0,2121.0
159,2018/10/16,2146.0,2166.105,2205.0,5700,2228.0,2103.0
160,2018/10/17,2264.0,2230.152,2178.0,6600,2264.0,2178.0
161,2018/10/18,2280.0,2278.177,2265.0,7900,2299.0,2239.0
162,2018/10/19,2300.0,2298.522,2281.0,4600,2328.0,2281.0
163,2018/10/22,2204.0,2211.577,2291.0,8500,2291.0,2171.0
164,2018/10/23,2216.0,2185.522,2156.0,4600,2216.0,2156.0
165,2018/10/24,2172.0,2223.486,2266.0,3500,2266.0,2172.0
166,2018/10/25,2080.0,2095.775,2103.0,10200,2133.0,2080.0
167,2018/10/26,2020.0,2063.77,2075.0,8700,2179.0,2010.0
168,2018/10/29,1820.0,1902.895,1991.0,10500,2001.0,1820.0
169,2018/10/30,1976.0,1911.818,1860.0,12100,1978.0,1800.0
170,2018/10/31,2147.0,2045.514,1976.0,10700,2147.0,1976.0
171,2018/11/01,2049.0,2061.573,2062.0,7500,2112.0,2039.0
172,2018/11/02,2068.0,2086.954,2051.0,4300,2139.0,2051.0
173,2018/11/05,2077.0,2079.448,2072.0,2900,2104.0,2048.0
174,2018/11/06,2021.0,2036.95,2066.0,4000,2081.0,2014.0
175,2018/11/07,2005.0,2009.667,2002.0,3000,2029.0,2002.0
176,2018/11/08,2005.0,2044.24,2074.0,5000,2076.0,2005.0
177,2018/11/09,1995.0,2001.029,2030.0,3500,2030.0,1990.0
178,2018/11/12,2000.0,1994.189,2000.0,3700,2001.0,1980.0
179,2018/11/13,1937.0,1936.741,1974.0,2700,1974.0,1920.0
180,2018/11/14,1872.0,1890.18,1930.0,6100,1930.0,1866.0
181,2018/11/15,1828.0,1843.745,1870.0,4700,1870.0,1825.0
182,2018/11/16,1869.0,1880.08,1830.0,5000,1945.0,1828.0
183,2018/11/19,1837.0,1846.923,1836.0,1300,1876.0,1836.0
184,2018/11/20,1821.0,1819.813,1821.0,3200,1854.0,1800.0
185,2018/11/21,1810.0,1811.529,1804.0,3400,1835.0,1803.0
186,2018/11/22,1818.0,1813.955,1810.0,2200,1850.0,1803.0
187,2018/11/26,1852.0,1833.188,1823.0,1600,1865.0,1820.0
188,2018/11/27,1791.0,1813.672,1851.0,6100,1851.0,1756.0
189,2018/11/28,1814.0,1801.543,1781.0,3500,1814.0,1781.0
190,2018/11/29,1842.0,1835.697,1830.0,6600,1875.0,1820.0
191,2018/11/30,1879.0,1889.8,1875.0,8000,1927.0,1850.0
192,2018/12/03,1897.0,1890.333,1880.0,4500,1919.0,1860.0
193,2018/12/04,1868.0,1868.208,1890.0,2400,1890.0,1851.0
194,2018/12/05,1890.0,1882.226,1867.0,3100,1930.0,1851.0
195,2018/12/06,1857.0,1848.714,1858.0,4200,1858.0,1829.0
196,2018/12/07,1849.0,1841.111,1857.0,3600,1888.0,1810.0
197,2018/12/10,1792.0,1785.429,1809.0,5600,1809.0,1753.0
198,2018/12/11,1565.0,1637.754,1799.0,11400,1799.0,1500.0
199,2018/12/12,1629.0,1588.743,1567.0,7000,1647.0,1555.0
200,2018/12/13,1591.0,1597.5,1589.0,4200,1615.0,1581.0
201,2018/12/14,1583.0,1552.38,1591.0,12100,1600.0,1500.0
202,2018/12/17,1359.0,1420.277,1463.0,31400,1500.0,1350.0
203,2018/12/18,1349.0,1328.929,1283.0,15500,1385.0,1283.0
204,2018/12/19,1288.0,1270.697,1349.0,18500,1349.0,1200.0
205,2018/12/20,1276.0,1286.869,1318.0,15300,1318.0,1228.0
206,2018/12/21,1173.0,1151.479,1186.0,28200,1224.0,1047.0
207,2018/12/25,1057.0,1081.279,1081.0,19700,1094.0,1056.0
208,2018/12/26,1080.0,1115.795,1177.0,19000,1177.0,1060.0
209,2018/12/27,1274.0,1186.755,1159.0,10600,1324.0,1100.0
210,2018/12/28,1184.0,1181.64,1195.0,10000,1235.0,1137.0
211,2019/01/04,1085.0,1082.54,1121.0,10000,1121.0,1067.0
212,2019/01/07,1129.0,1127.978,1084.0,9200,1160.0,1078.0
213,2019/01/08,1188.0,1182.191,1146.0,12600,1212.0,1146.0
214,2019/01/09,1182.0,1181.729,1158.0,4800,1219.0,1158.0
215,2019/01/10,1109.0,1141.107,1191.0,5600,1191.0,1109.0
216,2019/01/11,1132.0,1136.905,1139.0,2100,1156.0,1128.0
217,2019/01/15,1193.0,1162.0,1145.0,3100,1193.0,1144.0
218,2019/01/16,1168.0,1184.643,1171.0,4200,1229.0,1158.0
219,2019/01/17,1197.0,1178.089,1198.0,4500,1198.0,1144.0
220,2019/01/18,1327.0,1288.965,1214.0,19800,1360.0,1178.0
221,2019/01/21,1258.0,1321.264,1350.0,9100,1350.0,1258.0
222,2019/01/22,1251.0,1241.706,1228.0,5100,1280.0,1195.0
223,2019/01/23,1320.0,1304.974,1251.0,3800,1336.0,1232.0
224,2019/01/24,1315.0,1300.757,1293.0,3700,1329.0,1270.0
225,2019/01/25,1340.0,1336.03,1292.0,6700,1370.0,1292.0
226,2019/01/28,1398.0,1389.126,1358.0,8700,1407.0,1358.0
227,2019/01/29,1355.0,1343.167,1338.0,6000,1382.0,1302.0
228,2019/01/30,1303.0,1341.536,1399.0,6900,1399.0,1303.0
229,2019/01/31,1315.0,1312.8,1304.0,1500,1320.0,1302.0
230,2019/02/01,1325.0,1319.235,1315.0,1700,1336.0,1306.0
231,2019/02/04,1306.0,1313.913,1334.0,2300,1334.0,1300.0
232,2019/02/05,1291.0,1308.0,1320.0,3000,1320.0,1291.0
233,2019/02/06,1305.0,1303.571,1291.0,700,1314.0,1291.0
234,2019/02/07,1281.0,1307.96,1320.0,2500,1350.0,1280.0
235,2019/02/08,1281.0,1282.857,1281.0,1400,1288.0,1281.0
236,2019/02/12,1231.0,1227.0,1254.0,1200,1254.0,1204.0
237,2019/02/13,1231.0,1235.167,1225.0,1200,1261.0,1225.0
238,2019/02/14,1221.0,1235.636,1232.0,1100,1243.0,1221.0
239,2019/02/15,1221.0,1220.75,1221.0,1200,1221.0,1220.0
240,2019/02/18,1224.0,1229.727,1221.0,3300,1267.0,1203.0
241,2019/02/19,1224.0,1215.158,1231.0,1900,1231.0,1206.0
242,2019/02/20,1206.0,1207.59,1205.0,3900,1220.0,1205.0
243,2019/02/21,1206.0,1211.212,1210.0,3300,1228.0,1205.0
244,2019/02/22,1205.0,1207.0,1227.0,1300,1227.0,1203.0
245,2019/02/25,1229.0,1207.389,1205.0,3600,1229.0,1198.0
246,2019/02/26,1206.0,1225.765,1231.0,3400,1236.0,1205.0
247,2019/02/27,1200.0,1199.42,1218.0,6900,1218.0,1188.0
248,2019/02/28,1229.0,1208.578,1188.0,6400,1240.0,1188.0
249,2019/03/01,1211.0,1218.76,1242.0,2500,1242.0,1206.0
250,2019/03/04,1225.0,1219.031,1219.0,6500,1234.0,1201.0
251,2019/03/05,1229.0,1220.11,1237.0,8200,1237.0,1215.0
252,2019/03/06,1215.0,1220.944,1234.0,5400,1234.0,1215.0
253,2019/03/07,1216.0,1224.257,1219.0,7400,1234.0,1215.0
254,2019/03/08,1208.0,1215.514,1214.0,7000,1239.0,1208.0
255,2019/03/11,1218.0,1205.495,1216.0,9100,1234.0,1199.0
256,2019/03/12,1172.0,1186.933,1220.0,7500,1220.0,1150.0
257,2019/03/13,1143.0,1158.379,1196.0,10300,1196.0,1143.0
258,2019/03/14,1123.0,1129.911,1143.0,12300,1150.0,1110.0
259,2019/03/15,1151.0,1164.358,1152.0,16500,1185.0,1150.0
260,2019/03/18,1451.0,1451.0,1451.0,7500,1451.0,1451.0
261,2019/03/19,1751.0,1685.28,1631.0,425500,1751.0,1575.0
262,2019/03/20,1751.0,1864.592,1849.0,375700,1991.0,1751.0
263,2019/03/22,1599.0,1691.665,1771.0,110900,1859.0,1597.0
264,2019/03/25,1659.0,1622.938,1560.0,71100,1722.0,1519.0
265,2019/03/26,1611.0,1646.83,1699.0,27700,1711.0,1611.0
266,2019/03/27,2011.0,1871.283,1708.0,129200,2011.0,1680.0
267,2019/03/28,2203.0,2233.217,2151.0,485200,2371.0,2115.0
268,2019/03/29,2071.0,2085.32,2180.0,98100,2180.0,2017.0
269,2019/04/01,2010.0,2043.984,2055.0,43100,2160.0,2000.0
270,2019/04/02,1873.0,1951.618,2030.0,46800,2071.0,1872.0
271,2019/04/03,1810.0,1839.549,1891.0,21500,1897.0,1802.0
272,2019/04/04,1808.0,1792.229,1781.0,26200,1838.0,1751.0
273,2019/04/05,1810.0,1792.806,1768.0,13900,1828.0,1768.0
274,2019/04/08,2008.0,1964.433,1830.0,67000,2040.0,1829.0
275,2019/04/09,1930.0,1994.884,1958.0,55800,2100.0,1908.0
276,2019/04/10,1913.0,1901.662,1891.0,13600,1944.0,1850.0
277,2019/04/11,2016.0,2007.229,1953.0,41100,2080.0,1910.0
278,2019/04/12,1950.0,2026.101,2010.0,36500,2088.0,1950.0
279,2019/04/15,1951.0,1955.469,1990.0,11300,2002.0,1911.0
280,2019/04/16,1921.0,1933.122,1957.0,4900,1957.0,1921.0
281,2019/04/17,1876.0,1888.282,1880.0,13100,1952.0,1866.0
282,2019/04/18,1836.0,1830.194,1877.0,13400,1877.0,1801.0
283,2019/04/19,1810.0,1812.179,1800.0,14000,1854.0,1791.0
284,2019/04/22,1906.0,1824.956,1846.0,29400,1944.0,1732.0
285,2019/04/23,1895.0,1953.194,1970.0,22700,2000.0,1884.0
286,2019/04/24,1820.0,1875.929,1896.0,14100,1924.0,1820.0
287,2019/04/25,1752.0,1780.328,1800.0,28400,1825.0,1726.0
288,2019/04/26,1746.0,1733.023,1722.0,8900,1750.0,1722.0
289,2019/05/07,1783.0,1743.273,1718.0,6600,1795.0,1681.0
290,2019/05/08,1800.0,1766.522,1731.0,11300,1813.0,1731.0
291,2019/05/09,1752.0,1769.582,1785.0,11000,1830.0,1730.0
292,2019/05/10,1719.0,1722.947,1752.0,13300,1771.0,1683.0
293,2019/05/13,1600.0,1642.504,1693.0,12900,1744.0,1600.0
294,2019/05/14,1532.0,1509.027,1582.0,33400,1582.0,1463.0
295,2019/05/15,1516.0,1483.255,1533.0,21200,1539.0,1439.0
296,2019/05/16,1515.0,1513.418,1506.0,6700,1556.0,1464.0
297,2019/05/17,1655.0,1629.156,1541.0,13500,1669.0,1541.0
298,2019/05/20,1646.0,1647.275,1672.0,13100,1716.0,1581.0
299,2019/05/21,1648.0,1619.422,1622.0,6400,1657.0,1590.0
300,2019/05/22,1685.0,1678.649,1648.0,11100,1728.0,1620.0
301,2019/05/23,1645.0,1674.753,1662.0,8900,1726.0,1632.0
302,2019/05/24,1670.0,1653.921,1626.0,8900,1700.0,1600.0
303,2019/05/27,1869.0,1811.556,1663.0,35600,1946.0,1650.0
304,2019/05/28,1949.0,1914.8,1900.0,29000,1949.0,1881.0
305,2019/05/29,1998.0,1962.921,1948.0,22800,2017.0,1880.0
306,2019/05/30,1980.0,2024.715,1996.0,33000,2063.0,1980.0
307,2019/05/31,1832.0,1878.61,1931.0,33100,1982.0,1822.0
308,2019/06/03,1843.0,1837.787,1818.0,23500,1900.0,1756.0
309,2019/06/04,1924.0,1875.198,1923.0,19200,1925.0,1800.0
310,2019/06/05,1898.0,1915.171,1964.0,7600,1964.0,1885.0
311,2019/06/06,1875.0,1889.564,1905.0,3900,1911.0,1871.0
312,2019/06/07,1823.0,1843.742,1875.0,8900,1889.0,1817.0
313,2019/06/10,1906.0,1891.01,1840.0,10200,1915.0,1840.0
314,2019/06/11,2025.0,1991.405,1909.0,32100,2084.0,1883.0
315,2019/06/12,2040.0,2061.799,2029.0,33400,2139.0,2020.0
316,2019/06/13,2056.0,2032.556,2030.0,23200,2062.0,2000.0
317,2019/06/14,2198.0,2152.664,2071.0,54800,2229.0,2065.0
318,2019/06/17,1820.0,1878.039,1878.0,94900,1964.0,1784.0
319,2019/06/18,1719.0,1809.192,1800.0,38600,1890.0,1700.0
320,2019/06/19,1754.0,1728.645,1777.0,26500,1777.0,1665.0
321,2019/06/20,1808.0,1762.281,1774.0,13900,1813.0,1720.0
322,2019/06/21,1799.0,1801.849,1848.0,16500,1848.0,1771.0
323,2019/06/24,1749.0,1753.4,1780.0,10000,1780.0,1727.0
324,2019/06/25,1801.0,1783.27,1749.0,7400,1807.0,1738.0
325,2019/06/26,1769.0,1770.456,1801.0,6800,1801.0,1750.0
326,2019/06/27,1747.0,1733.212,1771.0,10400,1771.0,1700.0
327,2019/06/28,1748.0,1733.884,1769.0,17300,1777.0,1710.0
328,2019/07/01,1671.0,1718.364,1750.0,26900,1800.0,1670.0
329,2019/07/02,1690.0,1669.454,1711.0,17200,1711.0,1641.0
330,2019/07/03,1695.0,1679.283,1695.0,4600,1700.0,1653.0
331,2019/07/04,1696.0,1696.978,1695.0,4500,1711.0,1678.0
332,2019/07/05,1707.0,1706.627,1684.0,7500,1728.0,1684.0
333,2019/07/08,1730.0,1729.073,1731.0,6900,1750.0,1713.0
334,2019/07/09,1718.0,1720.565,1742.0,6200,1742.0,1701.0
335,2019/07/10,1709.0,1693.3,1689.0,4000,1718.0,1671.0
336,2019/07/11,1731.0,1731.339,1736.0,5600,1759.0,1700.0
337,2019/07/12,1712.0,1719.019,1746.0,5400,1747.0,1712.0
338,2019/07/16,1776.0,1747.788,1713.0,15100,1781.0,1685.0
339,2019/07/17,1773.0,1764.081,1800.0,14900,1800.0,1726.0
340,2019/07/18,1752.0,1749.367,1745.0,6000,1761.0,1727.0
341,2019/07/19,1807.0,1800.421,1778.0,21400,1830.0,1770.0
342,2019/07/22,1794.0,1809.705,1842.0,20000,1870.0,1735.0
343,2019/07/23,1824.0,1821.052,1794.0,11500,1851.0,1789.0
344,2019/07/24,1806.0,1818.15,1825.0,6000,1834.0,1806.0
345,2019/07/25,1790.0,1794.119,1810.0,4200,1815.0,1784.0
346,2019/07/26,1808.0,1779.546,1790.0,8800,1828.0,1755.0
347,2019/07/29,1812.0,1831.32,1814.0,17800,1860.0,1781.0
348,2019/07/30,1777.0,1786.695,1812.0,9500,1812.0,1762.0
349,2019/07/31,1775.0,1752.244,1758.0,4100,1784.0,1725.0
350,2019/08/01,1775.0,1772.471,1781.0,3400,1799.0,1748.0
351,2019/08/02,1784.0,1781.487,1742.0,7400,1800.0,1742.0
352,2019/08/05,1715.0,1725.015,1715.0,13700,1750.0,1715.0
353,2019/08/06,1710.0,1673.492,1687.0,12000,1715.0,1624.0
354,2019/08/07,1716.0,1685.129,1715.0,3100,1716.0,1665.0
355,2019/08/08,1694.0,1688.455,1707.0,3300,1721.0,1680.0
356,2019/08/09,1683.0,1695.783,1718.0,2300,1718.0,1680.0
357,2019/08/13,1660.0,1651.628,1683.0,4300,1683.0,1630.0
358,2019/08/14,1668.0,1673.535,1650.0,4300,1700.0,1650.0
359,2019/08/15,1651.0,1656.816,1668.0,3800,1678.0,1643.0
360,2019/08/16,1644.0,1638.588,1640.0,1700,1645.0,1630.0
361,2019/08/19,1645.0,1655.5,1677.0,1600,1677.0,1643.0
362,2019/08/20,1622.0,1628.972,1645.0,3600,1647.0,1620.0
363,2019/08/21,1629.0,1630.524,1618.0,2100,1648.0,1618.0
364,2019/08/22,1671.0,1661.8,1650.0,3500,1676.0,1648.0
365,2019/08/23,1765.0,1743.479,1672.0,9600,1787.0,1672.0
