,Date,Close,VWAP,Open,Volume,High,Low
0,2014/08/25,3280.0,3296.451,3290.0,255000,3320.0,3275.0
1,2014/08/26,3265.0,3270.871,3265.0,132000,3280.0,3265.0
2,2014/08/27,3235.0,3229.659,3250.0,308000,3265.0,3205.0
3,2014/08/28,3270.0,3265.125,3265.0,280000,3280.0,3245.0
4,2014/08/29,3255.0,3246.139,3235.0,395000,3280.0,3205.0
5,2014/09/01,3230.0,3238.566,3255.0,129000,3265.0,3225.0
6,2014/09/02,3195.0,3211.63,3245.0,322000,3245.0,3185.0
7,2014/09/03,3250.0,3238.816,3205.0,266000,3255.0,3205.0
8,2014/09/04,3250.0,3246.273,3255.0,220000,3255.0,3235.0
9,2014/09/05,3215.0,3228.699,3260.0,219000,3265.0,3210.0
10,2014/09/08,3260.0,3251.25,3250.0,268000,3270.0,3220.0
11,2014/09/09,3265.0,3260.098,3260.0,357000,3275.0,3230.0
12,2014/09/10,3290.0,3276.177,3260.0,323000,3295.0,3255.0
13,2014/09/11,3235.0,3241.151,3285.0,265000,3285.0,3220.0
14,2014/09/12,3220.0,3215.953,3215.0,383000,3235.0,3210.0
15,2014/09/16,3260.0,3256.025,3235.0,317000,3280.0,3210.0
16,2014/09/17,3280.0,3284.564,3270.0,195000,3300.0,3265.0
17,2014/09/18,3280.0,3284.476,3275.0,248000,3300.0,3275.0
18,2014/09/19,3315.0,3310.688,3300.0,189000,3335.0,3290.0
19,2014/09/22,3320.0,3318.376,3320.0,197000,3340.0,3300.0
20,2014/09/24,3345.0,3339.503,3320.0,161000,3350.0,3320.0
21,2014/09/25,3470.0,3440.117,3395.0,429000,3470.0,3385.0
22,2014/09/26,3390.0,3387.099,3350.0,312000,3415.0,3350.0
23,2014/09/29,3405.0,3422.367,3425.0,281000,3455.0,3395.0
24,2014/09/30,3640.0,3630.266,3575.0,1090000,3665.0,3575.0
25,2014/10/01,3595.0,3627.612,3650.0,1118300,3685.0,3585.0
26,2014/10/02,3570.0,3611.904,3720.0,1206400,3720.0,3530.0
27,2014/10/03,3630.0,3609.813,3540.0,956900,3645.0,3515.0
28,2014/10/06,3625.0,3638.336,3680.0,483500,3695.0,3600.0
29,2014/10/07,3690.0,3686.432,3640.0,589600,3725.0,3640.0
30,2014/10/08,3670.0,3667.338,3640.0,647400,3695.0,3635.0
31,2014/10/09,3635.0,3648.006,3675.0,381700,3680.0,3615.0
32,2014/10/10,3570.0,3582.975,3555.0,451300,3630.0,3550.0
33,2014/10/14,3500.0,3510.185,3450.0,617400,3550.0,3440.0
34,2014/10/15,3560.0,3556.909,3555.0,567500,3595.0,3530.0
35,2014/10/16,3530.0,3557.48,3520.0,690800,3625.0,3500.0
36,2014/10/17,3460.0,3493.459,3555.0,516400,3560.0,3460.0
37,2014/10/20,3535.0,3515.229,3520.0,730200,3545.0,3480.0
38,2014/10/21,3565.0,3563.207,3590.0,561400,3610.0,3535.0
39,2014/10/22,3630.0,3610.988,3595.0,339600,3640.0,3565.0
40,2014/10/23,3515.0,3526.508,3590.0,669200,3615.0,3485.0
41,2014/10/24,3530.0,3531.875,3570.0,582000,3580.0,3500.0
42,2014/10/27,3560.0,3558.784,3555.0,305400,3580.0,3530.0
43,2014/10/28,3595.0,3592.439,3580.0,275500,3625.0,3575.0
44,2014/10/29,3610.0,3606.13,3620.0,346400,3635.0,3585.0
45,2014/10/30,3680.0,3671.04,3645.0,904000,3710.0,3620.0
46,2014/10/31,3835.0,3776.816,3725.0,874800,3835.0,3680.0
47,2014/11/04,3985.0,4000.454,4045.0,955400,4055.0,3940.0
48,2014/11/05,3915.0,3897.704,3945.0,796600,3990.0,3820.0
49,2014/11/06,3885.0,3915.325,3930.0,641200,3990.0,3865.0
50,2014/11/07,3890.0,3887.806,3915.0,308300,3930.0,3870.0
51,2014/11/10,3850.0,3845.868,3850.0,235500,3875.0,3825.0
52,2014/11/11,3915.0,3898.888,3855.0,325600,3925.0,3855.0
53,2014/11/12,3900.0,3915.015,3950.0,274000,3950.0,3895.0
54,2014/11/13,3985.0,3959.169,3885.0,307600,3985.0,3880.0
55,2014/11/14,4000.0,4000.468,4045.0,258600,4055.0,3955.0
56,2014/11/17,3930.0,3932.488,3965.0,216000,3980.0,3900.0
57,2014/11/18,4110.0,4092.511,4000.0,560800,4135.0,4000.0
58,2014/11/19,4090.0,4086.573,4110.0,295700,4135.0,4050.0
59,2014/11/20,4100.0,4102.615,4120.0,386500,4130.0,4085.0
60,2014/11/21,4050.0,4045.929,4090.0,537300,4090.0,4020.0
61,2014/11/25,4065.0,4056.971,4085.0,343300,4100.0,4015.0
62,2014/11/26,4060.0,4043.694,4000.0,373000,4080.0,3990.0
63,2014/11/27,4055.0,4056.61,4060.0,335100,4080.0,4030.0
64,2014/11/28,4020.0,4028.288,4085.0,509900,4090.0,4005.0
65,2014/12/01,4095.0,4096.517,4075.0,287700,4140.0,4065.0
66,2014/12/02,4110.0,4090.02,4065.0,245900,4110.0,4055.0
67,2014/12/03,4130.0,4139.468,4180.0,338400,4190.0,4100.0
68,2014/12/04,4105.0,4109.251,4145.0,249700,4145.0,4090.0
69,2014/12/05,4085.0,4081.688,4120.0,206200,4120.0,4055.0
70,2014/12/08,4090.0,4079.159,4115.0,309800,4120.0,4055.0
71,2014/12/09,4130.0,4106.739,4055.0,248700,4130.0,4050.0
72,2014/12/10,4035.0,4067.842,4100.0,358000,4140.0,4015.0
73,2014/12/11,4000.0,4005.593,3995.0,407100,4050.0,3960.0
74,2014/12/12,3875.0,3913.737,3930.0,784400,3955.0,3870.0
75,2014/12/15,3860.0,3858.456,3835.0,405200,3895.0,3835.0
76,2014/12/16,3760.0,3771.256,3800.0,437000,3830.0,3735.0
77,2014/12/17,3795.0,3791.593,3750.0,490900,3815.0,3750.0
78,2014/12/18,3840.0,3847.479,3865.0,364700,3905.0,3820.0
79,2014/12/19,3875.0,3877.98,3935.0,353400,3945.0,3850.0
80,2014/12/22,3905.0,3900.847,3925.0,237400,3935.0,3880.0
81,2014/12/24,3935.0,3924.026,3970.0,265300,3970.0,3880.0
82,2014/12/25,3935.0,3936.068,3945.0,155000,3965.0,3915.0
83,2014/12/26,3920.0,3925.865,3960.0,126000,3960.0,3900.0
84,2014/12/29,3895.0,3888.588,3925.0,185500,3930.0,3855.0
85,2014/12/30,3900.0,3909.619,3910.0,218100,3945.0,3855.0
86,2015/01/05,3905.0,3896.282,3860.0,243000,3925.0,3845.0
87,2015/01/06,3810.0,3810.264,3795.0,529500,3825.0,3770.0
88,2015/01/07,3825.0,3823.555,3790.0,405400,3855.0,3785.0
89,2015/01/08,3835.0,3843.91,3845.0,447500,3910.0,3815.0
90,2015/01/09,3810.0,3807.875,3850.0,330400,3870.0,3780.0
91,2015/01/13,3880.0,3846.409,3780.0,308000,3880.0,3775.0
92,2015/01/14,3905.0,3901.064,3880.0,262200,3930.0,3875.0
93,2015/01/15,3975.0,3965.567,3935.0,285600,3990.0,3930.0
94,2015/01/16,3905.0,3892.764,3905.0,382000,3935.0,3845.0
95,2015/01/19,3945.0,3933.957,3950.0,226200,3955.0,3895.0
96,2015/01/20,4010.0,3981.242,3930.0,211700,4010.0,3920.0
97,2015/01/21,3990.0,3974.093,3990.0,428200,3995.0,3940.0
98,2015/01/22,3950.0,3948.747,3985.0,235800,4000.0,3910.0
99,2015/01/23,3930.0,3936.357,4000.0,227000,4000.0,3915.0
100,2015/01/26,3910.0,3905.957,3870.0,207900,3930.0,3865.0
101,2015/01/27,4125.0,4061.183,3975.0,707300,4135.0,3965.0
102,2015/01/28,4270.0,4213.609,4095.0,540200,4290.0,4085.0
103,2015/01/29,4210.0,4220.479,4205.0,346400,4275.0,4160.0
104,2015/01/30,4175.0,4236.834,4240.0,573100,4315.0,4170.0
105,2015/02/02,4000.0,4003.653,3930.0,567000,4070.0,3925.0
106,2015/02/03,3915.0,3941.713,3995.0,524100,4010.0,3900.0
107,2015/02/04,3975.0,4000.265,3955.0,550200,4060.0,3945.0
108,2015/02/05,3915.0,3946.858,3975.0,324200,4015.0,3910.0
109,2015/02/06,3960.0,3959.654,3985.0,352500,4000.0,3935.0
110,2015/02/09,4045.0,4025.446,4030.0,321700,4050.0,3985.0
111,2015/02/10,4075.0,4080.701,4085.0,432300,4190.0,4020.0
112,2015/02/12,4105.0,4106.6,4115.0,374400,4145.0,4080.0
113,2015/02/13,4040.0,4068.73,4100.0,266100,4105.0,4035.0
114,2015/02/16,4020.0,4026.429,4060.0,222500,4075.0,4000.0
115,2015/02/17,4125.0,4117.103,4050.0,430400,4165.0,4050.0
116,2015/02/18,4200.0,4198.851,4145.0,355800,4230.0,4145.0
117,2015/02/19,4220.0,4209.21,4200.0,230500,4225.0,4180.0
118,2015/02/20,4275.0,4282.575,4245.0,306600,4315.0,4215.0
119,2015/02/23,4295.0,4316.038,4345.0,239500,4400.0,4285.0
120,2015/02/24,4190.0,4198.617,4255.0,430600,4255.0,4160.0
121,2015/02/25,4230.0,4221.376,4230.0,295800,4235.0,4200.0
122,2015/02/26,4285.0,4263.548,4245.0,258900,4295.0,4215.0
123,2015/02/27,4270.0,4297.353,4310.0,365500,4365.0,4255.0
124,2015/03/02,4275.0,4283.615,4265.0,177300,4310.0,4260.0
125,2015/03/03,4275.0,4271.721,4310.0,221700,4310.0,4255.0
126,2015/03/04,4350.0,4342.318,4290.0,244800,4385.0,4290.0
127,2015/03/05,4370.0,4361.877,4375.0,237100,4385.0,4335.0
128,2015/03/06,4445.0,4415.639,4375.0,283200,4445.0,4345.0
129,2015/03/09,4400.0,4417.969,4435.0,259500,4450.0,4390.0
130,2015/03/10,4365.0,4392.748,4450.0,270700,4450.0,4360.0
131,2015/03/11,4335.0,4342.255,4325.0,289100,4380.0,4320.0
132,2015/03/12,4375.0,4364.516,4335.0,247900,4395.0,4300.0
133,2015/03/13,4415.0,4392.822,4380.0,529700,4430.0,4360.0
134,2015/03/16,4500.0,4504.219,4435.0,295300,4555.0,4435.0
135,2015/03/17,4510.0,4510.854,4545.0,178500,4545.0,4475.0
136,2015/03/18,4670.0,4631.506,4550.0,347600,4685.0,4545.0
137,2015/03/19,4610.0,4606.392,4630.0,269700,4680.0,4570.0
138,2015/03/20,4630.0,4638.125,4655.0,280600,4690.0,4615.0
139,2015/03/23,4670.0,4666.154,4665.0,129100,4680.0,4650.0
140,2015/03/24,4560.0,4582.685,4645.0,390900,4650.0,4555.0
141,2015/03/25,4555.0,4543.654,4555.0,341000,4585.0,4505.0
142,2015/03/26,4360.0,4395.617,4545.0,631900,4545.0,4340.0
143,2015/03/27,4315.0,4332.916,4360.0,624600,4400.0,4275.0
144,2015/03/30,4355.0,4379.644,4360.0,397900,4425.0,4350.0
145,2015/03/31,4230.0,4289.377,4425.0,492000,4425.0,4230.0
146,2015/04/01,4195.0,4214.345,4215.0,601600,4260.0,4165.0
147,2015/04/02,4180.0,4180.972,4140.0,487300,4220.0,4140.0
148,2015/04/03,4265.0,4246.475,4205.0,212600,4270.0,4195.0
149,2015/04/06,4245.0,4243.96,4235.0,165900,4280.0,4220.0
150,2015/04/07,4240.0,4248.667,4270.0,263600,4280.0,4225.0
151,2015/04/08,4255.0,4249.265,4240.0,289900,4290.0,4220.0
152,2015/04/09,4290.0,4275.157,4295.0,270600,4315.0,4240.0
153,2015/04/10,4255.0,4262.537,4295.0,270600,4305.0,4245.0
154,2015/04/13,4185.0,4194.792,4235.0,249400,4275.0,4170.0
155,2015/04/14,4190.0,4195.974,4200.0,191400,4240.0,4175.0
156,2015/04/15,4155.0,4167.403,4140.0,264500,4195.0,4140.0
157,2015/04/16,4190.0,4173.305,4170.0,358500,4210.0,4130.0
158,2015/04/17,4115.0,4137.63,4135.0,211400,4175.0,4115.0
159,2015/04/20,4105.0,4106.513,4105.0,337700,4155.0,4055.0
160,2015/04/21,4235.0,4201.003,4100.0,276800,4235.0,4100.0
161,2015/04/22,4165.0,4161.234,4215.0,343600,4220.0,4125.0
162,2015/04/23,4215.0,4215.015,4175.0,265800,4245.0,4165.0
163,2015/04/24,4220.0,4210.749,4190.0,222200,4240.0,4170.0
164,2015/04/27,4235.0,4237.67,4250.0,170400,4275.0,4220.0
165,2015/04/28,4250.0,4255.275,4275.0,192900,4280.0,4240.0
166,2015/04/30,4190.0,4181.532,4200.0,458600,4235.0,4145.0
167,2015/05/01,4170.0,4160.846,4140.0,203800,4190.0,4140.0
168,2015/05/07,4210.0,4204.526,4180.0,324000,4245.0,4165.0
169,2015/05/08,4220.0,4210.974,4210.0,273500,4240.0,4160.0
170,2015/05/11,4210.0,4228.07,4280.0,192000,4285.0,4200.0
171,2015/05/12,4195.0,4216.043,4210.0,200800,4255.0,4195.0
172,2015/05/13,4205.0,4172.842,4160.0,265100,4220.0,4110.0
173,2015/05/14,4075.0,4097.782,4155.0,434700,4200.0,4050.0
174,2015/05/15,4010.0,4051.637,4100.0,735100,4180.0,3965.0
175,2015/05/18,4245.0,4164.373,3940.0,686500,4255.0,3940.0
176,2015/05/19,4255.0,4239.409,4220.0,372900,4280.0,4170.0
177,2015/05/20,4300.0,4307.546,4280.0,403200,4335.0,4260.0
178,2015/05/21,4445.0,4449.311,4350.0,575800,4505.0,4350.0
179,2015/05/22,4380.0,4374.781,4410.0,451000,4415.0,4320.0
180,2015/05/25,4370.0,4370.332,4405.0,249900,4415.0,4335.0
181,2015/05/26,4360.0,4357.99,4395.0,134600,4415.0,4335.0
182,2015/05/27,4370.0,4360.109,4375.0,251900,4385.0,4335.0
183,2015/05/28,4305.0,4308.956,4380.0,352800,4380.0,4280.0
184,2015/05/29,4315.0,4329.758,4295.0,399400,4390.0,4295.0
185,2015/06/01,4290.0,4263.851,4205.0,299900,4300.0,4200.0
186,2015/06/02,4330.0,4318.817,4290.0,220200,4345.0,4270.0
187,2015/06/03,4195.0,4203.862,4245.0,585800,4255.0,4175.0
188,2015/06/04,4150.0,4156.757,4220.0,374800,4220.0,4130.0
189,2015/06/05,4195.0,4179.356,4140.0,250100,4195.0,4135.0
190,2015/06/08,4095.0,4111.424,4175.0,519100,4180.0,4085.0
191,2015/06/09,4095.0,4104.813,4060.0,405300,4140.0,4050.0
192,2015/06/10,4040.0,4059.033,4070.0,376000,4080.0,4040.0
193,2015/06/11,4090.0,4102.097,4045.0,311600,4135.0,4045.0
194,2015/06/12,4125.0,4090.279,4070.0,609000,4145.0,4045.0
195,2015/06/15,4100.0,4092.983,4065.0,259100,4120.0,4060.0
196,2015/06/16,4210.0,4211.252,4115.0,765800,4275.0,4110.0
197,2015/06/17,4210.0,4220.915,4200.0,316000,4265.0,4185.0
198,2015/06/18,4150.0,4157.868,4175.0,308400,4180.0,4140.0
199,2015/06/19,4295.0,4321.128,4285.0,753700,4375.0,4245.0
200,2015/06/22,4365.0,4347.377,4295.0,442500,4385.0,4295.0
201,2015/06/23,4455.0,4427.758,4395.0,411400,4455.0,4385.0
202,2015/06/24,4440.0,4443.117,4450.0,406200,4465.0,4380.0
203,2015/06/25,4410.0,4426.929,4400.0,265900,4465.0,4395.0
204,2015/06/26,4465.0,4459.431,4425.0,226600,4485.0,4395.0
205,2015/06/29,4400.0,4409.197,4350.0,331200,4445.0,4325.0
206,2015/06/30,4465.0,4468.046,4415.0,567500,4495.0,4415.0
207,2015/07/01,4465.0,4453.167,4480.0,255000,4480.0,4415.0
208,2015/07/02,4480.0,4473.031,4470.0,243000,4490.0,4455.0
209,2015/07/03,4460.0,4466.552,4470.0,279400,4495.0,4445.0
210,2015/07/06,4420.0,4422.187,4400.0,222000,4455.0,4365.0
211,2015/07/07,4455.0,4472.774,4455.0,287700,4500.0,4440.0
212,2015/07/08,4365.0,4401.594,4420.0,287000,4470.0,4365.0
213,2015/07/09,4335.0,4288.646,4255.0,397400,4355.0,4240.0
214,2015/07/10,4400.0,4410.643,4370.0,356000,4470.0,4335.0
215,2015/07/13,4545.0,4509.017,4435.0,229900,4550.0,4405.0
216,2015/07/14,4585.0,4585.09,4640.0,266400,4640.0,4545.0
217,2015/07/15,4535.0,4530.032,4580.0,379200,4590.0,4495.0
218,2015/07/16,4555.0,4565.195,4570.0,267000,4605.0,4540.0
219,2015/07/17,4540.0,4534.047,4520.0,206200,4580.0,4505.0
220,2015/07/21,4600.0,4595.794,4585.0,270300,4645.0,4540.0
221,2015/07/22,4560.0,4559.888,4530.0,218900,4600.0,4505.0
222,2015/07/23,4635.0,4626.053,4590.0,184700,4645.0,4580.0
223,2015/07/24,4585.0,4578.286,4610.0,190800,4610.0,4525.0
224,2015/07/27,4475.0,4492.835,4515.0,372800,4570.0,4445.0
225,2015/07/28,4590.0,4539.581,4425.0,469600,4610.0,4420.0
226,2015/07/29,4610.0,4613.894,4585.0,326700,4670.0,4560.0
227,2015/07/30,4455.0,4498.884,4605.0,408900,4615.0,4440.0
228,2015/07/31,4690.0,4641.837,4510.0,631300,4725.0,4475.0
229,2015/08/03,4815.0,4744.789,4620.0,503300,4835.0,4555.0
230,2015/08/04,4900.0,4883.711,4795.0,436500,4920.0,4785.0
231,2015/08/05,4900.0,4910.742,4855.0,423800,4985.0,4840.0
232,2015/08/06,4860.0,4886.319,4850.0,467300,4955.0,4815.0
233,2015/08/07,4800.0,4790.526,4850.0,295500,4870.0,4745.0
234,2015/08/10,4830.0,4802.035,4795.0,275400,4835.0,4725.0
235,2015/08/11,4725.0,4740.411,4785.0,326100,4810.0,4700.0
236,2015/08/12,4700.0,4705.897,4715.0,270500,4770.0,4660.0
237,2015/08/13,4740.0,4730.781,4695.0,233700,4785.0,4675.0
238,2015/08/14,4690.0,4697.136,4700.0,415900,4720.0,4670.0
239,2015/08/17,4930.0,4918.079,4785.0,563300,4990.0,4775.0
240,2015/08/18,4940.0,4955.467,4905.0,397300,5020.0,4880.0
241,2015/08/19,4765.0,4798.513,4830.0,455700,4845.0,4760.0
242,2015/08/20,4730.0,4759.75,4745.0,345900,4830.0,4710.0
243,2015/08/21,4570.0,4614.182,4645.0,339900,4695.0,4570.0
244,2015/08/24,4430.0,4483.131,4460.0,708500,4575.0,4425.0
245,2015/08/25,4305.0,4379.026,4320.0,594900,4485.0,4300.0
246,2015/08/26,4295.0,4295.609,4280.0,691100,4350.0,4255.0
247,2015/08/27,4415.0,4426.199,4345.0,366700,4525.0,4330.0
248,2015/08/28,4455.0,4456.764,4510.0,376500,4530.0,4410.0
249,2015/08/31,4550.0,4545.074,4525.0,585500,4590.0,4485.0
250,2015/09/01,4380.0,4474.171,4560.0,540200,4580.0,4375.0
251,2015/09/02,4345.0,4370.621,4310.0,488300,4440.0,4295.0
252,2015/09/03,4405.0,4430.923,4375.0,334300,4485.0,4340.0
253,2015/09/04,4440.0,4417.852,4470.0,591800,4470.0,4355.0
254,2015/09/07,4385.0,4387.797,4420.0,377000,4425.0,4345.0
255,2015/09/08,4265.0,4336.118,4405.0,399700,4455.0,4255.0
256,2015/09/09,4605.0,4504.039,4430.0,579900,4620.0,4390.0
257,2015/09/10,4525.0,4519.13,4535.0,465100,4570.0,4445.0
258,2015/09/11,4420.0,4435.678,4425.0,675200,4505.0,4405.0
259,2015/09/14,4335.0,4366.833,4365.0,499500,4460.0,4325.0
260,2015/09/15,4380.0,4410.048,4375.0,488600,4465.0,4370.0
261,2015/09/16,4335.0,4330.179,4410.0,416900,4420.0,4290.0
262,2015/09/17,4460.0,4448.132,4425.0,405000,4475.0,4400.0
263,2015/09/18,4300.0,4327.403,4395.0,558400,4415.0,4300.0
264,2015/09/24,4350.0,4412.786,4295.0,598800,4520.0,4280.0
265,2015/09/25,4475.0,4442.85,4355.0,427200,4485.0,4350.0
266,2015/09/28,4485.0,4473.066,4515.0,293400,4535.0,4440.0
267,2015/09/29,4410.0,4434.506,4415.0,572500,4500.0,4385.0
268,2015/09/30,4520.0,4507.7,4480.0,577700,4545.0,4455.0
269,2015/10/01,4500.0,4506.923,4550.0,349900,4550.0,4465.0
270,2015/10/02,4465.0,4466.64,4445.0,327500,4550.0,4425.0
271,2015/10/05,4540.0,4498.445,4400.0,317000,4550.0,4400.0
272,2015/10/06,4500.0,4508.551,4545.0,424900,4560.0,4475.0
273,2015/10/07,4470.0,4445.59,4515.0,312100,4515.0,4375.0
274,2015/10/08,4335.0,4344.596,4370.0,440900,4395.0,4320.0
275,2015/10/09,4455.0,4409.667,4395.0,349300,4455.0,4355.0
276,2015/10/13,4525.0,4514.806,4450.0,482700,4540.0,4440.0
277,2015/10/14,4415.0,4425.117,4490.0,411700,4525.0,4380.0
278,2015/10/15,4370.0,4369.903,4390.0,369200,4460.0,4350.0
279,2015/10/16,4375.0,4374.426,4375.0,383000,4400.0,4340.0
280,2015/10/19,4385.0,4395.1,4385.0,190100,4435.0,4365.0
281,2015/10/20,4405.0,4408.028,4420.0,196000,4440.0,4375.0
282,2015/10/21,4405.0,4375.258,4370.0,248300,4415.0,4320.0
283,2015/10/22,4425.0,4427.383,4390.0,202500,4455.0,4360.0
284,2015/10/23,4500.0,4500.132,4500.0,329800,4525.0,4475.0
285,2015/10/26,4495.0,4498.804,4560.0,168100,4580.0,4475.0
286,2015/10/27,4545.0,4562.632,4545.0,327100,4605.0,4540.0
287,2015/10/28,4550.0,4536.348,4540.0,312000,4555.0,4500.0
288,2015/10/29,4515.0,4501.059,4530.0,975300,4545.0,4425.0
289,2015/10/30,4480.0,4512.254,4500.0,531400,4610.0,4455.0
290,2015/11/02,4265.0,4307.767,4430.0,512500,4470.0,4255.0
291,2015/11/04,4280.0,4292.991,4335.0,459400,4350.0,4270.0
292,2015/11/05,4325.0,4316.973,4315.0,303400,4340.0,4290.0
293,2015/11/06,4340.0,4349.682,4360.0,328400,4395.0,4315.0
294,2015/11/09,4300.0,4317.446,4390.0,509300,4400.0,4270.0
295,2015/11/10,4305.0,4295.643,4270.0,335300,4320.0,4260.0
296,2015/11/11,4405.0,4379.504,4305.0,451300,4420.0,4290.0
297,2015/11/12,4430.0,4433.297,4395.0,640800,4465.0,4375.0
298,2015/11/13,4445.0,4440.841,4400.0,431800,4465.0,4395.0
299,2015/11/16,4455.0,4438.663,4375.0,241600,4460.0,4370.0
300,2015/11/17,4470.0,4477.489,4495.0,291900,4495.0,4450.0
301,2015/11/18,4505.0,4512.42,4490.0,362200,4560.0,4470.0
302,2015/11/19,4540.0,4570.379,4575.0,418100,4635.0,4530.0
303,2015/11/20,4570.0,4533.453,4500.0,474200,4575.0,4455.0
304,2015/11/24,4605.0,4597.265,4595.0,438500,4635.0,4560.0
305,2015/11/25,4585.0,4569.114,4580.0,464500,4600.0,4525.0
306,2015/11/26,4585.0,4590.442,4590.0,296200,4620.0,4555.0
307,2015/11/27,4560.0,4583.508,4600.0,348400,4655.0,4545.0
308,2015/11/30,4400.0,4449.511,4595.0,1332800,4625.0,4400.0
309,2015/12/01,4425.0,4401.478,4445.0,563900,4470.0,4355.0
310,2015/12/02,4425.0,4426.976,4425.0,415500,4450.0,4410.0
311,2015/12/03,4435.0,4439.521,4430.0,220000,4455.0,4410.0
312,2015/12/04,4355.0,4349.118,4370.0,416700,4380.0,4310.0
313,2015/12/07,4370.0,4390.883,4400.0,278200,4420.0,4365.0
314,2015/12/08,4375.0,4376.656,4380.0,347300,4415.0,4345.0
315,2015/12/09,4320.0,4330.441,4370.0,518100,4400.0,4300.0
316,2015/12/10,4265.0,4279.402,4280.0,240700,4310.0,4260.0
317,2015/12/11,4255.0,4239.253,4210.0,464900,4300.0,4210.0
318,2015/12/14,4265.0,4245.088,4170.0,382500,4280.0,4170.0
319,2015/12/15,4170.0,4220.983,4260.0,372400,4295.0,4170.0
320,2015/12/16,4265.0,4247.987,4245.0,514400,4275.0,4190.0
321,2015/12/17,4315.0,4326.604,4325.0,505100,4350.0,4280.0
322,2015/12/18,4175.0,4223.497,4265.0,1017600,4275.0,4175.0
323,2015/12/21,4185.0,4158.319,4175.0,483900,4220.0,4105.0
324,2015/12/22,4190.0,4187.566,4195.0,380400,4210.0,4140.0
325,2015/12/24,4180.0,4191.647,4230.0,343600,4275.0,4160.0
326,2015/12/25,4165.0,4172.202,4200.0,146900,4220.0,4150.0
327,2015/12/28,4145.0,4138.029,4185.0,305200,4205.0,4100.0
328,2015/12/29,4235.0,4218.955,4160.0,294300,4240.0,4140.0
329,2015/12/30,4230.0,4236.129,4235.0,241000,4265.0,4210.0
330,2016/01/04,4090.0,4119.677,4160.0,416600,4195.0,4080.0
331,2016/01/05,4080.0,4088.722,4100.0,491700,4110.0,4035.0
332,2016/01/06,4085.0,4076.085,4085.0,314900,4120.0,4050.0
333,2016/01/07,4070.0,4110.981,4210.0,399300,4210.0,4065.0
334,2016/01/08,4045.0,4060.032,4025.0,315700,4120.0,4010.0
335,2016/01/12,3925.0,3962.986,3975.0,401900,4035.0,3925.0
336,2016/01/13,4015.0,4001.147,3995.0,286900,4025.0,3965.0
337,2016/01/14,3905.0,3906.055,3945.0,569500,3960.0,3860.0
338,2016/01/15,3975.0,3991.18,3990.0,395200,4055.0,3950.0
339,2016/01/18,3985.0,3961.68,3915.0,338600,3995.0,3905.0
340,2016/01/19,3915.0,3926.152,3985.0,352000,3995.0,3890.0
341,2016/01/20,3845.0,3883.363,3900.0,351200,3980.0,3835.0
342,2016/01/21,3730.0,3802.72,3850.0,341000,3885.0,3730.0
343,2016/01/22,3810.0,3766.255,3795.0,590800,3835.0,3705.0
344,2016/01/25,3935.0,3906.083,3880.0,509900,3955.0,3840.0
345,2016/01/26,3870.0,3891.44,3895.0,307300,3940.0,3860.0
346,2016/01/27,3955.0,3936.914,3940.0,241700,3965.0,3900.0
347,2016/01/28,3955.0,3967.967,3920.0,246900,4000.0,3920.0
348,2016/01/29,4135.0,4076.387,4005.0,431200,4160.0,3960.0
349,2016/02/01,4140.0,4138.125,4135.0,438500,4165.0,4095.0
350,2016/02/02,4335.0,4296.662,4105.0,673500,4345.0,4105.0
351,2016/02/03,4295.0,4276.516,4270.0,416900,4295.0,4220.0
352,2016/02/04,4210.0,4235.172,4275.0,323200,4295.0,4195.0
353,2016/02/05,4180.0,4158.005,4140.0,382000,4190.0,4080.0
354,2016/02/08,4260.0,4230.668,4115.0,538600,4290.0,4105.0
355,2016/02/09,4130.0,4129.238,4140.0,434300,4170.0,4065.0
356,2016/02/10,4090.0,4085.87,4140.0,681900,4180.0,4010.0
357,2016/02/12,3930.0,3950.145,4000.0,650600,4015.0,3865.0
358,2016/02/15,4315.0,4220.194,4070.0,978100,4345.0,3985.0
359,2016/02/16,4070.0,4124.877,4250.0,574800,4255.0,4060.0
360,2016/02/17,4065.0,4065.637,4060.0,435200,4135.0,4005.0
361,2016/02/18,4115.0,4118.403,4150.0,432900,4155.0,4090.0
362,2016/02/19,4115.0,4109.733,4125.0,303300,4170.0,4050.0
363,2016/02/22,4165.0,4153.857,4100.0,296200,4195.0,4085.0
364,2016/02/23,4145.0,4147.902,4175.0,487200,4220.0,4105.0
365,2016/02/24,4100.0,4105.451,4075.0,331600,4150.0,4070.0
366,2016/02/25,4150.0,4144.703,4125.0,275600,4175.0,4105.0
367,2016/02/26,4150.0,4163.926,4180.0,479100,4205.0,4135.0
368,2016/02/29,4045.0,4084.488,4150.0,392300,4190.0,4045.0
369,2016/03/01,4120.0,4099.104,4050.0,305100,4135.0,4040.0
370,2016/03/02,4195.0,4183.71,4180.0,590900,4225.0,4130.0
371,2016/03/03,4295.0,4280.381,4240.0,551900,4315.0,4235.0
372,2016/03/04,4350.0,4306.268,4250.0,414100,4350.0,4230.0
373,2016/03/07,4240.0,4259.264,4320.0,403500,4320.0,4220.0
374,2016/03/08,4180.0,4155.414,4170.0,529200,4215.0,4085.0
375,2016/03/09,4140.0,4151.121,4150.0,372400,4200.0,4120.0
376,2016/03/10,4255.0,4250.434,4195.0,410300,4290.0,4185.0
377,2016/03/11,4245.0,4216.856,4185.0,414800,4285.0,4160.0
378,2016/03/14,4270.0,4262.749,4275.0,211200,4310.0,4240.0
379,2016/03/15,4200.0,4205.057,4200.0,333100,4250.0,4170.0
380,2016/03/16,4210.0,4215.369,4165.0,210200,4250.0,4165.0
381,2016/03/17,4135.0,4159.155,4225.0,314900,4250.0,4115.0
382,2016/03/18,4055.0,4063.495,4100.0,449700,4110.0,4035.0
383,2016/03/22,4070.0,4071.081,4085.0,422500,4125.0,4030.0
384,2016/03/23,4120.0,4122.213,4085.0,252200,4140.0,4080.0
385,2016/03/24,4145.0,4153.202,4150.0,342400,4170.0,4115.0
386,2016/03/25,4135.0,4132.732,4120.0,244300,4155.0,4115.0
387,2016/03/28,4185.0,4157.578,4160.0,380800,4185.0,4120.0
388,2016/03/29,4180.0,4187.451,4180.0,289100,4215.0,4170.0
389,2016/03/30,4130.0,4160.738,4165.0,432000,4215.0,4125.0
390,2016/03/31,4040.0,4049.833,4140.0,434000,4150.0,4015.0
391,2016/04/01,3865.0,3890.568,3975.0,622600,3990.0,3855.0
392,2016/04/04,3945.0,3942.883,3905.0,379700,3985.0,3890.0
393,2016/04/05,3885.0,3896.056,3910.0,318700,3930.0,3870.0
394,2016/04/06,3865.0,3862.193,3885.0,298700,3885.0,3835.0
395,2016/04/07,3895.0,3880.569,3825.0,289300,3905.0,3815.0
396,2016/04/08,3905.0,3892.197,3825.0,348600,3950.0,3820.0
397,2016/04/11,3880.0,3887.392,3905.0,197100,3920.0,3865.0
398,2016/04/12,3860.0,3872.44,3885.0,228700,3920.0,3850.0
399,2016/04/13,3870.0,3873.404,3880.0,264100,3905.0,3845.0
400,2016/04/14,3940.0,3904.096,3875.0,320300,3940.0,3845.0
401,2016/04/15,3915.0,3922.045,3880.0,253600,3940.0,3870.0
402,2016/04/18,3820.0,3816.736,3835.0,402300,3860.0,3780.0
403,2016/04/19,3885.0,3890.327,3890.0,446800,3920.0,3860.0
404,2016/04/20,3915.0,3919.439,3940.0,273600,3950.0,3895.0
405,2016/04/21,4020.0,4015.907,4045.0,344400,4055.0,3985.0
406,2016/04/22,4025.0,4017.229,3995.0,315900,4040.0,3980.0
407,2016/04/25,3990.0,4001.24,4040.0,229800,4040.0,3980.0
408,2016/04/26,4025.0,4007.49,3970.0,266300,4035.0,3970.0
409,2016/04/27,4015.0,4020.842,4055.0,330100,4085.0,3975.0
410,2016/04/28,3900.0,3946.302,4040.0,294200,4080.0,3855.0
411,2016/05/02,3905.0,3870.617,3790.0,370600,3905.0,3790.0
412,2016/05/06,3890.0,3895.593,3895.0,255700,3955.0,3865.0
413,2016/05/09,3980.0,3969.131,3935.0,160500,3990.0,3925.0
414,2016/05/10,4050.0,4032.381,3985.0,235200,4060.0,3980.0
415,2016/05/11,4050.0,4056.203,4105.0,230300,4115.0,4025.0
416,2016/05/12,4090.0,4073.353,4010.0,234400,4100.0,4000.0
417,2016/05/13,4035.0,4056.151,4060.0,350100,4100.0,4015.0
418,2016/05/16,3970.0,3973.422,3925.0,251600,4030.0,3925.0
419,2016/05/17,4075.0,4053.358,3990.0,310300,4080.0,3970.0
420,2016/05/18,4090.0,4086.854,4075.0,296700,4120.0,4050.0
421,2016/05/19,4170.0,4156.317,4135.0,342100,4190.0,4125.0
422,2016/05/20,4270.0,4249.337,4190.0,585500,4285.0,4165.0
423,2016/05/23,4190.0,4199.199,4230.0,356900,4230.0,4170.0
424,2016/05/24,4205.0,4206.427,4195.0,272700,4245.0,4175.0
425,2016/05/25,4200.0,4209.802,4270.0,255200,4275.0,4190.0
426,2016/05/26,4255.0,4249.685,4250.0,355400,4275.0,4210.0
427,2016/05/27,4270.0,4280.119,4285.0,379500,4320.0,4260.0
428,2016/05/30,4310.0,4310.493,4340.0,404800,4375.0,4270.0
429,2016/05/31,4295.0,4302.758,4290.0,1737900,4345.0,4260.0
430,2016/06/01,4325.0,4337.373,4295.0,549400,4380.0,4285.0
431,2016/06/02,4225.0,4237.257,4280.0,342900,4290.0,4215.0
432,2016/06/03,4290.0,4272.285,4225.0,413600,4295.0,4215.0
433,2016/06/06,4345.0,4306.67,4280.0,386800,4345.0,4255.0
434,2016/06/07,4315.0,4309.403,4290.0,346000,4340.0,4260.0
435,2016/06/08,4295.0,4284.305,4315.0,339500,4320.0,4245.0
436,2016/06/09,4290.0,4289.222,4310.0,364300,4335.0,4255.0
437,2016/06/10,4320.0,4292.367,4290.0,455200,4320.0,4260.0
438,2016/06/13,4220.0,4228.623,4260.0,357000,4280.0,4210.0
439,2016/06/14,4220.0,4213.084,4200.0,318300,4255.0,4180.0
440,2016/06/15,4175.0,4202.397,4235.0,672500,4275.0,4155.0
441,2016/06/16,4095.0,4105.109,4170.0,464600,4180.0,4065.0
442,2016/06/17,4065.0,4087.779,4155.0,568800,4175.0,4050.0
443,2016/06/20,4115.0,4107.189,4150.0,433100,4150.0,4085.0
444,2016/06/21,4265.0,4204.987,4145.0,523800,4270.0,4080.0
445,2016/06/22,4220.0,4222.319,4240.0,377100,4255.0,4190.0
446,2016/06/23,4175.0,4177.129,4225.0,284400,4235.0,4155.0
447,2016/06/24,3940.0,4009.853,4165.0,438100,4190.0,3905.0
448,2016/06/27,4070.0,4054.37,3995.0,458900,4100.0,3985.0
449,2016/06/28,4205.0,4178.941,4045.0,444700,4225.0,4040.0
450,2016/06/29,4170.0,4163.712,4185.0,375500,4215.0,4125.0
451,2016/06/30,4140.0,4168.362,4255.0,468300,4275.0,4140.0
452,2016/07/01,4225.0,4199.907,4190.0,387200,4225.0,4155.0
453,2016/07/04,4300.0,4271.948,4190.0,430300,4305.0,4185.0
454,2016/07/05,4305.0,4291.535,4305.0,256000,4330.0,4260.0
455,2016/07/06,4265.0,4228.311,4200.0,348200,4270.0,4145.0
456,2016/07/07,4225.0,4238.905,4220.0,345100,4275.0,4220.0
457,2016/07/08,4165.0,4198.064,4240.0,376200,4255.0,4165.0
458,2016/07/11,4245.0,4250.729,4235.0,377500,4280.0,4215.0
459,2016/07/12,4195.0,4214.315,4295.0,442900,4300.0,4190.0
460,2016/07/13,4270.0,4260.58,4265.0,432100,4285.0,4200.0
461,2016/07/14,4325.0,4308.115,4300.0,438800,4330.0,4270.0
462,2016/07/15,4260.0,4268.724,4320.0,373000,4320.0,4240.0
463,2016/07/19,4365.0,4328.222,4300.0,311300,4365.0,4265.0
464,2016/07/20,4435.0,4413.582,4360.0,438900,4440.0,4355.0
465,2016/07/21,4400.0,4415.835,4460.0,323300,4475.0,4380.0
466,2016/07/22,4400.0,4385.9,4390.0,253300,4450.0,4350.0
467,2016/07/25,4365.0,4382.176,4415.0,234200,4435.0,4355.0
468,2016/07/26,4410.0,4417.628,4365.0,384400,4450.0,4360.0
469,2016/07/27,4360.0,4387.535,4450.0,474600,4465.0,4350.0
470,2016/07/28,4335.0,4332.692,4325.0,452500,4375.0,4310.0
471,2016/07/29,4580.0,4520.467,4370.0,975000,4615.0,4330.0
472,2016/08/01,4435.0,4459.736,4485.0,603900,4525.0,4410.0
473,2016/08/02,4430.0,4442.948,4425.0,409400,4480.0,4410.0
474,2016/08/03,4270.0,4296.93,4330.0,352900,4350.0,4270.0
475,2016/08/04,4120.0,4147.588,4255.0,482900,4275.0,4100.0
476,2016/08/05,4110.0,4124.857,4130.0,297000,4195.0,4105.0
477,2016/08/08,4085.0,4076.756,4120.0,371800,4135.0,4035.0
478,2016/08/09,4205.0,4177.785,4120.0,333700,4210.0,4115.0
479,2016/08/10,4180.0,4174.99,4145.0,286500,4210.0,4130.0
480,2016/08/12,4240.0,4241.796,4240.0,309000,4280.0,4195.0
481,2016/08/15,4255.0,4252.552,4235.0,187500,4275.0,4215.0
482,2016/08/16,4250.0,4241.296,4245.0,305100,4260.0,4195.0
483,2016/08/17,4225.0,4226.122,4250.0,302600,4265.0,4200.0
484,2016/08/18,4185.0,4212.931,4260.0,300400,4275.0,4185.0
485,2016/08/19,4150.0,4132.494,4190.0,283700,4190.0,4080.0
486,2016/08/22,4160.0,4151.141,4175.0,340900,4185.0,4115.0
487,2016/08/23,4175.0,4161.357,4095.0,373200,4180.0,4095.0
488,2016/08/24,4190.0,4179.217,4125.0,299000,4215.0,4100.0
489,2016/08/25,4235.0,4243.896,4235.0,449200,4275.0,4220.0
490,2016/08/26,4215.0,4234.425,4280.0,283500,4280.0,4215.0
491,2016/08/29,4240.0,4254.177,4310.0,289100,4330.0,4225.0
492,2016/08/30,4210.0,4229.28,4250.0,239600,4265.0,4205.0
493,2016/08/31,4235.0,4226.548,4250.0,391400,4255.0,4205.0
494,2016/09/01,4285.0,4269.16,4280.0,271500,4320.0,4240.0
495,2016/09/02,4280.0,4296.967,4280.0,260600,4345.0,4270.0
496,2016/09/05,4280.0,4278.822,4330.0,221600,4330.0,4250.0
497,2016/09/06,4390.0,4377.026,4300.0,356200,4425.0,4300.0
498,2016/09/07,4405.0,4402.257,4405.0,343200,4430.0,4370.0
499,2016/09/08,4400.0,4389.007,4385.0,294400,4415.0,4360.0
500,2016/09/09,4345.0,4365.164,4400.0,325900,4405.0,4325.0
501,2016/09/12,4295.0,4285.626,4285.0,286600,4305.0,4245.0
502,2016/09/13,4310.0,4312.408,4320.0,310600,4350.0,4285.0
503,2016/09/14,4305.0,4315.287,4335.0,241800,4365.0,4295.0
504,2016/09/15,4255.0,4257.566,4270.0,267200,4280.0,4240.0
505,2016/09/16,4305.0,4295.451,4275.0,234200,4320.0,4255.0
506,2016/09/20,4335.0,4309.955,4295.0,362300,4335.0,4255.0
507,2016/09/21,4400.0,4348.974,4275.0,393400,4405.0,4260.0
508,2016/09/23,4390.0,4373.9,4380.0,327300,4390.0,4315.0
509,2016/09/26,4360.0,4370.294,4370.0,244700,4415.0,4340.0
510,2016/09/27,4475.0,4425.366,4325.0,343400,4475.0,4320.0
511,2016/09/28,4400.0,4384.52,4415.0,385700,4435.0,4350.0
512,2016/09/29,4370.0,4357.226,4380.0,285700,4380.0,4315.0
513,2016/09/30,4270.0,4288.489,4245.0,451900,4330.0,4245.0
514,2016/10/03,4375.0,4369.452,4310.0,269300,4405.0,4310.0
515,2016/10/04,4365.0,4365.857,4395.0,232200,4400.0,4350.0
516,2016/10/05,4350.0,4361.837,4385.0,258300,4390.0,4335.0
517,2016/10/06,4420.0,4411.603,4360.0,344000,4460.0,4345.0
518,2016/10/07,4350.0,4369.191,4385.0,306600,4410.0,4340.0
519,2016/10/11,4385.0,4382.009,4350.0,270500,4415.0,4340.0
520,2016/10/12,4360.0,4378.33,4375.0,329900,4415.0,4355.0
521,2016/10/13,4355.0,4345.018,4370.0,338800,4370.0,4325.0
522,2016/10/14,4345.0,4353.334,4365.0,163300,4390.0,4335.0
523,2016/10/17,4360.0,4350.376,4355.0,274000,4375.0,4315.0
524,2016/10/18,4345.0,4340.406,4310.0,246300,4365.0,4310.0
525,2016/10/19,4385.0,4378.807,4365.0,281100,4400.0,4350.0
526,2016/10/20,4405.0,4398.471,4400.0,184800,4415.0,4375.0
527,2016/10/21,4350.0,4356.715,4405.0,212200,4410.0,4330.0
528,2016/10/24,4380.0,4366.933,4330.0,254000,4395.0,4320.0
529,2016/10/25,4380.0,4385.915,4400.0,186400,4405.0,4375.0
530,2016/10/26,4390.0,4392.224,4375.0,221900,4415.0,4355.0
531,2016/10/27,4395.0,4402.566,4400.0,164100,4435.0,4375.0
532,2016/10/28,4410.0,4408.109,4400.0,415600,4435.0,4380.0
533,2016/10/31,4255.0,4303.165,4375.0,503000,4395.0,4255.0
534,2016/11/01,4220.0,4198.253,4230.0,472600,4245.0,4155.0
535,2016/11/02,4200.0,4189.203,4210.0,272100,4215.0,4170.0
536,2016/11/04,4115.0,4112.675,4150.0,357200,4150.0,4085.0
537,2016/11/07,4140.0,4143.351,4200.0,278600,4200.0,4105.0
538,2016/11/08,4140.0,4133.338,4165.0,210600,4165.0,4105.0
539,2016/11/09,3960.0,4018.486,4160.0,486800,4190.0,3925.0
540,2016/11/10,3950.0,3977.929,4150.0,749000,4160.0,3925.0
541,2016/11/11,3910.0,3932.884,4000.0,412800,4000.0,3895.0
542,2016/11/14,3925.0,3927.27,3965.0,264600,3965.0,3905.0
543,2016/11/15,3905.0,3881.785,3855.0,478400,3915.0,3835.0
544,2016/11/16,3940.0,3944.165,3950.0,455900,3975.0,3905.0
545,2016/11/17,3965.0,3965.448,3965.0,312500,3995.0,3940.0
546,2016/11/18,3945.0,3949.69,3985.0,337400,3985.0,3920.0
547,2016/11/21,4005.0,3998.05,3960.0,241800,4020.0,3960.0
548,2016/11/22,3975.0,3981.821,4005.0,437600,4025.0,3950.0
549,2016/11/24,3955.0,3963.901,4020.0,442200,4020.0,3945.0
550,2016/11/25,3960.0,3953.344,3960.0,291100,3970.0,3925.0
551,2016/11/28,3975.0,3973.068,3980.0,276700,3990.0,3950.0
552,2016/11/29,4010.0,3997.443,4000.0,248100,4010.0,3970.0
553,2016/11/30,4050.0,4043.328,4050.0,632400,4065.0,4025.0
554,2016/12/01,4040.0,4063.22,4100.0,445700,4110.0,4020.0
555,2016/12/02,3970.0,3982.394,3995.0,507700,4025.0,3955.0
556,2016/12/05,3955.0,3952.939,3970.0,317600,3990.0,3930.0
557,2016/12/06,3940.0,3952.762,3965.0,420000,3985.0,3935.0
558,2016/12/07,3970.0,3960.421,3960.0,266100,3980.0,3930.0
559,2016/12/08,4050.0,4035.171,4020.0,432900,4050.0,4000.0
560,2016/12/09,3985.0,4001.285,4000.0,506900,4055.0,3980.0
561,2016/12/12,4155.0,4114.953,4030.0,382400,4155.0,4010.0
562,2016/12/13,4185.0,4192.445,4150.0,415000,4225.0,4145.0
563,2016/12/14,4115.0,4129.609,4115.0,397800,4175.0,4110.0
564,2016/12/15,4085.0,4081.132,4115.0,564800,4120.0,4050.0
565,2016/12/16,4100.0,4105.725,4125.0,302100,4140.0,4085.0
566,2016/12/19,4155.0,4137.803,4075.0,421900,4165.0,4070.0
567,2016/12/20,4220.0,4220.404,4165.0,397200,4235.0,4155.0
568,2016/12/21,4195.0,4231.856,4235.0,390900,4260.0,4190.0
569,2016/12/22,4145.0,4155.236,4200.0,368100,4215.0,4130.0
570,2016/12/26,4175.0,4173.377,4155.0,227900,4190.0,4150.0
571,2016/12/27,4195.0,4209.149,4190.0,231000,4230.0,4185.0
572,2016/12/28,4175.0,4172.432,4175.0,169400,4190.0,4150.0
573,2016/12/29,4195.0,4190.178,4175.0,263900,4205.0,4160.0
574,2016/12/30,4235.0,4226.301,4190.0,236400,4250.0,4185.0
575,2017/01/04,4210.0,4204.194,4215.0,533600,4225.0,4180.0
576,2017/01/05,4140.0,4140.761,4150.0,561400,4160.0,4130.0
577,2017/01/06,4180.0,4161.369,4130.0,322800,4190.0,4125.0
578,2017/01/10,4155.0,4170.33,4185.0,427700,4205.0,4140.0
579,2017/01/11,4130.0,4138.047,4160.0,314900,4165.0,4120.0
580,2017/01/12,4050.0,4061.156,4140.0,434600,4140.0,4030.0
581,2017/01/13,4095.0,4094.036,4050.0,349500,4120.0,4050.0
582,2017/01/16,4070.0,4074.814,4090.0,301000,4100.0,4055.0
583,2017/01/17,3985.0,4005.682,4050.0,365100,4050.0,3985.0
584,2017/01/18,3995.0,3990.721,4000.0,232400,4030.0,3970.0
585,2017/01/19,4030.0,4030.599,3995.0,261300,4055.0,3995.0
586,2017/01/20,4055.0,4060.748,4050.0,330800,4085.0,4030.0
587,2017/01/23,3955.0,3983.762,4055.0,434900,4060.0,3955.0
588,2017/01/24,3975.0,3982.708,3955.0,305900,4010.0,3955.0
589,2017/01/25,3985.0,3992.254,4005.0,284400,4030.0,3970.0
590,2017/01/26,4020.0,4010.527,4005.0,292000,4030.0,3980.0
591,2017/01/27,3975.0,3984.551,3980.0,511600,4030.0,3960.0
592,2017/01/30,4000.0,3976.271,3970.0,351300,4000.0,3945.0
593,2017/01/31,4030.0,4041.875,3975.0,883100,4100.0,3975.0
594,2017/02/01,4045.0,4068.92,4115.0,515800,4145.0,4020.0
595,2017/02/02,3970.0,3978.008,3980.0,553500,3995.0,3965.0
596,2017/02/03,3990.0,3998.408,3975.0,355600,4030.0,3970.0
597,2017/02/06,4000.0,4001.705,4020.0,304700,4030.0,3980.0
598,2017/02/07,3960.0,3959.819,3975.0,340000,3990.0,3940.0
599,2017/02/08,3920.0,3922.327,3965.0,380800,3970.0,3900.0
600,2017/02/09,3905.0,3895.569,3915.0,460300,3930.0,3880.0
601,2017/02/10,3940.0,3939.574,3945.0,304300,3960.0,3915.0
602,2017/02/13,3975.0,3977.13,3965.0,361500,3995.0,3955.0
603,2017/02/14,3915.0,3937.834,3975.0,351600,3980.0,3915.0
604,2017/02/15,3955.0,3955.138,3950.0,311800,3975.0,3940.0
605,2017/02/16,3940.0,3934.365,3955.0,262200,3965.0,3920.0
606,2017/02/17,3950.0,3936.648,3925.0,374800,3955.0,3900.0
607,2017/02/20,3980.0,3964.93,3960.0,298600,3985.0,3930.0
608,2017/02/21,3985.0,3986.999,3980.0,354200,4005.0,3975.0
609,2017/02/22,4015.0,4000.116,3990.0,462500,4015.0,3975.0
610,2017/02/23,4055.0,4053.784,4030.0,507000,4075.0,4025.0
611,2017/02/24,4095.0,4097.846,4055.0,459000,4140.0,4050.0
612,2017/02/27,4105.0,4103.265,4065.0,390700,4120.0,4055.0
613,2017/02/28,4120.0,4133.516,4115.0,536400,4150.0,4100.0
614,2017/03/01,4145.0,4143.562,4135.0,374900,4160.0,4120.0
615,2017/03/02,4170.0,4157.974,4175.0,324000,4175.0,4130.0
616,2017/03/03,4165.0,4171.484,4180.0,356800,4205.0,4140.0
617,2017/03/06,4160.0,4162.493,4170.0,183900,4175.0,4150.0
618,2017/03/07,4210.0,4204.406,4180.0,389500,4220.0,4180.0
619,2017/03/08,4180.0,4175.598,4190.0,291900,4205.0,4160.0
620,2017/03/09,4180.0,4185.116,4230.0,225100,4230.0,4165.0
621,2017/03/10,4275.0,4250.207,4240.0,580000,4275.0,4225.0
622,2017/03/13,4320.0,4318.175,4295.0,452700,4345.0,4270.0
623,2017/03/14,4365.0,4356.931,4345.0,383400,4375.0,4325.0
624,2017/03/15,4395.0,4387.782,4365.0,274400,4405.0,4355.0
625,2017/03/16,4345.0,4342.159,4375.0,385800,4375.0,4315.0
626,2017/03/17,4345.0,4326.033,4310.0,448100,4345.0,4270.0
627,2017/03/21,4345.0,4342.743,4315.0,364400,4365.0,4310.0
628,2017/03/22,4300.0,4315.391,4305.0,332500,4340.0,4295.0
629,2017/03/23,4360.0,4332.01,4290.0,338400,4360.0,4290.0
630,2017/03/24,4365.0,4360.081,4360.0,351500,4380.0,4340.0
631,2017/03/27,4315.0,4312.297,4320.0,355300,4345.0,4285.0
632,2017/03/28,4310.0,4292.796,4325.0,636700,4335.0,4240.0
633,2017/03/29,4340.0,4322.732,4310.0,713500,4375.0,4255.0
634,2017/03/30,4230.0,4250.148,4315.0,330700,4315.0,4215.0
635,2017/03/31,4145.0,4175.845,4255.0,502100,4265.0,4145.0
636,2017/04/03,4240.0,4219.725,4170.0,385400,4245.0,4160.0
637,2017/04/04,4210.0,4211.881,4205.0,420200,4240.0,4185.0
638,2017/04/05,4220.0,4232.906,4235.0,257600,4260.0,4205.0
639,2017/04/06,4155.0,4170.3,4205.0,305500,4235.0,4145.0
640,2017/04/07,4175.0,4180.771,4160.0,386300,4205.0,4145.0
641,2017/04/10,4155.0,4167.553,4210.0,313200,4235.0,4140.0
642,2017/04/11,4165.0,4159.169,4155.0,259900,4180.0,4140.0
643,2017/04/12,4160.0,4144.149,4110.0,279600,4170.0,4105.0
644,2017/04/13,4155.0,4153.79,4150.0,400800,4175.0,4130.0
645,2017/04/14,4145.0,4145.971,4175.0,329000,4180.0,4115.0
646,2017/04/17,4225.0,4208.961,4140.0,302300,4235.0,4135.0
647,2017/04/18,4210.0,4205.194,4230.0,235200,4235.0,4180.0
648,2017/04/19,4185.0,4185.884,4200.0,420100,4215.0,4155.0
649,2017/04/20,4125.0,4135.46,4175.0,348900,4175.0,4105.0
650,2017/04/21,4145.0,4135.534,4145.0,269500,4150.0,4110.0
651,2017/04/24,4190.0,4182.523,4180.0,232700,4200.0,4155.0
652,2017/04/25,4235.0,4222.468,4190.0,306100,4250.0,4180.0
653,2017/04/26,4245.0,4240.737,4245.0,288500,4265.0,4215.0
654,2017/04/27,4175.0,4177.516,4175.0,504000,4210.0,4160.0
655,2017/04/28,4180.0,4186.942,4185.0,258000,4205.0,4180.0
656,2017/05/01,4185.0,4179.388,4205.0,173200,4215.0,4165.0
657,2017/05/02,4220.0,4222.783,4215.0,303500,4245.0,4205.0
658,2017/05/08,4295.0,4277.83,4230.0,445300,4310.0,4225.0
659,2017/05/09,4310.0,4309.296,4300.0,374100,4325.0,4290.0
660,2017/05/10,4310.0,4298.808,4305.0,380000,4320.0,4270.0
661,2017/05/11,4305.0,4311.232,4325.0,287300,4345.0,4275.0
662,2017/05/12,4325.0,4320.999,4315.0,341300,4345.0,4300.0
663,2017/05/15,4390.0,4366.519,4310.0,374700,4395.0,4290.0
664,2017/05/16,4385.0,4391.896,4400.0,251300,4410.0,4380.0
665,2017/05/17,4345.0,4350.083,4330.0,409300,4380.0,4325.0
666,2017/05/18,4335.0,4334.459,4320.0,269100,4370.0,4320.0
667,2017/05/19,4330.0,4321.043,4325.0,250800,4345.0,4295.0
668,2017/05/22,4335.0,4333.704,4325.0,245000,4350.0,4315.0
669,2017/05/23,4340.0,4336.454,4320.0,184000,4365.0,4305.0
670,2017/05/24,4310.0,4318.765,4355.0,272000,4360.0,4305.0
671,2017/05/25,4315.0,4321.47,4310.0,171800,4340.0,4310.0
672,2017/05/26,4285.0,4291.247,4300.0,183300,4310.0,4280.0
673,2017/05/29,4315.0,4308.831,4305.0,191100,4330.0,4280.0
674,2017/05/30,4315.0,4315.998,4320.0,245600,4340.0,4300.0
675,2017/05/31,4315.0,4314.713,4320.0,407700,4350.0,4290.0
676,2017/06/01,4375.0,4352.803,4310.0,285100,4380.0,4295.0
677,2017/06/02,4390.0,4385.051,4390.0,364500,4400.0,4345.0
678,2017/06/05,4430.0,4409.569,4375.0,247300,4445.0,4355.0
679,2017/06/06,4375.0,4377.654,4420.0,347200,4420.0,4350.0
680,2017/06/07,4345.0,4340.735,4360.0,343700,4365.0,4310.0
681,2017/06/08,4295.0,4311.86,4335.0,266400,4350.0,4290.0
682,2017/06/09,4270.0,4287.305,4285.0,383600,4310.0,4270.0
683,2017/06/12,4310.0,4307.049,4275.0,270400,4330.0,4265.0
684,2017/06/13,4305.0,4315.246,4325.0,321800,4340.0,4295.0
685,2017/06/14,4350.0,4339.99,4295.0,354200,4365.0,4285.0
686,2017/06/15,4375.0,4366.63,4315.0,354400,4390.0,4300.0
687,2017/06/16,4375.0,4375.079,4400.0,365900,4400.0,4355.0
688,2017/06/19,4380.0,4382.894,4375.0,231500,4405.0,4365.0
689,2017/06/20,4425.0,4421.881,4405.0,232100,4435.0,4385.0
690,2017/06/21,4450.0,4450.017,4440.0,322000,4470.0,4435.0
691,2017/06/22,4435.0,4446.302,4460.0,143200,4465.0,4435.0
692,2017/06/23,4375.0,4381.83,4430.0,224300,4430.0,4360.0
693,2017/06/26,4375.0,4380.659,4385.0,151000,4410.0,4375.0
694,2017/06/27,4375.0,4370.084,4375.0,191600,4390.0,4345.0
695,2017/06/28,4345.0,4349.34,4345.0,174100,4380.0,4335.0
696,2017/06/29,4360.0,4351.518,4355.0,157800,4365.0,4325.0
697,2017/06/30,4305.0,4299.952,4320.0,220200,4320.0,4280.0
698,2017/07/03,4230.0,4250.056,4290.0,455600,4305.0,4220.0
699,2017/07/04,4220.0,4227.689,4240.0,226500,4255.0,4210.0
700,2017/07/05,4185.0,4175.25,4165.0,383700,4195.0,4140.0
701,2017/07/06,4230.0,4244.607,4215.0,496300,4280.0,4215.0
702,2017/07/07,4190.0,4199.393,4180.0,348400,4235.0,4170.0
703,2017/07/10,4195.0,4212.399,4230.0,331600,4245.0,4195.0
704,2017/07/11,4215.0,4209.83,4180.0,194100,4230.0,4180.0
705,2017/07/12,4205.0,4214.995,4245.0,208200,4245.0,4200.0
706,2017/07/13,4220.0,4223.257,4235.0,247200,4245.0,4210.0
707,2017/07/14,4250.0,4248.717,4225.0,263800,4265.0,4225.0
708,2017/07/18,4195.0,4193.168,4220.0,309700,4230.0,4165.0
709,2017/07/19,4190.0,4200.945,4200.0,294600,4235.0,4185.0
710,2017/07/20,4190.0,4197.1,4190.0,305700,4215.0,4185.0
711,2017/07/21,4145.0,4156.717,4160.0,225700,4180.0,4140.0
712,2017/07/24,4160.0,4142.392,4120.0,201500,4160.0,4115.0
713,2017/07/25,4140.0,4149.813,4150.0,168400,4170.0,4140.0
714,2017/07/26,4130.0,4133.047,4170.0,196600,4170.0,4115.0
715,2017/07/27,4135.0,4142.764,4105.0,237500,4170.0,4100.0
716,2017/07/28,4170.0,4160.47,4120.0,346900,4175.0,4110.0
717,2017/07/31,4010.0,4053.805,4170.0,725500,4185.0,4000.0
718,2017/08/01,4020.0,4023.379,4000.0,363000,4040.0,3980.0
719,2017/08/02,4000.0,4011.256,4040.0,398100,4045.0,4000.0
720,2017/08/03,4005.0,4012.814,4015.0,298700,4035.0,4000.0
721,2017/08/04,4005.0,4011.347,4020.0,248400,4020.0,4000.0
722,2017/08/07,4005.0,4006.855,4010.0,187900,4015.0,3995.0
723,2017/08/08,4000.0,3997.002,3995.0,243000,4015.0,3980.0
724,2017/08/09,3985.0,3979.273,3990.0,344400,4015.0,3960.0
725,2017/08/10,3985.0,3983.801,3975.0,227200,3995.0,3965.0
726,2017/08/14,3940.0,3948.708,3985.0,334700,3990.0,3930.0
727,2017/08/15,3985.0,3984.701,3960.0,299500,4000.0,3950.0
728,2017/08/16,4000.0,4007.229,4005.0,290700,4020.0,3985.0
729,2017/08/17,3995.0,3997.05,4000.0,210300,4010.0,3975.0
730,2017/08/18,3980.0,3975.768,3975.0,224600,3995.0,3950.0
731,2017/08/21,4020.0,4008.114,4000.0,289300,4025.0,3980.0
732,2017/08/22,3975.0,3983.084,4025.0,318700,4025.0,3965.0
733,2017/08/23,4015.0,4013.658,4000.0,341200,4030.0,3995.0
734,2017/08/24,4040.0,4031.561,4005.0,297200,4050.0,3990.0
735,2017/08/25,4045.0,4039.472,4030.0,243400,4055.0,4015.0
736,2017/08/28,4050.0,4035.975,4025.0,231700,4055.0,3995.0
737,2017/08/29,4035.0,4032.875,4020.0,165900,4050.0,4010.0
738,2017/08/30,4080.0,4068.116,4055.0,247900,4095.0,4040.0
739,2017/08/31,4065.0,4075.232,4090.0,431700,4110.0,4055.0
740,2017/09/01,4085.0,4076.166,4090.0,187400,4090.0,4060.0
741,2017/09/04,4060.0,4057.232,4075.0,202300,4085.0,4045.0
742,2017/09/05,4075.0,4078.361,4105.0,303000,4105.0,4060.0
743,2017/09/06,4040.0,4038.532,4060.0,392400,4060.0,4020.0
744,2017/09/07,4070.0,4066.5,4060.0,292600,4100.0,4045.0
745,2017/09/08,4080.0,4066.84,4070.0,400000,4080.0,4025.0
746,2017/09/11,4160.0,4155.031,4130.0,359200,4170.0,4130.0
747,2017/09/12,4165.0,4165.266,4180.0,220000,4190.0,4150.0
748,2017/09/13,4175.0,4182.548,4200.0,332200,4215.0,4165.0
749,2017/09/14,4185.0,4181.138,4160.0,286000,4195.0,4150.0
750,2017/09/15,4165.0,4167.044,4170.0,414300,4190.0,4150.0
751,2017/09/19,4160.0,4158.721,4190.0,360300,4195.0,4145.0
752,2017/09/20,4120.0,4117.207,4135.0,369700,4140.0,4095.0
753,2017/09/21,4145.0,4146.733,4135.0,300700,4165.0,4130.0
754,2017/09/22,4135.0,4135.423,4150.0,139400,4165.0,4120.0
755,2017/09/25,4130.0,4121.728,4125.0,221400,4130.0,4100.0
756,2017/09/26,4175.0,4165.013,4140.0,339100,4175.0,4140.0
757,2017/09/27,4175.0,4165.075,4145.0,415300,4180.0,4125.0
758,2017/09/28,4180.0,4161.964,4170.0,311900,4185.0,4125.0
759,2017/09/29,4135.0,4136.207,4150.0,380200,4160.0,4125.0
760,2017/10/02,4160.0,4154.233,4170.0,237300,4185.0,4135.0
761,2017/10/03,4145.0,4135.479,4165.0,268300,4165.0,4105.0
762,2017/10/04,4215.0,4201.394,4145.0,382800,4225.0,4145.0
763,2017/10/05,4215.0,4215.796,4210.0,251300,4235.0,4185.0
764,2017/10/06,4240.0,4229.983,4240.0,349300,4240.0,4205.0
765,2017/10/10,4260.0,4260.85,4250.0,310200,4275.0,4225.0
766,2017/10/11,4290.0,4287.907,4280.0,254900,4315.0,4270.0
767,2017/10/12,4290.0,4293.205,4300.0,257600,4320.0,4275.0
768,2017/10/13,4290.0,4277.727,4260.0,329700,4305.0,4250.0
769,2017/10/16,4355.0,4350.01,4310.0,239600,4365.0,4300.0
770,2017/10/17,4370.0,4362.841,4395.0,267900,4395.0,4340.0
771,2017/10/18,4370.0,4372.826,4355.0,226300,4395.0,4355.0
772,2017/10/19,4365.0,4364.209,4375.0,225000,4385.0,4350.0
773,2017/10/20,4385.0,4378.279,4335.0,270200,4400.0,4320.0
774,2017/10/23,4430.0,4418.517,4415.0,269000,4440.0,4385.0
775,2017/10/24,4500.0,4481.057,4440.0,395400,4500.0,4440.0
776,2017/10/25,4385.0,4397.327,4445.0,575600,4445.0,4380.0
777,2017/10/26,4370.0,4373.805,4385.0,282000,4395.0,4360.0
778,2017/10/27,4400.0,4395.099,4390.0,201800,4415.0,4365.0
779,2017/10/30,4410.0,4406.643,4410.0,418500,4430.0,4385.0
780,2017/10/31,4355.0,4318.263,4385.0,538600,4405.0,4210.0
781,2017/11/01,4630.0,4596.362,4530.0,850400,4660.0,4495.0
782,2017/11/02,4660.0,4657.951,4685.0,418700,4700.0,4610.0
783,2017/11/06,4695.0,4682.742,4665.0,244000,4710.0,4640.0
784,2017/11/07,4685.0,4662.206,4640.0,365100,4690.0,4600.0
785,2017/11/08,4625.0,4644.094,4680.0,343200,4690.0,4620.0
786,2017/11/09,4605.0,4629.038,4650.0,401800,4665.0,4570.0
787,2017/11/10,4600.0,4594.633,4545.0,251900,4615.0,4545.0
788,2017/11/13,4590.0,4595.951,4585.0,227100,4630.0,4585.0
789,2017/11/14,4545.0,4554.014,4575.0,245400,4580.0,4535.0
790,2017/11/15,4475.0,4496.292,4540.0,325600,4565.0,4465.0
791,2017/11/16,4545.0,4523.76,4450.0,323100,4555.0,4435.0
792,2017/11/17,4550.0,4544.316,4580.0,340800,4590.0,4515.0
793,2017/11/20,4545.0,4534.467,4520.0,150000,4550.0,4490.0
794,2017/11/21,4565.0,4548.134,4535.0,304400,4570.0,4510.0
795,2017/11/22,4530.0,4527.207,4555.0,242400,4555.0,4505.0
796,2017/11/24,4540.0,4532.226,4520.0,201300,4545.0,4495.0
797,2017/11/27,4540.0,4540.135,4550.0,230500,4560.0,4515.0
798,2017/11/28,4690.0,4697.331,4750.0,568100,4785.0,4630.0
799,2017/11/29,4695.0,4687.14,4710.0,436000,4710.0,4660.0
800,2017/11/30,4780.0,4755.881,4740.0,550100,4785.0,4705.0
801,2017/12/01,4765.0,4763.406,4800.0,253700,4805.0,4740.0
802,2017/12/04,4695.0,4711.74,4765.0,376700,4770.0,4680.0
803,2017/12/05,4775.0,4753.861,4720.0,296800,4775.0,4715.0
804,2017/12/06,4750.0,4751.552,4755.0,256500,4800.0,4720.0
805,2017/12/07,4815.0,4798.703,4745.0,278300,4820.0,4735.0
806,2017/12/08,4790.0,4774.429,4745.0,458000,4810.0,4745.0
807,2017/12/11,4845.0,4819.658,4800.0,181400,4845.0,4770.0
808,2017/12/12,4830.0,4841.874,4865.0,182200,4870.0,4825.0
809,2017/12/13,4875.0,4861.831,4840.0,269200,4885.0,4815.0
810,2017/12/14,4885.0,4886.092,4910.0,236700,4930.0,4860.0
811,2017/12/15,4865.0,4869.117,4875.0,395900,4900.0,4850.0
812,2017/12/18,4880.0,4872.346,4880.0,220600,4895.0,4840.0
813,2017/12/19,4880.0,4876.421,4890.0,152700,4910.0,4850.0
814,2017/12/20,4865.0,4856.434,4880.0,174400,4880.0,4820.0
815,2017/12/21,4895.0,4872.236,4865.0,181100,4895.0,4840.0
816,2017/12/22,4865.0,4863.31,4885.0,238400,4885.0,4845.0
817,2017/12/25,4895.0,4889.552,4865.0,97100,4915.0,4855.0
818,2017/12/26,4890.0,4903.393,4905.0,106700,4935.0,4885.0
819,2017/12/27,4860.0,4867.173,4855.0,196300,4895.0,4835.0
820,2017/12/28,4840.0,4837.978,4850.0,202500,4855.0,4820.0
821,2017/12/29,4815.0,4829.104,4840.0,167400,4850.0,4810.0
822,2018/01/04,4830.0,4810.18,4840.0,370000,4840.0,4760.0
823,2018/01/05,4845.0,4841.725,4855.0,295900,4865.0,4820.0
824,2018/01/09,4910.0,4901.286,4875.0,280000,4915.0,4870.0
825,2018/01/10,4865.0,4868.869,4900.0,219800,4900.0,4850.0
826,2018/01/11,4810.0,4808.245,4830.0,245600,4830.0,4790.0
827,2018/01/12,4735.0,4746.139,4785.0,287200,4790.0,4725.0
828,2018/01/15,4770.0,4776.2,4750.0,149600,4805.0,4745.0
829,2018/01/16,4835.0,4825.599,4805.0,167900,4840.0,4795.0
830,2018/01/17,4815.0,4806.088,4835.0,313800,4840.0,4765.0
831,2018/01/18,4770.0,4783.173,4840.0,313300,4845.0,4760.0
832,2018/01/19,4775.0,4782.513,4775.0,196000,4820.0,4755.0
833,2018/01/22,4780.0,4783.474,4805.0,197200,4810.0,4760.0
834,2018/01/23,4800.0,4792.746,4800.0,246900,4810.0,4775.0
835,2018/01/24,4780.0,4780.977,4795.0,213000,4805.0,4750.0
836,2018/01/25,4710.0,4723.327,4740.0,301800,4760.0,4695.0
837,2018/01/26,4755.0,4754.935,4715.0,275000,4775.0,4705.0
838,2018/01/29,4720.0,4738.411,4760.0,198500,4770.0,4710.0
839,2018/01/30,4675.0,4689.607,4720.0,381800,4745.0,4665.0
840,2018/01/31,4425.0,4513.574,4720.0,1194400,4805.0,4310.0
841,2018/02/01,4480.0,4443.791,4490.0,751000,4500.0,4340.0
842,2018/02/02,4545.0,4528.836,4465.0,409800,4565.0,4460.0
843,2018/02/05,4400.0,4420.168,4455.0,374700,4470.0,4400.0
844,2018/02/06,4195.0,4214.759,4275.0,610000,4305.0,4175.0
845,2018/02/07,4205.0,4246.333,4275.0,607400,4320.0,4205.0
846,2018/02/08,4185.0,4193.672,4185.0,418400,4220.0,4160.0
847,2018/02/09,4160.0,4134.425,4100.0,319700,4175.0,4065.0
848,2018/02/13,4100.0,4124.941,4145.0,382300,4170.0,4095.0
849,2018/02/14,4075.0,4081.546,4095.0,403200,4125.0,4060.0
850,2018/02/15,4075.0,4085.796,4095.0,377300,4120.0,4050.0
851,2018/02/16,4180.0,4173.362,4120.0,364500,4195.0,4110.0
852,2018/02/19,4260.0,4248.792,4235.0,259000,4270.0,4215.0
853,2018/02/20,4205.0,4214.58,4235.0,239500,4250.0,4200.0
854,2018/02/21,4200.0,4201.215,4200.0,226800,4225.0,4185.0
855,2018/02/22,4160.0,4160.514,4145.0,318300,4180.0,4125.0
856,2018/02/23,4200.0,4197.38,4195.0,225000,4205.0,4175.0
857,2018/02/26,4210.0,4212.605,4215.0,323000,4235.0,4190.0
858,2018/02/27,4215.0,4215.997,4230.0,266900,4235.0,4200.0
859,2018/02/28,4190.0,4207.174,4205.0,526900,4245.0,4190.0
860,2018/03/01,4135.0,4145.505,4155.0,372200,4180.0,4120.0
861,2018/03/02,4135.0,4137.229,4085.0,539300,4155.0,4085.0
862,2018/03/05,4140.0,4146.28,4135.0,378100,4175.0,4125.0
863,2018/03/06,4160.0,4161.211,4195.0,449800,4195.0,4140.0
864,2018/03/07,4175.0,4186.195,4130.0,362700,4225.0,4130.0
865,2018/03/08,4150.0,4167.881,4200.0,260000,4205.0,4140.0
866,2018/03/09,4160.0,4178.413,4185.0,401600,4230.0,4145.0
867,2018/03/12,4195.0,4187.244,4195.0,309300,4205.0,4165.0
868,2018/03/13,4225.0,4216.108,4185.0,286200,4235.0,4185.0
869,2018/03/14,4180.0,4179.907,4205.0,294200,4205.0,4160.0
870,2018/03/15,4155.0,4151.563,4140.0,247300,4180.0,4125.0
871,2018/03/16,4145.0,4144.33,4170.0,408100,4175.0,4130.0
872,2018/03/19,4130.0,4142.263,4155.0,187400,4180.0,4115.0
873,2018/03/20,4120.0,4103.55,4100.0,238300,4125.0,4055.0
874,2018/03/22,4145.0,4128.402,4120.0,329800,4145.0,4085.0
875,2018/03/23,4035.0,4067.624,4075.0,476600,4125.0,4030.0
876,2018/03/26,4095.0,4054.896,4010.0,318500,4095.0,4005.0
877,2018/03/27,4180.0,4151.265,4090.0,357000,4185.0,4075.0
878,2018/03/28,4115.0,4107.065,4135.0,237500,4145.0,4075.0
879,2018/03/29,4180.0,4169.899,4145.0,261500,4190.0,4135.0
880,2018/03/30,4125.0,4130.798,4185.0,247600,4185.0,4110.0
881,2018/04/02,4130.0,4138.989,4125.0,152300,4165.0,4120.0
882,2018/04/03,4140.0,4129.036,4105.0,235900,4155.0,4090.0
883,2018/04/04,4175.0,4167.648,4140.0,246000,4185.0,4125.0
884,2018/04/05,4270.0,4255.173,4210.0,321200,4295.0,4200.0
885,2018/04/06,4260.0,4267.077,4265.0,213300,4290.0,4240.0
886,2018/04/09,4340.0,4327.068,4290.0,301000,4345.0,4265.0
887,2018/04/10,4125.0,4140.297,4130.0,699500,4195.0,4100.0
888,2018/04/11,4080.0,4089.973,4120.0,272600,4135.0,4055.0
889,2018/04/12,4130.0,4120.274,4085.0,270600,4145.0,4085.0
890,2018/04/13,4135.0,4133.333,4155.0,260600,4155.0,4100.0
891,2018/04/16,4180.0,4153.378,4090.0,172000,4190.0,4085.0
892,2018/04/17,4190.0,4193.728,4155.0,219300,4215.0,4145.0
893,2018/04/18,4260.0,4245.54,4190.0,162100,4270.0,4190.0
894,2018/04/19,4250.0,4248.847,4260.0,235100,4265.0,4235.0
895,2018/04/20,4230.0,4235.073,4235.0,232000,4260.0,4215.0
896,2018/04/23,4195.0,4193.771,4220.0,241700,4225.0,4165.0
897,2018/04/24,4190.0,4190.262,4220.0,263600,4230.0,4175.0
898,2018/04/25,4210.0,4202.699,4190.0,224000,4235.0,4175.0
899,2018/04/26,4275.0,4260.723,4235.0,213100,4280.0,4215.0
900,2018/04/27,4310.0,4310.563,4300.0,346600,4340.0,4285.0
901,2018/05/01,4330.0,4319.81,4315.0,200200,4340.0,4290.0
902,2018/05/02,4310.0,4304.16,4330.0,201700,4330.0,4285.0
903,2018/05/07,4280.0,4286.228,4310.0,241500,4320.0,4265.0
904,2018/05/08,4305.0,4298.38,4300.0,287400,4320.0,4265.0
905,2018/05/09,4240.0,4261.586,4310.0,313300,4320.0,4230.0
906,2018/05/10,4235.0,4238.264,4255.0,245900,4280.0,4210.0
907,2018/05/11,4020.0,4048.816,4255.0,751600,4290.0,3960.0
908,2018/05/14,3930.0,3948.85,3960.0,519800,3990.0,3920.0
909,2018/05/15,3990.0,3982.4,3960.0,320900,4000.0,3950.0
910,2018/05/16,3970.0,3970.901,3980.0,228100,3980.0,3950.0
911,2018/05/17,3970.0,3972.358,3975.0,230500,3985.0,3960.0
912,2018/05/18,3940.0,3941.394,3960.0,263600,3965.0,3925.0
913,2018/05/21,3925.0,3928.957,3935.0,187000,3940.0,3920.0
914,2018/05/22,3940.0,3937.705,3950.0,220000,3950.0,3920.0
915,2018/05/23,3935.0,3932.302,3920.0,266900,3955.0,3915.0
916,2018/05/24,3900.0,3905.137,3935.0,265800,3940.0,3890.0
917,2018/05/25,3890.0,3890.32,3900.0,226500,3910.0,3870.0
918,2018/05/28,3865.0,3867.241,3890.0,174500,3905.0,3850.0
919,2018/05/29,3910.0,3897.611,3885.0,280400,3920.0,3870.0
920,2018/05/30,3890.0,3887.698,3910.0,331200,3910.0,3865.0
921,2018/05/31,3885.0,3885.302,3895.0,599700,3905.0,3850.0
922,2018/06/01,3910.0,3910.602,3860.0,345500,3935.0,3860.0
923,2018/06/04,3890.0,3874.337,3840.0,417700,3910.0,3835.0
924,2018/06/05,3915.0,3902.777,3890.0,338100,3920.0,3870.0
925,2018/06/06,3920.0,3907.827,3870.0,351600,3930.0,3870.0
926,2018/06/07,3905.0,3903.457,3920.0,234600,3925.0,3890.0
927,2018/06/08,3895.0,3891.691,3870.0,374600,3930.0,3870.0
928,2018/06/11,3950.0,3963.618,3935.0,336500,3995.0,3915.0
929,2018/06/12,3995.0,3993.881,3985.0,258600,4005.0,3965.0
930,2018/06/13,4015.0,4024.057,3995.0,171200,4050.0,3990.0
931,2018/06/14,4005.0,4011.33,4015.0,210500,4030.0,4000.0
932,2018/06/15,4065.0,4054.809,4035.0,478000,4075.0,4020.0
933,2018/06/18,3825.0,3830.01,3855.0,674300,3860.0,3810.0
934,2018/06/19,3845.0,3843.658,3820.0,447300,3870.0,3815.0
935,2018/06/20,3895.0,3893.132,3860.0,387400,3915.0,3850.0
936,2018/06/21,3845.0,3859.266,3875.0,332200,3895.0,3835.0
937,2018/06/22,3885.0,3875.635,3855.0,369500,3895.0,3830.0
938,2018/06/25,3875.0,3878.728,3895.0,288800,3910.0,3850.0
939,2018/06/26,3930.0,3910.354,3890.0,244400,3935.0,3870.0
940,2018/06/27,4005.0,3989.181,3935.0,275300,4010.0,3935.0
941,2018/06/28,3930.0,3932.728,3980.0,302800,3990.0,3900.0
942,2018/06/29,3945.0,3934.266,3930.0,249200,3965.0,3875.0
943,2018/07/02,3830.0,3861.587,3935.0,279400,3935.0,3825.0
944,2018/07/03,3815.0,3818.78,3850.0,259800,3855.0,3785.0
945,2018/07/04,3865.0,3845.323,3795.0,306700,3875.0,3790.0
946,2018/07/05,3855.0,3859.704,3875.0,266500,3890.0,3840.0
947,2018/07/06,3855.0,3872.951,3920.0,274000,3935.0,3855.0
948,2018/07/09,3890.0,3882.873,3870.0,215100,3905.0,3845.0
949,2018/07/10,3855.0,3872.766,3885.0,297200,3905.0,3855.0
950,2018/07/11,3810.0,3813.398,3850.0,300000,3850.0,3795.0
951,2018/07/12,3875.0,3883.435,3870.0,315900,3925.0,3850.0
952,2018/07/13,3875.0,3862.398,3845.0,308800,3885.0,3820.0
953,2018/07/17,3945.0,3934.899,3885.0,227200,3965.0,3860.0
954,2018/07/18,3945.0,3954.813,3970.0,224900,3990.0,3930.0
955,2018/07/19,3845.0,3860.239,3890.0,215400,3890.0,3840.0
956,2018/07/20,3850.0,3844.202,3820.0,266800,3865.0,3815.0
957,2018/07/23,3850.0,3856.802,3830.0,163700,3890.0,3830.0
958,2018/07/24,3810.0,3822.418,3850.0,213400,3855.0,3805.0
959,2018/07/25,3795.0,3806.956,3830.0,251500,3835.0,3790.0
960,2018/07/26,3845.0,3828.379,3810.0,243400,3845.0,3795.0
961,2018/07/27,3895.0,3878.918,3855.0,251000,3895.0,3835.0
962,2018/07/30,3865.0,3866.019,3895.0,162000,3895.0,3850.0
963,2018/07/31,4040.0,4010.162,3880.0,888500,4125.0,3820.0
964,2018/08/01,4055.0,3990.188,4045.0,779300,4085.0,3820.0
965,2018/08/02,4145.0,4146.236,4060.0,567400,4210.0,4055.0
966,2018/08/03,4085.0,4093.362,4125.0,386400,4125.0,4045.0
967,2018/08/06,4105.0,4118.609,4125.0,242700,4165.0,4100.0
968,2018/08/07,4050.0,4024.95,4055.0,431000,4080.0,3970.0
969,2018/08/08,4015.0,4021.793,4025.0,326800,4085.0,3995.0
970,2018/08/09,3990.0,3985.569,3990.0,260300,4005.0,3950.0
971,2018/08/10,3970.0,3974.201,3985.0,230800,4015.0,3960.0
972,2018/08/13,3895.0,3908.384,3960.0,221800,3960.0,3880.0
973,2018/08/14,3975.0,3949.464,3935.0,165900,3975.0,3910.0
974,2018/08/15,3980.0,3966.257,3970.0,224400,3985.0,3940.0
975,2018/08/16,3930.0,3918.643,3935.0,349400,3970.0,3885.0
976,2018/08/17,3975.0,3962.619,3955.0,204700,3975.0,3930.0
977,2018/08/20,3970.0,3968.71,3990.0,160900,4010.0,3950.0
978,2018/08/21,3990.0,3990.077,3990.0,234800,4005.0,3965.0
979,2018/08/22,4030.0,4015.105,3990.0,213900,4030.0,3965.0
980,2018/08/23,4020.0,4021.345,4035.0,213000,4040.0,4010.0
981,2018/08/24,4015.0,4010.62,4035.0,208100,4045.0,3985.0
982,2018/08/27,4020.0,4022.074,4020.0,173300,4035.0,4000.0
983,2018/08/28,4030.0,4033.589,4025.0,184600,4050.0,4015.0
984,2018/08/29,4025.0,4029.482,4015.0,208600,4050.0,4005.0
985,2018/08/30,4100.0,4102.406,4060.0,410900,4140.0,4055.0
986,2018/08/31,4095.0,4094.984,4075.0,413000,4120.0,4045.0
987,2018/09/03,4080.0,4079.555,4095.0,180800,4100.0,4055.0
988,2018/09/04,4070.0,4075.181,4090.0,284000,4100.0,4055.0
989,2018/09/05,4055.0,4058.359,4050.0,290900,4090.0,4020.0
990,2018/09/06,4050.0,4049.295,4055.0,173800,4065.0,4025.0
991,2018/09/07,4120.0,4099.36,4045.0,275800,4125.0,4040.0
992,2018/09/10,4140.0,4134.135,4100.0,495200,4175.0,4065.0
993,2018/09/11,4180.0,4168.14,4125.0,294400,4185.0,4120.0
994,2018/09/12,4185.0,4165.581,4175.0,335400,4195.0,4110.0
995,2018/09/13,4230.0,4228.347,4205.0,294900,4270.0,4195.0
996,2018/09/14,4265.0,4279.453,4295.0,466700,4310.0,4245.0
997,2018/09/18,4455.0,4413.912,4310.0,560000,4470.0,4300.0
998,2018/09/19,4405.0,4401.211,4450.0,376900,4450.0,4360.0
999,2018/09/20,4420.0,4412.828,4450.0,303400,4450.0,4390.0
1000,2018/09/21,4475.0,4465.706,4450.0,348600,4475.0,4405.0
1001,2018/09/25,4460.0,4439.988,4405.0,500200,4470.0,4380.0
1002,2018/09/26,4450.0,4423.402,4445.0,489300,4465.0,4350.0
1003,2018/09/27,4415.0,4421.967,4425.0,351800,4460.0,4395.0
1004,2018/09/28,4405.0,4408.821,4415.0,450600,4450.0,4380.0
1005,2018/10/01,4380.0,4374.246,4375.0,287300,4400.0,4340.0
1006,2018/10/02,4390.0,4392.261,4390.0,385700,4425.0,4360.0
1007,2018/10/03,4380.0,4392.288,4435.0,403400,4440.0,4360.0
1008,2018/10/04,4370.0,4373.435,4390.0,262600,4390.0,4355.0
1009,2018/10/05,4370.0,4372.147,4350.0,270400,4400.0,4330.0
1010,2018/10/09,4375.0,4366.331,4370.0,343100,4385.0,4345.0
1011,2018/10/10,4355.0,4354.396,4350.0,440500,4380.0,4335.0
1012,2018/10/11,4280.0,4281.181,4290.0,358900,4310.0,4255.0
1013,2018/10/12,4230.0,4233.86,4250.0,413400,4280.0,4200.0
1014,2018/10/15,4170.0,4179.001,4180.0,321700,4205.0,4160.0
1015,2018/10/16,4135.0,4124.955,4140.0,354700,4155.0,4085.0
1016,2018/10/17,4170.0,4161.654,4155.0,272100,4180.0,4135.0
1017,2018/10/18,4205.0,4205.608,4175.0,215600,4225.0,4170.0
1018,2018/10/19,4170.0,4153.675,4170.0,355100,4175.0,4115.0
1019,2018/10/22,4225.0,4223.988,4200.0,283600,4245.0,4195.0
1020,2018/10/23,4125.0,4138.55,4180.0,314100,4180.0,4110.0
1021,2018/10/24,4160.0,4161.878,4185.0,380900,4190.0,4120.0
1022,2018/10/25,4090.0,4100.313,4110.0,365800,4130.0,4080.0
1023,2018/10/26,4075.0,4065.955,4075.0,444400,4100.0,4040.0
1024,2018/10/29,4055.0,4065.226,4080.0,311800,4115.0,4040.0
1025,2018/10/30,4105.0,4089.591,4050.0,904300,4105.0,4020.0
1026,2018/10/31,3890.0,3920.151,4010.0,989800,4070.0,3780.0
1027,2018/11/01,3910.0,3936.521,3890.0,764600,4030.0,3870.0
1028,2018/11/02,3895.0,3882.033,3870.0,577200,3925.0,3850.0
1029,2018/11/05,3840.0,3848.873,3860.0,304700,3895.0,3830.0
1030,2018/11/06,3920.0,3914.568,3885.0,266000,3935.0,3870.0
1031,2018/11/07,3905.0,3907.42,3915.0,466100,3940.0,3875.0
1032,2018/11/08,3965.0,3955.84,3945.0,359100,3980.0,3930.0
1033,2018/11/09,3955.0,3963.206,3970.0,277300,4010.0,3945.0
1034,2018/11/12,3945.0,3957.063,3945.0,236100,3995.0,3935.0
1035,2018/11/13,3880.0,3865.908,3885.0,279800,3890.0,3845.0
1036,2018/11/14,3800.0,3817.798,3870.0,380400,3880.0,3785.0
1037,2018/11/15,3820.0,3806.498,3795.0,234600,3825.0,3765.0
1038,2018/11/16,3805.0,3801.599,3810.0,323900,3820.0,3780.0
1039,2018/11/19,3785.0,3794.284,3805.0,206100,3830.0,3780.0
1040,2018/11/20,3805.0,3786.754,3770.0,292700,3810.0,3750.0
1041,2018/11/21,3815.0,3812.829,3805.0,326800,3835.0,3795.0
1042,2018/11/22,3905.0,3867.28,3825.0,268700,3905.0,3800.0
1043,2018/11/26,3930.0,3915.962,3920.0,318700,3935.0,3870.0
1044,2018/11/27,3885.0,3892.951,3895.0,396600,3920.0,3865.0
1045,2018/11/28,3820.0,3843.459,3895.0,360900,3900.0,3820.0
1046,2018/11/29,3815.0,3834.259,3865.0,299500,3880.0,3810.0
1047,2018/11/30,3890.0,3882.047,3850.0,527600,3900.0,3845.0
1048,2018/12/03,3955.0,3946.395,3950.0,415000,3970.0,3910.0
1049,2018/12/04,4015.0,4018.649,3970.0,546800,4055.0,3955.0
1050,2018/12/05,4045.0,4021.737,3965.0,426500,4050.0,3950.0
1051,2018/12/06,3995.0,3998.483,4015.0,424100,4050.0,3955.0
1052,2018/12/07,4065.0,4034.579,4045.0,487800,4080.0,3955.0
1053,2018/12/10,4010.0,4007.989,4040.0,308500,4040.0,3980.0
1054,2018/12/11,3960.0,3976.951,4015.0,362700,4050.0,3935.0
1055,2018/12/12,4080.0,4079.287,4075.0,397600,4100.0,4060.0
1056,2018/12/13,4060.0,4064.88,4080.0,359300,4095.0,4040.0
1057,2018/12/14,4055.0,4067.254,4060.0,420600,4100.0,4040.0
1058,2018/12/17,4065.0,4060.88,4075.0,329000,4090.0,4035.0
1059,2018/12/18,4005.0,4018.195,4040.0,407200,4050.0,3985.0
1060,2018/12/19,3990.0,3993.912,4020.0,272900,4030.0,3970.0
1061,2018/12/20,3935.0,3945.02,3985.0,318000,4020.0,3910.0
1062,2018/12/21,3810.0,3831.632,3925.0,560700,3935.0,3805.0
1063,2018/12/25,3660.0,3677.111,3780.0,324900,3780.0,3620.0
1064,2018/12/26,3655.0,3659.115,3645.0,291000,3725.0,3625.0
1065,2018/12/27,3835.0,3814.02,3740.0,293500,3845.0,3740.0
1066,2018/12/28,3835.0,3838.594,3830.0,318000,3865.0,3810.0
1067,2019/01/04,3820.0,3815.624,3785.0,514900,3860.0,3780.0
1068,2019/01/07,3905.0,3901.563,3885.0,382000,3940.0,3855.0
1069,2019/01/08,3870.0,3893.495,3950.0,394400,3980.0,3850.0
1070,2019/01/09,3955.0,3965.95,3950.0,352100,4015.0,3925.0
1071,2019/01/10,3880.0,3879.529,3900.0,885000,3950.0,3815.0
1072,2019/01/11,3890.0,3892.001,3880.0,465800,3925.0,3860.0
1073,2019/01/15,3885.0,3887.78,3890.0,284900,3920.0,3860.0
1074,2019/01/16,3900.0,3895.665,3910.0,253300,3910.0,3875.0
1075,2019/01/17,3875.0,3885.255,3900.0,303500,3910.0,3870.0
1076,2019/01/18,3885.0,3905.944,3875.0,290300,3930.0,3875.0
1077,2019/01/21,3900.0,3912.791,3910.0,348800,3935.0,3900.0
1078,2019/01/22,3935.0,3940.12,3935.0,287800,3965.0,3925.0
1079,2019/01/23,3900.0,3905.167,3945.0,322700,3950.0,3890.0
1080,2019/01/24,3940.0,3930.819,3935.0,501200,3950.0,3900.0
1081,2019/01/25,3910.0,3922.859,3950.0,395400,3950.0,3905.0
1082,2019/01/28,3885.0,3880.267,3885.0,286500,3895.0,3850.0
1083,2019/01/29,3925.0,3915.291,3910.0,331900,3930.0,3900.0
1084,2019/01/30,3915.0,3911.951,3895.0,351100,3925.0,3890.0
1085,2019/01/31,3905.0,3912.475,3965.0,882900,4010.0,3835.0
1086,2019/02/01,3875.0,3880.812,3850.0,429100,3915.0,3815.0
1087,2019/02/04,3910.0,3921.348,3910.0,380200,3950.0,3890.0
1088,2019/02/05,4130.0,4058.53,3915.0,1013700,4170.0,3905.0
1089,2019/02/06,4070.0,4085.081,4110.0,344500,4110.0,4065.0
1090,2019/02/07,4080.0,4092.764,4140.0,437200,4140.0,4070.0
1091,2019/02/08,4065.0,4069.727,4060.0,292700,4090.0,4055.0
1092,2019/02/12,4085.0,4089.356,4070.0,462400,4110.0,4060.0
1093,2019/02/13,4115.0,4109.197,4100.0,429000,4125.0,4085.0
1094,2019/02/14,4105.0,4107.338,4100.0,341100,4130.0,4095.0
1095,2019/02/15,4090.0,4095.019,4085.0,344300,4120.0,4080.0
1096,2019/02/18,4140.0,4146.335,4130.0,358700,4175.0,4110.0
1097,2019/02/19,4160.0,4153.564,4150.0,299500,4165.0,4135.0
1098,2019/02/20,4190.0,4185.674,4200.0,403300,4205.0,4140.0
1099,2019/02/21,4185.0,4176.173,4175.0,303400,4195.0,4145.0
1100,2019/02/22,4140.0,4161.333,4185.0,294400,4200.0,4140.0
1101,2019/02/25,4145.0,4156.479,4150.0,371800,4195.0,4135.0
1102,2019/02/26,4160.0,4159.369,4155.0,241500,4180.0,4145.0
1103,2019/02/27,4135.0,4144.992,4135.0,371500,4165.0,4135.0
1104,2019/02/28,4130.0,4137.317,4150.0,316100,4155.0,4125.0
1105,2019/03/01,4140.0,4141.869,4155.0,194000,4155.0,4125.0
1106,2019/03/04,4110.0,4121.826,4155.0,297400,4175.0,4100.0
1107,2019/03/05,4115.0,4112.178,4100.0,230700,4120.0,4095.0
1108,2019/03/06,4120.0,4113.478,4105.0,241200,4125.0,4090.0
1109,2019/03/07,4075.0,4088.084,4130.0,336300,4130.0,4070.0
1110,2019/03/08,4055.0,4052.656,4045.0,292000,4080.0,4045.0
1111,2019/03/11,4050.0,4053.365,4055.0,214400,4065.0,4045.0
1112,2019/03/12,4075.0,4067.082,4045.0,262300,4080.0,4040.0
1113,2019/03/13,4080.0,4067.659,4065.0,337400,4085.0,4035.0
1114,2019/03/14,4115.0,4120.813,4140.0,379000,4145.0,4095.0
1115,2019/03/15,4130.0,4135.472,4120.0,452800,4150.0,4120.0
1116,2019/03/18,4125.0,4123.689,4135.0,228400,4140.0,4110.0
1117,2019/03/19,4095.0,4102.038,4140.0,197500,4140.0,4090.0
1118,2019/03/20,4130.0,4113.109,4080.0,404500,4140.0,4075.0
1119,2019/03/22,4115.0,4118.083,4120.0,309600,4145.0,4100.0
1120,2019/03/25,4140.0,4143.081,4165.0,561800,4165.0,4105.0
1121,2019/03/26,4255.0,4230.098,4140.0,631100,4260.0,4140.0
1122,2019/03/27,4225.0,4217.771,4225.0,409900,4245.0,4190.0
1123,2019/03/28,4160.0,4165.274,4190.0,337400,4210.0,4140.0
1124,2019/03/29,4215.0,4211.477,4215.0,447800,4225.0,4190.0
1125,2019/04/01,4215.0,4222.989,4235.0,349400,4245.0,4210.0
1126,2019/04/02,4185.0,4196.977,4245.0,228100,4245.0,4180.0
1127,2019/04/03,4210.0,4201.408,4240.0,400000,4240.0,4160.0
1128,2019/04/04,4205.0,4203.443,4200.0,237000,4215.0,4185.0
1129,2019/04/05,4225.0,4225.692,4240.0,389300,4255.0,4205.0
1130,2019/04/08,4250.0,4252.03,4280.0,237000,4280.0,4235.0
1131,2019/04/09,4210.0,4211.542,4250.0,222100,4250.0,4200.0
1132,2019/04/10,4195.0,4198.189,4180.0,144400,4210.0,4175.0
1133,2019/04/11,4215.0,4211.509,4205.0,189500,4230.0,4195.0
1134,2019/04/12,4215.0,4209.396,4200.0,204500,4215.0,4190.0
1135,2019/04/15,4215.0,4226.553,4260.0,308500,4290.0,4200.0
1136,2019/04/16,4225.0,4230.1,4235.0,254700,4250.0,4210.0
1137,2019/04/17,4175.0,4188.791,4215.0,410100,4215.0,4170.0
1138,2019/04/18,4130.0,4137.636,4175.0,270300,4185.0,4115.0
1139,2019/04/19,4170.0,4165.345,4160.0,162400,4175.0,4145.0
1140,2019/04/22,4240.0,4225.386,4190.0,217400,4245.0,4180.0
1141,2019/04/23,4220.0,4230.732,4240.0,207000,4270.0,4215.0
1142,2019/04/24,4205.0,4205.069,4210.0,224400,4230.0,4185.0
1143,2019/04/25,4230.0,4222.961,4225.0,237400,4245.0,4195.0
1144,2019/04/26,4235.0,4237.702,4250.0,310900,4265.0,4220.0
1145,2019/05/07,4285.0,4285.019,4305.0,505300,4340.0,4260.0
1146,2019/05/08,4145.0,4160.445,4235.0,426700,4235.0,4115.0
1147,2019/05/09,4060.0,4068.893,4125.0,585700,4125.0,4035.0
1148,2019/05/10,4035.0,3974.189,3990.0,957000,4045.0,3910.0
1149,2019/05/13,4360.0,4344.136,4380.0,1113100,4390.0,4255.0
1150,2019/05/14,4330.0,4314.194,4335.0,566100,4345.0,4285.0
1151,2019/05/15,4305.0,4278.443,4300.0,562500,4315.0,4240.0
1152,2019/05/16,4310.0,4296.912,4280.0,283500,4320.0,4270.0
1153,2019/05/17,4320.0,4290.895,4310.0,515600,4320.0,4250.0
1154,2019/05/20,4360.0,4331.554,4285.0,278700,4365.0,4280.0
1155,2019/05/21,4380.0,4390.206,4405.0,337100,4410.0,4370.0
1156,2019/05/22,4360.0,4378.796,4435.0,374300,4435.0,4350.0
1157,2019/05/23,4500.0,4468.468,4370.0,476300,4510.0,4370.0
1158,2019/05/24,4490.0,4495.306,4540.0,369300,4555.0,4460.0
1159,2019/05/27,4490.0,4485.565,4485.0,229200,4505.0,4460.0
1160,2019/05/28,4420.0,4417.486,4450.0,619000,4450.0,4395.0
1161,2019/05/29,4360.0,4361.847,4350.0,455400,4410.0,4325.0
1162,2019/05/30,4315.0,4298.008,4305.0,408900,4330.0,4270.0
1163,2019/05/31,4240.0,4221.587,4270.0,1069600,4280.0,4155.0
1164,2019/06/03,4210.0,4212.559,4210.0,384500,4245.0,4180.0
1165,2019/06/04,4225.0,4217.765,4265.0,338500,4270.0,4180.0
1166,2019/06/05,4290.0,4278.729,4275.0,383200,4320.0,4225.0
1167,2019/06/06,4275.0,4267.491,4285.0,237100,4285.0,4240.0
1168,2019/06/07,4290.0,4301.761,4310.0,299600,4325.0,4285.0
1169,2019/06/10,4380.0,4374.032,4360.0,248400,4395.0,4350.0
1170,2019/06/11,4345.0,4325.747,4335.0,301800,4345.0,4295.0
1171,2019/06/12,4355.0,4362.151,4385.0,263200,4415.0,4345.0
1172,2019/06/13,4360.0,4355.193,4380.0,285200,4380.0,4335.0
1173,2019/06/14,4365.0,4366.157,4385.0,340000,4385.0,4340.0
1174,2019/06/17,4355.0,4357.837,4355.0,246000,4385.0,4335.0
1175,2019/06/18,4375.0,4383.797,4355.0,519400,4440.0,4345.0
1176,2019/06/19,4455.0,4436.837,4380.0,415900,4460.0,4375.0
1177,2019/06/20,4420.0,4429.857,4475.0,185000,4480.0,4405.0
1178,2019/06/21,4450.0,4436.596,4460.0,595400,4460.0,4395.0
1179,2019/06/24,4430.0,4418.879,4415.0,160100,4435.0,4395.0
1180,2019/06/25,4475.0,4478.026,4495.0,394100,4515.0,4450.0
1181,2019/06/26,4495.0,4483.435,4435.0,406300,4515.0,4420.0
1182,2019/06/27,4465.0,4458.521,4475.0,348900,4475.0,4415.0
1183,2019/06/28,4440.0,4447.67,4500.0,478200,4510.0,4415.0
1184,2019/07/01,4460.0,4456.43,4470.0,237000,4475.0,4430.0
1185,2019/07/02,4505.0,4502.81,4490.0,298200,4520.0,4480.0
1186,2019/07/03,4535.0,4530.79,4530.0,181700,4540.0,4510.0
1187,2019/07/04,4565.0,4564.756,4550.0,143400,4580.0,4545.0
1188,2019/07/05,4560.0,4551.649,4565.0,182200,4565.0,4520.0
1189,2019/07/08,4500.0,4508.342,4520.0,187900,4540.0,4490.0
1190,2019/07/09,4525.0,4535.948,4525.0,218300,4570.0,4515.0
1191,2019/07/10,4585.0,4560.252,4520.0,370400,4595.0,4495.0
1192,2019/07/11,4615.0,4608.249,4600.0,305600,4625.0,4585.0
1193,2019/07/12,4615.0,4617.62,4615.0,245400,4635.0,4605.0
1194,2019/07/16,4650.0,4647.93,4660.0,302600,4665.0,4620.0
1195,2019/07/17,4640.0,4628.554,4615.0,221000,4645.0,4600.0
1196,2019/07/18,4515.0,4540.856,4535.0,400600,4605.0,4505.0
1197,2019/07/19,4620.0,4593.452,4515.0,298100,4625.0,4510.0
1198,2019/07/22,4565.0,4577.526,4560.0,244500,4610.0,4560.0
1199,2019/07/23,4605.0,4606.079,4580.0,156200,4625.0,4560.0
1200,2019/07/24,4650.0,4636.508,4625.0,217200,4655.0,4590.0
1201,2019/07/25,4625.0,4633.711,4625.0,131900,4665.0,4615.0
1202,2019/07/26,4590.0,4589.814,4600.0,207000,4610.0,4570.0
1203,2019/07/29,4620.0,4611.391,4600.0,195900,4630.0,4595.0
1204,2019/07/30,4625.0,4611.901,4615.0,261700,4630.0,4590.0
1205,2019/07/31,4395.0,4429.324,4560.0,1058600,4565.0,4255.0
1206,2019/08/01,4550.0,4501.086,4325.0,737300,4605.0,4315.0
1207,2019/08/02,4405.0,4426.47,4490.0,349700,4530.0,4395.0
1208,2019/08/05,4400.0,4371.516,4370.0,499500,4405.0,4320.0
1209,2019/08/06,4385.0,4358.249,4310.0,273300,4395.0,4285.0
1210,2019/08/07,4425.0,4406.903,4370.0,269000,4440.0,4360.0
1211,2019/08/08,4395.0,4386.986,4380.0,1234200,4420.0,4320.0
1212,2019/08/09,4360.0,4391.1,4400.0,957900,4415.0,4355.0
1213,2019/08/13,4350.0,4350.521,4340.0,315700,4375.0,4300.0
1214,2019/08/14,4370.0,4366.488,4380.0,220800,4400.0,4330.0
1215,2019/08/15,4395.0,4369.048,4300.0,318700,4400.0,4300.0
1216,2019/08/16,4375.0,4388.051,4395.0,369400,4425.0,4360.0
1217,2019/08/19,4355.0,4351.016,4375.0,257800,4385.0,4320.0
1218,2019/08/20,4370.0,4352.905,4355.0,223400,4370.0,4320.0
1219,2019/08/21,4340.0,4318.491,4305.0,216100,4340.0,4265.0
1220,2019/08/22,4340.0,4335.631,4340.0,263200,4360.0,4305.0
1221,2019/08/23,4365.0,4364.318,4405.0,167900,4410.0,4325.0
