,Date,Close,VWAP,Open,Volume,High,Low
0,2015/12/15,2875.0,2610.86,2505.0,4026200,3005.0,2332.5
1,2015/12/16,2375.0,2644.966,3045.0,3209000,3090.0,2375.0
2,2015/12/17,2045.0,2137.142,2250.0,1544600,2275.0,2035.0
3,2015/12/18,2085.0,2173.903,2115.0,1107800,2317.5,1975.0
4,2015/12/21,2072.5,2173.885,2050.0,1075200,2370.0,1982.5
5,2015/12/22,1782.5,1875.898,2002.5,580400,2052.5,1742.5
6,2015/12/24,1557.5,1647.491,1712.5,381800,1735.0,1557.5
7,2015/12/25,1725.0,1634.101,1627.5,435400,1740.0,1502.5
8,2015/12/28,1767.5,1773.818,1805.0,295600,1835.0,1710.0
9,2015/12/29,1790.0,1887.143,1857.5,684200,1997.5,1765.0
10,2015/12/30,2140.0,1963.975,1850.0,536800,2140.0,1842.5
11,2016/01/04,2065.0,2119.941,2230.0,801400,2240.0,1957.5
12,2016/01/05,1840.0,1911.981,2000.0,424800,2045.0,1820.0
13,2016/01/06,1700.0,1772.299,1825.0,270800,1890.0,1695.0
14,2016/01/07,1627.5,1665.355,1690.0,166200,1765.0,1592.5
15,2016/01/08,1655.0,1602.624,1595.0,125400,1655.0,1565.0
16,2016/01/12,1461.5,1559.935,1687.5,209000,1710.0,1425.0
17,2016/01/13,1535.0,1470.49,1486.5,127200,1550.0,1425.0
18,2016/01/14,1470.0,1417.475,1425.0,102200,1500.0,1380.5
19,2016/01/15,1382.5,1471.501,1484.0,91400,1567.5,1382.5
20,2016/01/18,1360.0,1315.717,1307.5,122400,1396.5,1252.5
21,2016/01/19,1374.5,1348.973,1335.0,48200,1400.0,1325.0
22,2016/01/20,1237.5,1297.916,1380.0,84000,1392.5,1225.0
23,2016/01/21,1137.5,1210.202,1252.5,114200,1301.5,1122.0
24,2016/01/22,1272.5,1225.786,1235.0,69200,1275.0,1177.5
25,2016/01/25,1326.5,1294.869,1297.5,130200,1372.5,1212.5
26,2016/01/26,1307.0,1336.66,1290.0,141600,1432.5,1260.0
27,2016/01/27,1361.0,1376.65,1334.0,122800,1430.0,1334.0
28,2016/01/28,1612.5,1537.041,1386.0,316800,1612.5,1362.5
29,2016/01/29,1507.5,1496.514,1580.0,247600,1600.0,1430.0
30,2016/02/01,1490.5,1507.592,1517.5,77200,1585.0,1488.0
31,2016/02/02,1400.0,1419.061,1485.5,63800,1485.5,1389.5
32,2016/02/03,1301.5,1325.649,1350.0,45600,1360.0,1295.0
33,2016/02/04,1309.0,1334.476,1292.5,45800,1384.5,1286.5
34,2016/02/05,1194.5,1208.933,1259.5,62400,1280.0,1170.0
35,2016/02/08,1172.5,1156.717,1144.5,56800,1190.0,1128.0
36,2016/02/09,1028.5,1062.916,1111.0,67400,1124.0,1016.5
37,2016/02/10,1015.0,1027.925,1071.5,56000,1071.5,1000.0
38,2016/02/12,959.5,971.519,994.5,63800,1000.0,938.5
39,2016/02/15,1029.5,1019.638,1025.0,48600,1050.0,985.0
40,2016/02/16,1014.0,1053.653,1004.5,69800,1112.5,1002.0
41,2016/02/17,1048.0,1036.947,1020.0,43200,1079.0,1013.5
42,2016/02/18,1140.0,1098.5,1085.0,75000,1142.5,1062.0
43,2016/02/19,1215.0,1148.252,1095.0,68200,1222.5,1095.0
44,2016/02/22,1292.0,1246.631,1181.0,113000,1320.0,1174.0
45,2016/02/23,1189.0,1283.021,1317.0,138600,1361.5,1181.0
46,2016/02/24,1140.5,1153.159,1144.0,44800,1182.5,1136.0
47,2016/02/25,1151.0,1161.566,1145.0,29000,1189.0,1140.0
48,2016/02/26,1113.0,1141.276,1156.0,28600,1172.5,1112.5
49,2016/02/29,1172.5,1144.7,1100.0,59400,1215.0,1080.0
50,2016/03/01,1190.0,1178.267,1160.0,26200,1196.0,1150.5
51,2016/03/02,1240.0,1246.36,1212.0,39400,1265.5,1212.0
52,2016/03/03,1490.0,1410.95,1265.0,226800,1490.0,1260.0
53,2016/03/04,1430.0,1446.593,1440.0,272400,1535.0,1385.0
54,2016/03/07,1537.5,1478.125,1475.0,118400,1567.5,1405.0
55,2016/03/08,1692.5,1639.113,1567.5,585800,1795.0,1490.0
56,2016/03/09,1885.0,1799.248,1625.0,604600,1900.0,1607.5
57,2016/03/10,1800.0,1877.25,1950.0,365400,1972.5,1757.5
58,2016/03/11,1642.5,1783.769,1785.0,310400,1922.5,1640.0
59,2016/03/14,1735.0,1734.084,1650.0,196400,1795.0,1650.0
60,2016/03/15,1632.5,1691.685,1765.0,109800,1765.0,1612.5
61,2016/03/16,1635.0,1586.494,1607.5,77000,1645.0,1562.5
62,2016/03/17,1637.5,1705.43,1672.5,169600,1782.5,1615.0
63,2016/03/18,1545.0,1543.754,1635.0,87200,1635.0,1499.0
64,2016/03/22,1742.5,1648.149,1610.0,124000,1742.5,1565.0
65,2016/03/23,1780.0,1745.007,1760.0,143000,1795.0,1665.0
66,2016/03/24,1732.5,1813.559,1815.0,178400,1862.5,1722.5
67,2016/03/25,1775.0,1733.088,1727.5,97800,1795.0,1685.0
68,2016/03/28,1990.0,1902.787,1810.0,443200,1990.0,1790.0
69,2016/03/29,1987.5,2009.142,2025.0,491600,2085.0,1927.5
70,2016/03/30,1917.5,2027.42,2050.0,542000,2130.0,1847.5
71,2016/03/31,2017.5,1945.931,1945.0,223000,2022.5,1860.0
72,2016/04/01,1870.0,1880.581,2027.5,257400,2037.5,1752.5
73,2016/04/04,1765.0,1756.43,1805.0,124800,1805.0,1677.5
74,2016/04/05,1570.0,1618.482,1750.0,192400,1752.5,1525.0
75,2016/04/06,1505.0,1510.519,1515.0,103000,1570.0,1460.0
76,2016/04/07,1535.0,1546.182,1505.0,79600,1627.5,1490.5
77,2016/04/08,1605.0,1558.707,1480.0,62800,1615.0,1478.0
78,2016/04/11,1710.0,1687.794,1625.0,148200,1805.0,1555.0
79,2016/04/12,1602.5,1641.707,1710.0,96400,1722.5,1585.0
80,2016/04/13,1635.0,1621.414,1632.5,83800,1670.0,1582.5
81,2016/04/14,1632.5,1645.575,1662.5,62600,1687.5,1610.0
82,2016/04/15,1617.5,1588.949,1612.5,46600,1617.5,1565.0
83,2016/04/18,1575.0,1564.945,1557.5,45600,1642.5,1525.0
84,2016/04/19,1605.0,1601.878,1602.5,44200,1635.0,1555.0
85,2016/04/20,1647.5,1639.605,1617.5,67000,1685.0,1595.0
86,2016/04/21,1855.0,1790.931,1717.5,335200,1855.0,1670.0
87,2016/04/22,1800.0,1771.745,1800.0,143600,1827.5,1712.5
88,2016/04/25,1992.5,1896.439,1847.5,240800,1995.0,1780.0
89,2016/04/26,1805.0,1866.597,1975.0,219200,1987.5,1755.0
90,2016/04/27,1915.0,1887.825,1850.0,208000,1932.5,1827.5
91,2016/04/28,1877.5,1875.999,1915.0,141200,1922.5,1807.5
92,2016/05/02,1777.5,1785.103,1772.5,106600,1850.0,1730.0
93,2016/05/06,1717.5,1709.497,1785.0,113400,1800.0,1652.5
94,2016/05/09,1775.0,1755.392,1752.5,56200,1785.0,1715.0
95,2016/05/10,2047.5,1996.161,1810.0,657600,2120.0,1802.5
96,2016/05/11,1957.5,1985.344,2025.0,304000,2090.0,1905.0
97,2016/05/12,2057.5,2017.902,1932.5,297400,2102.5,1890.0
98,2016/05/13,1892.5,1891.04,2022.5,324400,2030.0,1807.5
99,2016/05/16,1800.0,1920.579,1860.0,346200,2050.0,1790.0
100,2016/05/17,1920.0,1910.444,1900.0,129600,1972.5,1850.0
101,2016/05/18,1842.5,1884.315,1950.0,171600,1992.5,1782.5
102,2016/05/19,1812.5,1837.969,1860.0,51200,1885.0,1805.0
103,2016/05/20,1762.5,1746.82,1790.0,106600,1795.0,1700.0
104,2016/05/23,1745.0,1725.199,1780.0,60200,1790.0,1700.0
105,2016/05/24,1675.0,1666.911,1727.5,86600,1742.5,1627.5
106,2016/05/25,1810.0,1779.128,1700.0,117000,1830.0,1700.0
107,2016/05/26,1732.5,1742.648,1830.0,64200,1830.0,1700.0
108,2016/05/27,1682.5,1701.753,1725.0,40800,1737.5,1670.0
109,2016/05/30,1737.5,1701.266,1665.0,32400,1737.5,1665.0
110,2016/05/31,1745.0,1738.007,1750.0,27600,1770.0,1707.5
111,2016/06/01,1685.0,1700.967,1707.5,27400,1727.5,1677.5
112,2016/06/02,1632.5,1649.669,1672.5,52800,1685.0,1627.5
113,2016/06/03,1670.0,1650.448,1625.0,42400,1685.0,1615.0
114,2016/06/06,1630.0,1626.228,1605.0,22400,1645.0,1605.0
115,2016/06/07,1632.5,1635.608,1650.0,22200,1665.0,1625.0
116,2016/06/08,1617.5,1586.042,1632.5,43200,1635.0,1552.5
117,2016/06/09,1605.0,1629.585,1620.0,71000,1690.0,1575.0
118,2016/06/10,1585.0,1600.421,1607.5,36800,1632.5,1572.5
119,2016/06/13,1505.0,1524.248,1567.5,65800,1567.5,1505.0
120,2016/06/14,1355.0,1401.862,1500.0,138600,1535.0,1336.0
121,2016/06/15,1325.0,1300.747,1280.0,185000,1355.0,1256.5
122,2016/06/16,1223.0,1244.006,1345.0,90200,1350.0,1175.0
123,2016/06/17,1178.0,1206.472,1250.0,75000,1268.5,1150.5
124,2016/06/20,1248.5,1243.889,1250.0,82800,1270.0,1223.0
125,2016/06/21,1305.0,1284.855,1248.0,89000,1340.0,1248.0
126,2016/06/22,1252.0,1266.793,1300.0,54000,1300.0,1250.0
127,2016/06/23,1269.5,1236.471,1245.5,45200,1269.5,1200.5
128,2016/06/24,1139.5,1179.39,1295.0,131400,1319.0,1050.5
129,2016/06/27,1192.5,1169.322,1150.0,52800,1199.0,1142.5
130,2016/06/28,1215.0,1169.084,1165.0,48600,1228.0,1112.5
131,2016/06/29,1225.0,1250.579,1265.0,65600,1287.5,1200.5
132,2016/06/30,1253.5,1260.538,1250.0,65200,1290.0,1249.0
133,2016/07/01,1300.0,1287.318,1272.5,45600,1302.0,1256.0
134,2016/07/04,1307.0,1302.292,1301.0,54800,1322.5,1285.0
135,2016/07/05,1270.0,1283.929,1290.5,35400,1305.0,1268.0
136,2016/07/06,1229.0,1221.495,1230.0,42600,1243.5,1204.5
137,2016/07/07,1158.0,1193.586,1249.5,56800,1249.5,1150.0
138,2016/07/08,1157.5,1160.731,1156.0,24200,1187.5,1146.5
139,2016/07/11,1273.5,1247.778,1212.5,46800,1290.0,1189.0
140,2016/07/12,1290.0,1300.788,1315.0,54800,1332.5,1265.0
141,2016/07/13,1253.5,1291.237,1320.0,37200,1325.0,1245.0
142,2016/07/14,1346.0,1329.908,1253.5,93200,1374.5,1253.5
143,2016/07/15,1255.0,1299.438,1375.0,113600,1375.0,1240.0
144,2016/07/19,1208.5,1210.326,1230.0,55200,1237.0,1190.5
145,2016/07/20,1210.0,1209.448,1206.0,23000,1228.5,1200.0
146,2016/07/21,1209.0,1209.244,1210.0,24600,1229.0,1200.5
147,2016/07/22,1187.5,1187.524,1184.0,21200,1200.0,1175.5
148,2016/07/25,1177.0,1185.541,1177.0,7400,1199.5,1177.0
149,2016/07/26,1156.0,1159.568,1158.0,20600,1170.5,1156.0
150,2016/07/27,1121.5,1138.194,1161.0,38600,1161.0,1121.5
151,2016/07/28,1102.5,1111.577,1123.0,16800,1130.0,1102.0
152,2016/07/29,1140.5,1110.444,1110.0,23000,1142.5,1100.0
153,2016/08/01,1165.0,1168.388,1142.5,18800,1194.5,1130.0
154,2016/08/02,1160.5,1153.204,1160.5,17200,1179.0,1135.0
155,2016/08/03,1115.0,1127.91,1145.0,23400,1145.0,1111.0
156,2016/08/04,1112.5,1115.086,1118.0,22200,1130.0,1107.5
157,2016/08/05,1123.0,1125.938,1107.5,22600,1140.0,1107.5
158,2016/08/08,1100.5,1115.436,1149.0,22000,1149.5,1100.5
159,2016/08/09,1119.5,1116.274,1115.0,8400,1124.5,1103.5
160,2016/08/10,1132.0,1128.907,1111.5,21400,1161.5,1110.0
161,2016/08/12,1189.5,1171.748,1132.5,25000,1190.0,1132.5
162,2016/08/15,1439.5,1439.5,1439.5,78400,1439.5,1439.5
163,2016/08/16,1460.0,1443.132,1439.5,250000,1492.5,1385.0
164,2016/08/17,1421.5,1448.464,1470.0,84000,1470.0,1415.0
165,2016/08/18,1366.0,1334.635,1421.5,92400,1421.5,1277.0
166,2016/08/19,1380.5,1371.482,1341.0,32600,1389.0,1341.0
167,2016/08/22,1362.5,1375.054,1396.0,28000,1414.0,1333.0
168,2016/08/23,1349.5,1346.52,1349.0,24600,1375.0,1325.0
169,2016/08/24,1470.0,1420.81,1374.5,81000,1470.0,1355.0
170,2016/08/25,1427.0,1432.812,1460.0,38800,1460.0,1412.5
171,2016/08/26,1349.5,1363.273,1415.0,30800,1417.5,1340.0
172,2016/08/29,1343.0,1342.857,1355.0,15400,1366.5,1325.5
173,2016/08/30,1382.5,1385.738,1331.0,25200,1412.0,1331.0
174,2016/08/31,1333.5,1338.361,1347.5,23800,1356.0,1326.5
175,2016/09/01,1371.5,1373.759,1355.0,33600,1400.0,1349.5
176,2016/09/02,1358.5,1381.448,1371.5,21000,1399.5,1356.5
177,2016/09/05,1450.0,1432.758,1399.0,71400,1458.5,1381.0
178,2016/09/06,1427.5,1430.204,1450.0,33800,1454.5,1405.5
179,2016/09/07,1510.0,1481.905,1427.5,123600,1520.0,1427.5
180,2016/09/08,1575.0,1510.288,1490.5,77000,1575.0,1456.5
181,2016/09/09,1552.5,1566.635,1575.0,78000,1595.0,1527.5
182,2016/09/12,1457.5,1477.066,1491.5,92400,1517.5,1440.0
183,2016/09/13,1530.0,1492.557,1499.0,38400,1530.0,1465.0
184,2016/09/14,1452.5,1478.291,1500.0,56000,1522.5,1441.0
185,2016/09/15,1474.0,1447.526,1440.0,23000,1474.0,1420.5
186,2016/09/16,1438.5,1446.281,1460.0,27400,1469.5,1433.0
187,2016/09/20,1382.0,1398.421,1430.0,46600,1433.0,1375.0
188,2016/09/21,1378.5,1359.614,1357.5,28200,1387.0,1345.0
189,2016/09/23,1457.5,1428.533,1380.0,39600,1459.5,1380.0
190,2016/09/26,1461.5,1458.07,1475.0,28400,1480.0,1436.0
191,2016/09/27,1490.0,1467.99,1461.0,30000,1495.0,1440.0
192,2016/09/28,1490.0,1475.707,1485.0,24600,1492.0,1451.0
193,2016/09/29,1470.0,1482.131,1494.0,26800,1502.5,1460.5
194,2016/09/30,1421.0,1434.905,1450.0,30400,1450.0,1421.0
195,2016/10/03,1460.0,1433.811,1431.0,27000,1460.0,1411.0
196,2016/10/04,1472.0,1463.061,1460.0,16400,1479.5,1447.5
197,2016/10/05,1484.5,1490.164,1480.0,33600,1515.0,1470.0
198,2016/10/06,1485.0,1505.65,1510.0,70200,1535.0,1485.0
199,2016/10/07,1480.0,1475.48,1485.0,29200,1491.0,1455.0
200,2016/10/11,1498.0,1507.364,1500.0,23600,1525.0,1495.0
201,2016/10/12,1469.0,1476.789,1487.5,20400,1490.0,1455.5
202,2016/10/13,1466.0,1469.695,1475.0,16400,1489.5,1460.0
203,2016/10/14,1453.0,1446.397,1460.5,28200,1460.5,1400.5
204,2016/10/17,1446.0,1438.4,1453.0,20000,1473.0,1423.0
205,2016/10/18,1493.5,1473.266,1445.5,34600,1497.5,1435.5
206,2016/10/19,1540.0,1521.238,1490.0,49200,1542.5,1485.0
207,2016/10/20,1522.5,1575.836,1550.0,111800,1615.0,1515.0
208,2016/10/21,1489.5,1495.761,1525.0,41800,1525.0,1478.5
209,2016/10/24,1545.0,1518.597,1510.0,36000,1565.0,1490.0
210,2016/10/25,1597.5,1528.586,1560.0,88400,1597.5,1488.0
211,2016/10/26,1555.0,1637.428,1620.0,194600,1715.0,1540.0
212,2016/10/27,1707.5,1640.245,1580.0,112400,1710.0,1560.0
213,2016/10/28,1712.5,1733.813,1710.0,213200,1802.5,1672.5
214,2016/10/31,1747.5,1709.642,1680.0,64200,1762.5,1650.0
215,2016/11/01,1710.0,1716.896,1770.0,54600,1772.5,1685.0
216,2016/11/02,1620.0,1620.123,1670.0,85600,1675.0,1577.5
217,2016/11/04,1667.5,1606.456,1575.0,58400,1667.5,1550.0
218,2016/11/07,1635.0,1664.624,1675.0,42600,1710.0,1622.5
219,2016/11/08,1620.0,1630.833,1655.0,18000,1655.0,1610.0
220,2016/11/09,1625.0,1550.313,1650.0,103000,1672.5,1477.5
221,2016/11/10,1755.0,1705.206,1660.0,133800,1760.0,1637.5
222,2016/11/11,1762.5,1723.063,1727.5,106600,1792.5,1655.0
223,2016/11/14,1795.0,1771.699,1760.0,83600,1825.0,1725.0
224,2016/11/15,1582.5,1617.962,1697.5,232800,1697.5,1537.5
225,2016/11/16,1602.5,1620.464,1607.5,83000,1650.0,1595.0
226,2016/11/17,1630.0,1641.756,1607.5,69200,1675.0,1607.5
227,2016/11/18,1605.0,1606.104,1637.5,51200,1650.0,1570.0
228,2016/11/21,1545.0,1567.454,1625.0,65800,1625.0,1540.0
229,2016/11/22,1520.0,1508.964,1537.5,89200,1537.5,1490.5
230,2016/11/24,1494.5,1506.947,1535.0,92800,1535.0,1482.5
231,2016/11/25,1470.0,1480.243,1517.5,86000,1517.5,1454.5
232,2016/11/28,1520.0,1493.474,1489.5,64200,1527.5,1455.0
233,2016/11/29,1570.0,1561.141,1540.0,64400,1590.0,1530.0
234,2016/11/30,1527.5,1533.513,1575.0,59800,1580.0,1495.0
235,2016/12/01,1493.0,1500.146,1527.5,55400,1527.5,1475.5
236,2016/12/02,1446.5,1453.578,1484.5,64400,1484.5,1432.5
237,2016/12/05,1463.0,1445.447,1425.0,28200,1470.5,1418.0
238,2016/12/06,1434.0,1440.032,1475.0,28600,1475.0,1425.0
239,2016/12/07,1444.5,1443.197,1437.0,16800,1459.5,1435.0
240,2016/12/08,1422.0,1432.666,1456.5,30200,1456.5,1419.5
241,2016/12/09,1467.0,1466.309,1423.5,32000,1490.0,1423.5
242,2016/12/12,1510.0,1502.312,1467.5,64200,1525.0,1467.5
243,2016/12/13,1505.0,1524.422,1545.0,71800,1547.5,1502.5
244,2016/12/14,1475.0,1486.908,1507.5,40000,1510.0,1463.5
245,2016/12/15,1485.0,1466.397,1465.0,37000,1485.0,1455.5
246,2016/12/16,1462.0,1479.051,1487.0,29400,1498.0,1462.0
247,2016/12/19,1455.5,1459.231,1463.0,23400,1479.0,1455.0
248,2016/12/20,1474.5,1449.801,1453.0,33200,1474.5,1437.5
249,2016/12/21,1460.0,1487.25,1490.5,59200,1505.0,1450.0
250,2016/12/22,1451.5,1465.447,1484.0,57000,1484.0,1451.0
251,2016/12/26,1545.0,1512.608,1476.5,109800,1562.5,1467.0
252,2016/12/27,1550.0,1553.854,1572.5,84200,1585.0,1522.5
253,2016/12/28,1545.0,1561.086,1572.5,35000,1572.5,1545.0
254,2016/12/29,1510.0,1514.889,1550.0,33400,1550.0,1499.5
255,2016/12/30,1525.0,1521.013,1499.5,24000,1542.5,1499.5
256,2017/01/04,1557.5,1559.341,1570.0,25800,1570.0,1550.0
257,2017/01/05,1620.0,1604.725,1560.0,107400,1640.0,1550.0
258,2017/01/06,1607.5,1622.668,1622.5,41800,1640.0,1607.5
259,2017/01/10,1640.0,1609.089,1640.0,51600,1640.0,1567.5
260,2017/01/11,1590.0,1603.261,1625.0,32200,1625.0,1585.0
261,2017/01/12,1565.0,1574.344,1597.5,24400,1597.5,1555.0
262,2017/01/13,1597.5,1584.936,1552.5,15600,1600.0,1552.5
263,2017/01/16,1565.0,1575.912,1600.0,17000,1600.0,1562.5
264,2017/01/17,1582.5,1575.241,1565.0,16600,1592.5,1552.5
265,2017/01/18,1670.0,1658.329,1617.5,150200,1710.0,1597.5
266,2017/01/19,1645.0,1677.614,1675.0,61400,1707.5,1640.0
267,2017/01/20,1650.0,1651.625,1637.5,24000,1670.0,1635.0
268,2017/01/23,1672.5,1670.064,1685.0,31200,1685.0,1655.0
269,2017/01/24,1700.0,1694.241,1677.5,63200,1737.5,1650.0
270,2017/01/25,1680.0,1678.433,1685.0,43400,1700.0,1660.0
271,2017/01/26,1707.5,1693.586,1682.5,33600,1707.5,1665.0
272,2017/01/27,1717.5,1723.264,1732.5,47800,1737.5,1705.0
273,2017/01/30,1732.5,1734.746,1720.0,35400,1750.0,1715.0
274,2017/01/31,1717.5,1721.523,1710.0,43000,1730.0,1707.5
275,2017/02/01,1725.0,1727.907,1705.0,27000,1742.5,1705.0
276,2017/02/02,1715.0,1732.177,1725.0,23200,1745.0,1715.0
277,2017/02/03,1760.0,1751.894,1720.0,39600,1782.5,1717.5
278,2017/02/06,1770.0,1776.028,1790.0,24800,1790.0,1757.5
279,2017/02/07,1855.0,1816.635,1772.5,119600,1875.0,1765.0
280,2017/02/08,1850.0,1872.176,1900.0,95800,1912.5,1832.5
281,2017/02/09,1835.0,1835.05,1857.5,50200,1857.5,1807.5
282,2017/02/10,1817.5,1834.878,1850.0,53200,1855.0,1817.5
283,2017/02/13,1765.0,1721.248,1737.5,134600,1767.5,1660.0
284,2017/02/14,1670.0,1701.255,1750.0,92400,1750.0,1665.0
285,2017/02/15,1702.5,1682.825,1690.0,40000,1725.0,1665.0
286,2017/02/16,1687.5,1689.379,1715.0,30600,1715.0,1675.0
287,2017/02/17,1665.0,1672.442,1682.5,34600,1687.5,1655.0
288,2017/02/20,1692.5,1684.348,1665.0,32200,1717.5,1665.0
289,2017/02/21,1795.0,1764.778,1735.0,92400,1802.5,1700.0
290,2017/02/22,1772.5,1776.474,1795.0,39000,1795.0,1762.5
291,2017/02/23,1770.0,1768.102,1775.0,26600,1787.5,1750.0
292,2017/02/24,1810.0,1810.042,1775.0,72000,1837.5,1775.0
293,2017/02/27,1790.0,1805.579,1812.5,32800,1845.0,1785.0
294,2017/02/28,1777.5,1792.917,1810.0,39600,1820.0,1777.5
295,2017/03/01,1865.0,1844.866,1777.5,115200,1887.5,1775.0
296,2017/03/02,1885.0,1889.348,1882.5,74400,1907.5,1872.5
297,2017/03/03,2025.0,1985.415,1912.5,295200,2060.0,1912.5
298,2017/03/06,2010.0,2006.836,2030.0,107600,2042.5,1967.5
299,2017/03/07,2007.5,2005.781,2025.0,82000,2025.0,1990.0
300,2017/03/08,2137.5,2115.264,2012.5,221400,2185.0,1995.0
301,2017/03/09,2110.0,2140.951,2120.0,128800,2200.0,2087.5
302,2017/03/10,2102.5,2096.148,2110.0,56600,2130.0,2067.5
303,2017/03/13,1965.0,2033.234,2155.0,133600,2155.0,1965.0
304,2017/03/14,1997.5,1944.833,1915.0,81000,2015.0,1902.5
305,2017/03/15,1930.0,1927.064,1980.0,68800,1982.5,1875.0
306,2017/03/16,2070.0,2026.06,1950.0,89600,2100.0,1932.5
307,2017/03/17,2020.0,2031.147,2050.0,55800,2087.5,1992.5
308,2017/03/21,2025.0,1998.412,2020.0,31800,2042.5,1945.0
309,2017/03/22,1935.0,1955.404,1960.0,52000,1985.0,1925.0
310,2017/03/23,2025.0,1986.807,1937.5,54800,2042.5,1932.5
311,2017/03/24,2007.5,2006.94,2025.0,38400,2040.0,1980.0
312,2017/03/27,1957.5,1982.645,2007.5,34400,2025.0,1955.0
313,2017/03/28,2012.5,2008.05,1952.5,51800,2062.5,1952.5
314,2017/03/29,2092.5,2086.681,2030.0,81800,2120.0,2015.0
315,2017/03/30,2175.0,2130.0,2102.5,77000,2175.0,2090.0
316,2017/03/31,2122.5,2152.374,2175.0,59600,2190.0,2110.0
317,2017/04/03,2052.5,2071.955,2157.5,37600,2157.5,2030.0
318,2017/04/04,1910.0,1958.126,2027.5,87800,2035.0,1900.0
319,2017/04/05,1925.0,1923.196,1930.0,47400,1982.5,1885.0
320,2017/04/06,1850.0,1856.497,1925.0,37400,1925.0,1832.5
321,2017/04/07,1910.0,1879.183,1885.0,30600,1952.5,1827.5
322,2017/04/10,1900.0,1903.111,1900.0,9000,1920.0,1887.5
323,2017/04/11,1857.5,1862.769,1917.5,18600,1917.5,1837.5
324,2017/04/12,1707.5,1720.038,1752.5,92800,1787.5,1690.0
325,2017/04/13,1722.5,1668.248,1622.5,44800,1737.5,1605.0
326,2017/04/14,1690.0,1707.626,1737.5,27800,1737.5,1672.5
327,2017/04/17,1780.0,1754.706,1700.0,27200,1802.5,1700.0
328,2017/04/18,1817.5,1842.317,1850.0,30000,1895.0,1800.0
329,2017/04/19,1822.5,1820.777,1785.0,14800,1842.5,1780.0
330,2017/04/20,1807.5,1809.89,1807.5,18200,1830.0,1795.0
331,2017/04/21,1805.0,1811.631,1840.0,9200,1840.0,1800.0
332,2017/04/24,1775.0,1792.059,1810.0,23800,1812.5,1765.0
333,2017/04/25,1807.5,1795.343,1765.0,14600,1812.5,1765.0
334,2017/04/26,1832.5,1852.35,1827.5,26600,1887.5,1825.0
335,2017/04/27,1857.5,1841.55,1817.5,20000,1862.5,1812.5
336,2017/04/28,1865.0,1855.082,1857.5,12200,1880.0,1840.0
337,2017/05/01,1915.0,1900.833,1867.5,36600,1920.0,1857.5
338,2017/05/02,1927.5,1946.557,1942.5,48800,1972.5,1915.0
339,2017/05/08,1975.0,1964.576,1972.5,22400,1982.5,1945.0
340,2017/05/09,1965.0,1961.015,1975.0,26600,1982.5,1935.0
341,2017/05/10,1950.0,1956.355,1962.5,16600,1970.0,1950.0
342,2017/05/11,1995.0,1964.445,1972.5,39600,1995.0,1930.0
343,2017/05/12,2035.0,2004.333,1992.5,63000,2045.0,1945.0
344,2017/05/15,1952.5,1923.616,1907.5,69000,1972.5,1872.5
345,2017/05/16,1912.5,1919.791,1967.5,35800,1967.5,1890.0
346,2017/05/17,1905.0,1901.839,1910.0,31000,1912.5,1887.5
347,2017/05/18,1902.5,1853.042,1850.0,45200,1902.5,1810.0
348,2017/05/19,1947.5,1925.424,1887.5,36600,1947.5,1885.0
349,2017/05/22,1987.5,1972.483,1965.0,30000,1987.5,1950.0
350,2017/05/23,1975.0,1972.548,1990.0,21000,1992.5,1952.5
351,2017/05/24,2010.0,1996.496,1975.0,51800,2010.0,1972.5
352,2017/05/25,2010.0,2008.744,2005.0,41400,2032.5,1985.0
353,2017/05/26,1995.0,2005.117,2010.0,38400,2017.5,1995.0
354,2017/05/29,1992.5,2003.394,2000.0,27400,2017.5,1992.5
355,2017/05/30,1990.0,1991.719,1997.5,67200,2012.5,1945.0
356,2017/05/31,2037.5,2016.524,2000.0,46600,2037.5,2000.0
357,2017/06/01,2092.5,2079.672,2050.0,76200,2127.5,2047.5
358,2017/06/02,2062.5,2074.371,2100.0,30200,2110.0,2050.0
359,2017/06/05,2085.0,2092.755,2097.5,29400,2115.0,2077.5
360,2017/06/06,2100.0,2050.431,2082.5,52200,2100.0,2005.0
361,2017/06/07,2107.5,2084.396,2100.0,35600,2107.5,2052.5
362,2017/06/08,2072.5,2092.346,2095.0,16200,2105.0,2072.5
363,2017/06/09,2122.5,2123.578,2092.5,56600,2160.0,2080.0
364,2017/06/12,2120.0,2116.637,2137.5,38800,2137.5,2090.0
365,2017/06/13,2127.5,2109.56,2105.0,28400,2140.0,2072.5
366,2017/06/14,2137.5,2114.5,2110.0,20000,2137.5,2092.5
367,2017/06/15,2132.5,2123.889,2135.0,28800,2140.0,2100.0
368,2017/06/16,2115.0,2144.94,2130.0,50200,2185.0,2107.5
369,2017/06/19,2140.0,2122.855,2120.0,35200,2150.0,2090.0
370,2017/06/20,2177.5,2169.25,2172.5,36000,2185.0,2135.0
371,2017/06/21,2262.5,2222.697,2182.5,106400,2285.0,2150.0
372,2017/06/22,2435.0,2347.886,2312.5,136200,2435.0,2275.0
373,2017/06/23,2397.5,2385.424,2470.0,115600,2470.0,2322.5
374,2017/06/26,2487.5,2429.704,2377.5,81000,2500.0,2325.0
375,2017/06/27,2430.0,2433.528,2450.0,77800,2477.5,2400.0
376,2017/06/28,2315.0,2338.036,2405.0,77400,2405.0,2297.5
377,2017/06/29,2280.0,2304.524,2325.0,41000,2345.0,2265.0
378,2017/06/30,2260.0,2232.354,2217.5,44600,2270.0,2197.5
379,2017/07/03,2205.0,2223.237,2270.0,34600,2270.0,2195.0
380,2017/07/04,2105.0,2148.265,2210.0,75200,2230.0,2085.0
381,2017/07/05,2135.0,2119.703,2100.0,40400,2165.0,2067.5
382,2017/07/06,2155.0,2152.84,2160.0,29400,2180.0,2120.0
383,2017/07/07,2182.5,2154.929,2150.0,14000,2182.5,2122.5
384,2017/07/10,2200.0,2193.512,2200.0,24200,2215.0,2162.5
385,2017/07/11,2190.0,2194.245,2205.0,21200,2217.5,2170.0
386,2017/07/12,2360.0,2290.852,2225.0,81600,2370.0,2202.5
387,2017/07/13,2332.5,2329.353,2342.5,34000,2365.0,2300.0
388,2017/07/14,2295.0,2293.214,2340.0,16800,2340.0,2275.0
389,2017/07/18,2345.0,2302.76,2295.0,21200,2345.0,2260.0
390,2017/07/19,2425.0,2413.636,2370.0,66000,2435.0,2367.5
391,2017/07/20,2395.0,2426.644,2425.0,64800,2470.0,2377.5
392,2017/07/21,2345.0,2366.643,2377.5,42000,2407.5,2327.5
393,2017/07/24,2322.5,2314.426,2325.0,29600,2367.5,2262.5
394,2017/07/25,2320.0,2309.123,2322.5,15400,2332.5,2272.5
395,2017/07/26,2312.5,2309.576,2337.5,11800,2337.5,2292.5
396,2017/07/27,2355.0,2339.602,2337.5,27600,2372.5,2290.0
397,2017/07/28,2317.5,2324.375,2357.5,24000,2360.0,2305.0
398,2017/07/31,2262.5,2265.994,2302.5,33200,2322.5,2230.0
399,2017/08/01,2207.5,2226.194,2262.5,35600,2277.5,2200.0
400,2017/08/02,2275.0,2279.357,2300.0,20200,2312.5,2237.5
401,2017/08/03,2210.0,2238.876,2295.0,25800,2295.0,2202.5
402,2017/08/04,2340.0,2299.553,2245.0,32400,2362.5,2227.5
403,2017/08/07,2450.0,2386.423,2362.5,49200,2450.0,2322.5
404,2017/08/08,2387.5,2414.051,2455.0,37400,2470.0,2352.5
405,2017/08/09,2340.0,2344.809,2387.5,31400,2387.5,2312.5
406,2017/08/10,2267.5,2300.177,2340.0,22600,2345.0,2257.5
407,2017/08/14,2265.0,2242.896,2250.0,32800,2290.0,2200.0
408,2017/08/15,2435.0,2416.505,2300.0,130600,2462.5,2295.0
409,2017/08/16,2685.0,2596.073,2450.0,214000,2705.0,2442.5
410,2017/08/17,2710.0,2652.883,2650.0,158200,2730.0,2560.0
411,2017/08/18,2760.0,2745.58,2650.0,122400,2850.0,2625.0
412,2017/08/21,2835.0,2803.64,2770.0,86000,2870.0,2700.0
413,2017/08/22,2710.0,2744.652,2785.0,112200,2835.0,2625.0
414,2017/08/23,3035.0,3052.097,2750.0,353400,3210.0,2715.0
415,2017/08/24,3170.0,3006.51,3045.0,274200,3195.0,2850.0
416,2017/08/25,2950.0,3018.819,3120.0,159200,3125.0,2930.0
417,2017/08/28,3100.0,3015.009,3000.0,106400,3100.0,2860.0
418,2017/08/29,3040.0,3060.856,3040.0,58400,3120.0,3025.0
419,2017/08/30,2990.0,3002.023,3090.0,77600,3090.0,2945.0
420,2017/08/31,2990.0,3019.324,2995.0,75400,3090.0,2975.0
421,2017/09/01,3045.0,3030.058,2985.0,52200,3085.0,2930.0
422,2017/09/04,2950.0,3003.193,3060.0,102400,3150.0,2895.0
423,2017/09/05,2825.0,2856.073,2960.0,114600,3010.0,2700.0
424,2017/09/06,2845.0,2814.215,2710.0,48400,2880.0,2710.0
425,2017/09/07,2845.0,2816.147,2870.0,43600,2875.0,2725.0
426,2017/09/08,2800.0,2818.784,2795.0,29600,2900.0,2765.0
427,2017/09/11,2960.0,2954.358,2850.0,59200,3035.0,2850.0
428,2017/09/12,2975.0,3005.32,3060.0,34400,3070.0,2950.0
429,2017/09/13,2940.0,2964.323,2970.0,19200,3015.0,2940.0
430,2017/09/14,2880.0,2913.496,2970.0,26600,2975.0,2870.0
431,2017/09/15,2885.0,2863.962,2830.0,26000,2910.0,2830.0
432,2017/09/19,2950.0,2963.478,2985.0,23000,2985.0,2940.0
433,2017/09/20,2930.0,2919.134,2945.0,25400,2965.0,2865.0
434,2017/09/21,2850.0,2896.952,2935.0,45600,2955.0,2830.0
435,2017/09/22,2750.0,2764.596,2815.0,59400,2840.0,2720.0
436,2017/09/25,2835.0,2800.492,2740.0,24400,2835.0,2740.0
437,2017/09/26,2830.0,2813.445,2825.0,23800,2850.0,2755.0
438,2017/09/27,2830.0,2812.643,2815.0,14000,2845.0,2780.0
439,2017/09/28,2825.0,2822.353,2880.0,17000,2880.0,2780.0
440,2017/09/29,2755.0,2771.549,2830.0,22600,2830.0,2725.0
441,2017/10/02,2770.0,2779.066,2740.0,18200,2810.0,2740.0
442,2017/10/03,2750.0,2758.068,2770.0,8800,2770.0,2740.0
443,2017/10/04,2645.0,2684.355,2765.0,43400,2770.0,2630.0
444,2017/10/05,2605.0,2609.182,2655.0,33000,2665.0,2570.0
445,2017/10/06,2590.0,2567.426,2585.0,20200,2610.0,2530.0
446,2017/10/10,2665.0,2626.046,2615.0,22000,2675.0,2575.0
447,2017/10/11,2590.0,2624.44,2695.0,23200,2695.0,2575.0
448,2017/10/12,2525.0,2552.774,2585.0,29200,2590.0,2515.0
449,2017/10/13,2500.0,2505.931,2525.0,20400,2530.0,2485.0
450,2017/10/16,2472.5,2489.669,2500.0,24200,2505.0,2457.5
451,2017/10/17,2525.0,2443.281,2460.0,51200,2525.0,2387.5
452,2017/10/18,2470.0,2474.392,2500.0,22200,2505.0,2450.0
453,2017/10/19,2442.5,2450.87,2470.0,13800,2472.5,2432.5
454,2017/10/20,2430.0,2420.123,2435.0,32600,2440.0,2397.5
455,2017/10/23,2500.0,2488.648,2487.5,24400,2525.0,2445.0
456,2017/10/24,2620.0,2578.975,2510.0,48800,2630.0,2500.0
457,2017/10/25,2525.0,2550.188,2595.0,53200,2605.0,2500.0
458,2017/10/26,2530.0,2540.171,2520.0,17600,2580.0,2520.0
459,2017/10/27,2560.0,2553.165,2540.0,15800,2575.0,2520.0
460,2017/10/30,2600.0,2569.461,2555.0,20400,2600.0,2540.0
461,2017/10/31,2615.0,2602.7,2620.0,20000,2625.0,2555.0
462,2017/11/01,2610.0,2596.667,2615.0,25800,2625.0,2580.0
463,2017/11/02,2540.0,2567.525,2605.0,19800,2625.0,2535.0
464,2017/11/06,2525.0,2527.061,2555.0,18200,2555.0,2490.0
465,2017/11/07,2550.0,2520.605,2505.0,19000,2550.0,2490.0
466,2017/11/08,2515.0,2519.643,2550.0,8400,2550.0,2505.0
467,2017/11/09,2500.0,2501.861,2515.0,26600,2525.0,2477.5
468,2017/11/10,2575.0,2535.962,2500.0,23400,2575.0,2480.0
469,2017/11/13,2550.0,2580.667,2595.0,27000,2600.0,2550.0
470,2017/11/14,2655.0,2714.574,2700.0,178400,2845.0,2600.0
471,2017/11/15,2585.0,2575.607,2645.0,54400,2645.0,2495.0
472,2017/11/16,2665.0,2597.278,2555.0,36000,2665.0,2500.0
473,2017/11/17,2825.0,2792.484,2690.0,94600,2890.0,2690.0
474,2017/11/20,2940.0,2910.696,2875.0,61800,2960.0,2850.0
475,2017/11/21,2915.0,2914.204,2940.0,40200,2940.0,2855.0
476,2017/11/22,3015.0,2991.061,2955.0,75400,3035.0,2950.0
477,2017/11/24,3010.0,3002.5,3025.0,37600,3045.0,2950.0
478,2017/11/27,2905.0,2935.48,2995.0,50000,3000.0,2875.0
479,2017/11/28,2895.0,2868.448,2905.0,29000,2905.0,2835.0
480,2017/11/29,2870.0,2868.962,2895.0,21200,2895.0,2845.0
481,2017/11/30,2910.0,2834.39,2855.0,41000,2950.0,2760.0
482,2017/12/01,2855.0,2887.574,2910.0,13600,2940.0,2835.0
483,2017/12/04,3155.0,3217.088,2920.0,364000,3355.0,2900.0
484,2017/12/05,3075.0,3036.848,3065.0,150400,3150.0,2925.0
485,2017/12/06,2950.0,3040.011,3115.0,93000,3130.0,2940.0
486,2017/12/07,3045.0,3031.594,3015.0,41400,3080.0,2965.0
487,2017/12/08,3060.0,3031.06,3080.0,36800,3095.0,2965.0
488,2017/12/11,3270.0,3249.978,3060.0,179000,3345.0,3060.0
489,2017/12/12,3405.0,3423.591,3320.0,179600,3550.0,3275.0
490,2017/12/13,3545.0,3467.568,3395.0,125000,3575.0,3300.0
491,2017/12/14,3555.0,3504.622,3550.0,71400,3575.0,3435.0
492,2017/12/15,3600.0,3658.128,3575.0,162400,3800.0,3550.0
493,2017/12/18,3515.0,3626.857,3800.0,91000,3800.0,3505.0
494,2017/12/19,3630.0,3625.794,3500.0,122200,3720.0,3430.0
495,2017/12/20,3575.0,3576.213,3630.0,40400,3655.0,3535.0
496,2017/12/21,3515.0,3485.735,3580.0,70800,3595.0,3415.0
497,2017/12/22,3525.0,3506.741,3475.0,31600,3555.0,3450.0
498,2017/12/25,3480.0,3539.477,3525.0,34400,3635.0,3450.0
499,2017/12/26,3475.0,3473.803,3470.0,23400,3525.0,3445.0
500,2017/12/27,3690.0,3635.208,3475.0,52800,3700.0,3455.0
501,2017/12/28,3570.0,3647.816,3680.0,41200,3745.0,3570.0
502,2017/12/29,3550.0,3543.158,3595.0,34200,3630.0,3485.0
503,2018/01/04,3640.0,3625.379,3615.0,42200,3690.0,3535.0
504,2018/01/05,3485.0,3537.303,3675.0,76000,3675.0,3465.0
505,2018/01/09,3595.0,3523.159,3550.0,69000,3595.0,3465.0
506,2018/01/10,3680.0,3658.857,3625.0,56000,3735.0,3555.0
507,2018/01/11,3940.0,3850.36,3650.0,113800,3970.0,3615.0
508,2018/01/12,3975.0,3970.145,3970.0,76000,4050.0,3900.0
509,2018/01/15,3945.0,3963.201,4020.0,57800,4040.0,3880.0
510,2018/01/16,4245.0,4213.249,4075.0,169000,4365.0,4050.0
511,2018/01/17,4170.0,4160.807,4245.0,63200,4245.0,4075.0
512,2018/01/18,4045.0,4174.575,4270.0,87000,4380.0,4010.0
513,2018/01/19,4070.0,4059.555,3970.0,40400,4165.0,3960.0
514,2018/01/22,4360.0,4245.478,4095.0,54400,4360.0,4035.0
515,2018/01/23,4280.0,4321.219,4305.0,47600,4445.0,4270.0
516,2018/01/24,4170.0,4199.433,4330.0,65200,4345.0,4100.0
517,2018/01/25,4190.0,4172.947,4120.0,33600,4255.0,4100.0
518,2018/01/26,4160.0,4178.209,4220.0,13400,4220.0,4150.0
519,2018/01/29,4250.0,4246.059,4160.0,34000,4285.0,4160.0
520,2018/01/30,4125.0,4131.675,4245.0,39400,4245.0,4080.0
521,2018/01/31,4160.0,4106.626,4065.0,32600,4175.0,4040.0
522,2018/02/01,4165.0,4155.807,4175.0,12400,4205.0,4100.0
523,2018/02/02,4125.0,4087.8,4130.0,25000,4145.0,4040.0
524,2018/02/05,4010.0,3884.386,3975.0,57000,4035.0,3460.0
525,2018/02/06,3590.0,3552.4,3560.0,80000,3740.0,3330.0
526,2018/02/07,3530.0,3704.805,3880.0,51200,3935.0,3525.0
527,2018/02/08,3670.0,3607.79,3580.0,27600,3675.0,3550.0
528,2018/02/09,3540.0,3461.29,3345.0,38000,3550.0,3345.0
529,2018/02/13,3550.0,3605.417,3690.0,36000,3700.0,3530.0
530,2018/02/14,3545.0,3489.694,3560.0,55600,3600.0,3385.0
531,2018/02/15,4065.0,3971.81,3845.0,185600,4160.0,3665.0
532,2018/02/16,4070.0,4022.052,4050.0,53600,4115.0,3930.0
533,2018/02/19,4210.0,4186.777,4120.0,54600,4265.0,4045.0
534,2018/02/20,4595.0,4451.141,4230.0,98200,4615.0,4175.0
535,2018/02/21,4510.0,4607.172,4550.0,87000,4740.0,4510.0
536,2018/02/22,4440.0,4420.125,4485.0,56000,4535.0,4340.0
537,2018/02/23,4375.0,4414.066,4490.0,39600,4560.0,4345.0
538,2018/02/26,4495.0,4488.072,4450.0,47200,4615.0,4345.0
539,2018/02/27,4420.0,4467.367,4530.0,37600,4565.0,4400.0
540,2018/02/28,4495.0,4520.88,4385.0,28400,4600.0,4385.0
541,2018/03/01,4465.0,4526.227,4450.0,44000,4640.0,4390.0
542,2018/03/02,4440.0,4414.024,4390.0,24600,4480.0,4350.0
543,2018/03/05,4090.0,4227.325,4500.0,71400,4510.0,4090.0
544,2018/03/06,4245.0,4243.824,4240.0,30600,4300.0,4170.0
545,2018/03/07,4280.0,4262.5,4245.0,19600,4340.0,4180.0
546,2018/03/08,4365.0,4378.672,4280.0,25600,4475.0,4265.0
547,2018/03/09,4375.0,4437.031,4500.0,25600,4525.0,4355.0
548,2018/03/12,4320.0,4350.44,4440.0,18200,4450.0,4265.0
549,2018/03/13,4445.0,4387.202,4320.0,16800,4445.0,4320.0
550,2018/03/14,4385.0,4357.469,4370.0,16200,4385.0,4325.0
551,2018/03/15,4375.0,4366.288,4410.0,13200,4410.0,4330.0
552,2018/03/16,4295.0,4315.889,4385.0,18000,4385.0,4275.0
553,2018/03/19,4080.0,4086.719,4190.0,38400,4225.0,3960.0
554,2018/03/20,4020.0,3969.831,3930.0,29600,4070.0,3920.0
555,2018/03/22,4100.0,4064.568,4095.0,16200,4100.0,4010.0
556,2018/03/23,3880.0,3887.024,3840.0,42000,3955.0,3840.0
557,2018/03/26,3875.0,3806.895,3880.0,24800,3905.0,3725.0
558,2018/03/27,3890.0,3925.632,4025.0,19000,4025.0,3890.0
559,2018/03/28,3785.0,3788.154,3765.0,14900,3870.0,3755.0
560,2018/03/29,3950.0,3880.111,3835.0,18000,4045.0,3740.0
561,2018/03/30,3995.0,3976.504,4000.0,12300,4030.0,3930.0
562,2018/04/02,3905.0,3966.659,4000.0,22900,4070.0,3905.0
563,2018/04/03,3800.0,3813.077,3835.0,20800,3890.0,3775.0
564,2018/04/04,3795.0,3773.359,3835.0,19800,3835.0,3705.0
565,2018/04/05,3705.0,3741.189,3785.0,16400,3835.0,3705.0
566,2018/04/06,3610.0,3648.072,3720.0,29300,3720.0,3605.0
567,2018/04/09,3660.0,3579.144,3590.0,36200,3700.0,3495.0
568,2018/04/10,3760.0,3748.31,3695.0,28400,3820.0,3645.0
569,2018/04/11,3665.0,3699.832,3765.0,17800,3800.0,3630.0
570,2018/04/12,3775.0,3750.995,3695.0,18100,3795.0,3650.0
571,2018/04/13,3790.0,3788.886,3805.0,16600,3825.0,3750.0
572,2018/04/16,3700.0,3724.226,3775.0,15500,3795.0,3685.0
573,2018/04/17,3620.0,3631.959,3710.0,31400,3750.0,3500.0
574,2018/04/18,3670.0,3662.925,3620.0,10600,3695.0,3620.0
575,2018/04/19,3505.0,3579.754,3695.0,28500,3695.0,3505.0
576,2018/04/20,3515.0,3509.491,3510.0,21600,3560.0,3475.0
577,2018/04/23,3545.0,3536.149,3560.0,8700,3585.0,3505.0
578,2018/04/24,3515.0,3529.039,3555.0,13000,3560.0,3505.0
579,2018/04/25,3390.0,3465.345,3555.0,40600,3555.0,3380.0
580,2018/04/26,3465.0,3416.529,3405.0,17000,3470.0,3380.0
581,2018/04/27,3415.0,3440.993,3470.0,13600,3470.0,3415.0
582,2018/05/01,3385.0,3380.065,3405.0,15500,3415.0,3340.0
583,2018/05/02,3430.0,3410.889,3385.0,9000,3455.0,3355.0
584,2018/05/07,3550.0,3521.742,3480.0,19800,3570.0,3455.0
585,2018/05/08,3695.0,3633.309,3570.0,27200,3695.0,3555.0
586,2018/05/09,3795.0,3798.073,3750.0,44100,3880.0,3680.0
587,2018/05/10,3660.0,3732.665,3855.0,19700,3855.0,3655.0
588,2018/05/11,3725.0,3743.804,3685.0,16300,3790.0,3660.0
589,2018/05/14,3845.0,3845.508,3795.0,31500,3910.0,3730.0
590,2018/05/15,3760.0,3837.457,3985.0,98300,4040.0,3620.0
591,2018/05/16,3535.0,3601.987,3705.0,39000,3720.0,3510.0
592,2018/05/17,3605.0,3538.439,3540.0,34600,3640.0,3470.0
593,2018/05/18,3665.0,3607.615,3615.0,19500,3670.0,3550.0
594,2018/05/21,3895.0,3823.023,3695.0,43500,3895.0,3650.0
595,2018/05/22,3790.0,3833.232,3935.0,18100,3935.0,3770.0
596,2018/05/23,3745.0,3710.622,3720.0,19300,3775.0,3630.0
597,2018/05/24,3645.0,3650.349,3720.0,17200,3720.0,3605.0
598,2018/05/25,3560.0,3569.896,3565.0,24100,3620.0,3545.0
599,2018/05/28,3475.0,3503.374,3510.0,57500,3545.0,3465.0
600,2018/05/29,3330.0,3343.685,3370.0,181300,3370.0,3300.0
601,2018/05/30,3345.0,3304.558,3265.0,63300,3360.0,3230.0
602,2018/05/31,3320.0,3341.592,3365.0,33600,3365.0,3305.0
603,2018/06/01,3330.0,3315.042,3320.0,23900,3340.0,3280.0
604,2018/06/04,3235.0,3262.028,3310.0,39700,3320.0,3230.0
605,2018/06/05,3115.0,3163.542,3220.0,56600,3235.0,3100.0
606,2018/06/06,3150.0,3118.162,3075.0,34000,3170.0,3060.0
607,2018/06/07,3245.0,3218.137,3170.0,25500,3260.0,3170.0
608,2018/06/08,3245.0,3235.303,3205.0,19800,3275.0,3175.0
609,2018/06/11,3355.0,3317.041,3250.0,36500,3355.0,3225.0
610,2018/06/12,3375.0,3366.958,3360.0,54900,3395.0,3325.0
611,2018/06/13,3385.0,3380.86,3370.0,52900,3415.0,3335.0
612,2018/06/14,3325.0,3366.215,3365.0,32100,3390.0,3325.0
613,2018/06/15,3360.0,3352.863,3360.0,24100,3375.0,3320.0
614,2018/06/18,3395.0,3386.205,3385.0,55600,3415.0,3340.0
615,2018/06/19,3220.0,3285.362,3400.0,56700,3410.0,3175.0
616,2018/06/20,3295.0,3192.715,3205.0,49900,3300.0,3080.0
617,2018/06/21,3275.0,3302.597,3300.0,23100,3340.0,3260.0
618,2018/06/22,3210.0,3226.923,3280.0,23400,3280.0,3195.0
619,2018/06/25,3000.0,3075.621,3210.0,64100,3215.0,2996.0
620,2018/06/26,3010.0,2988.566,2979.0,37100,3050.0,2922.0
621,2018/06/27,2997.0,3002.535,3010.0,17200,3050.0,2985.0
622,2018/06/28,2913.0,2944.022,2980.0,36700,2980.0,2910.0
623,2018/06/29,2957.0,2912.822,2905.0,31400,2965.0,2877.0
624,2018/07/02,2876.0,2917.523,2959.0,19900,2959.0,2872.0
625,2018/07/03,2859.0,2885.577,2861.0,39500,2972.0,2831.0
626,2018/07/04,2881.0,2874.168,2841.0,25600,2932.0,2840.0
627,2018/07/05,2836.0,2873.293,2908.0,24200,2945.0,2829.0
628,2018/07/06,2909.0,2871.702,2832.0,22500,2930.0,2827.0
629,2018/07/09,3310.0,3162.775,3065.0,118900,3325.0,2998.0
630,2018/07/10,3180.0,3213.929,3325.0,106000,3360.0,3075.0
631,2018/07/11,3160.0,3159.225,3125.0,55500,3230.0,3080.0
632,2018/07/12,3340.0,3300.415,3225.0,79500,3380.0,3175.0
633,2018/07/13,3360.0,3363.081,3390.0,45600,3390.0,3330.0
634,2018/07/17,3325.0,3363.573,3400.0,52200,3415.0,3300.0
635,2018/07/18,3475.0,3418.908,3345.0,65000,3475.0,3340.0
636,2018/07/19,3555.0,3597.235,3500.0,123500,3710.0,3495.0
637,2018/07/20,3575.0,3513.839,3515.0,46500,3595.0,3460.0
638,2018/07/23,3580.0,3581.635,3600.0,37300,3620.0,3530.0
639,2018/07/24,3690.0,3691.573,3605.0,53400,3750.0,3605.0
640,2018/07/25,3670.0,3669.228,3695.0,29800,3700.0,3625.0
641,2018/07/26,3555.0,3571.959,3695.0,50800,3695.0,3510.0
642,2018/07/27,3545.0,3573.318,3525.0,21100,3625.0,3525.0
643,2018/07/30,3385.0,3429.748,3545.0,47700,3545.0,3360.0
644,2018/07/31,3430.0,3375.534,3330.0,38400,3475.0,3275.0
645,2018/08/01,3385.0,3419.541,3450.0,20700,3520.0,3355.0
646,2018/08/02,3360.0,3391.717,3380.0,16600,3445.0,3360.0
647,2018/08/03,3160.0,3237.785,3360.0,46500,3370.0,3155.0
648,2018/08/06,3210.0,3174.839,3160.0,21800,3245.0,3110.0
649,2018/08/07,3300.0,3245.113,3200.0,31100,3305.0,3160.0
650,2018/08/08,3425.0,3388.322,3305.0,29800,3445.0,3305.0
651,2018/08/09,3535.0,3555.3,3490.0,66600,3625.0,3465.0
652,2018/08/10,3510.0,3495.573,3470.0,34900,3565.0,3420.0
653,2018/08/13,3530.0,3556.381,3535.0,71700,3615.0,3500.0
654,2018/08/14,4230.0,4230.0,4230.0,41000,4230.0,4230.0
655,2018/08/15,4885.0,4637.245,4230.0,631600,4915.0,4145.0
656,2018/08/16,5590.0,5284.495,4745.0,610000,5590.0,4700.0
657,2018/08/17,4730.0,4951.233,5290.0,659900,5500.0,4625.0
658,2018/08/20,4345.0,4404.625,4660.0,473700,4685.0,4225.0
659,2018/08/21,4925.0,4763.522,4485.0,441800,5050.0,4435.0
660,2018/08/22,4595.0,4648.559,4825.0,248400,4910.0,4485.0
661,2018/08/23,4670.0,4790.761,4700.0,510600,5080.0,4515.0
662,2018/08/24,5120.0,4943.236,4810.0,259300,5130.0,4690.0
663,2018/08/27,5050.0,5032.705,5080.0,177100,5200.0,4915.0
664,2018/08/28,5050.0,5081.404,5140.0,164200,5270.0,4935.0
665,2018/08/29,5270.0,5293.78,4970.0,218800,5460.0,4965.0
666,2018/08/30,5160.0,5319.44,5260.0,280500,5570.0,5160.0
667,2018/08/31,5110.0,4975.107,4930.0,444200,5130.0,4890.0
668,2018/09/03,4855.0,4882.916,5050.0,189300,5100.0,4775.0
669,2018/09/04,4815.0,4839.736,4850.0,90800,4950.0,4720.0
670,2018/09/05,4895.0,4902.362,4860.0,132500,4995.0,4750.0
671,2018/09/06,4580.0,4697.804,4840.0,207600,4950.0,4535.0
672,2018/09/07,4545.0,4555.276,4500.0,128500,4635.0,4480.0
673,2018/09/10,4650.0,4615.068,4585.0,88200,4685.0,4540.0
674,2018/09/11,4900.0,4821.974,4730.0,158300,4905.0,4705.0
675,2018/09/12,4655.0,4757.648,4930.0,142200,4975.0,4635.0
676,2018/09/13,4735.0,4658.645,4630.0,101100,4740.0,4560.0
677,2018/09/14,4810.0,4821.297,4720.0,124900,4940.0,4720.0
678,2018/09/18,4930.0,4863.159,4780.0,104000,4965.0,4690.0
679,2018/09/19,4870.0,4905.088,4965.0,102800,5030.0,4810.0
680,2018/09/20,5280.0,5161.334,4920.0,253400,5360.0,4880.0
681,2018/09/21,5180.0,5195.529,5250.0,135100,5270.0,5110.0
682,2018/09/25,5780.0,5610.405,5180.0,301200,5920.0,5120.0
683,2018/09/26,5850.0,5829.731,5870.0,193300,5970.0,5720.0
684,2018/09/27,5630.0,5741.79,5810.0,195000,6000.0,5540.0
685,2018/09/28,6140.0,5998.261,5770.0,299600,6150.0,5770.0
686,2018/10/01,6090.0,6043.449,6090.0,176000,6180.0,5920.0
687,2018/10/02,5730.0,5795.408,6140.0,229100,6160.0,5660.0
688,2018/10/03,5760.0,5799.664,5740.0,107100,5930.0,5690.0
689,2018/10/04,5660.0,5721.637,5890.0,78200,5890.0,5610.0
690,2018/10/05,5590.0,5526.11,5460.0,109500,5710.0,5410.0
691,2018/10/09,5590.0,5498.669,5430.0,96900,5680.0,5280.0
692,2018/10/10,5700.0,5716.264,5750.0,96100,5830.0,5600.0
693,2018/10/11,5240.0,5242.772,5200.0,229400,5450.0,5050.0
694,2018/10/12,5540.0,5399.761,5200.0,92000,5580.0,5190.0
695,2018/10/15,5380.0,5506.642,5640.0,81000,5680.0,5360.0
696,2018/10/16,5450.0,5413.183,5480.0,66300,5570.0,5260.0
697,2018/10/17,5750.0,5737.976,5710.0,101800,5800.0,5650.0
698,2018/10/18,5620.0,5783.156,5760.0,118200,5960.0,5620.0
699,2018/10/19,5710.0,5557.533,5500.0,68500,5710.0,5420.0
700,2018/10/22,5780.0,5770.541,5650.0,97900,5930.0,5540.0
701,2018/10/23,5830.0,5910.245,5700.0,191800,6110.0,5660.0
702,2018/10/24,5760.0,5876.199,6030.0,143900,6090.0,5720.0
703,2018/10/25,5120.0,5283.144,5490.0,241100,5520.0,5090.0
704,2018/10/26,4915.0,4920.912,5250.0,230800,5350.0,4605.0
705,2018/10/29,4305.0,4509.89,4890.0,313800,5060.0,4215.0
706,2018/10/30,4635.0,4520.876,4300.0,218600,4760.0,4220.0
707,2018/10/31,4990.0,4837.133,4840.0,158900,4990.0,4695.0
708,2018/11/01,4925.0,4995.9,4955.0,147300,5180.0,4850.0
709,2018/11/02,5130.0,5116.062,5030.0,107400,5210.0,4980.0
710,2018/11/05,5230.0,5160.917,5070.0,129800,5290.0,5000.0
711,2018/11/06,4960.0,5042.201,5300.0,138800,5330.0,4930.0
712,2018/11/07,5240.0,5121.862,5010.0,136400,5300.0,4885.0
713,2018/11/08,5360.0,5393.849,5380.0,137700,5520.0,5270.0
714,2018/11/09,5340.0,5355.407,5400.0,87300,5480.0,5230.0
715,2018/11/12,5280.0,5376.63,5280.0,145100,5560.0,5230.0
716,2018/11/13,5300.0,5232.66,5010.0,159200,5410.0,4980.0
717,2018/11/14,4300.0,4397.29,4620.0,444600,4650.0,4300.0
718,2018/11/15,4410.0,4355.64,4220.0,420100,4570.0,4030.0
719,2018/11/16,3970.0,4111.389,4480.0,406400,4495.0,3930.0
720,2018/11/19,3790.0,3822.545,3970.0,386100,3975.0,3720.0
721,2018/11/20,3790.0,3742.855,3750.0,296500,3815.0,3650.0
722,2018/11/21,4035.0,4060.207,3900.0,456300,4205.0,3890.0
723,2018/11/22,4055.0,4005.597,4035.0,191900,4095.0,3920.0
724,2018/11/26,4015.0,4045.205,4005.0,117000,4120.0,3965.0
725,2018/11/27,4080.0,4055.448,4040.0,142800,4130.0,3975.0
726,2018/11/28,4060.0,4044.821,4075.0,100700,4110.0,3980.0
727,2018/11/29,4105.0,4152.339,4080.0,197700,4260.0,4045.0
728,2018/11/30,4080.0,4101.161,4210.0,130900,4245.0,4005.0
729,2018/12/03,4215.0,4200.58,4200.0,162900,4295.0,4120.0
730,2018/12/04,4180.0,4231.13,4210.0,148300,4310.0,4150.0
731,2018/12/05,4175.0,4155.198,4060.0,113900,4230.0,4055.0
732,2018/12/06,4015.0,4025.351,4150.0,128400,4195.0,3935.0
733,2018/12/07,3955.0,4021.255,4090.0,81300,4135.0,3955.0
734,2018/12/10,3945.0,3964.126,3910.0,97800,4040.0,3865.0
735,2018/12/11,3900.0,4024.711,4065.0,153800,4160.0,3890.0
736,2018/12/12,4160.0,4093.01,3960.0,174400,4200.0,3950.0
737,2018/12/13,4290.0,4299.69,4230.0,143300,4345.0,4210.0
738,2018/12/14,3995.0,4127.044,4325.0,134300,4375.0,3990.0
739,2018/12/17,3790.0,3835.276,4000.0,170100,4040.0,3725.0
740,2018/12/18,3520.0,3579.008,3650.0,175400,3725.0,3465.0
741,2018/12/19,3565.0,3559.586,3520.0,103900,3680.0,3445.0
742,2018/12/20,3460.0,3519.08,3495.0,227100,3800.0,3380.0
743,2018/12/21,3275.0,3279.832,3375.0,222600,3440.0,3155.0
744,2018/12/25,2957.0,3015.365,2945.0,173500,3140.0,2915.0
745,2018/12/26,3315.0,3290.74,3120.0,151300,3460.0,3110.0
746,2018/12/27,3555.0,3570.531,3650.0,276700,3680.0,3435.0
747,2018/12/28,3250.0,3300.506,3445.0,212300,3510.0,3200.0
748,2019/01/04,3295.0,3200.075,3075.0,120400,3320.0,3075.0
749,2019/01/07,3485.0,3496.817,3435.0,102100,3595.0,3410.0
750,2019/01/08,3665.0,3669.755,3500.0,120500,3750.0,3500.0
751,2019/01/09,3530.0,3634.849,3775.0,136100,3820.0,3505.0
752,2019/01/10,3435.0,3446.32,3460.0,67800,3515.0,3395.0
753,2019/01/11,3455.0,3480.696,3455.0,47400,3555.0,3420.0
754,2019/01/15,3605.0,3562.768,3410.0,50400,3620.0,3400.0
755,2019/01/16,3680.0,3663.781,3690.0,71800,3730.0,3570.0
756,2019/01/17,3795.0,3754.387,3680.0,94600,3820.0,3610.0
757,2019/01/18,3815.0,3826.964,3830.0,89100,3935.0,3760.0
758,2019/01/21,3735.0,3786.69,3885.0,70100,3890.0,3705.0
759,2019/01/22,3705.0,3700.914,3760.0,49800,3800.0,3640.0
760,2019/01/23,3635.0,3643.197,3615.0,52400,3700.0,3580.0
761,2019/01/24,3710.0,3647.399,3615.0,51900,3725.0,3555.0
762,2019/01/25,3690.0,3749.198,3750.0,64200,3830.0,3680.0
763,2019/01/28,3690.0,3741.554,3765.0,46000,3820.0,3680.0
764,2019/01/29,3775.0,3686.034,3650.0,52700,3785.0,3570.0
765,2019/01/30,3605.0,3638.577,3720.0,51300,3730.0,3590.0
766,2019/01/31,3770.0,3753.786,3710.0,61800,3805.0,3670.0
767,2019/02/01,3740.0,3764.522,3800.0,51300,3845.0,3705.0
768,2019/02/04,3810.0,3819.517,3765.0,65200,3880.0,3760.0
769,2019/02/05,3835.0,3845.718,3820.0,55000,3915.0,3780.0
770,2019/02/06,3845.0,3822.56,3815.0,58400,3870.0,3780.0
771,2019/02/07,3710.0,3734.848,3845.0,52500,3845.0,3675.0
772,2019/02/08,3590.0,3626.307,3690.0,83000,3700.0,3540.0
773,2019/02/12,3680.0,3667.504,3640.0,59700,3705.0,3605.0
774,2019/02/13,3795.0,3752.39,3650.0,124700,3825.0,3650.0
775,2019/02/14,4495.0,4494.631,4495.0,169200,4495.0,4450.0
776,2019/02/15,4490.0,4578.468,4565.0,414600,4770.0,4435.0
777,2019/02/18,4665.0,4688.921,4700.0,153400,4770.0,4590.0
778,2019/02/19,5000.0,4947.285,4690.0,274600,5150.0,4660.0
779,2019/02/20,5010.0,5041.032,5100.0,150200,5220.0,4855.0
780,2019/02/21,4925.0,4955.293,5020.0,124700,5040.0,4835.0
781,2019/02/22,5150.0,5095.908,4960.0,137100,5190.0,4905.0
782,2019/02/25,5150.0,5172.979,5230.0,98700,5300.0,5080.0
783,2019/02/26,5140.0,5093.371,5140.0,61400,5160.0,5000.0
784,2019/02/27,5180.0,5142.714,5100.0,60800,5200.0,5070.0
785,2019/02/28,5050.0,5046.622,5120.0,81400,5140.0,4980.0
786,2019/03/01,5040.0,5006.298,5010.0,70100,5090.0,4950.0
787,2019/03/04,5170.0,5150.561,5060.0,78500,5240.0,5040.0
788,2019/03/05,5190.0,5131.97,5080.0,66500,5250.0,5030.0
789,2019/03/06,5090.0,5077.183,5170.0,49700,5170.0,5030.0
790,2019/03/07,4915.0,4929.35,4970.0,96900,5000.0,4880.0
791,2019/03/08,4700.0,4692.645,4775.0,129700,4835.0,4590.0
792,2019/03/11,4875.0,4798.574,4710.0,131500,4915.0,4590.0
793,2019/03/12,4910.0,4910.08,4975.0,99800,4985.0,4840.0
794,2019/03/13,5100.0,5024.408,4910.0,125000,5130.0,4895.0
795,2019/03/14,5130.0,5137.223,5150.0,87500,5220.0,5060.0
796,2019/03/15,5400.0,5337.64,5160.0,132200,5440.0,5160.0
797,2019/03/18,5400.0,5454.355,5530.0,110000,5580.0,5350.0
798,2019/03/19,5400.0,5402.85,5450.0,59300,5450.0,5360.0
799,2019/03/20,5410.0,5502.367,5430.0,73100,5600.0,5400.0
800,2019/03/22,5360.0,5380.023,5420.0,44000,5460.0,5350.0
801,2019/03/25,5160.0,5126.928,5060.0,72600,5240.0,5010.0
802,2019/03/26,5260.0,5210.623,5160.0,51400,5300.0,5090.0
803,2019/03/27,5480.0,5443.754,5380.0,87100,5530.0,5290.0
804,2019/03/28,5430.0,5441.002,5500.0,57900,5540.0,5350.0
805,2019/03/29,5420.0,5395.676,5450.0,70300,5480.0,5280.0
806,2019/04/01,5390.0,5431.642,5490.0,48100,5540.0,5350.0
807,2019/04/02,5150.0,5250.87,5390.0,67800,5410.0,5150.0
808,2019/04/03,5280.0,5264.52,5150.0,39600,5330.0,5150.0
809,2019/04/04,5120.0,5167.557,5240.0,39300,5270.0,5100.0
810,2019/04/05,5130.0,5090.398,5120.0,32700,5160.0,5040.0
811,2019/04/08,5170.0,5186.63,5190.0,36200,5250.0,5130.0
812,2019/04/09,5090.0,5120.114,5160.0,35100,5240.0,5080.0
813,2019/04/10,5000.0,5018.237,5010.0,48200,5090.0,4965.0
814,2019/04/11,5020.0,4989.586,4980.0,30200,5030.0,4950.0
815,2019/04/12,4985.0,4983.655,5030.0,39400,5030.0,4945.0
816,2019/04/15,5160.0,5078.362,4970.0,63800,5170.0,4960.0
817,2019/04/16,5180.0,5167.0,5110.0,38000,5220.0,5090.0
818,2019/04/17,5060.0,5030.732,5180.0,74500,5200.0,4975.0
819,2019/04/18,4800.0,4875.51,4990.0,101900,4995.0,4795.0
820,2019/04/19,4955.0,5029.627,4900.0,75100,5150.0,4895.0
821,2019/04/22,4925.0,4957.744,5000.0,34800,5010.0,4895.0
822,2019/04/23,4930.0,4918.229,4900.0,31900,4970.0,4875.0
823,2019/04/24,4995.0,5011.614,4890.0,31900,5070.0,4890.0
824,2019/04/25,5000.0,5000.238,4975.0,44100,5040.0,4945.0
825,2019/04/26,5100.0,5009.352,4935.0,47100,5100.0,4895.0
826,2019/05/07,5240.0,5212.793,5080.0,55500,5280.0,5080.0
827,2019/05/08,5370.0,5332.963,5140.0,76600,5440.0,5130.0
828,2019/05/09,5460.0,5523.567,5410.0,135400,5670.0,5360.0
829,2019/05/10,5470.0,5473.686,5460.0,101200,5600.0,5300.0
830,2019/05/13,5560.0,5571.787,5600.0,223300,5700.0,5340.0
831,2019/05/14,4560.0,4573.004,4560.0,236500,4745.0,4560.0
832,2019/05/15,4485.0,4381.407,4590.0,286000,4625.0,4210.0
833,2019/05/16,4335.0,4367.109,4510.0,110700,4530.0,4280.0
834,2019/05/17,4465.0,4519.127,4405.0,163800,4675.0,4405.0
835,2019/05/20,4515.0,4556.446,4600.0,100600,4650.0,4470.0
836,2019/05/21,4375.0,4394.803,4490.0,66100,4500.0,4350.0
837,2019/05/22,4445.0,4453.368,4420.0,43200,4490.0,4400.0
838,2019/05/23,4510.0,4500.506,4420.0,85000,4555.0,4405.0
839,2019/05/24,4600.0,4562.107,4440.0,59800,4625.0,4430.0
840,2019/05/27,4675.0,4691.938,4645.0,113500,4780.0,4620.0
841,2019/05/28,4675.0,4657.711,4690.0,47400,4740.0,4595.0
842,2019/05/29,4770.0,4712.859,4660.0,53700,4785.0,4615.0
843,2019/05/30,4750.0,4714.933,4715.0,66800,4770.0,4655.0
844,2019/05/31,4815.0,4806.838,4710.0,78900,4860.0,4710.0
845,2019/06/03,4320.0,4476.41,4790.0,180200,4790.0,4305.0
846,2019/06/04,4215.0,4243.688,4375.0,92600,4380.0,4165.0
847,2019/06/05,4290.0,4376.352,4410.0,88400,4460.0,4265.0
848,2019/06/06,4275.0,4330.027,4260.0,75000,4400.0,4230.0
849,2019/06/07,4330.0,4269.107,4300.0,60500,4330.0,4215.0
850,2019/06/10,4310.0,4304.446,4335.0,66800,4375.0,4250.0
851,2019/06/11,4410.0,4413.087,4320.0,92500,4495.0,4295.0
852,2019/06/12,4485.0,4501.643,4400.0,63300,4565.0,4395.0
853,2019/06/13,4495.0,4469.319,4455.0,40400,4515.0,4390.0
854,2019/06/14,4660.0,4639.532,4545.0,95100,4725.0,4540.0
855,2019/06/17,4695.0,4701.625,4700.0,48300,4765.0,4645.0
856,2019/06/18,4620.0,4678.219,4745.0,30600,4770.0,4605.0
857,2019/06/19,4700.0,4690.757,4710.0,31700,4730.0,4620.0
858,2019/06/20,4725.0,4688.232,4680.0,41000,4740.0,4640.0
859,2019/06/21,4610.0,4685.877,4725.0,62700,4815.0,4585.0
860,2019/06/24,4535.0,4523.914,4610.0,47400,4610.0,4465.0
861,2019/06/25,4370.0,4411.131,4490.0,69400,4535.0,4350.0
862,2019/06/26,4295.0,4301.032,4300.0,64900,4355.0,4235.0
863,2019/06/27,4305.0,4281.04,4295.0,30300,4320.0,4250.0
864,2019/06/28,4300.0,4324.337,4280.0,26400,4380.0,4270.0
865,2019/07/01,4495.0,4447.192,4420.0,60900,4505.0,4380.0
866,2019/07/02,4585.0,4584.824,4555.0,76600,4670.0,4525.0
867,2019/07/03,4845.0,4737.02,4630.0,126000,4860.0,4540.0
868,2019/07/04,4820.0,4778.953,4835.0,84500,4865.0,4675.0
869,2019/07/05,4950.0,4959.157,4835.0,97900,5060.0,4835.0
870,2019/07/08,4910.0,4945.765,4950.0,48400,5030.0,4900.0
871,2019/07/09,4885.0,4881.194,4910.0,42300,4945.0,4845.0
872,2019/07/10,4850.0,4813.976,4885.0,54700,4885.0,4740.0
873,2019/07/11,4895.0,4926.757,4850.0,38700,4985.0,4850.0
874,2019/07/12,4650.0,4737.054,4880.0,63300,4895.0,4650.0
875,2019/07/16,4620.0,4635.647,4650.0,25500,4675.0,4595.0
876,2019/07/17,4590.0,4553.125,4620.0,27200,4620.0,4510.0
877,2019/07/18,4430.0,4477.733,4585.0,58000,4585.0,4425.0
878,2019/07/19,4500.0,4520.048,4500.0,31400,4565.0,4480.0
879,2019/07/22,4515.0,4491.094,4500.0,26500,4540.0,4420.0
880,2019/07/23,4640.0,4619.476,4560.0,50600,4670.0,4515.0
881,2019/07/24,4610.0,4658.44,4675.0,37500,4725.0,4605.0
882,2019/07/25,4615.0,4650.157,4630.0,28600,4715.0,4605.0
883,2019/07/26,4555.0,4548.975,4580.0,31700,4610.0,4515.0
884,2019/07/29,4545.0,4550.651,4545.0,21500,4615.0,4520.0
885,2019/07/30,4595.0,4579.566,4550.0,50700,4605.0,4540.0
886,2019/07/31,4730.0,4666.047,4595.0,53000,4730.0,4570.0
887,2019/08/01,4670.0,4700.048,4695.0,42000,4760.0,4650.0
888,2019/08/02,4485.0,4530.164,4550.0,64000,4610.0,4480.0
889,2019/08/05,4220.0,4279.463,4440.0,116300,4440.0,4210.0
890,2019/08/06,4155.0,4098.869,4010.0,122000,4205.0,4010.0
891,2019/08/07,4100.0,4161.144,4290.0,64700,4305.0,4080.0
892,2019/08/08,4065.0,4107.528,4135.0,63300,4185.0,4060.0
893,2019/08/09,4040.0,4095.065,4135.0,99500,4220.0,4020.0
894,2019/08/13,3990.0,3988.052,4000.0,95200,4045.0,3925.0
895,2019/08/14,4690.0,4651.732,4550.0,222900,4690.0,4500.0
896,2019/08/15,4970.0,4790.192,4665.0,441100,4990.0,4565.0
897,2019/08/16,5050.0,4977.385,4990.0,257200,5120.0,4785.0
898,2019/08/19,4935.0,5014.99,5010.0,147300,5200.0,4910.0
899,2019/08/20,5120.0,5061.196,4995.0,99900,5140.0,4875.0
900,2019/08/21,4970.0,5002.53,5030.0,73900,5140.0,4950.0
901,2019/08/22,4690.0,4777.698,5010.0,122700,5020.0,4690.0
902,2019/08/23,4690.0,4626.273,4660.0,142200,4730.0,4510.0
