ds,yhat
2019-08-22,4604.3232130839615
2019-08-23,4587.252993447302
2019-08-26,4633.975093580187
2019-08-27,4635.704048165068
2019-08-28,4612.956924328654
2019-08-29,4584.360839145806
2019-08-30,4572.913608475657
2019-09-02,4602.36617854363
2019-09-03,4580.589401983066
2019-09-04,4552.739152027914
2019-09-05,4542.306532517292
2019-09-06,4557.231823956441
2019-09-09,4582.218247369324
2019-09-10,4561.797433670751
2019-09-11,4556.877248501098
2019-09-12,4579.418289903157
2019-09-13,4618.50042016415
2019-09-17,4694.656416869891
2019-09-18,4735.949906070631
2019-09-19,4787.453409850863
2019-09-20,4826.846471972813
