ds,yhat
2019-07-16,1376.162641525686
2019-07-17,1376.0119217818406
2019-07-18,1369.1878236616978
2019-07-19,1358.025808889935
2019-07-22,1346.7261055330196
2019-07-23,1350.3464756586286
2019-07-24,1349.1649110292865
2019-07-25,1340.705799654999
2019-07-26,1328.0321194480807
2019-07-29,1314.2869018508973
2019-07-30,1316.8106502330957
2019-07-31,1315.414195675585
2019-08-01,1308.3841599266038
2019-08-02,1298.0705840858254
2019-08-05,1282.0666016939606
2019-08-06,1283.8331418330215
2019-08-07,1286.463219917024
2019-08-08,1288.3477572368856
2019-08-09,1288.39871259797
