,Date,Close,VWAP,Open,Volume,High,Low
0,2014/08/25,2175.0,2173.264,2145.0,53000,2185.0,2145.0
1,2014/08/26,2180.0,2176.402,2160.0,31400,2190.0,2160.0
2,2014/08/27,2185.0,2191.809,2195.0,39800,2220.0,2175.0
3,2014/08/28,2190.0,2183.485,2185.0,39600,2195.0,2165.0
4,2014/08/29,2155.0,2158.517,2190.0,47200,2190.0,2145.0
5,2014/09/01,2215.0,2197.613,2175.0,39800,2215.0,2170.0
6,2014/09/02,2265.0,2253.011,2220.0,76400,2265.0,2220.0
7,2014/09/03,2250.0,2256.624,2250.0,62200,2275.0,2250.0
8,2014/09/04,2180.0,2185.256,2210.0,58600,2210.0,2170.0
9,2014/09/05,2170.0,2183.939,2210.0,35800,2215.0,2170.0
10,2014/09/08,2210.0,2197.738,2170.0,61000,2220.0,2170.0
11,2014/09/09,2180.0,2195.85,2225.0,41200,2235.0,2180.0
12,2014/09/10,2190.0,2171.904,2155.0,47800,2190.0,2150.0
13,2014/09/11,2190.0,2184.832,2165.0,71400,2215.0,2165.0
14,2014/09/12,2185.0,2176.768,2175.0,356400,2200.0,2175.0
15,2014/09/16,2130.0,2135.616,2145.0,65000,2150.0,2130.0
16,2014/09/17,2110.0,2116.936,2145.0,65600,2145.0,2105.0
17,2014/09/18,2170.0,2153.859,2125.0,100800,2175.0,2115.0
18,2014/09/19,2185.0,2191.478,2170.0,111000,2210.0,2160.0
19,2014/09/22,2125.0,2141.073,2170.0,43800,2180.0,2125.0
20,2014/09/24,2115.0,2116.797,2130.0,38400,2135.0,2105.0
21,2014/09/25,2150.0,2144.632,2155.0,67800,2155.0,2130.0
22,2014/09/26,2125.0,2118.34,2100.0,97600,2135.0,2100.0
23,2014/09/29,2120.0,2118.334,2125.0,56400,2135.0,2110.0
24,2014/09/30,2110.0,2105.467,2105.0,79200,2125.0,2080.0
25,2014/10/01,2090.0,2101.887,2125.0,53000,2125.0,2085.0
26,2014/10/02,2010.0,2026.636,2050.0,97800,2060.0,2010.0
27,2014/10/03,2035.0,2012.654,1985.0,120600,2035.0,1985.0
28,2014/10/06,2055.0,2052.619,2040.0,71800,2060.0,2035.0
29,2014/10/07,2010.0,2021.844,2020.0,88400,2045.0,2005.0
30,2014/10/08,2010.0,2007.057,1995.0,134200,2025.0,1990.0
31,2014/10/09,1970.0,1982.941,2030.0,80600,2030.0,1970.0
32,2014/10/10,1940.0,1938.821,1940.0,199200,1950.0,1925.0
33,2014/10/14,1880.0,1889.738,1870.0,133600,1915.0,1870.0
34,2014/10/15,1885.0,1882.67,1900.0,97000,1915.0,1870.0
35,2014/10/16,1785.0,1804.297,1815.0,162200,1835.0,1780.0
36,2014/10/17,1755.0,1777.539,1805.0,102000,1815.0,1755.0
37,2014/10/20,1830.0,1819.459,1800.0,116400,1830.0,1800.0
38,2014/10/21,1740.0,1766.412,1810.0,109800,1830.0,1740.0
39,2014/10/22,1805.0,1791.209,1770.0,108400,1805.0,1765.0
40,2014/10/23,1770.0,1775.529,1780.0,75600,1785.0,1770.0
41,2014/10/24,1770.0,1769.975,1770.0,119800,1785.0,1760.0
42,2014/10/27,1800.0,1794.493,1790.0,57200,1815.0,1780.0
43,2014/10/28,1770.0,1775.447,1780.0,47000,1790.0,1770.0
44,2014/10/29,1830.0,1826.908,1775.0,108000,1850.0,1775.0
45,2014/10/30,1830.0,1849.808,1860.0,83400,1885.0,1825.0
46,2014/10/31,1945.0,1922.706,1870.0,194800,1965.0,1850.0
47,2014/11/04,2065.0,2055.159,2025.0,302800,2085.0,1990.0
48,2014/11/05,2045.0,2049.539,2060.0,173400,2070.0,2020.0
49,2014/11/06,2080.0,2111.193,2125.0,148400,2145.0,2075.0
50,2014/11/07,2095.0,2086.128,2110.0,122400,2110.0,2065.0
51,2014/11/10,2075.0,2074.865,2070.0,66600,2110.0,2065.0
52,2014/11/11,2135.0,2110.278,2070.0,133400,2135.0,2070.0
53,2014/11/12,2150.0,2151.284,2130.0,148800,2170.0,2130.0
54,2014/11/13,2160.0,2140.578,2155.0,97000,2165.0,2110.0
55,2014/11/14,2175.0,2170.747,2180.0,275800,2185.0,2140.0
56,2014/11/17,2040.0,2072.312,2160.0,167400,2180.0,2030.0
57,2014/11/18,2115.0,2095.403,2065.0,121600,2120.0,2060.0
58,2014/11/19,2125.0,2138.484,2105.0,161600,2160.0,2105.0
59,2014/11/20,2115.0,2108.19,2130.0,90600,2135.0,2090.0
60,2014/11/21,2120.0,2103.323,2095.0,93000,2125.0,2080.0
61,2014/11/25,2095.0,2099.768,2105.0,60200,2115.0,2090.0
62,2014/11/26,2145.0,2134.49,2075.0,131400,2160.0,2075.0
63,2014/11/27,2090.0,2097.846,2105.0,75200,2125.0,2085.0
64,2014/11/28,2115.0,2113.936,2090.0,47000,2125.0,2090.0
65,2014/12/01,2125.0,2117.174,2090.0,59800,2130.0,2090.0
66,2014/12/02,2165.0,2147.289,2100.0,83000,2165.0,2100.0
67,2014/12/03,2165.0,2174.472,2165.0,77600,2200.0,2155.0
68,2014/12/04,2190.0,2187.364,2190.0,44000,2200.0,2175.0
69,2014/12/05,2160.0,2161.887,2150.0,72600,2190.0,2150.0
70,2014/12/08,2170.0,2174.632,2180.0,73400,2190.0,2160.0
71,2014/12/09,2145.0,2151.285,2155.0,50600,2165.0,2140.0
72,2014/12/10,2075.0,2092.898,2115.0,84200,2135.0,2070.0
73,2014/12/11,2040.0,2040.074,2045.0,67600,2055.0,2030.0
74,2014/12/12,2050.0,2048.93,2045.0,349600,2095.0,2045.0
75,2014/12/15,2000.0,2006.896,2010.0,111800,2025.0,2000.0
76,2014/12/16,1955.0,1944.006,1960.0,183000,1960.0,1935.0
77,2014/12/17,2015.0,1986.368,1935.0,176200,2020.0,1925.0
78,2014/12/18,2095.0,2087.405,2030.0,167200,2110.0,2030.0
79,2014/12/19,2155.0,2139.637,2150.0,146000,2155.0,2100.0
80,2014/12/22,2170.0,2145.557,2145.0,97000,2175.0,2110.0
81,2014/12/24,2180.0,2185.923,2200.0,131200,2220.0,2170.0
82,2014/12/25,2180.0,2177.0,2170.0,66000,2190.0,2170.0
83,2014/12/26,2200.0,2190.341,2170.0,85200,2215.0,2160.0
84,2014/12/29,2210.0,2219.291,2225.0,115600,2255.0,2175.0
85,2014/12/30,2175.0,2182.744,2205.0,65600,2205.0,2170.0
86,2015/01/05,2175.0,2155.965,2150.0,85000,2190.0,2125.0
87,2015/01/06,2085.0,2096.624,2125.0,170000,2125.0,2075.0
88,2015/01/07,2075.0,2074.702,2060.0,134000,2090.0,2055.0
89,2015/01/08,2090.0,2085.521,2080.0,115200,2095.0,2065.0
90,2015/01/09,2070.0,2095.769,2115.0,156000,2115.0,2065.0
91,2015/01/13,1995.0,1994.399,2030.0,109800,2030.0,1975.0
92,2015/01/14,1955.0,1961.951,1970.0,138400,1980.0,1945.0
93,2015/01/15,1995.0,1983.095,1965.0,78200,2000.0,1960.0
94,2015/01/16,1930.0,1918.305,1940.0,176400,1950.0,1890.0
95,2015/01/19,1955.0,1953.345,1965.0,61000,1965.0,1930.0
96,2015/01/20,2000.0,1989.024,1955.0,66600,2000.0,1940.0
97,2015/01/21,1970.0,1971.164,1975.0,72200,1985.0,1960.0
98,2015/01/22,2015.0,1995.489,1970.0,96200,2015.0,1965.0
99,2015/01/23,2040.0,2038.525,2050.0,52200,2050.0,2025.0
100,2015/01/26,2020.0,2021.514,2000.0,50200,2035.0,1985.0
101,2015/01/27,2065.0,2056.099,2020.0,62800,2075.0,2020.0
102,2015/01/28,2060.0,2058.413,2035.0,79400,2070.0,2035.0
103,2015/01/29,2040.0,2044.418,2035.0,73800,2070.0,2025.0
104,2015/01/30,2080.0,2067.209,2075.0,72000,2080.0,2050.0
105,2015/02/02,2050.0,2055.249,2080.0,56200,2080.0,2040.0
106,2015/02/03,2060.0,2057.3,2075.0,74800,2075.0,2045.0
107,2015/02/04,2120.0,2103.784,2055.0,104400,2120.0,2055.0
108,2015/02/05,2115.0,2094.0,2085.0,74000,2120.0,2060.0
109,2015/02/06,2350.0,2288.31,2145.0,358000,2360.0,2140.0
110,2015/02/09,2330.0,2323.787,2350.0,135200,2350.0,2285.0
111,2015/02/10,2325.0,2322.111,2325.0,84800,2345.0,2305.0
112,2015/02/12,2395.0,2403.958,2375.0,117000,2435.0,2375.0
113,2015/02/13,2345.0,2356.64,2365.0,151200,2390.0,2335.0
114,2015/02/16,2390.0,2384.951,2345.0,81600,2400.0,2345.0
115,2015/02/17,2385.0,2393.838,2365.0,54200,2430.0,2365.0
116,2015/02/18,2435.0,2447.983,2395.0,139800,2475.0,2395.0
117,2015/02/19,2460.0,2463.682,2430.0,72800,2475.0,2430.0
118,2015/02/20,2440.0,2440.595,2450.0,53800,2455.0,2415.0
119,2015/02/23,2450.0,2448.179,2460.0,64800,2465.0,2435.0
120,2015/02/24,2485.0,2478.628,2460.0,63400,2490.0,2455.0
121,2015/02/25,2455.0,2465.108,2475.0,46400,2495.0,2445.0
122,2015/02/26,2490.0,2484.246,2455.0,42400,2500.0,2455.0
123,2015/02/27,2460.0,2458.086,2475.0,51200,2485.0,2440.0
124,2015/03/02,2430.0,2435.916,2430.0,54600,2470.0,2415.0
125,2015/03/03,2405.0,2416.454,2420.0,39200,2440.0,2405.0
126,2015/03/04,2390.0,2384.89,2370.0,45200,2405.0,2365.0
127,2015/03/05,2360.0,2370.285,2360.0,56200,2395.0,2360.0
128,2015/03/06,2350.0,2357.556,2365.0,62600,2375.0,2345.0
129,2015/03/09,2325.0,2333.523,2335.0,61600,2365.0,2325.0
130,2015/03/10,2305.0,2325.625,2365.0,86400,2365.0,2300.0
131,2015/03/11,2315.0,2319.953,2285.0,63400,2350.0,2285.0
132,2015/03/12,2375.0,2361.592,2315.0,49000,2375.0,2315.0
133,2015/03/13,2415.0,2407.245,2400.0,344400,2450.0,2390.0
134,2015/03/16,2415.0,2414.266,2380.0,91200,2430.0,2380.0
135,2015/03/17,2400.0,2406.384,2435.0,54200,2435.0,2400.0
136,2015/03/18,2460.0,2409.295,2375.0,112000,2460.0,2355.0
137,2015/03/19,2405.0,2410.687,2420.0,91800,2445.0,2395.0
138,2015/03/20,2405.0,2397.37,2405.0,49800,2415.0,2375.0
139,2015/03/23,2435.0,2423.745,2390.0,44600,2435.0,2390.0
140,2015/03/24,2405.0,2413.422,2435.0,75400,2435.0,2400.0
141,2015/03/25,2390.0,2390.659,2410.0,74400,2410.0,2365.0
142,2015/03/26,2370.0,2366.91,2355.0,82200,2385.0,2350.0
143,2015/03/27,2310.0,2327.13,2305.0,100000,2385.0,2300.0
144,2015/03/30,2340.0,2326.024,2320.0,77200,2345.0,2300.0
145,2015/03/31,2335.0,2352.239,2325.0,114800,2390.0,2325.0
146,2015/04/01,2305.0,2312.956,2325.0,139400,2340.0,2300.0
147,2015/04/02,2370.0,2363.685,2310.0,114800,2395.0,2310.0
148,2015/04/03,2345.0,2345.257,2340.0,42800,2375.0,2335.0
149,2015/04/06,2320.0,2320.527,2325.0,30400,2335.0,2310.0
150,2015/04/07,2330.0,2322.348,2310.0,75400,2340.0,2305.0
151,2015/04/08,2355.0,2358.566,2365.0,50200,2375.0,2345.0
152,2015/04/09,2355.0,2356.756,2375.0,41000,2375.0,2345.0
153,2015/04/10,2340.0,2337.253,2340.0,183800,2355.0,2310.0
154,2015/04/13,2325.0,2331.222,2330.0,53200,2345.0,2315.0
155,2015/04/14,2325.0,2322.252,2300.0,52400,2335.0,2300.0
156,2015/04/15,2310.0,2313.088,2330.0,43400,2335.0,2300.0
157,2015/04/16,2340.0,2331.656,2310.0,59800,2350.0,2310.0
158,2015/04/17,2305.0,2312.665,2320.0,87800,2330.0,2300.0
159,2015/04/20,2300.0,2286.333,2310.0,66800,2310.0,2250.0
160,2015/04/21,2290.0,2282.967,2295.0,84600,2300.0,2270.0
161,2015/04/22,2395.0,2367.693,2310.0,98800,2395.0,2305.0
162,2015/04/23,2430.0,2422.743,2415.0,111200,2435.0,2410.0
163,2015/04/24,2370.0,2373.392,2390.0,74600,2420.0,2365.0
164,2015/04/27,2345.0,2354.692,2370.0,58400,2370.0,2340.0
165,2015/04/28,2355.0,2360.421,2375.0,78400,2380.0,2350.0
166,2015/04/30,2290.0,2304.037,2320.0,124600,2325.0,2290.0
167,2015/05/01,2275.0,2263.334,2255.0,84600,2285.0,2250.0
168,2015/05/07,2250.0,2268.805,2250.0,77800,2295.0,2250.0
169,2015/05/08,2275.0,2257.993,2240.0,113600,2285.0,2240.0
170,2015/05/11,2330.0,2324.314,2300.0,61200,2335.0,2300.0
171,2015/05/12,2335.0,2327.776,2290.0,54400,2340.0,2290.0
172,2015/05/13,2330.0,2323.313,2300.0,98400,2350.0,2300.0
173,2015/05/14,2305.0,2295.602,2305.0,156200,2325.0,2275.0
174,2015/05/15,2310.0,2308.072,2305.0,61200,2320.0,2290.0
175,2015/05/18,2350.0,2341.432,2310.0,51000,2355.0,2310.0
176,2015/05/19,2460.0,2438.247,2350.0,164800,2470.0,2350.0
177,2015/05/20,2470.0,2473.813,2470.0,111200,2490.0,2460.0
178,2015/05/21,2440.0,2443.889,2450.0,55800,2465.0,2430.0
179,2015/05/22,2465.0,2458.408,2435.0,58400,2470.0,2425.0
180,2015/05/25,2485.0,2472.85,2450.0,41400,2485.0,2440.0
181,2015/05/26,2495.0,2493.896,2490.0,82400,2500.0,2480.0
182,2015/05/27,2525.0,2510.045,2495.0,66800,2525.0,2485.0
183,2015/05/28,2560.0,2562.35,2550.0,96200,2580.0,2540.0
184,2015/05/29,2555.0,2555.0,2530.0,81600,2570.0,2520.0
185,2015/06/01,2605.0,2593.516,2565.0,62000,2610.0,2565.0
186,2015/06/02,2590.0,2603.194,2620.0,69200,2635.0,2575.0
187,2015/06/03,2630.0,2624.673,2590.0,91600,2645.0,2590.0
188,2015/06/04,2620.0,2635.679,2615.0,67800,2650.0,2615.0
189,2015/06/05,2615.0,2604.548,2585.0,70800,2625.0,2585.0
190,2015/06/08,2685.0,2666.233,2640.0,58400,2690.0,2640.0
191,2015/06/09,2625.0,2642.537,2675.0,68600,2675.0,2620.0
192,2015/06/10,2595.0,2612.774,2675.0,75000,2675.0,2585.0
193,2015/06/11,2725.0,2682.83,2600.0,110600,2725.0,2600.0
194,2015/06/12,2705.0,2747.155,2760.0,268200,2775.0,2695.0
195,2015/06/15,2690.0,2680.635,2685.0,63000,2695.0,2665.0
196,2015/06/16,2655.0,2663.17,2685.0,67200,2715.0,2645.0
197,2015/06/17,2635.0,2629.406,2635.0,65600,2650.0,2605.0
198,2015/06/18,2585.0,2597.965,2655.0,86000,2655.0,2575.0
199,2015/06/19,2620.0,2611.197,2565.0,80200,2625.0,2560.0
200,2015/06/22,2640.0,2620.385,2590.0,49400,2645.0,2585.0
201,2015/06/23,2725.0,2695.954,2650.0,99600,2730.0,2650.0
202,2015/06/24,2770.0,2766.143,2750.0,86600,2785.0,2740.0
203,2015/06/25,2795.0,2785.88,2795.0,61400,2810.0,2760.0
204,2015/06/26,2765.0,2779.37,2825.0,71400,2835.0,2760.0
205,2015/06/29,2655.0,2672.33,2745.0,129200,2745.0,2640.0
206,2015/06/30,2700.0,2683.523,2690.0,79200,2700.0,2650.0
207,2015/07/01,2735.0,2725.171,2715.0,52800,2740.0,2680.0
208,2015/07/02,2760.0,2761.486,2780.0,49800,2780.0,2745.0
209,2015/07/03,2975.0,2896.466,2750.0,197800,2975.0,2750.0
210,2015/07/06,2885.0,2906.266,2900.0,189600,2950.0,2860.0
211,2015/07/07,3005.0,2992.061,2935.0,112600,3020.0,2920.0
212,2015/07/08,2960.0,2966.645,3010.0,139200,3030.0,2940.0
213,2015/07/09,3020.0,2941.741,2915.0,152800,3020.0,2835.0
214,2015/07/10,2980.0,2994.705,3010.0,169600,3030.0,2960.0
215,2015/07/13,3060.0,3047.599,3000.0,117000,3075.0,2950.0
216,2015/07/14,3100.0,3108.043,3095.0,88400,3135.0,3090.0
217,2015/07/15,3035.0,3054.805,3105.0,87200,3110.0,3030.0
218,2015/07/16,3085.0,3079.044,3075.0,73200,3095.0,3035.0
219,2015/07/17,3140.0,3140.048,3125.0,63000,3185.0,3085.0
220,2015/07/21,3160.0,3150.492,3145.0,34600,3165.0,3135.0
221,2015/07/22,3120.0,3124.115,3110.0,35000,3140.0,3110.0
222,2015/07/23,3175.0,3155.902,3170.0,38800,3175.0,3110.0
223,2015/07/24,3105.0,3111.756,3125.0,56400,3140.0,3090.0
224,2015/07/27,3035.0,3040.47,3070.0,53200,3070.0,3020.0
225,2015/07/28,3170.0,3116.914,3015.0,104000,3180.0,3015.0
226,2015/07/29,3250.0,3242.261,3185.0,85800,3305.0,3185.0
227,2015/07/30,3380.0,3352.177,3280.0,117600,3390.0,3280.0
228,2015/07/31,3320.0,3357.924,3375.0,128600,3420.0,3310.0
229,2015/08/03,3210.0,3208.226,3240.0,129600,3245.0,3180.0
230,2015/08/04,3235.0,3249.191,3200.0,103800,3290.0,3175.0
231,2015/08/05,3260.0,3253.973,3220.0,66200,3295.0,3180.0
232,2015/08/06,3320.0,3374.352,3425.0,112600,3435.0,3315.0
233,2015/08/07,3400.0,3381.425,3320.0,101800,3420.0,3320.0
234,2015/08/10,3360.0,3366.283,3395.0,69400,3395.0,3345.0
235,2015/08/11,3310.0,3334.907,3365.0,85600,3395.0,3300.0
236,2015/08/12,3235.0,3264.825,3295.0,74000,3330.0,3220.0
237,2015/08/13,3315.0,3299.129,3285.0,93000,3325.0,3250.0
238,2015/08/14,3280.0,3307.692,3305.0,94000,3360.0,3280.0
239,2015/08/17,3320.0,3309.838,3280.0,49400,3330.0,3250.0
240,2015/08/18,3265.0,3287.891,3335.0,47400,3340.0,3255.0
241,2015/08/19,3235.0,3244.968,3255.0,62000,3280.0,3230.0
242,2015/08/20,3190.0,3208.259,3230.0,62600,3245.0,3180.0
243,2015/08/21,3010.0,3061.588,3150.0,119000,3150.0,3005.0
244,2015/08/24,2900.0,2938.266,2960.0,137800,3005.0,2890.0
245,2015/08/25,2720.0,2811.641,2780.0,234000,2945.0,2705.0
246,2015/08/26,2715.0,2722.786,2705.0,252400,2800.0,2680.0
247,2015/08/27,2805.0,2808.313,2765.0,193200,2855.0,2735.0
248,2015/08/28,2910.0,2892.206,2855.0,108800,2920.0,2855.0
249,2015/08/31,2875.0,2876.065,2895.0,98600,2920.0,2850.0
250,2015/09/01,2740.0,2790.584,2830.0,108000,2850.0,2740.0
251,2015/09/02,2650.0,2692.52,2670.0,201600,2760.0,2635.0
252,2015/09/03,2665.0,2692.233,2700.0,132600,2750.0,2655.0
253,2015/09/04,2615.0,2605.224,2660.0,259200,2660.0,2550.0
254,2015/09/07,2130.0,2162.046,2265.0,1206000,2270.0,2115.0
255,2015/09/08,2045.0,2102.543,2150.0,664200,2175.0,2035.0
256,2015/09/09,2115.0,2091.929,2125.0,540800,2125.0,2055.0
257,2015/09/10,2055.0,2060.262,2075.0,493600,2105.0,2025.0
258,2015/09/11,2055.0,2075.56,2065.0,711600,2115.0,2050.0
259,2015/09/14,2015.0,2049.865,2080.0,326000,2095.0,2015.0
260,2015/09/15,1875.0,1920.504,2025.0,1006600,2045.0,1865.0
261,2015/09/16,1855.0,1863.73,1900.0,901200,1905.0,1840.0
262,2015/09/17,1890.0,1896.026,1875.0,836600,1945.0,1850.0
263,2015/09/18,1855.0,1864.954,1890.0,518600,1900.0,1845.0
264,2015/09/24,1805.0,1810.771,1825.0,591400,1840.0,1795.0
265,2015/09/25,1805.0,1798.276,1800.0,556200,1835.0,1775.0
266,2015/09/28,1830.0,1830.191,1805.0,483200,1855.0,1785.0
267,2015/09/29,1735.0,1756.32,1800.0,814800,1800.0,1725.0
268,2015/09/30,1785.0,1781.269,1750.0,6294800,1840.0,1720.0
269,2015/10/01,1820.0,1825.384,1815.0,1365000,1885.0,1775.0
270,2015/10/02,1755.0,1759.459,1780.0,798600,1785.0,1745.0
271,2015/10/05,1795.0,1786.345,1765.0,435800,1810.0,1760.0
272,2015/10/06,1740.0,1772.15,1830.0,730400,1850.0,1735.0
273,2015/10/07,1740.0,1735.558,1745.0,659800,1765.0,1700.0
274,2015/10/08,1710.0,1726.04,1745.0,527200,1750.0,1705.0
275,2015/10/09,1775.0,1764.015,1720.0,669200,1790.0,1720.0
276,2015/10/13,1725.0,1750.984,1790.0,733000,1790.0,1720.0
277,2015/10/14,1715.0,1720.069,1715.0,612800,1745.0,1685.0
278,2015/10/15,1735.0,1729.178,1705.0,320000,1750.0,1700.0
279,2015/10/16,1755.0,1766.23,1745.0,340000,1790.0,1745.0
280,2015/10/19,1740.0,1737.409,1755.0,339200,1760.0,1715.0
281,2015/10/20,1720.0,1721.634,1745.0,349400,1755.0,1705.0
282,2015/10/21,1760.0,1743.505,1710.0,365800,1760.0,1710.0
283,2015/10/22,1730.0,1741.61,1750.0,269600,1760.0,1725.0
284,2015/10/23,1820.0,1796.638,1760.0,765200,1830.0,1750.0
285,2015/10/26,1830.0,1850.407,1860.0,722400,1875.0,1825.0
286,2015/10/27,1840.0,1843.95,1845.0,410400,1865.0,1825.0
287,2015/10/28,1840.0,1830.151,1855.0,417400,1860.0,1810.0
288,2015/10/29,1845.0,1847.43,1865.0,627600,1870.0,1830.0
289,2015/10/30,1835.0,1829.511,1835.0,382400,1850.0,1805.0
290,2015/11/02,1810.0,1814.41,1830.0,262400,1830.0,1805.0
291,2015/11/04,1780.0,1806.576,1835.0,370600,1845.0,1775.0
292,2015/11/05,1790.0,1777.106,1755.0,349600,1805.0,1750.0
293,2015/11/06,1835.0,1849.398,1870.0,582400,1875.0,1815.0
294,2015/11/09,1865.0,1862.284,1845.0,434000,1880.0,1840.0
295,2015/11/10,1880.0,1868.483,1840.0,330800,1885.0,1840.0
296,2015/11/11,1875.0,1876.755,1870.0,354400,1900.0,1855.0
297,2015/11/12,1830.0,1837.632,1875.0,365200,1885.0,1810.0
298,2015/11/13,1835.0,1822.166,1810.0,248000,1845.0,1795.0
299,2015/11/16,1785.0,1794.845,1805.0,297000,1815.0,1775.0
300,2015/11/17,1820.0,1814.103,1805.0,215000,1830.0,1800.0
301,2015/11/18,1790.0,1800.925,1830.0,223800,1830.0,1785.0
302,2015/11/19,1810.0,1804.608,1810.0,186200,1815.0,1795.0
303,2015/11/20,1805.0,1805.154,1810.0,136800,1820.0,1795.0
304,2015/11/24,1820.0,1811.337,1805.0,156400,1820.0,1800.0
305,2015/11/25,1810.0,1813.706,1815.0,151400,1820.0,1800.0
306,2015/11/26,1820.0,1827.444,1815.0,206200,1845.0,1815.0
307,2015/11/27,1805.0,1805.677,1815.0,199400,1820.0,1795.0
308,2015/11/30,1790.0,1790.518,1805.0,148600,1805.0,1780.0
309,2015/12/01,1800.0,1794.768,1785.0,172000,1800.0,1780.0
310,2015/12/02,1770.0,1782.441,1800.0,227000,1800.0,1765.0
311,2015/12/03,1735.0,1736.567,1760.0,447400,1765.0,1710.0
312,2015/12/04,1695.0,1704.869,1715.0,449200,1735.0,1685.0
313,2015/12/07,1715.0,1717.596,1720.0,183000,1725.0,1710.0
314,2015/12/08,1710.0,1701.101,1710.0,214400,1715.0,1685.0
315,2015/12/09,1675.0,1680.928,1695.0,237200,1700.0,1670.0
316,2015/12/10,1655.0,1655.417,1650.0,225400,1670.0,1645.0
317,2015/12/11,1660.0,1650.782,1640.0,179000,1665.0,1640.0
318,2015/12/14,1625.0,1622.954,1635.0,253600,1640.0,1600.0
319,2015/12/15,1600.0,1610.538,1620.0,189600,1625.0,1600.0
320,2015/12/16,1620.0,1625.692,1625.0,140200,1635.0,1615.0
321,2015/12/17,1665.0,1661.729,1640.0,184000,1680.0,1640.0
322,2015/12/18,1625.0,1652.067,1665.0,220200,1680.0,1625.0
323,2015/12/21,1595.0,1590.106,1610.0,189400,1610.0,1575.0
324,2015/12/22,1590.0,1586.868,1605.0,155800,1605.0,1575.0
325,2015/12/24,1575.0,1592.505,1600.0,211200,1620.0,1565.0
326,2015/12/25,1590.0,1580.221,1580.0,239600,1605.0,1555.0
327,2015/12/28,1635.0,1633.788,1580.0,205400,1650.0,1580.0
328,2015/12/29,1635.0,1630.265,1625.0,113200,1645.0,1610.0
329,2015/12/30,1635.0,1632.514,1645.0,108200,1655.0,1620.0
330,2016/01/04,1580.0,1597.222,1620.0,176400,1625.0,1570.0
331,2016/01/05,1630.0,1610.518,1585.0,218200,1640.0,1565.0
332,2016/01/06,1635.0,1630.929,1625.0,207800,1645.0,1615.0
333,2016/01/07,1620.0,1621.797,1620.0,235400,1635.0,1605.0
334,2016/01/08,1640.0,1633.166,1615.0,207200,1655.0,1595.0
335,2016/01/12,1595.0,1612.13,1620.0,302400,1630.0,1595.0
336,2016/01/13,1635.0,1627.93,1615.0,164200,1640.0,1600.0
337,2016/01/14,1625.0,1604.321,1595.0,247200,1625.0,1585.0
338,2016/01/15,1625.0,1633.88,1635.0,276800,1660.0,1610.0
339,2016/01/18,1605.0,1583.57,1595.0,252400,1610.0,1545.0
340,2016/01/19,1655.0,1638.028,1610.0,237800,1660.0,1605.0
341,2016/01/20,1595.0,1620.718,1635.0,338400,1655.0,1590.0
342,2016/01/21,1560.0,1604.325,1595.0,312600,1640.0,1560.0
343,2016/01/22,1655.0,1637.556,1625.0,261400,1660.0,1610.0
344,2016/01/25,1700.0,1693.66,1690.0,243200,1730.0,1650.0
345,2016/01/26,1695.0,1694.14,1690.0,261400,1710.0,1665.0
346,2016/01/27,1755.0,1747.924,1735.0,263400,1765.0,1725.0
347,2016/01/28,1745.0,1755.945,1750.0,204200,1770.0,1735.0
348,2016/01/29,1795.0,1770.217,1760.0,272600,1800.0,1735.0
349,2016/02/01,1805.0,1806.433,1800.0,187800,1820.0,1800.0
350,2016/02/02,1790.0,1790.065,1795.0,310200,1805.0,1770.0
351,2016/02/03,1745.0,1738.646,1750.0,248800,1750.0,1715.0
352,2016/02/04,1740.0,1744.127,1715.0,198000,1765.0,1715.0
353,2016/02/05,1740.0,1721.031,1700.0,339600,1770.0,1600.0
354,2016/02/08,1765.0,1739.613,1705.0,227000,1780.0,1700.0
355,2016/02/09,1710.0,1716.287,1725.0,356000,1735.0,1695.0
356,2016/02/10,1665.0,1683.435,1720.0,400000,1735.0,1640.0
357,2016/02/12,1595.0,1609.324,1585.0,642800,1645.0,1570.0
358,2016/02/15,1710.0,1695.761,1640.0,382400,1725.0,1630.0
359,2016/02/16,1770.0,1763.945,1675.0,503200,1795.0,1670.0
360,2016/02/17,1725.0,1754.813,1770.0,314600,1810.0,1695.0
361,2016/02/18,1805.0,1810.0,1770.0,285400,1840.0,1765.0
362,2016/02/19,1810.0,1803.873,1805.0,182800,1825.0,1785.0
363,2016/02/22,1815.0,1815.933,1800.0,205800,1840.0,1795.0
364,2016/02/23,1815.0,1827.303,1835.0,134200,1850.0,1805.0
365,2016/02/24,1810.0,1810.9,1790.0,130000,1835.0,1770.0
366,2016/02/25,1835.0,1846.733,1800.0,247000,1875.0,1800.0
367,2016/02/26,1820.0,1838.714,1850.0,139200,1875.0,1815.0
368,2016/02/29,1830.0,1857.016,1855.0,181600,1890.0,1825.0
369,2016/03/01,1845.0,1837.91,1850.0,184200,1855.0,1815.0
370,2016/03/02,1890.0,1890.209,1885.0,211200,1910.0,1875.0
371,2016/03/03,1895.0,1891.504,1890.0,118400,1905.0,1880.0
372,2016/03/04,1885.0,1877.211,1870.0,180000,1895.0,1855.0
373,2016/03/07,1875.0,1877.51,1885.0,104000,1890.0,1865.0
374,2016/03/08,1855.0,1856.933,1875.0,124200,1880.0,1830.0
375,2016/03/09,1830.0,1824.377,1840.0,147600,1845.0,1805.0
376,2016/03/10,1880.0,1866.618,1830.0,89000,1885.0,1830.0
377,2016/03/11,1885.0,1866.701,1845.0,88800,1890.0,1845.0
378,2016/03/14,1925.0,1909.371,1905.0,114400,1925.0,1885.0
379,2016/03/15,1940.0,1935.058,1925.0,104600,1955.0,1915.0
380,2016/03/16,1905.0,1919.364,1930.0,78600,1940.0,1900.0
381,2016/03/17,1885.0,1899.604,1920.0,65600,1925.0,1880.0
382,2016/03/18,1870.0,1861.218,1875.0,99400,1900.0,1840.0
383,2016/03/22,1890.0,1891.151,1885.0,80800,1915.0,1880.0
384,2016/03/23,1870.0,1874.766,1895.0,59800,1895.0,1865.0
385,2016/03/24,1825.0,1830.84,1855.0,81000,1865.0,1815.0
386,2016/03/25,1820.0,1814.563,1830.0,68600,1830.0,1800.0
387,2016/03/28,1840.0,1814.916,1810.0,107400,1840.0,1800.0
388,2016/03/29,1835.0,1821.922,1820.0,51000,1840.0,1800.0
389,2016/03/30,1830.0,1824.685,1835.0,50800,1835.0,1815.0
390,2016/03/31,1815.0,1827.034,1835.0,53600,1840.0,1815.0
391,2016/04/01,1720.0,1744.718,1835.0,116800,1835.0,1710.0
392,2016/04/04,1720.0,1701.107,1705.0,99400,1745.0,1650.0
393,2016/04/05,1680.0,1689.191,1720.0,89000,1720.0,1670.0
394,2016/04/06,1675.0,1674.263,1675.0,57000,1690.0,1660.0
395,2016/04/07,1695.0,1690.737,1670.0,58400,1705.0,1670.0
396,2016/04/08,1705.0,1684.599,1675.0,84800,1735.0,1645.0
397,2016/04/11,1695.0,1686.039,1705.0,41400,1705.0,1665.0
398,2016/04/12,1725.0,1720.181,1685.0,49800,1740.0,1685.0
399,2016/04/13,1765.0,1757.06,1750.0,63600,1770.0,1740.0
400,2016/04/14,1820.0,1796.326,1800.0,98800,1820.0,1775.0
401,2016/04/15,1800.0,1810.616,1795.0,81200,1830.0,1790.0
402,2016/04/18,1740.0,1743.239,1755.0,84600,1760.0,1730.0
403,2016/04/19,1775.0,1771.547,1780.0,61400,1790.0,1760.0
404,2016/04/20,1790.0,1796.892,1795.0,60800,1815.0,1780.0
405,2016/04/21,1815.0,1808.923,1815.0,52000,1815.0,1800.0
406,2016/04/22,1825.0,1811.719,1805.0,69800,1825.0,1790.0
407,2016/04/25,1815.0,1817.196,1830.0,51000,1835.0,1805.0
408,2016/04/26,1775.0,1780.753,1815.0,51800,1815.0,1765.0
409,2016/04/27,1790.0,1787.006,1780.0,32400,1795.0,1780.0
410,2016/04/28,1710.0,1767.521,1790.0,95600,1820.0,1700.0
411,2016/05/02,1650.0,1645.57,1620.0,79000,1665.0,1620.0
412,2016/05/06,1645.0,1646.678,1660.0,59000,1680.0,1635.0
413,2016/05/09,1635.0,1644.563,1675.0,32000,1675.0,1630.0
414,2016/05/10,1685.0,1668.035,1640.0,51400,1690.0,1635.0
415,2016/05/11,1690.0,1688.313,1710.0,64600,1715.0,1665.0
416,2016/05/12,1745.0,1718.473,1680.0,74000,1750.0,1670.0
417,2016/05/13,1740.0,1744.775,1750.0,48800,1760.0,1730.0
418,2016/05/16,1685.0,1711.621,1735.0,29000,1750.0,1680.0
419,2016/05/17,1690.0,1688.222,1695.0,29800,1715.0,1675.0
420,2016/05/18,1670.0,1670.631,1685.0,61800,1695.0,1655.0
421,2016/05/19,1650.0,1659.193,1660.0,26000,1685.0,1650.0
422,2016/05/20,1660.0,1661.648,1650.0,17600,1670.0,1650.0
423,2016/05/23,1685.0,1670.302,1670.0,39800,1690.0,1640.0
424,2016/05/24,1650.0,1660.475,1670.0,27400,1675.0,1650.0
425,2016/05/25,1715.0,1702.074,1680.0,43400,1725.0,1660.0
426,2016/05/26,1725.0,1719.554,1730.0,31400,1730.0,1695.0
427,2016/05/27,1715.0,1712.674,1725.0,28800,1725.0,1700.0
428,2016/05/30,1720.0,1718.72,1715.0,16400,1725.0,1710.0
429,2016/05/31,1760.0,1747.761,1715.0,59400,1770.0,1700.0
430,2016/06/01,1710.0,1727.032,1735.0,25600,1750.0,1710.0
431,2016/06/02,1660.0,1672.867,1695.0,43600,1695.0,1655.0
432,2016/06/03,1655.0,1655.549,1665.0,16400,1680.0,1640.0
433,2016/06/06,1645.0,1631.159,1615.0,32800,1660.0,1615.0
434,2016/06/07,1645.0,1648.142,1645.0,22600,1665.0,1635.0
435,2016/06/08,1670.0,1657.114,1655.0,24600,1670.0,1645.0
436,2016/06/09,1665.0,1653.819,1660.0,36400,1670.0,1635.0
437,2016/06/10,1650.0,1659.235,1670.0,56200,1670.0,1640.0
438,2016/06/13,1570.0,1584.58,1620.0,50000,1620.0,1570.0
439,2016/06/14,1520.0,1533.066,1545.0,42400,1575.0,1515.0
440,2016/06/15,1565.0,1583.876,1520.0,97800,1650.0,1520.0
441,2016/06/16,1525.0,1531.775,1575.0,64800,1585.0,1510.0
442,2016/06/17,1680.0,1638.892,1555.0,197600,1680.0,1535.0
443,2016/06/20,1680.0,1663.814,1645.0,106200,1695.0,1620.0
444,2016/06/21,1675.0,1672.044,1675.0,50400,1685.0,1650.0
445,2016/06/22,1695.0,1681.424,1665.0,56200,1695.0,1650.0
446,2016/06/23,1760.0,1736.414,1700.0,99000,1760.0,1690.0
447,2016/06/24,1575.0,1670.584,1775.0,109600,1785.0,1565.0
448,2016/06/27,1655.0,1646.072,1615.0,64400,1660.0,1615.0
449,2016/06/28,1645.0,1635.142,1645.0,70600,1680.0,1570.0
450,2016/06/29,1715.0,1686.503,1675.0,63200,1720.0,1650.0
451,2016/06/30,1720.0,1738.825,1720.0,67200,1760.0,1715.0
452,2016/07/01,1755.0,1748.963,1725.0,37600,1770.0,1715.0
453,2016/07/04,1735.0,1731.692,1745.0,26600,1745.0,1715.0
454,2016/07/05,1870.0,1854.311,1815.0,188600,1915.0,1790.0
455,2016/07/06,1785.0,1788.743,1835.0,71600,1835.0,1755.0
456,2016/07/07,1755.0,1773.892,1785.0,66800,1810.0,1740.0
457,2016/07/08,1710.0,1750.618,1795.0,50200,1795.0,1710.0
458,2016/07/11,1830.0,1807.391,1750.0,45600,1835.0,1750.0
459,2016/07/12,1850.0,1865.014,1850.0,70200,1890.0,1845.0
460,2016/07/13,1820.0,1841.73,1865.0,52600,1880.0,1810.0
461,2016/07/14,1835.0,1840.431,1825.0,41800,1860.0,1820.0
462,2016/07/15,1805.0,1806.25,1850.0,49600,1850.0,1780.0
463,2016/07/19,1840.0,1827.564,1825.0,39400,1840.0,1810.0
464,2016/07/20,1835.0,1821.196,1830.0,18400,1835.0,1805.0
465,2016/07/21,1820.0,1828.132,1855.0,34800,1855.0,1810.0
466,2016/07/22,1840.0,1820.42,1815.0,28600,1840.0,1800.0
467,2016/07/25,1865.0,1859.846,1850.0,26000,1870.0,1830.0
468,2016/07/26,1820.0,1820.219,1850.0,32000,1850.0,1800.0
469,2016/07/27,1865.0,1857.176,1840.0,52400,1870.0,1835.0
470,2016/07/28,1865.0,1852.167,1845.0,24000,1865.0,1840.0
471,2016/07/29,1875.0,1852.369,1865.0,38000,1875.0,1815.0
472,2016/08/01,1810.0,1815.741,1850.0,48600,1850.0,1800.0
473,2016/08/02,1810.0,1804.493,1810.0,29600,1825.0,1780.0
474,2016/08/03,1770.0,1764.803,1800.0,50600,1800.0,1735.0
475,2016/08/04,1670.0,1695.294,1770.0,71400,1770.0,1670.0
476,2016/08/05,1640.0,1652.872,1665.0,49800,1680.0,1630.0
477,2016/08/08,1730.0,1706.437,1680.0,53600,1730.0,1660.0
478,2016/08/09,1750.0,1744.341,1730.0,28800,1755.0,1730.0
479,2016/08/10,1725.0,1722.168,1750.0,28600,1750.0,1715.0
480,2016/08/12,1745.0,1747.222,1750.0,21600,1755.0,1735.0
481,2016/08/15,1760.0,1751.097,1730.0,31000,1765.0,1730.0
482,2016/08/16,1710.0,1727.633,1775.0,37600,1775.0,1695.0
483,2016/08/17,1705.0,1707.65,1690.0,40000,1740.0,1685.0
484,2016/08/18,1725.0,1726.256,1705.0,40600,1745.0,1695.0
485,2016/08/19,1715.0,1715.2,1715.0,20000,1730.0,1700.0
486,2016/08/22,1710.0,1706.342,1740.0,16400,1740.0,1695.0
487,2016/08/23,1720.0,1704.492,1710.0,49200,1735.0,1680.0
488,2016/08/24,1720.0,1718.972,1740.0,21400,1740.0,1710.0
489,2016/08/25,1735.0,1728.739,1720.0,22200,1740.0,1710.0
490,2016/08/26,1730.0,1730.612,1725.0,29400,1745.0,1715.0
491,2016/08/29,1790.0,1767.419,1750.0,49200,1790.0,1735.0
492,2016/08/30,1730.0,1744.708,1795.0,30800,1795.0,1720.0
493,2016/08/31,1755.0,1754.203,1740.0,46400,1770.0,1730.0
494,2016/09/01,1745.0,1745.506,1755.0,17800,1760.0,1730.0
495,2016/09/02,1760.0,1736.897,1735.0,40600,1765.0,1705.0
496,2016/09/05,1735.0,1747.263,1770.0,27400,1770.0,1735.0
497,2016/09/06,1745.0,1740.871,1740.0,52800,1765.0,1730.0
498,2016/09/07,1730.0,1722.874,1735.0,34800,1745.0,1705.0
499,2016/09/08,1710.0,1707.655,1735.0,55000,1740.0,1690.0
500,2016/09/09,1690.0,1690.874,1685.0,57200,1705.0,1685.0
501,2016/09/12,1670.0,1661.421,1670.0,55600,1675.0,1640.0
502,2016/09/13,1675.0,1673.039,1685.0,30600,1685.0,1655.0
503,2016/09/14,1655.0,1655.515,1670.0,27200,1670.0,1645.0
504,2016/09/15,1635.0,1636.597,1655.0,33200,1655.0,1625.0
505,2016/09/16,1660.0,1643.992,1635.0,70400,1660.0,1615.0
506,2016/09/20,1635.0,1642.0,1635.0,46000,1660.0,1625.0
507,2016/09/21,1685.0,1649.738,1640.0,84000,1685.0,1605.0
508,2016/09/23,1685.0,1674.934,1680.0,60200,1690.0,1660.0
509,2016/09/26,1655.0,1662.836,1680.0,26800,1680.0,1650.0
510,2016/09/27,1665.0,1647.726,1635.0,55400,1665.0,1620.0
511,2016/09/28,1685.0,1662.622,1660.0,61400,1685.0,1635.0
512,2016/09/29,1690.0,1690.839,1690.0,57200,1705.0,1665.0
513,2016/09/30,1650.0,1645.153,1660.0,52400,1660.0,1630.0
514,2016/10/03,1640.0,1656.102,1675.0,47200,1675.0,1640.0
515,2016/10/04,1645.0,1642.137,1645.0,49600,1655.0,1625.0
516,2016/10/05,1660.0,1654.375,1655.0,38400,1665.0,1635.0
517,2016/10/06,1680.0,1679.348,1675.0,36800,1685.0,1670.0
518,2016/10/07,1680.0,1675.271,1680.0,40600,1680.0,1665.0
519,2016/10/11,1720.0,1709.16,1705.0,90400,1720.0,1695.0
520,2016/10/12,1715.0,1718.394,1700.0,109600,1730.0,1695.0
521,2016/10/13,1665.0,1679.6,1725.0,92400,1725.0,1660.0
522,2016/10/14,1680.0,1665.422,1670.0,90000,1685.0,1645.0
523,2016/10/17,1685.0,1683.444,1685.0,51400,1700.0,1670.0
524,2016/10/18,1705.0,1697.363,1680.0,91000,1715.0,1675.0
525,2016/10/19,1735.0,1724.536,1700.0,90400,1735.0,1700.0
526,2016/10/20,1780.0,1763.733,1735.0,127000,1780.0,1735.0
527,2016/10/21,1760.0,1766.411,1785.0,54600,1785.0,1750.0
528,2016/10/24,1775.0,1765.572,1750.0,49000,1785.0,1745.0
529,2016/10/25,1770.0,1778.894,1770.0,69600,1800.0,1765.0
530,2016/10/26,1780.0,1779.546,1770.0,70400,1790.0,1760.0
531,2016/10/27,1760.0,1762.554,1775.0,65000,1790.0,1745.0
532,2016/10/28,1715.0,1720.622,1760.0,455400,1765.0,1710.0
533,2016/10/31,1710.0,1703.466,1710.0,95800,1715.0,1695.0
534,2016/11/01,1705.0,1697.908,1710.0,56400,1710.0,1685.0
535,2016/11/02,1685.0,1674.56,1695.0,93200,1695.0,1655.0
536,2016/11/04,1845.0,1843.927,1810.0,881400,1890.0,1805.0
537,2016/11/07,1890.0,1886.473,1875.0,189400,1915.0,1865.0
538,2016/11/08,1905.0,1894.372,1895.0,149600,1905.0,1870.0
539,2016/11/09,1850.0,1888.827,1885.0,215600,1970.0,1820.0
540,2016/11/10,1965.0,1964.117,1955.0,200400,1980.0,1930.0
541,2016/11/11,1950.0,1961.971,1965.0,118200,1990.0,1940.0
542,2016/11/14,2015.0,2001.636,1975.0,106400,2020.0,1975.0
543,2016/11/15,2015.0,2013.495,2000.0,80400,2035.0,2000.0
544,2016/11/16,2045.0,2038.439,2035.0,73000,2050.0,2015.0
545,2016/11/17,2095.0,2071.052,2035.0,104600,2100.0,2030.0
546,2016/11/18,2140.0,2133.923,2105.0,124400,2155.0,2100.0
547,2016/11/21,2145.0,2149.55,2145.0,64400,2170.0,2140.0
548,2016/11/22,2160.0,2160.493,2155.0,71000,2170.0,2145.0
549,2016/11/24,2180.0,2178.042,2185.0,67400,2185.0,2165.0
550,2016/11/25,2215.0,2206.957,2190.0,78200,2220.0,2185.0
551,2016/11/28,2225.0,2210.826,2205.0,84800,2230.0,2190.0
552,2016/11/29,2225.0,2228.041,2225.0,77600,2240.0,2220.0
553,2016/11/30,2225.0,2215.141,2230.0,70800,2230.0,2200.0
554,2016/12/01,2270.0,2266.014,2240.0,114400,2280.0,2235.0
555,2016/12/02,2270.0,2258.711,2270.0,88400,2270.0,2240.0
556,2016/12/05,2260.0,2256.937,2250.0,63000,2270.0,2245.0
557,2016/12/06,2305.0,2304.183,2275.0,93000,2320.0,2275.0
558,2016/12/07,2345.0,2341.087,2345.0,110400,2360.0,2325.0
559,2016/12/08,2320.0,2315.661,2365.0,106000,2370.0,2290.0
560,2016/12/09,2380.0,2354.893,2330.0,121200,2385.0,2330.0
561,2016/12/12,2355.0,2362.742,2420.0,121800,2420.0,2330.0
562,2016/12/13,2385.0,2358.783,2345.0,83000,2385.0,2330.0
563,2016/12/14,2330.0,2338.25,2365.0,83400,2365.0,2320.0
564,2016/12/15,2355.0,2347.334,2335.0,90000,2360.0,2330.0
565,2016/12/16,2390.0,2380.145,2360.0,76200,2395.0,2360.0
566,2016/12/19,2365.0,2377.656,2385.0,54600,2400.0,2365.0
567,2016/12/20,2345.0,2337.323,2350.0,59400,2350.0,2325.0
568,2016/12/21,2300.0,2311.063,2345.0,80000,2345.0,2290.0
569,2016/12/22,2310.0,2300.152,2300.0,66000,2315.0,2280.0
570,2016/12/26,2250.0,2262.446,2285.0,73600,2295.0,2245.0
571,2016/12/27,2230.0,2236.853,2240.0,55600,2250.0,2220.0
572,2016/12/28,2245.0,2249.936,2240.0,78400,2280.0,2235.0
573,2016/12/29,2215.0,2218.257,2230.0,52200,2240.0,2205.0
574,2016/12/30,2285.0,2261.716,2220.0,81000,2295.0,2210.0
575,2017/01/04,2390.0,2365.732,2310.0,112000,2390.0,2310.0
576,2017/01/05,2335.0,2347.506,2390.0,81400,2390.0,2315.0
577,2017/01/06,2310.0,2298.278,2310.0,54000,2315.0,2285.0
578,2017/01/10,2300.0,2292.537,2310.0,67400,2310.0,2270.0
579,2017/01/11,2340.0,2326.697,2305.0,56000,2340.0,2295.0
580,2017/01/12,2335.0,2329.933,2340.0,59200,2350.0,2305.0
581,2017/01/13,2345.0,2336.108,2315.0,38800,2345.0,2315.0
582,2017/01/16,2270.0,2287.573,2315.0,75400,2325.0,2270.0
583,2017/01/17,2255.0,2251.716,2260.0,47200,2275.0,2235.0
584,2017/01/18,2265.0,2256.418,2255.0,38800,2275.0,2225.0
585,2017/01/19,2300.0,2298.957,2295.0,46000,2310.0,2285.0
586,2017/01/20,2310.0,2302.93,2300.0,45400,2315.0,2285.0
587,2017/01/23,2270.0,2277.146,2300.0,50800,2300.0,2260.0
588,2017/01/24,2250.0,2249.543,2245.0,61200,2280.0,2235.0
589,2017/01/25,2270.0,2264.51,2270.0,49000,2290.0,2245.0
590,2017/01/26,2300.0,2289.446,2295.0,77600,2300.0,2270.0
591,2017/01/27,2315.0,2310.805,2300.0,70800,2325.0,2285.0
592,2017/01/30,2330.0,2329.843,2320.0,57200,2340.0,2315.0
593,2017/01/31,2265.0,2277.317,2285.0,76400,2310.0,2260.0
594,2017/02/01,2305.0,2294.377,2265.0,69000,2310.0,2260.0
595,2017/02/02,2235.0,2249.772,2300.0,96200,2300.0,2225.0
596,2017/02/03,2270.0,2268.014,2230.0,59400,2280.0,2230.0
597,2017/02/06,2430.0,2391.961,2310.0,161200,2435.0,2305.0
598,2017/02/07,2435.0,2442.56,2425.0,143400,2460.0,2415.0
599,2017/02/08,2435.0,2430.522,2435.0,46000,2450.0,2415.0
600,2017/02/09,2370.0,2377.415,2410.0,82400,2410.0,2355.0
601,2017/02/10,2425.0,2420.225,2410.0,71200,2440.0,2400.0
602,2017/02/13,2420.0,2423.767,2435.0,59200,2435.0,2410.0
603,2017/02/14,2470.0,2474.205,2445.0,96800,2495.0,2435.0
604,2017/02/15,2495.0,2500.689,2485.0,78400,2525.0,2485.0
605,2017/02/16,2510.0,2491.469,2490.0,60600,2515.0,2455.0
606,2017/02/17,2515.0,2517.61,2500.0,59400,2525.0,2500.0
607,2017/02/20,2530.0,2524.39,2515.0,57400,2535.0,2500.0
608,2017/02/21,2530.0,2523.223,2525.0,33200,2530.0,2510.0
609,2017/02/22,2500.0,2504.015,2530.0,53800,2530.0,2495.0
610,2017/02/23,2510.0,2506.872,2515.0,37400,2525.0,2495.0
611,2017/02/24,2440.0,2448.218,2470.0,66200,2470.0,2435.0
612,2017/02/27,2445.0,2447.903,2440.0,53400,2465.0,2435.0
613,2017/02/28,2465.0,2468.876,2460.0,67600,2485.0,2460.0
614,2017/03/01,2450.0,2453.951,2465.0,61000,2470.0,2435.0
615,2017/03/02,2490.0,2484.244,2490.0,41000,2490.0,2475.0
616,2017/03/03,2460.0,2456.556,2465.0,78400,2475.0,2440.0
617,2017/03/06,2480.0,2474.421,2460.0,41400,2485.0,2450.0
618,2017/03/07,2445.0,2443.228,2470.0,53600,2470.0,2435.0
619,2017/03/08,2410.0,2415.668,2445.0,64400,2445.0,2405.0
620,2017/03/09,2460.0,2437.731,2420.0,73600,2465.0,2400.0
621,2017/03/10,2495.0,2486.109,2490.0,86600,2500.0,2465.0
622,2017/03/13,2510.0,2504.332,2500.0,37400,2515.0,2490.0
623,2017/03/14,2550.0,2545.51,2495.0,102000,2575.0,2480.0
624,2017/03/15,2515.0,2522.599,2545.0,45400,2545.0,2510.0
625,2017/03/16,2575.0,2551.44,2485.0,64600,2585.0,2485.0
626,2017/03/17,2670.0,2663.902,2620.0,184000,2700.0,2620.0
627,2017/03/21,2730.0,2720.01,2670.0,100000,2745.0,2670.0
628,2017/03/22,2660.0,2672.374,2665.0,99000,2695.0,2650.0
629,2017/03/23,2740.0,2733.975,2665.0,126800,2750.0,2665.0
630,2017/03/24,2705.0,2717.707,2740.0,150000,2750.0,2695.0
631,2017/03/27,2695.0,2689.003,2660.0,81200,2705.0,2660.0
632,2017/03/28,2840.0,2796.782,2720.0,162800,2845.0,2720.0
633,2017/03/29,2800.0,2809.173,2840.0,54400,2840.0,2795.0
634,2017/03/30,2780.0,2787.981,2800.0,62400,2805.0,2775.0
635,2017/03/31,2770.0,2796.428,2790.0,117000,2835.0,2770.0
636,2017/04/03,2810.0,2809.86,2785.0,78400,2830.0,2780.0
637,2017/04/04,2820.0,2808.6,2810.0,105000,2830.0,2775.0
638,2017/04/05,2800.0,2800.475,2815.0,124200,2820.0,2780.0
639,2017/04/06,2750.0,2765.656,2780.0,134200,2800.0,2740.0
640,2017/04/07,2760.0,2765.164,2750.0,103600,2785.0,2750.0
641,2017/04/10,2765.0,2761.715,2770.0,76400,2775.0,2745.0
642,2017/04/11,2680.0,2692.129,2735.0,93000,2735.0,2670.0
643,2017/04/12,2610.0,2617.138,2635.0,87000,2640.0,2590.0
644,2017/04/13,2590.0,2582.422,2595.0,90000,2605.0,2560.0
645,2017/04/14,2540.0,2550.122,2570.0,107000,2580.0,2530.0
646,2017/04/17,2545.0,2531.797,2540.0,102400,2550.0,2510.0
647,2017/04/18,2565.0,2575.34,2565.0,61800,2610.0,2555.0
648,2017/04/19,2600.0,2604.967,2570.0,91000,2630.0,2545.0
649,2017/04/20,2625.0,2637.823,2640.0,71200,2670.0,2615.0
650,2017/04/21,2670.0,2664.615,2670.0,72600,2680.0,2640.0
651,2017/04/24,2725.0,2708.686,2710.0,81400,2730.0,2690.0
652,2017/04/25,2745.0,2738.353,2720.0,85600,2745.0,2720.0
653,2017/04/26,2760.0,2751.037,2755.0,70400,2770.0,2730.0
654,2017/04/27,2810.0,2791.191,2770.0,71400,2810.0,2755.0
655,2017/04/28,2815.0,2809.0,2810.0,60000,2825.0,2795.0
656,2017/05/01,2885.0,2859.165,2815.0,94600,2895.0,2815.0
657,2017/05/02,2920.0,2914.896,2915.0,95600,2920.0,2900.0
658,2017/05/08,3030.0,3004.399,2950.0,128000,3035.0,2950.0
659,2017/05/09,3010.0,3028.599,3030.0,122000,3060.0,3005.0
660,2017/05/10,2985.0,2978.389,2980.0,108600,3005.0,2955.0
661,2017/05/11,2985.0,2988.002,3005.0,123600,3020.0,2940.0
662,2017/05/12,2900.0,2911.957,2960.0,96600,2960.0,2885.0
663,2017/05/15,2830.0,2837.142,2830.0,122800,2875.0,2825.0
664,2017/05/16,2805.0,2813.673,2860.0,81400,2870.0,2785.0
665,2017/05/17,2730.0,2747.907,2775.0,121800,2775.0,2730.0
666,2017/05/18,2680.0,2692.384,2695.0,77200,2720.0,2680.0
667,2017/05/19,2675.0,2676.111,2695.0,86400,2710.0,2655.0
668,2017/05/22,2720.0,2705.092,2695.0,76600,2720.0,2670.0
669,2017/05/23,2755.0,2754.942,2735.0,103800,2770.0,2735.0
670,2017/05/24,2835.0,2830.488,2800.0,119000,2850.0,2800.0
671,2017/05/25,2840.0,2843.574,2845.0,117800,2865.0,2825.0
672,2017/05/26,2820.0,2828.867,2860.0,156200,2865.0,2805.0
673,2017/05/29,2730.0,2762.712,2815.0,89600,2815.0,2730.0
674,2017/05/30,2755.0,2747.398,2735.0,113000,2765.0,2715.0
675,2017/05/31,2730.0,2744.824,2765.0,102000,2765.0,2730.0
676,2017/06/01,2705.0,2717.286,2740.0,109800,2750.0,2695.0
677,2017/06/02,2720.0,2722.52,2705.0,125000,2745.0,2700.0
678,2017/06/05,2695.0,2696.405,2715.0,72600,2715.0,2685.0
679,2017/06/06,2745.0,2739.865,2705.0,184200,2770.0,2690.0
680,2017/06/07,2770.0,2776.348,2755.0,166200,2815.0,2735.0
681,2017/06/08,2695.0,2727.09,2775.0,82800,2785.0,2695.0
682,2017/06/09,2710.0,2717.0,2695.0,104000,2770.0,2695.0
683,2017/06/12,2690.0,2681.083,2700.0,94200,2720.0,2660.0
684,2017/06/13,2720.0,2714.791,2680.0,76400,2735.0,2680.0
685,2017/06/14,2655.0,2679.137,2740.0,71800,2740.0,2655.0
686,2017/06/15,2605.0,2616.081,2655.0,88800,2655.0,2595.0
687,2017/06/16,2625.0,2621.018,2615.0,209200,2640.0,2600.0
688,2017/06/19,2630.0,2632.064,2625.0,34400,2650.0,2620.0
689,2017/06/20,2720.0,2697.712,2660.0,125000,2725.0,2645.0
690,2017/06/21,2730.0,2748.449,2720.0,98600,2775.0,2720.0
691,2017/06/22,2745.0,2740.888,2745.0,55200,2750.0,2730.0
692,2017/06/23,2730.0,2739.242,2755.0,48800,2765.0,2725.0
693,2017/06/26,2815.0,2803.263,2760.0,104200,2825.0,2750.0
694,2017/06/27,2785.0,2791.313,2820.0,67800,2830.0,2775.0
695,2017/06/28,2750.0,2759.479,2775.0,48000,2785.0,2740.0
696,2017/06/29,2755.0,2753.077,2770.0,36400,2775.0,2735.0
697,2017/06/30,2700.0,2687.707,2725.0,96800,2725.0,2655.0
698,2017/07/03,2730.0,2724.128,2740.0,56200,2740.0,2700.0
699,2017/07/04,2730.0,2735.087,2760.0,69200,2760.0,2715.0
700,2017/07/05,2755.0,2740.378,2705.0,68800,2755.0,2705.0
701,2017/07/06,2780.0,2771.656,2720.0,94200,2800.0,2720.0
702,2017/07/07,2945.0,2883.026,2755.0,235000,2945.0,2750.0
703,2017/07/10,2950.0,2951.549,2990.0,127200,2990.0,2915.0
704,2017/07/11,3050.0,3041.154,2935.0,171600,3105.0,2935.0
705,2017/07/12,3150.0,3131.45,3050.0,229000,3175.0,3050.0
706,2017/07/13,3110.0,3125.53,3195.0,194600,3210.0,3085.0
707,2017/07/14,3125.0,3127.353,3095.0,112200,3170.0,3090.0
708,2017/07/18,3055.0,3063.296,3095.0,116200,3115.0,3035.0
709,2017/07/19,3030.0,3044.923,3055.0,115800,3085.0,3015.0
710,2017/07/20,3075.0,3062.893,3060.0,72600,3075.0,3040.0
711,2017/07/21,3145.0,3113.491,3075.0,145800,3155.0,3060.0
712,2017/07/24,3185.0,3154.416,3135.0,106200,3190.0,3100.0
713,2017/07/25,3230.0,3222.819,3185.0,191600,3260.0,3170.0
714,2017/07/26,3290.0,3262.033,3235.0,223800,3295.0,3205.0
715,2017/07/27,3260.0,3273.368,3290.0,144600,3305.0,3245.0
716,2017/07/28,3235.0,3223.498,3255.0,123800,3260.0,3175.0
717,2017/07/31,3215.0,3190.58,3235.0,131000,3235.0,3130.0
718,2017/08/01,3170.0,3171.888,3210.0,90600,3220.0,3135.0
719,2017/08/02,3180.0,3169.689,3165.0,86800,3195.0,3140.0
720,2017/08/03,3150.0,3150.825,3195.0,76400,3200.0,3135.0
721,2017/08/04,3200.0,3201.371,3230.0,186800,3265.0,3155.0
722,2017/08/07,3130.0,3152.845,3215.0,123400,3230.0,3125.0
723,2017/08/08,3095.0,3091.258,3130.0,93800,3130.0,3065.0
724,2017/08/09,3040.0,3029.036,3090.0,89200,3090.0,3005.0
725,2017/08/10,3000.0,3014.418,3040.0,116800,3070.0,2990.0
726,2017/08/14,2975.0,2976.503,2970.0,103800,3010.0,2940.0
727,2017/08/15,2945.0,2961.47,3000.0,140800,3010.0,2940.0
728,2017/08/16,2980.0,2990.761,2980.0,146000,3015.0,2960.0
729,2017/08/17,2980.0,2961.504,2980.0,89800,2990.0,2930.0
730,2017/08/18,2920.0,2920.214,2935.0,103000,2935.0,2905.0
731,2017/08/21,2910.0,2905.955,2930.0,74400,2930.0,2885.0
732,2017/08/22,2910.0,2901.191,2890.0,89000,2940.0,2870.0
733,2017/08/23,2905.0,2916.088,2960.0,95600,2960.0,2900.0
734,2017/08/24,2860.0,2883.347,2905.0,98000,2925.0,2860.0
735,2017/08/25,2905.0,2886.477,2860.0,101600,2920.0,2850.0
736,2017/08/28,2890.0,2888.007,2900.0,56200,2920.0,2870.0
737,2017/08/29,2940.0,2908.735,2855.0,101200,2955.0,2850.0
738,2017/08/30,2955.0,2948.695,2945.0,95800,2965.0,2925.0
739,2017/08/31,2915.0,2936.165,2955.0,93600,2970.0,2910.0
740,2017/09/01,3115.0,3036.029,3000.0,442200,3120.0,2915.0
741,2017/09/04,3090.0,3068.812,3095.0,195200,3125.0,3010.0
742,2017/09/05,3025.0,3059.882,3095.0,118200,3125.0,3020.0
743,2017/09/06,3045.0,3025.351,2975.0,71200,3065.0,2955.0
744,2017/09/07,3100.0,3073.837,3025.0,118600,3110.0,3025.0
745,2017/09/08,3075.0,3088.447,3100.0,88200,3115.0,3055.0
746,2017/09/11,3085.0,3095.131,3120.0,68600,3120.0,3070.0
747,2017/09/12,3150.0,3135.287,3120.0,115000,3150.0,3115.0
748,2017/09/13,3165.0,3162.913,3180.0,89600,3185.0,3135.0
749,2017/09/14,3155.0,3167.997,3190.0,133800,3210.0,3135.0
750,2017/09/15,3135.0,3142.804,3155.0,144800,3190.0,3115.0
751,2017/09/19,3265.0,3212.771,3175.0,210400,3265.0,3155.0
752,2017/09/20,3175.0,3183.34,3275.0,148800,3275.0,3145.0
753,2017/09/21,3220.0,3187.512,3180.0,130600,3220.0,3140.0
754,2017/09/22,3310.0,3283.977,3270.0,282400,3320.0,3225.0
755,2017/09/25,3365.0,3355.896,3340.0,294600,3450.0,3295.0
756,2017/09/26,3385.0,3378.384,3365.0,125600,3395.0,3355.0
757,2017/09/27,3355.0,3341.563,3340.0,109700,3370.0,3305.0
758,2017/09/28,3420.0,3394.102,3365.0,106300,3420.0,3345.0
759,2017/09/29,3450.0,3423.931,3405.0,158100,3455.0,3350.0
760,2017/10/02,3435.0,3437.039,3480.0,75300,3480.0,3410.0
761,2017/10/03,3385.0,3410.534,3465.0,141400,3470.0,3370.0
762,2017/10/04,3355.0,3361.471,3370.0,82600,3385.0,3345.0
763,2017/10/05,3415.0,3414.47,3370.0,131200,3450.0,3370.0
764,2017/10/06,3450.0,3464.994,3485.0,171500,3520.0,3430.0
765,2017/10/10,3450.0,3427.607,3440.0,119700,3465.0,3395.0
766,2017/10/11,3415.0,3413.248,3455.0,83600,3455.0,3385.0
767,2017/10/12,3465.0,3455.362,3455.0,116100,3495.0,3400.0
768,2017/10/13,3480.0,3483.606,3465.0,169300,3510.0,3445.0
769,2017/10/16,3465.0,3483.469,3500.0,114600,3510.0,3460.0
770,2017/10/17,3475.0,3475.611,3500.0,76900,3505.0,3450.0
771,2017/10/18,3365.0,3370.142,3460.0,221200,3480.0,3325.0
772,2017/10/19,3385.0,3385.511,3415.0,129100,3415.0,3355.0
773,2017/10/20,3440.0,3429.642,3420.0,148200,3460.0,3375.0
774,2017/10/23,3625.0,3592.823,3500.0,329100,3655.0,3480.0
775,2017/10/24,3675.0,3656.474,3650.0,234000,3695.0,3605.0
776,2017/10/25,3675.0,3701.431,3700.0,344200,3770.0,3655.0
777,2017/10/26,3715.0,3717.806,3715.0,217200,3755.0,3690.0
778,2017/10/27,3745.0,3754.391,3725.0,193900,3795.0,3715.0
779,2017/10/30,3755.0,3747.925,3755.0,359100,3790.0,3680.0
780,2017/10/31,3805.0,3810.241,3750.0,160100,3840.0,3750.0
781,2017/11/01,3860.0,3845.975,3845.0,180000,3890.0,3760.0
782,2017/11/02,3795.0,3826.943,3860.0,194000,3895.0,3795.0
783,2017/11/06,3340.0,3335.497,3515.0,636500,3515.0,3245.0
784,2017/11/07,3460.0,3393.38,3340.0,440200,3465.0,3270.0
785,2017/11/08,3345.0,3349.587,3390.0,182700,3390.0,3325.0
786,2017/11/09,3350.0,3340.455,3355.0,222200,3390.0,3300.0
787,2017/11/10,3290.0,3300.082,3280.0,213800,3350.0,3275.0
788,2017/11/13,3195.0,3215.634,3280.0,248600,3280.0,3180.0
789,2017/11/14,3150.0,3146.68,3185.0,247700,3220.0,3115.0
790,2017/11/15,3060.0,3068.655,3100.0,248600,3115.0,3040.0
791,2017/11/16,3225.0,3188.018,3110.0,289100,3230.0,3090.0
792,2017/11/17,3290.0,3308.158,3315.0,407700,3395.0,3260.0
793,2017/11/20,3325.0,3322.215,3255.0,152800,3365.0,3245.0
794,2017/11/21,3315.0,3310.081,3350.0,116700,3350.0,3280.0
795,2017/11/22,3385.0,3380.29,3365.0,139700,3400.0,3350.0
796,2017/11/24,3330.0,3324.021,3350.0,75100,3350.0,3300.0
797,2017/11/27,3335.0,3329.309,3380.0,73800,3385.0,3305.0
798,2017/11/28,3295.0,3310.803,3340.0,66600,3355.0,3290.0
799,2017/11/29,3375.0,3351.894,3345.0,111700,3375.0,3315.0
800,2017/11/30,3370.0,3369.842,3385.0,135800,3385.0,3330.0
801,2017/12/01,3310.0,3312.453,3370.0,148200,3390.0,3275.0
802,2017/12/04,3270.0,3285.17,3310.0,123400,3340.0,3260.0
803,2017/12/05,3270.0,3243.732,3245.0,105700,3280.0,3185.0
804,2017/12/06,3220.0,3227.672,3245.0,118100,3265.0,3205.0
805,2017/12/07,3320.0,3304.602,3260.0,121800,3335.0,3245.0
806,2017/12/08,3280.0,3268.484,3250.0,174500,3310.0,3245.0
807,2017/12/11,3275.0,3263.701,3260.0,177000,3305.0,3230.0
808,2017/12/12,3275.0,3268.934,3280.0,100800,3305.0,3255.0
809,2017/12/13,3215.0,3227.664,3265.0,151100,3290.0,3200.0
810,2017/12/14,3255.0,3243.575,3245.0,104200,3260.0,3220.0
811,2017/12/15,3215.0,3233.227,3240.0,154000,3290.0,3205.0
812,2017/12/18,3250.0,3250.641,3240.0,99100,3265.0,3225.0
813,2017/12/19,3220.0,3235.496,3255.0,80600,3260.0,3220.0
814,2017/12/20,3245.0,3234.882,3210.0,76000,3245.0,3210.0
815,2017/12/21,3245.0,3251.936,3250.0,97100,3285.0,3235.0
816,2017/12/22,3275.0,3264.501,3250.0,116300,3285.0,3225.0
817,2017/12/25,3245.0,3264.803,3275.0,73500,3305.0,3235.0
818,2017/12/26,3190.0,3206.927,3245.0,91600,3260.0,3190.0
819,2017/12/27,3255.0,3241.041,3195.0,81200,3265.0,3195.0
820,2017/12/28,3225.0,3251.551,3255.0,75100,3285.0,3220.0
821,2017/12/29,3250.0,3262.76,3225.0,115200,3290.0,3225.0
822,2018/01/04,3290.0,3277.997,3260.0,99100,3305.0,3260.0
823,2018/01/05,3270.0,3263.725,3305.0,85900,3310.0,3245.0
824,2018/01/09,3350.0,3322.474,3320.0,134600,3350.0,3265.0
825,2018/01/10,3365.0,3384.738,3380.0,152800,3465.0,3340.0
826,2018/01/11,3430.0,3399.802,3380.0,123900,3430.0,3335.0
827,2018/01/12,3355.0,3372.869,3430.0,90100,3435.0,3350.0
828,2018/01/15,3345.0,3356.972,3405.0,63900,3405.0,3340.0
829,2018/01/16,3385.0,3363.924,3350.0,79000,3390.0,3325.0
830,2018/01/17,3340.0,3344.754,3345.0,63100,3370.0,3335.0
831,2018/01/18,3320.0,3334.792,3380.0,91200,3380.0,3320.0
832,2018/01/19,3320.0,3314.43,3315.0,64900,3340.0,3300.0
833,2018/01/22,3250.0,3260.728,3315.0,95500,3320.0,3245.0
834,2018/01/23,3420.0,3384.309,3300.0,191000,3425.0,3300.0
835,2018/01/24,3320.0,3354.61,3395.0,121900,3400.0,3320.0
836,2018/01/25,3305.0,3315.861,3305.0,73200,3340.0,3295.0
837,2018/01/26,3290.0,3303.983,3315.0,75700,3335.0,3290.0
838,2018/01/29,3345.0,3333.851,3310.0,70500,3355.0,3295.0
839,2018/01/30,3270.0,3294.481,3335.0,89600,3345.0,3265.0
840,2018/01/31,3270.0,3282.892,3265.0,102700,3305.0,3255.0
841,2018/02/01,3255.0,3249.822,3285.0,109800,3300.0,3235.0
842,2018/02/02,3260.0,3251.152,3235.0,98500,3275.0,3230.0
843,2018/02/05,3110.0,3119.025,3200.0,189800,3220.0,3075.0
844,2018/02/06,2865.0,2875.375,2920.0,135200,2940.0,2811.0
845,2018/02/07,2600.0,2702.927,2715.0,557700,2834.0,2600.0
846,2018/02/08,2631.0,2631.429,2626.0,643100,2687.0,2589.0
847,2018/02/09,2500.0,2473.377,2491.0,414400,2503.0,2438.0
848,2018/02/13,2424.0,2430.903,2530.0,402100,2540.0,2391.0
849,2018/02/14,2369.0,2405.612,2421.0,261600,2467.0,2360.0
850,2018/02/15,2446.0,2437.574,2369.0,331900,2515.0,2349.0
851,2018/02/16,2478.0,2474.666,2451.0,125600,2498.0,2436.0
852,2018/02/19,2544.0,2527.231,2500.0,130400,2556.0,2470.0
853,2018/02/20,2566.0,2552.52,2536.0,130500,2574.0,2512.0
854,2018/02/21,2550.0,2567.118,2560.0,94900,2603.0,2544.0
855,2018/02/22,2504.0,2506.889,2525.0,97400,2530.0,2485.0
856,2018/02/23,2524.0,2515.894,2506.0,63400,2528.0,2496.0
857,2018/02/26,2509.0,2511.858,2538.0,116300,2542.0,2492.0
858,2018/02/27,2514.0,2524.571,2534.0,64600,2544.0,2511.0
859,2018/02/28,2506.0,2518.081,2504.0,95600,2540.0,2503.0
860,2018/03/01,2456.0,2464.007,2485.0,152500,2487.0,2441.0
861,2018/03/02,2420.0,2418.316,2406.0,97800,2432.0,2401.0
862,2018/03/05,2385.0,2382.939,2420.0,104600,2424.0,2359.0
863,2018/03/06,2452.0,2464.058,2427.0,130600,2505.0,2427.0
864,2018/03/07,2387.0,2398.134,2420.0,113400,2441.0,2375.0
865,2018/03/08,2371.0,2376.187,2407.0,66200,2407.0,2362.0
866,2018/03/09,2400.0,2410.267,2400.0,109200,2457.0,2386.0
867,2018/03/12,2442.0,2443.815,2450.0,84500,2476.0,2416.0
868,2018/03/13,2443.0,2428.514,2407.0,63100,2448.0,2401.0
869,2018/03/14,2446.0,2447.392,2443.0,57600,2465.0,2427.0
870,2018/03/15,2432.0,2421.653,2432.0,82700,2461.0,2388.0
871,2018/03/16,2393.0,2396.87,2432.0,54400,2435.0,2386.0
872,2018/03/19,2370.0,2375.301,2390.0,65500,2423.0,2354.0
873,2018/03/20,2341.0,2337.145,2342.0,67700,2354.0,2322.0
874,2018/03/22,2284.0,2273.291,2348.0,226900,2353.0,2229.0
875,2018/03/23,2198.0,2209.663,2236.0,129900,2254.0,2186.0
876,2018/03/26,2251.0,2208.195,2175.0,126900,2253.0,2150.0
877,2018/03/27,2295.0,2254.474,2250.0,174200,2296.0,2197.0
878,2018/03/28,2265.0,2241.626,2257.0,101900,2268.0,2201.0
879,2018/03/29,2249.0,2248.968,2281.0,85200,2299.0,2220.0
880,2018/03/30,2256.0,2250.458,2256.0,141700,2272.0,2235.0
881,2018/04/02,2253.0,2257.939,2263.0,112500,2274.0,2237.0
882,2018/04/03,2195.0,2200.046,2214.0,129600,2225.0,2186.0
883,2018/04/04,2233.0,2221.513,2205.0,104400,2239.0,2194.0
884,2018/04/05,2244.0,2242.767,2234.0,89100,2260.0,2222.0
885,2018/04/06,2206.0,2226.52,2243.0,105300,2273.0,2204.0
886,2018/04/09,2189.0,2177.025,2200.0,104400,2202.0,2151.0
887,2018/04/10,2232.0,2219.264,2180.0,122700,2243.0,2180.0
888,2018/04/11,2302.0,2290.642,2240.0,151500,2329.0,2226.0
889,2018/04/12,2244.0,2265.878,2305.0,90400,2305.0,2241.0
890,2018/04/13,2293.0,2301.922,2253.0,86100,2331.0,2253.0
891,2018/04/16,2335.0,2326.326,2318.0,82200,2340.0,2305.0
892,2018/04/17,2357.0,2368.237,2345.0,129600,2412.0,2345.0
893,2018/04/18,2398.0,2391.819,2376.0,79700,2410.0,2361.0
894,2018/04/19,2414.0,2429.382,2419.0,111500,2456.0,2403.0
895,2018/04/20,2400.0,2399.547,2420.0,91800,2427.0,2379.0
896,2018/04/23,2392.0,2403.518,2428.0,93200,2446.0,2382.0
897,2018/04/24,2423.0,2427.883,2430.0,67300,2451.0,2407.0
898,2018/04/25,2397.0,2385.393,2405.0,113300,2423.0,2353.0
899,2018/04/26,2398.0,2412.606,2423.0,107000,2452.0,2391.0
900,2018/04/27,2368.0,2364.849,2407.0,88700,2411.0,2340.0
901,2018/05/01,2345.0,2347.801,2369.0,88900,2371.0,2325.0
902,2018/05/02,2363.0,2358.088,2362.0,98300,2379.0,2339.0
903,2018/05/07,2390.0,2387.378,2369.0,110100,2413.0,2352.0
904,2018/05/08,2355.0,2363.761,2385.0,124400,2385.0,2345.0
905,2018/05/09,2407.0,2432.062,2405.0,172000,2485.0,2350.0
906,2018/05/10,2232.0,2224.509,2280.0,367900,2286.0,2150.0
907,2018/05/11,2316.0,2281.86,2233.0,170300,2317.0,2226.0
908,2018/05/14,2344.0,2328.268,2330.0,112600,2345.0,2292.0
909,2018/05/15,2354.0,2360.513,2350.0,104400,2386.0,2347.0
910,2018/05/16,2335.0,2330.984,2345.0,112700,2356.0,2308.0
911,2018/05/17,2396.0,2380.838,2335.0,135000,2407.0,2328.0
912,2018/05/18,2487.0,2487.407,2451.0,271600,2516.0,2451.0
913,2018/05/21,2563.0,2584.554,2562.0,322800,2622.0,2552.0
914,2018/05/22,2585.0,2575.913,2568.0,261900,2613.0,2550.0
915,2018/05/23,2597.0,2583.664,2590.0,171200,2603.0,2563.0
916,2018/05/24,2607.0,2611.622,2614.0,299300,2649.0,2592.0
917,2018/05/25,2622.0,2649.274,2657.0,341300,2719.0,2611.0
918,2018/05/28,2619.0,2605.755,2615.0,200900,2644.0,2571.0
919,2018/05/29,2534.0,2538.906,2601.0,297100,2601.0,2513.0
920,2018/05/30,2536.0,2526.728,2500.0,224500,2554.0,2495.0
921,2018/05/31,2497.0,2518.694,2554.0,498900,2566.0,2497.0
922,2018/06/01,2563.0,2568.078,2512.0,145700,2582.0,2500.0
923,2018/06/04,2617.0,2627.142,2598.0,184100,2657.0,2585.0
924,2018/06/05,2603.0,2602.614,2626.0,155100,2626.0,2578.0
925,2018/06/06,2697.0,2684.113,2640.0,271200,2709.0,2623.0
926,2018/06/07,2699.0,2703.913,2703.0,187700,2733.0,2675.0
927,2018/06/08,2686.0,2683.447,2686.0,148300,2701.0,2646.0
928,2018/06/11,2729.0,2700.828,2683.0,176700,2738.0,2658.0
929,2018/06/12,2666.0,2667.775,2697.0,141300,2697.0,2656.0
930,2018/06/13,2641.0,2639.594,2652.0,75400,2660.0,2619.0
931,2018/06/14,2614.0,2601.483,2615.0,107100,2622.0,2569.0
932,2018/06/15,2622.0,2616.523,2616.0,111100,2638.0,2584.0
933,2018/06/18,2608.0,2597.528,2615.0,103600,2619.0,2574.0
934,2018/06/19,2589.0,2583.837,2575.0,143100,2605.0,2552.0
935,2018/06/20,2618.0,2597.646,2590.0,118500,2627.0,2565.0
936,2018/06/21,2596.0,2601.781,2595.0,101000,2634.0,2581.0
937,2018/06/22,2637.0,2633.83,2610.0,171400,2653.0,2593.0
938,2018/06/25,2617.0,2618.037,2626.0,101300,2633.0,2606.0
939,2018/06/26,2634.0,2618.462,2589.0,86200,2640.0,2566.0
940,2018/06/27,2640.0,2641.297,2653.0,50800,2661.0,2617.0
941,2018/06/28,2639.0,2631.524,2621.0,78800,2645.0,2602.0
942,2018/06/29,2648.0,2632.475,2641.0,68400,2661.0,2602.0
943,2018/07/02,2632.0,2644.302,2646.0,98500,2663.0,2630.0
944,2018/07/03,2608.0,2617.364,2632.0,112000,2658.0,2581.0
945,2018/07/04,2610.0,2609.922,2597.0,96500,2625.0,2586.0
946,2018/07/05,2607.0,2609.99,2609.0,98300,2622.0,2601.0
947,2018/07/06,2628.0,2614.502,2607.0,115500,2634.0,2595.0
948,2018/07/09,2669.0,2648.941,2648.0,69300,2672.0,2622.0
949,2018/07/10,2662.0,2670.929,2672.0,77600,2687.0,2660.0
950,2018/07/11,2661.0,2657.274,2648.0,104900,2672.0,2622.0
951,2018/07/12,2657.0,2659.442,2661.0,95700,2669.0,2647.0
952,2018/07/13,2650.0,2641.085,2662.0,96900,2662.0,2615.0
953,2018/07/17,2664.0,2662.459,2648.0,95300,2679.0,2646.0
954,2018/07/18,2660.0,2655.213,2661.0,67000,2667.0,2634.0
955,2018/07/19,2697.0,2687.742,2671.0,107500,2705.0,2650.0
956,2018/07/20,2721.0,2712.692,2700.0,110400,2725.0,2692.0
957,2018/07/23,2635.0,2659.94,2692.0,225900,2710.0,2628.0
958,2018/07/24,2681.0,2667.293,2661.0,152100,2689.0,2638.0
959,2018/07/25,2644.0,2651.281,2686.0,54500,2686.0,2638.0
960,2018/07/26,2698.0,2687.518,2662.0,45800,2701.0,2645.0
961,2018/07/27,2726.0,2714.533,2700.0,79500,2731.0,2675.0
962,2018/07/30,2756.0,2745.992,2728.0,104900,2765.0,2720.0
963,2018/07/31,2778.0,2774.84,2800.0,128400,2815.0,2751.0
964,2018/08/01,2756.0,2751.678,2754.0,125200,2768.0,2724.0
965,2018/08/02,2703.0,2708.967,2710.0,132000,2728.0,2696.0
966,2018/08/03,2623.0,2618.934,2689.0,170400,2689.0,2590.0
967,2018/08/06,2629.0,2630.318,2620.0,106700,2653.0,2602.0
968,2018/08/07,2631.0,2627.21,2619.0,111700,2653.0,2610.0
969,2018/08/08,2714.0,2695.056,2637.0,119900,2724.0,2624.0
970,2018/08/09,2659.0,2657.23,2651.0,71200,2680.0,2639.0
971,2018/08/10,2582.0,2597.728,2671.0,102300,2671.0,2576.0
972,2018/08/13,2533.0,2550.412,2534.0,67900,2588.0,2531.0
973,2018/08/14,2535.0,2524.708,2523.0,52400,2536.0,2511.0
974,2018/08/15,2504.0,2506.321,2540.0,45200,2546.0,2493.0
975,2018/08/16,2441.0,2438.495,2450.0,65600,2467.0,2421.0
976,2018/08/17,2414.0,2400.033,2391.0,95300,2426.0,2378.0
977,2018/08/20,2369.0,2399.529,2414.0,220500,2469.0,2335.0
978,2018/08/21,2355.0,2346.859,2341.0,104200,2374.0,2317.0
979,2018/08/22,2380.0,2375.212,2355.0,55300,2391.0,2355.0
980,2018/08/23,2359.0,2359.76,2378.0,78800,2393.0,2342.0
981,2018/08/24,2344.0,2349.584,2400.0,157300,2406.0,2330.0
982,2018/08/27,2417.0,2396.965,2345.0,112400,2422.0,2345.0
983,2018/08/28,2484.0,2483.962,2451.0,93700,2497.0,2451.0
984,2018/08/29,2529.0,2526.446,2480.0,80900,2545.0,2477.0
985,2018/08/30,2548.0,2547.003,2550.0,103500,2570.0,2532.0
986,2018/08/31,2557.0,2569.793,2538.0,90600,2589.0,2535.0
987,2018/09/03,2571.0,2564.619,2570.0,75000,2579.0,2551.0
988,2018/09/04,2490.0,2491.651,2564.0,114100,2564.0,2463.0
989,2018/09/05,2494.0,2487.858,2474.0,68900,2509.0,2458.0
990,2018/09/06,2503.0,2500.279,2501.0,69300,2533.0,2475.0
991,2018/09/07,2497.0,2490.135,2472.0,48000,2506.0,2466.0
992,2018/09/10,2501.0,2497.271,2492.0,63500,2506.0,2464.0
993,2018/09/11,2527.0,2536.671,2487.0,102600,2567.0,2487.0
994,2018/09/12,2482.0,2484.552,2539.0,174400,2586.0,2426.0
995,2018/09/13,2468.0,2478.695,2458.0,55000,2514.0,2450.0
996,2018/09/14,2530.0,2509.989,2483.0,87500,2546.0,2483.0
997,2018/09/18,2646.0,2624.313,2540.0,96500,2656.0,2529.0
998,2018/09/19,2699.0,2683.848,2673.0,80000,2708.0,2636.0
999,2018/09/20,2659.0,2659.553,2730.0,86600,2730.0,2636.0
1000,2018/09/21,2725.0,2719.153,2687.0,128400,2745.0,2668.0
1001,2018/09/25,2738.0,2719.734,2729.0,92600,2739.0,2674.0
1002,2018/09/26,2756.0,2743.399,2740.0,71500,2759.0,2707.0
1003,2018/09/27,2641.0,2668.706,2691.0,84700,2705.0,2641.0
1004,2018/09/28,2657.0,2673.304,2670.0,80500,2708.0,2650.0
1005,2018/10/01,2602.0,2604.997,2607.0,104600,2633.0,2583.0
1006,2018/10/02,2671.0,2658.557,2618.0,122600,2684.0,2608.0
1007,2018/10/03,2608.0,2636.819,2656.0,96000,2700.0,2600.0
1008,2018/10/04,2621.0,2615.029,2622.0,175800,2672.0,2570.0
1009,2018/10/05,2598.0,2606.552,2620.0,71800,2626.0,2593.0
1010,2018/10/09,2503.0,2516.712,2578.0,65700,2588.0,2495.0
1011,2018/10/10,2544.0,2542.433,2530.0,66700,2567.0,2506.0
1012,2018/10/11,2504.0,2498.915,2494.0,122900,2521.0,2479.0
1013,2018/10/12,2503.0,2505.148,2494.0,70100,2522.0,2492.0
1014,2018/10/15,2492.0,2487.202,2488.0,116800,2506.0,2454.0
1015,2018/10/16,2517.0,2498.744,2442.0,81200,2519.0,2442.0
1016,2018/10/17,2579.0,2571.202,2530.0,67200,2594.0,2525.0
1017,2018/10/18,2517.0,2536.023,2565.0,57700,2588.0,2505.0
1018,2018/10/19,2489.0,2491.894,2500.0,40600,2513.0,2471.0
1019,2018/10/22,2456.0,2449.991,2450.0,44100,2473.0,2413.0
1020,2018/10/23,2375.0,2400.704,2459.0,49300,2459.0,2374.0
1021,2018/10/24,2341.0,2335.586,2354.0,57900,2366.0,2296.0
1022,2018/10/25,2237.0,2250.747,2241.0,66300,2284.0,2237.0
1023,2018/10/26,2248.0,2238.521,2246.0,95900,2265.0,2208.0
1024,2018/10/29,2205.0,2222.349,2228.0,86300,2265.0,2204.0
1025,2018/10/30,2199.0,2198.153,2194.0,158000,2220.0,2160.0
1026,2018/10/31,2238.0,2218.575,2190.0,65100,2245.0,2171.0
1027,2018/11/01,2262.0,2253.751,2200.0,63100,2275.0,2199.0
1028,2018/11/02,2450.0,2428.394,2462.0,154300,2462.0,2366.0
1029,2018/11/05,2395.0,2391.177,2380.0,154300,2417.0,2350.0
1030,2018/11/06,2356.0,2374.14,2359.0,90800,2408.0,2350.0
1031,2018/11/07,2350.0,2345.556,2362.0,163500,2369.0,2296.0
1032,2018/11/08,2252.0,2262.78,2342.0,130800,2344.0,2238.0
1033,2018/11/09,2250.0,2243.728,2240.0,96000,2257.0,2221.0
1034,2018/11/12,2291.0,2274.101,2232.0,49400,2292.0,2225.0
1035,2018/11/13,2237.0,2205.0,2223.0,108600,2240.0,2159.0
1036,2018/11/14,2204.0,2204.465,2228.0,108300,2236.0,2183.0
1037,2018/11/15,2211.0,2185.696,2154.0,103600,2213.0,2154.0
1038,2018/11/16,2188.0,2190.459,2211.0,62100,2236.0,2162.0
1039,2018/11/19,2167.0,2161.036,2168.0,75000,2179.0,2146.0
1040,2018/11/20,2118.0,2117.64,2143.0,75200,2164.0,2106.0
1041,2018/11/21,2135.0,2116.069,2089.0,98100,2136.0,2054.0
1042,2018/11/22,2158.0,2134.056,2133.0,75000,2161.0,2093.0
1043,2018/11/26,2152.0,2167.988,2134.0,76400,2192.0,2123.0
1044,2018/11/27,2130.0,2131.529,2156.0,58200,2160.0,2113.0
1045,2018/11/28,2127.0,2125.151,2147.0,56800,2147.0,2107.0
1046,2018/11/29,2131.0,2125.416,2130.0,76200,2148.0,2101.0
1047,2018/11/30,2174.0,2154.436,2131.0,84500,2189.0,2113.0
1048,2018/12/03,2162.0,2171.01,2176.0,73100,2199.0,2153.0
1049,2018/12/04,2082.0,2099.478,2129.0,86500,2135.0,2077.0
1050,2018/12/05,2045.0,2027.795,2049.0,119700,2049.0,2007.0
1051,2018/12/06,2026.0,2001.305,2000.0,149000,2037.0,1963.0
1052,2018/12/07,2020.0,2001.738,2011.0,107800,2022.0,1970.0
1053,2018/12/10,1961.0,1979.544,1997.0,106500,2000.0,1958.0
1054,2018/12/11,1890.0,1907.992,1961.0,76900,1964.0,1885.0
1055,2018/12/12,1950.0,1940.316,1900.0,68400,1956.0,1900.0
1056,2018/12/13,1974.0,1975.795,1963.0,57100,1989.0,1958.0
1057,2018/12/14,1910.0,1940.409,1971.0,84200,1971.0,1907.0
1058,2018/12/17,1866.0,1877.333,1915.0,59500,1944.0,1859.0
1059,2018/12/18,1860.0,1837.952,1839.0,103300,1866.0,1808.0
1060,2018/12/19,1845.0,1843.029,1879.0,77000,1888.0,1823.0
1061,2018/12/20,1741.0,1766.924,1815.0,84200,1841.0,1737.0
1062,2018/12/21,1719.0,1712.671,1752.0,157700,1755.0,1678.0
1063,2018/12/25,1604.0,1619.828,1625.0,108900,1649.0,1586.0
1064,2018/12/26,1708.0,1702.154,1644.0,95000,1740.0,1644.0
1065,2018/12/27,1802.0,1786.167,1768.0,52600,1802.0,1742.0
1066,2018/12/28,1795.0,1799.218,1806.0,36700,1831.0,1785.0
1067,2019/01/04,1743.0,1735.334,1755.0,54500,1755.0,1708.0
1068,2019/01/07,1807.0,1806.572,1799.0,58900,1826.0,1785.0
1069,2019/01/08,1853.0,1849.614,1838.0,68300,1866.0,1821.0
1070,2019/01/09,1831.0,1835.126,1876.0,44600,1876.0,1822.0
1071,2019/01/10,1812.0,1806.157,1814.0,35700,1822.0,1787.0
1072,2019/01/11,1790.0,1803.159,1835.0,46700,1835.0,1781.0
1073,2019/01/15,1844.0,1835.353,1768.0,43300,1853.0,1762.0
1074,2019/01/16,1821.0,1829.162,1850.0,37600,1866.0,1815.0
1075,2019/01/17,1815.0,1817.456,1827.0,52800,1857.0,1798.0
1076,2019/01/18,1832.0,1843.621,1831.0,45100,1860.0,1826.0
1077,2019/01/21,1852.0,1848.184,1842.0,40800,1869.0,1834.0
1078,2019/01/22,1839.0,1837.806,1854.0,42700,1862.0,1819.0
1079,2019/01/23,1851.0,1850.519,1879.0,64600,1884.0,1820.0
1080,2019/01/24,1913.0,1900.376,1845.0,58200,1918.0,1845.0
1081,2019/01/25,1946.0,1964.364,1911.0,89300,2009.0,1910.0
1082,2019/01/28,1904.0,1909.183,1931.0,51500,1931.0,1897.0
1083,2019/01/29,1922.0,1913.94,1892.0,39800,1929.0,1892.0
1084,2019/01/30,1916.0,1917.908,1930.0,62800,1940.0,1906.0
1085,2019/01/31,1913.0,1918.867,1956.0,42000,1967.0,1907.0
1086,2019/02/01,1869.0,1893.7,1907.0,56600,1932.0,1866.0
1087,2019/02/04,1869.0,1848.842,1851.0,122400,1871.0,1824.0
1088,2019/02/05,1909.0,1895.171,1858.0,50300,1911.0,1853.0
1089,2019/02/06,1885.0,1895.526,1916.0,60800,1925.0,1874.0
1090,2019/02/07,1925.0,1901.284,1845.0,136300,1936.0,1845.0
1091,2019/02/08,1852.0,1853.996,1888.0,100200,1899.0,1834.0
1092,2019/02/12,1969.0,1949.135,1861.0,60600,1970.0,1861.0
1093,2019/02/13,1969.0,1955.997,1969.0,72000,1979.0,1918.0
1094,2019/02/14,1952.0,1958.39,1974.0,34400,1981.0,1946.0
1095,2019/02/15,1946.0,1941.896,1951.0,29700,1952.0,1923.0
1096,2019/02/18,1979.0,1971.696,1999.0,48400,2006.0,1951.0
1097,2019/02/19,1943.0,1944.746,1955.0,35400,1957.0,1934.0
1098,2019/02/20,1962.0,1958.586,1950.0,51400,1973.0,1943.0
1099,2019/02/21,1972.0,1970.181,1970.0,53000,1982.0,1949.0
1100,2019/02/22,1968.0,1970.73,1980.0,55200,1980.0,1954.0
1101,2019/02/25,1997.0,1990.358,1990.0,78300,2003.0,1958.0
1102,2019/02/26,1983.0,1983.398,1998.0,61800,2000.0,1973.0
1103,2019/02/27,1976.0,1981.738,1999.0,60200,2002.0,1972.0
1104,2019/02/28,1963.0,1963.501,1976.0,63700,1976.0,1932.0
1105,2019/03/01,1982.0,1998.047,1982.0,65700,2023.0,1978.0
1106,2019/03/04,1984.0,1979.511,1990.0,32100,1990.0,1967.0
1107,2019/03/05,1977.0,1971.058,1961.0,44600,1981.0,1960.0
1108,2019/03/06,1924.0,1925.088,1965.0,110000,1968.0,1907.0
1109,2019/03/07,1931.0,1920.228,1910.0,56200,1937.0,1898.0
1110,2019/03/08,1875.0,1887.365,1901.0,88400,1901.0,1866.0
1111,2019/03/11,1897.0,1886.36,1865.0,40600,1899.0,1864.0
1112,2019/03/12,1940.0,1934.088,1921.0,46700,1945.0,1907.0
1113,2019/03/13,1924.0,1929.876,1920.0,51400,1955.0,1916.0
1114,2019/03/14,1921.0,1923.328,1924.0,66100,1938.0,1911.0
1115,2019/03/15,1946.0,1948.143,1955.0,51900,1964.0,1936.0
1116,2019/03/18,1990.0,1979.062,1965.0,69400,1990.0,1951.0
1117,2019/03/19,1991.0,1986.748,1990.0,27800,1997.0,1972.0
1118,2019/03/20,2010.0,2002.591,1973.0,38600,2014.0,1973.0
1119,2019/03/22,2041.0,2031.596,2026.0,46300,2042.0,2006.0
1120,2019/03/25,1971.0,1975.312,2000.0,68200,2000.0,1966.0
1121,2019/03/26,2073.0,2053.964,2014.0,109100,2074.0,1998.0
1122,2019/03/27,2043.0,2030.932,2041.0,65700,2053.0,2005.0
1123,2019/03/28,1985.0,1985.682,2010.0,51600,2010.0,1973.0
1124,2019/03/29,1980.0,1985.391,1999.0,23800,2007.0,1977.0
1125,2019/04/01,2059.0,2050.598,2035.0,56500,2063.0,2018.0
1126,2019/04/02,2148.0,2127.785,2078.0,88500,2156.0,2077.0
1127,2019/04/03,2178.0,2160.483,2136.0,54700,2179.0,2119.0
1128,2019/04/04,2201.0,2203.133,2178.0,71500,2218.0,2178.0
1129,2019/04/05,2214.0,2204.059,2214.0,51000,2223.0,2183.0
1130,2019/04/08,2185.0,2190.318,2233.0,53500,2239.0,2177.0
1131,2019/04/09,2167.0,2156.852,2164.0,56600,2179.0,2141.0
1132,2019/04/10,2153.0,2142.305,2130.0,66900,2162.0,2116.0
1133,2019/04/11,2144.0,2136.561,2132.0,37100,2149.0,2119.0
1134,2019/04/12,2215.0,2192.892,2147.0,103500,2227.0,2125.0
1135,2019/04/15,2279.0,2276.667,2231.0,71700,2295.0,2231.0
1136,2019/04/16,2281.0,2281.912,2281.0,56800,2315.0,2250.0
1137,2019/04/17,2323.0,2308.051,2281.0,62700,2327.0,2275.0
1138,2019/04/18,2311.0,2309.049,2323.0,156900,2331.0,2283.0
1139,2019/04/19,2309.0,2307.517,2332.0,60400,2350.0,2294.0
1140,2019/04/22,2330.0,2326.0,2349.0,47500,2349.0,2309.0
1141,2019/04/23,2356.0,2338.643,2338.0,91100,2360.0,2314.0
1142,2019/04/24,2309.0,2313.971,2346.0,107100,2346.0,2287.0
1143,2019/04/25,2330.0,2319.323,2314.0,53900,2339.0,2299.0
1144,2019/04/26,2312.0,2303.377,2316.0,79800,2317.0,2277.0
1145,2019/05/07,2225.0,2240.988,2285.0,72400,2285.0,2224.0
1146,2019/05/08,2153.0,2158.98,2190.0,79900,2207.0,2136.0
1147,2019/05/09,2086.0,2096.257,2124.0,84200,2133.0,2078.0
1148,2019/05/10,2115.0,2111.76,2089.0,63200,2146.0,2088.0
1149,2019/05/13,2125.0,2129.03,2106.0,86600,2158.0,2095.0
1150,2019/05/14,2109.0,2093.091,2075.0,72500,2115.0,2046.0
1151,2019/05/15,2061.0,2020.764,2002.0,193900,2063.0,1974.0
1152,2019/05/16,2056.0,2056.82,2054.0,62800,2110.0,2041.0
1153,2019/05/17,2059.0,2071.228,2085.0,59600,2117.0,2051.0
1154,2019/05/20,2041.0,2029.983,2045.0,52500,2055.0,2001.0
1155,2019/05/21,2048.0,2028.74,2029.0,58900,2051.0,1998.0
1156,2019/05/22,2046.0,2053.722,2061.0,41700,2075.0,2046.0
1157,2019/05/23,2028.0,2027.118,2044.0,43200,2044.0,2009.0
1158,2019/05/24,2028.0,2017.421,1992.0,35900,2029.0,1987.0
1159,2019/05/27,1995.0,2000.613,2030.0,35700,2030.0,1983.0
1160,2019/05/28,2018.0,2001.815,1989.0,85700,2025.0,1951.0
1161,2019/05/29,2005.0,1997.344,1978.0,42700,2020.0,1968.0
1162,2019/05/30,2013.0,1992.297,1976.0,57500,2016.0,1964.0
1163,2019/05/31,1972.0,1976.712,1992.0,36400,1992.0,1960.0
1164,2019/06/03,1924.0,1930.824,1932.0,43100,1957.0,1920.0
1165,2019/06/04,1943.0,1923.891,1914.0,66800,1944.0,1900.0
1166,2019/06/05,2049.0,2033.317,2000.0,66600,2054.0,1998.0
1167,2019/06/06,2010.0,2024.828,2054.0,32600,2078.0,2010.0
1168,2019/06/07,2097.0,2069.933,2020.0,87500,2107.0,2004.0
1169,2019/06/10,2146.0,2130.143,2110.0,78500,2158.0,2087.0
1170,2019/06/11,2186.0,2176.607,2149.0,66200,2187.0,2148.0
1171,2019/06/12,2207.0,2213.389,2189.0,77600,2238.0,2187.0
1172,2019/06/13,2123.0,2133.105,2185.0,63000,2187.0,2110.0
1173,2019/06/14,2188.0,2173.506,2173.0,78200,2201.0,2110.0
1174,2019/06/17,2141.0,2151.041,2171.0,46300,2176.0,2137.0
1175,2019/06/18,2119.0,2140.91,2140.0,43300,2182.0,2116.0
1176,2019/06/19,2227.0,2205.36,2133.0,116000,2231.0,2125.0
1177,2019/06/20,2258.0,2256.93,2240.0,80500,2281.0,2221.0
1178,2019/06/21,2241.0,2266.61,2279.0,125000,2316.0,2238.0
1179,2019/06/24,2301.0,2301.182,2261.0,76500,2329.0,2252.0
1180,2019/06/25,2218.0,2249.59,2286.0,122300,2301.0,2218.0
1181,2019/06/26,2162.0,2186.423,2193.0,87300,2236.0,2162.0
1182,2019/06/27,2267.0,2232.29,2176.0,100300,2267.0,2176.0
1183,2019/06/28,2278.0,2271.834,2250.0,90900,2318.0,2199.0
1184,2019/07/01,2343.0,2322.875,2328.0,92800,2348.0,2288.0
1185,2019/07/02,2378.0,2379.792,2367.0,91800,2400.0,2363.0
1186,2019/07/03,2365.0,2358.074,2371.0,82600,2378.0,2335.0
1187,2019/07/04,2330.0,2326.373,2370.0,60400,2370.0,2306.0
1188,2019/07/05,2313.0,2309.035,2316.0,66700,2326.0,2293.0
1189,2019/07/08,2303.0,2304.974,2313.0,61400,2319.0,2294.0
1190,2019/07/09,2253.0,2256.052,2280.0,75400,2280.0,2234.0
1191,2019/07/10,2325.0,2311.651,2350.0,249600,2350.0,2257.0
1192,2019/07/11,2349.0,2352.966,2350.0,161200,2383.0,2334.0
1193,2019/07/12,2381.0,2351.318,2319.0,154300,2387.0,2294.0
1194,2019/07/16,2380.0,2378.742,2357.0,92500,2390.0,2347.0
1195,2019/07/17,2337.0,2345.944,2380.0,109800,2380.0,2320.0
1196,2019/07/18,2359.0,2358.925,2338.0,195000,2379.0,2336.0
1197,2019/07/19,2475.0,2435.213,2349.0,171800,2477.0,2338.0
1198,2019/07/22,2417.0,2424.529,2466.0,110700,2466.0,2408.0
1199,2019/07/23,2451.0,2448.575,2429.0,82500,2464.0,2418.0
1200,2019/07/24,2489.0,2486.161,2468.0,138800,2508.0,2468.0
1201,2019/07/25,2558.0,2542.213,2515.0,120300,2563.0,2513.0
1202,2019/07/26,2498.0,2489.394,2516.0,134500,2532.0,2469.0
1203,2019/07/29,2458.0,2463.67,2511.0,83600,2517.0,2442.0
1204,2019/07/30,2455.0,2437.518,2433.0,95000,2456.0,2401.0
1205,2019/07/31,2461.0,2469.387,2460.0,106600,2492.0,2457.0
1206,2019/08/01,2414.0,2406.614,2411.0,120600,2433.0,2378.0
1207,2019/08/02,2575.0,2557.408,2500.0,307000,2590.0,2463.0
1208,2019/08/05,2564.0,2553.064,2573.0,230400,2598.0,2503.0
1209,2019/08/06,2559.0,2544.647,2472.0,153600,2575.0,2470.0
1210,2019/08/07,2521.0,2529.42,2541.0,113600,2565.0,2512.0
1211,2019/08/08,2542.0,2541.441,2525.0,62600,2557.0,2514.0
1212,2019/08/09,2640.0,2625.222,2576.0,144900,2657.0,2572.0
1213,2019/08/13,2609.0,2591.084,2590.0,131900,2619.0,2554.0
1214,2019/08/14,2744.0,2707.945,2696.0,202900,2745.0,2655.0
1215,2019/08/15,2758.0,2746.642,2701.0,153800,2765.0,2700.0
1216,2019/08/16,2835.0,2824.992,2745.0,215200,2862.0,2734.0
1217,2019/08/19,2876.0,2877.302,2850.0,135300,2920.0,2846.0
1218,2019/08/20,2830.0,2837.378,2861.0,67400,2863.0,2819.0
1219,2019/08/21,2761.0,2758.91,2780.0,85500,2780.0,2723.0
1220,2019/08/22,2744.0,2758.494,2787.0,111900,2789.0,2733.0
1221,2019/08/23,2740.0,2732.178,2744.0,146400,2770.0,2684.0
