,Date,Close,VWAP,Open,Volume,High,Low
0,2014/08/25,572.2,571.784,571.1,4185400,574.7,569.0
1,2014/08/26,565.9,568.32,570.2,5767800,573.8,565.1
2,2014/08/27,565.0,566.012,565.0,6067400,571.6,563.7
3,2014/08/28,563.8,563.315,562.0,4240000,566.3,561.1
4,2014/08/29,564.2,565.016,560.8,6316500,568.4,560.8
5,2014/09/01,564.6,564.941,563.6,3367400,567.4,562.6
6,2014/09/02,574.5,573.769,566.6,7491700,577.2,564.7
7,2014/09/03,578.9,580.556,579.9,7910300,584.5,576.3
8,2014/09/04,581.7,582.439,583.0,7479300,585.7,576.6
9,2014/09/05,577.7,579.734,584.1,5555200,584.8,576.3
10,2014/09/08,579.2,578.164,576.9,6425100,580.2,576.3
11,2014/09/09,575.5,577.607,582.0,5501900,583.2,575.1
12,2014/09/10,582.2,579.219,572.6,5207100,582.4,571.9
13,2014/09/11,581.3,584.435,586.0,7426900,587.9,580.1
14,2014/09/12,589.9,586.855,585.0,10782000,589.9,580.6
15,2014/09/16,585.2,585.153,590.0,6727700,590.5,581.4
16,2014/09/17,582.1,584.72,589.2,5278800,591.9,582.1
17,2014/09/18,592.6,592.259,588.1,10871700,594.9,588.1
18,2014/09/19,603.1,604.543,597.5,19370200,609.9,596.3
19,2014/09/22,621.9,616.881,610.9,18602100,622.6,607.8
20,2014/09/24,620.7,615.797,609.6,12249600,621.6,606.8
21,2014/09/25,625.8,623.541,624.9,12678800,626.3,620.0
22,2014/09/26,627.3,624.14,615.1,10855500,630.0,615.1
23,2014/09/29,627.0,624.716,627.3,10248100,629.1,621.0
24,2014/09/30,618.4,618.981,628.0,10642900,630.0,613.0
25,2014/10/01,611.6,614.709,613.0,10774300,620.5,610.6
26,2014/10/02,595.1,597.362,595.2,15448200,600.8,594.0
27,2014/10/03,592.0,592.155,593.0,9492500,596.1,589.4
28,2014/10/06,603.6,604.141,601.4,8455100,608.7,599.0
29,2014/10/07,603.1,603.892,601.0,8473000,608.2,599.3
30,2014/10/08,606.0,605.509,596.0,15513900,610.0,595.1
31,2014/10/09,599.2,604.898,610.0,11555800,610.7,598.5
32,2014/10/10,590.8,586.67,580.9,14334000,592.1,580.1
33,2014/10/14,569.3,573.52,577.8,17899000,581.3,568.1
34,2014/10/15,575.0,573.111,570.2,9582300,576.2,568.4
35,2014/10/16,567.3,565.988,561.4,13467400,569.0,561.2
36,2014/10/17,555.3,559.193,575.5,20104700,578.4,550.7
37,2014/10/20,589.9,585.015,575.6,19670800,590.8,572.0
38,2014/10/21,573.0,577.482,587.0,11376800,589.9,571.1
39,2014/10/22,582.6,579.984,580.9,11417900,585.3,573.2
40,2014/10/23,590.2,587.593,585.1,13946500,591.8,579.1
41,2014/10/24,586.6,588.954,597.5,12738100,597.7,585.3
42,2014/10/27,594.8,591.552,595.2,9487600,595.8,584.1
43,2014/10/28,596.9,597.069,595.0,7890500,602.2,592.7
44,2014/10/29,604.0,603.874,603.9,10862500,607.8,598.3
45,2014/10/30,610.5,608.564,604.2,35530700,612.0,599.2
46,2014/10/31,628.4,619.762,612.6,26927200,630.7,609.2
47,2014/11/04,663.0,666.967,678.4,30611900,682.3,652.5
48,2014/11/05,658.0,655.626,661.7,16740300,664.5,647.1
49,2014/11/06,644.7,650.814,657.7,11924900,658.0,643.7
50,2014/11/07,657.0,656.251,651.3,10589200,659.9,650.1
51,2014/11/10,656.1,651.969,651.2,10155900,657.3,645.1
52,2014/11/11,660.9,659.738,665.0,12790200,669.8,649.6
53,2014/11/12,650.6,656.984,665.0,20251200,665.1,650.0
54,2014/11/13,644.0,643.107,649.8,14631600,649.9,638.5
55,2014/11/14,648.0,647.417,652.4,15767700,652.6,641.7
56,2014/11/17,629.5,636.244,644.6,12453500,647.6,628.4
57,2014/11/18,642.0,639.932,640.0,14326200,643.9,635.3
58,2014/11/19,642.4,641.352,641.6,13573000,646.0,635.9
59,2014/11/20,637.4,640.051,648.0,11864200,652.9,635.6
60,2014/11/21,641.8,636.673,640.1,13540000,642.0,630.4
61,2014/11/25,655.5,652.7,648.0,17998100,656.9,641.5
62,2014/11/26,643.6,647.518,656.9,10470800,656.9,643.6
63,2014/11/27,635.5,639.679,643.0,8953300,648.0,635.5
64,2014/11/28,640.8,639.692,635.0,8134600,643.1,633.1
65,2014/12/01,639.3,640.465,639.9,8050700,647.3,636.7
66,2014/12/02,630.0,631.513,634.1,13253600,636.6,629.1
67,2014/12/03,634.8,632.571,631.6,17750400,637.3,625.2
68,2014/12/04,648.0,646.736,644.6,13641500,649.3,642.4
69,2014/12/05,648.8,646.926,648.3,8366400,649.7,644.1
70,2014/12/08,640.3,641.553,650.0,9472600,650.0,637.9
71,2014/12/09,631.8,629.509,631.0,15249000,633.0,627.2
72,2014/12/10,623.0,626.412,628.7,13600400,635.0,622.0
73,2014/12/11,611.1,613.224,620.0,12411600,624.0,610.0
74,2014/12/12,612.5,611.372,605.6,16337300,620.6,604.8
75,2014/12/15,604.8,605.874,603.4,8701200,610.7,600.5
76,2014/12/16,593.0,595.907,598.3,9363300,604.8,592.7
77,2014/12/17,594.6,596.454,594.2,10448400,600.8,592.9
78,2014/12/18,603.5,609.155,612.5,13916000,614.5,603.3
79,2014/12/19,615.6,613.241,615.0,10790500,619.0,609.1
80,2014/12/22,607.8,608.757,611.9,10471800,613.8,605.1
81,2014/12/24,616.9,616.07,614.4,8232000,618.0,613.7
82,2014/12/25,616.3,616.04,613.3,5260000,618.9,613.2
83,2014/12/26,618.7,618.29,616.5,3272800,622.0,615.5
84,2014/12/29,613.7,615.499,622.0,6026000,622.0,610.3
85,2014/12/30,611.9,615.285,616.3,7003500,619.0,611.9
86,2015/01/05,623.7,618.956,612.6,10583000,625.8,608.4
87,2015/01/06,593.3,599.35,610.9,18263600,611.9,593.0
88,2015/01/07,588.7,590.096,589.0,10523700,593.0,586.0
89,2015/01/08,591.9,595.339,598.7,8278100,599.5,590.9
90,2015/01/09,599.2,597.498,595.0,10430800,600.3,595.0
91,2015/01/13,582.7,581.488,590.0,11979100,592.6,577.0
92,2015/01/14,578.0,579.79,578.2,10061000,585.1,577.4
93,2015/01/15,584.3,581.652,578.0,8023900,585.4,576.0
94,2015/01/16,581.1,576.448,576.0,10189400,581.6,573.0
95,2015/01/19,573.2,575.82,584.7,8501400,584.9,572.0
96,2015/01/20,576.3,572.24,570.0,11710900,576.3,565.7
97,2015/01/21,572.0,570.942,575.9,11474100,577.7,565.1
98,2015/01/22,573.9,570.289,570.5,8399200,574.0,565.6
99,2015/01/23,581.7,580.811,578.5,7873300,583.4,578.3
100,2015/01/26,581.8,577.387,577.7,7377000,582.0,571.3
101,2015/01/27,600.5,595.283,593.0,11187400,600.7,589.1
102,2015/01/28,602.0,598.405,593.6,8071700,603.6,592.3
103,2015/01/29,584.3,587.904,596.0,14748400,596.4,582.9
104,2015/01/30,588.4,588.405,585.0,13219100,595.0,582.0
105,2015/02/02,581.7,580.195,582.3,8317200,585.0,576.0
106,2015/02/03,578.9,580.418,581.7,10231800,585.3,577.6
107,2015/02/04,594.8,597.758,584.3,16742800,605.4,584.3
108,2015/02/05,604.3,601.075,597.0,13251000,609.0,592.2
109,2015/02/06,622.0,619.618,615.0,23467800,627.0,612.3
110,2015/02/09,632.7,634.248,629.8,15279900,644.8,626.6
111,2015/02/10,634.9,631.698,629.8,8052800,635.0,625.7
112,2015/02/12,634.8,637.999,644.0,14867000,646.0,632.8
113,2015/02/13,646.1,644.925,640.9,15525600,650.3,637.5
114,2015/02/16,660.3,660.472,655.0,15047500,665.1,650.7
115,2015/02/17,652.7,654.983,655.0,12341400,660.4,650.5
116,2015/02/18,674.6,671.181,660.0,18009800,676.0,659.3
117,2015/02/19,673.2,672.6,670.4,15919400,677.9,666.6
118,2015/02/20,667.2,667.191,677.0,11006700,677.0,662.4
119,2015/02/23,664.6,667.836,676.9,13560100,677.0,658.0
120,2015/02/24,669.8,669.152,665.0,12032500,674.4,662.1
121,2015/02/25,674.0,674.827,676.4,10264500,679.5,672.1
122,2015/02/26,672.0,669.862,673.0,10108300,674.0,666.3
123,2015/02/27,671.6,672.924,674.9,12427300,679.5,667.0
124,2015/03/02,655.1,662.542,685.0,33381500,685.9,653.1
125,2015/03/03,642.8,642.184,651.0,26233100,655.0,635.7
126,2015/03/04,639.0,636.988,635.0,16505900,643.3,630.5
127,2015/03/05,642.9,642.11,639.5,12131800,648.4,637.0
128,2015/03/06,635.2,635.305,640.1,21119100,641.3,631.3
129,2015/03/09,634.0,632.934,631.5,15849900,635.2,630.8
130,2015/03/10,625.5,628.612,636.0,16747600,637.3,623.0
131,2015/03/11,627.0,626.418,622.9,10188800,631.4,621.1
132,2015/03/12,631.1,629.186,627.1,12734300,632.7,623.1
133,2015/03/13,628.0,629.718,631.1,24897200,634.4,627.1
134,2015/03/16,638.0,637.61,631.2,17396200,643.0,628.7
135,2015/03/17,634.4,637.054,643.8,14606400,643.8,634.0
136,2015/03/18,638.0,635.573,637.0,12711700,639.3,631.7
137,2015/03/19,633.4,633.618,639.4,15831600,639.4,631.0
138,2015/03/20,635.7,632.48,634.0,12778900,635.7,630.0
139,2015/03/23,635.0,634.383,633.1,13185500,638.6,630.1
140,2015/03/24,634.5,634.201,636.0,15081100,638.7,632.0
141,2015/03/25,639.9,637.165,638.0,14394200,639.9,634.0
142,2015/03/26,636.5,635.582,636.0,18933900,639.8,633.0
143,2015/03/27,609.0,612.757,617.2,28690400,620.1,603.8
144,2015/03/30,607.1,603.008,603.5,15537600,609.4,596.3
145,2015/03/31,596.6,604.769,612.8,15426700,616.9,596.6
146,2015/04/01,590.7,591.515,595.5,18289300,598.7,586.0
147,2015/04/02,610.2,609.876,600.3,17990000,615.9,597.8
148,2015/04/03,605.6,604.966,609.9,8382500,610.6,601.3
149,2015/04/06,601.4,599.359,600.0,8169300,602.0,594.2
150,2015/04/07,610.0,610.437,609.0,9853500,614.7,605.1
151,2015/04/08,614.5,613.883,615.8,9234400,618.6,611.0
152,2015/04/09,615.6,616.685,619.0,9043800,620.0,612.9
153,2015/04/10,609.1,611.345,617.9,8049000,618.0,607.4
154,2015/04/13,608.3,605.19,607.3,6800100,608.8,601.0
155,2015/04/14,614.9,613.683,608.0,7016200,616.3,606.4
156,2015/04/15,615.7,615.376,612.0,9386200,622.0,611.1
157,2015/04/16,634.9,627.821,617.2,14868800,634.9,617.0
158,2015/04/17,636.2,636.217,634.8,15662900,641.0,625.0
159,2015/04/20,635.4,635.516,626.2,11066100,640.0,624.0
160,2015/04/21,643.0,642.326,639.6,13523700,644.9,635.8
161,2015/04/22,655.4,652.963,644.1,24444200,658.9,643.5
162,2015/04/23,653.4,656.147,660.1,13725700,664.8,646.1
163,2015/04/24,651.5,653.915,653.5,8516000,658.5,650.0
164,2015/04/27,651.1,653.549,656.8,11396900,659.5,648.8
165,2015/04/28,649.8,650.601,651.0,10389800,657.0,647.7
166,2015/04/30,641.7,641.1,646.0,13601300,647.3,635.2
167,2015/05/01,639.8,636.366,635.0,10958600,644.0,627.2
168,2015/05/07,625.0,626.795,626.3,18412700,634.8,621.1
169,2015/05/08,647.9,639.62,631.6,16006900,648.9,626.4
170,2015/05/11,638.3,643.98,655.0,15855200,655.9,636.6
171,2015/05/12,651.4,649.218,648.0,17059000,652.5,641.0
172,2015/05/13,645.1,645.812,646.0,12683700,653.9,640.4
173,2015/05/14,636.6,639.551,646.9,8822500,647.9,633.5
174,2015/05/15,648.3,643.947,645.3,12332600,650.6,635.6
175,2015/05/18,659.5,653.43,642.5,17870900,659.5,641.7
176,2015/05/19,669.9,666.704,659.5,20623300,672.0,657.2
177,2015/05/20,681.7,683.436,676.2,25550600,691.9,672.8
178,2015/05/21,682.7,681.896,680.0,13370300,689.5,671.8
179,2015/05/22,684.8,682.884,688.0,7952000,689.0,678.2
180,2015/05/25,694.5,694.876,689.8,10433900,698.0,687.2
181,2015/05/26,692.7,693.297,694.4,6437700,697.3,690.7
182,2015/05/27,690.8,691.097,685.9,11297400,697.0,682.9
183,2015/05/28,714.7,709.032,698.0,22072600,719.3,692.6
184,2015/05/29,712.8,713.698,714.0,12655600,719.6,708.0
185,2015/06/01,720.4,714.372,707.1,11301800,721.4,705.2
186,2015/06/02,704.8,709.832,721.0,10131000,721.3,703.0
187,2015/06/03,706.3,704.648,700.2,9267200,710.9,696.1
188,2015/06/04,721.2,719.447,709.7,12069100,726.7,703.5
189,2015/06/05,709.3,708.044,712.5,8365700,714.7,702.1
190,2015/06/08,712.3,715.394,719.7,9146900,725.3,707.2
191,2015/06/09,691.5,699.505,702.0,13681100,709.0,690.5
192,2015/06/10,687.5,690.587,688.8,13139300,698.0,685.9
193,2015/06/11,689.3,691.778,695.0,13237300,701.0,686.4
194,2015/06/12,690.1,692.725,696.7,16284200,697.0,686.8
195,2015/06/15,693.2,688.713,684.0,11482700,695.3,678.1
196,2015/06/16,680.3,683.867,684.9,11288300,694.5,679.2
197,2015/06/17,680.9,681.913,684.2,7569700,686.2,679.7
198,2015/06/18,669.9,672.111,680.8,9779800,681.4,666.6
199,2015/06/19,673.4,672.404,676.1,20122300,677.2,667.5
200,2015/06/22,691.3,687.262,675.2,8660300,691.4,675.2
201,2015/06/23,706.0,703.092,700.0,11652100,706.0,693.8
202,2015/06/24,714.4,716.984,715.0,15270100,721.8,713.0
203,2015/06/25,713.3,713.002,712.0,8780200,716.9,708.6
204,2015/06/26,698.2,697.083,700.0,18033300,704.8,692.0
205,2015/06/29,674.4,675.032,668.2,15693900,680.7,667.0
206,2015/06/30,668.5,664.97,671.0,20411200,674.4,657.7
207,2015/07/01,672.7,671.16,670.9,9718200,675.2,664.1
208,2015/07/02,679.8,677.814,676.7,10453600,680.8,674.2
209,2015/07/03,681.6,682.361,679.8,12268400,686.9,678.6
210,2015/07/06,663.5,664.636,668.1,11375900,670.3,660.0
211,2015/07/07,665.5,668.796,674.0,9904800,675.5,663.5
212,2015/07/08,642.3,654.079,667.0,17551200,671.6,641.3
213,2015/07/09,644.0,634.451,630.0,17146900,645.7,622.0
214,2015/07/10,654.7,654.447,645.0,12018500,664.6,643.4
215,2015/07/13,660.9,660.841,661.5,8593300,665.3,655.2
216,2015/07/14,677.9,676.551,676.2,9927600,678.9,670.4
217,2015/07/15,680.8,679.942,678.9,7607900,683.8,675.6
218,2015/07/16,686.0,682.428,684.0,7292700,686.0,678.1
219,2015/07/17,691.5,688.918,687.7,7349700,693.2,682.4
220,2015/07/21,693.8,692.51,696.1,5651400,696.9,689.1
221,2015/07/22,683.5,685.035,689.5,5567300,689.5,681.6
222,2015/07/23,686.7,686.199,690.9,4184400,692.9,682.7
223,2015/07/24,678.7,679.783,683.0,5348200,686.9,676.1
224,2015/07/27,679.4,676.182,671.1,5914100,680.3,670.1
225,2015/07/28,670.5,670.662,674.0,8768200,683.0,651.9
226,2015/07/29,676.5,675.96,675.0,5883400,681.9,671.8
227,2015/07/30,681.7,680.445,674.4,9719800,683.9,673.3
228,2015/07/31,682.2,683.558,685.9,7533900,686.9,680.8
229,2015/08/03,676.4,674.348,680.3,10394400,680.8,668.4
230,2015/08/04,677.5,678.077,676.4,9074000,686.5,673.1
231,2015/08/05,678.0,675.833,677.4,9167800,683.9,663.9
232,2015/08/06,684.6,688.861,685.0,11816500,693.0,678.5
233,2015/08/07,699.8,695.464,684.1,10726500,700.7,683.4
234,2015/08/10,706.0,700.933,698.0,7923500,706.0,694.2
235,2015/08/11,700.0,702.858,704.1,8970100,710.6,696.6
236,2015/08/12,686.0,688.505,696.0,12564600,704.0,680.2
237,2015/08/13,669.4,672.52,681.4,14540600,687.3,668.0
238,2015/08/14,668.2,668.493,670.8,11533500,675.0,665.6
239,2015/08/17,669.6,672.491,672.0,8582200,681.7,667.2
240,2015/08/18,669.0,670.353,673.8,5986500,673.9,667.2
241,2015/08/19,658.6,662.741,669.0,11765300,671.5,658.0
242,2015/08/20,646.2,649.371,658.0,11520500,658.4,646.1
243,2015/08/21,624.4,626.565,634.5,12070000,634.9,622.0
244,2015/08/24,578.2,587.487,595.0,30467300,599.8,573.0
245,2015/08/25,560.6,568.571,552.0,29965400,592.9,545.0
246,2015/08/26,582.6,570.929,562.9,19910700,583.7,553.3
247,2015/08/27,593.4,597.596,595.0,14198200,604.6,592.3
248,2015/08/28,620.0,618.348,613.0,12843800,624.5,610.7
249,2015/08/31,613.8,611.795,612.0,10268900,615.6,606.4
250,2015/09/01,594.4,602.562,610.0,9214000,614.9,594.4
251,2015/09/02,590.5,592.819,582.9,9987300,607.4,582.4
252,2015/09/03,584.2,590.749,596.7,7426000,600.1,583.1
253,2015/09/04,572.8,577.518,593.3,8889700,593.3,566.8
254,2015/09/07,570.0,565.38,565.0,9682600,574.5,550.0
255,2015/09/08,574.1,575.464,570.1,7062000,580.4,569.7
256,2015/09/09,608.8,598.46,593.5,10370800,608.8,585.4
257,2015/09/10,596.8,593.739,590.0,7778100,599.2,583.6
258,2015/09/11,601.3,596.049,590.0,14335400,604.1,585.7
259,2015/09/14,596.5,597.065,602.8,7866300,604.7,591.4
260,2015/09/15,594.2,597.963,597.9,8673800,611.2,589.5
261,2015/09/16,607.6,604.212,602.0,6655500,608.8,594.3
262,2015/09/17,616.9,614.99,612.5,10533800,620.5,610.0
263,2015/09/18,615.6,616.237,625.0,17881800,625.1,611.5
264,2015/09/24,601.5,604.838,609.0,15408000,615.7,598.4
265,2015/09/25,614.8,607.332,601.7,12365200,617.6,592.3
266,2015/09/28,617.8,615.929,613.9,8709900,622.1,607.1
267,2015/09/29,591.8,595.291,600.3,12922500,605.7,586.5
268,2015/09/30,606.3,604.07,597.7,11829800,611.2,593.2
269,2015/10/01,626.7,621.157,608.0,8391400,629.7,605.0
270,2015/10/02,625.9,622.078,618.1,7753900,627.3,615.5
271,2015/10/05,628.6,627.419,627.5,8816400,632.0,620.6
272,2015/10/06,637.5,637.525,635.1,9826800,641.7,631.3
273,2015/10/07,642.0,639.234,636.0,9937500,642.9,628.1
274,2015/10/08,638.5,638.814,640.0,9344900,642.7,633.2
275,2015/10/09,645.0,639.864,640.2,9996800,645.0,630.8
276,2015/10/13,641.4,641.15,644.8,7616500,647.4,636.6
277,2015/10/14,621.9,623.364,634.5,10677000,638.4,618.2
278,2015/10/15,624.5,622.071,618.6,8410700,626.8,615.3
279,2015/10/16,628.6,627.007,628.6,13128900,635.3,622.6
280,2015/10/19,612.8,615.229,623.8,11498300,624.0,604.5
281,2015/10/20,631.0,628.012,619.0,10062100,632.7,616.9
282,2015/10/21,637.6,634.101,625.4,8875400,639.2,621.3
283,2015/10/22,637.6,639.185,634.0,5466700,645.9,631.6
284,2015/10/23,647.9,649.133,649.2,8864100,651.8,644.3
285,2015/10/26,648.6,649.889,653.0,7642500,654.1,644.7
286,2015/10/27,638.5,643.232,650.0,6066000,650.2,638.5
287,2015/10/28,639.3,638.887,639.3,3730000,643.8,635.8
288,2015/10/29,640.4,641.813,647.0,5172700,648.9,635.9
289,2015/10/30,643.6,643.248,641.8,6598300,649.4,635.8
290,2015/11/02,629.6,630.026,639.8,7642300,644.5,625.1
291,2015/11/04,631.2,634.798,636.4,8005600,642.0,630.4
292,2015/11/05,641.8,640.801,633.2,6947600,644.5,632.3
293,2015/11/06,642.9,642.408,645.0,5842800,647.6,635.8
294,2015/11/09,659.3,658.467,650.0,11008400,664.4,647.9
295,2015/11/10,659.3,656.809,653.7,8024100,663.0,648.8
296,2015/11/11,666.5,662.596,657.0,7781600,668.0,654.7
297,2015/11/12,626.0,627.976,636.5,28706900,640.0,620.3
298,2015/11/13,625.3,622.119,616.1,17685300,628.6,614.0
299,2015/11/16,618.4,618.539,613.8,8030100,624.6,611.3
300,2015/11/17,618.7,621.387,624.5,10561200,625.0,618.3
301,2015/11/18,620.3,622.223,623.7,10915600,625.3,617.6
302,2015/11/19,627.0,627.902,624.0,14553800,632.8,622.5
303,2015/11/20,625.7,623.457,624.8,8966000,626.6,618.7
304,2015/11/24,627.0,625.286,623.2,10667900,628.4,619.1
305,2015/11/25,620.0,622.74,624.3,10252500,628.5,619.5
306,2015/11/26,621.7,621.481,621.1,6623600,624.2,618.1
307,2015/11/27,619.7,620.067,620.9,8087900,622.7,618.6
308,2015/11/30,600.8,605.266,617.1,17724900,617.6,600.8
309,2015/12/01,612.1,607.747,601.9,13721300,612.2,597.6
310,2015/12/02,611.8,614.309,612.0,7653900,617.7,608.5
311,2015/12/03,615.5,614.347,611.9,8744600,617.3,609.9
312,2015/12/04,607.1,604.335,604.8,10573000,608.2,601.2
313,2015/12/07,613.3,617.144,615.0,10143400,621.4,610.2
314,2015/12/08,605.7,606.454,611.2,8471900,614.7,602.8
315,2015/12/09,603.2,603.551,601.7,8587300,607.6,600.0
316,2015/12/10,595.4,597.154,600.0,10032000,604.8,593.4
317,2015/12/11,593.4,591.478,589.0,13987200,597.1,587.7
318,2015/12/14,588.3,586.505,583.4,10127500,589.8,583.0
319,2015/12/15,572.6,574.903,585.0,15627000,586.9,570.0
320,2015/12/16,588.5,587.013,574.0,13983100,593.2,574.0
321,2015/12/17,595.7,596.401,597.8,13106800,600.8,590.6
322,2015/12/18,583.2,590.26,595.7,12468800,606.5,583.2
323,2015/12/21,583.9,580.762,578.6,8694100,587.4,572.4
324,2015/12/22,583.5,584.41,585.0,7339900,591.5,582.1
325,2015/12/24,581.2,584.326,583.6,8076800,590.0,581.1
326,2015/12/25,572.1,571.762,578.0,8062300,578.0,568.7
327,2015/12/28,580.8,580.204,577.1,5431700,583.1,575.0
328,2015/12/29,591.6,587.325,578.8,6873100,592.9,578.8
329,2015/12/30,591.2,593.232,592.3,5383000,597.9,587.1
330,2016/01/04,582.5,584.035,584.1,7313200,595.1,578.5
331,2016/01/05,585.8,585.246,580.3,6471500,590.0,580.3
332,2016/01/06,575.3,577.319,589.5,9194800,591.7,571.0
333,2016/01/07,565.7,568.844,575.3,12013100,577.4,563.4
334,2016/01/08,564.5,568.441,560.0,15892900,578.2,558.7
335,2016/01/12,540.0,545.652,554.5,18074200,560.2,540.0
336,2016/01/13,560.6,558.926,549.8,12882400,562.8,547.5
337,2016/01/14,553.7,545.979,544.6,12527400,555.2,539.7
338,2016/01/15,566.3,565.291,570.0,19447500,572.0,561.0
339,2016/01/18,563.0,561.864,558.1,16346000,567.6,553.4
340,2016/01/19,557.2,555.912,560.0,9725900,564.7,549.2
341,2016/01/20,543.7,549.977,558.8,9587100,559.7,542.3
342,2016/01/21,529.2,540.722,544.3,11318500,552.8,529.2
343,2016/01/22,556.2,549.911,546.0,12207200,557.6,539.2
344,2016/01/25,563.0,562.034,563.9,9309100,566.3,556.5
345,2016/01/26,549.9,548.614,551.5,10575700,553.0,542.7
346,2016/01/27,573.1,568.705,559.1,16909700,574.2,558.0
347,2016/01/28,575.5,576.524,570.8,11747400,581.1,567.4
348,2016/01/29,547.5,542.992,571.0,32828200,583.0,497.0
349,2016/02/01,503.6,505.271,530.0,26619600,530.0,499.8
350,2016/02/02,486.0,489.548,488.0,37003300,501.7,483.2
351,2016/02/03,465.8,468.504,480.0,24824200,480.0,462.5
352,2016/02/04,468.7,470.626,461.0,16313000,480.9,458.0
353,2016/02/05,453.0,452.715,452.2,22681300,461.2,447.9
354,2016/02/08,452.8,450.47,445.0,14559400,457.1,442.3
355,2016/02/09,416.7,420.961,430.2,23100600,430.4,412.8
356,2016/02/10,395.2,402.815,417.3,22895400,419.5,392.0
357,2016/02/12,377.1,381.407,373.6,25414200,392.5,369.1
358,2016/02/15,409.5,407.605,407.0,21356700,414.0,396.8
359,2016/02/16,414.1,415.584,409.4,17666900,423.1,402.0
360,2016/02/17,405.0,408.675,411.4,19585800,419.5,400.6
361,2016/02/18,412.8,411.028,413.0,17056500,417.2,404.0
362,2016/02/19,397.3,399.252,408.0,19847400,408.5,396.6
363,2016/02/22,389.6,389.584,392.0,14650400,393.4,385.3
364,2016/02/23,394.7,397.166,397.6,18614400,401.9,393.0
365,2016/02/24,398.6,398.755,387.8,20609700,404.2,386.3
366,2016/02/25,401.5,401.213,399.3,17797100,403.4,396.2
367,2016/02/26,398.0,399.743,403.5,14477500,404.9,395.0
368,2016/02/29,395.0,399.786,402.0,17921900,405.4,393.2
369,2016/03/01,394.1,393.317,394.8,15556700,400.2,388.9
370,2016/03/02,400.4,401.469,402.1,27745000,406.6,398.5
371,2016/03/03,427.5,421.923,404.7,29972000,431.7,402.9
372,2016/03/04,429.8,429.509,429.4,19215100,437.3,423.3
373,2016/03/07,426.9,427.546,428.6,13292400,431.6,423.9
374,2016/03/08,413.5,417.386,427.1,18784400,431.3,410.0
375,2016/03/09,403.2,405.015,409.0,15619000,411.2,402.6
376,2016/03/10,407.8,406.084,407.0,17311900,409.9,400.4
377,2016/03/11,424.6,416.975,402.0,21609600,426.0,402.0
378,2016/03/14,435.9,433.404,432.6,21801600,436.2,430.2
379,2016/03/15,430.7,430.04,434.5,20394600,434.7,426.0
380,2016/03/16,412.0,413.831,423.6,23284600,423.9,410.0
381,2016/03/17,409.7,413.309,414.7,17434400,419.9,408.2
382,2016/03/18,409.0,406.617,408.8,16949700,412.5,402.0
383,2016/03/22,410.3,410.472,409.2,12954700,414.8,406.3
384,2016/03/23,409.3,410.963,410.9,11660700,416.0,408.6
385,2016/03/24,395.3,398.289,408.3,21625800,408.3,394.7
386,2016/03/25,403.0,399.98,395.6,15694700,407.0,393.3
387,2016/03/28,411.9,408.548,406.0,13553900,411.9,404.5
388,2016/03/29,407.3,405.899,405.6,10603500,409.6,401.1
389,2016/03/30,391.1,395.813,406.8,17337900,407.6,390.1
390,2016/03/31,401.6,403.571,395.8,21703500,407.9,395.0
391,2016/04/01,380.9,384.837,399.6,24322300,399.6,380.5
392,2016/04/04,386.3,386.566,380.0,16844500,394.5,379.0
393,2016/04/05,370.6,372.767,381.1,21101100,385.6,367.2
394,2016/04/06,371.9,371.746,371.1,20472100,377.5,368.4
395,2016/04/07,372.6,373.041,371.0,13523000,381.8,367.4
396,2016/04/08,377.6,373.128,364.6,14927300,382.7,359.3
397,2016/04/11,369.5,368.684,373.1,14731000,373.1,364.1
398,2016/04/12,392.8,386.04,369.0,19341700,394.5,368.3
399,2016/04/13,402.4,399.466,397.5,17063800,404.8,392.0
400,2016/04/14,417.2,412.024,408.3,20802700,417.2,403.5
401,2016/04/15,406.0,408.547,412.7,15642000,416.3,404.5
402,2016/04/18,392.1,393.26,390.0,8177200,398.5,390.0
403,2016/04/19,413.3,412.988,405.2,15256600,419.0,404.6
404,2016/04/20,411.0,413.122,415.1,10082700,417.7,410.0
405,2016/04/21,415.1,414.304,418.9,12357400,419.8,408.1
406,2016/04/22,435.4,431.985,411.0,30779000,452.9,409.3
407,2016/04/25,434.5,433.421,439.8,20971800,441.7,427.0
408,2016/04/26,426.8,426.955,433.2,13697700,437.5,421.6
409,2016/04/27,421.0,420.622,424.2,14690500,427.9,415.0
410,2016/04/28,393.2,404.287,422.5,24806800,429.7,390.1
411,2016/05/02,379.7,378.036,377.0,20272500,383.5,375.0
412,2016/05/06,380.6,378.212,380.0,12241000,384.7,374.1
413,2016/05/09,381.3,382.19,383.3,7089100,388.3,379.0
414,2016/05/10,386.4,382.491,382.1,13962600,387.8,373.1
415,2016/05/11,387.9,390.147,390.0,12022600,396.4,385.4
416,2016/05/12,388.1,386.128,380.0,10258400,389.8,378.1
417,2016/05/13,398.4,406.054,411.7,25906400,412.8,398.3
418,2016/05/16,397.6,396.711,396.7,13899200,401.5,391.8
419,2016/05/17,408.5,405.841,403.0,12079100,408.5,401.6
420,2016/05/18,427.9,424.128,409.2,23465500,431.6,408.2
421,2016/05/19,428.1,430.845,440.0,17031100,441.0,423.7
422,2016/05/20,426.5,426.204,427.8,15307100,429.4,421.2
423,2016/05/23,427.3,425.45,425.0,10197400,428.9,419.2
424,2016/05/24,423.0,423.468,426.1,6202400,426.2,421.5
425,2016/05/25,422.3,423.026,428.3,11108200,428.4,421.0
426,2016/05/26,418.5,421.656,425.3,12794000,426.2,418.1
427,2016/05/27,419.0,418.397,419.7,15732900,422.3,415.4
428,2016/05/30,419.8,417.681,422.5,15623000,423.0,414.1
429,2016/05/31,421.4,420.469,419.8,16897300,422.7,415.7
430,2016/06/01,414.6,416.239,418.7,14944400,420.5,413.2
431,2016/06/02,401.2,403.497,412.0,16928500,412.0,400.1
432,2016/06/03,402.5,401.43,400.0,11515800,404.9,399.1
433,2016/06/06,398.5,394.45,391.1,11810000,398.8,390.2
434,2016/06/07,401.3,401.0,401.3,7055000,403.7,397.2
435,2016/06/08,404.1,402.296,402.9,8828700,404.6,398.2
436,2016/06/09,393.6,394.65,399.5,10297000,400.1,391.7
437,2016/06/10,391.3,389.706,390.0,13696000,391.6,387.0
438,2016/06/13,381.8,383.913,384.9,11898700,387.5,381.8
439,2016/06/14,375.0,375.541,380.3,13214800,380.4,372.2
440,2016/06/15,377.8,377.828,371.3,12313400,382.6,370.1
441,2016/06/16,378.8,377.032,377.5,18483200,382.5,372.0
442,2016/06/17,390.0,388.28,385.3,19084600,392.2,381.6
443,2016/06/20,396.5,396.706,395.0,9637000,399.1,392.4
444,2016/06/21,398.8,395.16,391.5,11263900,400.2,387.2
445,2016/06/22,398.4,397.873,399.0,11659400,401.0,393.7
446,2016/06/23,409.1,407.229,405.0,16130000,411.5,400.1
447,2016/06/24,379.6,389.309,413.2,21228000,413.9,370.2
448,2016/06/27,374.9,375.598,384.0,11810600,384.8,370.0
449,2016/06/28,371.0,369.199,370.0,12190000,376.2,360.4
450,2016/06/29,373.6,375.011,380.0,11219200,380.0,371.3
451,2016/06/30,372.0,375.044,380.7,13267700,382.2,371.7
452,2016/07/01,374.5,375.073,376.0,7837200,379.1,372.1
453,2016/07/04,375.0,375.504,374.5,7917200,378.4,371.2
454,2016/07/05,373.9,371.943,373.1,8500900,375.0,369.2
455,2016/07/06,365.8,364.029,368.1,17555600,369.3,360.7
456,2016/07/07,360.2,362.907,362.0,11881500,368.7,359.6
457,2016/07/08,358.0,360.129,362.7,12902200,364.5,356.4
458,2016/07/11,366.5,365.46,363.1,13506500,369.1,361.2
459,2016/07/12,384.9,384.099,379.0,24934900,388.9,377.0
460,2016/07/13,397.3,398.001,399.8,19352600,403.1,393.1
461,2016/07/14,395.6,395.078,396.6,10411500,398.6,390.5
462,2016/07/15,407.9,406.445,400.5,17962300,412.9,397.7
463,2016/07/19,413.2,412.991,420.0,17140700,420.0,408.0
464,2016/07/20,406.9,406.991,411.5,11700900,414.8,402.4
465,2016/07/21,411.2,413.05,414.6,14154000,418.2,409.0
466,2016/07/22,402.9,401.645,402.2,11988700,404.2,398.9
467,2016/07/25,400.7,402.946,400.7,14170000,410.0,399.4
468,2016/07/26,394.9,395.517,398.2,9945500,400.8,392.5
469,2016/07/27,395.8,395.75,400.0,15700800,400.2,390.6
470,2016/07/28,388.4,387.314,393.2,10682800,393.7,383.7
471,2016/07/29,415.0,398.818,382.8,31143500,417.2,378.0
472,2016/08/01,445.3,440.75,428.8,45755500,452.7,416.6
473,2016/08/02,426.2,434.887,437.3,22462400,443.9,425.2
474,2016/08/03,410.6,412.309,416.0,18596100,420.8,406.1
475,2016/08/04,418.5,416.936,413.2,15950600,422.9,410.7
476,2016/08/05,418.1,420.11,426.5,11366500,430.3,415.6
477,2016/08/08,436.9,434.955,425.2,16088100,441.2,421.9
478,2016/08/09,436.0,436.274,438.7,12139600,441.0,430.6
479,2016/08/10,430.8,430.179,431.8,9608600,434.9,426.1
480,2016/08/12,422.7,425.057,436.9,14413400,437.8,420.0
481,2016/08/15,425.9,426.451,422.8,10791800,430.3,421.7
482,2016/08/16,424.2,428.862,429.6,11616100,434.2,423.6
483,2016/08/17,446.7,440.763,425.7,17420200,447.0,425.7
484,2016/08/18,452.7,458.264,449.9,31737000,469.3,447.0
485,2016/08/19,455.4,455.173,452.6,18698900,459.2,449.0
486,2016/08/22,459.0,456.508,458.0,11610600,461.2,447.6
487,2016/08/23,453.0,452.346,457.4,13408000,459.1,447.7
488,2016/08/24,450.3,454.742,457.8,11989000,465.4,448.1
489,2016/08/25,454.7,452.155,450.3,6795800,455.4,447.4
490,2016/08/26,449.4,451.602,453.8,7268500,455.8,449.4
491,2016/08/29,454.0,455.868,455.0,10286200,460.9,452.5
492,2016/08/30,458.8,459.107,454.2,9976600,462.4,452.1
493,2016/08/31,473.2,472.329,465.2,13052100,475.7,464.9
494,2016/09/01,480.0,481.758,476.0,15963200,487.8,474.2
495,2016/09/02,478.1,477.378,479.7,9646800,480.5,473.1
496,2016/09/05,468.9,476.233,486.1,12450800,486.1,467.2
497,2016/09/06,472.6,473.112,470.2,12368500,478.9,467.6
498,2016/09/07,466.9,465.002,469.7,14742100,471.4,459.2
499,2016/09/08,462.3,463.849,467.4,12566700,471.5,460.9
500,2016/09/09,462.6,462.681,460.4,9408000,466.9,460.2
501,2016/09/12,451.1,450.52,454.6,15831700,458.4,445.5
502,2016/09/13,437.9,440.553,451.1,24425900,452.7,435.3
503,2016/09/14,430.4,429.837,435.2,21579000,435.4,426.1
504,2016/09/15,418.9,419.188,424.1,26044600,425.0,416.4
505,2016/09/16,433.0,431.39,426.8,23562900,436.4,422.5
506,2016/09/20,434.0,435.983,432.7,19620700,441.6,432.1
507,2016/09/21,469.1,453.484,435.3,30046300,470.0,424.8
508,2016/09/23,468.1,466.735,465.7,27759200,472.5,459.6
509,2016/09/26,462.0,464.406,467.9,14379100,469.8,460.2
510,2016/09/27,449.3,445.806,438.1,24078600,453.0,436.7
511,2016/09/28,432.2,433.125,439.5,14896700,442.0,429.4
512,2016/09/29,430.6,432.152,433.0,17464900,435.8,428.6
513,2016/09/30,422.3,423.19,420.3,13919300,428.4,418.0
514,2016/10/03,425.7,426.543,427.4,9094400,431.2,422.7
515,2016/10/04,426.7,428.914,426.5,9813100,435.0,424.7
516,2016/10/05,434.0,430.647,426.6,11264200,434.0,424.6
517,2016/10/06,436.5,439.392,436.5,13167000,443.3,436.5
518,2016/10/07,434.9,434.056,436.6,7085600,439.2,431.4
519,2016/10/11,432.7,435.675,435.9,8483900,440.6,432.2
520,2016/10/12,423.5,425.137,427.0,12870400,430.1,423.2
521,2016/10/13,421.0,424.6,426.0,11970300,431.9,420.5
522,2016/10/14,422.8,420.597,419.8,9630700,423.8,416.7
523,2016/10/17,421.5,422.881,422.0,7945500,429.2,419.8
524,2016/10/18,423.1,422.033,420.1,7125200,425.8,418.4
525,2016/10/19,422.5,423.507,425.0,8370500,426.2,421.5
526,2016/10/20,431.1,427.919,423.8,11239400,431.2,422.8
527,2016/10/21,440.4,440.964,436.3,16267100,445.1,433.0
528,2016/10/24,437.7,436.71,438.9,8059600,440.3,432.4
529,2016/10/25,441.7,442.468,439.4,10818900,445.9,439.4
530,2016/10/26,445.2,443.785,442.4,8526600,445.5,440.2
531,2016/10/27,444.9,443.693,442.8,7437200,446.1,440.1
532,2016/10/28,457.3,457.455,454.2,20682300,462.5,453.2
533,2016/10/31,466.0,462.026,456.3,17412800,467.4,455.2
534,2016/11/01,463.8,463.862,467.0,13063000,467.8,461.3
535,2016/11/02,451.6,453.127,456.2,10591300,457.4,449.3
536,2016/11/04,449.3,447.474,449.0,12982200,452.4,442.3
537,2016/11/07,455.3,456.715,456.0,11171700,459.7,453.0
538,2016/11/08,456.4,458.069,456.0,10999700,462.9,453.0
539,2016/11/09,435.3,442.302,460.0,26313700,464.8,426.2
540,2016/11/10,468.4,467.327,464.8,24399200,472.4,458.2
541,2016/11/11,479.6,482.404,477.0,24192400,489.5,475.6
542,2016/11/14,500.0,498.33,491.0,23493300,502.6,490.8
543,2016/11/15,516.3,515.464,505.0,30073600,528.0,501.5
544,2016/11/16,538.3,536.422,525.0,31565600,541.0,525.0
545,2016/11/17,535.7,532.664,534.5,24041100,537.7,525.3
546,2016/11/18,533.9,541.123,550.0,24875200,550.0,532.8
547,2016/11/21,545.1,541.778,533.1,19169000,548.4,529.7
548,2016/11/22,554.9,550.295,543.0,20142300,555.0,542.3
549,2016/11/24,547.3,552.142,559.7,23259200,563.9,544.7
550,2016/11/25,539.0,541.082,551.3,20547900,554.5,533.0
551,2016/11/28,547.8,545.325,532.0,18763100,554.7,531.6
552,2016/11/29,553.7,550.438,539.0,17037100,556.5,534.4
553,2016/11/30,550.1,552.484,559.0,20525600,559.7,549.1
554,2016/12/01,562.5,565.181,560.0,22389200,575.8,556.3
555,2016/12/02,591.4,587.593,569.3,34880500,598.7,568.5
556,2016/12/05,582.4,579.981,579.5,21621100,584.9,576.1
557,2016/12/06,591.9,591.638,588.8,19737900,594.2,588.7
558,2016/12/07,610.1,606.335,599.0,25525000,611.5,597.5
559,2016/12/08,616.4,617.394,620.0,23222700,628.3,609.0
560,2016/12/09,623.6,623.618,621.6,27933700,630.0,617.6
561,2016/12/12,613.4,614.236,630.0,29276100,630.0,598.0
562,2016/12/13,615.6,611.872,603.4,20571800,619.0,597.7
563,2016/12/14,621.4,618.943,615.5,17531700,624.3,608.2
564,2016/12/15,626.5,624.592,626.0,20220700,628.7,615.8
565,2016/12/16,646.5,642.275,631.6,28422400,648.4,631.0
566,2016/12/19,634.0,633.831,641.3,17816700,643.6,629.7
567,2016/12/20,627.5,627.727,627.0,14854100,633.3,623.2
568,2016/12/21,627.0,628.955,630.0,13636600,638.0,623.5
569,2016/12/22,616.0,614.061,615.1,20871000,618.3,607.7
570,2016/12/26,613.5,612.349,607.0,9906300,615.8,607.0
571,2016/12/27,612.4,613.091,607.1,10147500,618.4,603.4
572,2016/12/28,615.6,615.323,615.0,8244700,618.5,611.7
573,2016/12/29,598.6,598.395,602.0,16823300,603.0,595.0
574,2016/12/30,599.5,598.05,590.7,10632000,601.3,586.5
575,2017/01/04,623.6,621.236,616.9,16591200,625.1,612.8
576,2017/01/05,637.4,635.05,629.2,20759800,639.4,629.0
577,2017/01/06,626.7,625.732,629.5,15957800,629.6,623.0
578,2017/01/10,615.5,615.447,620.9,15279600,621.3,610.7
579,2017/01/11,626.3,625.628,621.0,9071300,629.8,619.7
580,2017/01/12,612.3,611.833,615.0,18011600,618.9,608.1
581,2017/01/13,612.3,610.986,610.6,11005100,614.0,607.0
582,2017/01/16,606.7,609.261,616.1,7695400,616.1,605.6
583,2017/01/17,596.1,596.905,601.6,11464000,603.3,590.7
584,2017/01/18,600.9,593.177,589.5,11023000,602.4,584.6
585,2017/01/19,610.0,610.51,610.0,13202400,616.2,604.5
586,2017/01/20,611.9,611.05,609.0,10174800,615.7,605.2
587,2017/01/23,607.3,607.561,605.7,8946100,611.7,602.9
588,2017/01/24,584.7,587.168,596.0,21447900,597.0,583.5
589,2017/01/25,589.1,590.335,595.5,13366000,595.8,586.0
590,2017/01/26,615.1,606.614,599.1,22126300,615.2,596.1
591,2017/01/27,624.3,621.912,619.5,24269600,626.2,617.6
592,2017/01/30,621.6,618.51,616.0,7614400,621.9,614.5
593,2017/01/31,613.2,614.164,611.6,10199600,618.5,610.8
594,2017/02/01,588.4,588.938,599.0,24219000,600.0,585.0
595,2017/02/02,577.9,579.542,591.5,21404900,591.5,574.4
596,2017/02/03,587.9,588.946,580.0,22860900,600.0,577.3
597,2017/02/06,590.9,594.843,600.3,12393000,604.0,589.6
598,2017/02/07,593.2,590.969,586.6,8373600,595.5,583.2
599,2017/02/08,600.5,596.504,593.2,9018600,601.2,591.0
600,2017/02/09,598.3,595.55,593.0,12278100,598.4,587.8
601,2017/02/10,615.7,614.849,609.8,17351700,617.8,609.8
602,2017/02/13,615.7,618.462,623.8,10206500,623.9,615.5
603,2017/02/14,608.1,610.537,619.5,9172700,619.5,605.7
604,2017/02/15,623.5,623.185,618.0,15537200,626.2,615.6
605,2017/02/16,632.4,632.957,628.7,16015500,639.1,627.6
606,2017/02/17,630.9,630.608,630.9,7941200,635.0,627.0
607,2017/02/20,629.4,626.274,624.2,8504900,630.3,619.4
608,2017/02/21,639.1,639.38,643.2,14027900,644.5,635.0
609,2017/02/22,643.5,641.356,643.5,15002200,644.0,638.3
610,2017/02/23,637.8,635.11,639.7,13403100,639.7,630.7
611,2017/02/24,632.6,632.96,636.7,11610500,636.7,629.1
612,2017/02/27,624.8,624.523,625.0,11305800,629.4,621.0
613,2017/02/28,627.0,629.597,623.0,13569600,634.9,623.0
614,2017/03/01,630.4,627.08,629.0,12903000,632.0,621.1
615,2017/03/02,638.7,642.432,644.0,15288000,648.7,637.2
616,2017/03/03,639.6,638.001,638.2,8948200,641.6,634.0
617,2017/03/06,655.5,651.507,638.9,21676400,660.9,632.4
618,2017/03/07,650.3,649.649,652.0,10451500,652.0,647.4
619,2017/03/08,647.4,648.324,651.9,9957600,652.4,645.2
620,2017/03/09,653.8,652.349,650.0,9205500,655.0,648.0
621,2017/03/10,661.3,659.844,660.0,14271100,662.4,656.3
622,2017/03/13,658.3,658.983,657.2,6340300,661.7,655.5
623,2017/03/14,656.8,656.701,658.4,7603500,659.5,653.5
624,2017/03/15,655.3,654.538,652.5,6700900,657.8,650.4
625,2017/03/16,650.0,650.546,648.7,8906500,653.2,647.0
626,2017/03/17,639.9,640.67,645.6,16266000,646.0,636.8
627,2017/03/21,641.0,640.002,635.0,9665900,643.5,631.6
628,2017/03/22,614.1,616.19,620.0,17413500,624.6,613.0
629,2017/03/23,608.7,608.55,604.1,14558700,613.0,604.1
630,2017/03/24,613.4,615.051,608.2,12295800,621.1,608.2
631,2017/03/27,604.1,603.324,608.5,10971500,608.6,600.9
632,2017/03/28,612.4,611.91,612.0,10470100,614.6,607.2
633,2017/03/29,604.5,606.563,612.9,8712500,613.4,603.6
634,2017/03/30,607.2,605.865,600.0,10413800,611.9,598.2
635,2017/03/31,597.9,605.94,613.0,10779400,618.2,597.9
636,2017/04/03,585.7,586.748,597.0,14878900,597.2,580.6
637,2017/04/04,575.3,574.506,579.7,16050800,580.0,569.7
638,2017/04/05,570.2,571.206,583.4,13213100,584.4,563.7
639,2017/04/06,558.7,559.401,563.0,12940600,565.9,555.3
640,2017/04/07,557.3,559.734,560.4,13964400,565.9,553.7
641,2017/04/10,569.7,566.478,562.0,8235100,571.5,561.2
642,2017/04/11,566.6,563.892,563.0,10639000,566.9,560.1
643,2017/04/12,562.6,560.392,563.0,9613200,564.3,555.4
644,2017/04/13,558.7,556.851,555.0,9442400,560.2,552.6
645,2017/04/14,562.0,559.746,553.0,9080000,566.7,549.3
646,2017/04/17,558.3,554.19,557.4,9486500,559.0,548.6
647,2017/04/18,560.3,564.739,565.0,10200400,572.4,559.7
648,2017/04/19,568.3,564.051,559.5,17381000,572.8,552.4
649,2017/04/20,576.6,577.929,569.5,14964500,583.5,567.0
650,2017/04/21,592.3,592.001,586.0,14009100,596.0,586.0
651,2017/04/24,594.5,597.014,602.3,9371000,602.6,592.9
652,2017/04/25,611.9,609.213,594.4,16024400,614.5,594.3
653,2017/04/26,630.5,626.871,618.5,18048700,631.4,616.8
654,2017/04/27,632.3,629.032,624.0,13703800,633.5,621.5
655,2017/04/28,619.8,622.79,629.5,9997100,631.0,618.5
656,2017/05/01,593.2,593.058,592.7,26819000,604.0,588.1
657,2017/05/02,598.1,598.415,598.9,11437800,601.6,595.8
658,2017/05/08,616.3,615.224,608.6,13384900,619.5,604.5
659,2017/05/09,615.7,615.394,615.8,8325800,618.8,611.9
660,2017/05/10,610.1,610.261,615.2,9813400,615.7,607.6
661,2017/05/11,616.0,613.222,610.5,11598800,619.0,604.6
662,2017/05/12,608.4,608.83,613.5,8155700,614.5,604.3
663,2017/05/15,583.8,581.991,580.0,21730400,587.5,578.0
664,2017/05/16,576.3,576.585,584.9,17857100,585.3,571.7
665,2017/05/17,563.3,565.283,572.0,15934200,573.5,563.1
666,2017/05/18,554.7,553.956,551.0,29699900,556.6,550.3
667,2017/05/19,567.7,564.145,561.0,17090800,569.7,554.4
668,2017/05/22,568.4,568.359,572.0,15131400,573.9,564.4
669,2017/05/23,561.9,561.394,566.5,14852400,568.4,558.4
670,2017/05/24,569.5,570.162,571.1,14301800,574.3,566.4
671,2017/05/25,574.5,572.934,569.0,12486100,576.7,566.1
672,2017/05/26,571.6,571.007,573.0,10234500,574.8,567.2
673,2017/05/29,567.6,568.583,571.0,6632700,573.3,565.5
674,2017/05/30,565.3,564.079,567.8,6687800,569.2,560.1
675,2017/05/31,566.7,565.273,563.7,17138400,567.3,560.4
676,2017/06/01,569.0,567.405,566.6,12526300,571.8,562.9
677,2017/06/02,586.0,582.015,571.8,17674700,587.6,571.5
678,2017/06/05,583.9,583.575,584.5,10890100,587.5,580.0
679,2017/06/06,576.3,579.788,575.0,10389000,585.8,572.5
680,2017/06/07,577.8,576.273,574.4,10352200,579.3,572.1
681,2017/06/08,589.8,588.893,581.4,15808000,598.9,580.3
682,2017/06/09,594.5,591.97,590.5,19217300,596.0,586.9
683,2017/06/12,595.2,600.051,598.0,9737100,607.9,594.5
684,2017/06/13,597.1,593.412,587.5,13913000,599.3,586.3
685,2017/06/14,601.0,601.717,599.3,15501300,604.7,596.8
686,2017/06/15,586.8,589.352,592.0,13060900,596.0,586.5
687,2017/06/16,592.2,593.806,592.5,13709700,599.5,590.0
688,2017/06/19,595.6,593.389,590.0,7247700,597.1,586.2
689,2017/06/20,593.5,599.362,603.0,14305200,606.7,592.5
690,2017/06/21,590.0,589.793,592.0,13340600,592.4,587.3
691,2017/06/22,584.2,587.326,590.0,12337800,591.6,584.0
692,2017/06/23,589.5,587.785,583.0,7214800,591.2,581.3
693,2017/06/26,582.9,582.897,586.4,9944500,587.5,580.5
694,2017/06/27,585.1,586.383,584.9,9772500,590.4,582.4
695,2017/06/28,604.8,601.726,591.8,19449200,606.0,591.5
696,2017/06/29,613.1,614.144,614.8,14731000,621.0,610.7
697,2017/06/30,618.5,618.452,612.0,18853400,624.5,612.0
698,2017/07/03,624.2,620.485,617.4,11882400,624.4,613.8
699,2017/07/04,625.5,631.952,634.0,11874100,642.2,624.8
700,2017/07/05,629.0,625.967,623.0,9965000,629.1,620.4
701,2017/07/06,616.4,618.419,628.0,14935400,628.0,614.3
702,2017/07/07,609.7,611.668,612.9,12135400,616.3,608.0
703,2017/07/10,605.3,603.565,608.7,11520100,610.5,599.6
704,2017/07/11,602.3,602.558,605.7,8960500,606.6,599.3
705,2017/07/12,596.7,597.67,600.6,10083300,601.2,595.7
706,2017/07/13,590.1,591.481,595.5,11420900,597.0,589.5
707,2017/07/14,590.4,590.005,592.4,11009100,593.0,587.1
708,2017/07/18,584.5,582.356,585.1,9933500,586.9,578.4
709,2017/07/19,579.0,578.352,580.0,10256000,581.3,576.2
710,2017/07/20,575.3,576.394,578.5,12275300,579.3,574.0
711,2017/07/21,573.7,572.981,574.0,9114300,575.2,570.3
712,2017/07/24,566.3,565.759,570.0,14882000,570.1,562.9
713,2017/07/25,568.9,570.921,569.0,9829100,575.0,568.0
714,2017/07/26,572.6,575.362,575.7,9505500,580.3,572.4
715,2017/07/27,566.7,566.115,566.0,11843700,568.8,563.8
716,2017/07/28,567.1,566.267,565.0,12886900,568.5,564.0
717,2017/07/31,568.4,570.12,568.0,15107800,574.6,566.5
718,2017/08/01,574.3,572.584,571.3,14936500,577.5,568.4
719,2017/08/02,573.8,573.435,578.4,10136000,579.6,569.1
720,2017/08/03,574.3,571.528,574.0,9567600,574.8,567.2
721,2017/08/04,572.8,572.629,573.0,8018300,574.8,570.4
722,2017/08/07,576.6,578.276,578.6,8792800,581.0,576.1
723,2017/08/08,575.2,574.704,576.9,6550400,578.7,571.8
724,2017/08/09,573.1,571.89,575.0,10357100,577.5,568.4
725,2017/08/10,562.9,564.037,572.6,19014100,573.8,560.2
726,2017/08/14,553.7,553.494,554.9,12954600,557.1,549.2
727,2017/08/15,564.4,565.875,563.7,11891800,569.4,562.4
728,2017/08/16,561.5,562.002,564.8,5728100,565.8,559.2
729,2017/08/17,557.7,557.453,558.7,5411800,559.1,555.5
730,2017/08/18,553.0,551.341,552.2,9874400,554.5,549.6
731,2017/08/21,547.8,549.231,555.0,7695600,555.6,546.6
732,2017/08/22,546.8,546.537,547.8,7138800,549.8,544.2
733,2017/08/23,546.4,547.349,551.7,6813100,551.8,545.7
734,2017/08/24,542.5,544.674,545.0,7961900,549.4,541.7
735,2017/08/25,544.6,544.167,541.0,5205600,547.2,540.5
736,2017/08/28,542.7,542.142,545.0,7390800,546.2,539.1
737,2017/08/29,539.4,537.611,537.9,8050000,540.6,533.4
738,2017/08/30,540.7,540.779,541.1,8595800,543.9,539.1
739,2017/08/31,548.6,549.549,545.6,12228700,554.3,545.2
740,2017/09/01,548.4,547.189,550.1,7805600,552.5,543.8
741,2017/09/04,544.2,545.803,546.3,7347300,551.3,543.0
742,2017/09/05,541.7,541.951,545.3,6036700,546.6,539.3
743,2017/09/06,534.6,532.27,535.0,10274300,535.9,527.5
744,2017/09/07,531.5,532.525,535.8,8990900,536.5,530.1
745,2017/09/08,524.2,523.798,526.8,15044200,528.4,520.5
746,2017/09/11,528.4,531.107,528.8,6306700,535.2,527.8
747,2017/09/12,537.7,538.352,538.0,9111000,541.9,536.6
748,2017/09/13,540.1,542.942,543.0,9343700,546.3,540.0
749,2017/09/14,538.4,540.17,540.6,8570000,544.5,537.8
750,2017/09/15,542.7,542.395,535.8,11490100,545.7,535.6
751,2017/09/19,552.9,552.187,553.0,11791400,555.3,549.0
752,2017/09/20,558.1,557.429,553.9,14201300,560.5,553.3
753,2017/09/21,560.9,564.918,565.4,13987600,568.5,560.8
754,2017/09/22,567.8,566.096,565.2,12565500,568.6,563.1
755,2017/09/25,567.0,568.04,570.0,11921100,571.1,564.8
756,2017/09/26,567.6,564.539,567.2,13607100,567.7,560.1
757,2017/09/27,559.0,557.913,555.9,9121000,559.9,555.7
758,2017/09/28,573.5,572.756,569.0,18020100,576.2,568.9
759,2017/09/29,578.0,575.57,570.9,13329200,578.0,569.9
760,2017/10/02,573.4,572.777,577.3,10103700,577.3,569.7
761,2017/10/03,572.2,573.311,577.0,11434100,579.0,570.3
762,2017/10/04,573.4,574.029,575.0,9495300,576.9,571.6
763,2017/10/05,572.2,572.109,573.4,6289200,574.7,570.4
764,2017/10/06,577.1,578.619,575.0,15211400,582.9,573.8
765,2017/10/10,577.8,575.993,578.6,11209000,579.6,573.5
766,2017/10/11,573.3,574.497,576.6,10104000,578.6,572.0
767,2017/10/12,566.1,567.7,572.0,11066800,574.2,564.1
768,2017/10/13,569.2,566.151,565.0,9995300,570.5,561.6
769,2017/10/16,587.1,583.884,570.7,21848200,590.9,569.2
770,2017/10/17,595.5,595.741,592.0,18605100,603.1,591.8
771,2017/10/18,591.4,593.829,597.5,10008300,602.2,590.3
772,2017/10/19,592.4,593.267,595.0,8079600,596.6,591.0
773,2017/10/20,585.8,585.685,586.8,12306400,588.3,582.4
774,2017/10/23,587.7,589.834,594.0,10564800,595.4,586.9
775,2017/10/24,592.7,591.909,586.4,9413600,594.6,585.8
776,2017/10/25,611.2,611.59,604.0,28928600,617.3,603.9
777,2017/10/26,613.5,613.797,614.9,12762800,617.0,611.7
778,2017/10/27,625.2,623.929,618.0,17967500,628.9,615.7
779,2017/10/30,625.3,623.876,619.1,20463000,627.5,618.2
780,2017/10/31,608.2,610.903,616.2,15640500,617.6,608.2
781,2017/11/01,618.5,618.363,615.8,14878400,621.5,611.2
782,2017/11/02,623.1,622.91,624.8,9565400,628.0,619.0
783,2017/11/06,614.5,615.042,621.2,12385500,622.1,609.4
784,2017/11/07,617.3,614.864,610.0,8486200,619.9,607.4
785,2017/11/08,611.8,609.551,609.6,8723300,611.8,605.2
786,2017/11/09,606.2,609.313,614.9,17612800,618.8,600.6
787,2017/11/10,604.5,604.095,600.0,9929400,608.2,599.4
788,2017/11/13,596.5,597.687,607.2,13144500,608.0,595.6
789,2017/11/14,597.1,598.187,600.0,8598600,602.0,595.4
790,2017/11/15,588.0,586.983,591.9,13668100,592.2,582.7
791,2017/11/16,589.3,590.15,587.3,9249400,594.5,586.4
792,2017/11/17,588.7,589.721,591.6,10754200,594.1,586.4
793,2017/11/20,581.3,581.634,585.5,9690000,588.1,576.4
794,2017/11/21,585.6,587.775,586.2,9454500,591.7,585.0
795,2017/11/22,588.8,588.328,585.0,9434000,592.3,581.7
796,2017/11/24,585.9,584.024,584.5,7508800,586.9,579.5
797,2017/11/27,581.7,583.486,587.4,9008300,588.0,581.1
798,2017/11/28,577.1,578.729,581.1,10357500,583.1,576.6
799,2017/11/29,593.9,592.495,587.1,16113100,596.7,585.9
800,2017/11/30,595.9,598.607,598.0,23844000,604.2,591.1
801,2017/12/01,598.7,598.928,602.2,10242500,604.4,594.8
802,2017/12/04,597.5,599.859,603.0,6524300,605.4,596.8
803,2017/12/05,604.5,603.336,597.1,10164900,607.6,595.6
804,2017/12/06,598.2,599.835,602.1,16115200,606.5,592.7
805,2017/12/07,596.9,597.569,600.1,14074700,602.6,593.0
806,2017/12/08,603.9,597.045,586.9,15151200,604.0,586.9
807,2017/12/11,614.2,611.54,605.5,10061200,614.2,604.6
808,2017/12/12,638.6,631.712,613.0,27279600,638.6,612.9
809,2017/12/13,651.7,649.178,640.0,28817900,655.5,640.0
810,2017/12/14,637.2,636.9,641.7,15988400,643.5,631.5
811,2017/12/15,624.6,624.622,630.6,15358900,633.0,621.1
812,2017/12/18,648.2,646.166,634.1,19742900,652.0,633.5
813,2017/12/19,648.3,647.638,642.0,11743200,650.4,642.0
814,2017/12/20,676.5,673.103,660.0,29505100,679.8,659.5
815,2017/12/21,663.9,673.032,679.6,28682400,688.6,659.0
816,2017/12/22,684.1,683.369,664.3,29078200,694.4,664.3
817,2017/12/25,681.8,681.412,685.0,9907800,691.8,677.2
818,2017/12/26,683.2,684.1,681.9,8723100,689.0,680.5
819,2017/12/27,682.1,683.09,683.3,8658300,686.6,681.0
820,2017/12/28,672.1,674.643,680.0,8125700,680.7,670.5
821,2017/12/29,673.1,673.291,673.7,9976300,677.0,670.5
822,2018/01/04,696.6,690.881,686.5,17552500,696.6,685.9
823,2018/01/05,711.2,710.127,709.0,20372800,714.9,704.8
824,2018/01/09,712.6,714.679,717.0,16745300,725.5,709.1
825,2018/01/10,724.9,725.473,720.0,21125300,729.0,719.4
826,2018/01/11,723.6,724.959,730.0,20934100,734.4,717.6
827,2018/01/12,716.4,718.38,724.0,17128700,726.7,713.4
828,2018/01/15,731.0,730.04,726.0,14243500,734.3,723.6
829,2018/01/16,732.3,730.39,730.0,11176300,734.0,725.6
830,2018/01/17,713.7,715.23,720.8,18292200,720.9,713.0
831,2018/01/18,699.3,707.649,720.0,16956400,722.0,698.8
832,2018/01/19,709.0,709.574,705.0,14734600,717.5,703.7
833,2018/01/22,710.3,711.804,711.9,9371700,719.1,708.2
834,2018/01/23,721.2,717.023,713.1,10716100,721.8,708.5
835,2018/01/24,701.7,703.446,710.6,16499800,711.4,694.5
836,2018/01/25,694.3,695.318,691.8,12641000,700.5,688.0
837,2018/01/26,680.7,684.998,695.0,15188300,695.7,680.3
838,2018/01/29,681.8,682.881,677.7,11648800,690.9,675.2
839,2018/01/30,675.3,676.815,684.3,12118800,685.3,673.7
840,2018/01/31,657.3,665.409,669.8,15786700,675.6,657.0
841,2018/02/01,676.1,674.981,673.6,18938600,683.3,667.0
842,2018/02/02,665.4,666.654,679.7,19362200,683.0,658.6
843,2018/02/05,653.4,651.102,653.2,15752800,656.9,641.0
844,2018/02/06,634.9,627.418,628.7,21409500,635.4,618.5
845,2018/02/07,630.9,645.04,654.9,16902600,657.7,630.8
846,2018/02/08,632.3,632.362,632.4,14558200,637.5,626.8
847,2018/02/09,617.2,615.26,612.5,18224900,621.1,609.0
848,2018/02/13,608.6,615.19,625.5,12894100,626.2,607.2
849,2018/02/14,602.2,605.805,609.3,10110800,614.8,600.9
850,2018/02/15,618.5,620.709,620.0,13729900,626.4,614.5
851,2018/02/16,621.6,623.627,622.0,9022400,628.3,620.5
852,2018/02/19,633.7,632.656,629.0,7805900,635.7,625.9
853,2018/02/20,625.9,624.345,631.0,6932200,631.0,618.5
854,2018/02/21,618.9,619.523,625.0,8120100,625.1,616.7
855,2018/02/22,616.9,615.022,617.0,8320600,618.7,609.2
856,2018/02/23,621.2,618.26,615.8,6348900,622.7,611.2
857,2018/02/26,622.6,623.438,625.0,6371100,627.3,620.4
858,2018/02/27,624.2,624.28,632.0,8317900,632.4,619.1
859,2018/02/28,612.0,615.481,621.1,11583600,623.4,612.0
860,2018/03/01,593.2,595.224,603.0,20361300,603.3,590.1
861,2018/03/02,587.4,586.29,583.2,12785000,589.9,582.4
862,2018/03/05,586.2,582.764,581.8,13005600,587.1,577.4
863,2018/03/06,588.2,593.091,593.7,10586200,600.5,588.0
864,2018/03/07,585.4,587.036,584.6,12847100,593.6,583.5
865,2018/03/08,584.5,585.255,590.3,9378100,591.4,580.5
866,2018/03/09,578.1,583.18,587.7,17087600,591.2,577.1
867,2018/03/12,593.0,590.86,587.0,9770000,595.1,584.1
868,2018/03/13,594.9,590.517,587.1,11040500,595.4,583.8
869,2018/03/14,593.3,592.975,589.3,9712700,596.3,588.1
870,2018/03/15,586.0,587.101,592.1,11745400,593.7,582.5
871,2018/03/16,582.6,584.246,591.0,14378600,592.4,581.7
872,2018/03/19,579.5,579.141,580.1,8202000,582.8,576.3
873,2018/03/20,580.4,579.195,575.9,8992500,583.7,573.7
874,2018/03/22,581.7,576.328,575.2,11885800,582.3,570.4
875,2018/03/23,564.1,565.185,570.0,12914400,570.1,561.3
876,2018/03/26,564.5,559.252,554.1,11949000,565.2,553.9
877,2018/03/27,576.2,573.106,570.2,12164000,576.4,567.1
878,2018/03/28,568.8,562.708,561.5,11102800,569.5,554.8
879,2018/03/29,564.9,564.965,574.2,10268100,575.7,558.0
880,2018/03/30,562.0,562.63,566.4,8764200,568.4,559.3
881,2018/04/02,557.5,561.144,561.5,6349600,567.5,557.4
882,2018/04/03,553.8,549.765,551.0,12363000,555.0,545.1
883,2018/04/04,550.8,548.507,550.0,11384200,552.2,544.2
884,2018/04/05,558.2,556.85,551.4,14065900,562.9,549.4
885,2018/04/06,557.0,556.669,554.9,9769100,559.4,552.8
886,2018/04/09,566.8,565.401,556.5,10506900,569.3,556.2
887,2018/04/10,570.4,568.131,564.9,10325700,572.8,559.6
888,2018/04/11,575.7,579.315,575.4,13141500,584.3,575.0
889,2018/04/12,575.3,574.3,574.0,10356500,577.1,569.7
890,2018/04/13,592.4,591.401,582.3,15028500,595.3,581.7
891,2018/04/16,593.6,593.817,593.0,9743900,598.9,590.8
892,2018/04/17,584.1,585.793,590.4,8837000,590.7,583.8
893,2018/04/18,584.5,583.001,582.0,9478400,586.3,578.3
894,2018/04/19,586.6,588.842,587.3,9049200,593.2,585.1
895,2018/04/20,587.5,587.282,586.2,10119200,591.2,583.0
896,2018/04/23,607.1,607.345,593.7,19008100,614.2,592.5
897,2018/04/24,626.3,624.102,615.0,19531600,627.9,615.0
898,2018/04/25,629.3,627.19,621.0,11063000,630.7,620.0
899,2018/04/26,626.6,628.825,630.3,9579900,636.1,623.2
900,2018/04/27,622.6,622.024,625.0,11038200,626.5,618.4
901,2018/05/01,610.9,610.342,616.2,10618700,617.7,606.3
902,2018/05/02,608.5,608.602,615.0,5812500,615.0,606.2
903,2018/05/07,607.6,604.626,610.5,7320200,611.6,599.7
904,2018/05/08,611.4,611.898,603.3,7589400,616.8,602.9
905,2018/05/09,615.2,612.488,609.9,8166200,615.7,605.3
906,2018/05/10,619.0,620.279,622.2,6616200,624.9,617.4
907,2018/05/11,622.4,619.682,616.0,6227800,623.0,614.2
908,2018/05/14,622.5,622.798,624.6,6948700,627.0,618.8
909,2018/05/15,635.0,635.941,628.5,11199100,639.9,628.5
910,2018/05/16,641.3,639.047,633.5,11722900,643.0,632.1
911,2018/05/17,649.2,649.677,645.9,10710400,653.2,645.8
912,2018/05/18,646.2,648.571,652.5,8558900,655.3,645.5
913,2018/05/21,642.1,643.359,644.0,7062000,646.8,641.0
914,2018/05/22,636.9,634.597,637.0,10458300,638.0,629.7
915,2018/05/23,631.6,631.349,632.8,9679700,637.8,627.0
916,2018/05/24,622.7,623.301,625.2,8998800,628.7,619.3
917,2018/05/25,623.0,624.068,625.3,10023700,630.7,620.1
918,2018/05/28,619.6,617.755,619.8,5780100,620.4,614.8
919,2018/05/29,614.7,614.793,617.0,5890100,618.5,612.5
920,2018/05/30,604.0,602.552,601.7,11362000,605.7,599.0
921,2018/05/31,606.9,607.667,611.0,19539300,612.7,605.3
922,2018/06/01,623.7,620.821,604.9,15418300,629.2,603.2
923,2018/06/04,639.2,635.536,633.7,13531300,641.6,622.6
924,2018/06/05,634.5,634.031,639.2,8747900,640.4,630.8
925,2018/06/06,640.2,638.965,634.0,10454700,641.6,633.5
926,2018/06/07,640.4,643.432,647.2,11120900,649.5,638.3
927,2018/06/08,634.6,635.584,635.0,14790800,640.3,633.5
928,2018/06/11,634.2,632.615,629.3,8320700,636.7,624.7
929,2018/06/12,629.6,631.881,639.3,7459000,639.3,629.2
930,2018/06/13,641.0,638.795,630.0,11677100,643.4,626.4
931,2018/06/14,657.0,654.588,640.9,19424600,664.0,636.2
932,2018/06/15,653.1,653.491,656.6,14416400,659.1,649.6
933,2018/06/18,629.5,632.627,651.6,14361000,651.7,627.6
934,2018/06/19,615.3,618.767,623.0,13361700,627.5,614.8
935,2018/06/20,611.1,608.289,615.0,15981700,615.3,601.1
936,2018/06/21,591.6,594.966,603.9,20078800,605.0,589.2
937,2018/06/22,582.9,579.67,581.6,18938300,584.1,571.3
938,2018/06/25,586.4,585.437,585.7,8345900,589.0,582.7
939,2018/06/26,590.8,588.641,581.2,9817400,595.0,580.2
940,2018/06/27,588.2,585.116,586.2,7881700,589.1,579.7
941,2018/06/28,585.4,587.148,590.8,8707000,594.6,583.6
942,2018/06/29,592.6,590.823,591.7,9252100,594.5,584.2
943,2018/07/02,582.3,584.518,588.8,5599000,591.7,580.9
944,2018/07/03,581.1,579.234,582.9,7519800,584.0,575.0
945,2018/07/04,575.9,577.929,575.9,5275500,581.9,575.5
946,2018/07/05,569.8,569.106,571.0,7034400,572.9,566.2
947,2018/07/06,580.3,580.037,573.1,9355500,583.7,571.0
948,2018/07/09,587.8,587.011,585.0,6802700,591.0,581.2
949,2018/07/10,593.0,597.221,597.8,8646600,602.4,593.0
950,2018/07/11,592.9,590.905,585.9,8143200,594.4,584.7
951,2018/07/12,602.0,600.916,598.9,9701700,603.9,593.6
952,2018/07/13,598.8,601.223,603.2,10467000,606.5,598.4
953,2018/07/17,607.3,606.323,597.0,11117100,612.9,596.0
954,2018/07/18,600.1,602.462,607.3,8298800,608.8,599.6
955,2018/07/19,602.4,603.958,601.5,13145900,608.8,601.1
956,2018/07/20,600.0,598.562,597.7,8457600,603.3,595.6
957,2018/07/23,641.1,637.575,630.0,28256300,642.8,629.2
958,2018/07/24,645.4,651.859,650.0,22460900,663.9,640.7
959,2018/07/25,650.0,651.115,646.8,12655200,656.3,644.7
960,2018/07/26,659.3,658.193,650.2,14925200,662.5,649.1
961,2018/07/27,656.0,657.853,655.0,12928800,661.3,654.5
962,2018/07/30,667.1,665.158,661.0,17183500,669.0,659.6
963,2018/07/31,635.9,650.493,671.6,31397600,674.9,635.9
964,2018/08/01,635.9,629.754,641.0,31458400,643.6,617.7
965,2018/08/02,639.0,645.345,642.6,22679500,653.6,636.1
966,2018/08/03,618.2,622.88,637.4,15725600,639.5,617.2
967,2018/08/06,615.5,615.587,611.6,11134600,621.6,609.6
968,2018/08/07,614.7,616.159,625.0,9333500,625.3,611.9
969,2018/08/08,624.8,622.957,616.7,9288900,625.5,615.9
970,2018/08/09,617.0,617.317,615.2,7213300,620.8,615.1
971,2018/08/10,614.8,615.802,619.2,8268700,621.2,612.2
972,2018/08/13,604.8,604.651,607.0,11171300,609.3,601.2
973,2018/08/14,603.0,603.04,605.0,8495100,607.5,600.4
974,2018/08/15,604.3,604.607,610.6,7367800,612.2,600.0
975,2018/08/16,606.5,603.321,597.9,8136200,607.6,592.3
976,2018/08/17,619.0,617.781,606.6,9426100,623.9,606.6
977,2018/08/20,614.2,613.119,613.1,6770300,615.6,609.8
978,2018/08/21,612.0,611.697,610.1,6596600,615.5,608.9
979,2018/08/22,624.4,624.032,612.9,12385300,628.7,612.6
980,2018/08/23,621.0,620.849,621.3,8595200,624.8,618.1
981,2018/08/24,625.1,625.368,625.0,6859800,628.5,622.5
982,2018/08/27,634.3,631.964,627.5,7674100,635.5,624.1
983,2018/08/28,634.0,638.656,638.5,6939200,644.5,633.8
984,2018/08/29,644.0,644.293,637.0,10013000,647.3,635.8
985,2018/08/30,640.1,641.184,644.0,6712400,646.6,637.4
986,2018/08/31,629.9,629.88,630.8,11125200,632.4,627.6
987,2018/09/03,620.7,622.754,625.0,8238000,630.6,619.0
988,2018/09/04,613.2,614.273,618.2,7670000,619.1,612.3
989,2018/09/05,604.0,605.852,614.1,11934100,614.6,603.7
990,2018/09/06,603.6,603.345,604.0,8792000,607.4,601.0
991,2018/09/07,600.1,599.445,601.0,12046000,602.5,595.1
992,2018/09/10,605.6,605.325,600.9,9800300,608.0,598.2
993,2018/09/11,603.0,602.278,602.5,8083200,604.6,598.8
994,2018/09/12,594.9,597.255,603.0,13009700,604.9,594.0
995,2018/09/13,601.8,601.851,595.0,7391100,604.9,593.8
996,2018/09/14,610.2,606.781,603.6,13667200,611.5,601.9
997,2018/09/18,619.2,616.002,609.1,14677100,621.5,608.8
998,2018/09/19,624.3,623.631,624.9,17136700,628.8,618.7
999,2018/09/20,640.4,638.518,632.5,17333200,643.1,629.2
1000,2018/09/21,651.5,651.636,645.0,19507100,657.1,644.0
1001,2018/09/25,658.0,657.799,652.6,14475800,668.7,652.4
1002,2018/09/26,646.2,644.588,648.0,11452200,649.6,639.4
1003,2018/09/27,636.8,638.07,641.6,9771800,642.6,635.1
1004,2018/09/28,638.3,641.96,641.0,10480100,648.9,638.0
1005,2018/10/01,632.8,634.104,641.0,9361000,642.0,630.1
1006,2018/10/02,631.2,633.32,635.0,8851100,637.0,629.4
1007,2018/10/03,621.9,625.405,629.4,10849800,636.7,620.3
1008,2018/10/04,639.6,638.732,639.0,14902400,642.4,633.7
1009,2018/10/05,652.9,652.029,645.1,17337300,655.8,645.1
1010,2018/10/09,636.9,637.893,647.1,16153300,648.5,631.3
1011,2018/10/10,648.6,648.214,644.0,12324200,652.6,640.6
1012,2018/10/11,618.2,621.649,619.0,21714000,644.7,614.4
1013,2018/10/12,611.9,610.254,612.0,12979800,613.7,605.1
1014,2018/10/15,596.8,596.996,603.7,13917300,604.3,590.5
1015,2018/10/16,598.2,596.587,595.0,9420800,599.7,590.2
1016,2018/10/17,607.2,607.532,608.7,12053200,611.2,604.3
1017,2018/10/18,611.5,614.243,616.0,12243000,619.2,609.2
1018,2018/10/19,613.0,609.079,601.8,11580200,613.3,601.5
1019,2018/10/22,613.8,613.822,609.6,6174900,617.3,608.7
1020,2018/10/23,603.5,604.211,608.7,9678500,611.7,600.9
1021,2018/10/24,588.2,591.75,605.0,15622100,605.6,585.4
1022,2018/10/25,578.6,578.29,575.0,13742600,583.0,570.1
1023,2018/10/26,584.1,583.723,587.3,9532000,587.6,577.9
1024,2018/10/29,579.8,582.536,589.8,9623600,591.4,579.0
1025,2018/10/30,585.9,585.619,579.6,10462100,589.0,579.3
1026,2018/10/31,595.0,592.574,589.0,15814900,596.3,585.8
1027,2018/11/01,605.9,603.499,601.9,14753700,607.4,594.2
1028,2018/11/02,609.0,607.666,613.0,10279100,614.5,600.8
1029,2018/11/05,605.6,608.004,606.7,6209000,611.7,605.4
1030,2018/11/06,614.1,614.705,606.2,7437400,617.1,606.2
1031,2018/11/07,607.2,612.442,613.0,11735600,622.9,604.2
1032,2018/11/08,619.1,619.678,616.4,10987200,624.6,610.7
1033,2018/11/09,617.6,619.693,615.6,9865900,625.7,615.6
1034,2018/11/12,611.0,610.868,610.0,10322100,615.7,604.4
1035,2018/11/13,595.5,593.0,596.4,12984200,597.2,588.6
1036,2018/11/14,599.0,600.795,598.9,9701700,604.1,597.6
1037,2018/11/15,581.4,581.326,589.5,15795800,589.5,577.5
1038,2018/11/16,575.3,577.722,579.3,12039900,583.1,574.7
1039,2018/11/19,574.5,573.387,575.0,9235300,580.0,570.0
1040,2018/11/20,578.0,577.316,571.4,8406600,581.3,567.3
1041,2018/11/21,578.0,576.876,571.4,8462300,579.3,571.1
1042,2018/11/22,580.0,576.387,577.0,8538400,580.7,570.1
1043,2018/11/26,576.4,574.291,571.1,10934000,577.2,566.4
1044,2018/11/27,588.7,586.996,584.2,16881800,590.9,582.6
1045,2018/11/28,594.7,594.302,591.7,16406200,601.5,588.0
1046,2018/11/29,600.4,602.507,597.8,11119000,607.3,596.8
1047,2018/11/30,601.9,602.595,602.2,27064700,606.1,597.8
1048,2018/12/03,610.3,611.467,609.0,8870800,615.7,606.5
1049,2018/12/04,590.4,593.496,606.1,14272800,606.6,588.1
1050,2018/12/05,579.5,578.04,579.5,12468100,583.2,573.3
1051,2018/12/06,569.7,570.617,574.2,9847400,577.8,567.7
1052,2018/12/07,565.3,566.024,569.8,11724300,571.7,562.0
1053,2018/12/10,561.2,561.702,564.8,9530700,565.2,559.4
1054,2018/12/11,555.0,552.923,557.7,10624300,558.1,546.0
1055,2018/12/12,561.6,562.888,560.2,11128000,567.5,559.6
1056,2018/12/13,565.6,567.12,567.2,10983200,571.8,564.8
1057,2018/12/14,552.1,554.137,561.0,19860200,561.6,546.3
1058,2018/12/17,555.0,557.184,562.1,9025500,565.6,553.8
1059,2018/12/18,547.7,547.342,546.0,11186900,551.0,543.3
1060,2018/12/19,542.3,541.539,542.8,9364800,545.0,537.6
1061,2018/12/20,536.8,535.9,535.7,11592500,542.6,531.9
1062,2018/12/21,528.2,528.411,537.8,14021900,540.9,522.4
1063,2018/12/25,512.5,510.626,508.2,11408600,513.6,504.1
1064,2018/12/26,513.0,512.179,514.2,10027900,518.5,506.5
1065,2018/12/27,529.7,530.805,535.0,10432500,541.0,527.0
1066,2018/12/28,528.7,528.385,522.6,8091400,533.6,519.7
1067,2019/01/04,529.2,524.905,518.7,9922500,529.2,517.3
1068,2019/01/07,541.1,542.605,545.3,9220700,547.2,539.2
1069,2019/01/08,543.8,545.356,540.7,8513700,549.8,540.3
1070,2019/01/09,547.9,546.503,550.0,7421800,552.7,542.0
1071,2019/01/10,545.7,544.003,539.7,6679200,547.3,538.5
1072,2019/01/11,545.1,544.99,545.5,8509900,547.9,542.2
1073,2019/01/15,552.4,552.182,542.4,11093700,557.8,541.8
1074,2019/01/16,544.0,542.617,551.5,9088300,551.5,538.2
1075,2019/01/17,547.0,549.143,553.3,6601500,554.0,546.5
1076,2019/01/18,551.0,552.069,551.7,5993100,556.9,548.0
1077,2019/01/21,556.2,556.771,556.9,5651400,560.4,552.3
1078,2019/01/22,549.2,549.962,555.0,5674800,556.5,547.2
1079,2019/01/23,546.5,547.12,546.0,7495400,551.7,544.1
1080,2019/01/24,552.0,551.726,548.1,8262100,555.6,547.1
1081,2019/01/25,556.2,556.095,551.6,7972900,560.5,551.5
1082,2019/01/28,550.7,551.29,552.4,7107600,553.7,548.4
1083,2019/01/29,548.0,547.617,550.1,8077200,551.7,543.8
1084,2019/01/30,547.4,548.29,547.1,7431000,551.7,546.6
1085,2019/01/31,549.9,550.328,550.1,8989200,556.5,546.9
1086,2019/02/01,527.2,531.702,543.7,15244200,543.7,526.6
1087,2019/02/04,534.8,534.953,535.0,7951400,539.4,531.1
1088,2019/02/05,533.1,533.3,532.8,5179300,535.5,531.5
1089,2019/02/06,530.5,530.184,532.8,8729600,533.7,527.3
1090,2019/02/07,517.7,519.402,525.2,12828300,526.4,515.7
1091,2019/02/08,505.4,506.439,513.6,13374100,514.1,502.8
1092,2019/02/12,516.5,515.824,507.5,12343000,519.8,505.3
1093,2019/02/13,515.4,515.28,519.4,10521000,519.8,511.2
1094,2019/02/14,512.0,512.82,509.3,13355200,516.1,508.9
1095,2019/02/15,507.8,506.393,505.9,11620900,509.6,500.8
1096,2019/02/18,515.4,516.686,516.1,10712800,519.0,513.2
1097,2019/02/19,514.0,512.269,511.5,16092200,515.1,509.0
1098,2019/02/20,509.5,508.709,511.1,21198400,513.6,505.4
1099,2019/02/21,512.0,510.389,509.5,10652900,512.7,506.8
1100,2019/02/22,507.4,507.123,505.9,7475000,509.6,503.6
1101,2019/02/25,510.3,509.345,509.4,9021900,511.0,506.2
1102,2019/02/26,506.3,504.749,506.2,10138900,506.8,501.4
1103,2019/02/27,507.0,507.67,507.4,8692100,510.4,505.7
1104,2019/02/28,503.3,505.226,506.0,10508800,508.8,503.3
1105,2019/03/01,505.6,505.11,506.9,9230400,508.3,503.2
1106,2019/03/04,504.2,504.978,508.2,8095500,509.5,503.2
1107,2019/03/05,506.8,504.626,502.0,8941300,507.1,501.1
1108,2019/03/06,505.4,505.178,506.8,5386900,507.0,503.2
1109,2019/03/07,500.7,500.418,504.2,11572300,505.5,498.2
1110,2019/03/08,484.8,488.336,493.4,19427800,495.0,483.0
1111,2019/03/11,487.5,487.489,483.8,7639500,490.7,482.5
1112,2019/03/12,488.6,490.458,486.8,11366600,493.8,485.5
1113,2019/03/13,488.7,487.783,484.0,11400800,490.6,483.2
1114,2019/03/14,490.2,491.724,489.0,10660000,496.9,488.9
1115,2019/03/15,493.0,493.646,491.4,10216700,497.2,491.2
1116,2019/03/18,494.5,493.703,493.4,7203600,495.6,491.3
1117,2019/03/19,497.3,498.428,496.4,9661600,501.1,493.8
1118,2019/03/20,499.8,497.469,490.7,11981700,500.0,490.5
1119,2019/03/22,498.7,496.839,493.2,14008400,499.4,491.4
1120,2019/03/25,486.7,486.397,490.3,12606500,490.3,482.9
1121,2019/03/26,496.1,494.437,488.9,14196400,498.3,485.6
1122,2019/03/27,487.9,485.55,482.0,9007900,488.1,481.9
1123,2019/03/28,480.6,481.277,487.3,11505000,488.4,479.0
1124,2019/03/29,479.7,481.288,484.5,7225100,485.1,479.7
1125,2019/04/01,487.9,488.767,484.0,10653800,493.2,484.0
1126,2019/04/02,490.9,492.692,498.0,7564100,498.0,489.6
1127,2019/04/03,492.8,491.626,490.0,7690600,494.1,486.8
1128,2019/04/04,491.2,491.864,495.0,6108000,495.5,490.3
1129,2019/04/05,497.1,496.264,492.8,7182400,498.4,491.5
1130,2019/04/08,488.0,489.209,498.4,11214200,498.6,485.0
1131,2019/04/09,486.6,484.556,483.2,6019700,486.6,481.8
1132,2019/04/10,474.9,474.28,476.0,14192100,477.8,470.7
1133,2019/04/11,460.0,461.43,470.7,20795400,471.3,458.1
1134,2019/04/12,455.0,457.821,462.9,15457500,464.9,455.0
1135,2019/04/15,460.8,461.982,463.0,13718900,465.0,458.9
1136,2019/04/16,461.7,460.278,457.3,8113700,463.0,455.0
1137,2019/04/17,467.4,466.788,463.4,12022600,470.6,462.4
1138,2019/04/18,466.5,469.41,470.0,14677100,474.8,465.6
1139,2019/04/19,464.2,464.61,465.0,5478700,466.9,462.8
1140,2019/04/22,468.2,467.03,461.6,8217000,470.7,460.1
1141,2019/04/23,473.6,473.642,469.2,12503900,476.1,469.0
1142,2019/04/24,467.4,468.252,475.0,9862300,476.9,463.5
1143,2019/04/25,472.7,470.523,468.0,11466200,474.8,464.4
1144,2019/04/26,469.7,467.223,468.0,10168200,470.7,462.0
1145,2019/05/07,469.5,469.222,475.3,9693500,475.8,465.9
1146,2019/05/08,459.9,458.857,458.2,13862500,461.0,455.7
1147,2019/05/09,451.9,451.172,455.3,11985900,456.0,448.3
1148,2019/05/10,446.6,447.225,447.4,14249500,452.0,443.0
1149,2019/05/13,458.0,459.119,454.6,21645200,464.0,454.0
1150,2019/05/14,454.3,444.828,434.0,22607200,454.9,433.0
1151,2019/05/15,462.3,461.781,458.3,17363100,465.1,456.2
1152,2019/05/16,462.2,461.121,458.3,12086700,464.5,455.3
1153,2019/05/17,462.9,464.364,468.0,9988500,468.4,459.3
1154,2019/05/20,467.5,467.351,466.4,8977100,470.6,464.7
1155,2019/05/21,464.3,464.132,460.2,15316400,467.1,458.1
1156,2019/05/22,464.0,463.024,465.6,8715600,466.0,460.2
1157,2019/05/23,462.9,461.403,460.3,8802000,464.0,457.6
1158,2019/05/24,465.8,464.298,461.4,10217800,466.0,459.5
1159,2019/05/27,465.5,465.979,468.0,6225000,468.7,463.5
1160,2019/05/28,466.8,466.872,465.5,9937200,469.2,464.5
1161,2019/05/29,465.3,464.128,461.5,10226900,467.0,458.1
1162,2019/05/30,469.2,468.177,462.5,8444600,470.8,461.9
1163,2019/05/31,459.9,461.656,463.5,12944800,465.2,459.1
1164,2019/06/03,455.1,454.445,454.6,8763600,457.3,451.4
1165,2019/06/04,458.8,459.338,460.2,9576900,463.3,457.3
1166,2019/06/05,467.1,467.253,467.0,11881900,472.3,464.2
1167,2019/06/06,464.7,464.842,462.9,6806400,466.5,462.1
1168,2019/06/07,460.9,457.099,455.0,11669700,461.6,451.7
1169,2019/06/10,452.9,454.344,461.8,12806700,461.8,452.4
1170,2019/06/11,458.7,457.378,455.2,10336100,458.7,453.9
1171,2019/06/12,450.0,449.904,451.2,11963000,451.5,447.3
1172,2019/06/13,442.1,442.042,445.5,12186700,447.0,439.0
1173,2019/06/14,443.4,443.283,443.3,9993400,445.1,440.3
1174,2019/06/17,440.0,441.709,442.0,8162700,444.0,440.0
1175,2019/06/18,436.5,437.267,436.3,8401400,441.8,435.3
1176,2019/06/19,440.2,440.89,440.3,7185400,443.2,439.3
1177,2019/06/20,441.8,442.73,441.0,7695100,444.5,440.1
1178,2019/06/21,438.6,438.64,440.0,12862800,443.1,436.1
1179,2019/06/24,442.9,442.945,440.4,8259800,445.0,438.9
1180,2019/06/25,441.1,440.289,438.9,6963400,442.8,438.3
1181,2019/06/26,438.1,438.154,439.1,6848200,440.7,436.6
1182,2019/06/27,449.2,447.287,442.9,10319000,449.2,441.3
1183,2019/06/28,448.6,447.477,449.5,8738700,451.0,444.3
1184,2019/07/01,453.5,453.641,456.6,10756600,458.8,451.3
1185,2019/07/02,454.3,453.662,454.3,7418100,454.8,450.6
1186,2019/07/03,450.1,448.557,449.0,8577900,450.5,444.9
1187,2019/07/04,450.2,449.423,448.8,5882200,451.3,446.3
1188,2019/07/05,450.9,450.556,448.2,6240900,452.4,447.8
1189,2019/07/08,454.3,456.913,455.3,12170000,461.0,453.6
1190,2019/07/09,457.2,459.06,460.0,11461900,463.9,455.9
1191,2019/07/10,459.6,459.051,455.8,9233300,460.9,455.1
1192,2019/07/11,459.9,459.079,458.0,6044100,460.4,456.6
1193,2019/07/12,461.6,461.284,462.0,4932900,464.3,458.9
1194,2019/07/16,455.0,455.503,457.0,8186000,458.9,454.1
1195,2019/07/17,461.7,460.716,453.5,12251200,463.5,453.3
1196,2019/07/18,450.7,452.289,457.0,13394200,459.5,448.8
1197,2019/07/19,452.5,453.345,450.6,9254900,456.2,448.3
1198,2019/07/22,449.9,449.989,454.1,8267000,455.9,446.9
1199,2019/07/23,448.4,449.161,446.0,7543900,451.8,445.3
1200,2019/07/24,449.9,450.828,452.6,5765600,453.4,449.6
1201,2019/07/25,447.9,447.488,448.4,5456900,448.9,446.3
1202,2019/07/26,445.4,445.115,445.4,6343200,447.3,443.6
1203,2019/07/29,443.1,444.066,448.4,6506000,449.3,441.3
1204,2019/07/30,444.8,445.02,445.0,5761000,448.6,442.7
1205,2019/07/31,444.4,443.963,443.0,8724600,445.2,440.7
1206,2019/08/01,451.7,450.907,442.2,10297500,455.3,441.8
1207,2019/08/02,446.1,443.127,442.4,14552900,446.1,440.1
1208,2019/08/05,435.6,436.464,443.0,9889900,443.6,432.6
1209,2019/08/06,431.5,426.758,422.7,10381900,432.5,418.4
1210,2019/08/07,429.9,430.24,429.6,7764500,433.2,427.1
1211,2019/08/08,423.3,424.474,426.5,8183500,427.2,422.7
1212,2019/08/09,424.1,423.849,422.7,7236900,425.7,421.8
1213,2019/08/13,417.6,417.212,420.0,10628700,421.0,413.6
1214,2019/08/14,416.7,417.236,419.5,7052900,420.6,415.8
1215,2019/08/15,409.9,408.182,404.6,10221700,410.8,404.0
1216,2019/08/16,407.5,406.736,406.4,8340100,407.9,404.7
1217,2019/08/19,413.2,412.674,410.9,7984500,414.1,410.1
1218,2019/08/20,410.8,411.608,415.6,6274200,417.2,409.8
1219,2019/08/21,405.9,405.631,405.1,8360700,406.8,403.3
1220,2019/08/22,407.1,406.878,407.5,6021400,408.3,405.1
1221,2019/08/23,411.0,410.399,406.8,7999700,412.4,406.3
