ds,yhat
2019-08-20,129.93606122275878
2019-08-21,130.32466211128417
2019-08-22,130.34192868280468
2019-08-23,129.82614731123968
2019-08-26,127.0037725982185
2019-08-27,125.86471767495085
2019-08-28,125.0854376049271
2019-08-29,125.09391862917582
2019-08-30,125.73783655109719
2019-09-02,122.76798047922675
2019-09-03,120.1123213826267
2019-09-04,118.93813105497469
2019-09-05,120.09228760724433
2019-09-06,122.62022604054842
2019-09-09,120.32297425929485
2019-09-10,116.87948654979411
2019-09-11,115.5212274413241
2019-09-12,117.05714623504454
2019-09-13,120.18346830259948
2019-09-17,119.57400589798097
2019-09-18,119.39837898186258
