,Date,Close,VWAP,Open,Volume,High,Low
0,2014/08/25,1045.0,1043.986,1032.0,62600,1057.0,1032.0
1,2014/08/26,1023.0,1022.666,1045.0,58300,1045.0,1001.0
2,2014/08/27,1021.0,1015.474,1016.0,24700,1030.0,1006.0
3,2014/08/28,1010.0,1009.953,1011.0,46500,1032.0,998.0
4,2014/08/29,982.0,984.298,1014.0,58000,1015.0,967.0
5,2014/09/01,990.0,996.208,980.0,57200,1017.0,980.0
6,2014/09/02,1031.0,1011.131,995.0,64800,1034.0,986.0
7,2014/09/03,1007.0,1007.566,1031.0,81300,1032.0,993.0
8,2014/09/04,988.0,989.779,996.0,54800,1006.0,965.0
9,2014/09/05,992.0,1000.731,985.0,27100,1019.0,985.0
10,2014/09/08,1010.0,996.287,992.0,31400,1015.0,980.0
11,2014/09/09,1039.0,1039.162,1020.0,94000,1056.0,1012.0
12,2014/09/10,1005.0,1010.718,1039.0,47800,1039.0,995.0
13,2014/09/11,1025.0,1023.354,1019.0,27400,1032.0,1008.0
14,2014/09/12,982.0,988.947,1011.0,94400,1012.0,972.0
15,2014/09/16,991.0,995.517,988.0,26300,1010.0,986.0
16,2014/09/17,976.0,967.068,995.0,64900,1000.0,947.0
17,2014/09/18,953.0,956.495,962.0,40200,968.0,950.0
18,2014/09/19,956.0,954.289,968.0,33900,968.0,945.0
19,2014/09/22,985.0,991.284,969.0,74200,1006.0,960.0
20,2014/09/24,1002.0,990.928,988.0,34500,1003.0,979.0
21,2014/09/25,1031.0,1028.713,1008.0,99700,1042.0,1008.0
22,2014/09/26,1017.0,1010.181,1016.0,26600,1029.0,999.0
23,2014/09/29,1068.0,1052.247,1030.0,102300,1070.0,1027.0
24,2014/09/30,1047.0,1036.776,1068.0,109000,1068.0,1006.0
25,2014/10/01,1036.0,1031.968,1047.0,77000,1049.0,1019.0
26,2014/10/02,1003.0,1005.312,1000.0,89500,1026.0,996.0
27,2014/10/03,1044.0,1022.155,1003.0,34800,1044.0,1003.0
28,2014/10/06,1061.0,1059.825,1067.0,42200,1067.0,1052.0
29,2014/10/07,1115.0,1117.006,1075.0,329800,1138.0,1067.0
30,2014/10/08,1120.0,1101.605,1100.0,106700,1124.0,1069.0
31,2014/10/09,1103.0,1112.4,1120.0,127400,1146.0,1082.0
32,2014/10/10,1128.0,1096.701,1075.0,114300,1140.0,1067.0
33,2014/10/14,1167.0,1144.675,1125.0,162300,1179.0,1086.0
34,2014/10/15,1221.0,1201.434,1183.0,171600,1228.0,1162.0
35,2014/10/16,1206.0,1207.311,1173.0,128100,1241.0,1170.0
36,2014/10/17,1238.0,1252.908,1250.0,129800,1278.0,1235.0
37,2014/10/20,1297.0,1287.991,1280.0,125800,1322.0,1244.0
38,2014/10/21,1316.0,1304.72,1299.0,126400,1321.0,1263.0
39,2014/10/22,1173.0,1232.099,1353.0,407900,1366.0,1103.0
40,2014/10/23,1119.0,1141.748,1150.0,157700,1167.0,1117.0
41,2014/10/24,1082.0,1077.508,1120.0,336800,1134.0,1029.0
42,2014/10/27,1125.0,1103.749,1072.0,123800,1128.0,1072.0
43,2014/10/28,1131.0,1115.846,1103.0,84300,1145.0,1089.0
44,2014/10/29,1141.0,1136.475,1131.0,70700,1155.0,1124.0
45,2014/10/30,1140.0,1127.436,1131.0,58700,1146.0,1106.0
46,2014/10/31,1133.0,1130.961,1139.0,66100,1150.0,1114.0
47,2014/11/04,1134.0,1145.411,1179.0,116900,1179.0,1127.0
48,2014/11/05,1126.0,1127.798,1128.0,52000,1143.0,1118.0
49,2014/11/06,1190.0,1174.095,1124.0,116000,1198.0,1124.0
50,2014/11/07,1231.0,1211.65,1192.0,98200,1233.0,1182.0
51,2014/11/10,1230.0,1247.718,1242.0,87100,1269.0,1223.0
52,2014/11/11,1217.0,1266.554,1300.0,343300,1320.0,1183.0
53,2014/11/12,1259.0,1260.516,1238.0,112600,1278.0,1236.0
54,2014/11/13,1190.0,1198.916,1251.0,145500,1251.0,1177.0
55,2014/11/14,1201.0,1177.912,1181.0,72600,1201.0,1155.0
56,2014/11/17,1185.0,1194.479,1231.0,102600,1231.0,1169.0
57,2014/11/18,1210.0,1195.866,1197.0,65000,1210.0,1181.0
58,2014/11/19,1237.0,1224.167,1220.0,43100,1237.0,1211.0
59,2014/11/20,1246.0,1241.715,1245.0,37200,1248.0,1233.0
60,2014/11/21,1194.0,1200.918,1239.0,74400,1239.0,1185.0
61,2014/11/25,1214.0,1211.322,1210.0,33200,1219.0,1200.0
62,2014/11/26,1185.0,1188.571,1210.0,80000,1210.0,1173.0
63,2014/11/27,1156.0,1161.581,1170.0,115500,1180.0,1148.0
64,2014/11/28,1175.0,1180.265,1186.0,92500,1189.0,1164.0
65,2014/12/01,1238.0,1226.13,1185.0,147700,1250.0,1184.0
66,2014/12/02,1206.0,1216.783,1232.0,99900,1237.0,1197.0
67,2014/12/03,1215.0,1213.186,1217.0,40800,1230.0,1197.0
68,2014/12/04,1198.0,1205.22,1208.0,25000,1224.0,1197.0
69,2014/12/05,1204.0,1200.924,1200.0,15800,1205.0,1197.0
70,2014/12/08,1235.0,1234.914,1216.0,115200,1256.0,1216.0
71,2014/12/09,1241.0,1243.858,1226.0,40000,1258.0,1220.0
72,2014/12/10,1225.0,1221.945,1220.0,38200,1240.0,1204.0
73,2014/12/11,1230.0,1212.33,1196.0,43300,1233.0,1193.0
74,2014/12/12,1245.0,1242.298,1231.0,24800,1249.0,1231.0
75,2014/12/15,1233.0,1222.61,1215.0,42800,1239.0,1212.0
76,2014/12/16,1199.0,1210.419,1221.0,51500,1229.0,1191.0
77,2014/12/17,1200.0,1189.893,1166.0,37300,1209.0,1163.0
78,2014/12/18,1209.0,1215.86,1230.0,22200,1231.0,1202.0
79,2014/12/19,1277.0,1251.018,1229.0,73600,1277.0,1225.0
80,2014/12/22,1300.0,1297.39,1289.0,69500,1310.0,1281.0
81,2014/12/24,1280.0,1292.205,1305.0,25800,1305.0,1280.0
82,2014/12/25,1285.0,1285.872,1290.0,24300,1290.0,1280.0
83,2014/12/26,1270.0,1267.299,1271.0,29800,1279.0,1255.0
84,2014/12/29,1255.0,1264.773,1275.0,19400,1279.0,1255.0
85,2014/12/30,1233.0,1240.324,1252.0,24100,1259.0,1233.0
86,2015/01/05,1223.0,1227.287,1222.0,18100,1239.0,1221.0
87,2015/01/06,1235.0,1223.217,1206.0,16600,1240.0,1206.0
88,2015/01/07,1248.0,1228.524,1214.0,14900,1250.0,1208.0
89,2015/01/08,1264.0,1257.911,1276.0,12400,1276.0,1248.0
90,2015/01/09,1240.0,1236.304,1265.0,15800,1269.0,1208.0
91,2015/01/13,1233.0,1210.589,1207.0,26500,1233.0,1204.0
92,2015/01/14,1230.0,1229.813,1232.0,12800,1237.0,1219.0
93,2015/01/15,1210.0,1209.579,1227.0,26600,1229.0,1205.0
94,2015/01/16,1166.0,1177.75,1201.0,46400,1203.0,1125.0
95,2015/01/19,1136.0,1143.709,1163.0,32000,1179.0,1124.0
96,2015/01/20,1128.0,1108.311,1130.0,47900,1137.0,1093.0
97,2015/01/21,1048.0,1063.842,1100.0,122500,1105.0,1042.0
98,2015/01/22,1030.0,1038.082,1041.0,60000,1059.0,1028.0
99,2015/01/23,1068.0,1049.03,1028.0,43900,1068.0,1028.0
100,2015/01/26,1079.0,1066.267,1060.0,26200,1080.0,1052.0
101,2015/01/27,1056.0,1063.943,1081.0,29600,1082.0,1055.0
102,2015/01/28,1047.0,1042.317,1053.0,29700,1053.0,1035.0
103,2015/01/29,1031.0,1037.622,1038.0,34100,1061.0,1028.0
104,2015/01/30,1026.0,1031.546,1033.0,23100,1051.0,1021.0
105,2015/02/02,984.0,989.226,1000.0,64300,1004.0,972.0
106,2015/02/03,978.0,997.524,990.0,45000,1032.0,972.0
107,2015/02/04,976.0,978.477,970.0,29800,990.0,970.0
108,2015/02/05,977.0,974.838,970.0,33300,996.0,964.0
109,2015/02/06,957.0,961.846,971.0,40200,972.0,955.0
110,2015/02/09,966.0,960.061,957.0,13200,975.0,952.0
111,2015/02/10,958.0,960.817,963.0,24000,968.0,956.0
112,2015/02/12,970.0,966.549,963.0,25500,978.0,957.0
113,2015/02/13,905.0,927.738,1016.0,414900,1016.0,860.0
114,2015/02/16,901.0,913.969,920.0,117600,937.0,890.0
115,2015/02/17,883.0,891.163,900.0,92500,909.0,878.0
116,2015/02/18,873.0,877.764,884.0,95300,892.0,867.0
117,2015/02/19,876.0,877.003,881.0,70400,891.0,868.0
118,2015/02/20,860.0,874.125,880.0,101700,890.0,856.0
119,2015/02/23,868.0,866.363,866.0,53700,872.0,860.0
120,2015/02/24,904.0,893.894,879.0,90200,908.0,879.0
121,2015/02/25,952.0,941.915,914.0,133600,970.0,907.0
122,2015/02/26,950.0,934.232,937.0,95100,960.0,921.0
123,2015/02/27,933.0,937.741,951.0,34800,956.0,930.0
124,2015/03/02,916.0,918.605,924.0,44500,928.0,912.0
125,2015/03/03,902.0,902.096,910.0,51100,911.0,898.0
126,2015/03/04,918.0,905.709,899.0,26100,918.0,896.0
127,2015/03/05,927.0,918.753,924.0,28700,927.0,910.0
128,2015/03/06,927.0,929.847,932.0,45100,938.0,921.0
129,2015/03/09,905.0,916.605,926.0,40500,928.0,905.0
130,2015/03/10,882.0,891.08,906.0,88300,915.0,872.0
131,2015/03/11,893.0,888.317,880.0,69100,900.0,878.0
132,2015/03/12,925.0,904.997,897.0,58800,926.0,893.0
133,2015/03/13,932.0,933.46,933.0,66700,938.0,930.0
134,2015/03/16,917.0,923.871,931.0,35700,932.0,913.0
135,2015/03/17,915.0,915.202,916.0,19300,921.0,911.0
136,2015/03/18,902.0,903.092,915.0,49800,916.0,897.0
137,2015/03/19,916.0,911.478,905.0,18400,919.0,905.0
138,2015/03/20,930.0,923.15,918.0,20700,930.0,914.0
139,2015/03/23,934.0,934.081,940.0,26000,940.0,928.0
140,2015/03/24,932.0,935.181,934.0,18800,939.0,929.0
141,2015/03/25,924.0,925.539,937.0,14300,937.0,920.0
142,2015/03/26,910.0,916.496,927.0,22400,927.0,910.0
143,2015/03/27,911.0,914.445,910.0,14600,922.0,905.0
144,2015/03/30,931.0,922.079,919.0,12700,931.0,914.0
145,2015/03/31,945.0,943.228,942.0,39000,950.0,937.0
146,2015/04/01,967.0,959.114,951.0,55400,974.0,946.0
147,2015/04/02,998.0,985.646,972.0,83600,1006.0,972.0
148,2015/04/03,1078.0,1043.954,1026.0,145900,1080.0,1014.0
149,2015/04/06,1123.0,1099.047,1070.0,111100,1124.0,1067.0
150,2015/04/07,1145.0,1143.165,1140.0,136400,1165.0,1116.0
151,2015/04/08,1091.0,1121.038,1139.0,81900,1152.0,1088.0
152,2015/04/09,1109.0,1096.154,1088.0,26700,1116.0,1085.0
153,2015/04/10,1130.0,1113.247,1117.0,62000,1134.0,1097.0
154,2015/04/13,1189.0,1172.454,1160.0,84200,1193.0,1155.0
155,2015/04/14,1177.0,1183.966,1190.0,40600,1193.0,1175.0
156,2015/04/15,1182.0,1190.276,1181.0,48500,1202.0,1171.0
157,2015/04/16,1192.0,1188.974,1190.0,34600,1197.0,1182.0
158,2015/04/17,1164.0,1165.486,1185.0,47100,1190.0,1100.0
159,2015/04/20,1102.0,1108.976,1104.0,49800,1126.0,1098.0
160,2015/04/21,1076.0,1083.985,1101.0,59600,1107.0,1065.0
161,2015/04/22,1068.0,1071.355,1076.0,65300,1094.0,1057.0
162,2015/04/23,1072.0,1081.571,1095.0,39200,1095.0,1068.0
163,2015/04/24,1076.0,1075.311,1070.0,34100,1090.0,1067.0
164,2015/04/27,1063.0,1065.169,1095.0,34400,1095.0,1049.0
165,2015/04/28,1055.0,1053.589,1068.0,24300,1068.0,1041.0
166,2015/04/30,1060.0,1060.872,1055.0,22700,1068.0,1055.0
167,2015/05/01,1080.0,1053.921,1050.0,44100,1080.0,1040.0
168,2015/05/07,1090.0,1073.333,1062.0,44800,1095.0,1060.0
169,2015/05/08,1390.0,1390.0,1390.0,83700,1390.0,1390.0
170,2015/05/11,1405.0,1426.836,1390.0,1625200,1549.0,1342.0
171,2015/05/12,1455.0,1484.247,1440.0,498300,1576.0,1436.0
172,2015/05/13,1619.0,1530.037,1440.0,668000,1619.0,1415.0
173,2015/05/14,1640.0,1579.965,1580.0,375500,1640.0,1535.0
174,2015/05/15,1613.0,1618.431,1630.0,227400,1666.0,1590.0
175,2015/05/18,1667.0,1614.231,1630.0,316300,1700.0,1550.0
176,2015/05/19,1680.0,1682.769,1656.0,246300,1740.0,1621.0
177,2015/05/20,1557.0,1599.315,1640.0,289800,1654.0,1556.0
178,2015/05/21,1605.0,1602.567,1568.0,127800,1642.0,1568.0
179,2015/05/22,1608.0,1610.917,1634.0,55500,1634.0,1591.0
180,2015/05/25,1695.0,1680.297,1633.0,139900,1715.0,1633.0
181,2015/05/26,1642.0,1658.263,1695.0,116900,1699.0,1635.0
182,2015/05/27,1613.0,1626.606,1620.0,47000,1659.0,1612.0
183,2015/05/28,1653.0,1618.794,1601.0,128400,1660.0,1567.0
184,2015/05/29,1580.0,1590.506,1635.0,180600,1646.0,1565.0
185,2015/06/01,1600.0,1608.528,1592.0,53000,1629.0,1586.0
186,2015/06/02,1586.0,1590.683,1613.0,50800,1615.0,1568.0
187,2015/06/03,1621.0,1611.782,1591.0,88200,1631.0,1581.0
188,2015/06/04,1656.0,1662.782,1624.0,95600,1683.0,1624.0
189,2015/06/05,1619.0,1624.365,1656.0,67200,1666.0,1606.0
190,2015/06/08,1619.0,1604.009,1648.0,45400,1648.0,1580.0
191,2015/06/09,1570.0,1584.126,1619.0,91800,1619.0,1565.0
192,2015/06/10,1577.0,1574.138,1559.0,39900,1588.0,1556.0
193,2015/06/11,1559.0,1564.741,1581.0,52600,1599.0,1547.0
194,2015/06/12,1478.0,1470.556,1522.0,356000,1537.0,1420.0
195,2015/06/15,1412.0,1426.331,1448.0,292200,1469.0,1394.0
196,2015/06/16,1414.0,1411.688,1400.0,156800,1446.0,1379.0
197,2015/06/17,1471.0,1453.813,1406.0,145600,1500.0,1402.0
198,2015/06/18,1436.0,1434.735,1441.0,69900,1456.0,1414.0
199,2015/06/19,1442.0,1424.645,1424.0,70400,1445.0,1411.0
200,2015/06/22,1441.0,1430.084,1423.0,40300,1444.0,1419.0
201,2015/06/23,1486.0,1468.126,1441.0,86400,1495.0,1427.0
202,2015/06/24,1479.0,1486.233,1477.0,89700,1510.0,1464.0
203,2015/06/25,1462.0,1470.4,1474.0,68000,1486.0,1455.0
204,2015/06/26,1448.0,1449.276,1461.0,33000,1470.0,1439.0
205,2015/06/29,1401.0,1404.451,1401.0,57000,1427.0,1398.0
206,2015/06/30,1425.0,1411.845,1390.0,31600,1426.0,1390.0
207,2015/07/01,1459.0,1450.025,1429.0,32400,1463.0,1429.0
208,2015/07/02,1434.0,1457.714,1485.0,29700,1486.0,1431.0
209,2015/07/03,1435.0,1433.672,1442.0,30200,1443.0,1425.0
210,2015/07/06,1434.0,1414.506,1411.0,57700,1435.0,1399.0
211,2015/07/07,1497.0,1476.633,1450.0,122500,1497.0,1447.0
212,2015/07/08,1490.0,1494.0,1488.0,124700,1515.0,1471.0
213,2015/07/09,1525.0,1456.699,1430.0,142500,1531.0,1381.0
214,2015/07/10,1475.0,1507.335,1531.0,93400,1533.0,1470.0
215,2015/07/13,1470.0,1482.075,1494.0,40200,1494.0,1465.0
216,2015/07/14,1524.0,1511.793,1480.0,77200,1530.0,1480.0
217,2015/07/15,1607.0,1578.086,1536.0,123700,1610.0,1530.0
218,2015/07/16,1612.0,1609.395,1611.0,83200,1635.0,1582.0
219,2015/07/17,1667.0,1651.629,1630.0,129500,1670.0,1627.0
220,2015/07/21,1705.0,1702.451,1701.0,138400,1720.0,1681.0
221,2015/07/22,1760.0,1739.387,1700.0,175400,1771.0,1680.0
222,2015/07/23,1753.0,1768.863,1753.0,99400,1796.0,1745.0
223,2015/07/24,1720.0,1736.905,1750.0,51400,1764.0,1719.0
224,2015/07/27,1717.0,1734.685,1755.0,71400,1768.0,1692.0
225,2015/07/28,1733.0,1695.447,1696.0,72900,1748.0,1647.0
226,2015/07/29,1778.0,1772.423,1758.0,115200,1798.0,1736.0
227,2015/07/30,1767.0,1786.712,1808.0,89900,1810.0,1754.0
228,2015/07/31,1798.0,1778.132,1751.0,63000,1798.0,1748.0
229,2015/08/03,1810.0,1802.474,1799.0,81100,1822.0,1775.0
230,2015/08/04,1780.0,1782.955,1810.0,62600,1810.0,1765.0
231,2015/08/05,1780.0,1760.98,1756.0,68700,1790.0,1726.0
232,2015/08/06,1837.0,1826.132,1800.0,125200,1837.0,1793.0
233,2015/08/07,1907.0,1902.448,1845.0,400000,1951.0,1845.0
234,2015/08/10,1785.0,1818.173,1880.0,230700,1880.0,1760.0
235,2015/08/11,1859.0,1843.011,1805.0,116300,1885.0,1805.0
236,2015/08/12,1871.0,1872.188,1847.0,78300,1902.0,1819.0
237,2015/08/13,1936.0,1925.926,1870.0,137600,1959.0,1870.0
238,2015/08/14,1995.0,1980.859,1960.0,212400,2000.0,1918.0
239,2015/08/17,2090.0,2059.821,2000.0,244600,2097.0,2000.0
240,2015/08/18,2150.0,2137.356,2120.0,305900,2165.0,2112.0
241,2015/08/19,2084.0,2150.303,2160.0,272200,2215.0,2073.0
242,2015/08/20,2065.0,2030.062,2001.0,164300,2090.0,1976.0
243,2015/08/21,1920.0,1939.289,1941.0,148900,2011.0,1900.0
244,2015/08/24,1690.0,1779.018,1821.0,231300,1873.0,1665.0
245,2015/08/25,1575.0,1630.724,1591.0,315400,1768.0,1487.0
246,2015/08/26,1680.0,1651.628,1670.0,132900,1695.0,1611.0
247,2015/08/27,1688.0,1713.977,1760.0,171000,1760.0,1668.0
248,2015/08/28,1713.0,1716.026,1731.0,144200,1745.0,1695.0
249,2015/08/31,1693.0,1695.331,1713.0,121700,1738.0,1652.0
250,2015/09/01,1591.0,1626.554,1676.0,157700,1683.0,1582.0
251,2015/09/02,1581.0,1571.003,1501.0,124100,1627.0,1501.0
252,2015/09/03,1550.0,1575.89,1615.0,94300,1617.0,1541.0
253,2015/09/04,1488.0,1486.144,1535.0,162100,1543.0,1448.0
254,2015/09/07,1480.0,1473.586,1465.0,88500,1526.0,1432.0
255,2015/09/08,1418.0,1453.579,1491.0,57500,1515.0,1406.0
256,2015/09/09,1560.0,1524.842,1479.0,133100,1564.0,1472.0
257,2015/09/10,1503.0,1495.263,1499.0,99000,1518.0,1471.0
258,2015/09/11,1609.0,1588.608,1510.0,172300,1630.0,1500.0
259,2015/09/14,1511.0,1555.522,1600.0,150900,1600.0,1504.0
260,2015/09/15,1514.0,1525.432,1507.0,67900,1560.0,1502.0
261,2015/09/16,1466.0,1477.704,1522.0,85100,1533.0,1457.0
262,2015/09/17,1519.0,1508.047,1500.0,78600,1531.0,1490.0
263,2015/09/18,1508.0,1506.335,1515.0,37000,1524.0,1479.0
264,2015/09/24,1437.0,1446.311,1465.0,102300,1474.0,1422.0
265,2015/09/25,1444.0,1433.624,1436.0,40700,1454.0,1417.0
266,2015/09/28,1503.0,1498.969,1500.0,71700,1515.0,1476.0
267,2015/09/29,1426.0,1444.592,1491.0,62000,1499.0,1420.0
268,2015/09/30,1452.0,1453.499,1474.0,36300,1489.0,1434.0
269,2015/10/01,1448.0,1453.791,1478.0,63000,1480.0,1435.0
270,2015/10/02,1465.0,1447.022,1451.0,41900,1465.0,1423.0
271,2015/10/05,1582.0,1547.641,1495.0,90600,1585.0,1495.0
272,2015/10/06,1558.0,1563.986,1585.0,72900,1600.0,1533.0
273,2015/10/07,1532.0,1539.792,1562.0,56800,1568.0,1525.0
274,2015/10/08,1515.0,1523.502,1548.0,55600,1553.0,1501.0
275,2015/10/09,1518.0,1515.065,1511.0,30600,1527.0,1505.0
276,2015/10/13,1620.0,1583.779,1534.0,103100,1624.0,1532.0
277,2015/10/14,1582.0,1591.521,1601.0,56200,1617.0,1575.0
278,2015/10/15,1640.0,1614.888,1561.0,64000,1665.0,1555.0
279,2015/10/16,1663.0,1658.483,1660.0,51300,1680.0,1643.0
280,2015/10/19,1657.0,1666.13,1690.0,45500,1690.0,1643.0
281,2015/10/20,1644.0,1651.076,1670.0,40700,1671.0,1633.0
282,2015/10/21,1645.0,1632.196,1648.0,49400,1664.0,1606.0
283,2015/10/22,1603.0,1620.092,1626.0,58600,1647.0,1601.0
284,2015/10/23,1621.0,1625.171,1639.0,46200,1640.0,1607.0
285,2015/10/26,1694.0,1684.591,1632.0,126300,1716.0,1632.0
286,2015/10/27,1669.0,1677.884,1660.0,59700,1699.0,1660.0
287,2015/10/28,1654.0,1672.654,1686.0,51200,1696.0,1651.0
288,2015/10/29,1725.0,1717.24,1720.0,116700,1755.0,1686.0
289,2015/10/30,1742.0,1730.212,1730.0,90600,1755.0,1695.0
290,2015/11/02,1740.0,1740.098,1715.0,60400,1760.0,1715.0
291,2015/11/04,1741.0,1751.376,1795.0,70200,1795.0,1730.0
292,2015/11/05,1699.0,1692.209,1721.0,76500,1733.0,1675.0
293,2015/11/06,1711.0,1686.38,1680.0,48700,1713.0,1675.0
294,2015/11/09,1721.0,1730.384,1735.0,72900,1757.0,1713.0
295,2015/11/10,1544.0,1526.268,1532.0,377600,1564.0,1481.0
296,2015/11/11,1484.0,1502.978,1541.0,255000,1542.0,1481.0
297,2015/11/12,1471.0,1478.513,1483.0,123600,1494.0,1471.0
298,2015/11/13,1502.0,1482.924,1470.0,77400,1502.0,1466.0
299,2015/11/16,1451.0,1460.383,1472.0,97100,1475.0,1451.0
300,2015/11/17,1468.0,1460.26,1467.0,108400,1477.0,1437.0
301,2015/11/18,1485.0,1490.34,1487.0,87900,1498.0,1480.0
302,2015/11/19,1494.0,1493.906,1498.0,72100,1504.0,1486.0
303,2015/11/20,1444.0,1456.498,1489.0,195400,1489.0,1440.0
304,2015/11/24,1494.0,1469.047,1454.0,99600,1494.0,1453.0
305,2015/11/25,1535.0,1529.088,1510.0,233400,1550.0,1491.0
306,2015/11/26,1534.0,1538.478,1555.0,146900,1561.0,1524.0
307,2015/11/27,1562.0,1558.4,1548.0,135300,1579.0,1541.0
308,2015/11/30,1544.0,1554.57,1577.0,129700,1584.0,1535.0
309,2015/12/01,1509.0,1518.866,1544.0,153900,1545.0,1505.0
310,2015/12/02,1509.0,1513.289,1520.0,82000,1527.0,1502.0
311,2015/12/03,1490.0,1497.537,1513.0,114900,1513.0,1490.0
312,2015/12/04,1470.0,1472.646,1470.0,116500,1485.0,1464.0
313,2015/12/07,1473.0,1488.879,1480.0,106400,1509.0,1472.0
314,2015/12/08,1467.0,1469.652,1476.0,51500,1484.0,1460.0
315,2015/12/09,1450.0,1448.741,1457.0,109800,1459.0,1436.0
316,2015/12/10,1418.0,1425.291,1435.0,115400,1439.0,1410.0
317,2015/12/11,1451.0,1433.748,1421.0,61900,1451.0,1413.0
318,2015/12/14,1464.0,1439.424,1435.0,103700,1464.0,1420.0
319,2015/12/15,1402.0,1432.807,1474.0,139100,1475.0,1402.0
320,2015/12/16,1415.0,1422.104,1432.0,86700,1435.0,1408.0
321,2015/12/17,1443.0,1439.778,1436.0,77000,1455.0,1427.0
322,2015/12/18,1436.0,1439.055,1443.0,93600,1450.0,1430.0
323,2015/12/21,1407.0,1404.123,1436.0,236600,1448.0,1373.0
324,2015/12/22,1430.0,1413.127,1405.0,130300,1433.0,1399.0
325,2015/12/24,1406.0,1430.032,1438.0,158300,1469.0,1390.0
326,2015/12/25,1365.0,1377.705,1380.0,272300,1398.0,1361.0
327,2015/12/28,1391.0,1349.567,1311.0,143900,1397.0,1311.0
328,2015/12/29,1438.0,1425.88,1373.0,107500,1448.0,1373.0
329,2015/12/30,1427.0,1425.475,1449.0,55400,1449.0,1411.0
330,2016/01/04,1397.0,1406.542,1402.0,39300,1426.0,1390.0
331,2016/01/05,1390.0,1372.772,1367.0,61900,1400.0,1348.0
332,2016/01/06,1331.0,1336.465,1395.0,72100,1395.0,1313.0
333,2016/01/07,1301.0,1309.713,1311.0,79700,1330.0,1296.0
334,2016/01/08,1304.0,1302.945,1268.0,71200,1345.0,1268.0
335,2016/01/12,1186.0,1224.334,1279.0,163600,1280.0,1181.0
336,2016/01/13,1223.0,1224.397,1206.0,62800,1241.0,1206.0
337,2016/01/14,1186.0,1167.968,1181.0,82300,1193.0,1143.0
338,2016/01/15,1137.0,1161.97,1191.0,104900,1195.0,1127.0
339,2016/01/18,1102.0,1071.759,1050.0,197700,1118.0,1038.0
340,2016/01/19,1125.0,1111.022,1090.0,63800,1129.0,1089.0
341,2016/01/20,1180.0,1187.473,1200.0,303300,1234.0,1150.0
342,2016/01/21,1202.0,1219.136,1199.0,223300,1250.0,1191.0
343,2016/01/22,1327.0,1288.021,1231.0,219600,1340.0,1231.0
344,2016/01/25,1364.0,1369.377,1339.0,151300,1394.0,1339.0
345,2016/01/26,1342.0,1341.605,1312.0,139600,1370.0,1312.0
346,2016/01/27,1319.0,1323.966,1365.0,121400,1371.0,1287.0
347,2016/01/28,1318.0,1317.422,1328.0,44800,1335.0,1297.0
348,2016/01/29,1360.0,1342.399,1318.0,140800,1363.0,1296.0
349,2016/02/01,1411.0,1403.695,1384.0,176300,1420.0,1384.0
350,2016/02/02,1416.0,1407.974,1400.0,135900,1424.0,1383.0
351,2016/02/03,1560.0,1499.691,1406.0,898300,1590.0,1386.0
352,2016/02/04,1499.0,1511.93,1552.0,566700,1559.0,1465.0
353,2016/02/05,1399.0,1407.709,1450.0,254000,1470.0,1362.0
354,2016/02/08,1394.0,1375.557,1375.0,97000,1409.0,1350.0
355,2016/02/09,1234.0,1280.626,1350.0,208900,1373.0,1229.0
356,2016/02/10,1219.0,1195.787,1272.0,218700,1284.0,1145.0
357,2016/02/12,1185.0,1144.13,1100.0,270700,1250.0,1080.0
358,2016/02/15,1246.0,1246.451,1245.0,96600,1285.0,1219.0
359,2016/02/16,1276.0,1260.97,1251.0,199700,1297.0,1230.0
360,2016/02/17,1199.0,1212.959,1238.0,173300,1267.0,1174.0
361,2016/02/18,1225.0,1222.379,1237.0,123100,1247.0,1202.0
362,2016/02/19,1221.0,1205.922,1205.0,51300,1233.0,1187.0
363,2016/02/22,1275.0,1254.259,1202.0,72500,1282.0,1202.0
364,2016/02/23,1221.0,1246.345,1294.0,92300,1294.0,1215.0
365,2016/02/24,1215.0,1213.3,1212.0,62600,1251.0,1203.0
366,2016/02/25,1231.0,1224.301,1230.0,75800,1245.0,1201.0
367,2016/02/26,1231.0,1249.408,1250.0,45400,1266.0,1230.0
368,2016/02/29,1233.0,1248.246,1243.0,61000,1278.0,1233.0
369,2016/03/01,1245.0,1232.834,1238.0,39200,1248.0,1219.0
370,2016/03/02,1333.0,1293.286,1269.0,131000,1335.0,1255.0
371,2016/03/03,1329.0,1324.626,1318.0,87000,1337.0,1306.0
372,2016/03/04,1352.0,1329.087,1310.0,100100,1360.0,1292.0
373,2016/03/07,1394.0,1392.204,1380.0,166000,1404.0,1361.0
374,2016/03/08,1372.0,1353.378,1376.0,123100,1386.0,1324.0
375,2016/03/09,1333.0,1342.417,1331.0,46800,1355.0,1331.0
376,2016/03/10,1344.0,1351.21,1335.0,50900,1366.0,1335.0
377,2016/03/11,1361.0,1353.019,1345.0,47100,1361.0,1342.0
378,2016/03/14,1367.0,1376.607,1389.0,57300,1389.0,1362.0
379,2016/03/15,1374.0,1372.184,1367.0,54400,1384.0,1363.0
380,2016/03/16,1359.0,1368.941,1379.0,68100,1380.0,1350.0
381,2016/03/17,1341.0,1353.358,1350.0,88000,1367.0,1335.0
382,2016/03/18,1390.0,1368.957,1350.0,136300,1400.0,1325.0
383,2016/03/22,1398.0,1404.859,1400.0,154900,1422.0,1391.0
384,2016/03/23,1386.0,1394.071,1400.0,41000,1405.0,1382.0
385,2016/03/24,1394.0,1389.225,1380.0,49800,1402.0,1372.0
386,2016/03/25,1376.0,1382.51,1387.0,45100,1391.0,1374.0
387,2016/03/28,1372.0,1371.579,1372.0,41300,1381.0,1360.0
388,2016/03/29,1416.0,1400.576,1372.0,110200,1420.0,1372.0
389,2016/03/30,1411.0,1429.96,1440.0,148900,1447.0,1405.0
390,2016/03/31,1407.0,1411.142,1410.0,69200,1425.0,1407.0
391,2016/04/01,1371.0,1367.213,1407.0,110300,1412.0,1347.0
392,2016/04/04,1347.0,1356.111,1373.0,52500,1375.0,1334.0
393,2016/04/05,1261.0,1281.418,1345.0,134600,1345.0,1250.0
394,2016/04/06,1241.0,1239.595,1260.0,90100,1265.0,1223.0
395,2016/04/07,1215.0,1230.523,1240.0,77300,1260.0,1208.0
396,2016/04/08,1240.0,1228.463,1216.0,79000,1249.0,1205.0
397,2016/04/11,1230.0,1218.979,1225.0,62100,1234.0,1207.0
398,2016/04/12,1225.0,1224.469,1235.0,66100,1235.0,1215.0
399,2016/04/13,1257.0,1244.518,1230.0,62700,1265.0,1228.0
400,2016/04/14,1294.0,1294.289,1271.0,100100,1309.0,1271.0
401,2016/04/15,1292.0,1292.569,1300.0,85100,1303.0,1282.0
402,2016/04/18,1237.0,1255.29,1302.0,134300,1303.0,1230.0
403,2016/04/19,1230.0,1243.682,1257.0,130000,1261.0,1228.0
404,2016/04/20,1231.0,1237.026,1235.0,66100,1249.0,1231.0
405,2016/04/21,1274.0,1263.365,1257.0,93800,1279.0,1246.0
406,2016/04/22,1335.0,1297.716,1285.0,173400,1339.0,1256.0
407,2016/04/25,1372.0,1381.401,1365.0,200200,1409.0,1352.0
408,2016/04/26,1364.0,1351.173,1365.0,153500,1391.0,1302.0
409,2016/04/27,1357.0,1350.077,1348.0,53500,1370.0,1336.0
410,2016/04/28,1322.0,1339.324,1350.0,95000,1380.0,1305.0
411,2016/05/02,1299.0,1284.78,1265.0,99300,1320.0,1255.0
412,2016/05/06,1270.0,1276.462,1292.0,75600,1308.0,1260.0
413,2016/05/09,1319.0,1303.172,1270.0,107300,1338.0,1270.0
414,2016/05/10,1420.0,1390.178,1319.0,374300,1434.0,1319.0
415,2016/05/11,1401.0,1407.528,1402.0,83600,1422.0,1390.0
416,2016/05/12,1398.0,1388.48,1381.0,48500,1403.0,1375.0
417,2016/05/13,1373.0,1368.335,1390.0,84500,1395.0,1351.0
418,2016/05/16,1343.0,1366.426,1356.0,75800,1388.0,1341.0
419,2016/05/17,1350.0,1350.998,1345.0,40900,1364.0,1343.0
420,2016/05/18,1332.0,1337.449,1350.0,55000,1355.0,1325.0
421,2016/05/19,1340.0,1339.36,1334.0,26400,1350.0,1333.0
422,2016/05/20,1382.0,1367.731,1335.0,52700,1387.0,1332.0
423,2016/05/23,1391.0,1397.185,1400.0,73400,1418.0,1385.0
424,2016/05/24,1371.0,1376.736,1390.0,32900,1393.0,1363.0
425,2016/05/25,1352.0,1362.852,1372.0,43100,1385.0,1351.0
426,2016/05/26,1322.0,1337.28,1360.0,73300,1374.0,1320.0
427,2016/05/27,1348.0,1344.522,1325.0,43100,1358.0,1325.0
428,2016/05/30,1399.0,1379.719,1355.0,57700,1399.0,1354.0
429,2016/05/31,1387.0,1386.949,1395.0,25400,1396.0,1380.0
430,2016/06/01,1369.0,1381.605,1380.0,54700,1398.0,1359.0
431,2016/06/02,1368.0,1373.165,1365.0,43600,1393.0,1364.0
432,2016/06/03,1424.0,1404.451,1380.0,93800,1424.0,1380.0
433,2016/06/06,1414.0,1402.81,1395.0,52200,1420.0,1385.0
434,2016/06/07,1470.0,1456.201,1408.0,145600,1491.0,1408.0
435,2016/06/08,1466.0,1463.549,1470.0,73800,1477.0,1446.0
436,2016/06/09,1500.0,1499.42,1471.0,180900,1522.0,1464.0
437,2016/06/10,1530.0,1521.845,1505.0,102300,1537.0,1504.0
438,2016/06/13,1437.0,1464.217,1502.0,138000,1505.0,1433.0
439,2016/06/14,1417.0,1418.798,1431.0,126600,1477.0,1389.0
440,2016/06/15,1428.0,1412.774,1390.0,84900,1446.0,1385.0
441,2016/06/16,1351.0,1371.342,1400.0,167000,1416.0,1346.0
442,2016/06/17,1428.0,1409.791,1381.0,126600,1429.0,1363.0
443,2016/06/20,1417.0,1430.166,1428.0,98500,1463.0,1410.0
444,2016/06/21,1424.0,1422.739,1425.0,50200,1438.0,1412.0
445,2016/06/22,1398.0,1403.259,1429.0,100500,1431.0,1381.0
446,2016/06/23,1539.0,1511.854,1517.0,505700,1540.0,1487.0
447,2016/06/24,1405.0,1422.618,1526.0,367600,1527.0,1315.0
448,2016/06/27,1492.0,1458.128,1430.0,162900,1498.0,1418.0
449,2016/06/28,1570.0,1523.432,1488.0,241200,1584.0,1454.0
450,2016/06/29,1663.0,1621.536,1600.0,245700,1669.0,1564.0
451,2016/06/30,1716.0,1703.398,1685.0,347700,1723.0,1674.0
452,2016/07/01,1782.0,1745.493,1748.0,311700,1789.0,1687.0
453,2016/07/04,1837.0,1817.673,1782.0,220300,1850.0,1755.0
454,2016/07/05,1810.0,1821.088,1849.0,126300,1850.0,1790.0
455,2016/07/06,1817.0,1763.861,1770.0,194700,1818.0,1726.0
456,2016/07/07,1795.0,1826.868,1845.0,148700,1859.0,1788.0
457,2016/07/08,1704.0,1741.334,1780.0,221900,1795.0,1701.0
458,2016/07/11,1778.0,1774.748,1769.0,162900,1802.0,1740.0
459,2016/07/12,1748.0,1780.427,1810.0,133600,1839.0,1731.0
460,2016/07/13,1738.0,1727.148,1770.0,140400,1779.0,1710.0
461,2016/07/14,1744.0,1752.943,1700.0,97500,1794.0,1700.0
462,2016/07/15,1721.0,1723.664,1725.0,104600,1753.0,1704.0
463,2016/07/19,1753.0,1743.257,1720.0,87800,1772.0,1720.0
464,2016/07/20,1765.0,1751.305,1740.0,83200,1776.0,1712.0
465,2016/07/21,1668.0,1704.05,1785.0,202200,1785.0,1664.0
466,2016/07/22,1658.0,1655.82,1648.0,99200,1693.0,1635.0
467,2016/07/25,1595.0,1620.393,1664.0,122800,1664.0,1591.0
468,2016/07/26,1598.0,1599.438,1601.0,91300,1620.0,1570.0
469,2016/07/27,1597.0,1598.53,1598.0,109600,1623.0,1573.0
470,2016/07/28,1549.0,1562.126,1591.0,481800,1606.0,1534.0
471,2016/07/29,1566.0,1533.488,1541.0,211000,1570.0,1502.0
472,2016/08/01,1515.0,1531.141,1526.0,120700,1560.0,1511.0
473,2016/08/02,1490.0,1503.652,1508.0,117900,1525.0,1490.0
474,2016/08/03,1475.0,1474.078,1480.0,112800,1490.0,1455.0
475,2016/08/04,1363.0,1358.306,1415.0,423800,1420.0,1314.0
476,2016/08/05,1362.0,1373.701,1388.0,177700,1407.0,1350.0
477,2016/08/08,1340.0,1352.902,1392.0,159600,1395.0,1329.0
478,2016/08/09,1356.0,1352.393,1341.0,79200,1370.0,1334.0
479,2016/08/10,1358.0,1361.377,1360.0,65600,1380.0,1340.0
480,2016/08/12,1400.0,1389.179,1365.0,76100,1410.0,1363.0
481,2016/08/15,1388.0,1394.93,1415.0,64400,1418.0,1382.0
482,2016/08/16,1375.0,1378.57,1391.0,61600,1395.0,1363.0
483,2016/08/17,1354.0,1353.466,1364.0,77700,1375.0,1340.0
484,2016/08/18,1326.0,1334.069,1350.0,76400,1360.0,1320.0
485,2016/08/19,1339.0,1336.712,1345.0,56600,1354.0,1325.0
486,2016/08/22,1374.0,1355.495,1342.0,54700,1375.0,1332.0
487,2016/08/23,1407.0,1405.961,1380.0,106400,1428.0,1375.0
488,2016/08/24,1403.0,1402.971,1400.0,51500,1421.0,1390.0
489,2016/08/25,1406.0,1403.821,1417.0,57600,1420.0,1394.0
490,2016/08/26,1391.0,1395.05,1400.0,54400,1414.0,1386.0
491,2016/08/29,1431.0,1424.28,1410.0,83900,1435.0,1410.0
492,2016/08/30,1428.0,1436.464,1441.0,74200,1451.0,1417.0
493,2016/08/31,1411.0,1409.847,1430.0,65400,1438.0,1392.0
494,2016/09/01,1424.0,1423.404,1426.0,34700,1438.0,1415.0
495,2016/09/02,1408.0,1409.234,1418.0,27300,1418.0,1404.0
496,2016/09/05,1431.0,1432.274,1425.0,46400,1445.0,1419.0
497,2016/09/06,1474.0,1462.842,1436.0,56900,1479.0,1436.0
498,2016/09/07,1499.0,1492.17,1474.0,113600,1510.0,1463.0
499,2016/09/08,1493.0,1492.972,1505.0,56200,1508.0,1481.0
500,2016/09/09,1491.0,1485.896,1491.0,40300,1500.0,1471.0
501,2016/09/12,1476.0,1472.92,1479.0,46500,1490.0,1462.0
502,2016/09/13,1485.0,1485.473,1483.0,52900,1498.0,1476.0
503,2016/09/14,1467.0,1474.122,1475.0,35200,1489.0,1461.0
504,2016/09/15,1452.0,1455.061,1464.0,60900,1478.0,1442.0
505,2016/09/16,1479.0,1465.978,1445.0,64400,1479.0,1445.0
506,2016/09/20,1526.0,1509.177,1481.0,125600,1533.0,1474.0
507,2016/09/21,1552.0,1532.235,1521.0,97600,1552.0,1512.0
508,2016/09/23,1594.0,1589.534,1574.0,155400,1615.0,1560.0
509,2016/09/26,1618.0,1629.149,1624.0,126500,1644.0,1605.0
510,2016/09/27,1611.0,1601.416,1610.0,126600,1629.0,1585.0
511,2016/09/28,1658.0,1649.502,1610.0,166700,1678.0,1598.0
512,2016/09/29,1652.0,1657.702,1670.0,89000,1675.0,1639.0
513,2016/09/30,1637.0,1646.268,1643.0,57100,1659.0,1623.0
514,2016/10/03,1673.0,1665.942,1650.0,97500,1677.0,1650.0
515,2016/10/04,1678.0,1679.937,1675.0,107600,1695.0,1665.0
516,2016/10/05,1694.0,1689.528,1680.0,98000,1699.0,1669.0
517,2016/10/06,1684.0,1700.323,1680.0,172400,1729.0,1675.0
518,2016/10/07,1663.0,1663.668,1690.0,108600,1691.0,1642.0
519,2016/10/11,1676.0,1683.67,1688.0,97300,1694.0,1663.0
520,2016/10/12,1654.0,1660.211,1660.0,97700,1679.0,1644.0
521,2016/10/13,1645.0,1644.879,1648.0,105200,1670.0,1624.0
522,2016/10/14,1647.0,1641.227,1630.0,47100,1653.0,1630.0
523,2016/10/17,1666.0,1646.014,1650.0,106200,1673.0,1627.0
524,2016/10/18,1656.0,1652.946,1666.0,77300,1672.0,1646.0
525,2016/10/19,1639.0,1640.165,1661.0,117800,1666.0,1628.0
526,2016/10/20,1634.0,1634.632,1636.0,112500,1655.0,1620.0
527,2016/10/21,1619.0,1625.67,1635.0,84300,1654.0,1613.0
528,2016/10/24,1625.0,1623.948,1623.0,45700,1632.0,1611.0
529,2016/10/25,1604.0,1608.584,1617.0,70600,1627.0,1596.0
530,2016/10/26,1644.0,1625.521,1605.0,95400,1647.0,1594.0
531,2016/10/27,1627.0,1630.161,1644.0,69100,1652.0,1614.0
532,2016/10/28,1616.0,1609.435,1615.0,93200,1625.0,1604.0
533,2016/10/31,1624.0,1614.872,1619.0,72100,1627.0,1605.0
534,2016/11/01,1616.0,1619.057,1624.0,57800,1633.0,1612.0
535,2016/11/02,1585.0,1598.964,1608.0,127300,1616.0,1580.0
536,2016/11/04,1551.0,1554.675,1570.0,73500,1572.0,1543.0
537,2016/11/07,1583.0,1571.626,1540.0,58500,1598.0,1540.0
538,2016/11/08,1675.0,1690.142,1658.0,442300,1725.0,1652.0
539,2016/11/09,1580.0,1602.734,1676.0,329700,1687.0,1540.0
540,2016/11/10,1700.0,1687.03,1680.0,287600,1704.0,1655.0
541,2016/11/11,1719.0,1709.913,1715.0,142300,1724.0,1681.0
542,2016/11/14,1768.0,1762.661,1739.0,193800,1780.0,1738.0
543,2016/11/15,1734.0,1731.118,1762.0,152400,1762.0,1708.0
544,2016/11/16,1763.0,1758.719,1750.0,122900,1769.0,1749.0
545,2016/11/17,1778.0,1773.993,1747.0,134700,1785.0,1747.0
546,2016/11/18,1774.0,1780.762,1790.0,89200,1792.0,1770.0
547,2016/11/21,1775.0,1778.571,1775.0,114400,1790.0,1773.0
548,2016/11/22,1776.0,1773.223,1765.0,92100,1785.0,1750.0
549,2016/11/24,1786.0,1796.004,1799.0,141000,1806.0,1785.0
550,2016/11/25,1755.0,1764.273,1790.0,141100,1795.0,1735.0
551,2016/11/28,1808.0,1790.961,1756.0,236600,1811.0,1744.0
552,2016/11/29,1855.0,1848.656,1805.0,226700,1882.0,1802.0
553,2016/11/30,1883.0,1874.645,1860.0,175700,1890.0,1855.0
554,2016/12/01,1954.0,1934.322,1890.0,351400,1970.0,1889.0
555,2016/12/02,2023.0,1989.036,1954.0,300800,2034.0,1930.0
556,2016/12/05,2096.0,2074.281,2034.0,340700,2101.0,2011.0
557,2016/12/06,2080.0,2088.382,2105.0,222400,2133.0,2051.0
558,2016/12/07,2106.0,2067.903,2071.0,251800,2115.0,2001.0
559,2016/12/08,2118.0,2121.917,2110.0,166800,2149.0,2092.0
560,2016/12/09,2140.0,2114.687,2080.0,134700,2141.0,2075.0
561,2016/12/12,2167.0,2165.323,2150.0,151500,2188.0,2135.0
562,2016/12/13,2247.0,2216.348,2160.0,266900,2255.0,2141.0
563,2016/12/14,2254.0,2249.678,2250.0,267300,2286.0,2220.0
564,2016/12/15,2236.0,2237.395,2254.0,126500,2270.0,2210.0
565,2016/12/16,2161.0,2190.667,2240.0,202800,2248.0,2161.0
566,2016/12/19,2160.0,2119.269,2111.0,349300,2180.0,2050.0
567,2016/12/20,2219.0,2198.333,2159.0,136900,2235.0,2145.0
568,2016/12/21,2190.0,2211.094,2236.0,136900,2237.0,2177.0
569,2016/12/22,2184.0,2176.646,2171.0,70100,2189.0,2162.0
570,2016/12/26,2186.0,2191.303,2175.0,110400,2214.0,2174.0
571,2016/12/27,2179.0,2188.303,2185.0,250500,2233.0,2166.0
572,2016/12/28,2117.0,2111.554,2087.0,152800,2138.0,2062.0
573,2016/12/29,2082.0,2073.652,2088.0,139200,2100.0,2040.0
574,2016/12/30,2054.0,2043.652,2032.0,122200,2066.0,2023.0
575,2017/01/04,2189.0,2161.71,2097.0,320400,2196.0,2091.0
576,2017/01/05,2142.0,2154.341,2193.0,110100,2193.0,2132.0
577,2017/01/06,2165.0,2161.551,2140.0,107300,2180.0,2137.0
578,2017/01/10,2119.0,2130.606,2169.0,88500,2169.0,2085.0
579,2017/01/11,2099.0,2091.482,2101.0,84300,2107.0,2074.0
580,2017/01/12,2072.0,2075.68,2109.0,54600,2115.0,2058.0
581,2017/01/13,2108.0,2089.826,2050.0,82300,2118.0,2050.0
582,2017/01/16,2100.0,2102.832,2105.0,38000,2124.0,2083.0
583,2017/01/17,2032.0,2049.002,2077.0,58700,2085.0,2022.0
584,2017/01/18,2024.0,1997.427,2000.0,80400,2032.0,1971.0
585,2017/01/19,2024.0,2036.72,2042.0,50700,2055.0,2014.0
586,2017/01/20,2057.0,2044.67,2043.0,40300,2058.0,2022.0
587,2017/01/23,2017.0,2016.842,2020.0,58200,2030.0,1999.0
588,2017/01/24,2000.0,2003.313,2013.0,37700,2027.0,1996.0
589,2017/01/25,2028.0,2010.942,2012.0,90700,2035.0,1982.0
590,2017/01/26,2047.0,2043.634,2072.0,66200,2072.0,2022.0
591,2017/01/27,2067.0,2050.458,2050.0,51500,2069.0,2026.0
592,2017/01/30,2094.0,2075.734,2062.0,46200,2100.0,2050.0
593,2017/01/31,2050.0,2056.693,2065.0,49200,2080.0,2038.0
594,2017/02/01,2057.0,2031.18,2035.0,50700,2059.0,2004.0
595,2017/02/02,2033.0,2041.854,2039.0,39100,2060.0,2027.0
596,2017/02/03,2044.0,2026.389,2020.0,70400,2051.0,2001.0
597,2017/02/06,2007.0,2018.515,2035.0,42500,2048.0,2005.0
598,2017/02/07,2000.0,2002.876,2007.0,38700,2012.0,1995.0
599,2017/02/08,2037.0,2019.089,2015.0,46100,2053.0,1991.0
600,2017/02/09,1996.0,2005.285,2049.0,38600,2049.0,1994.0
601,2017/02/10,2075.0,2054.774,2002.0,112900,2095.0,1996.0
602,2017/02/13,2137.0,2122.879,2100.0,134000,2144.0,2100.0
603,2017/02/14,1835.0,1866.244,1907.0,604700,1921.0,1835.0
604,2017/02/15,1893.0,1873.833,1860.0,237200,1893.0,1858.0
605,2017/02/16,1856.0,1868.297,1895.0,130900,1897.0,1844.0
606,2017/02/17,1901.0,1890.339,1868.0,127000,1925.0,1857.0
607,2017/02/20,1930.0,1920.131,1915.0,78900,1935.0,1897.0
608,2017/02/21,1941.0,1944.594,1933.0,106700,1965.0,1928.0
609,2017/02/22,1931.0,1931.589,1962.0,78400,1962.0,1912.0
610,2017/02/23,1983.0,1965.259,1950.0,126500,1983.0,1938.0
611,2017/02/24,2040.0,2005.962,1990.0,167200,2045.0,1965.0
612,2017/02/27,1988.0,2001.746,2040.0,117400,2045.0,1974.0
613,2017/02/28,2050.0,2032.066,2012.0,140100,2058.0,1989.0
614,2017/03/01,2025.0,2014.864,2032.0,107500,2042.0,1992.0
615,2017/03/02,2017.0,2028.547,2045.0,86300,2048.0,2014.0
616,2017/03/03,2018.0,2021.009,2022.0,55400,2039.0,2009.0
617,2017/03/06,2074.0,2056.408,2032.0,105300,2074.0,2026.0
618,2017/03/07,2061.0,2072.738,2074.0,87500,2098.0,2051.0
619,2017/03/08,2042.0,2045.568,2080.0,54100,2080.0,2030.0
620,2017/03/09,2087.0,2070.465,2049.0,97200,2090.0,2038.0
621,2017/03/10,2121.0,2114.909,2095.0,129000,2136.0,2076.0
622,2017/03/13,2113.0,2114.953,2120.0,74700,2133.0,2091.0
623,2017/03/14,2167.0,2150.415,2097.0,121100,2187.0,2071.0
624,2017/03/15,2165.0,2158.695,2160.0,71200,2177.0,2131.0
625,2017/03/16,2270.0,2236.142,2165.0,224900,2273.0,2148.0
626,2017/03/17,2249.0,2257.409,2258.0,139300,2295.0,2217.0
627,2017/03/21,2235.0,2245.724,2255.0,59400,2260.0,2235.0
628,2017/03/22,2212.0,2203.07,2187.0,82000,2220.0,2128.0
629,2017/03/23,2193.0,2202.862,2220.0,53700,2228.0,2183.0
630,2017/03/24,2177.0,2183.052,2178.0,76700,2204.0,2161.0
631,2017/03/27,2144.0,2141.029,2170.0,59000,2177.0,2118.0
632,2017/03/28,2220.0,2194.146,2161.0,69300,2220.0,2144.0
633,2017/03/29,2242.0,2228.357,2222.0,38100,2244.0,2196.0
634,2017/03/30,2211.0,2242.255,2241.0,82300,2267.0,2210.0
635,2017/03/31,2330.0,2331.396,2248.0,209600,2374.0,2231.0
636,2017/04/03,2267.0,2249.493,2309.0,245500,2317.0,2204.0
637,2017/04/04,2186.0,2217.254,2248.0,112300,2299.0,2173.0
638,2017/04/05,2155.0,2161.74,2165.0,75700,2214.0,2128.0
639,2017/04/06,2074.0,2080.523,2145.0,107400,2151.0,2040.0
640,2017/04/07,2071.0,2069.774,2070.0,99500,2100.0,2037.0
641,2017/04/10,2076.0,2078.958,2083.0,64100,2106.0,2059.0
642,2017/04/11,2022.0,2026.823,2076.0,69000,2091.0,1990.0
643,2017/04/12,1974.0,1981.082,1999.0,88700,2011.0,1955.0
644,2017/04/13,1960.0,1951.731,1936.0,58400,1969.0,1925.0
645,2017/04/14,1902.0,1925.314,1960.0,49300,1961.0,1901.0
646,2017/04/17,1952.0,1932.426,1888.0,51900,1955.0,1881.0
647,2017/04/18,1970.0,1968.386,1992.0,64800,2003.0,1941.0
648,2017/04/19,1986.0,1995.026,1986.0,58000,2018.0,1978.0
649,2017/04/20,1969.0,1981.074,2004.0,32600,2004.0,1969.0
650,2017/04/21,2005.0,1990.472,1990.0,36000,2006.0,1974.0
651,2017/04/24,2024.0,2015.925,2009.0,54800,2045.0,1997.0
652,2017/04/25,2049.0,2039.995,2035.0,39100,2059.0,2015.0
653,2017/04/26,2072.0,2075.528,2065.0,50600,2091.0,2065.0
654,2017/04/27,2060.0,2070.636,2090.0,130800,2094.0,2060.0
655,2017/04/28,2109.0,2111.42,2098.0,86000,2130.0,2088.0
656,2017/05/01,2128.0,2125.147,2105.0,47100,2142.0,2104.0
657,2017/05/02,2161.0,2159.154,2140.0,87600,2180.0,2121.0
658,2017/05/08,2198.0,2184.189,2200.0,133600,2207.0,2142.0
659,2017/05/09,2380.0,2358.309,2238.0,378500,2405.0,2235.0
660,2017/05/10,2486.0,2452.255,2380.0,262100,2514.0,2370.0
661,2017/05/11,2429.0,2437.974,2479.0,105000,2489.0,2403.0
662,2017/05/12,2454.0,2431.732,2403.0,64100,2457.0,2393.0
663,2017/05/15,2479.0,2479.735,2414.0,106600,2515.0,2405.0
664,2017/05/16,2481.0,2490.248,2496.0,71500,2519.0,2452.0
665,2017/05/17,2535.0,2565.49,2490.0,219800,2624.0,2490.0
666,2017/05/18,2506.0,2487.953,2459.0,105100,2525.0,2440.0
667,2017/05/19,2522.0,2539.993,2541.0,70600,2563.0,2506.0
668,2017/05/22,2562.0,2568.01,2577.0,61100,2584.0,2540.0
669,2017/05/23,2597.0,2598.79,2572.0,91400,2622.0,2568.0
670,2017/05/24,2656.0,2644.122,2620.0,81800,2671.0,2604.0
671,2017/05/25,2660.0,2672.58,2670.0,90700,2717.0,2618.0
672,2017/05/26,2570.0,2606.226,2654.0,111700,2672.0,2562.0
673,2017/05/29,2546.0,2567.857,2568.0,91000,2599.0,2540.0
674,2017/05/30,2578.0,2566.253,2532.0,57000,2595.0,2531.0
675,2017/05/31,2561.0,2564.583,2562.0,32600,2583.0,2548.0
676,2017/06/01,2545.0,2560.464,2561.0,50900,2594.0,2535.0
677,2017/06/02,2511.0,2536.941,2560.0,68000,2565.0,2510.0
678,2017/06/05,2537.0,2529.663,2490.0,59900,2554.0,2490.0
679,2017/06/06,2468.0,2483.26,2541.0,79100,2541.0,2456.0
680,2017/06/07,2443.0,2449.587,2455.0,79800,2480.0,2421.0
681,2017/06/08,2489.0,2486.055,2469.0,78900,2518.0,2430.0
682,2017/06/09,2449.0,2472.738,2500.0,48100,2510.0,2442.0
683,2017/06/12,2413.0,2407.573,2440.0,92700,2440.0,2386.0
684,2017/06/13,2400.0,2407.647,2423.0,61800,2433.0,2384.0
685,2017/06/14,2341.0,2364.393,2412.0,41000,2412.0,2336.0
686,2017/06/15,2343.0,2352.493,2353.0,45600,2377.0,2339.0
687,2017/06/16,2364.0,2368.159,2388.0,45400,2396.0,2354.0
688,2017/06/19,2459.0,2435.573,2383.0,95000,2462.0,2383.0
689,2017/06/20,2514.0,2512.323,2497.0,115800,2539.0,2479.0
690,2017/06/21,2462.0,2485.642,2537.0,53000,2537.0,2454.0
691,2017/06/22,2490.0,2478.065,2499.0,93500,2526.0,2430.0
692,2017/06/23,2470.0,2466.347,2515.0,76900,2515.0,2420.0
693,2017/06/26,2484.0,2486.454,2460.0,40500,2505.0,2460.0
694,2017/06/27,2569.0,2539.761,2484.0,131000,2571.0,2463.0
695,2017/06/28,2544.0,2552.756,2569.0,95400,2605.0,2522.0
696,2017/06/29,2589.0,2585.542,2545.0,113200,2626.0,2505.0
697,2017/06/30,2620.0,2590.108,2585.0,94400,2625.0,2538.0
698,2017/07/03,2679.0,2652.59,2607.0,118600,2680.0,2607.0
699,2017/07/04,2661.0,2687.017,2689.0,127000,2728.0,2648.0
700,2017/07/05,2711.0,2683.248,2672.0,71400,2711.0,2638.0
701,2017/07/06,2737.0,2732.745,2727.0,93000,2760.0,2688.0
702,2017/07/07,2671.0,2671.104,2706.0,70400,2709.0,2627.0
703,2017/07/10,2691.0,2695.81,2665.0,64300,2732.0,2639.0
704,2017/07/11,2700.0,2704.634,2699.0,76400,2722.0,2670.0
705,2017/07/12,2666.0,2679.424,2700.0,68000,2719.0,2646.0
706,2017/07/13,2641.0,2651.362,2652.0,51900,2677.0,2639.0
707,2017/07/14,2676.0,2662.509,2622.0,43200,2687.0,2621.0
708,2017/07/18,2667.0,2669.198,2692.0,25800,2692.0,2657.0
709,2017/07/19,2688.0,2690.209,2670.0,28200,2705.0,2666.0
710,2017/07/20,2669.0,2676.964,2702.0,30700,2702.0,2658.0
711,2017/07/21,2661.0,2646.505,2654.0,31900,2664.0,2616.0
712,2017/07/24,2660.0,2636.523,2661.0,46700,2665.0,2607.0
713,2017/07/25,2672.0,2663.456,2660.0,32700,2679.0,2639.0
714,2017/07/26,2666.0,2668.301,2691.0,33600,2702.0,2638.0
715,2017/07/27,2734.0,2707.012,2670.0,113000,2742.0,2637.0
716,2017/07/28,2763.0,2780.089,2750.0,126700,2843.0,2722.0
717,2017/07/31,2686.0,2727.583,2764.0,97000,2800.0,2669.0
718,2017/08/01,2637.0,2630.889,2693.0,92100,2704.0,2575.0
719,2017/08/02,2640.0,2638.992,2645.0,39300,2667.0,2623.0
720,2017/08/03,2663.0,2635.076,2640.0,56300,2668.0,2592.0
721,2017/08/04,2669.0,2675.854,2625.0,94900,2737.0,2595.0
722,2017/08/07,2729.0,2699.695,2705.0,87300,2735.0,2653.0
723,2017/08/08,3070.0,3037.95,2950.0,474100,3115.0,2950.0
724,2017/08/09,3170.0,3121.689,3095.0,294800,3215.0,3060.0
725,2017/08/10,3205.0,3256.542,3180.0,235800,3325.0,3160.0
726,2017/08/14,3250.0,3246.273,3140.0,137900,3300.0,3125.0
727,2017/08/15,3280.0,3287.457,3260.0,87500,3345.0,3260.0
728,2017/08/16,3350.0,3349.419,3280.0,95500,3400.0,3270.0
729,2017/08/17,3280.0,3315.452,3385.0,127300,3395.0,3270.0
730,2017/08/18,3180.0,3196.571,3245.0,150500,3290.0,3140.0
731,2017/08/21,3285.0,3299.107,3250.0,109200,3345.0,3240.0
732,2017/08/22,3345.0,3323.962,3255.0,96800,3355.0,3255.0
733,2017/08/23,3520.0,3481.812,3405.0,166700,3525.0,3405.0
734,2017/08/24,3360.0,3415.848,3555.0,134400,3555.0,3340.0
735,2017/08/25,3415.0,3396.23,3395.0,100400,3470.0,3350.0
736,2017/08/28,3415.0,3415.511,3465.0,70400,3465.0,3385.0
737,2017/08/29,3490.0,3435.469,3380.0,86400,3500.0,3340.0
738,2017/08/30,3500.0,3451.603,3475.0,73600,3500.0,3375.0
739,2017/08/31,3520.0,3523.715,3475.0,130300,3575.0,3465.0
740,2017/09/01,3595.0,3571.599,3530.0,103200,3615.0,3505.0
741,2017/09/04,3535.0,3552.363,3560.0,78500,3605.0,3505.0
742,2017/09/05,3335.0,3372.925,3510.0,111300,3515.0,3275.0
743,2017/09/06,3450.0,3368.751,3270.0,134100,3460.0,3225.0
744,2017/09/07,3460.0,3445.196,3475.0,71600,3520.0,3380.0
745,2017/09/08,3420.0,3432.765,3460.0,34000,3490.0,3390.0
746,2017/09/11,3450.0,3466.422,3450.0,43600,3525.0,3425.0
747,2017/09/12,3510.0,3489.751,3495.0,42200,3520.0,3440.0
748,2017/09/13,3460.0,3468.144,3525.0,67900,3525.0,3445.0
749,2017/09/14,3375.0,3386.852,3440.0,94200,3450.0,3340.0
750,2017/09/15,3470.0,3428.078,3375.0,65300,3470.0,3360.0
751,2017/09/19,3400.0,3428.048,3495.0,62500,3500.0,3380.0
752,2017/09/20,3350.0,3381.975,3420.0,47600,3425.0,3335.0
753,2017/09/21,3280.0,3268.983,3335.0,102300,3345.0,3225.0
754,2017/09/22,3210.0,3230.061,3275.0,65500,3320.0,3180.0
755,2017/09/25,3330.0,3301.275,3220.0,74500,3335.0,3220.0
756,2017/09/26,3340.0,3311.461,3325.0,38000,3340.0,3265.0
757,2017/09/27,3350.0,3353.189,3325.0,26500,3380.0,3310.0
758,2017/09/28,3395.0,3389.792,3380.0,36000,3415.0,3345.0
759,2017/09/29,3420.0,3445.59,3410.0,85600,3485.0,3395.0
760,2017/10/02,3450.0,3478.978,3490.0,72900,3520.0,3425.0
761,2017/10/03,3465.0,3466.22,3510.0,66800,3510.0,3430.0
762,2017/10/04,3415.0,3380.728,3460.0,107900,3460.0,3320.0
763,2017/10/05,3320.0,3339.494,3395.0,53400,3410.0,3305.0
764,2017/10/06,3370.0,3338.677,3300.0,44600,3375.0,3285.0
765,2017/10/10,3435.0,3397.681,3370.0,80200,3450.0,3335.0
766,2017/10/11,3375.0,3393.472,3455.0,37300,3470.0,3360.0
767,2017/10/12,3325.0,3352.805,3420.0,58300,3420.0,3320.0
768,2017/10/13,3320.0,3272.382,3325.0,90900,3330.0,3230.0
769,2017/10/16,3335.0,3311.227,3315.0,70100,3345.0,3245.0
770,2017/10/17,3345.0,3341.281,3300.0,49200,3365.0,3290.0
771,2017/10/18,3445.0,3418.002,3360.0,102100,3455.0,3345.0
772,2017/10/19,3400.0,3402.99,3445.0,41300,3445.0,3370.0
773,2017/10/20,3345.0,3314.037,3375.0,98100,3375.0,3260.0
774,2017/10/23,3410.0,3383.059,3370.0,37600,3410.0,3345.0
775,2017/10/24,3520.0,3520.961,3435.0,104600,3565.0,3435.0
776,2017/10/25,3430.0,3456.004,3510.0,51300,3510.0,3420.0
777,2017/10/26,3480.0,3463.733,3430.0,35900,3505.0,3395.0
778,2017/10/27,3565.0,3571.368,3510.0,80800,3615.0,3510.0
779,2017/10/30,3610.0,3586.266,3600.0,61600,3610.0,3525.0
780,2017/10/31,3635.0,3622.59,3625.0,41700,3670.0,3590.0
781,2017/11/01,3650.0,3620.357,3640.0,43400,3660.0,3565.0
782,2017/11/02,3630.0,3624.183,3645.0,39800,3655.0,3590.0
783,2017/11/06,3595.0,3601.406,3660.0,66500,3660.0,3575.0
784,2017/11/07,3060.0,3012.316,3035.0,589500,3080.0,2931.0
785,2017/11/08,2792.0,2850.319,3020.0,791700,3035.0,2773.0
786,2017/11/09,2772.0,2794.283,2802.0,416200,2840.0,2744.0
787,2017/11/10,2850.0,2826.503,2774.0,328800,2867.0,2743.0
788,2017/11/13,2778.0,2773.932,2850.0,200200,2850.0,2721.0
789,2017/11/14,2732.0,2755.111,2785.0,195200,2800.0,2720.0
790,2017/11/15,2704.0,2702.908,2735.0,167500,2752.0,2673.0
791,2017/11/16,2852.0,2808.837,2673.0,251200,2862.0,2670.0
792,2017/11/17,2769.0,2776.967,2852.0,172000,2861.0,2745.0
793,2017/11/20,2782.0,2775.887,2756.0,98900,2805.0,2750.0
794,2017/11/21,2787.0,2775.011,2785.0,97800,2808.0,2731.0
795,2017/11/22,2838.0,2856.784,2821.0,175400,2902.0,2802.0
796,2017/11/24,2863.0,2841.932,2838.0,111800,2868.0,2806.0
797,2017/11/27,2901.0,2889.402,2890.0,123900,2918.0,2861.0
798,2017/11/28,2895.0,2881.475,2918.0,106700,2918.0,2841.0
799,2017/11/29,2904.0,2885.083,2895.0,87600,2907.0,2862.0
800,2017/11/30,2904.0,2884.511,2887.0,224600,2913.0,2830.0
801,2017/12/01,2962.0,2983.313,2913.0,232900,3040.0,2905.0
802,2017/12/04,2886.0,2938.618,2963.0,143800,3010.0,2883.0
803,2017/12/05,2957.0,2926.961,2884.0,124200,2963.0,2868.0
804,2017/12/06,2953.0,2944.996,2980.0,109100,2991.0,2902.0
805,2017/12/07,3030.0,3009.395,2953.0,139100,3030.0,2953.0
806,2017/12/08,3040.0,3040.639,3025.0,101800,3090.0,3005.0
807,2017/12/11,3095.0,3127.773,3070.0,174900,3185.0,3070.0
808,2017/12/12,3175.0,3179.298,3125.0,167400,3230.0,3125.0
809,2017/12/13,3160.0,3151.346,3170.0,62400,3175.0,3125.0
810,2017/12/14,3290.0,3243.428,3170.0,163800,3295.0,3135.0
811,2017/12/15,3310.0,3292.852,3320.0,118500,3345.0,3250.0
812,2017/12/18,3425.0,3400.91,3355.0,166000,3440.0,3350.0
813,2017/12/19,3555.0,3522.537,3470.0,213800,3565.0,3460.0
814,2017/12/20,3450.0,3475.175,3550.0,114100,3550.0,3430.0
815,2017/12/21,3515.0,3496.685,3430.0,92300,3545.0,3425.0
816,2017/12/22,3540.0,3537.905,3515.0,67300,3560.0,3495.0
817,2017/12/25,3600.0,3573.111,3555.0,85500,3605.0,3535.0
818,2017/12/26,3655.0,3637.583,3620.0,135900,3690.0,3590.0
819,2017/12/27,3610.0,3603.464,3600.0,109400,3645.0,3575.0
820,2017/12/28,3665.0,3695.563,3630.0,104800,3750.0,3630.0
821,2017/12/29,3585.0,3623.308,3670.0,120300,3710.0,3550.0
822,2018/01/04,3515.0,3523.189,3620.0,145200,3620.0,3470.0
823,2018/01/05,3425.0,3458.907,3515.0,74100,3545.0,3390.0
824,2018/01/09,3375.0,3382.41,3405.0,117200,3430.0,3335.0
825,2018/01/10,3300.0,3317.316,3375.0,119400,3375.0,3285.0
826,2018/01/11,3290.0,3278.123,3280.0,83900,3335.0,3245.0
827,2018/01/12,3400.0,3382.38,3300.0,125200,3430.0,3300.0
828,2018/01/15,3470.0,3444.892,3405.0,69600,3495.0,3380.0
829,2018/01/16,3535.0,3525.275,3480.0,61800,3550.0,3475.0
830,2018/01/17,3515.0,3523.199,3535.0,59400,3560.0,3480.0
831,2018/01/18,3535.0,3550.944,3535.0,65700,3595.0,3510.0
832,2018/01/19,3750.0,3667.434,3540.0,129600,3750.0,3535.0
833,2018/01/22,3730.0,3743.083,3770.0,112400,3815.0,3685.0
834,2018/01/23,3815.0,3775.893,3725.0,64400,3815.0,3710.0
835,2018/01/24,3920.0,3895.697,3810.0,124900,3950.0,3790.0
836,2018/01/25,3850.0,3863.606,3870.0,52000,3905.0,3805.0
837,2018/01/26,3810.0,3852.202,3855.0,80600,3910.0,3805.0
838,2018/01/29,3835.0,3881.459,3850.0,75400,3930.0,3835.0
839,2018/01/30,3725.0,3765.473,3835.0,91000,3850.0,3710.0
840,2018/01/31,3680.0,3715.834,3725.0,75500,3765.0,3670.0
841,2018/02/01,3740.0,3737.17,3720.0,68200,3760.0,3685.0
842,2018/02/02,3710.0,3698.949,3735.0,70900,3750.0,3640.0
843,2018/02/05,3600.0,3603.477,3620.0,90300,3685.0,3555.0
844,2018/02/06,3325.0,3352.315,3460.0,139500,3495.0,3195.0
845,2018/02/07,3345.0,3446.278,3480.0,106400,3555.0,3330.0
846,2018/02/08,3295.0,3330.901,3350.0,148200,3410.0,3275.0
847,2018/02/09,3225.0,3156.431,3055.0,157900,3235.0,3015.0
848,2018/02/13,3225.0,3255.876,3310.0,111900,3330.0,3185.0
849,2018/02/14,3525.0,3334.367,3225.0,432700,3560.0,3120.0
850,2018/02/15,3500.0,3431.763,3535.0,259800,3550.0,3275.0
851,2018/02/16,3760.0,3739.29,3570.0,176800,3870.0,3525.0
852,2018/02/19,4000.0,3917.765,3830.0,148100,4000.0,3800.0
853,2018/02/20,3970.0,3992.469,3980.0,179400,4075.0,3930.0
854,2018/02/21,3905.0,3947.118,4000.0,217200,4025.0,3790.0
855,2018/02/22,3745.0,3804.478,3905.0,216400,3905.0,3725.0
856,2018/02/23,3880.0,3857.619,3755.0,132700,3945.0,3755.0
857,2018/02/26,3985.0,3989.11,3950.0,100500,4040.0,3895.0
858,2018/02/27,3920.0,3920.949,4000.0,54800,4005.0,3865.0
859,2018/02/28,4310.0,4234.841,3990.0,348500,4370.0,3920.0
860,2018/03/01,4350.0,4340.401,4315.0,166000,4405.0,4260.0
861,2018/03/02,4455.0,4429.66,4310.0,205800,4515.0,4270.0
862,2018/03/05,4315.0,4339.251,4460.0,110800,4475.0,4255.0
863,2018/03/06,4335.0,4363.885,4390.0,88800,4435.0,4300.0
864,2018/03/07,4430.0,4444.52,4315.0,86500,4515.0,4315.0
865,2018/03/08,4560.0,4547.133,4500.0,113200,4615.0,4445.0
866,2018/03/09,4575.0,4551.783,4570.0,106000,4610.0,4475.0
867,2018/03/12,4590.0,4586.023,4645.0,70900,4665.0,4520.0
868,2018/03/13,4590.0,4588.923,4565.0,99800,4640.0,4550.0
869,2018/03/14,4450.0,4470.785,4520.0,94900,4555.0,4410.0
870,2018/03/15,4350.0,4334.873,4400.0,169800,4400.0,4295.0
871,2018/03/16,4300.0,4313.807,4350.0,269100,4420.0,4280.0
872,2018/03/19,4265.0,4294.22,4295.0,66700,4415.0,4215.0
873,2018/03/20,4380.0,4338.556,4195.0,101800,4405.0,4155.0
874,2018/03/22,4445.0,4443.135,4360.0,81500,4540.0,4360.0
875,2018/03/23,4310.0,4294.462,4275.0,60400,4335.0,4240.0
876,2018/03/26,4330.0,4254.45,4265.0,53600,4350.0,4120.0
877,2018/03/27,4325.0,4365.582,4405.0,54100,4465.0,4305.0
878,2018/03/28,4320.0,4324.191,4315.0,38300,4420.0,4260.0
879,2018/03/29,4580.0,4539.005,4390.0,86400,4645.0,4390.0
880,2018/03/30,4560.0,4558.294,4615.0,54800,4635.0,4515.0
881,2018/04/02,4675.0,4660.818,4640.0,58100,4715.0,4605.0
882,2018/04/03,4770.0,4707.55,4640.0,69600,4780.0,4565.0
883,2018/04/04,4810.0,4777.814,4800.0,68400,4855.0,4690.0
884,2018/04/05,4740.0,4757.401,4855.0,63300,4855.0,4710.0
885,2018/04/06,4860.0,4875.078,4735.0,96800,4950.0,4720.0
886,2018/04/09,4825.0,4837.116,4840.0,42300,4900.0,4785.0
887,2018/04/10,4735.0,4767.601,4840.0,59200,4845.0,4710.0
888,2018/04/11,4510.0,4567.148,4700.0,84500,4700.0,4480.0
889,2018/04/12,4490.0,4509.178,4530.0,66300,4615.0,4460.0
890,2018/04/13,4440.0,4445.294,4515.0,74900,4515.0,4380.0
891,2018/04/16,4290.0,4320.404,4410.0,90400,4415.0,4270.0
892,2018/04/17,4330.0,4292.704,4290.0,93000,4380.0,4210.0
893,2018/04/18,4345.0,4384.9,4325.0,49800,4445.0,4325.0
894,2018/04/19,4255.0,4266.66,4375.0,53000,4375.0,4230.0
895,2018/04/20,4310.0,4317.165,4220.0,29100,4355.0,4220.0
896,2018/04/23,4220.0,4224.161,4285.0,54200,4285.0,4175.0
897,2018/04/24,4110.0,4149.62,4265.0,119700,4285.0,4100.0
898,2018/04/25,3950.0,3986.621,4015.0,120600,4045.0,3940.0
899,2018/04/26,4005.0,3997.327,4015.0,69400,4075.0,3940.0
900,2018/04/27,3980.0,3963.674,4000.0,61100,4040.0,3925.0
901,2018/05/01,3925.0,3931.97,3970.0,62700,4005.0,3865.0
902,2018/05/02,3980.0,3966.852,3935.0,57500,4040.0,3915.0
903,2018/05/07,4030.0,4048.876,3980.0,155200,4135.0,3945.0
904,2018/05/08,4005.0,3871.333,3630.0,308700,4015.0,3610.0
905,2018/05/09,3645.0,3707.767,3930.0,208200,3955.0,3645.0
906,2018/05/10,3620.0,3631.764,3645.0,97800,3695.0,3590.0
907,2018/05/11,3765.0,3773.036,3640.0,130100,3825.0,3640.0
908,2018/05/14,3785.0,3798.872,3765.0,92200,3845.0,3745.0
909,2018/05/15,3715.0,3731.521,3780.0,47000,3815.0,3680.0
910,2018/05/16,3690.0,3688.554,3705.0,48400,3735.0,3655.0
911,2018/05/17,3680.0,3669.937,3685.0,31500,3700.0,3640.0
912,2018/05/18,3700.0,3693.268,3680.0,33200,3730.0,3660.0
913,2018/05/21,3770.0,3768.338,3735.0,36700,3810.0,3700.0
914,2018/05/22,3715.0,3737.491,3770.0,58400,3825.0,3680.0
915,2018/05/23,3785.0,3749.987,3680.0,38300,3790.0,3680.0
916,2018/05/24,3790.0,3774.512,3830.0,62500,3830.0,3710.0
917,2018/05/25,3675.0,3698.671,3770.0,58300,3770.0,3675.0
918,2018/05/28,3750.0,3755.192,3695.0,36500,3800.0,3685.0
919,2018/05/29,3640.0,3633.248,3725.0,81600,3725.0,3590.0
920,2018/05/30,3635.0,3623.853,3575.0,26600,3665.0,3575.0
921,2018/05/31,3755.0,3728.564,3670.0,65100,3755.0,3650.0
922,2018/06/01,3645.0,3643.975,3740.0,52200,3740.0,3590.0
923,2018/06/04,3625.0,3643.996,3660.0,24400,3685.0,3610.0
924,2018/06/05,3595.0,3573.712,3615.0,59800,3615.0,3525.0
925,2018/06/06,3495.0,3521.046,3575.0,50200,3575.0,3485.0
926,2018/06/07,3530.0,3495.343,3495.0,52500,3540.0,3445.0
927,2018/06/08,3485.0,3482.643,3495.0,43700,3515.0,3455.0
928,2018/06/11,3605.0,3603.621,3480.0,57300,3640.0,3480.0
929,2018/06/12,3590.0,3581.287,3615.0,33800,3630.0,3545.0
930,2018/06/13,3505.0,3530.449,3590.0,52400,3600.0,3490.0
931,2018/06/14,3550.0,3547.558,3505.0,34600,3590.0,3505.0
932,2018/06/15,3455.0,3475.107,3575.0,60500,3575.0,3425.0
933,2018/06/18,3475.0,3451.851,3490.0,38900,3505.0,3405.0
934,2018/06/19,3435.0,3443.468,3475.0,37200,3495.0,3405.0
935,2018/06/20,3510.0,3471.848,3435.0,53300,3515.0,3405.0
936,2018/06/21,3490.0,3505.669,3515.0,26900,3535.0,3480.0
937,2018/06/22,3495.0,3485.299,3480.0,31800,3510.0,3445.0
938,2018/06/25,3400.0,3432.108,3510.0,46500,3515.0,3375.0
939,2018/06/26,3380.0,3369.654,3375.0,36100,3405.0,3330.0
940,2018/06/27,3360.0,3349.373,3380.0,38300,3395.0,3310.0
941,2018/06/28,3340.0,3317.067,3360.0,44500,3365.0,3270.0
942,2018/06/29,3370.0,3350.209,3350.0,26300,3375.0,3305.0
943,2018/07/02,3300.0,3330.49,3350.0,49000,3380.0,3275.0
944,2018/07/03,3265.0,3276.822,3305.0,36500,3370.0,3230.0
945,2018/07/04,3280.0,3255.448,3235.0,32400,3305.0,3185.0
946,2018/07/05,3115.0,3151.004,3245.0,46800,3260.0,3100.0
947,2018/07/06,3225.0,3179.207,3130.0,41600,3225.0,3110.0
948,2018/07/09,3330.0,3292.603,3240.0,43600,3335.0,3230.0
949,2018/07/10,3345.0,3307.289,3330.0,46100,3365.0,3255.0
950,2018/07/11,3345.0,3330.347,3315.0,47600,3390.0,3225.0
951,2018/07/12,3310.0,3292.306,3345.0,56800,3345.0,3240.0
952,2018/07/13,3435.0,3392.998,3340.0,51700,3455.0,3285.0
953,2018/07/17,3490.0,3467.783,3460.0,49400,3505.0,3425.0
954,2018/07/18,3425.0,3438.186,3495.0,41900,3505.0,3385.0
955,2018/07/19,3530.0,3486.704,3420.0,98000,3565.0,3365.0
956,2018/07/20,3450.0,3500.716,3530.0,44700,3550.0,3445.0
957,2018/07/23,3520.0,3511.066,3430.0,38000,3540.0,3430.0
958,2018/07/24,3655.0,3625.128,3525.0,54800,3675.0,3515.0
959,2018/07/25,3650.0,3648.972,3670.0,39900,3680.0,3620.0
960,2018/07/26,3695.0,3687.261,3695.0,35600,3715.0,3640.0
961,2018/07/27,3700.0,3703.645,3710.0,31000,3740.0,3670.0
962,2018/07/30,3715.0,3703.779,3690.0,102400,3735.0,3650.0
963,2018/07/31,3560.0,3576.754,3690.0,89500,3690.0,3485.0
964,2018/08/01,3485.0,3544.31,3605.0,42000,3625.0,3475.0
965,2018/08/02,3580.0,3607.922,3530.0,104900,3705.0,3505.0
966,2018/08/03,3585.0,3589.578,3595.0,54500,3655.0,3545.0
967,2018/08/06,3535.0,3564.771,3620.0,72100,3620.0,3525.0
968,2018/08/07,3845.0,3744.239,3465.0,209700,3850.0,3465.0
969,2018/08/08,3790.0,3749.949,3840.0,157200,3840.0,3655.0
970,2018/08/09,3770.0,3775.459,3750.0,31600,3830.0,3710.0
971,2018/08/10,3810.0,3820.171,3815.0,73000,3905.0,3765.0
972,2018/08/13,3750.0,3756.091,3780.0,43100,3810.0,3720.0
973,2018/08/14,3760.0,3773.578,3795.0,32000,3810.0,3750.0
974,2018/08/15,3705.0,3701.455,3715.0,27500,3750.0,3670.0
975,2018/08/16,3540.0,3587.258,3660.0,40300,3675.0,3535.0
976,2018/08/17,3505.0,3537.888,3550.0,44500,3625.0,3490.0
977,2018/08/20,3410.0,3443.116,3520.0,33700,3540.0,3400.0
978,2018/08/21,3290.0,3322.508,3365.0,33300,3410.0,3285.0
979,2018/08/22,3255.0,3227.204,3290.0,67600,3300.0,3165.0
980,2018/08/23,3265.0,3243.182,3250.0,67100,3270.0,3195.0
981,2018/08/24,3340.0,3319.484,3280.0,50400,3350.0,3275.0
982,2018/08/27,3390.0,3364.578,3360.0,24900,3395.0,3320.0
983,2018/08/28,3410.0,3429.806,3430.0,28400,3475.0,3390.0
984,2018/08/29,3420.0,3426.64,3410.0,18600,3450.0,3385.0
985,2018/08/30,3475.0,3473.474,3440.0,27200,3510.0,3425.0
986,2018/08/31,3415.0,3450.885,3455.0,46900,3535.0,3400.0
987,2018/09/03,3340.0,3350.934,3405.0,38000,3405.0,3315.0
988,2018/09/04,3345.0,3347.381,3360.0,18900,3365.0,3330.0
989,2018/09/05,3245.0,3273.074,3345.0,28300,3345.0,3245.0
990,2018/09/06,3165.0,3190.844,3235.0,32600,3255.0,3140.0
991,2018/09/07,3120.0,3109.515,3140.0,30900,3140.0,3085.0
992,2018/09/10,3105.0,3103.177,3125.0,19200,3135.0,3075.0
993,2018/09/11,3085.0,3089.541,3095.0,19600,3115.0,3070.0
994,2018/09/12,3045.0,3046.745,3080.0,25500,3105.0,3020.0
995,2018/09/13,3065.0,3063.194,3030.0,29900,3110.0,3030.0
996,2018/09/14,3115.0,3128.03,3120.0,23600,3175.0,3105.0
997,2018/09/18,3150.0,3127.106,3095.0,29200,3165.0,3080.0
998,2018/09/19,3235.0,3223.99,3225.0,29700,3245.0,3180.0
999,2018/09/20,3335.0,3307.096,3285.0,44600,3350.0,3235.0
1000,2018/09/21,3435.0,3429.186,3385.0,60200,3490.0,3345.0
1001,2018/09/25,3415.0,3405.307,3440.0,30900,3445.0,3360.0
1002,2018/09/26,3520.0,3507.557,3480.0,43800,3540.0,3460.0
1003,2018/09/27,3410.0,3449.292,3520.0,21900,3520.0,3410.0
1004,2018/09/28,3430.0,3437.469,3410.0,31800,3490.0,3410.0
1005,2018/10/01,3465.0,3468.926,3425.0,29800,3495.0,3415.0
1006,2018/10/02,3400.0,3418.518,3490.0,19900,3490.0,3390.0
1007,2018/10/03,3335.0,3349.436,3425.0,18600,3425.0,3310.0
1008,2018/10/04,3295.0,3276.261,3310.0,32900,3365.0,3225.0
1009,2018/10/05,3195.0,3220.987,3250.0,23300,3285.0,3195.0
1010,2018/10/09,3130.0,3120.784,3195.0,35700,3195.0,3075.0
1011,2018/10/10,3110.0,3114.944,3110.0,35700,3170.0,3075.0
1012,2018/10/11,3015.0,3017.068,2992.0,57400,3075.0,2956.0
1013,2018/10/12,3110.0,3067.657,2980.0,34700,3125.0,2980.0
1014,2018/10/15,2991.0,3024.278,3130.0,33500,3130.0,2990.0
1015,2018/10/16,2937.0,2940.644,3000.0,44600,3005.0,2906.0
1016,2018/10/17,3030.0,3013.17,3015.0,39400,3030.0,2968.0
1017,2018/10/18,2932.0,2959.293,3070.0,72800,3080.0,2903.0
1018,2018/10/19,2919.0,2902.593,2932.0,43200,2932.0,2881.0
1019,2018/10/22,2900.0,2889.533,2918.0,26100,2919.0,2841.0
1020,2018/10/23,2758.0,2786.06,2854.0,53800,2861.0,2744.0
1021,2018/10/24,2763.0,2728.677,2764.0,85100,2813.0,2674.0
1022,2018/10/25,2613.0,2627.841,2660.0,61800,2670.0,2602.0
1023,2018/10/26,2540.0,2566.554,2604.0,44600,2630.0,2518.0
1024,2018/10/29,2484.0,2530.467,2575.0,46900,2628.0,2484.0
1025,2018/10/30,2639.0,2594.315,2487.0,49500,2646.0,2480.0
1026,2018/10/31,2724.0,2692.976,2663.0,29300,2727.0,2650.0
1027,2018/11/01,2673.0,2675.622,2699.0,22200,2700.0,2645.0
1028,2018/11/02,2715.0,2682.779,2651.0,50200,2729.0,2605.0
1029,2018/11/05,2814.0,2810.372,2705.0,73400,2859.0,2675.0
1030,2018/11/06,2868.0,2960.469,3000.0,119600,3075.0,2852.0
1031,2018/11/07,2863.0,2894.704,2918.0,97800,2983.0,2813.0
1032,2018/11/08,2918.0,2911.529,2915.0,45200,2941.0,2869.0
1033,2018/11/09,2902.0,2918.19,2946.0,45200,2989.0,2873.0
1034,2018/11/12,2784.0,2833.179,2894.0,87300,2921.0,2766.0
1035,2018/11/13,2686.0,2696.103,2684.0,56600,2721.0,2658.0
1036,2018/11/14,2570.0,2612.958,2693.0,90300,2695.0,2560.0
1037,2018/11/15,2687.0,2618.376,2526.0,89700,2692.0,2526.0
1038,2018/11/16,2588.0,2644.554,2713.0,36300,2750.0,2580.0
1039,2018/11/19,2556.0,2535.24,2552.0,91000,2562.0,2492.0
1040,2018/11/20,2470.0,2486.819,2506.0,62800,2525.0,2465.0
1041,2018/11/21,2495.0,2478.207,2433.0,51600,2536.0,2426.0
1042,2018/11/22,2530.0,2507.272,2496.0,40800,2540.0,2460.0
1043,2018/11/26,2498.0,2497.542,2553.0,37100,2566.0,2465.0
1044,2018/11/27,2559.0,2527.261,2497.0,44900,2567.0,2473.0
1045,2018/11/28,2676.0,2643.277,2559.0,75600,2692.0,2545.0
1046,2018/11/29,2717.0,2710.363,2679.0,39900,2746.0,2667.0
1047,2018/11/30,2736.0,2700.679,2701.0,74800,2760.0,2641.0
1048,2018/12/03,2762.0,2768.016,2770.0,31300,2806.0,2750.0
1049,2018/12/04,2693.0,2716.232,2752.0,37100,2760.0,2687.0
1050,2018/12/05,2663.0,2667.541,2658.0,29600,2695.0,2619.0
1051,2018/12/06,2555.0,2578.873,2640.0,59900,2640.0,2550.0
1052,2018/12/07,2658.0,2631.478,2564.0,45400,2677.0,2562.0
1053,2018/12/10,2608.0,2622.975,2631.0,36500,2676.0,2586.0
1054,2018/12/11,2510.0,2542.648,2625.0,24400,2627.0,2498.0
1055,2018/12/12,2584.0,2569.735,2572.0,38800,2595.0,2527.0
1056,2018/12/13,2534.0,2542.955,2600.0,44500,2600.0,2507.0
1057,2018/12/14,2454.0,2474.072,2520.0,37300,2520.0,2428.0
1058,2018/12/17,2430.0,2444.718,2450.0,19500,2478.0,2425.0
1059,2018/12/18,2296.0,2320.876,2400.0,50900,2400.0,2277.0
1060,2018/12/19,2295.0,2307.556,2312.0,42100,2368.0,2265.0
1061,2018/12/20,2153.0,2184.168,2267.0,55400,2289.0,2125.0
1062,2018/12/21,2148.0,2133.623,2100.0,81700,2180.0,2071.0
1063,2018/12/25,1989.0,2004.872,2011.0,145300,2065.0,1963.0
1064,2018/12/26,2094.0,2066.595,1986.0,67900,2111.0,1974.0
1065,2018/12/27,2257.0,2207.286,2208.0,58300,2264.0,2120.0
1066,2018/12/28,2150.0,2154.833,2207.0,58100,2226.0,2117.0
1067,2019/01/04,2095.0,2064.13,2100.0,57500,2138.0,2019.0
1068,2019/01/07,2181.0,2180.126,2160.0,37400,2198.0,2141.0
1069,2019/01/08,2238.0,2235.91,2185.0,29000,2258.0,2185.0
1070,2019/01/09,2317.0,2339.594,2257.0,65700,2387.0,2257.0
1071,2019/01/10,2353.0,2341.794,2311.0,53900,2374.0,2280.0
1072,2019/01/11,2405.0,2423.53,2353.0,88500,2486.0,2325.0
1073,2019/01/15,2449.0,2477.824,2388.0,76000,2550.0,2377.0
1074,2019/01/16,2514.0,2520.088,2499.0,60100,2548.0,2480.0
1075,2019/01/17,2514.0,2545.086,2537.0,48800,2585.0,2507.0
1076,2019/01/18,2511.0,2532.294,2515.0,25500,2565.0,2510.0
1077,2019/01/21,2554.0,2563.931,2569.0,31700,2587.0,2527.0
1078,2019/01/22,2562.0,2582.469,2585.0,29200,2635.0,2542.0
1079,2019/01/23,2506.0,2506.237,2512.0,43400,2544.0,2470.0
1080,2019/01/24,2549.0,2547.802,2507.0,32300,2580.0,2495.0
1081,2019/01/25,2558.0,2558.229,2556.0,15300,2586.0,2534.0
1082,2019/01/28,2626.0,2627.87,2551.0,56300,2660.0,2551.0
1083,2019/01/29,2638.0,2629.696,2615.0,27600,2648.0,2603.0
1084,2019/01/30,2635.0,2658.619,2601.0,62000,2722.0,2601.0
1085,2019/01/31,2698.0,2707.412,2665.0,43200,2745.0,2665.0
1086,2019/02/01,2661.0,2653.508,2666.0,41900,2708.0,2614.0
1087,2019/02/04,2839.0,2795.508,2704.0,66100,2841.0,2704.0
1088,2019/02/05,2798.0,2824.254,2853.0,47300,2895.0,2782.0
1089,2019/02/06,2732.0,2742.68,2805.0,30000,2810.0,2715.0
1090,2019/02/07,2736.0,2734.369,2732.0,20600,2761.0,2704.0
1091,2019/02/08,2693.0,2709.089,2700.0,32600,2761.0,2684.0
1092,2019/02/12,2787.0,2796.629,2749.0,129400,2899.0,2739.0
1093,2019/02/13,2287.0,2287.62,2287.0,58600,2325.0,2287.0
1094,2019/02/14,2362.0,2345.824,2337.0,158900,2422.0,2295.0
1095,2019/02/15,2300.0,2322.052,2356.0,57800,2373.0,2287.0
1096,2019/02/18,2312.0,2270.419,2278.0,133500,2336.0,2205.0
1097,2019/02/19,2195.0,2203.439,2262.0,255100,2280.0,2154.0
1098,2019/02/20,2156.0,2143.368,2171.0,187500,2182.0,2096.0
1099,2019/02/21,2123.0,2153.27,2170.0,117800,2190.0,2121.0
1100,2019/02/22,2022.0,2020.034,2107.0,368800,2107.0,1992.0
1101,2019/02/25,2038.0,2032.018,2028.0,159300,2060.0,2004.0
1102,2019/02/26,2069.0,2058.349,2050.0,116300,2087.0,2016.0
1103,2019/02/27,2118.0,2114.854,2099.0,152400,2137.0,2077.0
1104,2019/02/28,2082.0,2091.381,2136.0,115100,2136.0,2057.0
1105,2019/03/01,2055.0,2071.022,2081.0,86200,2112.0,2043.0
1106,2019/03/04,2040.0,2037.489,2062.0,207700,2092.0,2001.0
1107,2019/03/05,2033.0,2029.806,2028.0,74800,2052.0,2006.0
1108,2019/03/06,2047.0,2053.396,2052.0,91100,2066.0,2033.0
1109,2019/03/07,1958.0,1978.287,2047.0,155900,2047.0,1947.0
1110,2019/03/08,1811.0,1841.583,1907.0,206000,1940.0,1793.0
1111,2019/03/11,1885.0,1860.766,1831.0,108300,1893.0,1806.0
1112,2019/03/12,1920.0,1917.315,1915.0,65500,1944.0,1902.0
1113,2019/03/13,1906.0,1910.137,1902.0,45900,1945.0,1885.0
1114,2019/03/14,1919.0,1921.653,1908.0,32000,1939.0,1901.0
1115,2019/03/15,1912.0,1928.824,1919.0,74200,1964.0,1904.0
1116,2019/03/18,1966.0,1954.53,1924.0,53200,1973.0,1903.0
1117,2019/03/19,1936.0,1939.585,1962.0,34700,1963.0,1924.0
1118,2019/03/20,1960.0,1940.828,1936.0,52200,1960.0,1905.0
1119,2019/03/22,1910.0,1902.994,1941.0,95300,1943.0,1876.0
1120,2019/03/25,1793.0,1812.295,1831.0,127000,1849.0,1785.0
1121,2019/03/26,1882.0,1869.781,1833.0,57900,1891.0,1833.0
1122,2019/03/27,1947.0,1938.521,1883.0,76200,1966.0,1883.0
1123,2019/03/28,1857.0,1874.577,1930.0,67200,1936.0,1851.0
1124,2019/03/29,1889.0,1880.415,1880.0,54000,1908.0,1854.0
1125,2019/04/01,1969.0,1969.649,1907.0,81300,1990.0,1907.0
1126,2019/04/02,1900.0,1921.08,1972.0,75300,1981.0,1896.0
1127,2019/04/03,1933.0,1930.012,1900.0,32800,1949.0,1900.0
1128,2019/04/04,1959.0,1966.891,1949.0,55200,1983.0,1924.0
1129,2019/04/05,1955.0,1951.679,1959.0,47700,1970.0,1937.0
1130,2019/04/08,1956.0,1956.842,1965.0,21500,1977.0,1936.0
1131,2019/04/09,1950.0,1943.348,1955.0,32800,1958.0,1920.0
1132,2019/04/10,1918.0,1928.663,1935.0,25800,1962.0,1912.0
1133,2019/04/11,1897.0,1897.267,1918.0,25100,1918.0,1886.0
1134,2019/04/12,1930.0,1930.44,1901.0,33200,1947.0,1901.0
1135,2019/04/15,1963.0,1952.113,1944.0,48900,1967.0,1927.0
1136,2019/04/16,1926.0,1942.764,1961.0,21200,1972.0,1926.0
1137,2019/04/17,1939.0,1937.762,1939.0,18900,1958.0,1917.0
1138,2019/04/18,1885.0,1899.688,1924.0,35300,1925.0,1885.0
1139,2019/04/19,1881.0,1892.608,1887.0,21400,1921.0,1874.0
1140,2019/04/22,1880.0,1889.383,1921.0,22200,1921.0,1871.0
1141,2019/04/23,1866.0,1859.503,1872.0,30200,1882.0,1841.0
1142,2019/04/24,1846.0,1858.736,1893.0,27600,1894.0,1837.0
1143,2019/04/25,1888.0,1870.004,1850.0,27700,1888.0,1841.0
1144,2019/04/26,1886.0,1872.101,1896.0,33600,1896.0,1842.0
1145,2019/05/07,1918.0,1931.556,1904.0,79700,1966.0,1882.0
1146,2019/05/08,1893.0,1871.062,1874.0,120900,1896.0,1834.0
1147,2019/05/09,1716.0,1757.443,1874.0,150700,1896.0,1689.0
1148,2019/05/10,1771.0,1755.851,1700.0,53000,1809.0,1700.0
1149,2019/05/13,1699.0,1720.448,1752.0,56300,1770.0,1696.0
1150,2019/05/14,1673.0,1654.738,1623.0,62200,1689.0,1604.0
1151,2019/05/15,1721.0,1697.527,1689.0,35100,1726.0,1649.0
1152,2019/05/16,1707.0,1704.431,1692.0,37800,1725.0,1679.0
1153,2019/05/17,1734.0,1743.719,1731.0,28100,1759.0,1731.0
1154,2019/05/20,1712.0,1721.521,1747.0,21300,1775.0,1700.0
1155,2019/05/21,1675.0,1677.058,1715.0,45000,1715.0,1652.0
1156,2019/05/22,1642.0,1653.378,1677.0,52900,1690.0,1626.0
1157,2019/05/23,1625.0,1624.952,1631.0,45800,1656.0,1606.0
1158,2019/05/24,1637.0,1623.369,1607.0,31400,1647.0,1586.0
1159,2019/05/27,1646.0,1651.881,1649.0,15100,1675.0,1634.0
1160,2019/05/28,1663.0,1655.769,1646.0,26400,1670.0,1635.0
1161,2019/05/29,1635.0,1632.457,1642.0,22300,1648.0,1617.0
1162,2019/05/30,1594.0,1598.9,1613.0,38800,1624.0,1587.0
1163,2019/05/31,1592.0,1601.113,1595.0,47600,1625.0,1575.0
1164,2019/06/03,1499.0,1515.865,1575.0,39100,1575.0,1490.0
1165,2019/06/04,1549.0,1539.579,1501.0,48900,1588.0,1501.0
1166,2019/06/05,1572.0,1564.997,1589.0,59700,1589.0,1537.0
1167,2019/06/06,1568.0,1578.469,1579.0,24500,1598.0,1565.0
1168,2019/06/07,1651.0,1633.788,1586.0,59900,1657.0,1560.0
1169,2019/06/10,1626.0,1633.716,1657.0,37700,1673.0,1615.0
1170,2019/06/11,1652.0,1653.436,1626.0,64200,1666.0,1622.0
1171,2019/06/12,1765.0,1750.091,1689.0,126200,1792.0,1682.0
1172,2019/06/13,1703.0,1728.951,1773.0,48700,1780.0,1689.0
1173,2019/06/14,1704.0,1698.469,1703.0,24500,1722.0,1671.0
1174,2019/06/17,1698.0,1699.408,1699.0,17900,1720.0,1686.0
1175,2019/06/18,1667.0,1675.375,1698.0,20800,1707.0,1663.0
1176,2019/06/19,1759.0,1745.081,1689.0,43000,1759.0,1689.0
1177,2019/06/20,1756.0,1763.866,1767.0,41000,1796.0,1751.0
1178,2019/06/21,1758.0,1752.276,1757.0,80900,1768.0,1724.0
1179,2019/06/24,1753.0,1750.863,1766.0,20500,1784.0,1728.0
1180,2019/06/25,1729.0,1735.525,1764.0,15800,1764.0,1726.0
1181,2019/06/26,1690.0,1698.027,1729.0,18300,1741.0,1681.0
1182,2019/06/27,1648.0,1655.771,1683.0,36600,1683.0,1640.0
1183,2019/06/28,1680.0,1678.036,1650.0,46800,1710.0,1650.0
1184,2019/07/01,1762.0,1739.665,1720.0,48700,1768.0,1684.0
1185,2019/07/02,1764.0,1770.674,1749.0,28800,1788.0,1749.0
1186,2019/07/03,1742.0,1748.76,1764.0,15800,1769.0,1738.0
1187,2019/07/04,1731.0,1732.015,1759.0,13000,1759.0,1718.0
1188,2019/07/05,1727.0,1728.141,1743.0,19100,1749.0,1712.0
1189,2019/07/08,1710.0,1714.555,1728.0,29200,1735.0,1703.0
1190,2019/07/09,1701.0,1707.375,1717.0,33600,1734.0,1695.0
1191,2019/07/10,1714.0,1706.708,1701.0,29100,1724.0,1666.0
1192,2019/07/11,1731.0,1723.52,1724.0,14800,1734.0,1705.0
1193,2019/07/12,1668.0,1696.937,1723.0,47600,1737.0,1663.0
1194,2019/07/16,1631.0,1638.055,1665.0,43400,1694.0,1622.0
1195,2019/07/17,1613.0,1609.008,1630.0,36900,1630.0,1584.0
1196,2019/07/18,1564.0,1575.96,1592.0,35100,1602.0,1560.0
1197,2019/07/19,1591.0,1589.596,1574.0,20800,1607.0,1567.0
1198,2019/07/22,1561.0,1568.512,1560.0,21100,1583.0,1551.0
1199,2019/07/23,1577.0,1580.931,1563.0,21800,1603.0,1563.0
1200,2019/07/24,1561.0,1568.589,1580.0,20700,1587.0,1561.0
1201,2019/07/25,1566.0,1573.761,1566.0,16300,1592.0,1566.0
1202,2019/07/26,1556.0,1563.64,1565.0,24700,1580.0,1553.0
1203,2019/07/29,1542.0,1544.997,1561.0,30200,1569.0,1534.0
1204,2019/07/30,1513.0,1518.77,1542.0,65600,1561.0,1510.0
1205,2019/07/31,1486.0,1496.394,1505.0,45400,1521.0,1486.0
1206,2019/08/01,1480.0,1478.205,1482.0,42000,1494.0,1461.0
1207,2019/08/02,1421.0,1425.824,1463.0,91200,1464.0,1403.0
1208,2019/08/05,1389.0,1395.816,1421.0,67500,1422.0,1376.0
1209,2019/08/06,1536.0,1489.256,1425.0,338300,1554.0,1402.0
1210,2019/08/07,1679.0,1636.464,1556.0,219000,1686.0,1556.0
1211,2019/08/08,1575.0,1607.08,1671.0,144600,1677.0,1562.0
1212,2019/08/09,1523.0,1539.118,1575.0,81200,1607.0,1509.0
1213,2019/08/13,1462.0,1481.423,1517.0,89300,1530.0,1453.0
1214,2019/08/14,1489.0,1480.422,1476.0,52400,1503.0,1465.0
1215,2019/08/15,1523.0,1503.36,1462.0,111000,1529.0,1461.0
1216,2019/08/16,1546.0,1547.817,1512.0,54200,1568.0,1512.0
1217,2019/08/19,1546.0,1557.356,1550.0,48300,1579.0,1534.0
1218,2019/08/20,1648.0,1625.221,1559.0,149600,1661.0,1559.0
1219,2019/08/21,1650.0,1648.15,1650.0,99900,1668.0,1617.0
1220,2019/08/22,1650.0,1654.458,1655.0,96200,1694.0,1636.0
1221,2019/08/23,1581.0,1601.449,1650.0,116500,1664.0,1573.0
