ds,yhat
2019-08-22,4938.433896908451
2019-08-23,4965.105126306779
2019-08-26,4866.549260047979
2019-08-27,4851.046300539487
2019-08-28,4878.1454150324735
2019-08-29,4934.159856836298
2019-08-30,4988.374522645313
2019-09-02,4953.430366332397
2019-09-03,4906.798241691945
2019-09-04,4879.263135284113
2019-09-05,4878.674568803517
2019-09-06,4894.864683761265
2019-09-09,4839.911280424377
2019-09-10,4770.017345990922
2019-09-11,4709.894486937441
2019-09-12,4689.320946065121
2019-09-13,4719.671411143843
2019-09-17,4887.199952997417
2019-09-18,4867.871282562873
2019-09-19,4863.384544063945
2019-09-20,4894.827222215875
