,Date,Close,VWAP,Open,Volume,High,Low
0,2017/09/13,1070.0,1172.961,1242.5,4114400,1245.0,1070.0
1,2017/09/14,1072.5,1038.815,1042.5,2162000,1080.0,1000.0
2,2017/09/15,1027.5,1042.243,1037.5,784400,1075.0,1013.8
3,2017/09/19,968.8,1034.059,1033.8,806400,1088.8,962.5
4,2017/09/20,973.8,952.616,986.3,668800,996.3,920.0
5,2017/09/21,997.5,985.135,991.3,334000,1003.8,962.5
6,2017/09/22,926.3,940.271,975.0,274800,980.0,925.0
7,2017/09/25,928.8,930.217,915.0,138000,947.5,912.5
8,2017/09/26,948.8,926.365,913.8,186400,948.8,913.8
9,2017/09/27,960.0,949.428,935.0,182800,962.5,932.5
10,2017/09/28,930.0,946.41,962.5,196800,970.0,928.8
11,2017/09/29,920.0,932.449,930.0,206400,952.5,918.8
12,2017/10/02,971.3,955.363,927.5,260000,973.8,922.5
13,2017/10/03,943.8,975.721,988.8,439600,1005.0,932.5
14,2017/10/04,926.3,932.827,952.5,137600,952.5,923.8
15,2017/10/05,955.0,937.441,920.0,118800,956.3,920.0
16,2017/10/06,943.8,945.175,945.0,91600,962.5,935.0
17,2017/10/10,950.0,945.471,938.8,89200,957.5,930.0
18,2017/10/11,937.5,938.417,942.5,48000,952.5,930.0
19,2017/10/12,960.0,943.986,937.5,95200,962.5,933.8
20,2017/10/13,942.5,950.365,961.3,57600,967.5,942.5
21,2017/10/16,945.0,943.847,945.0,92800,956.3,930.0
22,2017/10/17,907.5,914.726,945.0,162400,945.0,903.8
23,2017/10/18,907.5,910.882,907.5,38000,920.0,902.5
24,2017/10/19,875.0,878.98,908.8,113200,915.0,861.3
25,2017/10/20,852.5,863.768,866.3,55600,876.3,852.5
26,2017/10/23,877.5,857.538,851.3,80000,878.8,841.3
27,2017/10/24,867.5,869.256,880.0,31600,882.5,860.0
28,2017/10/25,886.3,878.955,873.8,70800,895.0,856.3
29,2017/10/26,891.3,902.965,886.3,75200,920.0,886.3
30,2017/10/27,915.0,900.471,886.3,52000,915.0,880.0
31,2017/10/30,902.5,918.649,922.5,59600,928.8,902.5
32,2017/10/31,923.8,931.895,943.8,86800,943.8,910.0
33,2017/11/01,920.0,925.379,926.3,52800,943.8,912.5
34,2017/11/02,902.5,904.628,907.5,44400,922.5,898.8
35,2017/11/06,888.8,892.094,895.0,30800,898.8,887.5
36,2017/11/07,877.5,879.142,901.3,34400,901.3,871.3
37,2017/11/08,891.3,882.554,875.0,28000,891.3,875.0
38,2017/11/09,893.8,887.601,887.5,34800,896.3,881.3
39,2017/11/10,883.8,885.542,876.3,12000,891.3,876.3
40,2017/11/13,902.5,905.68,887.5,41200,918.8,887.5
41,2017/11/14,913.8,907.392,908.8,37200,922.5,892.5
42,2017/11/15,825.0,851.069,875.0,124400,875.0,825.0
43,2017/11/16,792.5,808.627,817.5,52800,823.8,792.5
44,2017/11/17,827.5,810.017,803.8,57200,827.5,795.0
45,2017/11/20,857.5,845.548,831.3,64800,865.0,822.5
46,2017/11/21,843.8,849.433,862.5,43200,862.5,840.0
47,2017/11/22,847.5,849.083,843.8,12000,853.8,843.8
48,2017/11/24,861.3,852.088,851.3,36400,861.3,845.0
49,2017/11/27,847.5,850.558,853.8,22400,856.3,846.3
50,2017/11/28,867.5,849.288,858.8,28800,867.5,837.5
51,2017/11/29,847.5,858.733,877.5,28800,877.5,843.8
52,2017/11/30,921.3,898.11,875.0,132800,921.3,870.0
53,2017/12/01,908.8,905.851,903.8,28800,925.0,895.0
54,2017/12/04,947.5,931.849,900.0,142000,947.5,900.0
55,2017/12/05,947.5,947.987,937.5,94400,967.5,925.0
56,2017/12/06,945.0,951.8,962.5,76400,965.0,925.0
57,2017/12/07,945.0,944.277,948.8,51200,955.0,927.5
58,2017/12/08,905.0,918.977,960.0,66000,961.3,895.0
59,2017/12/11,893.8,890.824,918.8,36400,918.8,875.0
60,2017/12/12,882.5,884.146,887.5,16400,893.8,880.0
61,2017/12/13,862.5,858.022,873.8,50800,875.0,837.5
62,2017/12/14,858.8,854.098,858.8,24400,858.8,850.0
63,2017/12/15,915.0,883.175,861.3,54800,915.0,860.0
64,2017/12/18,933.8,943.258,950.0,146400,961.3,920.0
65,2017/12/19,953.8,952.478,938.8,67200,967.5,930.0
66,2017/12/20,1005.0,998.949,975.0,510000,1027.5,973.8
67,2017/12/21,1002.5,998.079,1000.0,135600,1015.0,981.3
68,2017/12/22,1037.5,1026.588,1032.5,251200,1047.5,1005.0
69,2017/12/25,1122.5,1084.176,1062.5,445600,1122.5,1062.5
70,2017/12/26,1112.5,1101.925,1115.0,233200,1120.0,1068.8
71,2017/12/27,1207.5,1156.406,1112.5,259200,1225.0,1087.5
72,2017/12/28,1135.0,1183.567,1221.3,297600,1225.0,1125.0
73,2017/12/29,1107.5,1127.483,1152.5,234000,1212.5,1077.5
74,2018/01/04,1082.5,1092.418,1090.0,121600,1112.5,1080.0
75,2018/01/05,1061.3,1086.474,1085.0,109600,1112.5,1055.0
76,2018/01/09,1093.8,1074.947,1083.8,56400,1093.8,1062.5
77,2018/01/10,1171.3,1144.228,1103.8,239600,1172.5,1100.0
78,2018/01/11,1152.5,1152.78,1155.0,91200,1163.8,1143.8
79,2018/01/12,1137.5,1136.597,1156.3,80800,1163.8,1112.5
80,2018/01/15,1125.0,1128.821,1155.0,63600,1155.0,1110.0
81,2018/01/16,1098.8,1098.156,1115.0,87600,1120.0,1085.0
82,2018/01/17,1116.3,1097.567,1086.3,67200,1127.5,1081.3
83,2018/01/18,1085.0,1107.176,1128.8,78800,1130.0,1085.0
84,2018/01/19,1077.5,1077.626,1100.0,59600,1106.3,1063.8
85,2018/01/22,1102.5,1087.762,1080.0,66800,1117.5,1058.8
86,2018/01/23,1155.0,1135.555,1126.3,131600,1158.8,1111.3
87,2018/01/24,1167.5,1164.496,1157.5,155600,1181.3,1142.5
88,2018/01/25,1167.5,1164.269,1175.0,52000,1175.0,1128.8
89,2018/01/26,1196.3,1199.596,1163.8,221600,1225.0,1158.8
90,2018/01/29,1145.0,1178.305,1200.0,123600,1207.5,1138.8
91,2018/01/30,1112.5,1122.909,1141.3,86800,1150.0,1105.0
92,2018/01/31,1106.3,1110.443,1101.3,45200,1130.0,1096.3
93,2018/02/01,1138.8,1145.872,1141.3,51600,1160.0,1128.8
94,2018/02/02,1208.8,1186.928,1156.3,233200,1212.5,1152.5
95,2018/02/05,1285.0,1246.928,1176.3,575600,1310.0,1162.5
96,2018/02/06,1138.8,1176.491,1182.5,448800,1243.8,1093.8
97,2018/02/07,1140.0,1191.641,1237.5,300400,1262.5,1087.5
98,2018/02/08,1170.0,1171.675,1157.5,118800,1208.8,1145.0
99,2018/02/09,1121.3,1102.055,1100.0,123600,1131.3,1087.5
100,2018/02/13,1057.5,1101.08,1138.8,82400,1158.8,1057.5
101,2018/02/14,1056.3,1036.111,1045.0,143600,1075.0,1007.5
102,2018/02/15,1110.0,1143.881,1161.3,279200,1173.8,1083.8
103,2018/02/16,1122.5,1136.919,1125.0,86000,1155.0,1120.0
104,2018/02/19,1200.0,1179.093,1146.3,119600,1200.0,1133.8
105,2018/02/20,1355.0,1322.837,1220.0,498800,1375.0,1215.0
106,2018/02/21,1472.5,1453.63,1367.5,774400,1507.5,1362.5
107,2018/02/22,1477.5,1486.725,1502.5,274800,1547.5,1427.5
108,2018/02/23,1440.0,1429.264,1455.0,146800,1500.0,1390.0
109,2018/02/26,1462.5,1454.019,1475.0,106000,1475.0,1417.5
110,2018/02/27,1407.5,1491.422,1487.5,249600,1537.5,1385.0
111,2018/02/28,1492.5,1447.037,1390.0,97200,1492.5,1390.0
112,2018/03/01,1482.5,1515.602,1522.5,174400,1562.5,1467.5
113,2018/03/02,1450.0,1432.211,1414.0,92000,1475.0,1391.0
114,2018/03/05,1442.0,1474.773,1445.0,98100,1540.0,1405.0
115,2018/03/06,1530.0,1561.365,1460.0,181800,1720.0,1460.0
116,2018/03/07,1597.0,1603.362,1538.0,207800,1679.0,1526.0
117,2018/03/08,1654.0,1665.888,1652.0,153800,1694.0,1620.0
118,2018/03/09,1723.0,1719.297,1700.0,161800,1750.0,1691.0
119,2018/03/12,1763.0,1702.121,1762.0,244900,1820.0,1569.0
120,2018/03/13,1831.0,1772.273,1756.0,127800,1850.0,1704.0
121,2018/03/14,1918.0,1881.541,1831.0,112700,1931.0,1818.0
122,2018/03/15,1869.0,1870.359,1902.0,84500,1910.0,1826.0
123,2018/03/16,1750.0,1782.99,1863.0,118900,1865.0,1738.0
124,2018/03/19,1616.0,1637.207,1774.0,194200,1774.0,1580.0
125,2018/03/20,1670.0,1643.026,1591.0,113100,1718.0,1551.0
126,2018/03/22,1695.0,1670.766,1636.0,61600,1710.0,1631.0
127,2018/03/23,1610.0,1609.368,1575.0,84700,1660.0,1572.0
128,2018/03/26,1586.0,1528.325,1573.0,91100,1610.0,1451.0
129,2018/03/27,1688.0,1654.287,1651.0,72500,1700.0,1608.0
130,2018/03/28,1720.0,1714.538,1660.0,118600,1773.0,1626.0
131,2018/03/29,1765.0,1785.659,1760.0,75900,1819.0,1748.0
132,2018/03/30,1726.0,1738.964,1765.0,61500,1801.0,1710.0
133,2018/04/02,1662.0,1700.777,1738.0,76600,1740.0,1662.0
134,2018/04/03,1713.0,1640.094,1632.0,74400,1718.0,1553.0
135,2018/04/04,1696.0,1713.746,1718.0,31100,1747.0,1690.0
136,2018/04/05,1675.0,1688.407,1690.0,38100,1729.0,1666.0
137,2018/04/06,1620.0,1633.689,1714.0,60400,1714.0,1596.0
138,2018/04/09,1582.0,1585.355,1562.0,52900,1606.0,1561.0
139,2018/04/10,1557.0,1568.364,1588.0,47200,1597.0,1555.0
140,2018/04/11,1489.0,1520.419,1567.0,49700,1588.0,1482.0
141,2018/04/12,1491.0,1473.403,1476.0,27800,1510.0,1430.0
142,2018/04/13,1562.0,1505.137,1500.0,45900,1565.0,1476.0
143,2018/04/16,1480.0,1521.749,1582.0,35400,1583.0,1480.0
144,2018/04/17,1434.0,1425.561,1495.0,87500,1539.0,1350.0
145,2018/04/18,1450.0,1437.075,1418.0,37400,1470.0,1407.0
146,2018/04/19,1411.0,1425.708,1450.0,37700,1468.0,1399.0
147,2018/04/20,1430.0,1436.607,1423.0,18300,1459.0,1408.0
148,2018/04/23,1404.0,1416.272,1435.0,29400,1445.0,1400.0
149,2018/04/24,1525.0,1475.676,1421.0,57400,1547.0,1410.0
150,2018/04/25,1626.0,1569.253,1521.0,110400,1629.0,1491.0
151,2018/04/26,1643.0,1649.294,1654.0,95100,1694.0,1601.0
152,2018/04/27,1715.0,1703.882,1664.0,99200,1736.0,1653.0
153,2018/05/01,1564.0,1658.825,1693.0,93900,1731.0,1551.0
154,2018/05/02,1445.0,1426.612,1560.0,314100,1575.0,1370.0
155,2018/05/07,1428.0,1416.733,1433.0,75300,1442.0,1400.0
156,2018/05/08,1486.0,1478.234,1421.0,84300,1545.0,1409.0
157,2018/05/09,1555.0,1543.179,1504.0,102400,1577.0,1490.0
158,2018/05/10,1450.0,1454.683,1493.0,170800,1494.0,1435.0
159,2018/05/11,1504.0,1486.211,1438.0,47000,1523.0,1438.0
160,2018/05/14,1490.0,1499.978,1545.0,40700,1545.0,1472.0
161,2018/05/15,1438.0,1441.221,1451.0,65300,1463.0,1415.0
162,2018/05/16,1421.0,1404.232,1400.0,69400,1450.0,1390.0
163,2018/05/17,1450.0,1439.765,1415.0,64700,1450.0,1402.0
164,2018/05/18,1411.0,1422.518,1450.0,33400,1450.0,1401.0
165,2018/05/21,1395.0,1395.914,1410.0,93700,1420.0,1382.0
166,2018/05/22,1391.0,1397.017,1399.0,41700,1405.0,1387.0
167,2018/05/23,1391.0,1386.177,1397.0,36800,1401.0,1370.0
168,2018/05/24,1398.0,1411.618,1398.0,80300,1467.0,1390.0
169,2018/05/25,1373.0,1389.848,1391.0,31500,1409.0,1373.0
170,2018/05/28,1385.0,1384.26,1378.0,15000,1397.0,1376.0
171,2018/05/29,1352.0,1365.19,1386.0,59100,1417.0,1350.0
172,2018/05/30,1315.0,1300.743,1322.0,64500,1337.0,1280.0
173,2018/05/31,1276.0,1289.882,1300.0,82900,1305.0,1262.0
174,2018/06/01,1276.0,1277.813,1276.0,22400,1290.0,1269.0
175,2018/06/04,1218.0,1246.245,1285.0,60800,1300.0,1207.0
176,2018/06/05,1240.0,1244.051,1226.0,35200,1270.0,1223.0
177,2018/06/06,1178.0,1198.835,1225.0,78600,1226.0,1163.0
178,2018/06/07,1181.0,1177.83,1170.0,49400,1199.0,1168.0
179,2018/06/08,1195.0,1197.89,1199.0,66600,1202.0,1180.0
180,2018/06/11,1192.0,1196.264,1199.0,56100,1202.0,1183.0
181,2018/06/12,1157.0,1171.077,1200.0,92700,1202.0,1142.0
182,2018/06/13,1221.0,1203.764,1184.0,106500,1238.0,1160.0
183,2018/06/14,1218.0,1204.942,1202.0,77600,1235.0,1185.0
184,2018/06/15,1209.0,1212.526,1239.0,72300,1240.0,1192.0
185,2018/06/18,1317.0,1266.8,1225.0,86600,1329.0,1216.0
186,2018/06/19,1220.0,1302.407,1287.0,181500,1395.0,1215.0
187,2018/06/20,1250.0,1217.436,1235.0,74800,1260.0,1181.0
188,2018/06/21,1299.0,1283.285,1279.0,41400,1300.0,1255.0
189,2018/06/22,1335.0,1308.327,1263.0,60200,1343.0,1263.0
190,2018/06/25,1282.0,1316.918,1338.0,81500,1367.0,1280.0
191,2018/06/26,1311.0,1279.976,1288.0,20500,1313.0,1221.0
192,2018/06/27,1330.0,1321.714,1322.0,38800,1335.0,1299.0
193,2018/06/28,1362.0,1343.714,1360.0,50000,1364.0,1311.0
194,2018/06/29,1410.0,1394.354,1365.0,78000,1421.0,1350.0
195,2018/07/02,1328.0,1396.052,1420.0,95500,1448.0,1328.0
196,2018/07/03,1356.0,1347.584,1375.0,64900,1407.0,1300.0
197,2018/07/04,1336.0,1315.29,1329.0,61000,1356.0,1280.0
198,2018/07/05,1352.0,1365.01,1336.0,63000,1394.0,1336.0
199,2018/07/06,1406.0,1393.772,1389.0,64800,1417.0,1370.0
200,2018/07/09,1470.0,1462.487,1435.0,85400,1494.0,1429.0
201,2018/07/10,1519.0,1512.547,1500.0,114600,1546.0,1472.0
202,2018/07/11,1491.0,1496.669,1519.0,91500,1538.0,1442.0
203,2018/07/12,1474.0,1483.669,1513.0,31400,1513.0,1451.0
204,2018/07/13,1440.0,1444.157,1485.0,75600,1485.0,1400.0
205,2018/07/17,1368.0,1372.107,1435.0,78700,1435.0,1344.0
206,2018/07/18,1376.0,1343.742,1369.0,88600,1396.0,1298.0
207,2018/07/19,1344.0,1372.916,1389.0,63000,1412.0,1332.0
208,2018/07/20,1382.0,1365.1,1353.0,47900,1387.0,1337.0
209,2018/07/23,1372.0,1376.208,1378.0,31700,1398.0,1347.0
210,2018/07/24,1395.0,1379.04,1372.0,24800,1398.0,1359.0
211,2018/07/25,1481.0,1452.569,1406.0,76100,1488.0,1406.0
212,2018/07/26,1429.0,1457.469,1476.0,37300,1490.0,1423.0
213,2018/07/27,1391.0,1396.845,1445.0,52200,1445.0,1370.0
214,2018/07/30,1320.0,1341.465,1399.0,59400,1408.0,1311.0
215,2018/07/31,1275.0,1291.749,1300.0,49400,1317.0,1275.0
216,2018/08/01,1283.0,1282.452,1282.0,38700,1309.0,1260.0
217,2018/08/02,1310.0,1301.838,1280.0,23500,1324.0,1280.0
218,2018/08/03,1266.0,1280.75,1310.0,17200,1310.0,1260.0
219,2018/08/06,1220.0,1222.731,1237.0,41200,1257.0,1201.0
220,2018/08/07,1201.0,1196.184,1197.0,43500,1222.0,1180.0
221,2018/08/08,1210.0,1214.919,1201.0,35700,1233.0,1191.0
222,2018/08/09,1193.0,1209.378,1210.0,38400,1235.0,1193.0
223,2018/08/10,1187.0,1198.815,1208.0,47000,1225.0,1185.0
224,2018/08/13,1022.0,1070.118,1130.0,154700,1134.0,1004.0
225,2018/08/14,1036.0,1039.75,1053.0,46400,1062.0,1013.0
226,2018/08/15,1001.0,1008.507,1040.0,86400,1040.0,994.0
227,2018/08/16,971.0,981.345,1010.0,79800,1011.0,965.0
228,2018/08/17,1002.0,994.285,999.0,45700,1006.0,981.0
229,2018/08/20,996.0,998.517,1020.0,31900,1020.0,985.0
230,2018/08/21,969.0,967.431,996.0,44600,997.0,955.0
231,2018/08/22,996.0,975.535,965.0,50100,1004.0,939.0
232,2018/08/23,1009.0,1006.396,1005.0,33100,1020.0,991.0
233,2018/08/24,1073.0,1054.09,1020.0,52100,1085.0,1016.0
234,2018/08/27,1070.0,1070.531,1061.0,53500,1097.0,1055.0
235,2018/08/28,1097.0,1092.675,1098.0,64900,1113.0,1070.0
236,2018/08/29,1090.0,1090.475,1086.0,25900,1108.0,1082.0
237,2018/08/30,1112.0,1114.094,1096.0,35200,1129.0,1094.0
238,2018/08/31,1098.0,1096.332,1104.0,32800,1110.0,1082.0
239,2018/09/03,1057.0,1070.359,1091.0,29000,1095.0,1047.0
240,2018/09/04,1067.0,1055.373,1035.0,15000,1080.0,1034.0
241,2018/09/05,1074.0,1088.142,1069.0,20500,1112.0,1069.0
242,2018/09/06,1054.0,1069.656,1086.0,22100,1089.0,1050.0
243,2018/09/07,1055.0,1045.635,1054.0,22200,1076.0,1028.0
244,2018/09/10,1048.0,1042.956,1061.0,20300,1061.0,1028.0
245,2018/09/11,1035.0,1038.209,1048.0,12900,1048.0,1031.0
246,2018/09/12,1003.0,1013.417,1036.0,27600,1042.0,1000.0
247,2018/09/13,1002.0,1000.198,1000.0,23700,1016.0,991.0
248,2018/09/14,1050.0,1039.396,1029.0,21700,1059.0,1011.0
249,2018/09/18,1002.0,1028.035,1030.0,70700,1072.0,1002.0
250,2018/09/19,1019.0,1013.607,1007.0,25700,1034.0,1005.0
251,2018/09/20,1025.0,1016.357,1021.0,15700,1032.0,1007.0
252,2018/09/21,1114.0,1081.222,1021.0,127800,1124.0,1005.0
253,2018/09/25,1120.0,1102.891,1100.0,57800,1139.0,1075.0
254,2018/09/26,1105.0,1124.335,1118.0,54600,1145.0,1101.0
255,2018/09/27,1051.0,1088.326,1100.0,71200,1130.0,1045.0
256,2018/09/28,1079.0,1085.512,1051.0,47700,1116.0,1051.0
257,2018/10/01,1087.0,1089.021,1094.0,14400,1098.0,1078.0
258,2018/10/02,1022.0,1037.855,1087.0,73000,1100.0,1002.0
259,2018/10/03,1068.0,1042.253,1022.0,52200,1077.0,1011.0
260,2018/10/04,1048.0,1054.194,1085.0,24800,1085.0,1040.0
261,2018/10/05,1052.0,1027.028,1028.0,35400,1052.0,1010.0
262,2018/10/09,1018.0,1013.713,1040.0,20200,1040.0,1003.0
263,2018/10/10,999.0,1002.338,1005.0,39400,1020.0,991.0
264,2018/10/11,935.0,928.937,939.0,77600,945.0,911.0
265,2018/10/12,971.0,946.863,922.0,21100,974.0,922.0
266,2018/10/15,951.0,962.572,972.0,16600,975.0,951.0
267,2018/10/16,946.0,940.514,947.0,21000,956.0,932.0
268,2018/10/17,961.0,964.4,959.0,18500,972.0,953.0
269,2018/10/18,963.0,960.468,962.0,27800,975.0,949.0
270,2018/10/19,974.0,981.898,961.0,30400,1008.0,947.0
271,2018/10/22,1050.0,1029.848,975.0,103900,1070.0,961.0
272,2018/10/23,1040.0,1057.103,1077.0,73000,1077.0,1034.0
273,2018/10/24,1002.0,1007.905,1046.0,47500,1055.0,980.0
274,2018/10/25,936.0,943.796,946.0,56000,960.0,935.0
275,2018/10/26,835.0,861.567,952.0,101100,952.0,800.0
276,2018/10/29,766.0,798.924,831.0,100300,863.0,756.0
277,2018/10/30,796.0,742.393,751.0,171500,797.0,708.0
278,2018/10/31,836.0,808.673,811.0,57100,837.0,780.0
279,2018/11/01,811.0,819.091,830.0,20800,832.0,807.0
280,2018/11/02,875.0,863.326,826.0,64100,882.0,826.0
281,2018/11/05,911.0,896.193,890.0,59200,919.0,871.0
282,2018/11/06,894.0,905.24,930.0,34200,935.0,884.0
283,2018/11/07,910.0,908.0,894.0,22500,925.0,880.0
284,2018/11/08,922.0,934.496,926.0,25200,944.0,921.0
285,2018/11/09,930.0,922.579,929.0,30400,938.0,901.0
286,2018/11/12,902.0,906.693,922.0,23100,927.0,887.0
287,2018/11/13,886.0,866.43,850.0,48200,899.0,828.0
288,2018/11/14,865.0,864.375,880.0,44500,880.0,845.0
289,2018/11/15,811.0,825.248,814.0,64000,853.0,811.0
290,2018/11/16,763.0,780.984,810.0,57300,810.0,762.0
291,2018/11/19,804.0,795.356,772.0,55900,815.0,772.0
292,2018/11/20,770.0,779.498,798.0,29100,798.0,770.0
293,2018/11/21,782.0,772.814,760.0,40300,795.0,754.0
294,2018/11/22,778.0,772.929,767.0,58800,792.0,767.0
295,2018/11/26,830.0,805.042,780.0,52100,846.0,775.0
296,2018/11/27,812.0,817.132,828.0,21200,829.0,807.0
297,2018/11/28,836.0,824.341,820.0,25800,836.0,803.0
298,2018/11/29,870.0,861.447,837.0,37800,880.0,832.0
299,2018/11/30,854.0,855.442,870.0,40300,870.0,840.0
300,2018/12/03,856.0,865.228,869.0,25400,878.0,853.0
301,2018/12/04,847.0,866.577,860.0,37800,888.0,840.0
302,2018/12/05,848.0,834.693,824.0,17900,850.0,816.0
303,2018/12/06,797.0,802.988,850.0,49800,850.0,775.0
304,2018/12/07,792.0,802.705,810.0,28800,820.0,782.0
305,2018/12/10,765.0,753.247,762.0,56700,770.0,738.0
306,2018/12/11,730.0,749.925,765.0,44000,781.0,729.0
307,2018/12/12,737.0,731.536,734.0,75500,750.0,712.0
308,2018/12/13,732.0,721.893,730.0,70100,737.0,712.0
309,2018/12/14,723.0,722.337,741.0,46600,742.0,707.0
310,2018/12/17,711.0,708.954,711.0,43700,717.0,700.0
311,2018/12/18,641.0,659.435,676.0,83300,683.0,636.0
312,2018/12/19,648.0,638.186,638.0,56900,651.0,620.0
313,2018/12/20,601.0,617.518,628.0,84600,647.0,597.0
314,2018/12/21,570.0,570.138,593.0,98800,600.0,550.0
315,2018/12/25,492.0,514.093,530.0,164000,540.0,488.0
316,2018/12/26,518.0,518.036,550.0,78200,550.0,499.0
317,2018/12/27,562.0,562.351,558.0,98800,584.0,550.0
318,2018/12/28,554.0,547.705,552.0,50200,559.0,539.0
319,2019/01/04,542.0,521.151,514.0,55600,554.0,509.0
320,2019/01/07,616.0,611.234,582.0,102800,635.0,579.0
321,2019/01/08,647.0,632.358,600.0,89700,660.0,600.0
322,2019/01/09,641.0,655.881,655.0,82300,673.0,640.0
323,2019/01/10,652.0,641.622,648.0,54700,657.0,615.0
324,2019/01/11,752.0,752.0,752.0,54200,752.0,752.0
325,2019/01/15,795.0,753.192,740.0,207500,800.0,703.0
326,2019/01/16,806.0,829.313,830.0,170900,885.0,773.0
327,2019/01/17,803.0,795.002,791.0,56100,824.0,781.0
328,2019/01/18,809.0,804.244,801.0,35600,824.0,779.0
329,2019/01/21,752.0,791.14,822.0,63100,840.0,747.0
330,2019/01/22,762.0,742.117,747.0,51400,769.0,714.0
331,2019/01/23,753.0,747.749,745.0,24300,757.0,736.0
332,2019/01/24,762.0,765.0,782.0,23300,782.0,754.0
333,2019/01/25,769.0,765.146,762.0,24700,778.0,754.0
334,2019/01/28,727.0,741.251,763.0,28300,763.0,722.0
335,2019/01/29,753.0,734.319,726.0,31000,759.0,714.0
336,2019/01/30,691.0,709.31,750.0,56200,750.0,686.0
337,2019/01/31,726.0,722.497,716.0,37600,739.0,693.0
338,2019/02/01,724.0,726.846,737.0,19500,739.0,713.0
339,2019/02/04,802.0,775.316,730.0,71600,810.0,730.0
340,2019/02/05,763.0,777.64,802.0,46600,802.0,756.0
341,2019/02/06,749.0,753.372,786.0,33100,786.0,736.0
342,2019/02/07,737.0,737.167,764.0,25200,764.0,729.0
343,2019/02/08,728.0,717.938,722.0,40600,738.0,700.0
344,2019/02/12,785.0,776.77,753.0,52200,798.0,745.0
345,2019/02/13,821.0,812.84,800.0,105600,832.0,776.0
346,2019/02/14,891.0,863.112,832.0,166900,896.0,824.0
347,2019/02/15,984.0,1008.803,996.0,860800,1041.0,950.0
348,2019/02/18,1063.0,1023.344,999.0,618100,1090.0,957.0
349,2019/02/19,1033.0,1043.401,1058.0,224500,1080.0,1011.0
350,2019/02/20,1034.0,1059.14,1059.0,248400,1100.0,1015.0
351,2019/02/21,1035.0,1038.733,1044.0,141300,1069.0,1003.0
352,2019/02/22,1008.0,1008.151,1021.0,152700,1044.0,989.0
353,2019/02/25,1041.0,1065.638,1032.0,374800,1129.0,996.0
354,2019/02/26,1029.0,1033.3,1038.0,123700,1080.0,1002.0
355,2019/02/27,1080.0,1054.007,1030.0,118700,1090.0,1008.0
356,2019/02/28,1163.0,1148.045,1094.0,489300,1218.0,1080.0
357,2019/03/01,1148.0,1158.254,1160.0,170300,1188.0,1133.0
358,2019/03/04,1161.0,1142.585,1176.0,88200,1180.0,1125.0
359,2019/03/05,1126.0,1124.057,1140.0,100300,1158.0,1095.0
360,2019/03/06,1129.0,1100.763,1114.0,111900,1138.0,1063.0
361,2019/03/07,1070.0,1066.345,1103.0,146400,1113.0,1040.0
362,2019/03/08,1020.0,1016.655,1025.0,155000,1046.0,996.0
363,2019/03/11,1034.0,1022.329,1019.0,119600,1069.0,976.0
364,2019/03/12,1030.0,1055.904,1051.0,94400,1084.0,1029.0
365,2019/03/13,1096.0,1074.791,1041.0,152400,1108.0,1033.0
366,2019/03/14,1127.0,1099.793,1094.0,145700,1134.0,1061.0
367,2019/03/15,972.0,1002.526,1068.0,622600,1083.0,916.0
368,2019/03/18,948.0,938.688,987.0,246400,988.0,914.0
369,2019/03/19,959.0,947.968,941.0,125600,970.0,920.0
370,2019/03/20,925.0,932.293,951.0,94100,955.0,921.0
371,2019/03/22,911.0,917.81,940.0,88300,940.0,902.0
372,2019/03/25,883.0,873.326,868.0,176900,902.0,852.0
373,2019/03/26,924.0,926.434,928.0,249300,954.0,888.0
374,2019/03/27,947.0,948.485,951.0,116100,969.0,922.0
375,2019/03/28,908.0,915.578,930.0,108200,933.0,900.0
376,2019/03/29,936.0,923.898,910.0,146800,943.0,895.0
377,2019/04/01,937.0,951.01,955.0,173900,976.0,922.0
378,2019/04/02,910.0,926.096,950.0,122800,966.0,906.0
379,2019/04/03,930.0,933.672,913.0,103800,955.0,911.0
380,2019/04/04,904.0,909.269,931.0,138500,946.0,891.0
381,2019/04/05,913.0,909.582,907.0,79200,925.0,895.0
382,2019/04/08,907.0,907.634,925.0,57700,930.0,898.0
383,2019/04/09,869.0,880.895,907.0,130200,912.0,864.0
384,2019/04/10,873.0,862.191,862.0,70000,876.0,838.0
385,2019/04/11,847.0,849.492,877.0,89200,877.0,835.0
386,2019/04/12,834.0,840.1,849.0,69900,863.0,827.0
387,2019/04/15,873.0,856.368,839.0,66000,879.0,836.0
388,2019/04/16,853.0,860.265,876.0,57700,877.0,846.0
389,2019/04/17,872.0,871.033,868.0,63000,894.0,854.0
390,2019/04/18,833.0,853.456,877.0,88800,884.0,830.0
391,2019/04/19,835.0,843.29,843.0,40700,860.0,829.0
392,2019/04/22,860.0,868.229,865.0,72800,890.0,849.0
393,2019/04/23,852.0,851.39,860.0,36700,864.0,839.0
394,2019/04/24,859.0,868.08,860.0,47700,883.0,854.0
395,2019/04/25,863.0,859.252,856.0,25400,868.0,853.0
396,2019/04/26,874.0,855.118,850.0,59100,874.0,837.0
397,2019/05/07,886.0,885.96,860.0,59200,902.0,860.0
398,2019/05/08,866.0,855.007,872.0,67900,872.0,842.0
399,2019/05/09,832.0,843.53,860.0,67400,871.0,831.0
400,2019/05/10,876.0,841.626,833.0,87400,880.0,770.0
401,2019/05/13,921.0,905.611,903.0,251200,924.0,885.0
402,2019/05/14,975.0,948.312,892.0,535800,979.0,881.0
403,2019/05/15,946.0,959.403,986.0,403000,990.0,932.0
404,2019/05/16,796.0,812.658,826.0,381100,836.0,796.0
405,2019/05/17,789.0,798.038,808.0,165200,818.0,781.0
406,2019/05/20,728.0,736.758,778.0,233900,780.0,713.0
407,2019/05/21,697.0,701.054,713.0,154700,717.0,685.0
408,2019/05/22,706.0,711.557,706.0,120600,735.0,694.0
409,2019/05/23,701.0,707.433,707.0,80700,720.0,697.0
410,2019/05/24,700.0,700.229,696.0,68100,717.0,690.0
411,2019/05/27,704.0,703.926,715.0,75200,718.0,692.0
412,2019/05/28,708.0,709.92,702.0,45100,719.0,701.0
413,2019/05/29,692.0,695.406,701.0,80000,708.0,685.0
414,2019/05/30,669.0,673.289,682.0,119100,696.0,663.0
415,2019/05/31,663.0,670.445,679.0,65000,683.0,660.0
416,2019/06/03,620.0,632.24,650.0,87500,652.0,617.0
417,2019/06/04,622.0,632.034,640.0,83500,653.0,618.0
418,2019/06/05,635.0,639.892,640.0,85400,658.0,624.0
419,2019/06/06,623.0,629.853,640.0,50300,640.0,622.0
420,2019/06/07,635.0,630.684,624.0,39600,639.0,615.0
421,2019/06/10,637.0,641.242,638.0,55800,652.0,636.0
422,2019/06/11,632.0,635.908,633.0,49900,647.0,625.0
423,2019/06/12,637.0,634.301,633.0,59800,650.0,626.0
424,2019/06/13,623.0,625.585,631.0,66000,639.0,618.0
425,2019/06/14,644.0,640.541,630.0,38100,648.0,625.0
426,2019/06/17,630.0,633.754,643.0,36100,644.0,627.0
427,2019/06/18,622.0,628.663,630.0,62000,643.0,618.0
428,2019/06/19,635.0,632.955,625.0,50800,642.0,622.0
429,2019/06/20,652.0,648.2,641.0,43100,658.0,638.0
430,2019/06/21,643.0,653.074,657.0,44800,666.0,643.0
431,2019/06/24,638.0,636.281,644.0,28100,645.0,630.0
432,2019/06/25,632.0,634.979,633.0,23700,646.0,632.0
433,2019/06/26,627.0,628.631,630.0,34100,640.0,623.0
434,2019/06/27,639.0,635.407,634.0,16700,641.0,627.0
435,2019/06/28,652.0,648.618,639.0,49200,656.0,639.0
436,2019/07/01,676.0,672.028,662.0,80000,681.0,662.0
437,2019/07/02,723.0,703.56,680.0,176900,724.0,675.0
438,2019/07/03,722.0,713.535,724.0,194000,728.0,697.0
439,2019/07/04,716.0,718.464,725.0,100000,737.0,703.0
440,2019/07/05,713.0,717.596,715.0,59600,724.0,711.0
441,2019/07/08,701.0,705.904,718.0,73600,720.0,698.0
442,2019/07/09,712.0,712.694,705.0,88600,725.0,701.0
443,2019/07/10,713.0,710.181,716.0,26500,716.0,704.0
444,2019/07/11,715.0,716.611,716.0,45500,726.0,708.0
445,2019/07/12,710.0,713.035,720.0,43100,721.0,705.0
446,2019/07/16,685.0,689.592,707.0,55900,710.0,678.0
447,2019/07/17,702.0,691.539,695.0,40600,706.0,679.0
448,2019/07/18,670.0,678.545,692.0,54900,697.0,665.0
449,2019/07/19,737.0,719.285,680.0,179700,737.0,680.0
450,2019/07/22,815.0,814.052,803.0,739900,845.0,790.0
451,2019/07/23,813.0,812.929,815.0,141600,822.0,797.0
452,2019/07/24,773.0,791.867,827.0,195900,827.0,770.0
453,2019/07/25,782.0,787.697,774.0,84800,798.0,774.0
454,2019/07/26,760.0,766.947,777.0,60300,780.0,757.0
455,2019/07/29,791.0,784.183,768.0,79900,800.0,768.0
456,2019/07/30,784.0,787.372,794.0,45200,799.0,780.0
457,2019/07/31,811.0,792.984,783.0,69400,813.0,767.0
458,2019/08/01,808.0,810.727,800.0,72900,824.0,795.0
459,2019/08/02,796.0,788.836,785.0,88000,799.0,780.0
460,2019/08/05,773.0,766.019,800.0,111200,802.0,746.0
461,2019/08/06,778.0,752.159,733.0,56000,780.0,724.0
462,2019/08/07,759.0,771.016,793.0,50000,793.0,759.0
463,2019/08/08,768.0,761.919,760.0,28500,773.0,753.0
464,2019/08/09,772.0,770.33,772.0,39700,779.0,762.0
465,2019/08/13,658.0,668.723,667.0,222500,693.0,653.0
466,2019/08/14,659.0,658.851,656.0,69800,669.0,655.0
467,2019/08/15,653.0,636.092,640.0,87000,655.0,627.0
468,2019/08/16,645.0,642.159,653.0,47700,653.0,631.0
469,2019/08/19,644.0,647.293,647.0,20800,654.0,642.0
470,2019/08/20,648.0,647.302,644.0,34100,656.0,640.0
471,2019/08/21,651.0,648.614,648.0,29000,661.0,638.0
472,2019/08/22,635.0,640.037,650.0,34800,654.0,630.0
473,2019/08/23,634.0,633.097,636.0,22700,637.0,630.0
