,Date,Close,VWAP,Open,Volume,High,Low
0,2014/08/25,547.0,537.429,535.0,119000,547.0,531.0
1,2014/08/26,561.0,565.028,554.0,214000,575.0,554.0
2,2014/08/27,562.0,566.116,570.0,216000,580.0,558.0
3,2014/08/28,558.0,560.178,565.0,163000,568.0,556.0
4,2014/08/29,556.0,557.837,558.0,147000,567.0,552.0
5,2014/09/01,551.0,548.669,558.0,145000,560.0,542.0
6,2014/09/02,540.0,545.963,559.0,164000,559.0,537.0
7,2014/09/03,539.0,537.792,540.0,130000,543.0,531.0
8,2014/09/04,531.0,530.874,536.0,127000,536.0,525.0
9,2014/09/05,534.0,531.613,539.0,75000,539.0,526.0
10,2014/09/08,550.0,548.839,541.0,230000,558.0,539.0
11,2014/09/09,545.0,551.047,555.0,191000,558.0,542.0
12,2014/09/10,567.0,559.747,550.0,194000,567.0,544.0
13,2014/09/11,592.0,579.312,567.0,378000,592.0,562.0
14,2014/09/12,614.0,605.844,592.0,224000,614.0,591.0
15,2014/09/16,646.0,624.86,611.0,257000,648.0,610.0
16,2014/09/17,631.0,635.211,640.0,171000,646.0,626.0
17,2014/09/18,640.0,635.727,621.0,245000,648.0,617.0
18,2014/09/19,639.0,642.606,643.0,109000,646.0,639.0
19,2014/09/22,624.0,625.313,639.0,147000,639.0,617.0
20,2014/09/24,607.0,612.073,618.0,109000,618.0,607.0
21,2014/09/25,610.0,608.088,606.0,102000,620.0,604.0
22,2014/09/26,626.0,619.881,601.0,160000,631.0,600.0
23,2014/09/29,662.0,651.174,636.0,453000,666.0,635.0
24,2014/09/30,659.0,658.314,670.0,665000,674.0,637.0
25,2014/10/01,682.0,684.888,669.0,587000,720.0,666.0
26,2014/10/02,696.0,681.285,670.0,466000,710.0,657.0
27,2014/10/03,665.0,677.305,696.0,472000,715.0,652.0
28,2014/10/06,678.0,671.009,668.0,235000,688.0,652.0
29,2014/10/07,675.0,679.201,678.0,209000,689.0,675.0
30,2014/10/08,670.0,664.66,660.0,153000,672.0,659.0
31,2014/10/09,626.0,641.547,670.0,333000,674.0,625.0
32,2014/10/10,606.0,603.883,604.0,247000,616.0,591.0
33,2014/10/14,592.0,592.429,590.0,119000,599.0,582.0
34,2014/10/15,608.0,608.011,596.0,186000,621.0,596.0
35,2014/10/16,582.0,586.75,589.0,148000,595.0,580.0
36,2014/10/17,569.0,573.598,582.0,189000,588.0,564.0
37,2014/10/20,609.0,601.825,596.0,206000,611.0,590.0
38,2014/10/21,618.0,624.549,611.0,501000,644.0,611.0
39,2014/10/22,619.0,628.587,632.0,213000,638.0,618.0
40,2014/10/23,619.0,621.759,627.0,108000,627.0,618.0
41,2014/10/24,657.0,652.795,642.0,263000,664.0,637.0
42,2014/10/27,660.0,654.75,658.0,204000,664.0,645.0
43,2014/10/28,655.0,656.653,659.0,98000,660.0,651.0
44,2014/10/29,682.0,679.173,657.0,359000,700.0,655.0
45,2014/10/30,691.0,687.397,684.0,214000,694.0,682.0
46,2014/10/31,699.0,696.071,686.0,322000,707.0,683.0
47,2014/11/04,694.0,696.616,715.0,370000,717.0,685.0
48,2014/11/05,694.0,694.533,695.0,165000,705.0,682.0
49,2014/11/06,729.0,708.941,697.0,372000,729.0,693.0
50,2014/11/07,743.0,743.753,750.0,259000,750.0,732.0
51,2014/11/10,735.0,739.906,743.0,192000,747.0,733.0
52,2014/11/11,715.0,720.22,735.0,218000,735.0,707.0
53,2014/11/12,708.0,718.884,715.0,232000,730.0,708.0
54,2014/11/13,698.0,698.183,704.0,208000,706.0,685.0
55,2014/11/14,741.0,727.64,697.0,417000,745.0,697.0
56,2014/11/17,745.0,735.498,734.0,580000,745.0,719.0
57,2014/11/18,763.0,753.222,731.0,499000,770.0,731.0
58,2014/11/19,804.0,787.429,762.0,595000,807.0,760.0
59,2014/11/20,832.0,824.815,810.0,879000,841.0,804.0
60,2014/11/21,792.0,806.509,825.0,691000,840.0,789.0
61,2014/11/25,799.0,798.726,804.0,449000,804.0,792.0
62,2014/11/26,775.0,779.242,797.0,363000,799.0,768.0
63,2014/11/27,795.0,789.896,790.0,173000,799.0,777.0
64,2014/11/28,795.0,786.667,795.0,180000,795.0,775.0
65,2014/12/01,785.0,794.154,795.0,319000,817.0,782.0
66,2014/12/02,785.0,785.332,790.0,244000,792.0,779.0
67,2014/12/03,799.0,790.764,791.0,229000,799.0,785.0
68,2014/12/04,816.0,807.739,800.0,468000,823.0,796.0
69,2014/12/05,807.0,807.772,819.0,171000,819.0,802.0
70,2014/12/08,795.0,800.951,814.0,164000,814.0,791.0
71,2014/12/09,795.0,791.446,780.0,157000,800.0,780.0
72,2014/12/10,780.0,777.981,781.0,265000,788.0,770.0
73,2014/12/11,783.0,766.225,759.0,311000,789.0,751.0
74,2014/12/12,792.0,791.788,784.0,184000,800.0,784.0
75,2014/12/15,782.0,783.239,779.0,155000,792.0,778.0
76,2014/12/16,765.0,770.24,773.0,175000,780.0,765.0
77,2014/12/17,767.0,764.817,760.0,142000,771.0,755.0
78,2014/12/18,750.0,761.407,776.0,324000,783.0,749.0
79,2014/12/19,731.0,737.15,757.0,360000,764.0,718.0
80,2014/12/22,780.0,767.355,746.0,397000,788.0,745.0
81,2014/12/24,767.0,783.369,781.0,783000,811.0,762.0
82,2014/12/25,774.0,774.033,767.0,605000,788.0,764.0
83,2014/12/26,732.0,719.474,716.0,1245000,740.0,703.0
84,2014/12/29,765.0,743.189,734.0,444000,765.0,731.0
85,2014/12/30,750.0,758.496,760.0,250000,770.0,750.0
86,2015/01/05,774.0,766.16,764.0,262000,775.0,755.0
87,2015/01/06,768.0,764.216,766.0,319000,773.0,759.0
88,2015/01/07,767.0,765.273,764.0,128000,773.0,762.0
89,2015/01/08,754.0,759.203,765.0,138000,768.0,753.0
90,2015/01/09,749.0,750.075,756.0,134000,756.0,746.0
91,2015/01/13,754.0,740.006,739.0,183000,754.0,727.0
92,2015/01/14,739.0,741.803,751.0,76000,751.0,734.0
93,2015/01/15,751.0,741.814,734.0,102000,753.0,734.0
94,2015/01/16,760.0,751.321,751.0,137000,760.0,746.0
95,2015/01/19,751.0,749.772,757.0,114000,757.0,746.0
96,2015/01/20,748.0,748.308,751.0,107000,751.0,743.0
97,2015/01/21,748.0,745.84,748.0,125000,751.0,740.0
98,2015/01/22,738.0,740.698,747.0,106000,747.0,736.0
99,2015/01/23,739.0,736.878,738.0,82000,740.0,735.0
100,2015/01/26,738.0,738.365,739.0,63000,741.0,735.0
101,2015/01/27,742.0,740.754,743.0,57000,744.0,738.0
102,2015/01/28,764.0,757.069,740.0,144000,773.0,740.0
103,2015/01/29,764.0,765.911,764.0,90000,774.0,762.0
104,2015/01/30,789.0,779.661,769.0,274000,789.0,765.0
105,2015/02/02,777.0,779.449,783.0,78000,784.0,771.0
106,2015/02/03,782.0,780.874,783.0,183000,784.0,777.0
107,2015/02/04,772.0,776.491,783.0,163000,783.0,771.0
108,2015/02/05,757.0,765.073,770.0,96000,772.0,757.0
109,2015/02/06,745.0,751.459,758.0,61000,764.0,745.0
110,2015/02/09,740.0,742.054,740.0,37000,747.0,740.0
111,2015/02/10,739.0,739.755,738.0,53000,741.0,738.0
112,2015/02/12,753.0,749.812,754.0,85000,754.0,741.0
113,2015/02/13,733.0,739.142,741.0,113000,746.0,733.0
114,2015/02/16,730.0,732.022,740.0,92000,741.0,727.0
115,2015/02/17,740.0,737.438,739.0,128000,744.0,731.0
116,2015/02/18,778.0,764.428,750.0,374000,780.0,745.0
117,2015/02/19,801.0,805.531,785.0,703000,824.0,785.0
118,2015/02/20,804.0,805.818,803.0,253000,814.0,802.0
119,2015/02/23,809.0,813.534,811.0,494000,822.0,806.0
120,2015/02/24,804.0,802.662,805.0,198000,810.0,795.0
121,2015/02/25,800.0,799.103,804.0,155000,807.0,793.0
122,2015/02/26,802.0,790.329,785.0,410000,804.0,785.0
123,2015/02/27,805.0,800.214,802.0,89000,805.0,793.0
124,2015/03/02,822.0,815.401,805.0,237000,824.0,805.0
125,2015/03/03,818.0,821.543,823.0,140000,827.0,815.0
126,2015/03/04,816.0,810.072,811.0,83000,817.0,806.0
127,2015/03/05,824.0,835.24,820.0,429000,849.0,815.0
128,2015/03/06,883.0,859.23,824.0,448000,886.0,824.0
129,2015/03/09,927.0,916.386,895.0,373000,937.0,886.0
130,2015/03/10,917.0,935.038,940.0,422000,953.0,906.0
131,2015/03/11,922.0,908.113,905.0,275000,938.0,891.0
132,2015/03/12,949.0,954.307,924.0,306000,967.0,924.0
133,2015/03/13,952.0,953.235,959.0,132000,959.0,942.0
134,2015/03/16,1001.0,979.631,937.0,528000,1006.0,936.0
135,2015/03/17,990.0,999.559,1000.0,474000,1015.0,986.0
136,2015/03/18,992.0,989.96,980.0,150000,1004.0,980.0
137,2015/03/19,1030.0,1015.242,990.0,236000,1044.0,985.0
138,2015/03/20,1012.0,1010.466,1030.0,161000,1030.0,995.0
139,2015/03/23,1072.0,1055.45,1024.0,249000,1080.0,1024.0
140,2015/03/24,1062.0,1063.034,1075.0,204000,1080.0,1031.0
141,2015/03/25,1090.0,1090.469,1063.0,222000,1177.0,1063.0
142,2015/03/26,1079.0,1078.783,1093.0,138000,1100.0,1063.0
143,2015/03/27,1092.0,1114.432,1080.0,296000,1155.0,1080.0
144,2015/03/30,1119.0,1127.71,1100.0,314000,1146.0,1093.0
145,2015/03/31,1419.0,1419.0,1419.0,220000,1419.0,1419.0
146,2015/04/01,1471.0,1452.637,1360.0,3970000,1570.0,1286.0
147,2015/04/02,1425.0,1446.825,1463.0,765000,1505.0,1419.0
148,2015/04/03,1554.0,1533.187,1425.0,1213000,1619.0,1413.0
149,2015/04/06,1826.0,1753.906,1537.0,2553000,1835.0,1513.0
150,2015/04/07,1726.0,1746.987,1796.0,1329000,1818.0,1713.0
151,2015/04/08,1728.0,1714.105,1703.0,736000,1756.0,1672.0
152,2015/04/09,1642.0,1659.073,1710.0,615000,1728.0,1611.0
153,2015/04/10,1722.0,1714.329,1669.0,706000,1749.0,1656.0
154,2015/04/13,1724.0,1726.066,1714.0,411000,1768.0,1681.0
155,2015/04/14,1738.0,1730.434,1688.0,316000,1750.0,1688.0
156,2015/04/15,1730.0,1730.906,1738.0,245000,1767.0,1711.0
157,2015/04/16,1706.0,1721.229,1737.0,358000,1760.0,1683.0
158,2015/04/17,1686.0,1697.29,1726.0,255000,1726.0,1678.0
159,2015/04/20,1630.0,1647.206,1646.0,282000,1678.0,1628.0
160,2015/04/21,1719.0,1689.016,1623.0,509000,1719.0,1620.0
161,2015/04/22,1805.0,1780.088,1730.0,967000,1817.0,1722.0
162,2015/04/23,1720.0,1742.305,1780.0,630000,1816.0,1705.0
163,2015/04/24,1694.0,1705.469,1720.0,343000,1750.0,1682.0
164,2015/04/27,1680.0,1695.816,1686.0,152000,1720.0,1680.0
165,2015/04/28,1680.0,1694.609,1706.0,174000,1714.0,1680.0
166,2015/04/30,1642.0,1645.646,1660.0,384000,1670.0,1628.0
167,2015/05/01,1675.0,1666.379,1665.0,153000,1684.0,1651.0
168,2015/05/07,1617.0,1633.663,1673.0,353000,1694.0,1610.0
169,2015/05/08,1581.0,1593.787,1592.0,258000,1627.0,1581.0
170,2015/05/11,1600.0,1569.98,1588.0,348000,1601.0,1527.0
171,2015/05/12,1590.0,1567.187,1598.0,246000,1599.0,1531.0
172,2015/05/13,1649.0,1602.46,1564.0,224000,1649.0,1560.0
173,2015/05/14,1622.0,1634.722,1627.0,133000,1655.0,1615.0
174,2015/05/15,1598.0,1607.685,1601.0,130000,1634.0,1595.0
175,2015/05/18,1623.0,1610.146,1607.0,103000,1623.0,1600.0
176,2015/05/19,1698.0,1674.467,1610.0,328000,1700.0,1610.0
177,2015/05/20,1720.0,1741.433,1725.0,522000,1768.0,1720.0
178,2015/05/21,1707.0,1710.479,1720.0,169000,1723.0,1686.0
179,2015/05/22,1697.0,1693.573,1700.0,232000,1717.0,1674.0
180,2015/05/25,1698.0,1706.927,1721.0,68000,1721.0,1698.0
181,2015/05/26,1689.0,1685.711,1695.0,97000,1706.0,1675.0
182,2015/05/27,1683.0,1678.291,1693.0,103000,1693.0,1665.0
183,2015/05/28,1681.0,1694.038,1684.0,157000,1708.0,1681.0
184,2015/05/29,1720.0,1717.462,1681.0,563000,1735.0,1681.0
185,2015/06/01,1738.0,1732.441,1720.0,186000,1745.0,1718.0
186,2015/06/02,1769.0,1768.105,1738.0,324000,1784.0,1738.0
187,2015/06/03,1739.0,1739.683,1769.0,221000,1769.0,1721.0
188,2015/06/04,1747.0,1752.478,1750.0,251000,1774.0,1740.0
189,2015/06/05,1719.0,1729.441,1755.0,84000,1755.0,1719.0
190,2015/06/08,1726.0,1723.488,1734.0,84000,1734.0,1712.0
191,2015/06/09,1719.0,1722.564,1726.0,133000,1741.0,1710.0
192,2015/06/10,1742.0,1739.757,1720.0,148000,1758.0,1720.0
193,2015/06/11,1848.0,1820.04,1778.0,988000,1848.0,1773.0
194,2015/06/12,1798.0,1821.718,1850.0,503000,1869.0,1791.0
195,2015/06/15,1816.0,1821.741,1819.0,309000,1834.0,1806.0
196,2015/06/16,1851.0,1833.779,1832.0,589000,1851.0,1800.0
197,2015/06/17,1965.0,1906.3,1867.0,1261000,1965.0,1856.0
198,2015/06/18,1939.0,1937.656,1995.0,715000,1995.0,1858.0
199,2015/06/19,1960.0,1959.175,1960.0,582000,1976.0,1931.0
200,2015/06/22,2055.0,2009.36,1980.0,734000,2056.0,1961.0
201,2015/06/23,2004.0,2024.045,2079.0,1724000,2080.0,1971.0
202,2015/06/24,2008.0,2021.314,2019.0,672000,2050.0,2001.0
203,2015/06/25,2015.0,2008.125,2006.0,168000,2022.0,1995.0
204,2015/06/26,2027.0,2041.606,2015.0,381000,2069.0,2013.0
205,2015/06/29,1999.0,1975.097,1910.0,568000,2039.0,1891.0
206,2015/06/30,1890.0,1921.867,1959.0,757000,2005.0,1870.0
207,2015/07/01,1990.0,1955.952,1909.0,458000,1990.0,1903.0
208,2015/07/02,1986.0,1979.831,2003.0,403000,2016.0,1960.0
209,2015/07/03,1924.0,1930.27,1986.0,426000,1987.0,1896.0
210,2015/07/06,1886.0,1897.99,1890.0,306000,1932.0,1869.0
211,2015/07/07,1853.0,1881.932,1909.0,294000,1920.0,1852.0
212,2015/07/08,1701.0,1753.137,1861.0,997000,1876.0,1689.0
213,2015/07/09,1826.0,1733.81,1600.0,1355000,1843.0,1600.0
214,2015/07/10,1826.0,1833.872,1796.0,508000,1868.0,1795.0
215,2015/07/13,1923.0,1885.223,1846.0,390000,1927.0,1840.0
216,2015/07/14,1941.0,1946.595,1973.0,464000,1978.0,1915.0
217,2015/07/15,1968.0,1958.587,1949.0,441000,1970.0,1939.0
218,2015/07/16,1995.0,1976.556,1973.0,374000,1995.0,1955.0
219,2015/07/17,1998.0,1991.674,1999.0,221000,1999.0,1982.0
220,2015/07/21,2034.0,2017.633,1995.0,444000,2035.0,1990.0
221,2015/07/22,2006.0,1996.942,2015.0,294000,2020.0,1970.0
222,2015/07/23,1961.0,1966.164,2006.0,385000,2015.0,1954.0
223,2015/07/24,1957.0,1959.005,1961.0,219000,1978.0,1936.0
224,2015/07/27,1961.0,1965.611,1940.0,257000,1986.0,1936.0
225,2015/07/28,1978.0,1950.289,1940.0,405000,1994.0,1923.0
226,2015/07/29,1980.0,1995.09,1990.0,290000,2025.0,1967.0
227,2015/07/30,1961.0,1956.876,1980.0,233000,1990.0,1931.0
228,2015/07/31,1916.0,1925.726,1963.0,204000,1963.0,1911.0
229,2015/08/03,1941.0,1925.576,1916.0,165000,1946.0,1906.0
230,2015/08/04,1968.0,1948.011,1935.0,183000,1968.0,1919.0
231,2015/08/05,2031.0,2010.152,1969.0,402000,2032.0,1968.0
232,2015/08/06,2027.0,2028.424,2029.0,373000,2044.0,2018.0
233,2015/08/07,1974.0,1984.134,2019.0,187000,2022.0,1970.0
234,2015/08/10,1945.0,1960.873,1955.0,221000,1990.0,1945.0
235,2015/08/11,1950.0,1947.979,1973.0,140000,1973.0,1939.0
236,2015/08/12,1843.0,1890.084,1945.0,429000,1946.0,1837.0
237,2015/08/13,1753.0,1740.137,1855.0,1204000,1855.0,1705.0
238,2015/08/14,1753.0,1789.705,1790.0,468000,1846.0,1752.0
239,2015/08/17,1831.0,1806.838,1754.0,426000,1840.0,1754.0
240,2015/08/18,1831.0,1824.833,1830.0,245000,1837.0,1801.0
241,2015/08/19,1755.0,1775.797,1831.0,369000,1831.0,1748.0
242,2015/08/20,1729.0,1755.796,1755.0,274000,1776.0,1723.0
243,2015/08/21,1632.0,1657.652,1689.0,514000,1693.0,1629.0
244,2015/08/24,1509.0,1574.984,1595.0,703000,1650.0,1501.0
245,2015/08/25,1475.0,1489.103,1400.0,672000,1589.0,1344.0
246,2015/08/26,1536.0,1508.929,1505.0,253000,1561.0,1482.0
247,2015/08/27,1516.0,1539.861,1589.0,266000,1596.0,1507.0
248,2015/08/28,1558.0,1548.064,1569.0,264000,1569.0,1520.0
249,2015/08/31,1526.0,1539.986,1559.0,213000,1575.0,1502.0
250,2015/09/01,1465.0,1486.365,1527.0,274000,1527.0,1456.0
251,2015/09/02,1535.0,1500.949,1405.0,372000,1565.0,1405.0
252,2015/09/03,1638.0,1606.915,1561.0,399000,1645.0,1561.0
253,2015/09/04,1573.0,1576.93,1620.0,358000,1634.0,1549.0
254,2015/09/07,1553.0,1554.327,1533.0,208000,1587.0,1506.0
255,2015/09/08,1447.0,1479.143,1531.0,259000,1551.0,1443.0
256,2015/09/09,1537.0,1515.806,1505.0,232000,1537.0,1477.0
257,2015/09/10,1531.0,1499.828,1490.0,157000,1540.0,1470.0
258,2015/09/11,1543.0,1548.293,1493.0,150000,1585.0,1493.0
259,2015/09/14,1543.0,1527.353,1525.0,102000,1543.0,1509.0
260,2015/09/15,1529.0,1525.443,1543.0,167000,1564.0,1488.0
261,2015/09/16,1640.0,1602.744,1529.0,472000,1660.0,1516.0
262,2015/09/17,1799.0,1738.86,1678.0,564000,1799.0,1664.0
263,2015/09/18,1717.0,1726.272,1762.0,915000,1790.0,1699.0
264,2015/09/24,1661.0,1683.388,1675.0,170000,1702.0,1661.0
265,2015/09/25,1611.0,1614.922,1661.0,357000,1675.0,1586.0
266,2015/09/28,1625.0,1608.609,1611.0,391000,1637.0,1588.0
267,2015/09/29,1610.0,1614.603,1647.0,295000,1647.0,1590.0
268,2015/09/30,1716.0,1691.741,1648.0,475000,1724.0,1625.0
269,2015/10/01,1750.0,1775.283,1756.0,689000,1820.0,1734.0
270,2015/10/02,1858.0,1832.864,1771.0,824000,1896.0,1762.0
271,2015/10/05,1792.0,1816.349,1818.0,1017000,1858.0,1773.0
272,2015/10/06,1680.0,1723.586,1802.0,770000,1822.0,1672.0
273,2015/10/07,1573.0,1583.627,1664.0,1193000,1668.0,1521.0
274,2015/10/08,1538.0,1546.385,1600.0,686000,1610.0,1519.0
275,2015/10/09,1577.0,1562.221,1560.0,539000,1586.0,1520.0
276,2015/10/13,1583.0,1565.0,1569.0,358000,1597.0,1531.0
277,2015/10/14,1550.0,1551.427,1570.0,314000,1571.0,1535.0
278,2015/10/15,1575.0,1575.304,1531.0,487000,1596.0,1531.0
279,2015/10/16,1558.0,1570.967,1568.0,273000,1592.0,1556.0
280,2015/10/19,1575.0,1575.598,1556.0,189000,1597.0,1547.0
281,2015/10/20,1555.0,1563.445,1590.0,272000,1590.0,1551.0
282,2015/10/21,1549.0,1550.196,1546.0,112000,1560.0,1542.0
283,2015/10/22,1501.0,1511.028,1532.0,464000,1536.0,1490.0
284,2015/10/23,1548.0,1522.881,1522.0,428000,1551.0,1499.0
285,2015/10/26,1672.0,1642.578,1584.0,858000,1688.0,1574.0
286,2015/10/27,1659.0,1672.923,1696.0,479000,1696.0,1640.0
287,2015/10/28,1700.0,1694.298,1648.0,389000,1725.0,1646.0
288,2015/10/29,1723.0,1725.05,1712.0,360000,1743.0,1705.0
289,2015/10/30,1730.0,1710.641,1715.0,256000,1738.0,1685.0
290,2015/11/02,1727.0,1723.634,1717.0,243000,1742.0,1705.0
291,2015/11/04,1696.0,1703.974,1727.0,269000,1739.0,1684.0
292,2015/11/05,1641.0,1654.148,1671.0,434000,1674.0,1632.0
293,2015/11/06,1592.0,1604.203,1639.0,463000,1646.0,1575.0
294,2015/11/09,1601.0,1604.186,1600.0,296000,1625.0,1588.0
295,2015/11/10,1617.0,1593.723,1599.0,289000,1618.0,1576.0
296,2015/11/11,1619.0,1608.237,1600.0,232000,1625.0,1590.0
297,2015/11/12,1669.0,1666.859,1629.0,391000,1700.0,1624.0
298,2015/11/13,1705.0,1693.012,1685.0,418000,1722.0,1668.0
299,2015/11/16,1716.0,1711.87,1700.0,308000,1723.0,1689.0
300,2015/11/17,1720.0,1733.913,1740.0,332000,1744.0,1720.0
301,2015/11/18,1699.0,1707.714,1717.0,304000,1732.0,1690.0
302,2015/11/19,1724.0,1720.327,1720.0,202000,1727.0,1707.0
303,2015/11/20,1797.0,1755.869,1712.0,520000,1803.0,1705.0
304,2015/11/24,1981.0,1935.116,1900.0,1606600,2006.0,1871.0
305,2015/11/25,2030.0,2044.9,2071.0,1364500,2087.0,1981.0
306,2015/11/26,2050.0,2067.783,2065.0,738000,2088.0,2050.0
307,2015/11/27,1978.0,1998.342,2030.0,646000,2045.0,1952.0
308,2015/11/30,2010.0,1988.344,1979.0,405100,2024.0,1935.0
309,2015/12/01,1964.0,1971.722,2019.0,389300,2022.0,1948.0
310,2015/12/02,1944.0,1938.693,1940.0,353500,1958.0,1912.0
311,2015/12/03,1953.0,1951.563,1954.0,139700,1969.0,1939.0
312,2015/12/04,1896.0,1894.609,1900.0,346900,1919.0,1863.0
313,2015/12/07,1935.0,1929.779,1910.0,353300,1950.0,1908.0
314,2015/12/08,1977.0,1957.682,1937.0,574200,1991.0,1905.0
315,2015/12/09,1895.0,1909.607,1937.0,457400,1969.0,1877.0
316,2015/12/10,1824.0,1830.227,1849.0,291700,1863.0,1806.0
317,2015/12/11,1861.0,1838.731,1830.0,199800,1862.0,1821.0
318,2015/12/14,1808.0,1796.294,1802.0,190200,1825.0,1779.0
319,2015/12/15,1727.0,1755.36,1797.0,238900,1801.0,1724.0
320,2015/12/16,1753.0,1742.12,1767.0,184500,1780.0,1715.0
321,2015/12/17,1830.0,1819.742,1793.0,308100,1842.0,1769.0
322,2015/12/18,1858.0,1856.135,1840.0,376700,1875.0,1810.0
323,2015/12/21,1760.0,1774.263,1830.0,366600,1841.0,1729.0
324,2015/12/22,1780.0,1794.265,1745.0,291500,1837.0,1745.0
325,2015/12/24,1738.0,1760.781,1807.0,330700,1820.0,1733.0
326,2015/12/25,1725.0,1727.848,1730.0,401100,1775.0,1702.0
327,2015/12/28,1584.0,1602.169,1615.0,1886200,1660.0,1560.0
328,2015/12/29,1620.0,1576.342,1566.0,888000,1626.0,1518.0
329,2015/12/30,1730.0,1675.192,1590.0,997000,1739.0,1577.0
330,2016/01/04,1644.0,1685.75,1720.0,639800,1749.0,1625.0
331,2016/01/05,1593.0,1607.771,1637.0,439200,1651.0,1585.0
332,2016/01/06,1637.0,1608.647,1576.0,466000,1644.0,1567.0
333,2016/01/07,1597.0,1620.67,1629.0,409400,1670.0,1583.0
334,2016/01/08,1569.0,1576.341,1580.0,257900,1613.0,1550.0
335,2016/01/12,1477.0,1500.737,1527.0,583200,1546.0,1450.0
336,2016/01/13,1536.0,1529.127,1515.0,348600,1540.0,1513.0
337,2016/01/14,1526.0,1491.904,1490.0,292200,1527.0,1461.0
338,2016/01/15,1539.0,1548.525,1546.0,492900,1580.0,1525.0
339,2016/01/18,1560.0,1532.862,1499.0,759800,1630.0,1482.0
340,2016/01/19,1601.0,1552.891,1540.0,523500,1604.0,1514.0
341,2016/01/20,1498.0,1540.183,1580.0,575900,1589.0,1488.0
342,2016/01/21,1385.0,1411.07,1473.0,870100,1493.0,1350.0
343,2016/01/22,1495.0,1477.533,1473.0,744000,1529.0,1420.0
344,2016/01/25,1575.0,1577.8,1521.0,441600,1624.0,1517.0
345,2016/01/26,1604.0,1604.41,1520.0,387600,1647.0,1515.0
346,2016/01/27,1657.0,1646.741,1623.0,464900,1677.0,1607.0
347,2016/01/28,1663.0,1679.281,1623.0,438300,1725.0,1623.0
348,2016/01/29,1706.0,1683.277,1690.0,397900,1721.0,1629.0
349,2016/02/01,1782.0,1774.775,1740.0,664600,1808.0,1739.0
350,2016/02/02,1890.0,1891.088,1841.0,1262400,1945.0,1830.0
351,2016/02/03,1860.0,1865.211,1853.0,656200,1909.0,1827.0
352,2016/02/04,1720.0,1767.369,1848.0,603300,1860.0,1717.0
353,2016/02/05,1697.0,1669.186,1636.0,532700,1730.0,1620.0
354,2016/02/08,1671.0,1667.287,1646.0,280300,1694.0,1623.0
355,2016/02/09,1566.0,1584.767,1623.0,416600,1655.0,1534.0
356,2016/02/10,1470.0,1500.003,1558.0,663900,1582.0,1450.0
357,2016/02/12,1333.0,1332.87,1370.0,1409300,1420.0,1266.0
358,2016/02/15,1372.0,1385.547,1407.0,978200,1439.0,1333.0
359,2016/02/16,1379.0,1379.614,1371.0,657600,1413.0,1334.0
360,2016/02/17,1351.0,1358.585,1379.0,369200,1414.0,1318.0
361,2016/02/18,1387.0,1391.566,1404.0,278100,1410.0,1371.0
362,2016/02/19,1364.0,1373.787,1361.0,220100,1397.0,1353.0
363,2016/02/22,1514.0,1480.03,1355.0,812900,1527.0,1355.0
364,2016/02/23,1575.0,1561.799,1528.0,733700,1599.0,1524.0
365,2016/02/24,1599.0,1586.14,1575.0,424000,1609.0,1553.0
366,2016/02/25,1643.0,1651.669,1639.0,392600,1678.0,1632.0
367,2016/02/26,1674.0,1668.459,1683.0,223400,1683.0,1648.0
368,2016/02/29,1685.0,1715.401,1690.0,392900,1745.0,1674.0
369,2016/03/01,1708.0,1708.103,1685.0,277600,1727.0,1674.0
370,2016/03/02,1808.0,1789.296,1753.0,428000,1814.0,1737.0
371,2016/03/03,1758.0,1765.772,1779.0,355000,1810.0,1716.0
372,2016/03/04,1725.0,1730.455,1765.0,279000,1780.0,1702.0
373,2016/03/07,1691.0,1698.02,1726.0,270500,1735.0,1680.0
374,2016/03/08,1759.0,1729.667,1690.0,313500,1765.0,1666.0
375,2016/03/09,1770.0,1757.802,1723.0,244700,1776.0,1708.0
376,2016/03/10,1761.0,1783.411,1780.0,282000,1810.0,1756.0
377,2016/03/11,1771.0,1764.035,1731.0,208400,1784.0,1731.0
378,2016/03/14,1792.0,1783.842,1762.0,86500,1796.0,1756.0
379,2016/03/15,1767.0,1769.096,1770.0,80400,1788.0,1745.0
380,2016/03/16,1769.0,1772.606,1785.0,79100,1791.0,1763.0
381,2016/03/17,1764.0,1772.47,1779.0,95400,1789.0,1761.0
382,2016/03/18,1677.0,1701.95,1745.0,355000,1762.0,1670.0
383,2016/03/22,1738.0,1725.009,1659.0,226500,1742.0,1659.0
384,2016/03/23,1718.0,1717.045,1717.0,280000,1739.0,1699.0
385,2016/03/24,1673.0,1691.864,1705.0,378400,1722.0,1672.0
386,2016/03/25,1763.0,1733.334,1665.0,518800,1774.0,1658.0
387,2016/03/28,1836.0,1815.102,1780.0,405500,1845.0,1780.0
388,2016/03/29,1850.0,1860.773,1836.0,619200,1883.0,1819.0
389,2016/03/30,1820.0,1854.242,1850.0,729100,1887.0,1817.0
390,2016/03/31,1792.0,1787.157,1810.0,348500,1823.0,1767.0
391,2016/04/01,1768.0,1772.523,1820.0,383700,1821.0,1735.0
392,2016/04/04,1935.0,1957.214,1920.0,1818300,2009.0,1853.0
393,2016/04/05,1894.0,1893.131,1913.0,721100,1973.0,1846.0
394,2016/04/06,1843.0,1829.998,1893.0,649200,1894.0,1802.0
395,2016/04/07,1899.0,1856.59,1840.0,520100,1899.0,1810.0
396,2016/04/08,2048.0,1970.033,1859.0,1022200,2048.0,1846.0
397,2016/04/11,1987.0,1978.426,2000.0,635300,2012.0,1939.0
398,2016/04/12,1988.0,2001.695,1960.0,695900,2035.0,1960.0
399,2016/04/13,1964.0,1987.318,2010.0,711900,2027.0,1932.0
400,2016/04/14,1971.0,1967.837,1986.0,342100,1993.0,1936.0
401,2016/04/15,1977.0,1966.379,1959.0,311500,1981.0,1959.0
402,2016/04/18,1956.0,1954.571,1936.0,341200,1979.0,1934.0
403,2016/04/19,1937.0,1948.199,1916.0,325200,1990.0,1916.0
404,2016/04/20,1871.0,1883.061,1918.0,519500,1925.0,1850.0
405,2016/04/21,1756.0,1791.045,1850.0,1025600,1850.0,1744.0
406,2016/04/22,1693.0,1692.676,1740.0,992900,1750.0,1666.0
407,2016/04/25,1683.0,1707.31,1748.0,477500,1748.0,1679.0
408,2016/04/26,1646.0,1649.022,1679.0,562600,1712.0,1610.0
409,2016/04/27,1707.0,1707.3,1679.0,398100,1736.0,1665.0
410,2016/04/28,1657.0,1678.97,1727.0,374600,1728.0,1626.0
411,2016/05/02,1645.0,1635.182,1631.0,347700,1657.0,1613.0
412,2016/05/06,1691.0,1668.772,1615.0,495900,1704.0,1605.0
413,2016/05/09,1743.0,1729.044,1691.0,355400,1750.0,1668.0
414,2016/05/10,1765.0,1752.34,1758.0,407500,1767.0,1725.0
415,2016/05/11,1725.0,1745.492,1805.0,312500,1805.0,1703.0
416,2016/05/12,1771.0,1732.66,1724.0,268300,1771.0,1700.0
417,2016/05/13,1794.0,1783.94,1783.0,355100,1819.0,1756.0
418,2016/05/16,1771.0,1785.412,1815.0,261400,1840.0,1755.0
419,2016/05/17,1762.0,1770.052,1783.0,371300,1807.0,1739.0
420,2016/05/18,1747.0,1769.508,1793.0,311100,1810.0,1731.0
421,2016/05/19,1757.0,1780.255,1782.0,589500,1822.0,1747.0
422,2016/05/20,1745.0,1749.585,1766.0,178900,1779.0,1735.0
423,2016/05/23,1743.0,1743.536,1731.0,109900,1764.0,1724.0
424,2016/05/24,1669.0,1685.837,1720.0,221000,1723.0,1668.0
425,2016/05/25,1739.0,1753.356,1737.0,215900,1795.0,1710.0
426,2016/05/26,1795.0,1781.168,1762.0,211000,1799.0,1739.0
427,2016/05/27,1798.0,1784.677,1800.0,183600,1810.0,1768.0
428,2016/05/30,1881.0,1863.147,1830.0,442300,1896.0,1830.0
429,2016/05/31,1895.0,1872.398,1870.0,474300,1895.0,1835.0
430,2016/06/01,1927.0,1939.045,1975.0,560200,1980.0,1911.0
431,2016/06/02,1936.0,1941.875,1950.0,393100,1958.0,1923.0
432,2016/06/03,1935.0,1944.418,1941.0,207200,1978.0,1916.0
433,2016/06/06,1951.0,1925.741,1896.0,148000,1954.0,1880.0
434,2016/06/07,1940.0,1938.452,1950.0,221300,1959.0,1927.0
435,2016/06/08,1983.0,1975.568,1950.0,307500,1988.0,1927.0
436,2016/06/09,2009.0,2004.855,1960.0,279100,2019.0,1960.0
437,2016/06/10,1978.0,1987.388,1989.0,198400,2017.0,1966.0
438,2016/06/13,1921.0,1930.61,1943.0,199000,1957.0,1913.0
439,2016/06/14,1859.0,1868.901,1910.0,401100,1919.0,1836.0
440,2016/06/15,1891.0,1888.746,1832.0,212500,1930.0,1830.0
441,2016/06/16,1903.0,1894.436,1896.0,183800,1919.0,1863.0
442,2016/06/17,1909.0,1902.459,1880.0,301000,1938.0,1865.0
443,2016/06/20,1955.0,1945.971,1932.0,184300,1959.0,1919.0
444,2016/06/21,2096.0,2063.865,1950.0,709800,2109.0,1941.0
445,2016/06/22,2128.0,2105.623,2060.0,523900,2140.0,2046.0
446,2016/06/23,2108.0,2091.215,2078.0,284400,2126.0,2063.0
447,2016/06/24,2051.0,2068.528,2105.0,598400,2182.0,2005.0
448,2016/06/27,2206.0,2188.265,2051.0,736900,2240.0,2051.0
449,2016/06/28,2176.0,2196.217,2196.0,702800,2240.0,2127.0
450,2016/06/29,1927.0,1974.738,2076.0,1572300,2100.0,1915.0
451,2016/06/30,1936.0,1965.661,1951.0,767700,2035.0,1918.0
452,2016/07/01,1826.0,1845.706,1951.0,955500,1978.0,1775.0
453,2016/07/04,1828.0,1825.661,1808.0,464900,1869.0,1807.0
454,2016/07/05,1765.0,1772.975,1838.0,451600,1846.0,1754.0
455,2016/07/06,1713.0,1715.16,1736.0,579000,1772.0,1681.0
456,2016/07/07,1712.0,1720.668,1746.0,415400,1756.0,1702.0
457,2016/07/08,1641.0,1658.123,1711.0,359500,1733.0,1628.0
458,2016/07/11,1704.0,1682.581,1681.0,512700,1717.0,1632.0
459,2016/07/12,1764.0,1779.738,1751.0,859700,1805.0,1751.0
460,2016/07/13,1725.0,1744.71,1822.0,602100,1823.0,1711.0
461,2016/07/14,1733.0,1729.112,1730.0,308800,1752.0,1716.0
462,2016/07/15,1745.0,1746.229,1733.0,384600,1771.0,1722.0
463,2016/07/19,1801.0,1780.534,1770.0,324300,1810.0,1750.0
464,2016/07/20,1800.0,1798.293,1765.0,171700,1817.0,1761.0
465,2016/07/21,1737.0,1800.668,1843.0,1035400,1895.0,1728.0
466,2016/07/22,1668.0,1688.425,1764.0,940400,1782.0,1653.0
467,2016/07/25,1610.0,1622.137,1653.0,661600,1666.0,1599.0
468,2016/07/26,1585.0,1581.654,1601.0,527600,1613.0,1553.0
469,2016/07/27,1617.0,1620.016,1616.0,398600,1650.0,1587.0
470,2016/07/28,1598.0,1591.682,1617.0,294200,1621.0,1564.0
471,2016/07/29,1693.0,1658.651,1585.0,481400,1695.0,1585.0
472,2016/08/01,1695.0,1693.129,1668.0,276200,1708.0,1668.0
473,2016/08/02,1672.0,1677.896,1681.0,223800,1700.0,1656.0
474,2016/08/03,1651.0,1671.963,1666.0,163800,1698.0,1637.0
475,2016/08/04,1617.0,1646.45,1688.0,353200,1696.0,1610.0
476,2016/08/05,1582.0,1593.386,1617.0,339200,1647.0,1561.0
477,2016/08/08,1527.0,1537.864,1565.0,399100,1607.0,1522.0
478,2016/08/09,1583.0,1561.635,1546.0,158100,1587.0,1520.0
479,2016/08/10,1579.0,1580.422,1583.0,71300,1599.0,1562.0
480,2016/08/12,1609.0,1603.164,1570.0,322900,1635.0,1563.0
481,2016/08/15,1626.0,1626.561,1600.0,291500,1654.0,1594.0
482,2016/08/16,1634.0,1638.468,1619.0,165500,1650.0,1619.0
483,2016/08/17,1646.0,1647.792,1648.0,223600,1660.0,1631.0
484,2016/08/18,1556.0,1578.764,1641.0,342200,1646.0,1555.0
485,2016/08/19,1585.0,1576.356,1557.0,129100,1596.0,1545.0
486,2016/08/22,1602.0,1593.69,1587.0,116600,1605.0,1573.0
487,2016/08/23,1683.0,1665.198,1585.0,427500,1706.0,1585.0
488,2016/08/24,1670.0,1638.333,1643.0,289300,1680.0,1611.0
489,2016/08/25,1769.0,1746.395,1690.0,475600,1769.0,1690.0
490,2016/08/26,1741.0,1744.256,1754.0,242700,1763.0,1727.0
491,2016/08/29,1642.0,1656.83,1741.0,423900,1752.0,1621.0
492,2016/08/30,1655.0,1654.83,1628.0,112000,1676.0,1625.0
493,2016/08/31,1619.0,1620.523,1640.0,196500,1652.0,1608.0
494,2016/09/01,1635.0,1622.114,1615.0,97100,1638.0,1606.0
495,2016/09/02,1636.0,1630.928,1615.0,94600,1664.0,1615.0
496,2016/09/05,1627.0,1639.873,1654.0,103300,1658.0,1621.0
497,2016/09/06,1633.0,1620.482,1611.0,110900,1633.0,1607.0
498,2016/09/07,1652.0,1630.949,1613.0,174000,1652.0,1608.0
499,2016/09/08,1626.0,1627.871,1621.0,71200,1647.0,1621.0
500,2016/09/09,1665.0,1644.457,1619.0,162000,1670.0,1607.0
501,2016/09/12,1625.0,1626.877,1626.0,84700,1646.0,1616.0
502,2016/09/13,1664.0,1651.47,1625.0,120300,1677.0,1625.0
503,2016/09/14,1683.0,1672.065,1646.0,96300,1685.0,1646.0
504,2016/09/15,1668.0,1681.672,1670.0,117000,1704.0,1660.0
505,2016/09/16,1624.0,1633.08,1650.0,164600,1664.0,1621.0
506,2016/09/20,1582.0,1589.581,1609.0,260800,1617.0,1579.0
507,2016/09/21,1679.0,1645.799,1586.0,249400,1679.0,1586.0
508,2016/09/23,1707.0,1694.566,1649.0,202100,1718.0,1648.0
509,2016/09/26,1749.0,1759.178,1684.0,396700,1790.0,1684.0
510,2016/09/27,1702.0,1687.146,1687.0,308100,1710.0,1662.0
511,2016/09/28,1662.0,1672.529,1687.0,148800,1721.0,1652.0
512,2016/09/29,1609.0,1617.661,1657.0,423300,1657.0,1607.0
513,2016/09/30,1642.0,1625.615,1607.0,200000,1645.0,1602.0
514,2016/10/03,1618.0,1634.28,1638.0,307200,1672.0,1615.0
515,2016/10/04,1511.0,1485.93,1484.0,1370700,1538.0,1438.0
516,2016/10/05,1503.0,1506.871,1511.0,410000,1527.0,1500.0
517,2016/10/06,1510.0,1505.574,1516.0,351700,1517.0,1494.0
518,2016/10/07,1481.0,1485.659,1509.0,318800,1514.0,1471.0
519,2016/10/11,1459.0,1464.26,1480.0,320600,1488.0,1450.0
520,2016/10/12,1450.0,1465.007,1458.0,237600,1486.0,1449.0
521,2016/10/13,1501.0,1491.267,1476.0,401600,1507.0,1458.0
522,2016/10/14,1476.0,1489.314,1485.0,210200,1511.0,1476.0
523,2016/10/17,1474.0,1481.052,1493.0,131300,1500.0,1472.0
524,2016/10/18,1429.0,1441.099,1452.0,437200,1470.0,1428.0
525,2016/10/19,1442.0,1444.867,1435.0,274100,1460.0,1432.0
526,2016/10/20,1423.0,1421.896,1431.0,383300,1435.0,1412.0
527,2016/10/21,1391.0,1395.557,1420.0,581900,1420.0,1388.0
528,2016/10/24,1418.0,1413.88,1400.0,229800,1425.0,1400.0
529,2016/10/25,1428.0,1427.006,1429.0,194900,1434.0,1420.0
530,2016/10/26,1429.0,1425.556,1423.0,133600,1432.0,1413.0
531,2016/10/27,1456.0,1452.754,1429.0,439700,1464.0,1429.0
532,2016/10/28,1457.0,1453.522,1457.0,168900,1463.0,1442.0
533,2016/10/31,1450.0,1446.961,1452.0,190800,1458.0,1436.0
534,2016/11/01,1438.0,1437.415,1436.0,190800,1444.0,1430.0
535,2016/11/02,1412.0,1411.488,1428.0,226800,1429.0,1401.0
536,2016/11/04,1396.0,1389.515,1408.0,218000,1412.0,1378.0
537,2016/11/07,1384.0,1382.244,1395.0,260200,1399.0,1372.0
538,2016/11/08,1390.0,1391.463,1385.0,146100,1403.0,1385.0
539,2016/11/09,1363.0,1349.251,1400.0,571200,1400.0,1288.0
540,2016/11/10,1368.0,1373.681,1390.0,264500,1400.0,1359.0
541,2016/11/11,1301.0,1319.548,1370.0,383000,1371.0,1295.0
542,2016/11/14,1287.0,1282.303,1295.0,532400,1309.0,1264.0
543,2016/11/15,1282.0,1274.087,1288.0,565000,1290.0,1260.0
544,2016/11/16,1321.0,1290.484,1255.0,572000,1330.0,1255.0
545,2016/11/17,1334.0,1332.935,1317.0,226600,1352.0,1303.0
546,2016/11/18,1339.0,1334.966,1340.0,184700,1343.0,1317.0
547,2016/11/21,1385.0,1368.794,1339.0,282300,1388.0,1339.0
548,2016/11/22,1453.0,1435.687,1400.0,529400,1463.0,1397.0
549,2016/11/24,1378.0,1411.377,1460.0,749600,1461.0,1372.0
550,2016/11/25,1434.0,1420.025,1390.0,352100,1434.0,1390.0
551,2016/11/28,1496.0,1479.717,1450.0,626700,1496.0,1447.0
552,2016/11/29,1467.0,1477.694,1496.0,399400,1508.0,1455.0
553,2016/11/30,1513.0,1492.179,1448.0,464800,1513.0,1446.0
554,2016/12/01,1457.0,1467.807,1504.0,438400,1505.0,1455.0
555,2016/12/02,1463.0,1466.039,1468.0,143000,1478.0,1457.0
556,2016/12/05,1435.0,1439.614,1455.0,108400,1455.0,1433.0
557,2016/12/06,1455.0,1445.817,1434.0,162200,1462.0,1421.0
558,2016/12/07,1463.0,1460.074,1459.0,74500,1470.0,1453.0
559,2016/12/08,1473.0,1465.379,1466.0,130100,1473.0,1453.0
560,2016/12/09,1471.0,1467.763,1458.0,151600,1482.0,1450.0
561,2016/12/12,1465.0,1469.935,1467.0,172700,1484.0,1456.0
562,2016/12/13,1543.0,1512.986,1475.0,451900,1547.0,1464.0
563,2016/12/14,1533.0,1543.356,1539.0,246000,1570.0,1522.0
564,2016/12/15,1572.0,1565.455,1550.0,333700,1579.0,1538.0
565,2016/12/16,1543.0,1554.75,1578.0,142100,1580.0,1530.0
566,2016/12/19,1560.0,1552.012,1528.0,155300,1565.0,1520.0
567,2016/12/20,1555.0,1548.43,1564.0,86800,1564.0,1537.0
568,2016/12/21,1620.0,1606.861,1567.0,590200,1633.0,1560.0
569,2016/12/22,1613.0,1609.271,1619.0,289800,1624.0,1592.0
570,2016/12/26,1590.0,1608.988,1614.0,370900,1631.0,1562.0
571,2016/12/27,1612.0,1631.821,1581.0,1063300,1683.0,1581.0
572,2016/12/28,1606.0,1615.513,1602.0,402700,1648.0,1581.0
573,2016/12/29,1565.0,1560.312,1587.0,402800,1590.0,1533.0
574,2016/12/30,1569.0,1575.267,1575.0,182600,1598.0,1562.0
575,2017/01/04,1569.0,1560.247,1579.0,284800,1579.0,1550.0
576,2017/01/05,1605.0,1589.07,1566.0,282800,1619.0,1556.0
577,2017/01/06,1641.0,1635.462,1586.0,268700,1648.0,1586.0
578,2017/01/10,1579.0,1583.806,1622.0,698000,1645.0,1561.0
579,2017/01/11,1572.0,1586.652,1588.0,333900,1619.0,1563.0
580,2017/01/12,1596.0,1589.514,1564.0,346200,1604.0,1564.0
581,2017/01/13,1604.0,1607.03,1596.0,263900,1622.0,1585.0
582,2017/01/16,1607.0,1599.409,1597.0,154200,1610.0,1587.0
583,2017/01/17,1590.0,1594.766,1600.0,136900,1616.0,1587.0
584,2017/01/18,1597.0,1580.862,1585.0,182900,1599.0,1563.0
585,2017/01/19,1587.0,1584.451,1600.0,274200,1600.0,1566.0
586,2017/01/20,1587.0,1582.812,1590.0,238200,1598.0,1565.0
587,2017/01/23,1572.0,1570.258,1565.0,156500,1579.0,1565.0
588,2017/01/24,1540.0,1543.247,1562.0,216900,1563.0,1525.0
589,2017/01/25,1547.0,1545.274,1547.0,79700,1555.0,1533.0
590,2017/01/26,1529.0,1528.885,1551.0,267600,1558.0,1508.0
591,2017/01/27,1515.0,1517.893,1528.0,216200,1531.0,1510.0
592,2017/01/30,1520.0,1523.064,1509.0,144500,1531.0,1509.0
593,2017/01/31,1477.0,1478.416,1491.0,377200,1495.0,1463.0
594,2017/02/01,1489.0,1477.306,1460.0,299900,1497.0,1453.0
595,2017/02/02,1506.0,1509.008,1474.0,214800,1524.0,1474.0
596,2017/02/03,1488.0,1490.646,1500.0,155300,1520.0,1480.0
597,2017/02/06,1485.0,1488.421,1490.0,117700,1508.0,1479.0
598,2017/02/07,1450.0,1449.188,1455.0,341700,1458.0,1442.0
599,2017/02/08,1448.0,1449.419,1449.0,418000,1459.0,1440.0
600,2017/02/09,1446.0,1444.876,1446.0,119600,1457.0,1429.0
601,2017/02/10,1463.0,1458.127,1448.0,194400,1466.0,1441.0
602,2017/02/13,1461.0,1461.882,1475.0,246600,1487.0,1442.0
603,2017/02/14,1446.0,1453.942,1457.0,89300,1464.0,1446.0
604,2017/02/15,1454.0,1451.128,1455.0,131600,1457.0,1444.0
605,2017/02/16,1462.0,1468.642,1456.0,197600,1482.0,1455.0
606,2017/02/17,1447.0,1446.641,1447.0,157300,1460.0,1435.0
607,2017/02/20,1461.0,1469.1,1460.0,179900,1489.0,1445.0
608,2017/02/21,1450.0,1456.659,1462.0,117100,1469.0,1449.0
609,2017/02/22,1457.0,1455.263,1452.0,45200,1466.0,1450.0
610,2017/02/23,1470.0,1468.303,1452.0,90800,1476.0,1452.0
611,2017/02/24,1478.0,1478.121,1470.0,154400,1485.0,1463.0
612,2017/02/27,1486.0,1479.887,1480.0,103200,1490.0,1467.0
613,2017/02/28,1500.0,1501.892,1486.0,207900,1522.0,1476.0
614,2017/03/01,1497.0,1497.442,1500.0,140400,1508.0,1487.0
615,2017/03/02,1494.0,1497.617,1508.0,153200,1513.0,1488.0
616,2017/03/03,1491.0,1490.578,1488.0,58300,1499.0,1486.0
617,2017/03/06,1525.0,1512.673,1495.0,229200,1525.0,1488.0
618,2017/03/07,1525.0,1528.614,1525.0,163900,1545.0,1522.0
619,2017/03/08,1519.0,1520.891,1523.0,109600,1532.0,1509.0
620,2017/03/09,1530.0,1524.935,1519.0,192300,1534.0,1507.0
621,2017/03/10,1515.0,1514.113,1496.0,182800,1530.0,1491.0
622,2017/03/13,1528.0,1538.405,1518.0,224200,1550.0,1517.0
623,2017/03/14,1558.0,1553.737,1526.0,245300,1564.0,1525.0
624,2017/03/15,1536.0,1537.92,1522.0,140600,1550.0,1522.0
625,2017/03/16,1553.0,1548.764,1536.0,207900,1562.0,1535.0
626,2017/03/17,1579.0,1575.295,1547.0,222600,1585.0,1547.0
627,2017/03/21,1597.0,1597.86,1570.0,274000,1609.0,1567.0
628,2017/03/22,1613.0,1605.833,1567.0,268100,1627.0,1562.0
629,2017/03/23,1547.0,1559.637,1596.0,378600,1610.0,1539.0
630,2017/03/24,1581.0,1566.656,1551.0,188500,1581.0,1541.0
631,2017/03/27,1587.0,1587.083,1582.0,227900,1598.0,1573.0
632,2017/03/28,1619.0,1606.102,1600.0,233600,1620.0,1587.0
633,2017/03/29,1633.0,1630.777,1624.0,210800,1639.0,1622.0
634,2017/03/30,1596.0,1610.957,1635.0,265300,1636.0,1587.0
635,2017/03/31,1615.0,1624.049,1629.0,281100,1633.0,1609.0
636,2017/04/03,1468.0,1463.008,1489.0,981300,1498.0,1426.0
637,2017/04/04,1477.0,1470.34,1469.0,352900,1498.0,1455.0
638,2017/04/05,1446.0,1455.898,1480.0,271600,1484.0,1438.0
639,2017/04/06,1388.0,1403.077,1432.0,404700,1437.0,1388.0
640,2017/04/07,1391.0,1394.392,1390.0,469700,1416.0,1375.0
641,2017/04/10,1404.0,1409.507,1390.0,393500,1438.0,1390.0
642,2017/04/11,1440.0,1439.031,1405.0,490100,1453.0,1403.0
643,2017/04/12,1444.0,1450.174,1419.0,479900,1469.0,1417.0
644,2017/04/13,1425.0,1426.218,1430.0,225600,1446.0,1410.0
645,2017/04/14,1419.0,1423.181,1430.0,137200,1437.0,1413.0
646,2017/04/17,1392.0,1402.984,1410.0,158500,1424.0,1390.0
647,2017/04/18,1426.0,1418.408,1395.0,187500,1430.0,1395.0
648,2017/04/19,1427.0,1427.216,1410.0,99600,1441.0,1410.0
649,2017/04/20,1437.0,1436.759,1439.0,84800,1446.0,1429.0
650,2017/04/21,1443.0,1441.178,1435.0,73600,1451.0,1434.0
651,2017/04/24,1454.0,1462.51,1444.0,181300,1468.0,1444.0
652,2017/04/25,1457.0,1463.001,1454.0,176800,1470.0,1454.0
653,2017/04/26,1494.0,1483.582,1462.0,320600,1497.0,1462.0
654,2017/04/27,1500.0,1500.446,1498.0,134300,1508.0,1489.0
655,2017/04/28,1514.0,1513.024,1507.0,129700,1522.0,1500.0
656,2017/05/01,1503.0,1510.581,1515.0,170400,1528.0,1495.0
657,2017/05/02,1515.0,1517.294,1500.0,185500,1534.0,1498.0
658,2017/05/08,1528.0,1528.099,1517.0,255200,1535.0,1516.0
659,2017/05/09,1546.0,1544.369,1520.0,306300,1557.0,1518.0
660,2017/05/10,1523.0,1525.667,1540.0,208600,1543.0,1516.0
661,2017/05/11,1450.0,1472.028,1523.0,537700,1530.0,1445.0
662,2017/05/12,1381.0,1373.23,1438.0,1215700,1438.0,1335.0
663,2017/05/15,1406.0,1398.023,1382.0,428000,1412.0,1375.0
664,2017/05/16,1408.0,1406.157,1418.0,333400,1420.0,1391.0
665,2017/05/17,1419.0,1413.443,1403.0,297000,1425.0,1391.0
666,2017/05/18,1405.0,1404.271,1392.0,349800,1417.0,1392.0
667,2017/05/19,1373.0,1382.741,1404.0,238000,1406.0,1372.0
668,2017/05/22,1385.0,1375.331,1377.0,268900,1389.0,1359.0
669,2017/05/23,1375.0,1378.045,1386.0,209700,1390.0,1371.0
670,2017/05/24,1378.0,1386.089,1392.0,267400,1396.0,1378.0
671,2017/05/25,1379.0,1378.177,1378.0,308300,1386.0,1361.0
672,2017/05/26,1311.0,1314.167,1345.0,1046000,1345.0,1294.0
673,2017/05/29,1288.0,1290.642,1314.0,603800,1317.0,1274.0
674,2017/05/30,1312.0,1296.153,1290.0,335100,1315.0,1278.0
675,2017/05/31,1307.0,1303.035,1316.0,221000,1316.0,1294.0
676,2017/06/01,1298.0,1300.538,1304.0,176400,1307.0,1297.0
677,2017/06/02,1325.0,1319.018,1304.0,317500,1330.0,1301.0
678,2017/06/05,1365.0,1365.851,1339.0,460300,1383.0,1336.0
679,2017/06/06,1353.0,1355.369,1365.0,252100,1374.0,1341.0
680,2017/06/07,1325.0,1330.437,1353.0,261500,1358.0,1317.0
681,2017/06/08,1295.0,1301.142,1330.0,454100,1330.0,1278.0
682,2017/06/09,1276.0,1279.168,1280.0,433700,1294.0,1274.0
683,2017/06/12,1264.0,1269.249,1278.0,232600,1281.0,1262.0
684,2017/06/13,1258.0,1256.871,1258.0,262100,1262.0,1253.0
685,2017/06/14,1256.0,1265.316,1276.0,234700,1278.0,1254.0
686,2017/06/15,1220.0,1231.69,1256.0,560300,1263.0,1212.0
687,2017/06/16,1230.0,1234.699,1228.0,340300,1249.0,1226.0
688,2017/06/19,1229.0,1231.433,1232.0,206100,1241.0,1227.0
689,2017/06/20,1231.0,1229.902,1229.0,296300,1237.0,1222.0
690,2017/06/21,1227.0,1227.349,1234.0,220200,1235.0,1223.0
691,2017/06/22,1261.0,1246.006,1235.0,378700,1264.0,1224.0
692,2017/06/23,1252.0,1256.489,1260.0,306100,1268.0,1246.0
693,2017/06/26,1263.0,1267.993,1269.0,167600,1281.0,1260.0
694,2017/06/27,1266.0,1270.565,1270.0,153600,1277.0,1265.0
695,2017/06/28,1266.0,1267.276,1265.0,179500,1277.0,1259.0
696,2017/06/29,1307.0,1290.795,1275.0,296600,1307.0,1271.0
697,2017/06/30,1281.0,1285.597,1291.0,307400,1293.0,1276.0
698,2017/07/03,1316.0,1311.969,1305.0,553500,1323.0,1294.0
699,2017/07/04,1135.0,1145.334,1185.0,2317600,1185.0,1130.0
700,2017/07/05,1132.0,1133.944,1140.0,625400,1141.0,1131.0
701,2017/07/06,1119.0,1123.368,1141.0,943500,1142.0,1117.0
702,2017/07/07,1135.0,1130.979,1118.0,565300,1144.0,1111.0
703,2017/07/10,1114.0,1115.65,1125.0,627200,1126.0,1111.0
704,2017/07/11,1130.0,1126.681,1119.0,412400,1135.0,1115.0
705,2017/07/12,1130.0,1132.431,1133.0,373400,1144.0,1125.0
706,2017/07/13,1121.0,1122.198,1130.0,219600,1130.0,1118.0
707,2017/07/14,1125.0,1126.694,1122.0,212800,1131.0,1120.0
708,2017/07/18,1117.0,1126.103,1126.0,383400,1140.0,1116.0
709,2017/07/19,1125.0,1117.928,1116.0,302600,1127.0,1111.0
710,2017/07/20,1120.0,1124.621,1127.0,274300,1130.0,1120.0
711,2017/07/21,1123.0,1124.767,1120.0,358600,1132.0,1116.0
712,2017/07/24,1132.0,1126.752,1123.0,264800,1132.0,1120.0
713,2017/07/25,1144.0,1142.209,1130.0,403400,1150.0,1127.0
714,2017/07/26,1140.0,1139.44,1145.0,201300,1146.0,1131.0
715,2017/07/27,1141.0,1142.066,1139.0,173600,1146.0,1137.0
716,2017/07/28,1152.0,1146.395,1143.0,311600,1152.0,1139.0
717,2017/07/31,1152.0,1152.861,1153.0,234900,1158.0,1144.0
718,2017/08/01,1151.0,1145.466,1146.0,288000,1152.0,1135.0
719,2017/08/02,1154.0,1159.411,1156.0,215600,1169.0,1153.0
720,2017/08/03,1156.0,1171.08,1166.0,401900,1184.0,1151.0
721,2017/08/04,1175.0,1175.31,1156.0,304400,1184.0,1155.0
722,2017/08/07,1165.0,1171.082,1180.0,145800,1181.0,1161.0
723,2017/08/08,1169.0,1173.89,1173.0,190700,1191.0,1163.0
724,2017/08/09,1160.0,1157.966,1165.0,157000,1170.0,1154.0
725,2017/08/10,1161.0,1155.085,1164.0,177200,1164.0,1149.0
726,2017/08/14,1157.0,1155.031,1152.0,182000,1164.0,1151.0
727,2017/08/15,1154.0,1154.658,1154.0,170700,1160.0,1151.0
728,2017/08/16,1154.0,1153.835,1152.0,79600,1160.0,1150.0
729,2017/08/17,1174.0,1167.303,1153.0,153400,1174.0,1153.0
730,2017/08/18,1154.0,1152.858,1155.0,131400,1162.0,1150.0
731,2017/08/21,1154.0,1154.813,1155.0,112900,1163.0,1150.0
732,2017/08/22,1155.0,1157.237,1153.0,152500,1168.0,1147.0
733,2017/08/23,1150.0,1150.897,1154.0,227100,1161.0,1146.0
734,2017/08/24,1150.0,1147.907,1149.0,595800,1156.0,1137.0
735,2017/08/25,1149.0,1149.874,1145.0,338600,1156.0,1142.0
736,2017/08/28,1126.0,1131.43,1149.0,288000,1149.0,1118.0
737,2017/08/29,1095.0,1096.866,1120.0,474100,1122.0,1085.0
738,2017/08/30,1077.0,1080.391,1106.0,418200,1106.0,1070.0
739,2017/08/31,1096.0,1084.004,1074.0,283600,1099.0,1067.0
740,2017/09/01,1075.0,1081.126,1086.0,341600,1098.0,1074.0
741,2017/09/04,1049.0,1055.448,1073.0,358400,1073.0,1045.0
742,2017/09/05,1045.0,1054.401,1041.0,390400,1063.0,1039.0
743,2017/09/06,1063.0,1057.339,1040.0,215700,1070.0,1035.0
744,2017/09/07,1058.0,1065.251,1062.0,159500,1078.0,1058.0
745,2017/09/08,1047.0,1053.546,1056.0,124300,1063.0,1046.0
746,2017/09/11,1058.0,1057.318,1050.0,114500,1062.0,1050.0
747,2017/09/12,1079.0,1073.073,1057.0,171200,1082.0,1057.0
748,2017/09/13,1075.0,1079.758,1080.0,123800,1086.0,1075.0
749,2017/09/14,1058.0,1064.336,1078.0,165300,1083.0,1054.0
750,2017/09/15,1060.0,1055.732,1058.0,141200,1060.0,1049.0
751,2017/09/19,1053.0,1057.819,1056.0,270300,1071.0,1053.0
752,2017/09/20,1057.0,1056.064,1059.0,172500,1062.0,1052.0
753,2017/09/21,1058.0,1056.142,1057.0,173800,1061.0,1050.0
754,2017/09/22,1027.0,1039.042,1055.0,535800,1059.0,1027.0
755,2017/09/25,1028.0,1029.321,1033.0,312900,1035.0,1026.0
756,2017/09/26,1031.0,1030.385,1032.0,315900,1037.0,1026.0
757,2017/09/27,1043.0,1036.119,1030.0,256500,1044.0,1026.0
758,2017/09/28,1051.0,1052.175,1045.0,268400,1058.0,1045.0
759,2017/09/29,1078.0,1065.524,1054.0,491700,1081.0,1047.0
760,2017/10/02,1088.0,1089.27,1079.0,630800,1102.0,1078.0
761,2017/10/03,999.0,1002.194,1035.0,2373400,1041.0,989.0
762,2017/10/04,989.0,993.81,1003.0,1285900,1003.0,989.0
763,2017/10/05,993.0,992.677,990.0,569400,996.0,989.0
764,2017/10/06,993.0,992.737,994.0,1172500,1003.0,987.0
765,2017/10/10,1007.0,1006.916,996.0,863300,1013.0,996.0
766,2017/10/11,1001.0,1007.728,1012.0,331700,1019.0,1000.0
767,2017/10/12,1017.0,1012.022,1003.0,392300,1017.0,1003.0
768,2017/10/13,1025.0,1025.892,1017.0,442000,1035.0,1017.0
769,2017/10/16,1032.0,1032.719,1030.0,314600,1037.0,1027.0
770,2017/10/17,1040.0,1040.505,1033.0,301600,1045.0,1033.0
771,2017/10/18,1009.0,1019.409,1040.0,693200,1042.0,1007.0
772,2017/10/19,1011.0,1010.468,1017.0,545500,1020.0,1004.0
773,2017/10/20,1010.0,1003.756,1007.0,441500,1010.0,998.0
774,2017/10/23,1024.0,1018.457,1013.0,362300,1026.0,1010.0
775,2017/10/24,1021.0,1020.137,1024.0,131000,1024.0,1017.0
776,2017/10/25,1027.0,1031.218,1022.0,312000,1039.0,1019.0
777,2017/10/26,1022.0,1023.471,1025.0,145100,1027.0,1020.0
778,2017/10/27,1020.0,1021.367,1022.0,218400,1027.0,1018.0
779,2017/10/30,1028.0,1029.483,1025.0,213900,1034.0,1025.0
780,2017/10/31,1023.0,1024.519,1028.0,277600,1030.0,1020.0
781,2017/11/01,1023.0,1024.742,1025.0,193300,1028.0,1022.0
782,2017/11/02,1032.0,1030.928,1024.0,291900,1036.0,1023.0
783,2017/11/06,1032.0,1039.568,1049.0,352500,1049.0,1032.0
784,2017/11/07,1031.0,1031.446,1032.0,115400,1034.0,1027.0
785,2017/11/08,1037.0,1030.046,1030.0,246100,1037.0,1023.0
786,2017/11/09,1031.0,1040.996,1040.0,384800,1050.0,1026.0
787,2017/11/10,1045.0,1038.197,1028.0,288900,1046.0,1027.0
788,2017/11/13,1038.0,1039.083,1045.0,155900,1045.0,1035.0
789,2017/11/14,1031.0,1034.175,1036.0,162700,1039.0,1031.0
790,2017/11/15,1014.0,1022.728,1028.0,683500,1035.0,1014.0
791,2017/11/16,1003.0,1015.003,1030.0,393100,1030.0,1002.0
792,2017/11/17,1019.0,1017.225,1010.0,455200,1023.0,1010.0
793,2017/11/20,989.0,991.195,1010.0,687900,1012.0,982.0
794,2017/11/21,1003.0,1000.75,997.0,327300,1009.0,985.0
795,2017/11/22,1032.0,1023.313,1007.0,529900,1032.0,1007.0
796,2017/11/24,1036.0,1032.228,1031.0,296800,1038.0,1021.0
797,2017/11/27,1038.0,1041.124,1045.0,314300,1050.0,1032.0
798,2017/11/28,1030.0,1032.015,1028.0,259200,1042.0,1026.0
799,2017/11/29,1038.0,1036.899,1030.0,213900,1040.0,1030.0
800,2017/11/30,1041.0,1037.328,1040.0,229700,1041.0,1033.0
801,2017/12/01,1034.0,1038.11,1044.0,197100,1044.0,1028.0
802,2017/12/04,1036.0,1038.666,1035.0,171300,1043.0,1032.0
803,2017/12/05,1033.0,1037.202,1040.0,158800,1044.0,1030.0
804,2017/12/06,1015.0,1024.152,1031.0,118100,1032.0,1015.0
805,2017/12/07,1022.0,1018.614,1010.0,84700,1026.0,1010.0
806,2017/12/08,1033.0,1030.041,1019.0,130100,1034.0,1019.0
807,2017/12/11,1046.0,1041.445,1028.0,298500,1046.0,1027.0
808,2017/12/12,1056.0,1054.103,1042.0,352400,1059.0,1042.0
809,2017/12/13,1057.0,1056.849,1054.0,134800,1062.0,1052.0
810,2017/12/14,1060.0,1057.987,1051.0,140900,1062.0,1051.0
811,2017/12/15,1056.0,1062.745,1062.0,257900,1070.0,1056.0
812,2017/12/18,1070.0,1067.234,1065.0,194300,1070.0,1061.0
813,2017/12/19,1095.0,1088.229,1073.0,368400,1096.0,1070.0
814,2017/12/20,1083.0,1086.843,1085.0,234900,1096.0,1077.0
815,2017/12/21,1064.0,1064.742,1075.0,417800,1077.0,1050.0
816,2017/12/22,1063.0,1056.838,1063.0,288900,1063.0,1051.0
817,2017/12/25,1055.0,1052.439,1053.0,251000,1062.0,1042.0
818,2017/12/26,1209.0,1199.007,1191.0,3072700,1227.0,1146.0
819,2017/12/27,1152.0,1181.646,1211.0,1500000,1232.0,1149.0
820,2017/12/28,1149.0,1150.097,1150.0,575500,1167.0,1123.0
821,2017/12/29,1148.0,1145.451,1159.0,326100,1159.0,1134.0
822,2018/01/04,1175.0,1179.189,1178.0,832900,1194.0,1167.0
823,2018/01/05,1174.0,1175.937,1165.0,357100,1186.0,1165.0
824,2018/01/09,1192.0,1190.249,1183.0,440200,1198.0,1167.0
825,2018/01/10,1197.0,1198.242,1198.0,427600,1216.0,1188.0
826,2018/01/11,1215.0,1209.531,1197.0,355200,1218.0,1189.0
827,2018/01/12,1233.0,1225.013,1215.0,416400,1235.0,1206.0
828,2018/01/15,1266.0,1260.318,1250.0,574100,1274.0,1245.0
829,2018/01/16,1383.0,1373.108,1356.0,2482300,1390.0,1347.0
830,2018/01/17,1368.0,1367.617,1385.0,945400,1386.0,1350.0
831,2018/01/18,1410.0,1402.676,1377.0,1071800,1420.0,1377.0
832,2018/01/19,1378.0,1380.761,1401.0,596000,1413.0,1363.0
833,2018/01/22,1362.0,1362.154,1360.0,638000,1381.0,1344.0
834,2018/01/23,1368.0,1375.223,1360.0,495000,1393.0,1355.0
835,2018/01/24,1366.0,1374.937,1365.0,923200,1393.0,1364.0
836,2018/01/25,1355.0,1360.491,1366.0,1102600,1373.0,1349.0
837,2018/01/26,1369.0,1366.49,1363.0,495800,1376.0,1357.0
838,2018/01/29,1371.0,1368.765,1365.0,293300,1375.0,1359.0
839,2018/01/30,1360.0,1355.659,1363.0,497400,1367.0,1345.0
840,2018/01/31,1339.0,1347.851,1350.0,465500,1362.0,1339.0
841,2018/02/01,1356.0,1354.37,1335.0,491900,1364.0,1335.0
842,2018/02/02,1348.0,1348.61,1350.0,393900,1360.0,1337.0
843,2018/02/05,1325.0,1329.196,1330.0,1445300,1335.0,1321.0
844,2018/02/06,1268.0,1242.789,1221.0,1007600,1268.0,1210.0
845,2018/02/07,1277.0,1295.106,1300.0,476900,1315.0,1277.0
846,2018/02/08,1301.0,1295.033,1277.0,284800,1308.0,1274.0
847,2018/02/09,1288.0,1271.536,1244.0,309900,1288.0,1241.0
848,2018/02/13,1295.0,1301.091,1294.0,467400,1314.0,1276.0
849,2018/02/14,1306.0,1301.857,1281.0,407400,1314.0,1281.0
850,2018/02/15,1278.0,1287.815,1300.0,302700,1304.0,1278.0
851,2018/02/16,1291.0,1291.959,1274.0,427400,1301.0,1274.0
852,2018/02/19,1364.0,1349.467,1304.0,933800,1371.0,1304.0
853,2018/02/20,1369.0,1356.735,1350.0,334100,1370.0,1329.0
854,2018/02/21,1355.0,1358.065,1364.0,229600,1370.0,1344.0
855,2018/02/22,1356.0,1354.774,1360.0,238800,1365.0,1344.0
856,2018/02/23,1392.0,1377.792,1358.0,571000,1392.0,1356.0
857,2018/02/26,1364.0,1376.646,1395.0,396200,1402.0,1350.0
858,2018/02/27,1352.0,1360.305,1378.0,306300,1378.0,1350.0
859,2018/02/28,1339.0,1337.345,1329.0,552000,1357.0,1303.0
860,2018/03/01,1317.0,1333.578,1340.0,496600,1370.0,1307.0
861,2018/03/02,1327.0,1314.606,1300.0,292600,1328.0,1293.0
862,2018/03/05,1313.0,1309.543,1306.0,227600,1319.0,1294.0
863,2018/03/06,1329.0,1330.132,1320.0,176200,1340.0,1320.0
864,2018/03/07,1334.0,1335.846,1328.0,280500,1352.0,1313.0
865,2018/03/08,1339.0,1343.053,1343.0,174500,1352.0,1334.0
866,2018/03/09,1341.0,1343.423,1350.0,276000,1359.0,1332.0
867,2018/03/12,1361.0,1350.458,1361.0,330300,1365.0,1340.0
868,2018/03/13,1368.0,1365.999,1361.0,457800,1372.0,1349.0
869,2018/03/14,1371.0,1374.554,1372.0,264100,1382.0,1363.0
870,2018/03/15,1392.0,1389.974,1380.0,527600,1400.0,1379.0
871,2018/03/16,1380.0,1379.218,1399.0,328200,1399.0,1368.0
872,2018/03/19,1386.0,1380.777,1380.0,212600,1389.0,1369.0
873,2018/03/20,1389.0,1378.656,1378.0,532000,1390.0,1362.0
874,2018/03/22,1395.0,1391.585,1389.0,380100,1400.0,1385.0
875,2018/03/23,1382.0,1375.967,1365.0,687600,1390.0,1356.0
876,2018/03/26,1403.0,1390.328,1370.0,828900,1404.0,1356.0
877,2018/03/27,1567.0,1551.656,1453.0,3767800,1600.0,1433.0
878,2018/03/28,1540.0,1534.965,1529.0,1236600,1573.0,1507.0
879,2018/03/29,1548.0,1564.284,1580.0,4902400,1660.0,1535.0
880,2018/03/30,1525.0,1537.64,1552.0,841200,1571.0,1523.0
881,2018/04/02,1470.0,1490.568,1517.0,1445800,1536.0,1438.0
882,2018/04/03,1317.0,1338.247,1400.0,2458300,1402.0,1307.0
883,2018/04/04,1331.0,1325.374,1331.0,869900,1342.0,1307.0
884,2018/04/05,1295.0,1300.692,1321.0,879800,1323.0,1288.0
885,2018/04/06,1289.0,1284.026,1286.0,965800,1301.0,1268.0
886,2018/04/09,1300.0,1293.29,1275.0,554000,1303.0,1271.0
887,2018/04/10,1309.0,1302.752,1300.0,497400,1316.0,1287.0
888,2018/04/11,1349.0,1339.122,1317.0,701400,1355.0,1315.0
889,2018/04/12,1373.0,1366.267,1350.0,693000,1382.0,1344.0
890,2018/04/13,1380.0,1373.681,1371.0,489900,1387.0,1363.0
891,2018/04/16,1400.0,1404.217,1394.0,578200,1422.0,1387.0
892,2018/04/17,1418.0,1419.109,1395.0,357500,1433.0,1385.0
893,2018/04/18,1445.0,1437.328,1415.0,263800,1450.0,1406.0
894,2018/04/19,1447.0,1456.1,1455.0,377900,1467.0,1447.0
895,2018/04/20,1440.0,1442.412,1441.0,205300,1451.0,1431.0
896,2018/04/23,1427.0,1432.415,1442.0,210300,1446.0,1419.0
897,2018/04/24,1426.0,1429.92,1430.0,176400,1447.0,1421.0
898,2018/04/25,1451.0,1445.216,1415.0,250100,1462.0,1407.0
899,2018/04/26,1472.0,1461.422,1453.0,243200,1474.0,1442.0
900,2018/04/27,1472.0,1464.236,1475.0,266500,1477.0,1453.0
901,2018/05/01,1500.0,1488.987,1470.0,274300,1506.0,1453.0
902,2018/05/02,1540.0,1538.966,1504.0,525800,1565.0,1499.0
903,2018/05/07,1549.0,1549.747,1556.0,367300,1559.0,1537.0
904,2018/05/08,1565.0,1562.02,1541.0,281400,1576.0,1530.0
905,2018/05/09,1590.0,1583.848,1561.0,376900,1595.0,1555.0
906,2018/05/10,1581.0,1590.016,1597.0,314100,1607.0,1575.0
907,2018/05/11,1609.0,1605.245,1589.0,386000,1625.0,1582.0
908,2018/05/14,1589.0,1592.855,1610.0,288700,1613.0,1583.0
909,2018/05/15,1602.0,1596.75,1588.0,269000,1608.0,1586.0
910,2018/05/16,1601.0,1595.592,1586.0,200200,1610.0,1575.0
911,2018/05/17,1591.0,1584.017,1575.0,217500,1599.0,1575.0
912,2018/05/18,1596.0,1593.967,1590.0,170600,1602.0,1578.0
913,2018/05/21,1601.0,1598.801,1596.0,201400,1618.0,1587.0
914,2018/05/22,1584.0,1583.648,1585.0,151300,1592.0,1575.0
915,2018/05/23,1597.0,1596.201,1586.0,267700,1607.0,1580.0
916,2018/05/24,1596.0,1598.944,1595.0,163500,1612.0,1586.0
917,2018/05/25,1596.0,1589.205,1594.0,90800,1600.0,1578.0
918,2018/05/28,1641.0,1640.067,1600.0,397000,1662.0,1600.0
919,2018/05/29,1640.0,1635.756,1642.0,162800,1646.0,1618.0
920,2018/05/30,1619.0,1625.067,1617.0,146800,1640.0,1609.0
921,2018/05/31,1645.0,1643.062,1635.0,211800,1653.0,1617.0
922,2018/06/01,1671.0,1661.479,1630.0,230600,1672.0,1630.0
923,2018/06/04,1700.0,1694.72,1687.0,155900,1700.0,1685.0
924,2018/06/05,1739.0,1725.455,1710.0,287100,1742.0,1710.0
925,2018/06/06,1748.0,1748.192,1750.0,248100,1758.0,1733.0
926,2018/06/07,1720.0,1714.943,1741.0,190200,1741.0,1676.0
927,2018/06/08,1708.0,1709.557,1715.0,250500,1727.0,1696.0
928,2018/06/11,1736.0,1737.145,1708.0,474400,1755.0,1708.0
929,2018/06/12,1725.0,1722.036,1740.0,311200,1740.0,1709.0
930,2018/06/13,1634.0,1658.031,1655.0,930600,1725.0,1628.0
931,2018/06/14,1579.0,1591.437,1610.0,922200,1622.0,1576.0
932,2018/06/15,1589.0,1590.17,1571.0,582600,1605.0,1565.0
933,2018/06/18,1581.0,1575.577,1587.0,423800,1602.0,1563.0
934,2018/06/19,1570.0,1576.247,1566.0,619900,1592.0,1554.0
935,2018/06/20,1563.0,1544.504,1565.0,445100,1565.0,1527.0
936,2018/06/21,1571.0,1570.068,1560.0,336400,1582.0,1540.0
937,2018/06/22,1611.0,1599.86,1564.0,348600,1611.0,1556.0
938,2018/06/25,1582.0,1590.708,1600.0,273000,1610.0,1577.0
939,2018/06/26,1592.0,1603.896,1600.0,709600,1619.0,1584.0
940,2018/06/27,1535.0,1548.496,1573.0,408200,1597.0,1524.0
941,2018/06/28,1466.0,1483.943,1498.0,717700,1510.0,1445.0
942,2018/06/29,1354.0,1336.026,1346.0,1643400,1361.0,1295.0
943,2018/07/02,1351.0,1355.055,1381.0,751900,1404.0,1338.0
944,2018/07/03,1380.0,1363.616,1351.0,721400,1380.0,1331.0
945,2018/07/04,1352.0,1354.599,1376.0,580200,1391.0,1337.0
946,2018/07/05,1330.0,1327.475,1340.0,400100,1349.0,1319.0
947,2018/07/06,1325.0,1322.304,1327.0,383000,1332.0,1315.0
948,2018/07/09,1336.0,1330.21,1328.0,272000,1338.0,1316.0
949,2018/07/10,1346.0,1344.474,1366.0,282100,1367.0,1335.0
950,2018/07/11,1366.0,1359.018,1346.0,293500,1369.0,1344.0
951,2018/07/12,1365.0,1359.176,1366.0,456700,1372.0,1343.0
952,2018/07/13,1374.0,1372.228,1374.0,271000,1382.0,1362.0
953,2018/07/17,1395.0,1389.02,1380.0,389300,1403.0,1371.0
954,2018/07/18,1406.0,1403.7,1403.0,146500,1415.0,1398.0
955,2018/07/19,1410.0,1409.344,1410.0,193000,1416.0,1403.0
956,2018/07/20,1412.0,1410.941,1410.0,335300,1423.0,1404.0
957,2018/07/23,1416.0,1418.271,1411.0,238100,1431.0,1411.0
958,2018/07/24,1406.0,1411.786,1422.0,112400,1432.0,1399.0
959,2018/07/25,1412.0,1405.43,1413.0,127800,1418.0,1395.0
960,2018/07/26,1451.0,1445.631,1430.0,160600,1455.0,1421.0
961,2018/07/27,1467.0,1468.332,1452.0,184400,1484.0,1450.0
962,2018/07/30,1445.0,1445.02,1447.0,214000,1458.0,1428.0
963,2018/07/31,1438.0,1438.64,1429.0,300100,1460.0,1418.0
964,2018/08/01,1443.0,1446.854,1450.0,102200,1453.0,1442.0
965,2018/08/02,1450.0,1450.127,1445.0,201400,1456.0,1436.0
966,2018/08/03,1465.0,1462.667,1454.0,128100,1470.0,1448.0
967,2018/08/06,1444.0,1456.851,1470.0,129900,1479.0,1440.0
968,2018/08/07,1470.0,1463.098,1446.0,108200,1471.0,1446.0
969,2018/08/08,1465.0,1465.063,1465.0,154400,1484.0,1450.0
970,2018/08/09,1480.0,1478.775,1475.0,122400,1489.0,1470.0
971,2018/08/10,1472.0,1472.0,1484.0,83600,1487.0,1465.0
972,2018/08/13,1431.0,1435.182,1459.0,278000,1468.0,1412.0
973,2018/08/14,1468.0,1453.562,1430.0,135900,1468.0,1430.0
974,2018/08/15,1473.0,1472.064,1463.0,101000,1484.0,1458.0
975,2018/08/16,1429.0,1445.752,1459.0,174300,1469.0,1429.0
976,2018/08/17,1456.0,1441.26,1427.0,103900,1456.0,1421.0
977,2018/08/20,1440.0,1441.68,1426.0,102500,1450.0,1426.0
978,2018/08/21,1445.0,1443.126,1420.0,136100,1456.0,1419.0
979,2018/08/22,1460.0,1453.722,1441.0,102200,1463.0,1437.0
980,2018/08/23,1459.0,1458.657,1460.0,89600,1466.0,1451.0
981,2018/08/24,1464.0,1464.817,1465.0,91700,1472.0,1455.0
982,2018/08/27,1467.0,1467.193,1466.0,119600,1478.0,1460.0
983,2018/08/28,1470.0,1475.196,1480.0,114200,1486.0,1468.0
984,2018/08/29,1483.0,1481.776,1470.0,289600,1496.0,1459.0
985,2018/08/30,1480.0,1473.563,1468.0,107300,1482.0,1449.0
986,2018/08/31,1490.0,1486.911,1478.0,109500,1496.0,1476.0
987,2018/09/03,1454.0,1463.962,1487.0,113300,1492.0,1452.0
988,2018/09/04,1470.0,1464.739,1457.0,112100,1472.0,1447.0
989,2018/09/05,1500.0,1499.572,1475.0,154900,1513.0,1475.0
990,2018/09/06,1493.0,1492.936,1508.0,111300,1509.0,1480.0
991,2018/09/07,1526.0,1511.207,1483.0,128100,1528.0,1479.0
992,2018/09/10,1545.0,1543.79,1540.0,147400,1560.0,1528.0
993,2018/09/11,1566.0,1578.991,1570.0,212400,1609.0,1562.0
994,2018/09/12,1583.0,1584.859,1563.0,228900,1603.0,1562.0
995,2018/09/13,1608.0,1603.201,1582.0,151100,1618.0,1580.0
996,2018/09/14,1607.0,1614.412,1614.0,255600,1640.0,1597.0
997,2018/09/18,1632.0,1628.893,1594.0,274500,1648.0,1583.0
998,2018/09/19,1611.0,1623.66,1648.0,210800,1653.0,1610.0
999,2018/09/20,1603.0,1602.746,1614.0,176000,1614.0,1592.0
1000,2018/09/21,1607.0,1606.449,1603.0,215300,1619.0,1595.0
1001,2018/09/25,1659.0,1643.008,1619.0,268300,1664.0,1615.0
1002,2018/09/26,1682.0,1682.669,1659.0,221400,1696.0,1659.0
1003,2018/09/27,1605.0,1624.086,1649.0,246900,1661.0,1602.0
1004,2018/09/28,1607.0,1618.986,1622.0,270100,1641.0,1605.0
1005,2018/10/01,1545.0,1569.084,1585.0,508500,1610.0,1541.0
1006,2018/10/02,1377.0,1362.349,1405.0,3772700,1421.0,1322.0
1007,2018/10/03,1390.0,1353.532,1360.0,1985600,1390.0,1328.0
1008,2018/10/04,1377.0,1372.849,1390.0,722500,1400.0,1356.0
1009,2018/10/05,1396.0,1389.538,1378.0,645600,1403.0,1369.0
1010,2018/10/09,1388.0,1403.313,1405.0,438100,1419.0,1385.0
1011,2018/10/10,1368.0,1373.831,1370.0,268000,1387.0,1364.0
1012,2018/10/11,1364.0,1355.27,1341.0,916500,1376.0,1332.0
1013,2018/10/12,1371.0,1371.436,1355.0,586300,1385.0,1355.0
1014,2018/10/15,1370.0,1390.757,1384.0,582100,1401.0,1370.0
1015,2018/10/16,1384.0,1379.477,1367.0,305800,1387.0,1359.0
1016,2018/10/17,1386.0,1389.221,1397.0,287100,1399.0,1382.0
1017,2018/10/18,1381.0,1379.47,1388.0,314600,1391.0,1372.0
1018,2018/10/19,1288.0,1303.029,1361.0,788400,1371.0,1282.0
1019,2018/10/22,1253.0,1255.785,1275.0,549300,1275.0,1247.0
1020,2018/10/23,1239.0,1242.281,1249.0,387400,1253.0,1232.0
1021,2018/10/24,1199.0,1206.544,1248.0,554600,1248.0,1181.0
1022,2018/10/25,1174.0,1174.855,1169.0,437000,1186.0,1153.0
1023,2018/10/26,1168.0,1169.933,1174.0,483500,1192.0,1157.0
1024,2018/10/29,1192.0,1188.69,1168.0,378200,1206.0,1168.0
1025,2018/10/30,1201.0,1202.858,1183.0,330100,1213.0,1183.0
1026,2018/10/31,1230.0,1220.139,1220.0,447500,1233.0,1203.0
1027,2018/11/01,1213.0,1214.318,1215.0,217200,1224.0,1206.0
1028,2018/11/02,1214.0,1211.364,1215.0,318500,1221.0,1200.0
1029,2018/11/05,1195.0,1196.642,1200.0,165100,1203.0,1189.0
1030,2018/11/06,1207.0,1206.257,1200.0,192200,1215.0,1191.0
1031,2018/11/07,1205.0,1208.965,1203.0,320900,1221.0,1198.0
1032,2018/11/08,1207.0,1215.185,1221.0,269100,1227.0,1205.0
1033,2018/11/09,1224.0,1217.492,1207.0,189300,1229.0,1206.0
1034,2018/11/12,1208.0,1210.58,1225.0,234500,1226.0,1200.0
1035,2018/11/13,1184.0,1182.266,1186.0,387200,1191.0,1163.0
1036,2018/11/14,1180.0,1185.174,1179.0,408600,1197.0,1174.0
1037,2018/11/15,1161.0,1159.255,1158.0,1017000,1178.0,1144.0
1038,2018/11/16,1176.0,1174.309,1145.0,681500,1192.0,1141.0
1039,2018/11/19,1160.0,1153.166,1152.0,363200,1165.0,1132.0
1040,2018/11/20,1163.0,1160.947,1140.0,421700,1175.0,1135.0
1041,2018/11/21,1133.0,1138.752,1150.0,250700,1155.0,1132.0
1042,2018/11/22,1147.0,1142.672,1148.0,163800,1148.0,1134.0
1043,2018/11/26,1159.0,1149.338,1135.0,207200,1160.0,1126.0
1044,2018/11/27,1166.0,1159.992,1150.0,190700,1170.0,1150.0
1045,2018/11/28,1176.0,1171.873,1175.0,180800,1176.0,1161.0
1046,2018/11/29,1178.0,1179.327,1185.0,142500,1186.0,1167.0
1047,2018/11/30,1171.0,1166.436,1170.0,182300,1175.0,1156.0
1048,2018/12/03,1192.0,1189.104,1181.0,188500,1199.0,1174.0
1049,2018/12/04,1183.0,1193.537,1190.0,267200,1206.0,1183.0
1050,2018/12/05,1146.0,1156.089,1167.0,184100,1173.0,1145.0
1051,2018/12/06,1119.0,1118.697,1143.0,208100,1143.0,1106.0
1052,2018/12/07,1132.0,1134.06,1127.0,196600,1144.0,1125.0
1053,2018/12/10,1089.0,1089.561,1095.0,167300,1105.0,1084.0
1054,2018/12/11,1081.0,1086.323,1088.0,216800,1102.0,1076.0
1055,2018/12/12,1093.0,1098.734,1098.0,139900,1108.0,1092.0
1056,2018/12/13,1096.0,1098.912,1094.0,236500,1106.0,1091.0
1057,2018/12/14,1111.0,1105.692,1094.0,309200,1117.0,1091.0
1058,2018/12/17,1124.0,1111.376,1105.0,244200,1125.0,1092.0
1059,2018/12/18,1056.0,1071.495,1100.0,316500,1105.0,1053.0
1060,2018/12/19,1081.0,1078.094,1069.0,157500,1092.0,1063.0
1061,2018/12/20,1068.0,1069.629,1073.0,237000,1088.0,1056.0
1062,2018/12/21,1050.0,1038.937,1068.0,288400,1068.0,1013.0
1063,2018/12/25,1070.0,1062.734,1020.0,622500,1087.0,1009.0
1064,2018/12/26,890.0,866.598,950.0,2177200,964.0,792.0
1065,2018/12/27,932.0,917.509,930.0,1118500,960.0,873.0
1066,2018/12/28,965.0,952.06,918.0,516900,982.0,902.0
1067,2019/01/04,923.0,921.487,935.0,308700,940.0,913.0
1068,2019/01/07,1015.0,1005.652,953.0,460300,1023.0,953.0
1069,2019/01/08,1027.0,1025.892,1005.0,341600,1036.0,996.0
1070,2019/01/09,1030.0,1037.221,1037.0,305500,1058.0,1029.0
1071,2019/01/10,1044.0,1045.146,1028.0,223100,1055.0,1020.0
1072,2019/01/11,1020.0,1036.528,1048.0,453300,1069.0,1012.0
1073,2019/01/15,1053.0,1050.274,1018.0,250900,1064.0,1016.0
1074,2019/01/16,1055.0,1057.225,1058.0,303200,1075.0,1045.0
1075,2019/01/17,1080.0,1073.69,1063.0,328500,1083.0,1031.0
1076,2019/01/18,1079.0,1070.283,1067.0,450000,1081.0,1048.0
1077,2019/01/21,1101.0,1101.362,1077.0,221500,1118.0,1075.0
1078,2019/01/22,1132.0,1130.831,1112.0,343900,1142.0,1104.0
1079,2019/01/23,1122.0,1112.393,1113.0,282000,1126.0,1100.0
1080,2019/01/24,1152.0,1143.066,1122.0,214100,1152.0,1113.0
1081,2019/01/25,1137.0,1139.647,1143.0,275300,1157.0,1132.0
1082,2019/01/28,1141.0,1142.697,1150.0,350200,1152.0,1125.0
1083,2019/01/29,1144.0,1139.918,1128.0,378900,1168.0,1125.0
1084,2019/01/30,1132.0,1129.128,1148.0,302600,1148.0,1109.0
1085,2019/01/31,1139.0,1139.119,1153.0,323300,1160.0,1130.0
1086,2019/02/01,1140.0,1125.178,1126.0,364000,1140.0,1106.0
1087,2019/02/04,1170.0,1163.299,1138.0,209700,1172.0,1135.0
1088,2019/02/05,1193.0,1185.723,1175.0,250300,1193.0,1167.0
1089,2019/02/06,1201.0,1200.39,1200.0,313300,1214.0,1189.0
1090,2019/02/07,1187.0,1193.796,1200.0,228900,1206.0,1183.0
1091,2019/02/08,1168.0,1168.324,1172.0,356100,1180.0,1154.0
1092,2019/02/12,1193.0,1199.504,1179.0,706000,1222.0,1174.0
1093,2019/02/13,1185.0,1190.941,1204.0,457200,1211.0,1178.0
1094,2019/02/14,1206.0,1203.523,1181.0,421800,1218.0,1180.0
1095,2019/02/15,1177.0,1181.733,1202.0,203000,1202.0,1175.0
1096,2019/02/18,1179.0,1185.9,1194.0,133400,1197.0,1176.0
1097,2019/02/19,1205.0,1195.716,1179.0,212200,1209.0,1175.0
1098,2019/02/20,1220.0,1220.843,1210.0,294200,1232.0,1198.0
1099,2019/02/21,1240.0,1224.843,1210.0,275100,1244.0,1197.0
1100,2019/02/22,1212.0,1216.994,1224.0,138500,1235.0,1210.0
1101,2019/02/25,1228.0,1222.929,1217.0,135700,1231.0,1211.0
1102,2019/02/26,1218.0,1213.624,1228.0,165200,1229.0,1205.0
1103,2019/02/27,1208.0,1207.103,1213.0,189500,1220.0,1197.0
1104,2019/02/28,1189.0,1189.03,1202.0,165200,1202.0,1176.0
1105,2019/03/01,1204.0,1193.504,1189.0,163900,1204.0,1171.0
1106,2019/03/04,1217.0,1215.847,1211.0,112400,1221.0,1210.0
1107,2019/03/05,1219.0,1215.673,1205.0,146800,1224.0,1197.0
1108,2019/03/06,1219.0,1215.052,1205.0,113100,1226.0,1203.0
1109,2019/03/07,1210.0,1207.061,1210.0,166000,1216.0,1197.0
1110,2019/03/08,1170.0,1182.621,1190.0,154500,1207.0,1168.0
1111,2019/03/11,1152.0,1152.483,1159.0,208800,1169.0,1138.0
1112,2019/03/12,1193.0,1192.604,1162.0,180900,1202.0,1162.0
1113,2019/03/13,1172.0,1167.991,1174.0,164400,1184.0,1155.0
1114,2019/03/14,1130.0,1142.783,1163.0,180500,1165.0,1130.0
1115,2019/03/15,1143.0,1147.266,1140.0,200100,1158.0,1132.0
1116,2019/03/18,1125.0,1118.948,1137.0,493800,1147.0,1101.0
1117,2019/03/19,1148.0,1146.648,1127.0,227900,1154.0,1126.0
1118,2019/03/20,1137.0,1140.768,1150.0,209000,1161.0,1133.0
1119,2019/03/22,1098.0,1100.772,1131.0,378400,1135.0,1086.0
1120,2019/03/25,1062.0,1061.212,1071.0,370500,1084.0,1050.0
1121,2019/03/26,1105.0,1098.628,1090.0,325300,1108.0,1082.0
1122,2019/03/27,1128.0,1109.054,1095.0,349100,1129.0,1088.0
1123,2019/03/28,1096.0,1101.106,1122.0,300600,1125.0,1095.0
1124,2019/03/29,1150.0,1155.224,1121.0,679100,1174.0,1119.0
1125,2019/04/01,1133.0,1141.484,1157.0,676500,1166.0,1122.0
1126,2019/04/02,1110.0,1102.44,1073.0,1129600,1142.0,1054.0
1127,2019/04/03,1118.0,1109.272,1097.0,335000,1121.0,1095.0
1128,2019/04/04,1115.0,1112.311,1107.0,249000,1120.0,1097.0
1129,2019/04/05,1131.0,1131.441,1136.0,163800,1140.0,1125.0
1130,2019/04/08,1122.0,1123.242,1131.0,256600,1140.0,1111.0
1131,2019/04/09,1128.0,1122.413,1114.0,293000,1130.0,1105.0
1132,2019/04/10,1143.0,1131.937,1106.0,273700,1147.0,1105.0
1133,2019/04/11,1117.0,1124.9,1125.0,286300,1140.0,1116.0
1134,2019/04/12,1130.0,1133.315,1134.0,178500,1143.0,1128.0
1135,2019/04/15,1161.0,1156.969,1149.0,281600,1164.0,1145.0
1136,2019/04/16,1149.0,1154.623,1160.0,212000,1169.0,1144.0
1137,2019/04/17,1153.0,1156.127,1152.0,146100,1163.0,1144.0
1138,2019/04/18,1127.0,1143.314,1161.0,219100,1169.0,1127.0
1139,2019/04/19,1134.0,1134.816,1140.0,140000,1148.0,1126.0
1140,2019/04/22,1131.0,1137.834,1134.0,157400,1151.0,1127.0
1141,2019/04/23,1130.0,1130.151,1129.0,211600,1150.0,1122.0
1142,2019/04/24,1137.0,1135.685,1132.0,265800,1147.0,1122.0
1143,2019/04/25,1170.0,1169.83,1140.0,1047300,1187.0,1135.0
1144,2019/04/26,1144.0,1141.357,1170.0,276000,1170.0,1125.0
1145,2019/05/07,1134.0,1145.191,1145.0,250000,1166.0,1134.0
1146,2019/05/08,1122.0,1121.904,1113.0,305200,1139.0,1102.0
1147,2019/05/09,1115.0,1112.702,1109.0,267100,1118.0,1102.0
1148,2019/05/10,1121.0,1120.803,1112.0,175000,1144.0,1106.0
1149,2019/05/13,1115.0,1112.599,1120.0,136600,1120.0,1101.0
1150,2019/05/14,1103.0,1092.41,1090.0,130200,1104.0,1073.0
1151,2019/05/15,1114.0,1110.199,1110.0,259500,1115.0,1100.0
1152,2019/05/16,1094.0,1091.338,1086.0,157100,1097.0,1083.0
1153,2019/05/17,1102.0,1102.87,1106.0,154800,1108.0,1098.0
1154,2019/05/20,1089.0,1093.901,1099.0,102300,1106.0,1089.0
1155,2019/05/21,1065.0,1066.659,1078.0,111500,1082.0,1058.0
1156,2019/05/22,1085.0,1082.276,1066.0,239300,1090.0,1064.0
1157,2019/05/23,1106.0,1100.272,1078.0,202300,1110.0,1071.0
1158,2019/05/24,1106.0,1103.314,1094.0,140000,1112.0,1091.0
1159,2019/05/27,1133.0,1126.244,1112.0,98900,1133.0,1105.0
1160,2019/05/28,1166.0,1158.94,1133.0,268400,1172.0,1129.0
1161,2019/05/29,1148.0,1146.654,1150.0,138000,1154.0,1135.0
1162,2019/05/30,1153.0,1148.02,1137.0,128400,1154.0,1134.0
1163,2019/05/31,1150.0,1148.031,1143.0,106200,1154.0,1140.0
1164,2019/06/03,1121.0,1127.339,1134.0,133500,1145.0,1117.0
1165,2019/06/04,1128.0,1123.462,1120.0,130200,1133.0,1117.0
1166,2019/06/05,1150.0,1151.569,1158.0,135200,1165.0,1146.0
1167,2019/06/06,1143.0,1153.1,1158.0,132200,1167.0,1143.0
1168,2019/06/07,1159.0,1147.984,1140.0,227000,1161.0,1122.0
1169,2019/06/10,1180.0,1174.937,1160.0,121500,1183.0,1160.0
1170,2019/06/11,1144.0,1151.005,1170.0,136400,1174.0,1141.0
1171,2019/06/12,1143.0,1148.227,1146.0,102100,1160.0,1140.0
1172,2019/06/13,1135.0,1128.797,1134.0,125200,1135.0,1118.0
1173,2019/06/14,1151.0,1149.665,1149.0,147600,1157.0,1134.0
1174,2019/06/17,1162.0,1165.266,1160.0,227900,1180.0,1155.0
1175,2019/06/18,1150.0,1154.78,1156.0,145600,1174.0,1146.0
1176,2019/06/19,1161.0,1161.288,1167.0,168300,1175.0,1156.0
1177,2019/06/20,1170.0,1168.358,1171.0,181200,1174.0,1162.0
1178,2019/06/21,1156.0,1162.052,1177.0,230800,1182.0,1155.0
1179,2019/06/24,1139.0,1140.215,1158.0,108600,1158.0,1133.0
1180,2019/06/25,1152.0,1147.262,1136.0,130000,1154.0,1136.0
1181,2019/06/26,1135.0,1142.039,1152.0,105500,1152.0,1135.0
1182,2019/06/27,1143.0,1142.917,1145.0,153300,1153.0,1137.0
1183,2019/06/28,1149.0,1148.018,1144.0,183200,1156.0,1141.0
1184,2019/07/01,1155.0,1153.683,1169.0,476800,1188.0,1130.0
1185,2019/07/02,1194.0,1212.09,1155.0,1339900,1243.0,1155.0
1186,2019/07/03,1119.0,1147.6,1199.0,843000,1209.0,1116.0
1187,2019/07/04,1186.0,1170.958,1120.0,650700,1192.0,1120.0
1188,2019/07/05,1174.0,1179.891,1190.0,223400,1198.0,1171.0
1189,2019/07/08,1206.0,1214.132,1170.0,730500,1235.0,1164.0
1190,2019/07/09,1252.0,1240.291,1201.0,508800,1256.0,1200.0
1191,2019/07/10,1324.0,1298.961,1260.0,836000,1325.0,1256.0
1192,2019/07/11,1337.0,1344.921,1326.0,586500,1360.0,1326.0
1193,2019/07/12,1313.0,1316.905,1335.0,413500,1335.0,1293.0
1194,2019/07/16,1295.0,1294.271,1296.0,359700,1315.0,1276.0
1195,2019/07/17,1287.0,1290.055,1290.0,284300,1299.0,1283.0
1196,2019/07/18,1273.0,1283.682,1293.0,328200,1300.0,1270.0
1197,2019/07/19,1296.0,1292.527,1280.0,246200,1300.0,1276.0
1198,2019/07/22,1302.0,1305.612,1298.0,214100,1317.0,1297.0
1199,2019/07/23,1319.0,1316.542,1301.0,260200,1323.0,1297.0
1200,2019/07/24,1324.0,1319.694,1320.0,306100,1324.0,1313.0
1201,2019/07/25,1325.0,1321.856,1324.0,180100,1328.0,1314.0
1202,2019/07/26,1340.0,1338.436,1328.0,217600,1347.0,1325.0
1203,2019/07/29,1354.0,1348.836,1340.0,247900,1357.0,1338.0
1204,2019/07/30,1355.0,1353.668,1354.0,1100100,1363.0,1339.0
1205,2019/07/31,1316.0,1325.979,1335.0,300300,1349.0,1314.0
1206,2019/08/01,1316.0,1309.528,1289.0,183800,1323.0,1289.0
1207,2019/08/02,1291.0,1291.444,1286.0,258500,1312.0,1279.0
1208,2019/08/05,1276.0,1274.91,1276.0,186900,1286.0,1267.0
1209,2019/08/06,1272.0,1265.914,1250.0,191700,1280.0,1244.0
1210,2019/08/07,1261.0,1258.685,1251.0,147400,1265.0,1249.0
1211,2019/08/08,1261.0,1259.252,1255.0,158100,1268.0,1246.0
1212,2019/08/09,1269.0,1274.593,1267.0,185000,1286.0,1263.0
1213,2019/08/13,1257.0,1254.442,1253.0,179200,1263.0,1244.0
1214,2019/08/14,1266.0,1264.271,1268.0,125000,1273.0,1257.0
1215,2019/08/15,1242.0,1244.241,1239.0,80100,1255.0,1235.0
1216,2019/08/16,1235.0,1235.343,1234.0,84800,1245.0,1227.0
1217,2019/08/19,1246.0,1243.855,1240.0,95400,1250.0,1233.0
1218,2019/08/20,1254.0,1251.082,1240.0,142300,1262.0,1233.0
1219,2019/08/21,1235.0,1237.85,1237.0,55800,1245.0,1235.0
1220,2019/08/22,1234.0,1235.075,1244.0,80900,1244.0,1229.0
1221,2019/08/23,1259.0,1253.748,1244.0,127400,1260.0,1241.0
