,Date,Close,VWAP,Open,Volume,High,Low
0,2014/08/25,1219.0,1218.214,1213.0,113100,1225.0,1210.0
1,2014/08/26,1217.0,1217.633,1213.0,100700,1224.0,1209.0
2,2014/08/27,1218.0,1218.855,1218.0,58800,1226.0,1214.0
3,2014/08/28,1211.0,1211.238,1216.0,119900,1217.0,1205.0
4,2014/08/29,1206.0,1209.494,1210.0,105100,1217.0,1201.0
5,2014/09/01,1227.0,1220.708,1213.0,93700,1228.0,1211.0
6,2014/09/02,1214.0,1224.061,1237.0,184100,1241.0,1213.0
7,2014/09/03,1209.0,1214.411,1228.0,104000,1233.0,1208.0
8,2014/09/04,1199.0,1204.042,1210.0,64800,1210.0,1199.0
9,2014/09/05,1185.0,1191.178,1210.0,96000,1210.0,1184.0
10,2014/09/08,1176.0,1180.168,1186.0,148600,1190.0,1171.0
11,2014/09/09,1180.0,1179.901,1177.0,63800,1185.0,1172.0
12,2014/09/10,1171.0,1172.44,1173.0,101300,1180.0,1169.0
13,2014/09/11,1171.0,1172.028,1176.0,111200,1180.0,1168.0
14,2014/09/12,1171.0,1168.582,1166.0,157800,1175.0,1166.0
15,2014/09/16,1159.0,1161.909,1171.0,156500,1172.0,1156.0
16,2014/09/17,1146.0,1151.134,1155.0,224300,1156.0,1145.0
17,2014/09/18,1138.0,1145.076,1145.0,192300,1155.0,1136.0
18,2014/09/19,1140.0,1138.322,1133.0,228300,1149.0,1133.0
19,2014/09/22,1137.0,1134.943,1140.0,114100,1148.0,1130.0
20,2014/09/24,1131.0,1130.076,1135.0,157700,1135.0,1126.0
21,2014/09/25,1134.0,1134.485,1139.0,251300,1143.0,1130.0
22,2014/09/26,1145.0,1139.743,1127.0,225300,1150.0,1122.0
23,2014/09/29,1169.0,1161.992,1152.0,174300,1170.0,1147.0
24,2014/09/30,1161.0,1157.834,1170.0,196600,1170.0,1146.0
25,2014/10/01,1155.0,1160.998,1168.0,98900,1170.0,1152.0
26,2014/10/02,1120.0,1130.173,1146.0,175500,1146.0,1118.0
27,2014/10/03,1125.0,1127.473,1116.0,118400,1137.0,1116.0
28,2014/10/06,1152.0,1131.014,1126.0,264500,1161.0,1100.0
29,2014/10/07,1112.0,1130.066,1155.0,193200,1157.0,1111.0
30,2014/10/08,1095.0,1091.452,1091.0,165800,1100.0,1079.0
31,2014/10/09,1076.0,1091.367,1104.0,254200,1112.0,1076.0
32,2014/10/10,1060.0,1071.479,1067.0,234500,1089.0,1054.0
33,2014/10/14,1102.0,1097.803,1060.0,389800,1117.0,1055.0
34,2014/10/15,1100.0,1100.642,1113.0,180800,1123.0,1090.0
35,2014/10/16,1073.0,1079.415,1070.0,177300,1095.0,1068.0
36,2014/10/17,1067.0,1079.975,1080.0,192000,1102.0,1066.0
37,2014/10/20,1143.0,1127.53,1104.0,166800,1144.0,1104.0
38,2014/10/21,1100.0,1111.11,1145.0,207900,1147.0,1092.0
39,2014/10/22,1124.0,1118.239,1120.0,72500,1129.0,1110.0
40,2014/10/23,1088.0,1094.69,1115.0,146600,1115.0,1079.0
41,2014/10/24,1098.0,1100.77,1112.0,79000,1114.0,1089.0
42,2014/10/27,1109.0,1104.257,1103.0,81600,1114.0,1088.0
43,2014/10/28,1088.0,1091.676,1103.0,54600,1108.0,1084.0
44,2014/10/29,1089.0,1093.189,1099.0,97100,1102.0,1084.0
45,2014/10/30,1087.0,1084.199,1085.0,276800,1089.0,1075.0
46,2014/10/31,1099.0,1091.569,1101.0,324900,1104.0,1076.0
47,2014/11/04,1133.0,1134.374,1138.0,349100,1148.0,1112.0
48,2014/11/05,1158.0,1150.875,1132.0,277800,1164.0,1128.0
49,2014/11/06,1131.0,1142.021,1150.0,116200,1162.0,1129.0
50,2014/11/07,1152.0,1147.523,1141.0,63700,1155.0,1134.0
51,2014/11/10,1158.0,1155.283,1149.0,45300,1162.0,1145.0
52,2014/11/11,1150.0,1152.084,1161.0,64300,1165.0,1141.0
53,2014/11/12,1143.0,1152.176,1160.0,55000,1162.0,1143.0
54,2014/11/13,1144.0,1143.378,1138.0,68500,1150.0,1136.0
55,2014/11/14,1145.0,1150.453,1165.0,110400,1165.0,1138.0
56,2014/11/17,1112.0,1124.819,1145.0,101300,1145.0,1110.0
57,2014/11/18,1133.0,1126.11,1110.0,81000,1135.0,1110.0
58,2014/11/19,1109.0,1121.838,1135.0,135400,1139.0,1109.0
59,2014/11/20,1117.0,1118.843,1109.0,146400,1126.0,1109.0
60,2014/11/21,1121.0,1116.842,1118.0,78600,1125.0,1111.0
61,2014/11/25,1118.0,1119.347,1134.0,81300,1134.0,1112.0
62,2014/11/26,1122.0,1125.974,1120.0,73500,1135.0,1116.0
63,2014/11/27,1138.0,1137.918,1126.0,133400,1145.0,1121.0
64,2014/11/28,1154.0,1149.399,1145.0,110700,1159.0,1139.0
65,2014/12/01,1150.0,1151.731,1153.0,99900,1162.0,1143.0
66,2014/12/02,1139.0,1134.925,1140.0,77400,1145.0,1125.0
67,2014/12/03,1147.0,1151.86,1145.0,125400,1158.0,1143.0
68,2014/12/04,1148.0,1148.063,1146.0,88400,1152.0,1139.0
69,2014/12/05,1144.0,1141.832,1144.0,51700,1145.0,1137.0
70,2014/12/08,1142.0,1145.46,1148.0,88300,1152.0,1139.0
71,2014/12/09,1132.0,1134.281,1124.0,78300,1144.0,1124.0
72,2014/12/10,1123.0,1123.876,1130.0,80900,1140.0,1117.0
73,2014/12/11,1106.0,1110.231,1116.0,131500,1118.0,1104.0
74,2014/12/12,1082.0,1092.23,1094.0,204600,1108.0,1082.0
75,2014/12/15,1073.0,1075.767,1076.0,86500,1082.0,1070.0
76,2014/12/16,1058.0,1062.839,1068.0,209500,1073.0,1055.0
77,2014/12/17,1063.0,1063.732,1046.0,105300,1087.0,1046.0
78,2014/12/18,1101.0,1095.982,1081.0,114500,1104.0,1081.0
79,2014/12/19,1123.0,1113.889,1102.0,117300,1123.0,1102.0
80,2014/12/22,1137.0,1128.542,1118.0,109700,1137.0,1107.0
81,2014/12/24,1126.0,1137.028,1143.0,156600,1149.0,1124.0
82,2014/12/25,1113.0,1115.782,1127.0,77200,1127.0,1107.0
83,2014/12/26,1143.0,1129.755,1114.0,97600,1146.0,1112.0
84,2014/12/29,1136.0,1138.491,1147.0,67000,1148.0,1123.0
85,2014/12/30,1136.0,1133.325,1135.0,76400,1145.0,1123.0
86,2015/01/05,1148.0,1146.713,1131.0,111400,1161.0,1126.0
87,2015/01/06,1117.0,1125.007,1125.0,97300,1133.0,1115.0
88,2015/01/07,1113.0,1117.713,1115.0,60300,1124.0,1113.0
89,2015/01/08,1128.0,1122.905,1118.0,71700,1131.0,1118.0
90,2015/01/09,1118.0,1121.864,1124.0,60200,1128.0,1115.0
91,2015/01/13,1117.0,1113.14,1118.0,109700,1120.0,1107.0
92,2015/01/14,1105.0,1114.323,1120.0,103900,1124.0,1105.0
93,2015/01/15,1145.0,1133.298,1110.0,142600,1149.0,1110.0
94,2015/01/16,1117.0,1114.13,1121.0,107200,1133.0,1103.0
95,2015/01/19,1109.0,1113.524,1132.0,40100,1132.0,1107.0
96,2015/01/20,1118.0,1112.245,1104.0,84000,1124.0,1104.0
97,2015/01/21,1107.0,1110.207,1118.0,56100,1118.0,1105.0
98,2015/01/22,1104.0,1099.346,1107.0,70800,1107.0,1094.0
99,2015/01/23,1105.0,1107.117,1114.0,56200,1114.0,1100.0
100,2015/01/26,1095.0,1096.199,1095.0,60300,1104.0,1093.0
101,2015/01/27,1126.0,1118.119,1107.0,134100,1127.0,1103.0
102,2015/01/28,1121.0,1119.072,1118.0,42900,1126.0,1113.0
103,2015/01/29,1105.0,1109.127,1112.0,63900,1117.0,1104.0
104,2015/01/30,1123.0,1120.893,1117.0,98800,1126.0,1112.0
105,2015/02/02,1114.0,1116.101,1116.0,75500,1124.0,1110.0
106,2015/02/03,1104.0,1110.34,1120.0,105700,1126.0,1098.0
107,2015/02/04,1125.0,1127.704,1111.0,156600,1137.0,1110.0
108,2015/02/05,1119.0,1118.166,1120.0,71500,1128.0,1110.0
109,2015/02/06,1103.0,1107.846,1117.0,100600,1121.0,1100.0
110,2015/02/09,1107.0,1105.724,1116.0,117900,1116.0,1102.0
111,2015/02/10,1098.0,1099.96,1104.0,132500,1110.0,1095.0
112,2015/02/12,1105.0,1109.56,1119.0,162400,1121.0,1104.0
113,2015/02/13,1090.0,1096.322,1103.0,179400,1103.0,1090.0
114,2015/02/16,1115.0,1117.302,1111.0,218600,1126.0,1102.0
115,2015/02/17,1116.0,1116.864,1118.0,153300,1126.0,1110.0
116,2015/02/18,1142.0,1135.589,1125.0,150800,1145.0,1117.0
117,2015/02/19,1153.0,1148.812,1140.0,212500,1155.0,1138.0
118,2015/02/20,1159.0,1156.974,1154.0,84600,1161.0,1150.0
119,2015/02/23,1160.0,1164.468,1164.0,156100,1174.0,1155.0
120,2015/02/24,1176.0,1168.712,1163.0,456600,1177.0,1159.0
121,2015/02/25,1152.0,1149.486,1149.0,159800,1157.0,1135.0
122,2015/02/26,1152.0,1151.164,1143.0,117200,1157.0,1140.0
123,2015/02/27,1159.0,1160.392,1158.0,177700,1164.0,1152.0
124,2015/03/02,1152.0,1158.128,1168.0,75600,1168.0,1151.0
125,2015/03/03,1148.0,1152.194,1148.0,116700,1159.0,1142.0
126,2015/03/04,1135.0,1136.329,1141.0,81700,1145.0,1126.0
127,2015/03/05,1132.0,1133.804,1132.0,68400,1141.0,1126.0
128,2015/03/06,1131.0,1129.58,1133.0,74100,1136.0,1123.0
129,2015/03/09,1129.0,1126.9,1127.0,86900,1136.0,1123.0
130,2015/03/10,1127.0,1129.81,1132.0,91200,1137.0,1123.0
131,2015/03/11,1138.0,1128.951,1123.0,124000,1140.0,1117.0
132,2015/03/12,1140.0,1140.717,1143.0,106400,1145.0,1125.0
133,2015/03/13,1155.0,1152.324,1152.0,229400,1160.0,1141.0
134,2015/03/16,1176.0,1169.37,1159.0,164800,1178.0,1151.0
135,2015/03/17,1167.0,1169.167,1176.0,114100,1177.0,1164.0
136,2015/03/18,1153.0,1155.99,1174.0,112300,1174.0,1149.0
137,2015/03/19,1144.0,1147.132,1154.0,85900,1157.0,1141.0
138,2015/03/20,1174.0,1163.745,1148.0,125500,1175.0,1145.0
139,2015/03/23,1163.0,1170.038,1178.0,123300,1184.0,1160.0
140,2015/03/24,1202.0,1185.354,1166.0,252200,1205.0,1162.0
141,2015/03/25,1200.0,1196.201,1200.0,166300,1206.0,1184.0
142,2015/03/26,1214.0,1207.374,1199.0,232100,1219.0,1192.0
143,2015/03/27,1175.0,1192.509,1208.0,139600,1221.0,1169.0
144,2015/03/30,1168.0,1164.639,1181.0,109000,1182.0,1155.0
145,2015/03/31,1168.0,1179.554,1180.0,64400,1193.0,1167.0
146,2015/04/01,1179.0,1169.528,1150.0,142900,1186.0,1148.0
147,2015/04/02,1181.0,1185.885,1175.0,111400,1198.0,1175.0
148,2015/04/03,1187.0,1180.852,1190.0,62100,1190.0,1173.0
149,2015/04/06,1171.0,1172.254,1172.0,72000,1182.0,1167.0
150,2015/04/07,1199.0,1193.062,1179.0,102400,1205.0,1175.0
151,2015/04/08,1197.0,1203.02,1200.0,85300,1211.0,1194.0
152,2015/04/09,1192.0,1189.182,1201.0,92800,1201.0,1181.0
153,2015/04/10,1208.0,1205.024,1200.0,255800,1215.0,1183.0
154,2015/04/13,1196.0,1197.388,1200.0,165000,1213.0,1179.0
155,2015/04/14,1231.0,1227.535,1203.0,190800,1236.0,1199.0
156,2015/04/15,1229.0,1235.947,1238.0,94400,1249.0,1225.0
157,2015/04/16,1198.0,1194.899,1215.0,247500,1218.0,1182.0
158,2015/04/17,1192.0,1189.998,1193.0,120300,1199.0,1184.0
159,2015/04/20,1181.0,1183.745,1182.0,133900,1195.0,1171.0
160,2015/04/21,1178.0,1178.179,1179.0,93400,1188.0,1172.0
161,2015/04/22,1189.0,1192.183,1188.0,64100,1198.0,1186.0
162,2015/04/23,1180.0,1183.247,1194.0,84500,1194.0,1178.0
163,2015/04/24,1183.0,1184.187,1181.0,95500,1188.0,1179.0
164,2015/04/27,1176.0,1174.098,1185.0,79500,1185.0,1167.0
165,2015/04/28,1184.0,1186.699,1178.0,99300,1193.0,1178.0
166,2015/04/30,1193.0,1188.817,1189.0,173900,1198.0,1177.0
167,2015/05/01,1187.0,1182.554,1180.0,108300,1190.0,1175.0
168,2015/05/07,1198.0,1201.592,1180.0,179900,1212.0,1180.0
169,2015/05/08,1207.0,1206.451,1204.0,213200,1211.0,1195.0
170,2015/05/11,1217.0,1218.734,1222.0,163100,1223.0,1212.0
171,2015/05/12,1248.0,1232.621,1215.0,264700,1248.0,1199.0
172,2015/05/13,1225.0,1233.138,1235.0,124100,1243.0,1222.0
173,2015/05/14,1212.0,1211.823,1218.0,128200,1230.0,1203.0
174,2015/05/15,1234.0,1230.106,1224.0,111100,1242.0,1220.0
175,2015/05/18,1243.0,1238.684,1237.0,94900,1245.0,1233.0
176,2015/05/19,1238.0,1233.32,1231.0,124900,1243.0,1223.0
177,2015/05/20,1262.0,1259.309,1240.0,168900,1268.0,1240.0
178,2015/05/21,1250.0,1253.602,1267.0,133100,1267.0,1245.0
179,2015/05/22,1266.0,1262.103,1254.0,90100,1267.0,1252.0
180,2015/05/25,1263.0,1266.269,1268.0,88400,1278.0,1260.0
181,2015/05/26,1271.0,1269.543,1263.0,78300,1276.0,1259.0
182,2015/05/27,1282.0,1281.019,1274.0,108900,1285.0,1273.0
183,2015/05/28,1282.0,1289.106,1285.0,113300,1297.0,1280.0
184,2015/05/29,1288.0,1285.326,1274.0,96200,1293.0,1274.0
185,2015/06/01,1291.0,1285.871,1288.0,80900,1291.0,1281.0
186,2015/06/02,1298.0,1299.782,1291.0,127300,1309.0,1288.0
187,2015/06/03,1282.0,1282.159,1290.0,97100,1294.0,1275.0
188,2015/06/04,1272.0,1276.107,1273.0,124700,1285.0,1267.0
189,2015/06/05,1291.0,1291.464,1275.0,121800,1298.0,1275.0
190,2015/06/08,1286.0,1289.621,1290.0,52700,1298.0,1283.0
191,2015/06/09,1275.0,1286.119,1277.0,94900,1297.0,1275.0
192,2015/06/10,1279.0,1294.289,1284.0,124000,1308.0,1279.0
193,2015/06/11,1278.0,1285.472,1290.0,88600,1294.0,1276.0
194,2015/06/12,1274.0,1280.999,1286.0,164400,1295.0,1270.0
195,2015/06/15,1284.0,1278.669,1281.0,62900,1285.0,1271.0
196,2015/06/16,1245.0,1256.603,1278.0,160500,1285.0,1244.0
197,2015/06/17,1262.0,1264.865,1252.0,114200,1278.0,1252.0
198,2015/06/18,1254.0,1255.626,1279.0,76400,1279.0,1240.0
199,2015/06/19,1270.0,1264.005,1255.0,127900,1270.0,1253.0
200,2015/06/22,1271.0,1270.321,1269.0,85700,1276.0,1262.0
201,2015/06/23,1280.0,1279.632,1275.0,132200,1285.0,1273.0
202,2015/06/24,1279.0,1283.183,1281.0,98100,1293.0,1278.0
203,2015/06/25,1274.0,1273.758,1267.0,88800,1280.0,1266.0
204,2015/06/26,1268.0,1264.637,1273.0,61400,1273.0,1253.0
205,2015/06/29,1247.0,1253.608,1264.0,101600,1264.0,1245.0
206,2015/06/30,1248.0,1246.011,1246.0,79500,1253.0,1242.0
207,2015/07/01,1237.0,1236.07,1248.0,72600,1248.0,1231.0
208,2015/07/02,1242.0,1242.488,1247.0,70500,1248.0,1236.0
209,2015/07/03,1252.0,1244.659,1251.0,80700,1255.0,1236.0
210,2015/07/06,1202.0,1212.132,1227.0,177200,1230.0,1201.0
211,2015/07/07,1218.0,1225.266,1210.0,123500,1240.0,1210.0
212,2015/07/08,1194.0,1204.994,1216.0,143300,1225.0,1193.0
213,2015/07/09,1234.0,1203.276,1180.0,251300,1237.0,1168.0
214,2015/07/10,1191.0,1195.328,1239.0,228700,1239.0,1181.0
215,2015/07/13,1189.0,1189.397,1191.0,103800,1201.0,1179.0
216,2015/07/14,1214.0,1212.363,1206.0,145300,1224.0,1200.0
217,2015/07/15,1223.0,1220.686,1223.0,100700,1228.0,1214.0
218,2015/07/16,1230.0,1228.028,1225.0,130900,1236.0,1220.0
219,2015/07/17,1218.0,1217.729,1229.0,54700,1229.0,1211.0
220,2015/07/21,1219.0,1220.254,1221.0,65100,1228.0,1214.0
221,2015/07/22,1199.0,1201.085,1205.0,66900,1207.0,1197.0
222,2015/07/23,1203.0,1194.11,1194.0,88800,1204.0,1186.0
223,2015/07/24,1205.0,1206.353,1199.0,78700,1214.0,1198.0
224,2015/07/27,1193.0,1193.723,1202.0,89200,1204.0,1187.0
225,2015/07/28,1181.0,1178.608,1181.0,65600,1188.0,1168.0
226,2015/07/29,1176.0,1173.302,1179.0,84400,1189.0,1166.0
227,2015/07/30,1185.0,1182.765,1180.0,95300,1189.0,1173.0
228,2015/07/31,1191.0,1186.563,1185.0,55400,1193.0,1173.0
229,2015/08/03,1185.0,1185.163,1186.0,66100,1195.0,1177.0
230,2015/08/04,1185.0,1179.07,1179.0,88800,1186.0,1170.0
231,2015/08/05,1178.0,1185.827,1178.0,133900,1199.0,1170.0
232,2015/08/06,1217.0,1213.41,1191.0,202800,1223.0,1189.0
233,2015/08/07,1214.0,1224.063,1225.0,108800,1238.0,1210.0
234,2015/08/10,1236.0,1228.687,1214.0,158000,1239.0,1211.0
235,2015/08/11,1248.0,1248.877,1245.0,133000,1265.0,1236.0
236,2015/08/12,1248.0,1247.33,1240.0,95800,1260.0,1237.0
237,2015/08/13,1252.0,1248.787,1246.0,95800,1260.0,1237.0
238,2015/08/14,1225.0,1223.618,1246.0,75600,1246.0,1213.0
239,2015/08/17,1187.0,1197.064,1225.0,138000,1227.0,1179.0
240,2015/08/18,1200.0,1197.351,1187.0,121800,1210.0,1184.0
241,2015/08/19,1209.0,1216.257,1198.0,141300,1228.0,1194.0
242,2015/08/20,1182.0,1190.644,1200.0,55300,1207.0,1182.0
243,2015/08/21,1133.0,1143.339,1152.0,103900,1160.0,1130.0
244,2015/08/24,1073.0,1102.56,1100.0,151700,1128.0,1073.0
245,2015/08/25,1034.0,1047.044,1021.0,176500,1090.0,1011.0
246,2015/08/26,1073.0,1059.273,1043.0,151500,1082.0,1025.0
247,2015/08/27,1088.0,1096.507,1089.0,117700,1114.0,1083.0
248,2015/08/28,1136.0,1132.276,1119.0,106200,1145.0,1110.0
249,2015/08/31,1113.0,1111.102,1124.0,103600,1124.0,1101.0
250,2015/09/01,1085.0,1109.325,1119.0,147400,1127.0,1085.0
251,2015/09/02,1085.0,1083.934,1065.0,130800,1111.0,1055.0
252,2015/09/03,1091.0,1097.646,1094.0,75700,1109.0,1087.0
253,2015/09/04,1065.0,1071.472,1103.0,88600,1103.0,1056.0
254,2015/09/07,1053.0,1054.285,1059.0,55400,1078.0,1043.0
255,2015/09/08,1022.0,1032.062,1048.0,88100,1052.0,1016.0
256,2015/09/09,1064.0,1058.678,1050.0,120200,1073.0,1047.0
257,2015/09/10,1076.0,1064.507,1043.0,93000,1079.0,1037.0
258,2015/09/11,1081.0,1083.27,1089.0,145600,1090.0,1064.0
259,2015/09/14,1088.0,1090.727,1091.0,129400,1107.0,1076.0
260,2015/09/15,1101.0,1104.97,1100.0,117900,1115.0,1090.0
261,2015/09/16,1100.0,1090.746,1101.0,112000,1112.0,1076.0
262,2015/09/17,1105.0,1104.238,1099.0,150300,1125.0,1095.0
263,2015/09/18,1098.0,1097.87,1100.0,106500,1108.0,1087.0
264,2015/09/24,1078.0,1083.13,1077.0,94600,1099.0,1071.0
265,2015/09/25,1088.0,1081.953,1078.0,95900,1098.0,1068.0
266,2015/09/28,1099.0,1093.016,1080.0,154700,1108.0,1076.0
267,2015/09/29,1055.0,1068.722,1083.0,181400,1087.0,1053.0
268,2015/09/30,1079.0,1087.163,1075.0,207200,1106.0,1075.0
269,2015/10/01,1075.0,1074.226,1088.0,167900,1089.0,1060.0
270,2015/10/02,1057.0,1056.314,1068.0,133000,1074.0,1048.0
271,2015/10/05,1077.0,1077.869,1079.0,158700,1089.0,1067.0
272,2015/10/06,1072.0,1082.863,1088.0,202500,1115.0,1070.0
273,2015/10/07,1078.0,1089.232,1083.0,241500,1113.0,1072.0
274,2015/10/08,1101.0,1099.62,1090.0,317900,1120.0,1083.0
275,2015/10/09,1100.0,1099.356,1101.0,169400,1115.0,1091.0
276,2015/10/13,1025.0,1029.127,1040.0,614500,1054.0,1020.0
277,2015/10/14,1015.0,1019.711,1017.0,395500,1033.0,1014.0
278,2015/10/15,1027.0,1026.059,1022.0,399100,1035.0,1018.0
279,2015/10/16,1010.0,1013.605,1026.0,328000,1026.0,1006.0
280,2015/10/19,999.0,1000.232,1011.0,277700,1015.0,995.0
281,2015/10/20,988.0,989.808,1005.0,195800,1009.0,984.0
282,2015/10/21,996.0,988.374,985.0,301200,997.0,977.0
283,2015/10/22,988.0,989.604,996.0,195700,998.0,985.0
284,2015/10/23,1004.0,1003.944,1005.0,283100,1015.0,997.0
285,2015/10/26,1005.0,1004.358,1007.0,179600,1011.0,998.0
286,2015/10/27,976.0,979.593,996.0,415500,1003.0,975.0
287,2015/10/28,960.0,964.612,976.0,308700,978.0,959.0
288,2015/10/29,974.0,973.345,965.0,313300,982.0,965.0
289,2015/10/30,956.0,958.873,966.0,277700,973.0,952.0
290,2015/11/02,953.0,956.21,955.0,295100,966.0,945.0
291,2015/11/04,959.0,961.725,972.0,254100,980.0,955.0
292,2015/11/05,955.0,955.613,953.0,298400,965.0,951.0
293,2015/11/06,963.0,962.905,955.0,254900,972.0,951.0
294,2015/11/09,977.0,971.951,965.0,262300,978.0,961.0
295,2015/11/10,987.0,984.189,969.0,358800,990.0,969.0
296,2015/11/11,998.0,998.03,990.0,233800,1007.0,989.0
297,2015/11/12,996.0,995.332,1000.0,160400,1000.0,988.0
298,2015/11/13,1022.0,1011.953,990.0,615400,1023.0,981.0
299,2015/11/16,1010.0,1006.407,1007.0,197000,1012.0,1001.0
300,2015/11/17,1014.0,1015.525,1022.0,391500,1022.0,1010.0
301,2015/11/18,1010.0,1015.29,1020.0,189200,1026.0,1010.0
302,2015/11/19,1017.0,1022.145,1017.0,232700,1032.0,1013.0
303,2015/11/20,1029.0,1018.202,1012.0,352100,1034.0,998.0
304,2015/11/24,1032.0,1030.805,1029.0,224400,1035.0,1025.0
305,2015/11/25,1027.0,1030.33,1035.0,181600,1044.0,1025.0
306,2015/11/26,1044.0,1044.997,1043.0,243800,1049.0,1038.0
307,2015/11/27,1047.0,1054.034,1050.0,199400,1066.0,1046.0
308,2015/11/30,1057.0,1055.443,1054.0,248800,1063.0,1049.0
309,2015/12/01,1065.0,1065.385,1056.0,170500,1069.0,1053.0
310,2015/12/02,1054.0,1051.14,1059.0,201800,1063.0,1045.0
311,2015/12/03,1080.0,1074.655,1057.0,254500,1082.0,1057.0
312,2015/12/04,1047.0,1049.029,1052.0,213800,1055.0,1045.0
313,2015/12/07,1049.0,1051.455,1055.0,129600,1058.0,1047.0
314,2015/12/08,1050.0,1048.608,1049.0,172000,1056.0,1043.0
315,2015/12/09,1043.0,1046.476,1040.0,224000,1056.0,1036.0
316,2015/12/10,1016.0,1019.584,1031.0,215900,1036.0,1008.0
317,2015/12/11,1030.0,1024.49,1020.0,309000,1034.0,1017.0
318,2015/12/14,1014.0,1006.442,1003.0,159200,1014.0,992.0
319,2015/12/15,1002.0,1010.264,1024.0,125400,1029.0,1001.0
320,2015/12/16,1019.0,1017.021,1015.0,194400,1026.0,1005.0
321,2015/12/17,1031.0,1039.815,1040.0,192900,1062.0,1029.0
322,2015/12/18,1034.0,1044.394,1032.0,243700,1062.0,1030.0
323,2015/12/21,1021.0,1018.698,1026.0,98700,1031.0,1011.0
324,2015/12/22,1018.0,1023.046,1031.0,88300,1037.0,1017.0
325,2015/12/24,1017.0,1024.095,1030.0,83600,1037.0,1015.0
326,2015/12/25,1008.0,1010.277,1028.0,107100,1028.0,1004.0
327,2015/12/28,1029.0,1026.784,1010.0,113800,1033.0,1010.0
328,2015/12/29,1046.0,1040.318,1030.0,110500,1049.0,1024.0
329,2015/12/30,1048.0,1045.664,1040.0,63100,1050.0,1040.0
330,2016/01/04,1027.0,1033.561,1045.0,93100,1052.0,1024.0
331,2016/01/05,1020.0,1018.0,1015.0,132100,1027.0,1009.0
332,2016/01/06,1005.0,1008.157,1028.0,139900,1038.0,999.0
333,2016/01/07,987.0,990.65,995.0,191300,1003.0,984.0
334,2016/01/08,966.0,968.963,975.0,266000,979.0,962.0
335,2016/01/12,922.0,929.433,930.0,688400,955.0,914.0
336,2016/01/13,956.0,956.964,932.0,336600,966.0,932.0
337,2016/01/14,924.0,916.692,928.0,180400,938.0,910.0
338,2016/01/15,886.0,902.253,926.0,364700,928.0,883.0
339,2016/01/18,882.0,876.298,865.0,200500,887.0,862.0
340,2016/01/19,875.0,874.401,884.0,200400,885.0,867.0
341,2016/01/20,856.0,867.957,876.0,246700,880.0,855.0
342,2016/01/21,834.0,850.389,856.0,301100,870.0,832.0
343,2016/01/22,852.0,844.431,840.0,283300,855.0,834.0
344,2016/01/25,874.0,868.482,872.0,140100,875.0,855.0
345,2016/01/26,846.0,851.254,853.0,210300,858.0,843.0
346,2016/01/27,874.0,869.986,872.0,253200,876.0,862.0
347,2016/01/28,866.0,864.983,874.0,213700,874.0,859.0
348,2016/01/29,892.0,879.165,879.0,223100,898.0,864.0
349,2016/02/01,922.0,915.654,916.0,218900,922.0,909.0
350,2016/02/02,914.0,911.519,908.0,224400,922.0,903.0
351,2016/02/03,877.0,875.243,879.0,237400,889.0,866.0
352,2016/02/04,869.0,874.45,880.0,167700,884.0,866.0
353,2016/02/05,856.0,857.605,863.0,274600,877.0,847.0
354,2016/02/08,890.0,879.844,855.0,257700,894.0,854.0
355,2016/02/09,838.0,845.095,853.0,232600,856.0,834.0
356,2016/02/10,802.0,817.093,861.0,258600,861.0,796.0
357,2016/02/12,743.0,756.124,765.0,358300,779.0,743.0
358,2016/02/15,782.0,776.444,771.0,398200,788.0,763.0
359,2016/02/16,789.0,797.676,789.0,298700,809.0,787.0
360,2016/02/17,801.0,802.88,790.0,303500,821.0,790.0
361,2016/02/18,817.0,815.052,819.0,261800,824.0,797.0
362,2016/02/19,814.0,812.197,808.0,327400,821.0,806.0
363,2016/02/22,825.0,823.537,812.0,221900,832.0,812.0
364,2016/02/23,825.0,830.776,832.0,407700,843.0,819.0
365,2016/02/24,840.0,826.755,814.0,936700,841.0,810.0
366,2016/02/25,804.0,808.147,815.0,461300,817.0,795.0
367,2016/02/26,830.0,822.615,811.0,435100,830.0,811.0
368,2016/02/29,823.0,829.151,840.0,325400,842.0,821.0
369,2016/03/01,826.0,824.458,825.0,132600,831.0,813.0
370,2016/03/02,862.0,853.466,841.0,225600,864.0,841.0
371,2016/03/03,854.0,854.28,859.0,179400,865.0,848.0
372,2016/03/04,904.0,892.568,857.0,356500,906.0,856.0
373,2016/03/07,902.0,897.733,905.0,153000,906.0,885.0
374,2016/03/08,886.0,888.259,900.0,182400,910.0,869.0
375,2016/03/09,884.0,880.91,890.0,133500,890.0,872.0
376,2016/03/10,895.0,894.013,897.0,122200,902.0,883.0
377,2016/03/11,902.0,893.111,882.0,170600,907.0,879.0
378,2016/03/14,905.0,904.223,907.0,199700,912.0,895.0
379,2016/03/15,912.0,911.527,902.0,194900,921.0,896.0
380,2016/03/16,901.0,902.316,900.0,123600,909.0,896.0
381,2016/03/17,909.0,911.215,910.0,84500,918.0,900.0
382,2016/03/18,915.0,907.576,915.0,195700,916.0,893.0
383,2016/03/22,938.0,929.415,928.0,228900,938.0,918.0
384,2016/03/23,930.0,931.552,937.0,108500,945.0,925.0
385,2016/03/24,927.0,926.561,925.0,162700,933.0,916.0
386,2016/03/25,929.0,924.476,915.0,88200,934.0,913.0
387,2016/03/28,938.0,931.921,933.0,115600,938.0,926.0
388,2016/03/29,946.0,939.819,932.0,99800,947.0,929.0
389,2016/03/30,929.0,932.031,943.0,147400,943.0,926.0
390,2016/03/31,940.0,939.256,935.0,156500,947.0,931.0
391,2016/04/01,903.0,909.134,933.0,200100,935.0,896.0
392,2016/04/04,887.0,891.088,893.0,154200,912.0,877.0
393,2016/04/05,840.0,855.173,881.0,165200,881.0,839.0
394,2016/04/06,854.0,846.515,838.0,188100,856.0,834.0
395,2016/04/07,849.0,843.992,846.0,218600,860.0,833.0
396,2016/04/08,843.0,838.256,819.0,174900,861.0,804.0
397,2016/04/11,737.0,747.484,813.0,724800,817.0,726.0
398,2016/04/12,720.0,722.362,738.0,698800,739.0,712.0
399,2016/04/13,736.0,729.561,737.0,592700,738.0,717.0
400,2016/04/14,757.0,748.169,744.0,386500,757.0,737.0
401,2016/04/15,774.0,771.131,771.0,485800,778.0,759.0
402,2016/04/18,802.0,781.57,760.0,906600,811.0,746.0
403,2016/04/19,804.0,804.571,814.0,580400,826.0,792.0
404,2016/04/20,791.0,799.811,810.0,280900,813.0,790.0
405,2016/04/21,798.0,795.811,800.0,311500,801.0,783.0
406,2016/04/22,802.0,793.796,791.0,246500,803.0,784.0
407,2016/04/25,786.0,788.197,805.0,284800,805.0,782.0
408,2016/04/26,780.0,778.444,781.0,191300,790.0,770.0
409,2016/04/27,776.0,780.985,785.0,275700,792.0,774.0
410,2016/04/28,764.0,777.06,785.0,297600,798.0,761.0
411,2016/05/02,746.0,746.296,753.0,260200,755.0,737.0
412,2016/05/06,733.0,735.542,746.0,327100,751.0,728.0
413,2016/05/09,751.0,748.349,739.0,133400,755.0,738.0
414,2016/05/10,761.0,758.298,753.0,119000,767.0,747.0
415,2016/05/11,759.0,762.621,746.0,351200,777.0,744.0
416,2016/05/12,764.0,757.724,751.0,123700,767.0,747.0
417,2016/05/13,735.0,744.189,768.0,150200,769.0,735.0
418,2016/05/16,736.0,738.427,735.0,177200,746.0,733.0
419,2016/05/17,745.0,744.741,744.0,96500,751.0,739.0
420,2016/05/18,752.0,750.826,748.0,167700,757.0,746.0
421,2016/05/19,759.0,763.028,760.0,146000,772.0,755.0
422,2016/05/20,750.0,751.448,756.0,252000,764.0,745.0
423,2016/05/23,762.0,750.777,749.0,229000,763.0,739.0
424,2016/05/24,736.0,741.615,756.0,239500,756.0,734.0
425,2016/05/25,744.0,745.177,746.0,126900,748.0,742.0
426,2016/05/26,739.0,742.115,750.0,144000,751.0,734.0
427,2016/05/27,732.0,732.785,740.0,99900,741.0,729.0
428,2016/05/30,734.0,728.972,732.0,169300,736.0,720.0
429,2016/05/31,731.0,730.243,732.0,199800,736.0,722.0
430,2016/06/01,732.0,730.437,732.0,222900,735.0,723.0
431,2016/06/02,709.0,714.0,725.0,382200,725.0,708.0
432,2016/06/03,700.0,701.12,709.0,267200,715.0,694.0
433,2016/06/06,691.0,687.673,691.0,175800,692.0,682.0
434,2016/06/07,697.0,697.811,699.0,106600,704.0,692.0
435,2016/06/08,697.0,694.659,702.0,150800,703.0,690.0
436,2016/06/09,686.0,688.234,693.0,130100,697.0,685.0
437,2016/06/10,685.0,683.615,685.0,275200,691.0,678.0
438,2016/06/13,663.0,669.304,682.0,177000,682.0,663.0
439,2016/06/14,655.0,657.418,665.0,155700,669.0,651.0
440,2016/06/15,654.0,654.836,650.0,199200,662.0,650.0
441,2016/06/16,641.0,644.589,657.0,278000,662.0,637.0
442,2016/06/17,651.0,652.716,646.0,309100,660.0,646.0
443,2016/06/20,681.0,676.939,661.0,243900,683.0,661.0
444,2016/06/21,696.0,689.009,678.0,227600,699.0,671.0
445,2016/06/22,674.0,674.208,690.0,155400,690.0,668.0
446,2016/06/23,682.0,680.046,677.0,177400,685.0,673.0
447,2016/06/24,655.0,669.019,686.0,365700,692.0,647.0
448,2016/06/27,661.0,661.382,673.0,202300,684.0,651.0
449,2016/06/28,653.0,651.437,647.0,149600,661.0,642.0
450,2016/06/29,666.0,656.434,653.0,215600,667.0,643.0
451,2016/06/30,673.0,674.03,671.0,206300,679.0,664.0
452,2016/07/01,686.0,686.023,678.0,180100,693.0,675.0
453,2016/07/04,675.0,676.956,676.0,90900,683.0,672.0
454,2016/07/05,670.0,669.256,671.0,99700,674.0,665.0
455,2016/07/06,662.0,654.757,660.0,249300,663.0,647.0
456,2016/07/07,665.0,663.298,657.0,139900,668.0,656.0
457,2016/07/08,645.0,651.882,662.0,127700,664.0,643.0
458,2016/07/11,612.0,618.942,635.0,646800,640.0,607.0
459,2016/07/12,630.0,627.118,615.0,368800,637.0,615.0
460,2016/07/13,661.0,660.222,640.0,534100,671.0,640.0
461,2016/07/14,662.0,658.672,662.0,188800,669.0,649.0
462,2016/07/15,674.0,670.633,661.0,201700,678.0,661.0
463,2016/07/19,659.0,659.357,665.0,338200,666.0,654.0
464,2016/07/20,660.0,660.881,658.0,269700,668.0,654.0
465,2016/07/21,682.0,678.612,670.0,208800,682.0,670.0
466,2016/07/22,681.0,678.563,672.0,101800,683.0,672.0
467,2016/07/25,701.0,697.285,690.0,213300,702.0,689.0
468,2016/07/26,694.0,695.191,700.0,179900,700.0,688.0
469,2016/07/27,689.0,690.707,698.0,214700,702.0,683.0
470,2016/07/28,687.0,684.981,686.0,208400,696.0,675.0
471,2016/07/29,693.0,684.769,686.0,163200,696.0,676.0
472,2016/08/01,677.0,683.421,700.0,105100,700.0,674.0
473,2016/08/02,662.0,667.733,671.0,109700,678.0,661.0
474,2016/08/03,639.0,643.833,652.0,138100,653.0,637.0
475,2016/08/04,655.0,649.757,644.0,175200,658.0,643.0
476,2016/08/05,656.0,658.084,655.0,74100,665.0,652.0
477,2016/08/08,670.0,665.799,666.0,129000,670.0,660.0
478,2016/08/09,673.0,670.907,667.0,88800,675.0,663.0
479,2016/08/10,674.0,672.19,672.0,79500,676.0,667.0
480,2016/08/12,681.0,679.453,675.0,70500,683.0,673.0
481,2016/08/15,685.0,685.829,681.0,93400,691.0,680.0
482,2016/08/16,673.0,675.38,686.0,135900,687.0,669.0
483,2016/08/17,673.0,668.547,665.0,109600,674.0,659.0
484,2016/08/18,669.0,671.398,671.0,98100,678.0,666.0
485,2016/08/19,677.0,676.748,670.0,99800,682.0,668.0
486,2016/08/22,679.0,675.875,678.0,97600,681.0,671.0
487,2016/08/23,678.0,675.151,673.0,127600,682.0,670.0
488,2016/08/24,689.0,688.517,682.0,149400,693.0,681.0
489,2016/08/25,688.0,687.113,689.0,50600,690.0,684.0
490,2016/08/26,691.0,694.354,690.0,115000,702.0,684.0
491,2016/08/29,715.0,709.671,701.0,168200,716.0,699.0
492,2016/08/30,715.0,711.276,715.0,84700,718.0,705.0
493,2016/08/31,728.0,726.839,721.0,127700,734.0,719.0
494,2016/09/01,738.0,732.599,730.0,100500,738.0,726.0
495,2016/09/02,739.0,733.472,738.0,111100,739.0,726.0
496,2016/09/05,749.0,749.995,744.0,132200,756.0,743.0
497,2016/09/06,764.0,759.334,750.0,156500,768.0,749.0
498,2016/09/07,762.0,762.042,761.0,139000,767.0,757.0
499,2016/09/08,762.0,761.574,763.0,83400,766.0,757.0
500,2016/09/09,764.0,763.469,762.0,91700,767.0,759.0
501,2016/09/12,747.0,748.873,755.0,96600,755.0,744.0
502,2016/09/13,740.0,746.433,753.0,104600,760.0,740.0
503,2016/09/14,742.0,740.412,735.0,103900,747.0,729.0
504,2016/09/15,738.0,736.795,741.0,54500,741.0,730.0
505,2016/09/16,753.0,748.286,739.0,91200,753.0,736.0
506,2016/09/20,749.0,749.782,740.0,102300,756.0,738.0
507,2016/09/21,753.0,744.519,738.0,114700,757.0,729.0
508,2016/09/23,753.0,753.114,758.0,132000,760.0,747.0
509,2016/09/26,756.0,756.732,755.0,126500,763.0,754.0
510,2016/09/27,763.0,754.632,756.0,95700,763.0,739.0
511,2016/09/28,755.0,756.913,764.0,66400,768.0,750.0
512,2016/09/29,773.0,771.703,761.0,79200,776.0,761.0
513,2016/09/30,764.0,758.249,756.0,114100,769.0,746.0
514,2016/10/03,767.0,773.233,772.0,95700,780.0,764.0
515,2016/10/04,782.0,779.155,768.0,103000,784.0,763.0
516,2016/10/05,781.0,779.369,779.0,113800,784.0,770.0
517,2016/10/06,780.0,784.579,785.0,94700,793.0,776.0
518,2016/10/07,783.0,779.301,786.0,77800,786.0,773.0
519,2016/10/11,809.0,804.262,795.0,279500,815.0,793.0
520,2016/10/12,798.0,797.334,790.0,179400,807.0,789.0
521,2016/10/13,817.0,808.15,804.0,206800,817.0,798.0
522,2016/10/14,829.0,826.047,817.0,167600,832.0,815.0
523,2016/10/17,882.0,866.866,838.0,291200,883.0,837.0
524,2016/10/18,857.0,851.702,869.0,428000,875.0,833.0
525,2016/10/19,848.0,844.741,855.0,220000,859.0,836.0
526,2016/10/20,874.0,869.515,850.0,164900,878.0,850.0
527,2016/10/21,880.0,879.736,879.0,130500,887.0,875.0
528,2016/10/24,884.0,880.121,878.0,79700,885.0,873.0
529,2016/10/25,885.0,885.463,885.0,102100,893.0,877.0
530,2016/10/26,883.0,881.527,882.0,73100,884.0,878.0
531,2016/10/27,884.0,884.656,884.0,87100,892.0,881.0
532,2016/10/28,889.0,886.596,888.0,172000,892.0,880.0
533,2016/10/31,897.0,896.255,897.0,129300,899.0,892.0
534,2016/11/01,901.0,896.766,895.0,110700,903.0,885.0
535,2016/11/02,884.0,883.186,893.0,101200,893.0,879.0
536,2016/11/04,880.0,873.693,879.0,133700,882.0,863.0
537,2016/11/07,880.0,880.83,885.0,85500,889.0,874.0
538,2016/11/08,877.0,879.237,889.0,49400,889.0,875.0
539,2016/11/09,829.0,846.392,886.0,171800,892.0,818.0
540,2016/11/10,882.0,884.796,888.0,115800,892.0,879.0
541,2016/11/11,872.0,881.526,892.0,127700,898.0,864.0
542,2016/11/14,890.0,889.698,880.0,90700,894.0,875.0
543,2016/11/15,893.0,892.811,893.0,89400,903.0,877.0
544,2016/11/16,905.0,907.634,902.0,144900,916.0,901.0
545,2016/11/17,908.0,904.476,898.0,69600,910.0,898.0
546,2016/11/18,920.0,917.864,917.0,89600,923.0,912.0
547,2016/11/21,911.0,911.796,924.0,90200,924.0,898.0
548,2016/11/22,908.0,909.148,903.0,98200,917.0,903.0
549,2016/11/24,919.0,918.092,920.0,63100,922.0,910.0
550,2016/11/25,909.0,914.299,922.0,168000,925.0,905.0
551,2016/11/28,917.0,916.077,909.0,180200,922.0,907.0
552,2016/11/29,916.0,905.711,909.0,212400,917.0,891.0
553,2016/11/30,939.0,931.566,923.0,199100,943.0,914.0
554,2016/12/01,946.0,952.52,945.0,148600,963.0,945.0
555,2016/12/02,971.0,964.283,939.0,249200,977.0,939.0
556,2016/12/05,962.0,961.633,964.0,108400,969.0,951.0
557,2016/12/06,971.0,971.371,962.0,93600,976.0,962.0
558,2016/12/07,981.0,980.164,980.0,100100,986.0,975.0
559,2016/12/08,991.0,988.529,988.0,118400,992.0,984.0
560,2016/12/09,989.0,986.311,981.0,150000,994.0,981.0
561,2016/12/12,982.0,983.115,997.0,126200,997.0,970.0
562,2016/12/13,988.0,987.208,994.0,157900,994.0,980.0
563,2016/12/14,976.0,978.01,988.0,82700,988.0,975.0
564,2016/12/15,980.0,979.951,975.0,135800,990.0,971.0
565,2016/12/16,995.0,994.189,983.0,159500,999.0,983.0
566,2016/12/19,992.0,996.128,995.0,129900,1008.0,988.0
567,2016/12/20,994.0,992.234,981.0,89500,998.0,981.0
568,2016/12/21,976.0,979.353,989.0,94100,992.0,973.0
569,2016/12/22,977.0,974.731,985.0,78400,987.0,966.0
570,2016/12/26,979.0,981.396,985.0,72400,987.0,978.0
571,2016/12/27,983.0,983.427,983.0,67400,989.0,980.0
572,2016/12/28,990.0,990.034,983.0,96500,994.0,979.0
573,2016/12/29,976.0,973.544,990.0,142600,990.0,967.0
574,2016/12/30,975.0,971.917,972.0,71000,978.0,964.0
575,2017/01/04,1003.0,998.934,973.0,192800,1005.0,971.0
576,2017/01/05,992.0,994.397,999.0,145600,1002.0,989.0
577,2017/01/06,1016.0,1013.511,999.0,187000,1022.0,999.0
578,2017/01/10,1021.0,1018.895,1025.0,327600,1027.0,1006.0
579,2017/01/11,1027.0,1030.394,1024.0,204200,1038.0,1019.0
580,2017/01/12,1032.0,1032.399,1033.0,212500,1040.0,1020.0
581,2017/01/13,1028.0,1026.53,1020.0,160800,1035.0,1019.0
582,2017/01/16,1006.0,1007.723,1020.0,138700,1020.0,1001.0
583,2017/01/17,996.0,999.772,1003.0,178400,1008.0,995.0
584,2017/01/18,1020.0,1013.019,990.0,223600,1026.0,984.0
585,2017/01/19,1021.0,1031.679,1032.0,298200,1050.0,1021.0
586,2017/01/20,1033.0,1029.238,1020.0,228200,1035.0,1010.0
587,2017/01/23,1019.0,1023.103,1029.0,114300,1031.0,1019.0
588,2017/01/24,1021.0,1020.725,1019.0,158600,1030.0,1015.0
589,2017/01/25,1027.0,1031.891,1029.0,197400,1042.0,1023.0
590,2017/01/26,1044.0,1046.396,1043.0,142400,1054.0,1042.0
591,2017/01/27,1068.0,1068.173,1057.0,292800,1078.0,1057.0
592,2017/01/30,1069.0,1069.992,1076.0,144300,1076.0,1061.0
593,2017/01/31,1045.0,1051.915,1065.0,183300,1065.0,1044.0
594,2017/02/01,1047.0,1046.977,1043.0,144400,1054.0,1039.0
595,2017/02/02,1032.0,1040.113,1054.0,98800,1055.0,1031.0
596,2017/02/03,1033.0,1031.065,1030.0,149700,1036.0,1024.0
597,2017/02/06,1038.0,1037.123,1038.0,120800,1042.0,1033.0
598,2017/02/07,1032.0,1032.708,1034.0,202000,1039.0,1025.0
599,2017/02/08,1027.0,1023.225,1030.0,133300,1032.0,1013.0
600,2017/02/09,1019.0,1018.947,1027.0,126200,1028.0,1013.0
601,2017/02/10,1034.0,1032.594,1031.0,77900,1038.0,1026.0
602,2017/02/13,1026.0,1027.32,1032.0,126800,1033.0,1023.0
603,2017/02/14,1017.0,1020.271,1021.0,143700,1029.0,1015.0
604,2017/02/15,1046.0,1037.439,1022.0,225300,1047.0,1022.0
605,2017/02/16,1070.0,1069.001,1056.0,368900,1076.0,1056.0
606,2017/02/17,1076.0,1074.799,1065.0,265400,1083.0,1063.0
607,2017/02/20,1072.0,1072.115,1080.0,189000,1085.0,1067.0
608,2017/02/21,1071.0,1069.811,1072.0,158900,1075.0,1066.0
609,2017/02/22,1064.0,1064.452,1065.0,228200,1069.0,1060.0
610,2017/02/23,1068.0,1074.826,1077.0,450800,1096.0,1065.0
611,2017/02/24,1049.0,1047.803,1032.0,390900,1063.0,1029.0
612,2017/02/27,1023.0,1028.487,1046.0,167900,1046.0,1022.0
613,2017/02/28,1030.0,1033.282,1040.0,218000,1040.0,1028.0
614,2017/03/01,1054.0,1043.839,1033.0,241000,1057.0,1025.0
615,2017/03/02,1053.0,1055.451,1058.0,116700,1065.0,1049.0
616,2017/03/03,1057.0,1058.352,1055.0,183500,1063.0,1055.0
617,2017/03/06,1073.0,1075.17,1060.0,299800,1080.0,1060.0
618,2017/03/07,1071.0,1069.794,1075.0,94100,1075.0,1062.0
619,2017/03/08,1082.0,1083.226,1075.0,203500,1092.0,1075.0
620,2017/03/09,1069.0,1072.234,1089.0,107800,1090.0,1066.0
621,2017/03/10,1076.0,1079.85,1090.0,116600,1090.0,1068.0
622,2017/03/13,1076.0,1078.586,1080.0,93600,1085.0,1073.0
623,2017/03/14,1073.0,1072.369,1083.0,58300,1083.0,1067.0
624,2017/03/15,1070.0,1068.081,1073.0,101400,1075.0,1063.0
625,2017/03/16,1085.0,1077.709,1051.0,165800,1085.0,1051.0
626,2017/03/17,1086.0,1083.232,1083.0,202900,1089.0,1074.0
627,2017/03/21,1097.0,1096.44,1085.0,172900,1106.0,1083.0
628,2017/03/22,1072.0,1076.686,1070.0,164100,1087.0,1070.0
629,2017/03/23,1061.0,1059.946,1077.0,208800,1077.0,1054.0
630,2017/03/24,1064.0,1060.164,1059.0,170000,1065.0,1052.0
631,2017/03/27,1062.0,1061.58,1057.0,231200,1074.0,1049.0
632,2017/03/28,1091.0,1080.957,1079.0,242500,1093.0,1071.0
633,2017/03/29,1090.0,1083.096,1092.0,182300,1102.0,1065.0
634,2017/03/30,1068.0,1072.71,1075.0,181700,1085.0,1064.0
635,2017/03/31,1058.0,1067.993,1075.0,123000,1083.0,1057.0
636,2017/04/03,1053.0,1054.14,1056.0,124800,1061.0,1049.0
637,2017/04/04,1029.0,1028.903,1040.0,179800,1041.0,1017.0
638,2017/04/05,1025.0,1026.217,1022.0,133200,1031.0,1017.0
639,2017/04/06,1018.0,1014.686,1016.0,212400,1023.0,1006.0
640,2017/04/07,1037.0,1031.623,1014.0,250700,1041.0,1012.0
641,2017/04/10,1166.0,1134.261,1050.0,945400,1174.0,1050.0
642,2017/04/11,1174.0,1165.401,1150.0,517400,1178.0,1148.0
643,2017/04/12,1174.0,1167.731,1163.0,487400,1184.0,1155.0
644,2017/04/13,1222.0,1209.654,1178.0,556900,1224.0,1174.0
645,2017/04/14,1179.0,1182.508,1200.0,361600,1214.0,1167.0
646,2017/04/17,1183.0,1183.079,1178.0,209100,1194.0,1177.0
647,2017/04/18,1202.0,1203.534,1200.0,286000,1223.0,1193.0
648,2017/04/19,1226.0,1225.966,1202.0,374300,1242.0,1199.0
649,2017/04/20,1255.0,1256.354,1220.0,445700,1270.0,1217.0
650,2017/04/21,1264.0,1269.192,1265.0,300800,1282.0,1260.0
651,2017/04/24,1255.0,1258.477,1236.0,344400,1279.0,1222.0
652,2017/04/25,1266.0,1267.867,1253.0,250200,1281.0,1251.0
653,2017/04/26,1267.0,1268.713,1270.0,226900,1275.0,1260.0
654,2017/04/27,1293.0,1289.136,1274.0,364700,1297.0,1270.0
655,2017/04/28,1285.0,1291.55,1279.0,335900,1312.0,1278.0
656,2017/05/01,1271.0,1275.157,1293.0,246800,1296.0,1266.0
657,2017/05/02,1317.0,1314.865,1293.0,378800,1324.0,1293.0
658,2017/05/08,1301.0,1304.496,1315.0,312200,1325.0,1294.0
659,2017/05/09,1282.0,1281.749,1300.0,304000,1308.0,1269.0
660,2017/05/10,1275.0,1282.772,1274.0,285100,1302.0,1263.0
661,2017/05/11,1265.0,1266.875,1274.0,200600,1277.0,1258.0
662,2017/05/12,1260.0,1254.461,1258.0,210100,1264.0,1243.0
663,2017/05/15,1240.0,1244.265,1247.0,186300,1253.0,1238.0
664,2017/05/16,1236.0,1237.919,1240.0,140600,1248.0,1233.0
665,2017/05/17,1227.0,1231.059,1233.0,206700,1239.0,1221.0
666,2017/05/18,1202.0,1208.277,1211.0,247400,1227.0,1201.0
667,2017/05/19,1239.0,1230.129,1210.0,223300,1241.0,1210.0
668,2017/05/22,1238.0,1237.276,1239.0,145700,1255.0,1229.0
669,2017/05/23,1240.0,1240.241,1237.0,165900,1247.0,1230.0
670,2017/05/24,1256.0,1256.804,1253.0,153300,1266.0,1252.0
671,2017/05/25,1241.0,1251.622,1253.0,128400,1260.0,1241.0
672,2017/05/26,1215.0,1221.358,1241.0,143700,1241.0,1214.0
673,2017/05/29,1221.0,1219.949,1217.0,115200,1226.0,1210.0
674,2017/05/30,1214.0,1210.844,1204.0,83300,1216.0,1201.0
675,2017/05/31,1216.0,1218.738,1229.0,143300,1229.0,1212.0
676,2017/06/01,1233.0,1231.221,1225.0,129700,1236.0,1219.0
677,2017/06/02,1259.0,1261.282,1240.0,197400,1274.0,1239.0
678,2017/06/05,1246.0,1247.514,1259.0,98600,1260.0,1238.0
679,2017/06/06,1234.0,1238.909,1237.0,76500,1245.0,1233.0
680,2017/06/07,1218.0,1219.886,1233.0,163300,1234.0,1215.0
681,2017/06/08,1223.0,1222.069,1228.0,135100,1228.0,1212.0
682,2017/06/09,1216.0,1214.614,1218.0,177000,1225.0,1203.0
683,2017/06/12,1224.0,1217.767,1198.0,136400,1224.0,1194.0
684,2017/06/13,1230.0,1226.55,1223.0,93100,1234.0,1203.0
685,2017/06/14,1232.0,1236.598,1242.0,108000,1249.0,1230.0
686,2017/06/15,1217.0,1216.364,1228.0,123800,1228.0,1203.0
687,2017/06/16,1234.0,1232.897,1235.0,143600,1262.0,1223.0
688,2017/06/19,1244.0,1246.564,1232.0,154500,1258.0,1231.0
689,2017/06/20,1268.0,1266.841,1247.0,108300,1276.0,1247.0
690,2017/06/21,1243.0,1247.445,1252.0,87200,1257.0,1241.0
691,2017/06/22,1247.0,1248.285,1250.0,102700,1255.0,1242.0
692,2017/06/23,1257.0,1256.541,1253.0,142400,1262.0,1245.0
693,2017/06/26,1271.0,1271.988,1264.0,110400,1278.0,1263.0
694,2017/06/27,1282.0,1277.215,1277.0,119800,1283.0,1264.0
695,2017/06/28,1266.0,1270.148,1265.0,69400,1279.0,1265.0
696,2017/06/29,1283.0,1277.5,1279.0,95500,1283.0,1268.0
697,2017/06/30,1303.0,1289.93,1267.0,216300,1303.0,1266.0
698,2017/07/03,1297.0,1301.198,1300.0,99200,1310.0,1295.0
699,2017/07/04,1296.0,1304.31,1316.0,120400,1330.0,1291.0
700,2017/07/05,1312.0,1302.75,1295.0,116100,1312.0,1290.0
701,2017/07/06,1301.0,1306.666,1312.0,95800,1315.0,1301.0
702,2017/07/07,1295.0,1304.177,1311.0,149400,1316.0,1294.0
703,2017/07/10,1183.0,1195.048,1220.0,724700,1233.0,1180.0
704,2017/07/11,1194.0,1186.245,1185.0,289900,1200.0,1176.0
705,2017/07/12,1192.0,1185.405,1185.0,213100,1192.0,1179.0
706,2017/07/13,1218.0,1205.682,1191.0,321400,1219.0,1188.0
707,2017/07/14,1241.0,1240.28,1228.0,295000,1255.0,1224.0
708,2017/07/18,1274.0,1267.202,1251.0,274800,1280.0,1245.0
709,2017/07/19,1270.0,1270.358,1270.0,152700,1276.0,1262.0
710,2017/07/20,1265.0,1263.225,1260.0,123800,1272.0,1250.0
711,2017/07/21,1275.0,1275.137,1267.0,102600,1280.0,1265.0
712,2017/07/24,1296.0,1288.695,1269.0,131000,1296.0,1263.0
713,2017/07/25,1287.0,1286.264,1283.0,81600,1292.0,1283.0
714,2017/07/26,1281.0,1285.369,1290.0,88000,1297.0,1275.0
715,2017/07/27,1258.0,1265.368,1275.0,137000,1284.0,1257.0
716,2017/07/28,1257.0,1257.418,1258.0,94700,1267.0,1250.0
717,2017/07/31,1245.0,1251.415,1257.0,89400,1267.0,1245.0
718,2017/08/01,1258.0,1256.188,1255.0,124000,1262.0,1249.0
719,2017/08/02,1294.0,1283.675,1272.0,142900,1299.0,1267.0
720,2017/08/03,1317.0,1306.721,1282.0,192500,1325.0,1282.0
721,2017/08/04,1318.0,1311.104,1320.0,170000,1320.0,1298.0
722,2017/08/07,1333.0,1332.011,1331.0,131700,1339.0,1324.0
723,2017/08/08,1310.0,1312.431,1306.0,89600,1320.0,1304.0
724,2017/08/09,1311.0,1305.038,1313.0,110200,1317.0,1293.0
725,2017/08/10,1311.0,1306.943,1282.0,74200,1319.0,1282.0
726,2017/08/14,1268.0,1277.367,1291.0,113800,1293.0,1267.0
727,2017/08/15,1323.0,1320.191,1298.0,220700,1337.0,1290.0
728,2017/08/16,1298.0,1305.522,1320.0,124700,1325.0,1298.0
729,2017/08/17,1308.0,1308.069,1297.0,122300,1321.0,1296.0
730,2017/08/18,1307.0,1308.037,1291.0,150400,1325.0,1291.0
731,2017/08/21,1310.0,1308.276,1309.0,96300,1316.0,1295.0
732,2017/08/22,1299.0,1303.935,1301.0,119900,1314.0,1295.0
733,2017/08/23,1302.0,1303.898,1315.0,110300,1319.0,1298.0
734,2017/08/24,1290.0,1298.177,1302.0,75800,1310.0,1290.0
735,2017/08/25,1300.0,1298.785,1293.0,74500,1305.0,1287.0
736,2017/08/28,1294.0,1290.065,1300.0,94500,1302.0,1277.0
737,2017/08/29,1289.0,1282.612,1286.0,135400,1291.0,1269.0
738,2017/08/30,1300.0,1292.608,1301.0,80900,1301.0,1284.0
739,2017/08/31,1278.0,1279.068,1292.0,119000,1293.0,1274.0
740,2017/09/01,1286.0,1278.849,1280.0,116900,1287.0,1263.0
741,2017/09/04,1272.0,1270.15,1281.0,137200,1283.0,1257.0
742,2017/09/05,1257.0,1261.666,1270.0,134300,1270.0,1255.0
743,2017/09/06,1264.0,1257.308,1257.0,147900,1271.0,1243.0
744,2017/09/07,1296.0,1278.569,1257.0,206100,1297.0,1253.0
745,2017/09/08,1316.0,1309.825,1300.0,242800,1322.0,1299.0
746,2017/09/11,1279.0,1303.5,1326.0,223000,1345.0,1277.0
747,2017/09/12,1292.0,1292.126,1305.0,107400,1306.0,1281.0
748,2017/09/13,1297.0,1299.172,1300.0,68000,1307.0,1291.0
749,2017/09/14,1336.0,1333.295,1315.0,196300,1343.0,1310.0
750,2017/09/15,1338.0,1347.669,1339.0,366900,1370.0,1336.0
751,2017/09/19,1325.0,1325.415,1341.0,176300,1358.0,1312.0
752,2017/09/20,1372.0,1369.4,1337.0,255300,1385.0,1329.0
753,2017/09/21,1371.0,1372.97,1370.0,154000,1382.0,1364.0
754,2017/09/22,1365.0,1367.352,1370.0,101600,1384.0,1360.0
755,2017/09/25,1367.0,1366.64,1371.0,104000,1379.0,1360.0
756,2017/09/26,1346.0,1341.377,1348.0,181000,1352.0,1332.0
757,2017/09/27,1348.0,1347.097,1339.0,95300,1356.0,1332.0
758,2017/09/28,1348.0,1349.185,1365.0,156800,1365.0,1343.0
759,2017/09/29,1359.0,1351.593,1344.0,107800,1359.0,1336.0
760,2017/10/02,1350.0,1353.617,1350.0,98500,1366.0,1346.0
761,2017/10/03,1357.0,1352.039,1370.0,148900,1370.0,1340.0
762,2017/10/04,1354.0,1352.829,1366.0,66000,1368.0,1347.0
763,2017/10/05,1362.0,1358.288,1354.0,124800,1367.0,1352.0
764,2017/10/06,1372.0,1364.564,1352.0,135100,1374.0,1300.0
765,2017/10/10,1340.0,1330.149,1342.0,491400,1348.0,1303.0
766,2017/10/11,1326.0,1332.031,1334.0,144300,1355.0,1326.0
767,2017/10/12,1341.0,1342.735,1330.0,117500,1353.0,1329.0
768,2017/10/13,1328.0,1327.46,1335.0,120400,1335.0,1315.0
769,2017/10/16,1327.0,1329.48,1328.0,114900,1340.0,1319.0
770,2017/10/17,1341.0,1342.62,1336.0,103900,1355.0,1335.0
771,2017/10/18,1340.0,1336.195,1338.0,210700,1344.0,1328.0
772,2017/10/19,1330.0,1337.231,1337.0,157000,1355.0,1324.0
773,2017/10/20,1329.0,1329.879,1332.0,137100,1340.0,1320.0
774,2017/10/23,1334.0,1330.743,1336.0,187600,1336.0,1321.0
775,2017/10/24,1394.0,1383.654,1335.0,309900,1400.0,1335.0
776,2017/10/25,1355.0,1364.183,1394.0,164900,1394.0,1352.0
777,2017/10/26,1350.0,1356.067,1370.0,127700,1390.0,1348.0
778,2017/10/27,1358.0,1355.685,1375.0,153400,1375.0,1347.0
779,2017/10/30,1354.0,1351.702,1343.0,151700,1356.0,1337.0
780,2017/10/31,1393.0,1388.856,1366.0,160000,1398.0,1366.0
781,2017/11/01,1403.0,1402.191,1400.0,152400,1409.0,1391.0
782,2017/11/02,1404.0,1402.568,1399.0,105200,1407.0,1389.0
783,2017/11/06,1407.0,1410.279,1409.0,111300,1424.0,1403.0
784,2017/11/07,1409.0,1403.886,1390.0,89700,1410.0,1381.0
785,2017/11/08,1410.0,1408.703,1410.0,107800,1417.0,1396.0
786,2017/11/09,1425.0,1429.737,1424.0,202900,1448.0,1410.0
787,2017/11/10,1408.0,1409.736,1399.0,87100,1424.0,1399.0
788,2017/11/13,1414.0,1416.655,1409.0,83700,1425.0,1408.0
789,2017/11/14,1415.0,1416.781,1408.0,118400,1424.0,1399.0
790,2017/11/15,1365.0,1381.3,1415.0,229200,1415.0,1362.0
791,2017/11/16,1366.0,1366.441,1361.0,98200,1377.0,1357.0
792,2017/11/17,1351.0,1360.405,1378.0,134700,1389.0,1350.0
793,2017/11/20,1355.0,1354.337,1340.0,171000,1361.0,1340.0
794,2017/11/21,1359.0,1357.456,1355.0,71900,1363.0,1351.0
795,2017/11/22,1359.0,1359.212,1371.0,148000,1374.0,1353.0
796,2017/11/24,1356.0,1355.983,1355.0,126400,1362.0,1349.0
797,2017/11/27,1354.0,1353.338,1364.0,106400,1364.0,1347.0
798,2017/11/28,1323.0,1329.836,1341.0,128100,1344.0,1323.0
799,2017/11/29,1319.0,1325.818,1343.0,189600,1343.0,1317.0
800,2017/11/30,1328.0,1325.324,1323.0,368100,1336.0,1309.0
801,2017/12/01,1341.0,1332.711,1336.0,169800,1342.0,1322.0
802,2017/12/04,1329.0,1341.358,1360.0,137400,1360.0,1329.0
803,2017/12/05,1291.0,1295.116,1304.0,160200,1318.0,1289.0
804,2017/12/06,1273.0,1283.042,1295.0,166200,1302.0,1271.0
805,2017/12/07,1312.0,1303.982,1281.0,302800,1324.0,1275.0
806,2017/12/08,1289.0,1286.93,1282.0,158200,1303.0,1281.0
807,2017/12/11,1298.0,1298.878,1305.0,81600,1316.0,1286.0
808,2017/12/12,1304.0,1302.546,1299.0,75800,1305.0,1296.0
809,2017/12/13,1297.0,1299.32,1308.0,74000,1308.0,1292.0
810,2017/12/14,1308.0,1302.585,1301.0,153100,1310.0,1290.0
811,2017/12/15,1306.0,1301.846,1306.0,164000,1314.0,1288.0
812,2017/12/18,1331.0,1329.055,1321.0,127300,1335.0,1319.0
813,2017/12/19,1347.0,1346.945,1335.0,138800,1358.0,1334.0
814,2017/12/20,1353.0,1351.425,1343.0,103900,1357.0,1335.0
815,2017/12/21,1388.0,1394.283,1351.0,287700,1418.0,1344.0
816,2017/12/22,1395.0,1393.035,1385.0,133900,1401.0,1376.0
817,2017/12/25,1389.0,1390.49,1395.0,38600,1398.0,1385.0
818,2017/12/26,1375.0,1378.4,1390.0,45700,1390.0,1372.0
819,2017/12/27,1385.0,1389.377,1392.0,115800,1402.0,1380.0
820,2017/12/28,1367.0,1375.22,1388.0,72900,1389.0,1364.0
821,2017/12/29,1383.0,1384.628,1369.0,58000,1394.0,1369.0
822,2018/01/04,1388.0,1384.268,1385.0,142300,1397.0,1379.0
823,2018/01/05,1406.0,1400.643,1390.0,103100,1408.0,1389.0
824,2018/01/09,1395.0,1401.069,1410.0,154800,1424.0,1386.0
825,2018/01/10,1329.0,1338.349,1368.0,372600,1373.0,1317.0
826,2018/01/11,1367.0,1353.05,1324.0,221200,1369.0,1321.0
827,2018/01/12,1366.0,1371.538,1371.0,130800,1389.0,1363.0
828,2018/01/15,1353.0,1361.427,1381.0,87100,1381.0,1351.0
829,2018/01/16,1344.0,1349.75,1356.0,94200,1364.0,1343.0
830,2018/01/17,1345.0,1341.71,1333.0,102000,1351.0,1333.0
831,2018/01/18,1332.0,1344.814,1359.0,193700,1365.0,1332.0
832,2018/01/19,1359.0,1356.619,1338.0,117100,1362.0,1338.0
833,2018/01/22,1349.0,1349.299,1359.0,105000,1360.0,1346.0
834,2018/01/23,1351.0,1353.13,1346.0,104600,1362.0,1343.0
835,2018/01/24,1374.0,1373.27,1361.0,107800,1378.0,1357.0
836,2018/01/25,1350.0,1354.398,1364.0,72700,1368.0,1349.0
837,2018/01/26,1359.0,1362.556,1352.0,75200,1371.0,1348.0
838,2018/01/29,1374.0,1362.249,1351.0,220700,1384.0,1336.0
839,2018/01/30,1352.0,1360.944,1368.0,262900,1375.0,1346.0
840,2018/01/31,1349.0,1366.298,1355.0,298900,1386.0,1349.0
841,2018/02/01,1377.0,1370.9,1349.0,117600,1380.0,1347.0
842,2018/02/02,1377.0,1378.001,1379.0,90500,1386.0,1366.0
843,2018/02/05,1357.0,1357.25,1350.0,143600,1370.0,1349.0
844,2018/02/06,1266.0,1272.416,1305.0,257200,1312.0,1247.0
845,2018/02/07,1279.0,1293.167,1296.0,225900,1313.0,1279.0
846,2018/02/08,1300.0,1302.78,1289.0,216500,1311.0,1289.0
847,2018/02/09,1285.0,1280.309,1276.0,201900,1288.0,1269.0
848,2018/02/13,1250.0,1265.243,1290.0,193600,1298.0,1249.0
849,2018/02/14,1198.0,1212.027,1240.0,183300,1245.0,1196.0
850,2018/02/15,1202.0,1206.44,1210.0,202800,1215.0,1200.0
851,2018/02/16,1216.0,1220.703,1219.0,93900,1232.0,1214.0
852,2018/02/19,1255.0,1242.171,1218.0,130700,1255.0,1218.0
853,2018/02/20,1251.0,1247.694,1245.0,112200,1255.0,1237.0
854,2018/02/21,1281.0,1280.173,1273.0,137700,1291.0,1273.0
855,2018/02/22,1285.0,1287.244,1270.0,179500,1298.0,1268.0
856,2018/02/23,1311.0,1301.974,1301.0,236500,1316.0,1281.0
857,2018/02/26,1284.0,1285.674,1281.0,211200,1294.0,1275.0
858,2018/02/27,1290.0,1296.046,1291.0,115500,1307.0,1287.0
859,2018/02/28,1296.0,1300.8,1290.0,158200,1308.0,1288.0
860,2018/03/01,1288.0,1292.913,1308.0,170300,1308.0,1284.0
861,2018/03/02,1274.0,1282.324,1280.0,164600,1298.0,1272.0
862,2018/03/05,1241.0,1249.446,1262.0,189600,1271.0,1236.0
863,2018/03/06,1226.0,1237.643,1250.0,110500,1257.0,1224.0
864,2018/03/07,1204.0,1212.27,1210.0,472100,1239.0,1202.0
865,2018/03/08,1201.0,1206.271,1195.0,782600,1224.0,1192.0
866,2018/03/09,1215.0,1220.869,1222.0,475500,1240.0,1202.0
867,2018/03/12,1220.0,1222.423,1227.0,402300,1230.0,1213.0
868,2018/03/13,1224.0,1223.878,1220.0,216600,1231.0,1211.0
869,2018/03/14,1226.0,1228.712,1223.0,262800,1238.0,1222.0
870,2018/03/15,1210.0,1210.709,1230.0,193100,1230.0,1193.0
871,2018/03/16,1214.0,1221.987,1222.0,188400,1240.0,1211.0
872,2018/03/19,1188.0,1191.024,1195.0,127400,1207.0,1178.0
873,2018/03/20,1186.0,1183.335,1176.0,97700,1189.0,1172.0
874,2018/03/22,1203.0,1199.213,1186.0,141700,1205.0,1182.0
875,2018/03/23,1179.0,1192.537,1200.0,278300,1222.0,1175.0
876,2018/03/26,1194.0,1183.534,1186.0,222800,1203.0,1165.0
877,2018/03/27,1155.0,1153.254,1164.0,346400,1175.0,1137.0
878,2018/03/28,1171.0,1164.274,1152.0,185900,1175.0,1152.0
879,2018/03/29,1172.0,1167.696,1183.0,133700,1188.0,1157.0
880,2018/03/30,1188.0,1184.448,1188.0,148400,1194.0,1167.0
881,2018/04/02,1211.0,1205.932,1191.0,140600,1216.0,1184.0
882,2018/04/03,1196.0,1200.722,1202.0,204100,1216.0,1183.0
883,2018/04/04,1213.0,1213.893,1203.0,191000,1224.0,1194.0
884,2018/04/05,1210.0,1215.468,1225.0,127700,1228.0,1206.0
885,2018/04/06,1198.0,1203.1,1205.0,169600,1214.0,1197.0
886,2018/04/09,1127.0,1143.487,1207.0,415200,1207.0,1126.0
887,2018/04/10,1106.0,1098.85,1120.0,310500,1120.0,1082.0
888,2018/04/11,1146.0,1139.416,1128.0,245500,1155.0,1126.0
889,2018/04/12,1134.0,1137.354,1147.0,231300,1153.0,1131.0
890,2018/04/13,1134.0,1140.548,1144.0,211400,1157.0,1132.0
891,2018/04/16,1122.0,1120.936,1130.0,162600,1131.0,1111.0
892,2018/04/17,1111.0,1115.039,1122.0,162100,1139.0,1107.0
893,2018/04/18,1144.0,1137.64,1122.0,209600,1148.0,1118.0
894,2018/04/19,1141.0,1145.956,1148.0,324500,1156.0,1132.0
895,2018/04/20,1137.0,1137.767,1136.0,200700,1154.0,1125.0
896,2018/04/23,1160.0,1158.11,1137.0,143200,1166.0,1137.0
897,2018/04/24,1170.0,1167.281,1163.0,92500,1173.0,1157.0
898,2018/04/25,1158.0,1149.305,1163.0,262400,1171.0,1121.0
899,2018/04/26,1135.0,1142.875,1149.0,235900,1156.0,1134.0
900,2018/04/27,1156.0,1160.09,1161.0,224000,1181.0,1148.0
901,2018/05/01,1178.0,1175.899,1177.0,147300,1183.0,1150.0
902,2018/05/02,1183.0,1180.185,1174.0,155700,1189.0,1158.0
903,2018/05/07,1182.0,1179.056,1185.0,67500,1187.0,1165.0
904,2018/05/08,1207.0,1208.189,1195.0,173700,1223.0,1195.0
905,2018/05/09,1195.0,1197.991,1214.0,117300,1214.0,1193.0
906,2018/05/10,1201.0,1202.466,1192.0,127400,1209.0,1192.0
907,2018/05/11,1220.0,1213.918,1201.0,166700,1222.0,1199.0
908,2018/05/14,1189.0,1193.288,1219.0,249100,1219.0,1182.0
909,2018/05/15,1213.0,1215.42,1203.0,131100,1223.0,1202.0
910,2018/05/16,1218.0,1217.797,1208.0,163300,1225.0,1208.0
911,2018/05/17,1217.0,1214.673,1213.0,125600,1219.0,1202.0
912,2018/05/18,1224.0,1224.216,1226.0,107600,1230.0,1218.0
913,2018/05/21,1216.0,1218.165,1226.0,144000,1226.0,1211.0
914,2018/05/22,1212.0,1208.594,1220.0,76300,1220.0,1201.0
915,2018/05/23,1221.0,1223.324,1218.0,151900,1229.0,1214.0
916,2018/05/24,1217.0,1219.133,1230.0,119100,1231.0,1214.0
917,2018/05/25,1210.0,1212.083,1215.0,95000,1220.0,1205.0
918,2018/05/28,1193.0,1200.593,1210.0,145800,1220.0,1192.0
919,2018/05/29,1208.0,1202.909,1196.0,98100,1210.0,1193.0
920,2018/05/30,1177.0,1176.96,1186.0,105000,1186.0,1171.0
921,2018/05/31,1179.0,1182.831,1194.0,157200,1200.0,1178.0
922,2018/06/01,1169.0,1168.065,1164.0,200600,1176.0,1152.0
923,2018/06/04,1203.0,1198.997,1186.0,176800,1207.0,1179.0
924,2018/06/05,1190.0,1190.651,1195.0,166800,1204.0,1186.0
925,2018/06/06,1203.0,1199.631,1186.0,91800,1209.0,1179.0
926,2018/06/07,1231.0,1231.98,1219.0,98000,1243.0,1218.0
927,2018/06/08,1238.0,1237.767,1240.0,181700,1244.0,1226.0
928,2018/06/11,1232.0,1233.799,1240.0,65100,1243.0,1228.0
929,2018/06/12,1221.0,1225.544,1239.0,86900,1239.0,1220.0
930,2018/06/13,1223.0,1224.626,1225.0,51300,1234.0,1220.0
931,2018/06/14,1231.0,1232.002,1224.0,115600,1241.0,1215.0
932,2018/06/15,1209.0,1218.129,1241.0,98300,1241.0,1209.0
933,2018/06/18,1236.0,1228.893,1209.0,181300,1241.0,1200.0
934,2018/06/19,1195.0,1205.317,1231.0,121300,1237.0,1193.0
935,2018/06/20,1170.0,1171.207,1190.0,144700,1190.0,1158.0
936,2018/06/21,1169.0,1168.925,1168.0,116700,1175.0,1161.0
937,2018/06/22,1176.0,1174.212,1156.0,113600,1182.0,1154.0
938,2018/06/25,1143.0,1155.111,1172.0,64200,1173.0,1142.0
939,2018/06/26,1172.0,1156.363,1137.0,96700,1172.0,1127.0
940,2018/06/27,1173.0,1171.435,1160.0,65600,1182.0,1159.0
941,2018/06/28,1168.0,1164.253,1165.0,69200,1170.0,1158.0
942,2018/06/29,1162.0,1160.46,1157.0,39100,1167.0,1153.0
943,2018/07/02,1152.0,1161.708,1162.0,138500,1181.0,1149.0
944,2018/07/03,1148.0,1148.615,1156.0,74200,1162.0,1140.0
945,2018/07/04,1161.0,1156.426,1135.0,70500,1166.0,1135.0
946,2018/07/05,1149.0,1152.572,1156.0,85100,1162.0,1147.0
947,2018/07/06,1172.0,1160.66,1145.0,87300,1194.0,1140.0
948,2018/07/09,1228.0,1225.385,1229.0,266600,1269.0,1214.0
949,2018/07/10,1228.0,1227.159,1238.0,170300,1246.0,1212.0
950,2018/07/11,1247.0,1243.941,1236.0,180800,1261.0,1224.0
951,2018/07/12,1208.0,1224.133,1260.0,198500,1267.0,1201.0
952,2018/07/13,1254.0,1263.674,1248.0,315700,1290.0,1238.0
953,2018/07/17,1245.0,1254.296,1259.0,122600,1275.0,1241.0
954,2018/07/18,1304.0,1302.599,1284.0,343800,1322.0,1283.0
955,2018/07/19,1338.0,1338.302,1332.0,186500,1347.0,1325.0
956,2018/07/20,1324.0,1333.829,1350.0,209900,1364.0,1311.0
957,2018/07/23,1311.0,1311.639,1310.0,158500,1329.0,1296.0
958,2018/07/24,1341.0,1338.518,1328.0,122100,1347.0,1328.0
959,2018/07/25,1348.0,1351.359,1337.0,101100,1359.0,1337.0
960,2018/07/26,1368.0,1366.478,1368.0,125900,1372.0,1356.0
961,2018/07/27,1375.0,1372.649,1367.0,144000,1382.0,1345.0
962,2018/07/30,1367.0,1372.052,1365.0,124000,1384.0,1360.0
963,2018/07/31,1342.0,1343.696,1354.0,114300,1359.0,1329.0
964,2018/08/01,1359.0,1355.599,1348.0,91600,1364.0,1341.0
965,2018/08/02,1345.0,1346.997,1351.0,66500,1363.0,1340.0
966,2018/08/03,1338.0,1340.486,1346.0,75900,1364.0,1327.0
967,2018/08/06,1320.0,1325.073,1338.0,68800,1338.0,1319.0
968,2018/08/07,1327.0,1320.408,1301.0,86000,1327.0,1300.0
969,2018/08/08,1343.0,1338.743,1317.0,78300,1349.0,1314.0
970,2018/08/09,1320.0,1323.582,1320.0,64400,1333.0,1314.0
971,2018/08/10,1308.0,1305.338,1310.0,108100,1317.0,1293.0
972,2018/08/13,1272.0,1278.188,1299.0,70700,1300.0,1269.0
973,2018/08/14,1278.0,1265.788,1254.0,101600,1282.0,1247.0
974,2018/08/15,1275.0,1279.002,1282.0,57700,1290.0,1270.0
975,2018/08/16,1253.0,1253.842,1253.0,51200,1263.0,1243.0
976,2018/08/17,1271.0,1265.91,1248.0,53100,1275.0,1246.0
977,2018/08/20,1260.0,1261.65,1250.0,54800,1271.0,1250.0
978,2018/08/21,1245.0,1247.632,1250.0,57300,1260.0,1237.0
979,2018/08/22,1252.0,1252.885,1231.0,50200,1263.0,1231.0
980,2018/08/23,1253.0,1256.188,1259.0,35600,1263.0,1252.0
981,2018/08/24,1249.0,1249.548,1266.0,44700,1269.0,1242.0
982,2018/08/27,1266.0,1260.556,1254.0,71800,1270.0,1244.0
983,2018/08/28,1288.0,1284.79,1260.0,93600,1295.0,1260.0
984,2018/08/29,1296.0,1285.031,1258.0,116800,1304.0,1258.0
985,2018/08/30,1321.0,1321.228,1316.0,116900,1328.0,1311.0
986,2018/08/31,1307.0,1312.37,1307.0,127100,1323.0,1301.0
987,2018/09/03,1323.0,1327.05,1306.0,143400,1350.0,1300.0
988,2018/09/04,1381.0,1374.893,1339.0,255200,1401.0,1335.0
989,2018/09/05,1343.0,1355.115,1378.0,177300,1379.0,1335.0
990,2018/09/06,1367.0,1368.57,1360.0,154800,1384.0,1350.0
991,2018/09/07,1313.0,1319.632,1337.0,118600,1346.0,1306.0
992,2018/09/10,1341.0,1328.595,1290.0,125000,1344.0,1288.0
993,2018/09/11,1331.0,1332.969,1332.0,105500,1343.0,1321.0
994,2018/09/12,1324.0,1321.943,1328.0,153500,1339.0,1310.0
995,2018/09/13,1337.0,1341.772,1320.0,127000,1360.0,1319.0
996,2018/09/14,1366.0,1364.78,1363.0,197400,1382.0,1356.0
997,2018/09/18,1377.0,1372.427,1372.0,70000,1379.0,1357.0
998,2018/09/19,1393.0,1390.696,1395.0,120900,1399.0,1377.0
999,2018/09/20,1372.0,1376.182,1399.0,128000,1399.0,1367.0
1000,2018/09/21,1394.0,1383.5,1395.0,118700,1395.0,1366.0
1001,2018/09/25,1400.0,1395.714,1400.0,123300,1400.0,1387.0
1002,2018/09/26,1402.0,1399.627,1399.0,104400,1411.0,1387.0
1003,2018/09/27,1395.0,1400.155,1413.0,88900,1413.0,1391.0
1004,2018/09/28,1406.0,1404.607,1399.0,65700,1412.0,1391.0
1005,2018/10/01,1413.0,1414.159,1396.0,111800,1425.0,1395.0
1006,2018/10/02,1413.0,1424.382,1428.0,75200,1447.0,1411.0
1007,2018/10/03,1404.0,1414.786,1424.0,60300,1432.0,1404.0
1008,2018/10/04,1420.0,1418.972,1423.0,63300,1436.0,1402.0
1009,2018/10/05,1405.0,1411.091,1406.0,76900,1419.0,1404.0
1010,2018/10/09,1388.0,1413.16,1495.0,216600,1504.0,1379.0
1011,2018/10/10,1385.0,1383.921,1378.0,119300,1405.0,1344.0
1012,2018/10/11,1335.0,1342.267,1350.0,145200,1358.0,1332.0
1013,2018/10/12,1314.0,1319.789,1331.0,149500,1345.0,1311.0
1014,2018/10/15,1294.0,1304.492,1320.0,135000,1337.0,1292.0
1015,2018/10/16,1287.0,1285.919,1281.0,117600,1300.0,1279.0
1016,2018/10/17,1294.0,1293.322,1287.0,108100,1305.0,1281.0
1017,2018/10/18,1277.0,1282.718,1287.0,102100,1296.0,1275.0
1018,2018/10/19,1267.0,1262.975,1259.0,109400,1279.0,1252.0
1019,2018/10/22,1255.0,1252.895,1263.0,93200,1266.0,1240.0
1020,2018/10/23,1223.0,1233.739,1249.0,129900,1249.0,1220.0
1021,2018/10/24,1232.0,1229.625,1220.0,175500,1240.0,1216.0
1022,2018/10/25,1182.0,1188.702,1193.0,125200,1201.0,1179.0
1023,2018/10/26,1169.0,1173.777,1177.0,148900,1192.0,1163.0
1024,2018/10/29,1164.0,1170.294,1164.0,136300,1187.0,1132.0
1025,2018/10/30,1193.0,1185.592,1172.0,179000,1197.0,1167.0
1026,2018/10/31,1218.0,1207.096,1194.0,138100,1219.0,1189.0
1027,2018/11/01,1209.0,1210.963,1229.0,163800,1231.0,1201.0
1028,2018/11/02,1237.0,1226.218,1223.0,200400,1239.0,1209.0
1029,2018/11/05,1221.0,1220.656,1233.0,129400,1238.0,1210.0
1030,2018/11/06,1226.0,1225.489,1216.0,84400,1232.0,1214.0
1031,2018/11/07,1245.0,1251.076,1250.0,159200,1261.0,1240.0
1032,2018/11/08,1266.0,1271.743,1275.0,114000,1296.0,1265.0
1033,2018/11/09,1269.0,1269.037,1267.0,84500,1278.0,1257.0
1034,2018/11/12,1262.0,1262.07,1259.0,73300,1271.0,1241.0
1035,2018/11/13,1236.0,1235.495,1226.0,64600,1247.0,1223.0
1036,2018/11/14,1237.0,1237.984,1232.0,63200,1247.0,1232.0
1037,2018/11/15,1243.0,1238.78,1234.0,53100,1248.0,1228.0
1038,2018/11/16,1265.0,1268.415,1254.0,139500,1281.0,1254.0
1039,2018/11/19,1276.0,1275.616,1260.0,67500,1284.0,1260.0
1040,2018/11/20,1262.0,1269.084,1263.0,73700,1289.0,1254.0
1041,2018/11/21,1258.0,1255.893,1240.0,87200,1265.0,1234.0
1042,2018/11/22,1264.0,1262.669,1260.0,73600,1271.0,1251.0
1043,2018/11/26,1274.0,1274.217,1269.0,42500,1284.0,1262.0
1044,2018/11/27,1292.0,1290.686,1288.0,77400,1298.0,1281.0
1045,2018/11/28,1288.0,1286.427,1291.0,68200,1296.0,1281.0
1046,2018/11/29,1311.0,1318.813,1302.0,97500,1333.0,1297.0
1047,2018/11/30,1305.0,1309.899,1310.0,54400,1319.0,1305.0
1048,2018/12/03,1325.0,1322.55,1319.0,85500,1337.0,1307.0
1049,2018/12/04,1286.0,1294.21,1315.0,67700,1320.0,1283.0
1050,2018/12/05,1266.0,1264.196,1260.0,90700,1275.0,1257.0
1051,2018/12/06,1244.0,1245.293,1251.0,120800,1256.0,1237.0
1052,2018/12/07,1225.0,1226.629,1235.0,96700,1242.0,1215.0
1053,2018/12/10,1224.0,1218.853,1211.0,82800,1226.0,1201.0
1054,2018/12/11,1218.0,1222.175,1224.0,122000,1232.0,1211.0
1055,2018/12/12,1242.0,1240.824,1218.0,49400,1249.0,1218.0
1056,2018/12/13,1263.0,1266.739,1248.0,59300,1288.0,1247.0
1057,2018/12/14,1249.0,1275.693,1293.0,84400,1293.0,1248.0
1058,2018/12/17,1246.0,1249.246,1247.0,90900,1264.0,1243.0
1059,2018/12/18,1198.0,1209.59,1221.0,75200,1232.0,1197.0
1060,2018/12/19,1198.0,1196.188,1195.0,101400,1205.0,1180.0
1061,2018/12/20,1148.0,1159.734,1193.0,141100,1193.0,1143.0
1062,2018/12/21,1102.0,1108.004,1150.0,127400,1150.0,1095.0
1063,2018/12/25,1036.0,1043.981,1067.0,62100,1067.0,1034.0
1064,2018/12/26,1055.0,1052.802,1041.0,110900,1066.0,1030.0
1065,2018/12/27,1106.0,1096.847,1085.0,126700,1124.0,1068.0
1066,2018/12/28,1119.0,1116.215,1112.0,86400,1125.0,1096.0
1067,2019/01/04,1097.0,1096.058,1108.0,119100,1116.0,1082.0
1068,2019/01/07,1135.0,1137.853,1127.0,124800,1148.0,1117.0
1069,2019/01/08,1150.0,1144.08,1140.0,132200,1160.0,1127.0
1070,2019/01/09,1120.0,1123.145,1137.0,167600,1156.0,1114.0
1071,2019/01/10,1096.0,1093.497,1097.0,122300,1103.0,1086.0
1072,2019/01/11,1089.0,1093.985,1102.0,110700,1110.0,1084.0
1073,2019/01/15,1112.0,1113.206,1085.0,104700,1134.0,1084.0
1074,2019/01/16,1094.0,1098.895,1095.0,83400,1110.0,1089.0
1075,2019/01/17,1109.0,1109.684,1108.0,51600,1123.0,1101.0
1076,2019/01/18,1123.0,1125.709,1113.0,58800,1136.0,1111.0
1077,2019/01/21,1136.0,1137.269,1135.0,58400,1146.0,1126.0
1078,2019/01/22,1137.0,1140.175,1143.0,65600,1154.0,1130.0
1079,2019/01/23,1116.0,1119.505,1127.0,55200,1127.0,1113.0
1080,2019/01/24,1131.0,1128.766,1118.0,52900,1136.0,1112.0
1081,2019/01/25,1146.0,1149.859,1136.0,68100,1159.0,1136.0
1082,2019/01/28,1149.0,1154.844,1155.0,87000,1166.0,1146.0
1083,2019/01/29,1152.0,1148.598,1143.0,59900,1159.0,1139.0
1084,2019/01/30,1154.0,1162.362,1160.0,125700,1178.0,1154.0
1085,2019/01/31,1156.0,1160.327,1170.0,94600,1185.0,1152.0
1086,2019/02/01,1133.0,1139.889,1150.0,93900,1154.0,1132.0
1087,2019/02/04,1162.0,1154.807,1135.0,101000,1163.0,1133.0
1088,2019/02/05,1165.0,1166.422,1179.0,96300,1182.0,1160.0
1089,2019/02/06,1162.0,1166.04,1174.0,42100,1176.0,1160.0
1090,2019/02/07,1151.0,1152.163,1162.0,49000,1163.0,1147.0
1091,2019/02/08,1148.0,1144.779,1139.0,64300,1154.0,1133.0
1092,2019/02/12,1182.0,1175.282,1162.0,90700,1182.0,1160.0
1093,2019/02/13,1194.0,1188.504,1185.0,61500,1197.0,1176.0
1094,2019/02/14,1204.0,1204.717,1199.0,110200,1223.0,1195.0
1095,2019/02/15,1197.0,1195.724,1198.0,88500,1202.0,1192.0
1096,2019/02/18,1214.0,1210.96,1215.0,79500,1220.0,1203.0
1097,2019/02/19,1218.0,1212.754,1210.0,81800,1220.0,1205.0
1098,2019/02/20,1216.0,1223.685,1217.0,102700,1242.0,1212.0
1099,2019/02/21,1236.0,1236.402,1222.0,106700,1245.0,1222.0
1100,2019/02/22,1221.0,1220.078,1228.0,95100,1230.0,1211.0
1101,2019/02/25,1226.0,1222.113,1225.0,153800,1228.0,1216.0
1102,2019/02/26,1182.0,1182.519,1190.0,91600,1199.0,1174.0
1103,2019/02/27,1182.0,1181.787,1181.0,53100,1187.0,1177.0
1104,2019/02/28,1181.0,1180.686,1178.0,105700,1189.0,1173.0
1105,2019/03/01,1164.0,1165.116,1174.0,149500,1179.0,1157.0
1106,2019/03/04,1165.0,1163.165,1164.0,174200,1170.0,1155.0
1107,2019/03/05,1159.0,1151.905,1154.0,108900,1161.0,1142.0
1108,2019/03/06,1135.0,1137.953,1151.0,193000,1154.0,1130.0
1109,2019/03/07,1115.0,1117.45,1128.0,139900,1128.0,1111.0
1110,2019/03/08,1107.0,1106.589,1103.0,122300,1115.0,1102.0
1111,2019/03/11,1104.0,1098.721,1105.0,92900,1105.0,1092.0
1112,2019/03/12,1121.0,1122.372,1114.0,118400,1129.0,1111.0
1113,2019/03/13,1097.0,1102.988,1110.0,50500,1119.0,1097.0
1114,2019/03/14,1089.0,1090.832,1108.0,49900,1108.0,1086.0
1115,2019/03/15,1111.0,1106.79,1091.0,124700,1115.0,1090.0
1116,2019/03/18,1133.0,1126.458,1119.0,86900,1133.0,1112.0
1117,2019/03/19,1123.0,1123.329,1130.0,39800,1130.0,1120.0
1118,2019/03/20,1129.0,1122.091,1115.0,69600,1129.0,1112.0
1119,2019/03/22,1130.0,1125.491,1126.0,67200,1131.0,1118.0
1120,2019/03/25,1094.0,1092.537,1111.0,77800,1111.0,1085.0
1121,2019/03/26,1134.0,1127.706,1100.0,131400,1134.0,1100.0
1122,2019/03/27,1141.0,1134.964,1135.0,93700,1144.0,1122.0
1123,2019/03/28,1104.0,1107.261,1119.0,66200,1120.0,1102.0
1124,2019/03/29,1105.0,1102.801,1111.0,42700,1111.0,1092.0
1125,2019/04/01,1144.0,1140.592,1131.0,82900,1149.0,1127.0
1126,2019/04/02,1154.0,1159.894,1167.0,126900,1169.0,1151.0
1127,2019/04/03,1169.0,1161.91,1156.0,48900,1169.0,1144.0
1128,2019/04/04,1180.0,1178.367,1170.0,44200,1183.0,1168.0
1129,2019/04/05,1167.0,1174.282,1184.0,109400,1191.0,1163.0
1130,2019/04/08,1180.0,1171.815,1175.0,83200,1185.0,1160.0
1131,2019/04/09,1141.0,1144.922,1168.0,79500,1175.0,1134.0
1132,2019/04/10,1141.0,1135.906,1128.0,45800,1145.0,1124.0
1133,2019/04/11,1133.0,1133.54,1144.0,27400,1144.0,1129.0
1134,2019/04/12,1156.0,1154.738,1147.0,80100,1161.0,1136.0
1135,2019/04/15,1186.0,1187.081,1194.0,87700,1197.0,1179.0
1136,2019/04/16,1159.0,1165.796,1181.0,64800,1181.0,1156.0
1137,2019/04/17,1157.0,1157.228,1162.0,28900,1167.0,1149.0
1138,2019/04/18,1125.0,1131.768,1158.0,35300,1158.0,1121.0
1139,2019/04/19,1125.0,1127.788,1140.0,16000,1140.0,1122.0
1140,2019/04/22,1137.0,1132.909,1124.0,44000,1141.0,1114.0
1141,2019/04/23,1169.0,1159.415,1142.0,83900,1171.0,1142.0
1142,2019/04/24,1161.0,1168.252,1175.0,70300,1181.0,1159.0
1143,2019/04/25,1156.0,1155.767,1158.0,60200,1165.0,1146.0
1144,2019/04/26,1163.0,1157.185,1149.0,69800,1169.0,1134.0
1145,2019/05/07,1161.0,1164.686,1171.0,116200,1180.0,1156.0
1146,2019/05/08,1096.0,1097.275,1131.0,190700,1134.0,1080.0
1147,2019/05/09,1068.0,1071.631,1082.0,65800,1090.0,1063.0
1148,2019/05/10,1094.0,1094.239,1065.0,114900,1106.0,1065.0
1149,2019/05/13,1080.0,1091.091,1088.0,50400,1109.0,1080.0
1150,2019/05/14,1085.0,1076.09,1060.0,54600,1086.0,1055.0
1151,2019/05/15,1087.0,1086.64,1097.0,44700,1097.0,1074.0
1152,2019/05/16,1083.0,1079.185,1086.0,45400,1087.0,1065.0
1153,2019/05/17,1108.0,1107.95,1095.0,50100,1118.0,1095.0
1154,2019/05/20,1118.0,1120.478,1109.0,38100,1129.0,1109.0
1155,2019/05/21,1107.0,1108.59,1105.0,56100,1120.0,1101.0
1156,2019/05/22,1100.0,1104.888,1107.0,40900,1112.0,1099.0
1157,2019/05/23,1088.0,1087.823,1092.0,52400,1099.0,1082.0
1158,2019/05/24,1093.0,1088.607,1076.0,42000,1095.0,1072.0
1159,2019/05/27,1100.0,1100.743,1096.0,26500,1115.0,1090.0
1160,2019/05/28,1081.0,1078.865,1098.0,210900,1100.0,1070.0
1161,2019/05/29,1059.0,1064.404,1060.0,115900,1081.0,1051.0
1162,2019/05/30,1032.0,1029.45,1052.0,91300,1052.0,1021.0
1163,2019/05/31,1008.0,1009.619,1021.0,86100,1024.0,1003.0
1164,2019/06/03,984.0,983.933,997.0,65200,997.0,978.0
1165,2019/06/04,1000.0,989.602,988.0,74600,1000.0,973.0
1166,2019/06/05,1042.0,1034.26,1026.0,62800,1042.0,1023.0
1167,2019/06/06,1023.0,1029.909,1035.0,35300,1039.0,1023.0
1168,2019/06/07,1023.0,1023.485,1024.0,41000,1030.0,1014.0
1169,2019/06/10,1057.0,1047.892,1035.0,36100,1057.0,1032.0
1170,2019/06/11,1061.0,1059.53,1058.0,49800,1061.0,1052.0
1171,2019/06/12,1050.0,1053.458,1058.0,48900,1061.0,1048.0
1172,2019/06/13,1037.0,1039.068,1036.0,70800,1060.0,1031.0
1173,2019/06/14,1031.0,1030.081,1022.0,171500,1044.0,1021.0
1174,2019/06/17,1030.0,1031.072,1028.0,63800,1040.0,1022.0
1175,2019/06/18,998.0,1012.33,1027.0,67800,1037.0,997.0
1176,2019/06/19,1041.0,1032.759,1013.0,60200,1042.0,1013.0
1177,2019/06/20,1053.0,1052.925,1049.0,70500,1059.0,1046.0
1178,2019/06/21,1051.0,1058.544,1062.0,116400,1069.0,1051.0
1179,2019/06/24,1041.0,1045.495,1048.0,53500,1055.0,1039.0
1180,2019/06/25,1036.0,1039.234,1038.0,50400,1053.0,1034.0
1181,2019/06/26,1029.0,1033.744,1030.0,54700,1043.0,1028.0
1182,2019/06/27,1037.0,1038.353,1034.0,70000,1048.0,1034.0
1183,2019/06/28,1042.0,1041.252,1028.0,79500,1049.0,1028.0
1184,2019/07/01,1057.0,1055.829,1063.0,54900,1063.0,1046.0
1185,2019/07/02,1068.0,1064.079,1057.0,44300,1071.0,1055.0
1186,2019/07/03,1066.0,1064.213,1057.0,47000,1068.0,1056.0
1187,2019/07/04,1088.0,1083.946,1076.0,60900,1090.0,1072.0
1188,2019/07/05,1096.0,1093.082,1088.0,114300,1100.0,1078.0
1189,2019/07/08,1092.0,1090.583,1070.0,106000,1109.0,1070.0
1190,2019/07/09,1091.0,1101.911,1102.0,83100,1125.0,1088.0
1191,2019/07/10,1082.0,1083.576,1076.0,97000,1091.0,1076.0
1192,2019/07/11,1088.0,1086.053,1078.0,56400,1092.0,1074.0
1193,2019/07/12,1073.0,1083.89,1088.0,50100,1101.0,1073.0
1194,2019/07/16,1098.0,1093.394,1073.0,60400,1104.0,1073.0
1195,2019/07/17,1089.0,1094.215,1093.0,74000,1109.0,1085.0
1196,2019/07/18,1070.0,1073.187,1082.0,143800,1088.0,1061.0
1197,2019/07/19,1095.0,1087.21,1064.0,64900,1103.0,1063.0
1198,2019/07/22,1082.0,1087.513,1091.0,59600,1099.0,1082.0
1199,2019/07/23,1085.0,1084.4,1080.0,39500,1089.0,1077.0
1200,2019/07/24,1079.0,1079.284,1087.0,59800,1092.0,1072.0
1201,2019/07/25,1094.0,1091.024,1077.0,16600,1096.0,1077.0
1202,2019/07/26,1073.0,1074.754,1084.0,28900,1084.0,1070.0
1203,2019/07/29,1073.0,1071.175,1075.0,30800,1077.0,1063.0
1204,2019/07/30,1095.0,1091.11,1081.0,52600,1096.0,1080.0
1205,2019/07/31,1097.0,1097.088,1088.0,98900,1104.0,1088.0
1206,2019/08/01,1073.0,1078.974,1087.0,43000,1091.0,1071.0
1207,2019/08/02,1016.0,1023.517,1049.0,96700,1052.0,1009.0
1208,2019/08/05,991.0,992.007,1002.0,71300,1013.0,975.0
1209,2019/08/06,999.0,988.499,976.0,67800,1000.0,970.0
1210,2019/08/07,993.0,996.803,984.0,65600,1005.0,984.0
1211,2019/08/08,1001.0,998.752,982.0,99600,1014.0,977.0
1212,2019/08/09,1015.0,1015.893,1011.0,39100,1023.0,1010.0
1213,2019/08/13,1000.0,997.786,995.0,51300,1006.0,988.0
1214,2019/08/14,1001.0,999.448,1010.0,85900,1015.0,987.0
1215,2019/08/15,989.0,982.649,978.0,35600,989.0,965.0
1216,2019/08/16,991.0,987.502,980.0,23100,993.0,975.0
1217,2019/08/19,1000.0,1000.516,1001.0,18800,1004.0,997.0
1218,2019/08/20,1013.0,1009.546,992.0,27500,1013.0,992.0
1219,2019/08/21,1003.0,1003.947,996.0,22500,1012.0,996.0
1220,2019/08/22,1002.0,1003.086,1004.0,36100,1010.0,991.0
1221,2019/08/23,999.0,1000.543,1001.0,22100,1006.0,997.0
