,Date,Close,VWAP,Open,Volume,High,Low
0,2014/08/25,2850.0,2850.909,2830.0,62700,2870.0,2820.0
1,2014/08/26,2810.0,2820.33,2860.0,33300,2860.0,2800.0
2,2014/08/27,2790.0,2791.433,2800.0,29300,2820.0,2780.0
3,2014/08/28,2770.0,2774.498,2800.0,41800,2800.0,2760.0
4,2014/08/29,2940.0,2927.743,2900.0,339800,2970.0,2880.0
5,2014/09/01,2910.0,2914.975,2940.0,101300,2940.0,2900.0
6,2014/09/02,2930.0,2922.924,2920.0,72500,2940.0,2910.0
7,2014/09/03,2910.0,2915.249,2930.0,66300,2940.0,2890.0
8,2014/09/04,2970.0,2991.665,2970.0,297900,3050.0,2950.0
9,2014/09/05,3010.0,3001.084,2990.0,93200,3020.0,2980.0
10,2014/09/08,3030.0,3017.905,3030.0,69200,3030.0,2990.0
11,2014/09/09,3030.0,3024.984,3040.0,62400,3040.0,3000.0
12,2014/09/10,3020.0,3017.357,3020.0,47300,3030.0,3000.0
13,2014/09/11,3010.0,3017.607,3030.0,42200,3030.0,3010.0
14,2014/09/12,3030.0,3033.371,3030.0,96400,3050.0,3010.0
15,2014/09/16,3070.0,3064.829,3040.0,129000,3100.0,3030.0
16,2014/09/17,3050.0,3066.238,3090.0,42800,3100.0,3040.0
17,2014/09/18,3070.0,3059.253,3050.0,41500,3070.0,3050.0
18,2014/09/19,3080.0,3069.552,3080.0,73600,3080.0,3050.0
19,2014/09/22,3070.0,3079.961,3090.0,50700,3090.0,3070.0
20,2014/09/24,3080.0,3063.168,3070.0,54600,3080.0,3040.0
21,2014/09/25,3110.0,3089.868,3080.0,174600,3120.0,3070.0
22,2014/09/26,3100.0,3091.005,3070.0,54700,3120.0,3060.0
23,2014/09/29,3100.0,3097.609,3110.0,38900,3120.0,3080.0
24,2014/09/30,3080.0,3083.462,3100.0,44200,3110.0,3060.0
25,2014/10/01,3080.0,3083.274,3050.0,50700,3100.0,3050.0
26,2014/10/02,2950.0,2987.109,3030.0,119000,3040.0,2940.0
27,2014/10/03,2980.0,2982.148,2960.0,51200,3000.0,2960.0
28,2014/10/06,2970.0,2981.068,3000.0,45900,3010.0,2960.0
29,2014/10/07,3050.0,3050.222,3010.0,80900,3080.0,3000.0
30,2014/10/08,3030.0,3027.989,3010.0,52200,3050.0,3000.0
31,2014/10/09,3010.0,3025.624,3050.0,44100,3050.0,3010.0
32,2014/10/10,2920.0,2936.242,2960.0,73700,2970.0,2910.0
33,2014/10/14,2870.0,2885.127,2880.0,51300,2920.0,2860.0
34,2014/10/15,2870.0,2870.786,2860.0,36900,2900.0,2850.0
35,2014/10/16,2800.0,2821.58,2850.0,50000,2860.0,2800.0
36,2014/10/17,2790.0,2788.895,2800.0,57900,2810.0,2770.0
37,2014/10/20,2850.0,2841.144,2840.0,34100,2860.0,2820.0
38,2014/10/21,2850.0,2860.427,2880.0,93600,2880.0,2830.0
39,2014/10/22,2900.0,2882.769,2890.0,52000,2900.0,2860.0
40,2014/10/23,2880.0,2881.233,2890.0,21900,2900.0,2860.0
41,2014/10/24,2910.0,2896.8,2910.0,32500,2910.0,2870.0
42,2014/10/27,2970.0,2957.831,2940.0,46100,2980.0,2940.0
43,2014/10/28,2980.0,2966.626,2980.0,48900,2990.0,2940.0
44,2014/10/29,3000.0,3007.339,3000.0,45100,3030.0,2980.0
45,2014/10/30,3010.0,3011.616,2980.0,56300,3030.0,2980.0
46,2014/10/31,3090.0,3065.244,3050.0,86200,3100.0,3040.0
47,2014/11/04,3070.0,3086.142,3100.0,87100,3130.0,3060.0
48,2014/11/05,3090.0,3065.133,3050.0,71300,3100.0,3000.0
49,2014/11/06,3110.0,3111.927,3080.0,104300,3140.0,3070.0
50,2014/11/07,3120.0,3113.341,3080.0,83200,3130.0,3080.0
51,2014/11/10,3110.0,3114.447,3100.0,44300,3130.0,3100.0
52,2014/11/11,3070.0,3083.062,3110.0,68900,3110.0,3070.0
53,2014/11/12,3050.0,3078.867,3080.0,82100,3120.0,3050.0
54,2014/11/13,2970.0,2994.07,3050.0,133400,3070.0,2950.0
55,2014/11/14,2990.0,2981.132,3010.0,86600,3010.0,2950.0
56,2014/11/17,2950.0,2963.766,2970.0,39300,2990.0,2950.0
57,2014/11/18,3000.0,2979.781,2960.0,36600,3000.0,2960.0
58,2014/11/19,3000.0,3004.583,3000.0,51500,3020.0,2980.0
59,2014/11/20,3050.0,3037.657,3020.0,68300,3060.0,3000.0
60,2014/11/21,3070.0,3058.615,3070.0,39000,3080.0,3030.0
61,2014/11/25,3040.0,3039.095,3070.0,45300,3070.0,3020.0
62,2014/11/26,3040.0,3044.516,3010.0,43400,3060.0,3010.0
63,2014/11/27,3030.0,3040.0,3030.0,36100,3060.0,3030.0
64,2014/11/28,3100.0,3082.671,3060.0,64400,3100.0,3050.0
65,2014/12/01,3070.0,3078.155,3090.0,50400,3090.0,3050.0
66,2014/12/02,3110.0,3095.835,3080.0,67700,3120.0,3060.0
67,2014/12/03,3100.0,3101.174,3100.0,28100,3120.0,3090.0
68,2014/12/04,3210.0,3171.548,3140.0,176400,3220.0,3120.0
69,2014/12/05,3180.0,3172.743,3210.0,71100,3210.0,3140.0
70,2014/12/08,3180.0,3188.196,3200.0,37700,3200.0,3170.0
71,2014/12/09,3170.0,3171.525,3150.0,34100,3200.0,3150.0
72,2014/12/10,3140.0,3157.335,3190.0,48400,3190.0,3130.0
73,2014/12/11,3120.0,3115.809,3110.0,43900,3140.0,3100.0
74,2014/12/12,3120.0,3138.75,3130.0,56800,3160.0,3120.0
75,2014/12/15,3090.0,3113.934,3120.0,33300,3140.0,3090.0
76,2014/12/16,3040.0,3053.309,3070.0,41100,3080.0,3030.0
77,2014/12/17,3020.0,3032.526,3010.0,48700,3060.0,3010.0
78,2014/12/18,3060.0,3071.541,3060.0,34400,3100.0,3050.0
79,2014/12/19,3110.0,3088.489,3110.0,58900,3120.0,3050.0
80,2014/12/22,3080.0,3093.65,3130.0,32600,3130.0,3060.0
81,2014/12/24,3120.0,3107.343,3100.0,49300,3130.0,3080.0
82,2014/12/25,3140.0,3128.59,3130.0,38300,3150.0,3110.0
83,2014/12/26,3160.0,3140.709,3160.0,39500,3170.0,3110.0
84,2014/12/29,3130.0,3130.438,3150.0,41100,3160.0,3100.0
85,2014/12/30,3120.0,3127.879,3140.0,33000,3140.0,3110.0
86,2015/01/05,3110.0,3118.548,3120.0,24100,3140.0,3100.0
87,2015/01/06,3040.0,3062.274,3090.0,54100,3090.0,3040.0
88,2015/01/07,3110.0,3101.599,3040.0,63800,3130.0,3040.0
89,2015/01/08,3180.0,3163.697,3120.0,100900,3200.0,3110.0
90,2015/01/09,3150.0,3162.384,3180.0,47400,3190.0,3140.0
91,2015/01/13,3160.0,3148.602,3130.0,50800,3180.0,3120.0
92,2015/01/14,3050.0,3067.522,3140.0,123900,3150.0,3030.0
93,2015/01/15,3060.0,3072.207,3090.0,51200,3110.0,3050.0
94,2015/01/16,3020.0,3029.312,3050.0,55200,3050.0,3010.0
95,2015/01/19,3020.0,3024.26,3030.0,39200,3040.0,3010.0
96,2015/01/20,3050.0,3035.053,3020.0,56600,3050.0,3020.0
97,2015/01/21,3020.0,3029.848,3050.0,32800,3050.0,3010.0
98,2015/01/22,3030.0,3016.115,3030.0,38100,3030.0,3000.0
99,2015/01/23,3030.0,3039.691,3040.0,42100,3050.0,3030.0
100,2015/01/26,3040.0,3037.217,3030.0,30900,3050.0,3010.0
101,2015/01/27,3040.0,3043.477,3040.0,41700,3060.0,3030.0
102,2015/01/28,3080.0,3065.427,3050.0,29300,3080.0,3040.0
103,2015/01/29,3040.0,3058.105,3070.0,59100,3090.0,3030.0
104,2015/01/30,3060.0,3061.766,3060.0,36800,3080.0,3050.0
105,2015/02/02,3050.0,3048.179,3050.0,30200,3070.0,3020.0
106,2015/02/03,3040.0,3037.435,3060.0,50300,3070.0,3020.0
107,2015/02/04,3060.0,3052.779,3040.0,43900,3070.0,3040.0
108,2015/02/05,2970.0,2997.836,3060.0,140000,3060.0,2950.0
109,2015/02/06,3050.0,3026.341,3000.0,80900,3060.0,2990.0
110,2015/02/09,3060.0,3052.236,3050.0,31300,3060.0,3040.0
111,2015/02/10,3060.0,3054.2,3070.0,25000,3070.0,3040.0
112,2015/02/12,3080.0,3079.191,3070.0,51900,3090.0,3070.0
113,2015/02/13,3100.0,3102.726,3110.0,76300,3120.0,3090.0
114,2015/02/16,3120.0,3116.614,3090.0,50500,3140.0,3090.0
115,2015/02/17,3140.0,3132.121,3120.0,36300,3150.0,3110.0
116,2015/02/18,3190.0,3182.154,3150.0,59900,3200.0,3150.0
117,2015/02/19,3210.0,3198.38,3170.0,79000,3230.0,3170.0
118,2015/02/20,3230.0,3199.621,3220.0,89700,3240.0,3150.0
119,2015/02/23,3210.0,3221.235,3250.0,50200,3250.0,3200.0
120,2015/02/24,3200.0,3213.545,3210.0,42600,3230.0,3200.0
121,2015/02/25,3240.0,3230.204,3220.0,44100,3250.0,3210.0
122,2015/02/26,3270.0,3266.868,3250.0,64500,3290.0,3240.0
123,2015/02/27,3260.0,3268.789,3300.0,51200,3300.0,3240.0
124,2015/03/02,3270.0,3268.801,3280.0,29200,3290.0,3260.0
125,2015/03/03,3260.0,3265.269,3270.0,46500,3290.0,3240.0
126,2015/03/04,3250.0,3256.0,3250.0,33000,3270.0,3240.0
127,2015/03/05,3270.0,3258.621,3250.0,37700,3270.0,3240.0
128,2015/03/06,3270.0,3260.617,3270.0,22700,3270.0,3250.0
129,2015/03/09,3270.0,3261.72,3270.0,15700,3270.0,3250.0
130,2015/03/10,3260.0,3260.688,3250.0,32000,3280.0,3250.0
131,2015/03/11,3270.0,3265.164,3260.0,33500,3280.0,3250.0
132,2015/03/12,3270.0,3275.047,3280.0,42400,3290.0,3260.0
133,2015/03/13,3270.0,3281.957,3290.0,51600,3290.0,3260.0
134,2015/03/16,3280.0,3278.635,3270.0,24900,3290.0,3270.0
135,2015/03/17,3280.0,3279.483,3290.0,38700,3290.0,3270.0
136,2015/03/18,3370.0,3322.002,3280.0,92900,3370.0,3260.0
137,2015/03/19,3350.0,3355.915,3360.0,49200,3370.0,3330.0
138,2015/03/20,3350.0,3360.696,3360.0,43100,3380.0,3340.0
139,2015/03/23,3390.0,3388.366,3370.0,36100,3400.0,3370.0
140,2015/03/24,3400.0,3403.557,3390.0,44700,3420.0,3390.0
141,2015/03/25,3400.0,3399.796,3400.0,39300,3420.0,3380.0
142,2015/03/26,3370.0,3377.595,3400.0,68600,3420.0,3350.0
143,2015/03/27,3280.0,3272.387,3220.0,117700,3320.0,3210.0
144,2015/03/30,3220.0,3224.672,3220.0,82400,3250.0,3190.0
145,2015/03/31,3210.0,3223.605,3220.0,68800,3250.0,3200.0
146,2015/04/01,3170.0,3177.769,3200.0,74400,3210.0,3150.0
147,2015/04/02,3210.0,3216.79,3190.0,59500,3250.0,3180.0
148,2015/04/03,3260.0,3240.69,3220.0,53600,3260.0,3210.0
149,2015/04/06,3240.0,3241.269,3260.0,19700,3260.0,3230.0
150,2015/04/07,3240.0,3231.728,3240.0,24300,3240.0,3210.0
151,2015/04/08,3240.0,3243.973,3250.0,29700,3260.0,3230.0
152,2015/04/09,3210.0,3204.989,3240.0,45900,3240.0,3190.0
153,2015/04/10,3190.0,3195.039,3210.0,38300,3210.0,3170.0
154,2015/04/13,3180.0,3184.242,3200.0,16500,3200.0,3170.0
155,2015/04/14,3280.0,3242.043,3190.0,60200,3280.0,3190.0
156,2015/04/15,3250.0,3259.975,3260.0,40600,3280.0,3240.0
157,2015/04/16,3290.0,3270.421,3250.0,35600,3290.0,3240.0
158,2015/04/17,3250.0,3265.396,3280.0,41700,3280.0,3250.0
159,2015/04/20,3200.0,3216.789,3240.0,38300,3240.0,3190.0
160,2015/04/21,3220.0,3218.164,3220.0,50100,3230.0,3200.0
161,2015/04/22,3290.0,3261.985,3240.0,54900,3290.0,3230.0
162,2015/04/23,3330.0,3309.096,3290.0,74100,3330.0,3270.0
163,2015/04/24,3320.0,3305.794,3330.0,75600,3330.0,3270.0
164,2015/04/27,3290.0,3283.198,3320.0,41900,3320.0,3260.0
165,2015/04/28,3280.0,3284.9,3300.0,44900,3300.0,3270.0
166,2015/04/30,3230.0,3235.997,3280.0,69700,3280.0,3210.0
167,2015/05/01,3200.0,3204.952,3220.0,41400,3240.0,3180.0
168,2015/05/07,3210.0,3216.716,3200.0,46900,3240.0,3190.0
169,2015/05/08,3230.0,3222.712,3210.0,54200,3240.0,3190.0
170,2015/05/11,3340.0,3322.734,3270.0,82300,3350.0,3270.0
171,2015/05/12,3390.0,3357.749,3340.0,81300,3400.0,3310.0
172,2015/05/13,3400.0,3404.173,3380.0,232200,3490.0,3250.0
173,2015/05/14,3310.0,3334.899,3390.0,69400,3400.0,3290.0
174,2015/05/15,3310.0,3317.32,3330.0,38800,3360.0,3290.0
175,2015/05/18,3320.0,3314.98,3310.0,50600,3340.0,3300.0
176,2015/05/19,3300.0,3310.79,3320.0,62000,3350.0,3290.0
177,2015/05/20,3310.0,3306.701,3300.0,68800,3320.0,3290.0
178,2015/05/21,3270.0,3274.962,3310.0,66500,3310.0,3240.0
179,2015/05/22,3280.0,3274.819,3260.0,66200,3290.0,3260.0
180,2015/05/25,3270.0,3277.01,3300.0,38800,3300.0,3260.0
181,2015/05/26,3280.0,3269.265,3260.0,58500,3290.0,3260.0
182,2015/05/27,3310.0,3291.375,3280.0,53800,3320.0,3260.0
183,2015/05/28,3320.0,3312.532,3320.0,39100,3320.0,3300.0
184,2015/05/29,3330.0,3340.543,3320.0,64400,3360.0,3310.0
185,2015/06/01,3330.0,3324.208,3310.0,44200,3350.0,3300.0
186,2015/06/02,3350.0,3332.611,3330.0,56300,3350.0,3320.0
187,2015/06/03,3380.0,3359.858,3350.0,42400,3380.0,3330.0
188,2015/06/04,3360.0,3364.489,3380.0,32300,3380.0,3350.0
189,2015/06/05,3370.0,3360.854,3340.0,39800,3390.0,3330.0
190,2015/06/08,3320.0,3351.016,3390.0,55100,3390.0,3320.0
191,2015/06/09,3290.0,3304.864,3320.0,69900,3320.0,3290.0
192,2015/06/10,3270.0,3286.16,3290.0,72400,3320.0,3260.0
193,2015/06/11,3270.0,3283.416,3280.0,64700,3300.0,3260.0
194,2015/06/12,3300.0,3290.175,3280.0,97300,3310.0,3280.0
195,2015/06/15,3300.0,3297.197,3300.0,74200,3310.0,3280.0
196,2015/06/16,3300.0,3302.346,3300.0,42200,3320.0,3290.0
197,2015/06/17,3320.0,3320.869,3310.0,56400,3340.0,3300.0
198,2015/06/18,3290.0,3299.5,3330.0,50000,3330.0,3280.0
199,2015/06/19,3320.0,3307.734,3310.0,69300,3320.0,3290.0
200,2015/06/22,3390.0,3370.565,3320.0,97300,3410.0,3310.0
201,2015/06/23,3440.0,3424.175,3400.0,72100,3440.0,3400.0
202,2015/06/24,3460.0,3463.833,3450.0,98100,3490.0,3430.0
203,2015/06/25,3420.0,3418.336,3410.0,63100,3440.0,3380.0
204,2015/06/26,3420.0,3418.0,3440.0,43000,3440.0,3390.0
205,2015/06/29,3330.0,3360.501,3370.0,69800,3390.0,3330.0
206,2015/06/30,3350.0,3342.469,3330.0,56700,3370.0,3320.0
207,2015/07/01,3340.0,3351.024,3370.0,37100,3380.0,3340.0
208,2015/07/02,3390.0,3375.632,3370.0,60900,3390.0,3360.0
209,2015/07/03,3250.0,3308.082,3340.0,202800,3350.0,3250.0
210,2015/07/06,3220.0,3236.377,3250.0,112600,3270.0,3210.0
211,2015/07/07,3230.0,3242.535,3250.0,85200,3270.0,3220.0
212,2015/07/08,3170.0,3193.587,3230.0,124600,3240.0,3160.0
213,2015/07/09,3160.0,3112.296,3120.0,106700,3160.0,3060.0
214,2015/07/10,3200.0,3213.421,3190.0,121600,3250.0,3190.0
215,2015/07/13,3260.0,3241.765,3220.0,45900,3260.0,3210.0
216,2015/07/14,3330.0,3312.829,3290.0,77400,3340.0,3290.0
217,2015/07/15,3390.0,3362.614,3330.0,83000,3390.0,3320.0
218,2015/07/16,3390.0,3385.942,3390.0,72700,3400.0,3360.0
219,2015/07/17,3420.0,3435.215,3390.0,241800,3510.0,3360.0
220,2015/07/21,3390.0,3370.422,3400.0,102000,3400.0,3330.0
221,2015/07/22,3370.0,3360.16,3370.0,81100,3390.0,3330.0
222,2015/07/23,3400.0,3378.276,3380.0,46400,3400.0,3350.0
223,2015/07/24,3410.0,3410.286,3400.0,59400,3440.0,3390.0
224,2015/07/27,3350.0,3361.697,3380.0,76000,3390.0,3330.0
225,2015/07/28,3330.0,3334.78,3350.0,34100,3350.0,3310.0
226,2015/07/29,3350.0,3333.555,3340.0,30100,3350.0,3310.0
227,2015/07/30,3330.0,3335.109,3320.0,45800,3360.0,3310.0
228,2015/07/31,3370.0,3354.915,3330.0,29500,3370.0,3330.0
229,2015/08/03,3590.0,3515.787,3370.0,294800,3630.0,3340.0
230,2015/08/04,3660.0,3620.121,3570.0,173300,3660.0,3530.0
231,2015/08/05,3630.0,3643.273,3600.0,121300,3700.0,3580.0
232,2015/08/06,3680.0,3681.556,3650.0,84200,3720.0,3640.0
233,2015/08/07,3620.0,3636.002,3680.0,85800,3690.0,3600.0
234,2015/08/10,3720.0,3691.2,3670.0,83300,3720.0,3640.0
235,2015/08/11,3850.0,3840.627,3800.0,146700,3900.0,3780.0
236,2015/08/12,3840.0,3859.231,3850.0,92300,3890.0,3830.0
237,2015/08/13,3870.0,3857.761,3840.0,116100,3900.0,3790.0
238,2015/08/14,3890.0,3880.043,3870.0,69300,3920.0,3840.0
239,2015/08/17,3940.0,3927.337,3890.0,61200,3950.0,3890.0
240,2015/08/18,3930.0,3928.702,3940.0,47000,3940.0,3900.0
241,2015/08/19,3830.0,3853.844,3900.0,66600,3910.0,3810.0
242,2015/08/20,3820.0,3833.609,3830.0,39900,3860.0,3810.0
243,2015/08/21,3750.0,3767.958,3760.0,66600,3800.0,3740.0
244,2015/08/24,3620.0,3658.501,3690.0,120100,3710.0,3600.0
245,2015/08/25,3510.0,3506.165,3450.0,132200,3620.0,3390.0
246,2015/08/26,3590.0,3581.537,3550.0,95000,3630.0,3520.0
247,2015/08/27,3650.0,3641.177,3670.0,94300,3680.0,3590.0
248,2015/08/28,3730.0,3737.788,3770.0,85900,3770.0,3710.0
249,2015/08/31,3790.0,3765.761,3780.0,80200,3800.0,3700.0
250,2015/09/01,3600.0,3663.906,3710.0,82700,3730.0,3600.0
251,2015/09/02,3570.0,3597.051,3540.0,60700,3670.0,3540.0
252,2015/09/03,3620.0,3629.071,3610.0,63500,3670.0,3600.0
253,2015/09/04,3700.0,3651.132,3630.0,121000,3720.0,3580.0
254,2015/09/07,3660.0,3663.945,3670.0,90500,3720.0,3620.0
255,2015/09/08,3570.0,3591.727,3650.0,44000,3670.0,3540.0
256,2015/09/09,3740.0,3694.024,3640.0,50700,3750.0,3630.0
257,2015/09/10,3730.0,3698.216,3680.0,52700,3740.0,3620.0
258,2015/09/11,3780.0,3738.645,3680.0,62000,3810.0,3680.0
259,2015/09/14,3780.0,3785.17,3790.0,53000,3840.0,3750.0
260,2015/09/15,3750.0,3759.106,3770.0,43600,3790.0,3730.0
261,2015/09/16,3680.0,3688.318,3770.0,44000,3770.0,3640.0
262,2015/09/17,3710.0,3698.108,3700.0,37000,3720.0,3670.0
263,2015/09/18,3690.0,3697.022,3710.0,63800,3730.0,3640.0
264,2015/09/24,3640.0,3662.434,3650.0,72300,3710.0,3630.0
265,2015/09/25,3690.0,3730.604,3780.0,157200,3790.0,3630.0
266,2015/09/28,3740.0,3711.147,3690.0,68000,3750.0,3660.0
267,2015/09/29,3500.0,3558.696,3660.0,116600,3680.0,3500.0
268,2015/09/30,3610.0,3585.419,3550.0,81200,3620.0,3530.0
269,2015/10/01,3590.0,3595.389,3610.0,48800,3620.0,3570.0
270,2015/10/02,3560.0,3560.074,3570.0,67300,3590.0,3520.0
271,2015/10/05,3600.0,3585.147,3600.0,64500,3610.0,3550.0
272,2015/10/06,3710.0,3707.816,3650.0,71900,3750.0,3640.0
273,2015/10/07,3770.0,3752.057,3710.0,70500,3790.0,3700.0
274,2015/10/08,3810.0,3794.723,3790.0,75800,3830.0,3760.0
275,2015/10/09,3880.0,3863.194,3810.0,62300,3900.0,3810.0
276,2015/10/13,3870.0,3884.516,3880.0,58900,3920.0,3860.0
277,2015/10/14,3800.0,3808.019,3820.0,42400,3850.0,3790.0
278,2015/10/15,3850.0,3837.759,3770.0,29900,3880.0,3770.0
279,2015/10/16,3820.0,3847.744,3860.0,29700,3880.0,3800.0
280,2015/10/19,3840.0,3825.556,3800.0,30600,3850.0,3780.0
281,2015/10/20,3820.0,3808.527,3820.0,31900,3840.0,3770.0
282,2015/10/21,3960.0,3938.02,3910.0,131800,3980.0,3870.0
283,2015/10/22,3960.0,3953.479,3910.0,64100,3980.0,3910.0
284,2015/10/23,4000.0,3994.975,3990.0,80800,4020.0,3960.0
285,2015/10/26,3980.0,4002.188,4000.0,62600,4040.0,3970.0
286,2015/10/27,3910.0,3897.073,3900.0,61500,3920.0,3870.0
287,2015/10/28,3880.0,3867.829,3890.0,53900,3910.0,3830.0
288,2015/10/29,3840.0,3850.92,3910.0,52200,3920.0,3820.0
289,2015/10/30,3850.0,3845.85,3800.0,61200,3890.0,3800.0
290,2015/11/02,3850.0,3844.73,3830.0,53700,3880.0,3790.0
291,2015/11/04,3830.0,3850.75,3930.0,52000,3940.0,3800.0
292,2015/11/05,3840.0,3838.736,3850.0,129000,3900.0,3770.0
293,2015/11/06,3620.0,3642.075,3770.0,180700,3780.0,3580.0
294,2015/11/09,3750.0,3708.944,3670.0,125900,3750.0,3640.0
295,2015/11/10,3710.0,3706.84,3730.0,65200,3740.0,3680.0
296,2015/11/11,3740.0,3737.552,3720.0,47800,3760.0,3710.0
297,2015/11/12,3770.0,3763.118,3740.0,55800,3790.0,3730.0
298,2015/11/13,3730.0,3739.796,3730.0,24500,3760.0,3720.0
299,2015/11/16,3710.0,3715.882,3700.0,35700,3740.0,3690.0
300,2015/11/17,3750.0,3749.574,3750.0,46900,3770.0,3730.0
301,2015/11/18,3750.0,3779.254,3780.0,40200,3820.0,3750.0
302,2015/11/19,3790.0,3787.864,3790.0,20600,3810.0,3770.0
303,2015/11/20,3790.0,3770.894,3760.0,24600,3790.0,3750.0
304,2015/11/24,3810.0,3805.768,3800.0,37100,3820.0,3790.0
305,2015/11/25,3780.0,3782.363,3800.0,40200,3810.0,3750.0
306,2015/11/26,3770.0,3773.788,3750.0,26400,3800.0,3750.0
307,2015/11/27,3770.0,3777.473,3800.0,28100,3800.0,3750.0
308,2015/11/30,3710.0,3727.916,3750.0,40300,3760.0,3710.0
309,2015/12/01,3770.0,3756.128,3720.0,29700,3770.0,3720.0
310,2015/12/02,3760.0,3766.103,3800.0,39000,3800.0,3740.0
311,2015/12/03,3730.0,3732.775,3740.0,22700,3750.0,3720.0
312,2015/12/04,3710.0,3712.84,3710.0,41200,3740.0,3690.0
313,2015/12/07,3710.0,3727.469,3730.0,24500,3760.0,3700.0
314,2015/12/08,3710.0,3720.583,3730.0,20600,3750.0,3700.0
315,2015/12/09,3680.0,3699.772,3710.0,43800,3740.0,3660.0
316,2015/12/10,3610.0,3624.661,3650.0,33900,3650.0,3610.0
317,2015/12/11,3600.0,3574.465,3550.0,54200,3630.0,3540.0
318,2015/12/14,3560.0,3538.977,3530.0,21500,3570.0,3520.0
319,2015/12/15,3480.0,3506.153,3540.0,62900,3560.0,3460.0
320,2015/12/16,3550.0,3534.174,3500.0,32100,3570.0,3500.0
321,2015/12/17,3640.0,3602.045,3580.0,48400,3650.0,3550.0
322,2015/12/18,3560.0,3597.685,3610.0,44500,3650.0,3550.0
323,2015/12/21,3530.0,3512.003,3540.0,63900,3550.0,3450.0
324,2015/12/22,3500.0,3510.0,3540.0,33100,3560.0,3500.0
325,2015/12/24,3470.0,3470.306,3520.0,35900,3520.0,3450.0
326,2015/12/25,3460.0,3448.689,3450.0,24400,3470.0,3430.0
327,2015/12/28,3500.0,3500.104,3490.0,19300,3520.0,3480.0
328,2015/12/29,3550.0,3546.402,3500.0,21400,3570.0,3500.0
329,2015/12/30,3550.0,3558.092,3550.0,28300,3590.0,3530.0
330,2016/01/04,3500.0,3535.282,3550.0,30100,3610.0,3490.0
331,2016/01/05,3520.0,3535.72,3500.0,27100,3570.0,3500.0
332,2016/01/06,3490.0,3493.75,3540.0,40000,3560.0,3450.0
333,2016/01/07,3430.0,3455.365,3490.0,27400,3530.0,3430.0
334,2016/01/08,3390.0,3423.078,3420.0,49700,3470.0,3390.0
335,2016/01/12,3290.0,3335.885,3360.0,41800,3410.0,3290.0
336,2016/01/13,3380.0,3374.371,3340.0,28600,3400.0,3340.0
337,2016/01/14,3350.0,3343.221,3350.0,71400,3390.0,3290.0
338,2016/01/15,3340.0,3352.02,3400.0,29700,3400.0,3310.0
339,2016/01/18,3290.0,3294.007,3300.0,28700,3320.0,3250.0
340,2016/01/19,3320.0,3312.768,3290.0,35400,3340.0,3290.0
341,2016/01/20,3180.0,3237.631,3280.0,51500,3310.0,3170.0
342,2016/01/21,3100.0,3173.416,3170.0,44200,3240.0,3100.0
343,2016/01/22,3250.0,3199.448,3160.0,34400,3250.0,3140.0
344,2016/01/25,3320.0,3320.859,3330.0,25600,3380.0,3280.0
345,2016/01/26,3250.0,3271.517,3300.0,17800,3300.0,3250.0
346,2016/01/27,3380.0,3324.378,3290.0,40200,3400.0,3280.0
347,2016/01/28,3340.0,3346.516,3370.0,39900,3390.0,3320.0
348,2016/01/29,3370.0,3342.155,3340.0,51500,3390.0,3260.0
349,2016/02/01,3390.0,3346.689,3340.0,60100,3390.0,3310.0
350,2016/02/02,3340.0,3355.015,3390.0,33500,3390.0,3330.0
351,2016/02/03,3280.0,3268.371,3320.0,35600,3320.0,3230.0
352,2016/02/04,3250.0,3263.724,3260.0,29000,3290.0,3230.0
353,2016/02/05,2980.0,3089.031,3230.0,110400,3250.0,2980.0
354,2016/02/08,3080.0,3043.501,2950.0,77700,3120.0,2940.0
355,2016/02/09,2980.0,2973.678,2990.0,80200,3020.0,2930.0
356,2016/02/10,2850.0,2879.903,2980.0,82500,2980.0,2810.0
357,2016/02/12,2660.0,2708.968,2710.0,97900,2760.0,2660.0
358,2016/02/15,2850.0,2826.685,2820.0,55800,2880.0,2770.0
359,2016/02/16,2800.0,2835.807,2840.0,57000,2880.0,2800.0
360,2016/02/17,2800.0,2812.021,2800.0,48000,2860.0,2780.0
361,2016/02/18,2850.0,2866.797,2870.0,58700,2890.0,2840.0
362,2016/02/19,2850.0,2857.064,2850.0,54500,2910.0,2830.0
363,2016/02/22,2860.0,2864.936,2850.0,54500,2900.0,2840.0
364,2016/02/23,2840.0,2884.12,2910.0,44900,2960.0,2840.0
365,2016/02/24,2870.0,2876.512,2850.0,51600,2910.0,2830.0
366,2016/02/25,2970.0,2950.789,2900.0,43100,2990.0,2900.0
367,2016/02/26,2970.0,2985.208,3000.0,38400,3020.0,2960.0
368,2016/02/29,2960.0,3000.764,3010.0,44500,3040.0,2960.0
369,2016/03/01,2980.0,2970.885,2990.0,52000,3000.0,2940.0
370,2016/03/02,3070.0,3061.268,3050.0,35500,3090.0,3040.0
371,2016/03/03,3080.0,3084.562,3070.0,44500,3120.0,3060.0
372,2016/03/04,3110.0,3095.719,3080.0,61200,3120.0,3060.0
373,2016/03/07,3160.0,3149.848,3130.0,46000,3180.0,3110.0
374,2016/03/08,3160.0,3139.845,3180.0,51500,3190.0,3080.0
375,2016/03/09,3120.0,3117.199,3140.0,35700,3150.0,3070.0
376,2016/03/10,3170.0,3180.665,3160.0,46600,3210.0,3160.0
377,2016/03/11,3260.0,3231.163,3170.0,139300,3290.0,3170.0
378,2016/03/14,3320.0,3307.445,3310.0,72400,3330.0,3280.0
379,2016/03/15,3380.0,3354.969,3330.0,96200,3410.0,3310.0
380,2016/03/16,3370.0,3385.525,3390.0,68600,3420.0,3360.0
381,2016/03/17,3390.0,3397.068,3410.0,74000,3440.0,3330.0
382,2016/03/18,3340.0,3350.517,3390.0,61900,3410.0,3320.0
383,2016/03/22,3350.0,3350.221,3390.0,76900,3410.0,3320.0
384,2016/03/23,3320.0,3310.258,3370.0,65800,3370.0,3260.0
385,2016/03/24,3310.0,3327.821,3310.0,53700,3370.0,3300.0
386,2016/03/25,3330.0,3304.915,3320.0,41300,3330.0,3270.0
387,2016/03/28,3370.0,3351.208,3370.0,53000,3370.0,3310.0
388,2016/03/29,3310.0,3311.137,3290.0,42200,3340.0,3290.0
389,2016/03/30,3260.0,3275.355,3300.0,39400,3310.0,3250.0
390,2016/03/31,3180.0,3204.193,3270.0,72500,3270.0,3170.0
391,2016/04/01,3110.0,3136.281,3230.0,69100,3230.0,3090.0
392,2016/04/04,3170.0,3151.08,3140.0,43500,3180.0,3110.0
393,2016/04/05,3060.0,3112.052,3160.0,65300,3160.0,3060.0
394,2016/04/06,3030.0,3028.068,3000.0,55900,3060.0,2990.0
395,2016/04/07,3040.0,3043.11,3020.0,29900,3070.0,3010.0
396,2016/04/08,3050.0,3041.691,2980.0,27800,3090.0,2980.0
397,2016/04/11,3040.0,3030.372,3040.0,32300,3060.0,2990.0
398,2016/04/12,3090.0,3087.088,3050.0,18200,3110.0,3050.0
399,2016/04/13,3160.0,3139.248,3090.0,31900,3180.0,3090.0
400,2016/04/14,3200.0,3194.943,3220.0,44100,3220.0,3150.0
401,2016/04/15,3200.0,3193.263,3170.0,33400,3220.0,3140.0
402,2016/04/18,3140.0,3137.306,3120.0,21900,3160.0,3100.0
403,2016/04/19,3210.0,3206.909,3220.0,16500,3220.0,3180.0
404,2016/04/20,3210.0,3223.587,3240.0,22300,3240.0,3190.0
405,2016/04/21,3240.0,3234.839,3240.0,21700,3250.0,3220.0
406,2016/04/22,3210.0,3189.532,3140.0,74800,3240.0,3110.0
407,2016/04/25,3120.0,3143.507,3210.0,49900,3210.0,3110.0
408,2016/04/26,3120.0,3116.227,3120.0,27300,3140.0,3100.0
409,2016/04/27,3140.0,3133.969,3130.0,19400,3150.0,3110.0
410,2016/04/28,3050.0,3126.143,3190.0,57300,3200.0,3050.0
411,2016/05/02,2930.0,2960.935,2980.0,35300,3010.0,2930.0
412,2016/05/06,2990.0,2966.227,2970.0,43200,2990.0,2950.0
413,2016/05/09,3010.0,3007.968,3010.0,37900,3050.0,2980.0
414,2016/05/10,3080.0,3056.495,3010.0,29100,3090.0,3010.0
415,2016/05/11,3090.0,3086.947,3120.0,38000,3120.0,3040.0
416,2016/05/12,3210.0,3174.382,3120.0,76900,3280.0,3080.0
417,2016/05/13,3160.0,3144.694,3200.0,49000,3200.0,3090.0
418,2016/05/16,3170.0,3173.553,3170.0,30400,3190.0,3130.0
419,2016/05/17,3210.0,3191.825,3180.0,26300,3210.0,3160.0
420,2016/05/18,3250.0,3238.466,3210.0,36500,3280.0,3190.0
421,2016/05/19,3220.0,3216.221,3270.0,26200,3270.0,3180.0
422,2016/05/20,3280.0,3263.032,3220.0,43200,3290.0,3200.0
423,2016/05/23,3270.0,3261.049,3290.0,26700,3290.0,3220.0
424,2016/05/24,3260.0,3265.868,3270.0,31700,3290.0,3240.0
425,2016/05/25,3290.0,3277.704,3280.0,19600,3290.0,3260.0
426,2016/05/26,3310.0,3299.159,3310.0,22600,3310.0,3280.0
427,2016/05/27,3300.0,3304.672,3320.0,24400,3320.0,3290.0
428,2016/05/30,3310.0,3304.022,3300.0,18400,3320.0,3290.0
429,2016/05/31,3240.0,3235.728,3280.0,52200,3280.0,3210.0
430,2016/06/01,3160.0,3177.358,3200.0,37100,3220.0,3140.0
431,2016/06/02,3120.0,3132.028,3150.0,36000,3180.0,3110.0
432,2016/06/03,3150.0,3136.957,3120.0,27600,3160.0,3120.0
433,2016/06/06,3100.0,3077.275,3100.0,37800,3130.0,3040.0
434,2016/06/07,3110.0,3111.651,3100.0,21200,3130.0,3090.0
435,2016/06/08,3140.0,3131.895,3140.0,24800,3150.0,3100.0
436,2016/06/09,3130.0,3123.458,3140.0,32100,3140.0,3100.0
437,2016/06/10,3090.0,3091.575,3100.0,40000,3120.0,3070.0
438,2016/06/13,2960.0,2982.166,3060.0,49400,3060.0,2940.0
439,2016/06/14,2940.0,2951.987,2960.0,29700,3000.0,2930.0
440,2016/06/15,2940.0,2943.9,2920.0,34100,2980.0,2920.0
441,2016/06/16,2810.0,2853.759,2900.0,57200,2920.0,2810.0
442,2016/06/17,2720.0,2773.327,2820.0,105800,2860.0,2720.0
443,2016/06/20,2880.0,2873.655,2840.0,67300,2920.0,2820.0
444,2016/06/21,2950.0,2913.907,2860.0,40700,2970.0,2830.0
445,2016/06/22,2870.0,2873.618,2910.0,35100,2920.0,2850.0
446,2016/06/23,2890.0,2886.873,2850.0,40300,2920.0,2850.0
447,2016/06/24,2700.0,2765.183,2890.0,79100,2900.0,2660.0
448,2016/06/27,2800.0,2789.947,2750.0,37600,2820.0,2750.0
449,2016/06/28,2860.0,2851.867,2880.0,45000,2880.0,2790.0
450,2016/06/29,2890.0,2886.806,2860.0,31000,2910.0,2850.0
451,2016/06/30,2860.0,2877.279,2920.0,45200,2930.0,2850.0
452,2016/07/01,2920.0,2907.423,2870.0,26000,2930.0,2860.0
453,2016/07/04,2900.0,2895.188,2920.0,29300,2920.0,2880.0
454,2016/07/05,2900.0,2888.507,2880.0,20100,2910.0,2870.0
455,2016/07/06,2850.0,2836.851,2870.0,30800,2880.0,2800.0
456,2016/07/07,2830.0,2859.972,2900.0,35900,2900.0,2810.0
457,2016/07/08,2720.0,2755.085,2830.0,47000,2840.0,2710.0
458,2016/07/11,2870.0,2846.047,2770.0,33900,2880.0,2750.0
459,2016/07/12,2900.0,2908.54,2870.0,40400,2950.0,2870.0
460,2016/07/13,2890.0,2902.66,2940.0,40600,2940.0,2880.0
461,2016/07/14,2930.0,2923.462,2910.0,33800,2940.0,2890.0
462,2016/07/15,2890.0,2910.157,2950.0,44500,2950.0,2880.0
463,2016/07/19,2950.0,2933.897,2930.0,19500,2950.0,2920.0
464,2016/07/20,2960.0,2948.063,2950.0,22200,2970.0,2920.0
465,2016/07/21,3010.0,2998.736,2990.0,27700,3010.0,2980.0
466,2016/07/22,2950.0,2959.373,2980.0,25500,2980.0,2940.0
467,2016/07/25,2980.0,2981.765,2970.0,20400,3000.0,2960.0
468,2016/07/26,2930.0,2953.626,2960.0,34200,2990.0,2930.0
469,2016/07/27,2920.0,2929.353,2960.0,43300,2960.0,2890.0
470,2016/07/28,2960.0,2934.397,2920.0,30700,2960.0,2900.0
471,2016/07/29,2960.0,2945.168,2960.0,14900,2970.0,2920.0
472,2016/08/01,2890.0,2881.577,2920.0,24100,2920.0,2860.0
473,2016/08/02,2890.0,2885.858,2880.0,23900,2900.0,2860.0
474,2016/08/03,2820.0,2845.441,2860.0,27200,2880.0,2810.0
475,2016/08/04,3020.0,2944.31,2900.0,88400,3040.0,2840.0
476,2016/08/05,3010.0,3024.788,3040.0,33000,3040.0,3010.0
477,2016/08/08,3060.0,3058.922,3050.0,30600,3080.0,3040.0
478,2016/08/09,3050.0,3041.639,3060.0,18300,3060.0,3030.0
479,2016/08/10,3040.0,3036.64,3030.0,12500,3050.0,3020.0
480,2016/08/12,3050.0,3055.907,3060.0,21500,3070.0,3040.0
481,2016/08/15,3040.0,3040.526,3050.0,13300,3060.0,3030.0
482,2016/08/16,3020.0,3045.147,3030.0,44300,3070.0,3020.0
483,2016/08/17,3030.0,3015.242,3000.0,41400,3050.0,2980.0
484,2016/08/18,2960.0,2977.861,3010.0,17300,3020.0,2950.0
485,2016/08/19,2960.0,2956.715,2960.0,27400,2970.0,2940.0
486,2016/08/22,3070.0,3031.164,2990.0,31800,3080.0,2950.0
487,2016/08/23,3020.0,3039.656,3060.0,26200,3080.0,3010.0
488,2016/08/24,3060.0,3071.955,3060.0,26600,3090.0,3050.0
489,2016/08/25,3040.0,3050.526,3050.0,11400,3070.0,3030.0
490,2016/08/26,3100.0,3078.478,3050.0,41400,3110.0,3030.0
491,2016/08/29,3130.0,3121.939,3150.0,19600,3150.0,3100.0
492,2016/08/30,3130.0,3121.806,3130.0,14400,3130.0,3110.0
493,2016/08/31,3050.0,3061.929,3150.0,45100,3150.0,3030.0
494,2016/09/01,3030.0,3014.482,3040.0,32800,3040.0,3000.0
495,2016/09/02,3040.0,3026.379,3020.0,23200,3040.0,3010.0
496,2016/09/05,3060.0,3065.444,3070.0,25900,3090.0,3040.0
497,2016/09/06,3080.0,3071.644,3060.0,14600,3080.0,3050.0
498,2016/09/07,3140.0,3118.653,3080.0,33400,3140.0,3080.0
499,2016/09/08,3140.0,3133.35,3150.0,20300,3150.0,3110.0
500,2016/09/09,3140.0,3145.739,3160.0,29100,3160.0,3120.0
501,2016/09/12,3140.0,3114.84,3090.0,25000,3140.0,3070.0
502,2016/09/13,3150.0,3136.477,3130.0,17600,3160.0,3120.0
503,2016/09/14,3140.0,3124.057,3110.0,17500,3140.0,3110.0
504,2016/09/15,3110.0,3105.084,3120.0,29700,3120.0,3090.0
505,2016/09/16,3120.0,3120.639,3110.0,31300,3140.0,3100.0
506,2016/09/20,3130.0,3125.875,3120.0,48000,3150.0,3100.0
507,2016/09/21,3270.0,3197.514,3100.0,71200,3300.0,3100.0
508,2016/09/23,3270.0,3254.192,3250.0,45800,3290.0,3210.0
509,2016/09/26,3200.0,3229.439,3270.0,60600,3270.0,3200.0
510,2016/09/27,3280.0,3214.172,3180.0,88200,3290.0,3180.0
511,2016/09/28,3370.0,3327.165,3250.0,79000,3400.0,3250.0
512,2016/09/29,3350.0,3353.81,3350.0,35700,3380.0,3320.0
513,2016/09/30,3250.0,3255.84,3270.0,39900,3280.0,3230.0
514,2016/10/03,3350.0,3330.36,3290.0,61100,3360.0,3270.0
515,2016/10/04,3290.0,3302.1,3320.0,30000,3340.0,3270.0
516,2016/10/05,3250.0,3268.086,3290.0,32400,3300.0,3250.0
517,2016/10/06,3230.0,3235.251,3260.0,35800,3260.0,3220.0
518,2016/10/07,3250.0,3244.083,3230.0,50700,3270.0,3220.0
519,2016/10/11,3270.0,3276.179,3250.0,33500,3300.0,3250.0
520,2016/10/12,3280.0,3283.882,3240.0,25500,3300.0,3240.0
521,2016/10/13,3320.0,3286.018,3290.0,44700,3320.0,3240.0
522,2016/10/14,3270.0,3259.618,3280.0,52400,3300.0,3220.0
523,2016/10/17,3270.0,3266.031,3260.0,19400,3280.0,3250.0
524,2016/10/18,3250.0,3249.105,3250.0,32400,3270.0,3240.0
525,2016/10/19,3270.0,3262.427,3250.0,51100,3290.0,3250.0
526,2016/10/20,3270.0,3261.077,3270.0,39000,3280.0,3240.0
527,2016/10/21,3370.0,3346.01,3270.0,77700,3400.0,3260.0
528,2016/10/24,3380.0,3365.547,3380.0,24700,3380.0,3340.0
529,2016/10/25,3380.0,3411.317,3390.0,65300,3450.0,3370.0
530,2016/10/26,3480.0,3450.951,3360.0,67300,3500.0,3340.0
531,2016/10/27,3500.0,3488.477,3460.0,30200,3500.0,3460.0
532,2016/10/28,3490.0,3477.339,3500.0,154800,3510.0,3440.0
533,2016/10/31,3530.0,3523.807,3460.0,61200,3550.0,3460.0
534,2016/11/01,3490.0,3492.089,3500.0,47400,3510.0,3470.0
535,2016/11/02,3450.0,3444.729,3450.0,60900,3480.0,3430.0
536,2016/11/04,3580.0,3537.07,3410.0,149500,3600.0,3380.0
537,2016/11/07,3690.0,3659.778,3600.0,94500,3710.0,3590.0
538,2016/11/08,3700.0,3695.584,3670.0,82200,3720.0,3670.0
539,2016/11/09,3550.0,3606.414,3700.0,76400,3720.0,3520.0
540,2016/11/10,3700.0,3698.12,3730.0,50000,3730.0,3670.0
541,2016/11/11,3590.0,3628.324,3700.0,53100,3720.0,3570.0
542,2016/11/14,3660.0,3656.547,3620.0,50100,3700.0,3610.0
543,2016/11/15,3590.0,3601.396,3660.0,56600,3670.0,3550.0
544,2016/11/16,3620.0,3603.601,3600.0,59700,3630.0,3580.0
545,2016/11/17,3580.0,3574.283,3560.0,57900,3620.0,3540.0
546,2016/11/18,3650.0,3639.935,3620.0,46400,3680.0,3600.0
547,2016/11/21,3670.0,3676.9,3680.0,37100,3700.0,3660.0
548,2016/11/22,3700.0,3688.446,3680.0,38600,3710.0,3650.0
549,2016/11/24,3620.0,3629.966,3700.0,59400,3700.0,3600.0
550,2016/11/25,3800.0,3749.691,3630.0,142400,3810.0,3630.0
551,2016/11/28,3820.0,3802.607,3820.0,65600,3830.0,3760.0
552,2016/11/29,3780.0,3763.264,3820.0,57900,3820.0,3730.0
553,2016/11/30,3780.0,3763.92,3760.0,59700,3780.0,3740.0
554,2016/12/01,3740.0,3766.787,3790.0,86200,3820.0,3720.0
555,2016/12/02,3730.0,3725.666,3750.0,59300,3770.0,3700.0
556,2016/12/05,3700.0,3690.847,3700.0,42500,3720.0,3670.0
557,2016/12/06,3630.0,3634.224,3720.0,99200,3730.0,3590.0
558,2016/12/07,3660.0,3653.295,3660.0,34600,3670.0,3620.0
559,2016/12/08,3790.0,3734.563,3680.0,64000,3790.0,3670.0
560,2016/12/09,3820.0,3790.385,3770.0,72700,3820.0,3750.0
561,2016/12/12,3770.0,3791.429,3850.0,46200,3850.0,3740.0
562,2016/12/13,3810.0,3777.207,3710.0,40100,3810.0,3700.0
563,2016/12/14,3760.0,3751.593,3810.0,38300,3810.0,3720.0
564,2016/12/15,3770.0,3752.136,3780.0,44000,3780.0,3720.0
565,2016/12/16,3780.0,3781.468,3790.0,43600,3800.0,3760.0
566,2016/12/19,3770.0,3757.232,3790.0,33600,3790.0,3730.0
567,2016/12/20,3780.0,3758.076,3770.0,42100,3780.0,3720.0
568,2016/12/21,3720.0,3728.309,3770.0,34900,3770.0,3700.0
569,2016/12/22,3700.0,3700.595,3710.0,42000,3720.0,3680.0
570,2016/12/26,3800.0,3782.697,3750.0,102700,3810.0,3740.0
571,2016/12/27,3820.0,3810.911,3810.0,81200,3830.0,3770.0
572,2016/12/28,3870.0,3846.511,3820.0,51300,3880.0,3820.0
573,2016/12/29,3880.0,3881.966,3880.0,64600,3900.0,3860.0
574,2016/12/30,3890.0,3877.663,3850.0,41500,3900.0,3850.0
575,2017/01/04,4000.0,3972.887,3910.0,90400,4000.0,3910.0
576,2017/01/05,4030.0,4017.915,4000.0,61400,4050.0,3990.0
577,2017/01/06,4080.0,4065.855,4030.0,78400,4090.0,4010.0
578,2017/01/10,4070.0,4039.562,4080.0,70700,4080.0,4000.0
579,2017/01/11,4040.0,4083.202,4070.0,119600,4120.0,4040.0
580,2017/01/12,3950.0,3957.818,4000.0,72400,4000.0,3920.0
581,2017/01/13,3930.0,3923.152,3900.0,58700,3960.0,3900.0
582,2017/01/16,3920.0,3928.68,3900.0,55300,3950.0,3900.0
583,2017/01/17,3810.0,3837.668,3880.0,72900,3890.0,3810.0
584,2017/01/18,3790.0,3777.176,3810.0,68700,3820.0,3760.0
585,2017/01/19,3860.0,3860.046,3810.0,65300,3890.0,3810.0
586,2017/01/20,3790.0,3803.536,3840.0,59100,3840.0,3780.0
587,2017/01/23,3750.0,3744.247,3760.0,48500,3760.0,3720.0
588,2017/01/24,3770.0,3758.721,3740.0,64100,3780.0,3710.0
589,2017/01/25,3830.0,3803.781,3780.0,64800,3830.0,3760.0
590,2017/01/26,3840.0,3852.167,3870.0,72000,3890.0,3820.0
591,2017/01/27,3880.0,3890.018,3880.0,56600,3920.0,3840.0
592,2017/01/30,3890.0,3877.729,3880.0,43600,3900.0,3830.0
593,2017/01/31,3890.0,3884.174,3880.0,44800,3910.0,3860.0
594,2017/02/01,3920.0,3888.587,3880.0,36100,3930.0,3850.0
595,2017/02/02,3870.0,3910.99,3940.0,58600,3960.0,3850.0
596,2017/02/03,3910.0,3906.0,3840.0,37500,3930.0,3840.0
597,2017/02/06,4090.0,4058.783,4000.0,138000,4140.0,3950.0
598,2017/02/07,4170.0,4153.243,4070.0,161600,4220.0,4040.0
599,2017/02/08,4250.0,4207.208,4170.0,84900,4260.0,4120.0
600,2017/02/09,4300.0,4320.894,4330.0,177800,4420.0,4260.0
601,2017/02/10,4290.0,4311.646,4350.0,105700,4380.0,4260.0
602,2017/02/13,4300.0,4311.193,4320.0,83800,4350.0,4290.0
603,2017/02/14,4240.0,4270.128,4290.0,85800,4330.0,4220.0
604,2017/02/15,4260.0,4245.244,4240.0,75700,4270.0,4230.0
605,2017/02/16,4270.0,4243.691,4230.0,51200,4280.0,4210.0
606,2017/02/17,4210.0,4204.472,4230.0,56800,4230.0,4180.0
607,2017/02/20,4220.0,4219.098,4220.0,37700,4240.0,4190.0
608,2017/02/21,4200.0,4192.984,4200.0,37200,4210.0,4160.0
609,2017/02/22,4230.0,4215.233,4220.0,38600,4230.0,4180.0
610,2017/02/23,4230.0,4220.777,4230.0,75900,4240.0,4200.0
611,2017/02/24,4200.0,4200.151,4200.0,52900,4230.0,4180.0
612,2017/02/27,4130.0,4124.803,4160.0,91200,4160.0,4090.0
613,2017/02/28,4130.0,4151.492,4140.0,54300,4190.0,4120.0
614,2017/03/01,4270.0,4246.314,4170.0,110700,4300.0,4150.0
615,2017/03/02,4230.0,4242.274,4300.0,55400,4310.0,4210.0
616,2017/03/03,4230.0,4228.139,4230.0,48900,4260.0,4200.0
617,2017/03/06,4210.0,4220.078,4210.0,25500,4230.0,4210.0
618,2017/03/07,4240.0,4226.247,4200.0,38900,4250.0,4200.0
619,2017/03/08,4270.0,4248.005,4230.0,38100,4270.0,4210.0
620,2017/03/09,4350.0,4335.104,4300.0,81500,4360.0,4270.0
621,2017/03/10,4350.0,4380.09,4400.0,78000,4410.0,4350.0
622,2017/03/13,4380.0,4401.003,4330.0,101700,4470.0,4320.0
623,2017/03/14,4400.0,4410.72,4390.0,47200,4430.0,4390.0
624,2017/03/15,4380.0,4392.271,4400.0,36100,4410.0,4380.0
625,2017/03/16,4470.0,4438.166,4380.0,61600,4470.0,4370.0
626,2017/03/17,4440.0,4442.167,4470.0,64600,4470.0,4410.0
627,2017/03/21,4450.0,4452.323,4450.0,55100,4490.0,4420.0
628,2017/03/22,4370.0,4381.214,4400.0,51900,4420.0,4360.0
629,2017/03/23,4360.0,4362.14,4360.0,52800,4400.0,4340.0
630,2017/03/24,4440.0,4399.269,4380.0,91700,4460.0,4340.0
631,2017/03/27,4400.0,4405.086,4410.0,46400,4420.0,4380.0
632,2017/03/28,4650.0,4601.282,4480.0,181700,4660.0,4480.0
633,2017/03/29,4640.0,4620.092,4620.0,87000,4640.0,4560.0
634,2017/03/30,4580.0,4617.29,4640.0,67900,4660.0,4570.0
635,2017/03/31,4550.0,4604.147,4600.0,84400,4650.0,4550.0
636,2017/04/03,4540.0,4538.496,4530.0,79800,4580.0,4490.0
637,2017/04/04,4440.0,4457.206,4500.0,106300,4520.0,4420.0
638,2017/04/05,4560.0,4552.347,4490.0,150800,4590.0,4490.0
639,2017/04/06,4440.0,4492.395,4570.0,66400,4580.0,4440.0
640,2017/04/07,4490.0,4486.076,4480.0,73900,4510.0,4450.0
641,2017/04/10,4530.0,4527.376,4550.0,62500,4560.0,4500.0
642,2017/04/11,4530.0,4525.993,4530.0,55900,4540.0,4500.0
643,2017/04/12,4470.0,4450.907,4480.0,73900,4500.0,4420.0
644,2017/04/13,4390.0,4388.337,4400.0,93200,4410.0,4370.0
645,2017/04/14,4320.0,4317.65,4310.0,91500,4350.0,4300.0
646,2017/04/17,4310.0,4291.967,4250.0,73200,4320.0,4250.0
647,2017/04/18,4390.0,4373.397,4350.0,83300,4400.0,4350.0
648,2017/04/19,4360.0,4359.387,4340.0,78300,4380.0,4330.0
649,2017/04/20,4350.0,4354.864,4350.0,62700,4380.0,4340.0
650,2017/04/21,4370.0,4368.316,4380.0,47500,4380.0,4350.0
651,2017/04/24,4440.0,4421.975,4390.0,70900,4450.0,4390.0
652,2017/04/25,4450.0,4436.733,4400.0,80200,4480.0,4400.0
653,2017/04/26,4510.0,4485.946,4450.0,81900,4510.0,4440.0
654,2017/04/27,4500.0,4499.875,4510.0,64100,4520.0,4480.0
655,2017/04/28,4510.0,4494.09,4500.0,66500,4510.0,4480.0
656,2017/05/01,4560.0,4544.303,4510.0,49500,4560.0,4510.0
657,2017/05/02,4570.0,4585.872,4580.0,64200,4600.0,4570.0
658,2017/05/08,4700.0,4657.007,4600.0,89200,4700.0,4570.0
659,2017/05/09,4660.0,4668.597,4700.0,66300,4700.0,4650.0
660,2017/05/10,4650.0,4639.361,4630.0,78200,4670.0,4610.0
661,2017/05/11,4680.0,4674.308,4650.0,52000,4690.0,4650.0
662,2017/05/12,4670.0,4658.844,4660.0,44100,4680.0,4630.0
663,2017/05/15,4210.0,4239.776,4380.0,499600,4390.0,4190.0
664,2017/05/16,4100.0,4123.647,4200.0,309300,4200.0,4080.0
665,2017/05/17,3970.0,4005.445,4050.0,225900,4070.0,3960.0
666,2017/05/18,3950.0,3920.319,3920.0,153500,3970.0,3860.0
667,2017/05/19,3960.0,3947.286,3990.0,119000,3990.0,3910.0
668,2017/05/22,3960.0,3941.909,3980.0,123100,3980.0,3920.0
669,2017/05/23,3950.0,3939.764,3940.0,131400,3960.0,3920.0
670,2017/05/24,3970.0,3965.108,3980.0,88100,3980.0,3940.0
671,2017/05/25,4030.0,4043.318,4000.0,175400,4080.0,4000.0
672,2017/05/26,4020.0,4014.631,4050.0,100200,4060.0,3990.0
673,2017/05/29,3940.0,3963.629,4000.0,101400,4020.0,3930.0
674,2017/05/30,3960.0,3948.3,3920.0,110000,3970.0,3900.0
675,2017/05/31,3940.0,3952.678,3980.0,36600,3980.0,3940.0
676,2017/06/01,3900.0,3896.62,3920.0,221000,3930.0,3880.0
677,2017/06/02,3960.0,3955.16,3930.0,97100,3980.0,3920.0
678,2017/06/05,3900.0,3908.671,3940.0,168600,3950.0,3890.0
679,2017/06/06,3840.0,3844.035,3900.0,187600,3900.0,3820.0
680,2017/06/07,3900.0,3879.024,3870.0,117800,3900.0,3850.0
681,2017/06/08,3870.0,3881.099,3900.0,85500,3900.0,3850.0
682,2017/06/09,3810.0,3829.748,3840.0,103000,3850.0,3810.0
683,2017/06/12,3830.0,3827.634,3830.0,104800,3860.0,3800.0
684,2017/06/13,3790.0,3806.92,3820.0,76300,3830.0,3790.0
685,2017/06/14,3840.0,3852.136,3810.0,132500,3870.0,3810.0
686,2017/06/15,3900.0,3905.994,3870.0,125800,3930.0,3870.0
687,2017/06/16,3950.0,3939.418,3930.0,111700,3960.0,3910.0
688,2017/06/19,3960.0,3951.244,3930.0,58700,3970.0,3920.0
689,2017/06/20,3940.0,3949.771,3990.0,91800,3990.0,3930.0
690,2017/06/21,3970.0,3978.499,3970.0,98600,4000.0,3950.0
691,2017/06/22,4040.0,4015.297,4000.0,70600,4040.0,3980.0
692,2017/06/23,4070.0,4059.218,4060.0,81800,4070.0,4040.0
693,2017/06/26,4110.0,4104.753,4100.0,111300,4120.0,4080.0
694,2017/06/27,4060.0,4083.763,4130.0,107900,4130.0,4040.0
695,2017/06/28,4170.0,4156.015,4110.0,204500,4200.0,4090.0
696,2017/06/29,4090.0,4097.915,4130.0,75300,4150.0,4080.0
697,2017/06/30,4030.0,4017.495,4060.0,102600,4060.0,4000.0
698,2017/07/03,4040.0,4052.022,4050.0,46000,4080.0,4030.0
699,2017/07/04,3990.0,4000.079,4060.0,88400,4060.0,3970.0
700,2017/07/05,4030.0,4003.805,4000.0,70700,4030.0,3980.0
701,2017/07/06,4050.0,4039.048,4030.0,63000,4060.0,4000.0
702,2017/07/07,4030.0,4028.232,4030.0,62200,4060.0,4010.0
703,2017/07/10,4050.0,4046.563,4050.0,57900,4060.0,4020.0
704,2017/07/11,4130.0,4107.328,4050.0,74100,4130.0,4050.0
705,2017/07/12,4080.0,4091.404,4130.0,41300,4130.0,4070.0
706,2017/07/13,4060.0,4052.595,4080.0,55100,4080.0,4030.0
707,2017/07/14,4100.0,4096.829,4080.0,32800,4120.0,4070.0
708,2017/07/18,4070.0,4047.742,4040.0,58900,4080.0,4010.0
709,2017/07/19,4120.0,4108.926,4080.0,51200,4130.0,4070.0
710,2017/07/20,4170.0,4146.183,4120.0,50300,4170.0,4100.0
711,2017/07/21,4220.0,4207.515,4160.0,118700,4230.0,4160.0
712,2017/07/24,4300.0,4270.482,4230.0,109900,4310.0,4190.0
713,2017/07/25,4310.0,4305.771,4320.0,98600,4330.0,4270.0
714,2017/07/26,4320.0,4319.709,4330.0,82500,4340.0,4290.0
715,2017/07/27,4260.0,4283.664,4320.0,74500,4320.0,4250.0
716,2017/07/28,4240.0,4242.485,4260.0,50300,4270.0,4220.0
717,2017/07/31,4260.0,4257.813,4210.0,48000,4290.0,4210.0
718,2017/08/01,4260.0,4262.441,4260.0,29500,4300.0,4240.0
719,2017/08/02,4280.0,4241.703,4230.0,83400,4290.0,4160.0
720,2017/08/03,4360.0,4329.376,4300.0,86500,4360.0,4280.0
721,2017/08/04,4870.0,4803.268,4600.0,613900,4940.0,4600.0
722,2017/08/07,4810.0,4809.926,4800.0,161800,4860.0,4760.0
723,2017/08/08,4780.0,4765.481,4770.0,101800,4790.0,4730.0
724,2017/08/09,4690.0,4669.896,4730.0,134500,4730.0,4620.0
725,2017/08/10,4640.0,4658.161,4640.0,89200,4700.0,4630.0
726,2017/08/14,4530.0,4532.161,4550.0,70800,4570.0,4500.0
727,2017/08/15,4520.0,4541.433,4560.0,69800,4570.0,4520.0
728,2017/08/16,4500.0,4500.877,4510.0,88900,4540.0,4450.0
729,2017/08/17,4550.0,4528.824,4530.0,76500,4560.0,4500.0
730,2017/08/18,4530.0,4511.333,4500.0,57000,4530.0,4480.0
731,2017/08/21,4580.0,4557.566,4540.0,56700,4590.0,4510.0
732,2017/08/22,4590.0,4586.488,4580.0,43000,4600.0,4570.0
733,2017/08/23,4580.0,4585.293,4630.0,58000,4650.0,4560.0
734,2017/08/24,4580.0,4578.445,4550.0,41800,4600.0,4540.0
735,2017/08/25,4630.0,4623.023,4610.0,47300,4650.0,4560.0
736,2017/08/28,4630.0,4640.567,4650.0,33500,4660.0,4620.0
737,2017/08/29,4650.0,4643.065,4620.0,39800,4670.0,4610.0
738,2017/08/30,4850.0,4805.111,4720.0,157500,4850.0,4710.0
739,2017/08/31,4910.0,4920.86,4860.0,167500,5010.0,4840.0
740,2017/09/01,5020.0,4983.078,4960.0,125400,5040.0,4910.0
741,2017/09/04,4900.0,4912.725,5030.0,98700,5030.0,4800.0
742,2017/09/05,4950.0,4960.501,4900.0,111700,5010.0,4890.0
743,2017/09/06,4910.0,4875.452,4860.0,67500,4920.0,4800.0
744,2017/09/07,5020.0,5009.614,4940.0,75100,5050.0,4940.0
745,2017/09/08,4980.0,4990.518,4980.0,59900,5020.0,4950.0
746,2017/09/11,5060.0,5056.228,5000.0,84300,5110.0,5000.0
747,2017/09/12,5070.0,5100.494,5110.0,70800,5140.0,5070.0
748,2017/09/13,5140.0,5140.689,5100.0,84200,5190.0,5080.0
749,2017/09/14,5190.0,5232.619,5250.0,155400,5370.0,5170.0
750,2017/09/15,5220.0,5204.247,5180.0,106900,5230.0,5170.0
751,2017/09/19,5350.0,5322.862,5240.0,113200,5380.0,5220.0
752,2017/09/20,5150.0,5168.434,5300.0,127700,5310.0,5080.0
753,2017/09/21,5020.0,5057.374,5120.0,135200,5140.0,5020.0
754,2017/09/22,4970.0,4992.188,5020.0,89600,5040.0,4960.0
755,2017/09/25,5020.0,5004.731,4970.0,85400,5040.0,4960.0
756,2017/09/26,5060.0,5052.177,5030.0,105200,5080.0,5010.0
757,2017/09/27,5110.0,5092.254,5150.0,86500,5150.0,5020.0
758,2017/09/28,5180.0,5158.457,5120.0,83600,5190.0,5080.0
759,2017/09/29,5140.0,5128.065,5160.0,89400,5170.0,5100.0
760,2017/10/02,5170.0,5184.263,5160.0,80000,5240.0,5150.0
761,2017/10/03,5170.0,5160.854,5200.0,60900,5200.0,5130.0
762,2017/10/04,5200.0,5172.071,5170.0,56000,5200.0,5140.0
763,2017/10/05,5180.0,5180.502,5180.0,43800,5200.0,5150.0
764,2017/10/06,5050.0,5090.752,5180.0,81100,5190.0,5040.0
765,2017/10/10,5100.0,5098.299,5060.0,48200,5110.0,5050.0
766,2017/10/11,5100.0,5090.166,5110.0,42100,5110.0,5050.0
767,2017/10/12,5090.0,5099.363,5100.0,37700,5120.0,5070.0
768,2017/10/13,5060.0,5060.766,5060.0,49600,5080.0,5030.0
769,2017/10/16,5170.0,5146.52,5060.0,116100,5180.0,5040.0
770,2017/10/17,5270.0,5240.405,5180.0,131000,5290.0,5160.0
771,2017/10/18,5310.0,5298.098,5270.0,123000,5340.0,5230.0
772,2017/10/19,5340.0,5321.52,5280.0,100000,5380.0,5250.0
773,2017/10/20,5250.0,5265.413,5320.0,73900,5320.0,5240.0
774,2017/10/23,5250.0,5255.122,5260.0,36900,5290.0,5230.0
775,2017/10/24,5230.0,5235.088,5220.0,45400,5260.0,5220.0
776,2017/10/25,5200.0,5216.279,5220.0,55900,5260.0,5180.0
777,2017/10/26,5180.0,5181.552,5160.0,68300,5220.0,5150.0
778,2017/10/27,5210.0,5203.376,5200.0,47100,5220.0,5180.0
779,2017/10/30,5180.0,5178.453,5200.0,61400,5210.0,5150.0
780,2017/10/31,5150.0,5157.954,5180.0,43000,5190.0,5140.0
781,2017/11/01,5120.0,5138.328,5200.0,86100,5200.0,5100.0
782,2017/11/02,5180.0,5178.723,5140.0,78300,5220.0,5110.0
783,2017/11/06,5620.0,5663.1,5680.0,282300,5820.0,5560.0
784,2017/11/07,5300.0,5390.0,5440.0,177300,5520.0,5300.0
785,2017/11/08,5080.0,5120.96,5230.0,284500,5240.0,5050.0
786,2017/11/09,5140.0,5173.842,5130.0,153300,5270.0,5090.0
787,2017/11/10,5220.0,5198.146,5100.0,133200,5250.0,5100.0
788,2017/11/13,5160.0,5164.112,5220.0,42800,5220.0,5130.0
789,2017/11/14,5090.0,5098.217,5160.0,65600,5160.0,5070.0
790,2017/11/15,5050.0,5070.726,5060.0,81300,5120.0,5020.0
791,2017/11/16,5160.0,5135.363,5000.0,59300,5200.0,5000.0
792,2017/11/17,5170.0,5178.808,5230.0,64600,5240.0,5140.0
793,2017/11/20,5300.0,5269.807,5150.0,77800,5330.0,5150.0
794,2017/11/21,5310.0,5315.433,5300.0,25400,5340.0,5280.0
795,2017/11/22,5430.0,5389.909,5330.0,66200,5430.0,5320.0
796,2017/11/24,5460.0,5457.656,5390.0,61000,5490.0,5380.0
797,2017/11/27,5510.0,5504.465,5480.0,65400,5540.0,5450.0
798,2017/11/28,5610.0,5583.206,5510.0,73000,5650.0,5460.0
799,2017/11/29,5770.0,5729.173,5570.0,129300,5830.0,5520.0
800,2017/11/30,5880.0,5822.456,5770.0,130300,5880.0,5700.0
801,2017/12/01,5870.0,5864.924,5900.0,52800,5900.0,5820.0
802,2017/12/04,5660.0,5743.963,5880.0,82000,5880.0,5660.0
803,2017/12/05,5700.0,5676.841,5670.0,51600,5720.0,5610.0
804,2017/12/06,5670.0,5698.339,5720.0,62000,5780.0,5650.0
805,2017/12/07,5710.0,5709.017,5690.0,40700,5750.0,5680.0
806,2017/12/08,5930.0,5831.584,5660.0,138300,5950.0,5640.0
807,2017/12/11,5790.0,5816.056,5940.0,60600,5940.0,5740.0
808,2017/12/12,5850.0,5823.853,5860.0,54500,5860.0,5770.0
809,2017/12/13,5810.0,5806.896,5840.0,36400,5860.0,5770.0
810,2017/12/14,5890.0,5868.737,5820.0,57800,5910.0,5800.0
811,2017/12/15,5850.0,5850.355,5840.0,59100,5900.0,5810.0
812,2017/12/18,5900.0,5906.064,5890.0,59200,5970.0,5860.0
813,2017/12/19,5930.0,5942.116,5870.0,96900,6000.0,5840.0
814,2017/12/20,6190.0,6135.36,5950.0,163800,6280.0,5940.0
815,2017/12/21,6200.0,6149.557,6100.0,76800,6250.0,6020.0
816,2017/12/22,6170.0,6157.109,6160.0,72300,6210.0,6110.0
817,2017/12/25,6300.0,6303.272,6260.0,135700,6390.0,6210.0
818,2017/12/26,6460.0,6467.028,6400.0,174600,6580.0,6400.0
819,2017/12/27,6480.0,6467.018,6480.0,43600,6560.0,6400.0
820,2017/12/28,6520.0,6498.587,6440.0,94800,6550.0,6400.0
821,2017/12/29,6450.0,6481.175,6540.0,31500,6580.0,6430.0
822,2018/01/04,6570.0,6523.585,6400.0,91500,6600.0,6400.0
823,2018/01/05,6640.0,6636.545,6590.0,103900,6700.0,6480.0
824,2018/01/09,6650.0,6618.156,6540.0,67800,6660.0,6540.0
825,2018/01/10,6740.0,6725.772,6590.0,98400,6790.0,6590.0
826,2018/01/11,6800.0,6768.642,6700.0,72900,6820.0,6700.0
827,2018/01/12,6750.0,6770.257,6800.0,66200,6840.0,6730.0
828,2018/01/15,6670.0,6695.469,6750.0,49000,6770.0,6660.0
829,2018/01/16,6690.0,6681.213,6660.0,84900,6730.0,6600.0
830,2018/01/17,6660.0,6670.917,6690.0,44700,6730.0,6640.0
831,2018/01/18,6610.0,6614.749,6650.0,117300,6670.0,6550.0
832,2018/01/19,6780.0,6692.794,6590.0,114900,6780.0,6550.0
833,2018/01/22,6740.0,6718.213,6780.0,61000,6780.0,6660.0
834,2018/01/23,6730.0,6751.046,6750.0,66000,6790.0,6680.0
835,2018/01/24,6590.0,6627.688,6700.0,54500,6700.0,6580.0
836,2018/01/25,6620.0,6559.286,6540.0,123300,6650.0,6460.0
837,2018/01/26,6560.0,6563.715,6580.0,49800,6620.0,6530.0
838,2018/01/29,6580.0,6582.909,6540.0,44000,6630.0,6520.0
839,2018/01/30,6410.0,6444.156,6540.0,61600,6550.0,6380.0
840,2018/01/31,6770.0,6873.893,6580.0,319800,7080.0,6540.0
841,2018/02/01,6780.0,6712.791,6800.0,124700,6830.0,6590.0
842,2018/02/02,6860.0,6870.733,6810.0,73700,6940.0,6800.0
843,2018/02/05,6670.0,6722.532,6760.0,109000,6810.0,6650.0
844,2018/02/06,6180.0,6118.412,6100.0,222300,6330.0,5990.0
845,2018/02/07,6000.0,6118.004,6320.0,101700,6370.0,5980.0
846,2018/02/08,6100.0,6078.498,6000.0,79200,6140.0,6000.0
847,2018/02/09,6060.0,6004.068,5920.0,59000,6070.0,5910.0
848,2018/02/13,6030.0,6068.032,6150.0,82300,6250.0,6000.0
849,2018/02/14,5830.0,5861.676,5990.0,102600,6010.0,5790.0
850,2018/02/15,5840.0,5881.925,5830.0,80000,5960.0,5830.0
851,2018/02/16,5840.0,5873.502,5850.0,47400,5940.0,5830.0
852,2018/02/19,5950.0,5936.576,5880.0,33000,5960.0,5880.0
853,2018/02/20,5860.0,5870.318,5930.0,44000,5930.0,5820.0
854,2018/02/21,5860.0,5871.429,5830.0,59500,5930.0,5820.0
855,2018/02/22,5780.0,5800.691,5850.0,27500,5870.0,5770.0
856,2018/02/23,5880.0,5871.239,5770.0,46800,5940.0,5770.0
857,2018/02/26,5830.0,5856.224,5950.0,33100,5960.0,5810.0
858,2018/02/27,5890.0,5876.61,5910.0,29500,5910.0,5830.0
859,2018/02/28,5980.0,6003.29,5840.0,100600,6080.0,5840.0
860,2018/03/01,5770.0,5799.787,5880.0,65700,5880.0,5730.0
861,2018/03/02,5870.0,5855.835,5710.0,59300,5930.0,5710.0
862,2018/03/05,5750.0,5756.632,5780.0,77800,5830.0,5680.0
863,2018/03/06,6050.0,6008.796,5850.0,73100,6070.0,5830.0
864,2018/03/07,6130.0,6165.609,6100.0,124800,6230.0,6100.0
865,2018/03/08,6260.0,6260.37,6190.0,110900,6330.0,6140.0
866,2018/03/09,6210.0,6306.957,6390.0,103500,6450.0,6180.0
867,2018/03/12,6200.0,6203.753,6300.0,49300,6300.0,6130.0
868,2018/03/13,6190.0,6147.816,6170.0,38000,6200.0,6090.0
869,2018/03/14,6140.0,6145.839,6190.0,28600,6200.0,6110.0
870,2018/03/15,6040.0,6015.537,6110.0,59600,6110.0,5940.0
871,2018/03/16,6020.0,6031.553,6050.0,38000,6070.0,6000.0
872,2018/03/19,6060.0,6001.123,5920.0,96200,6100.0,5810.0
873,2018/03/20,5900.0,5920.85,5990.0,35300,5990.0,5890.0
874,2018/03/22,6060.0,6009.204,5890.0,75400,6100.0,5870.0
875,2018/03/23,5760.0,5809.074,5880.0,49700,5960.0,5750.0
876,2018/03/26,5870.0,5768.653,5670.0,85400,5880.0,5580.0
877,2018/03/27,6030.0,6011.171,5970.0,59800,6070.0,5930.0
878,2018/03/28,6100.0,6020.014,5900.0,72900,6110.0,5850.0
879,2018/03/29,6020.0,6041.29,6120.0,50400,6130.0,5960.0
880,2018/03/30,6030.0,6029.07,6110.0,35500,6110.0,5970.0
881,2018/04/02,6070.0,6065.462,6050.0,48700,6110.0,6010.0
882,2018/04/03,5960.0,5954.0,5940.0,40500,5990.0,5910.0
883,2018/04/04,6160.0,6118.664,5950.0,55400,6200.0,5950.0
884,2018/04/05,6170.0,6167.087,6200.0,41200,6200.0,6120.0
885,2018/04/06,6470.0,6437.44,6300.0,187900,6550.0,6280.0
886,2018/04/09,6410.0,6398.95,6410.0,81900,6460.0,6310.0
887,2018/04/10,6270.0,6326.392,6320.0,63200,6420.0,6250.0
888,2018/04/11,6120.0,6125.367,6220.0,57200,6260.0,6060.0
889,2018/04/12,6200.0,6194.519,6140.0,37400,6230.0,6120.0
890,2018/04/13,6340.0,6326.598,6220.0,68200,6420.0,6170.0
891,2018/04/16,6390.0,6361.891,6340.0,34900,6400.0,6320.0
892,2018/04/17,6290.0,6337.071,6390.0,51900,6440.0,6260.0
893,2018/04/18,6570.0,6500.808,6280.0,100300,6610.0,6260.0
894,2018/04/19,6560.0,6558.491,6550.0,51700,6600.0,6510.0
895,2018/04/20,6610.0,6604.61,6530.0,46200,6670.0,6510.0
896,2018/04/23,6620.0,6592.414,6570.0,34800,6640.0,6550.0
897,2018/04/24,6690.0,6672.949,6650.0,29500,6700.0,6630.0
898,2018/04/25,6740.0,6711.564,6650.0,56900,6770.0,6570.0
899,2018/04/26,6680.0,6681.54,6740.0,43500,6740.0,6640.0
900,2018/04/27,6730.0,6681.775,6610.0,47900,6730.0,6610.0
901,2018/05/01,6630.0,6621.789,6630.0,31300,6670.0,6570.0
902,2018/05/02,6620.0,6610.295,6630.0,30500,6640.0,6560.0
903,2018/05/07,6600.0,6601.875,6620.0,24000,6630.0,6560.0
904,2018/05/08,6870.0,6791.083,6630.0,83100,6880.0,6620.0
905,2018/05/09,6730.0,6716.095,6770.0,74000,6830.0,6660.0
906,2018/05/10,6790.0,6757.927,6780.0,46300,6820.0,6680.0
907,2018/05/11,6890.0,6850.786,6770.0,42000,6890.0,6770.0
908,2018/05/14,6860.0,6885.16,6900.0,112800,6970.0,6790.0
909,2018/05/15,7250.0,7402.379,7200.0,391300,7680.0,7090.0
910,2018/05/16,7180.0,7142.269,7160.0,97400,7210.0,7060.0
911,2018/05/17,7200.0,7291.744,7280.0,111800,7400.0,7160.0
912,2018/05/18,7150.0,7134.36,7200.0,53900,7210.0,7080.0
913,2018/05/21,7170.0,7175.718,7160.0,34800,7230.0,7140.0
914,2018/05/22,6970.0,7020.816,7130.0,77200,7130.0,6970.0
915,2018/05/23,7050.0,7034.069,7000.0,60700,7080.0,6980.0
916,2018/05/24,7070.0,7053.297,7050.0,36700,7100.0,7010.0
917,2018/05/25,7110.0,7098.474,7040.0,36700,7140.0,7020.0
918,2018/05/28,7190.0,7190.233,7110.0,64400,7250.0,7100.0
919,2018/05/29,7150.0,7185.623,7190.0,69000,7250.0,7140.0
920,2018/05/30,6950.0,7001.832,7070.0,71500,7090.0,6940.0
921,2018/05/31,7000.0,7000.734,6970.0,79000,7040.0,6920.0
922,2018/06/01,7060.0,7096.605,6970.0,81300,7190.0,6960.0
923,2018/06/04,7140.0,7219.228,7260.0,116600,7370.0,7100.0
924,2018/06/05,7200.0,7235.109,7180.0,114500,7360.0,7140.0
925,2018/06/06,7160.0,7168.821,7200.0,54300,7270.0,7110.0
926,2018/06/07,7230.0,7215.227,7230.0,52800,7280.0,7140.0
927,2018/06/08,7430.0,7371.594,7250.0,121700,7470.0,7250.0
928,2018/06/11,7420.0,7412.525,7420.0,40400,7460.0,7370.0
929,2018/06/12,7460.0,7444.721,7460.0,43000,7500.0,7360.0
930,2018/06/13,7460.0,7489.11,7460.0,53900,7560.0,7390.0
931,2018/06/14,7380.0,7389.035,7460.0,50800,7480.0,7350.0
932,2018/06/15,7210.0,7274.085,7390.0,89100,7440.0,7190.0
933,2018/06/18,7270.0,7287.658,7220.0,71300,7350.0,7220.0
934,2018/06/19,7050.0,7113.066,7280.0,57400,7290.0,7030.0
935,2018/06/20,7050.0,7009.199,7030.0,48700,7090.0,6940.0
936,2018/06/21,7020.0,7056.064,7120.0,40900,7160.0,7000.0
937,2018/06/22,7130.0,7083.619,6960.0,61900,7140.0,6920.0
938,2018/06/25,6810.0,6891.17,7050.0,100900,7110.0,6800.0
939,2018/06/26,6870.0,6829.312,6840.0,50900,6880.0,6750.0
940,2018/06/27,6980.0,6960.292,6930.0,30800,7020.0,6890.0
941,2018/06/28,6980.0,6922.212,6920.0,66000,7000.0,6810.0
942,2018/06/29,7100.0,7073.289,6960.0,52600,7150.0,6940.0
943,2018/07/02,6800.0,6870.073,7060.0,68800,7060.0,6780.0
944,2018/07/03,6740.0,6754.226,6750.0,71700,6870.0,6690.0
945,2018/07/04,6890.0,6857.303,6710.0,48200,6940.0,6680.0
946,2018/07/05,6790.0,6798.129,6790.0,74300,6840.0,6740.0
947,2018/07/06,7030.0,6960.119,6810.0,83800,7040.0,6800.0
948,2018/07/09,6870.0,6898.778,6970.0,54000,6970.0,6860.0
949,2018/07/10,6760.0,6820.852,6880.0,52800,6940.0,6760.0
950,2018/07/11,6570.0,6596.984,6670.0,72600,6670.0,6550.0
951,2018/07/12,6750.0,6696.777,6540.0,66400,6770.0,6540.0
952,2018/07/13,6890.0,6846.659,6720.0,41900,6890.0,6710.0
953,2018/07/17,6920.0,6893.594,6820.0,61500,6920.0,6800.0
954,2018/07/18,6980.0,6970.707,6940.0,41000,7010.0,6870.0
955,2018/07/19,6870.0,6915.039,6960.0,25400,6990.0,6870.0
956,2018/07/20,6840.0,6849.794,6860.0,43600,6920.0,6780.0
957,2018/07/23,6630.0,6671.33,6740.0,62400,6810.0,6580.0
958,2018/07/24,6680.0,6705.199,6730.0,27700,6760.0,6660.0
959,2018/07/25,6610.0,6622.042,6600.0,62700,6690.0,6590.0
960,2018/07/26,6760.0,6724.422,6640.0,29400,6770.0,6640.0
961,2018/07/27,6750.0,6751.78,6710.0,33700,6790.0,6710.0
962,2018/07/30,6790.0,6749.61,6710.0,30800,6810.0,6700.0
963,2018/07/31,6620.0,6640.089,6670.0,67700,6750.0,6610.0
964,2018/08/01,6540.0,6550.724,6630.0,63500,6650.0,6500.0
965,2018/08/02,6530.0,6544.361,6510.0,61000,6620.0,6500.0
966,2018/08/03,6540.0,6534.492,6500.0,58100,6580.0,6480.0
967,2018/08/06,5540.0,5650.976,5540.0,395500,5850.0,5540.0
968,2018/08/07,5530.0,5509.71,5400.0,206900,5620.0,5340.0
969,2018/08/08,5570.0,5556.286,5500.0,142700,5660.0,5440.0
970,2018/08/09,5480.0,5482.204,5560.0,87100,5570.0,5440.0
971,2018/08/10,5280.0,5332.042,5510.0,133700,5510.0,5240.0
972,2018/08/13,5290.0,5290.313,5270.0,105500,5400.0,5200.0
973,2018/08/14,5370.0,5304.033,5290.0,71900,5370.0,5210.0
974,2018/08/15,5380.0,5412.407,5380.0,56500,5490.0,5360.0
975,2018/08/16,5160.0,5183.388,5310.0,91800,5330.0,5130.0
976,2018/08/17,5310.0,5341.723,5260.0,135200,5470.0,5250.0
977,2018/08/20,5300.0,5308.141,5330.0,65100,5350.0,5260.0
978,2018/08/21,5270.0,5253.823,5270.0,49700,5290.0,5210.0
979,2018/08/22,5270.0,5251.14,5250.0,54400,5280.0,5200.0
980,2018/08/23,5300.0,5297.055,5240.0,48900,5350.0,5240.0
981,2018/08/24,5450.0,5428.35,5370.0,58800,5480.0,5350.0
982,2018/08/27,5630.0,5599.834,5530.0,126800,5690.0,5490.0
983,2018/08/28,5630.0,5664.757,5710.0,74200,5750.0,5580.0
984,2018/08/29,5720.0,5679.902,5640.0,61100,5730.0,5600.0
985,2018/08/30,5790.0,5761.676,5740.0,121100,5840.0,5660.0
986,2018/08/31,5810.0,5816.353,5750.0,116000,5900.0,5690.0
987,2018/09/03,5720.0,5758.164,5800.0,94200,5900.0,5660.0
988,2018/09/04,5780.0,5757.259,5670.0,78800,5810.0,5630.0
989,2018/09/05,5650.0,5673.512,5730.0,82000,5800.0,5590.0
990,2018/09/06,5590.0,5580.342,5600.0,67200,5620.0,5530.0
991,2018/09/07,5430.0,5445.361,5520.0,49800,5530.0,5390.0
992,2018/09/10,5320.0,5341.245,5390.0,70700,5400.0,5300.0
993,2018/09/11,5270.0,5279.926,5310.0,108200,5370.0,5220.0
994,2018/09/12,5390.0,5365.428,5340.0,58400,5400.0,5300.0
995,2018/09/13,5450.0,5460.383,5380.0,54900,5560.0,5380.0
996,2018/09/14,5550.0,5559.685,5530.0,69800,5630.0,5510.0
997,2018/09/18,5740.0,5672.471,5550.0,104400,5770.0,5470.0
998,2018/09/19,5790.0,5799.822,5790.0,78500,5840.0,5750.0
999,2018/09/20,5620.0,5619.721,5750.0,121900,5750.0,5560.0
1000,2018/09/21,5440.0,5469.098,5610.0,169700,5620.0,5420.0
1001,2018/09/25,5580.0,5488.575,5440.0,165600,5580.0,5360.0
1002,2018/09/26,5810.0,5777.962,5630.0,99600,5850.0,5610.0
1003,2018/09/27,5710.0,5744.992,5800.0,59100,5830.0,5700.0
1004,2018/09/28,5720.0,5755.695,5730.0,51100,5830.0,5720.0
1005,2018/10/01,5690.0,5690.296,5700.0,54100,5740.0,5650.0
1006,2018/10/02,5570.0,5612.775,5720.0,89000,5750.0,5570.0
1007,2018/10/03,5510.0,5551.028,5600.0,46700,5630.0,5500.0
1008,2018/10/04,5500.0,5494.53,5600.0,47900,5600.0,5450.0
1009,2018/10/05,5480.0,5497.642,5490.0,53000,5530.0,5460.0
1010,2018/10/09,5300.0,5323.608,5400.0,76500,5420.0,5270.0
1011,2018/10/10,5400.0,5354.341,5310.0,72100,5420.0,5250.0
1012,2018/10/11,5230.0,5248.171,5240.0,107700,5330.0,5190.0
1013,2018/10/12,5260.0,5269.106,5200.0,80500,5320.0,5200.0
1014,2018/10/15,5180.0,5197.306,5240.0,88700,5250.0,5160.0
1015,2018/10/16,5190.0,5174.639,5170.0,76100,5210.0,5150.0
1016,2018/10/17,5280.0,5274.664,5260.0,68400,5320.0,5240.0
1017,2018/10/18,5210.0,5227.485,5230.0,33800,5270.0,5200.0
1018,2018/10/19,5150.0,5147.484,5180.0,47700,5200.0,5110.0
1019,2018/10/22,5140.0,5098.702,5110.0,73200,5160.0,5030.0
1020,2018/10/23,5050.0,5065.756,5100.0,47600,5100.0,5040.0
1021,2018/10/24,5110.0,5073.391,5050.0,63700,5140.0,4990.0
1022,2018/10/25,4840.0,4888.775,4985.0,88600,5000.0,4825.0
1023,2018/10/26,4705.0,4731.836,4875.0,120400,4875.0,4655.0
1024,2018/10/29,4640.0,4682.63,4700.0,77200,4755.0,4620.0
1025,2018/10/30,4780.0,4750.646,4580.0,135400,4800.0,4580.0
1026,2018/10/31,5010.0,4943.519,4755.0,54000,5020.0,4755.0
1027,2018/11/01,4990.0,5029.708,5020.0,84000,5100.0,4970.0
1028,2018/11/02,4960.0,4964.287,4970.0,93900,5040.0,4920.0
1029,2018/11/05,4990.0,4953.495,4965.0,104000,5030.0,4880.0
1030,2018/11/06,4680.0,4736.491,4940.0,214300,4950.0,4605.0
1031,2018/11/07,4685.0,4715.534,4745.0,114200,4770.0,4650.0
1032,2018/11/08,4685.0,4676.481,4670.0,110400,4710.0,4645.0
1033,2018/11/09,4665.0,4654.597,4675.0,149000,4705.0,4605.0
1034,2018/11/12,4615.0,4643.019,4665.0,77500,4695.0,4605.0
1035,2018/11/13,4435.0,4448.617,4550.0,147500,4550.0,4405.0
1036,2018/11/14,4500.0,4505.128,4440.0,66600,4545.0,4440.0
1037,2018/11/15,4530.0,4490.202,4470.0,54400,4530.0,4425.0
1038,2018/11/16,4420.0,4464.167,4530.0,50400,4565.0,4420.0
1039,2018/11/19,4445.0,4448.957,4415.0,41700,4470.0,4415.0
1040,2018/11/20,4355.0,4379.927,4420.0,54700,4425.0,4350.0
1041,2018/11/21,4255.0,4267.144,4315.0,110100,4320.0,4235.0
1042,2018/11/22,4295.0,4288.391,4275.0,60600,4330.0,4250.0
1043,2018/11/26,4370.0,4362.031,4320.0,48000,4400.0,4295.0
1044,2018/11/27,4375.0,4381.7,4415.0,54400,4430.0,4350.0
1045,2018/11/28,4415.0,4420.824,4385.0,82500,4465.0,4385.0
1046,2018/11/29,4355.0,4380.039,4465.0,76700,4470.0,4350.0
1047,2018/11/30,4455.0,4432.635,4385.0,51800,4455.0,4375.0
1048,2018/12/03,4465.0,4469.912,4480.0,73600,4500.0,4425.0
1049,2018/12/04,4390.0,4422.013,4475.0,62600,4485.0,4390.0
1050,2018/12/05,4400.0,4403.411,4340.0,77100,4465.0,4340.0
1051,2018/12/06,4450.0,4440.547,4405.0,79600,4480.0,4360.0
1052,2018/12/07,4385.0,4397.587,4450.0,60300,4480.0,4355.0
1053,2018/12/10,4260.0,4267.042,4345.0,59000,4360.0,4215.0
1054,2018/12/11,4255.0,4279.392,4285.0,68300,4345.0,4240.0
1055,2018/12/12,4325.0,4318.526,4265.0,53600,4340.0,4260.0
1056,2018/12/13,4360.0,4354.043,4360.0,51200,4390.0,4320.0
1057,2018/12/14,4205.0,4252.971,4335.0,73200,4340.0,4190.0
1058,2018/12/17,4220.0,4221.895,4200.0,93400,4260.0,4175.0
1059,2018/12/18,4135.0,4141.085,4190.0,69100,4195.0,4105.0
1060,2018/12/19,4100.0,4121.088,4135.0,60200,4180.0,4095.0
1061,2018/12/20,3940.0,3986.844,4055.0,70500,4055.0,3935.0
1062,2018/12/21,3845.0,3842.076,3915.0,99700,3920.0,3765.0
1063,2018/12/25,3745.0,3738.754,3775.0,105500,3775.0,3670.0
1064,2018/12/26,3890.0,3893.032,3810.0,110000,3950.0,3810.0
1065,2018/12/27,4125.0,4106.282,4060.0,87000,4145.0,4035.0
1066,2018/12/28,4155.0,4139.881,4090.0,58900,4195.0,4055.0
1067,2019/01/04,4160.0,4142.844,4085.0,88800,4215.0,3995.0
1068,2019/01/07,4465.0,4481.822,4410.0,350500,4560.0,4350.0
1069,2019/01/08,4505.0,4522.92,4450.0,184400,4575.0,4440.0
1070,2019/01/09,4435.0,4452.464,4500.0,241300,4525.0,4390.0
1071,2019/01/10,4455.0,4421.863,4390.0,110600,4475.0,4370.0
1072,2019/01/11,4375.0,4409.529,4505.0,97700,4505.0,4360.0
1073,2019/01/15,4520.0,4487.228,4350.0,94700,4545.0,4335.0
1074,2019/01/16,4520.0,4557.523,4560.0,86200,4605.0,4515.0
1075,2019/01/17,4450.0,4468.372,4510.0,60500,4550.0,4415.0
1076,2019/01/18,4610.0,4579.236,4485.0,80500,4635.0,4465.0
1077,2019/01/21,4735.0,4706.025,4670.0,149300,4755.0,4645.0
1078,2019/01/22,4720.0,4739.655,4795.0,108800,4795.0,4690.0
1079,2019/01/23,4595.0,4640.107,4655.0,93800,4715.0,4590.0
1080,2019/01/24,4525.0,4549.475,4605.0,97100,4605.0,4520.0
1081,2019/01/25,4735.0,4694.482,4550.0,127400,4770.0,4525.0
1082,2019/01/28,4595.0,4621.317,4735.0,70600,4735.0,4570.0
1083,2019/01/29,4655.0,4605.276,4600.0,70600,4665.0,4520.0
1084,2019/01/30,4495.0,4526.964,4615.0,123500,4635.0,4480.0
1085,2019/01/31,4535.0,4530.606,4555.0,57800,4580.0,4495.0
1086,2019/02/01,4630.0,4625.192,4580.0,83400,4650.0,4575.0
1087,2019/02/04,4735.0,4703.387,4655.0,75300,4740.0,4630.0
1088,2019/02/05,4825.0,4785.312,4710.0,131600,4830.0,4695.0
1089,2019/02/06,5110.0,5065.958,4900.0,185900,5160.0,4900.0
1090,2019/02/07,5180.0,5101.064,5090.0,223700,5190.0,4940.0
1091,2019/02/08,5010.0,4984.172,5080.0,153900,5100.0,4850.0
1092,2019/02/12,5100.0,5055.895,5010.0,83800,5110.0,4955.0
1093,2019/02/13,5120.0,5101.294,5100.0,45600,5140.0,5020.0
1094,2019/02/14,5060.0,5090.759,5140.0,22400,5150.0,5050.0
1095,2019/02/15,5050.0,5022.441,5010.0,25400,5050.0,4975.0
1096,2019/02/18,5110.0,5094.634,5080.0,28700,5120.0,5070.0
1097,2019/02/19,5080.0,5075.654,5110.0,23700,5120.0,5040.0
1098,2019/02/20,5080.0,5073.6,5090.0,25000,5110.0,5040.0
1099,2019/02/21,5060.0,5057.186,5070.0,16700,5080.0,5030.0
1100,2019/02/22,5050.0,5027.189,5040.0,24900,5050.0,5000.0
1101,2019/02/25,5120.0,5094.142,5070.0,23900,5120.0,5050.0
1102,2019/02/26,5180.0,5160.841,5150.0,42800,5190.0,5130.0
1103,2019/02/27,5120.0,5141.524,5230.0,59700,5240.0,5090.0
1104,2019/02/28,5080.0,5072.83,5130.0,62200,5140.0,5020.0
1105,2019/03/01,4945.0,4947.151,5040.0,111100,5060.0,4895.0
1106,2019/03/04,4920.0,4934.581,4990.0,65600,5010.0,4905.0
1107,2019/03/05,4975.0,4934.444,4895.0,56600,4980.0,4865.0
1108,2019/03/06,5060.0,5048.015,4995.0,91200,5090.0,4980.0
1109,2019/03/07,5020.0,5011.013,4990.0,47900,5050.0,4965.0
1110,2019/03/08,4845.0,4892.381,4960.0,65300,4985.0,4835.0
1111,2019/03/11,4835.0,4785.314,4785.0,51000,4845.0,4735.0
1112,2019/03/12,4895.0,4858.553,4835.0,55300,4895.0,4810.0
1113,2019/03/13,4840.0,4858.194,4845.0,47900,4925.0,4820.0
1114,2019/03/14,4760.0,4784.661,4840.0,41300,4850.0,4745.0
1115,2019/03/15,4795.0,4786.799,4800.0,57800,4820.0,4750.0
1116,2019/03/18,4815.0,4790.926,4790.0,39400,4815.0,4765.0
1117,2019/03/19,4780.0,4783.902,4845.0,51000,4855.0,4755.0
1118,2019/03/20,4760.0,4740.485,4750.0,40200,4770.0,4715.0
1119,2019/03/22,4690.0,4703.351,4745.0,74000,4760.0,4675.0
1120,2019/03/25,4620.0,4599.915,4645.0,53200,4645.0,4565.0
1121,2019/03/26,4755.0,4711.376,4655.0,86500,4755.0,4635.0
1122,2019/03/27,4610.0,4601.168,4650.0,84800,4685.0,4555.0
1123,2019/03/28,4505.0,4492.983,4550.0,72400,4550.0,4435.0
1124,2019/03/29,4475.0,4466.277,4535.0,41100,4545.0,4435.0
1125,2019/04/01,4610.0,4595.356,4525.0,42100,4620.0,4525.0
1126,2019/04/02,4635.0,4651.878,4645.0,49000,4695.0,4625.0
1127,2019/04/03,4730.0,4697.157,4610.0,72800,4740.0,4580.0
1128,2019/04/04,4710.0,4734.326,4750.0,42300,4775.0,4700.0
1129,2019/04/05,4775.0,4767.52,4735.0,37500,4790.0,4725.0
1130,2019/04/08,4705.0,4729.206,4780.0,38400,4780.0,4690.0
1131,2019/04/09,4615.0,4607.065,4705.0,54000,4710.0,4565.0
1132,2019/04/10,4665.0,4661.729,4630.0,35000,4690.0,4615.0
1133,2019/04/11,4635.0,4624.163,4620.0,25700,4655.0,4590.0
1134,2019/04/12,4660.0,4649.812,4630.0,47800,4675.0,4615.0
1135,2019/04/15,4785.0,4765.158,4700.0,37900,4795.0,4700.0
1136,2019/04/16,4790.0,4790.85,4780.0,40000,4830.0,4760.0
1137,2019/04/17,4795.0,4799.385,4835.0,25200,4835.0,4770.0
1138,2019/04/18,4740.0,4745.401,4780.0,39900,4805.0,4720.0
1139,2019/04/19,4740.0,4737.822,4775.0,16300,4785.0,4710.0
1140,2019/04/22,4725.0,4726.642,4735.0,20100,4755.0,4680.0
1141,2019/04/23,4765.0,4747.376,4750.0,26300,4770.0,4710.0
1142,2019/04/24,4735.0,4751.085,4765.0,36400,4775.0,4730.0
1143,2019/04/25,4760.0,4763.07,4760.0,34200,4795.0,4715.0
1144,2019/04/26,4730.0,4710.382,4730.0,26200,4735.0,4675.0
1145,2019/05/07,4635.0,4662.987,4700.0,39000,4710.0,4625.0
1146,2019/05/08,4545.0,4538.062,4570.0,60900,4600.0,4510.0
1147,2019/05/09,4430.0,4452.666,4490.0,67700,4525.0,4425.0
1148,2019/05/10,4465.0,4461.471,4440.0,59500,4510.0,4430.0
1149,2019/05/13,4430.0,4417.486,4400.0,36000,4435.0,4390.0
1150,2019/05/14,4390.0,4374.53,4330.0,57500,4410.0,4320.0
1151,2019/05/15,4560.0,4614.5,4600.0,123900,4770.0,4470.0
1152,2019/05/16,4645.0,4606.518,4580.0,48100,4650.0,4530.0
1153,2019/05/17,4695.0,4663.385,4670.0,38400,4700.0,4625.0
1154,2019/05/20,4690.0,4682.458,4710.0,35800,4745.0,4665.0
1155,2019/05/21,4640.0,4637.414,4640.0,43500,4665.0,4625.0
1156,2019/05/22,4620.0,4633.718,4635.0,31200,4670.0,4620.0
1157,2019/05/23,4700.0,4686.048,4630.0,49600,4760.0,4630.0
1158,2019/05/24,4705.0,4685.036,4645.0,55100,4735.0,4605.0
1159,2019/05/27,4750.0,4739.076,4710.0,23800,4755.0,4710.0
1160,2019/05/28,4755.0,4751.414,4715.0,57300,4790.0,4715.0
1161,2019/05/29,4750.0,4740.83,4720.0,54200,4775.0,4685.0
1162,2019/05/30,4700.0,4672.803,4695.0,50300,4705.0,4630.0
1163,2019/05/31,4545.0,4555.479,4630.0,74100,4630.0,4510.0
1164,2019/06/03,4395.0,4406.448,4455.0,103600,4475.0,4360.0
1165,2019/06/04,4500.0,4473.111,4395.0,67500,4525.0,4390.0
1166,2019/06/05,4695.0,4673.199,4610.0,61900,4715.0,4595.0
1167,2019/06/06,4705.0,4699.821,4665.0,33600,4720.0,4665.0
1168,2019/06/07,4795.0,4770.0,4720.0,46800,4800.0,4680.0
1169,2019/06/10,4865.0,4849.941,4800.0,42100,4885.0,4800.0
1170,2019/06/11,4875.0,4863.325,4870.0,39700,4890.0,4820.0
1171,2019/06/12,4840.0,4844.941,4865.0,25600,4885.0,4820.0
1172,2019/06/13,4805.0,4799.382,4810.0,46100,4840.0,4755.0
1173,2019/06/14,4785.0,4803.417,4820.0,25900,4830.0,4775.0
1174,2019/06/17,4805.0,4796.955,4805.0,39900,4825.0,4755.0
1175,2019/06/18,4820.0,4829.583,4805.0,50400,4875.0,4790.0
1176,2019/06/19,4830.0,4839.657,4850.0,36400,4880.0,4820.0
1177,2019/06/20,4755.0,4779.153,4840.0,41900,4850.0,4750.0
1178,2019/06/21,4730.0,4741.252,4780.0,114200,4780.0,4705.0
1179,2019/06/24,4705.0,4703.172,4725.0,29000,4725.0,4685.0
1180,2019/06/25,4670.0,4687.004,4735.0,22700,4735.0,4660.0
1181,2019/06/26,4565.0,4607.271,4670.0,30600,4670.0,4565.0
1182,2019/06/27,4630.0,4604.29,4560.0,32400,4630.0,4555.0
1183,2019/06/28,4635.0,4661.76,4640.0,35800,4695.0,4635.0
1184,2019/07/01,4740.0,4702.661,4685.0,31000,4750.0,4650.0
1185,2019/07/02,4845.0,4833.769,4760.0,46700,4875.0,4760.0
1186,2019/07/03,4880.0,4886.188,4840.0,40000,4920.0,4825.0
1187,2019/07/04,4930.0,4926.372,4940.0,16400,4950.0,4905.0
1188,2019/07/05,4960.0,4949.104,4955.0,27900,4965.0,4930.0
1189,2019/07/08,4955.0,4958.21,4945.0,43300,5000.0,4920.0
1190,2019/07/09,4970.0,4983.559,4970.0,58300,5040.0,4930.0
1191,2019/07/10,4980.0,4981.774,4970.0,27900,5000.0,4950.0
1192,2019/07/11,5030.0,5015.349,4980.0,30100,5050.0,4960.0
1193,2019/07/12,5030.0,5028.218,5040.0,20200,5050.0,5000.0
1194,2019/07/16,4985.0,4982.073,5020.0,32800,5020.0,4955.0
1195,2019/07/17,5000.0,5003.056,5020.0,19800,5030.0,4980.0
1196,2019/07/18,4925.0,4946.042,5000.0,54200,5020.0,4910.0
1197,2019/07/19,4980.0,4971.988,4925.0,41000,5000.0,4920.0
1198,2019/07/22,4880.0,4907.839,4980.0,46500,4980.0,4880.0
1199,2019/07/23,4930.0,4924.156,4880.0,31400,4965.0,4870.0
1200,2019/07/24,4955.0,4950.408,4930.0,41700,4975.0,4910.0
1201,2019/07/25,4930.0,4935.427,4965.0,23400,4985.0,4910.0
1202,2019/07/26,4965.0,4946.007,4955.0,27800,4975.0,4900.0
1203,2019/07/29,4990.0,4978.717,4965.0,26100,4995.0,4950.0
1204,2019/07/30,4995.0,5005.691,5020.0,21000,5040.0,4985.0
1205,2019/07/31,4860.0,4912.366,4960.0,39300,4995.0,4860.0
1206,2019/08/01,4740.0,4769.073,4860.0,41000,4860.0,4725.0
1207,2019/08/02,4615.0,4649.412,4700.0,50200,4710.0,4605.0
1208,2019/08/05,4500.0,4453.267,4500.0,137600,4525.0,4350.0
1209,2019/08/06,4455.0,4401.86,4360.0,57000,4460.0,4335.0
1210,2019/08/07,4445.0,4448.808,4440.0,47400,4485.0,4425.0
1211,2019/08/08,4385.0,4396.774,4440.0,53000,4450.0,4365.0
1212,2019/08/09,4395.0,4397.294,4420.0,40100,4435.0,4380.0
1213,2019/08/13,4295.0,4302.37,4305.0,42400,4330.0,4290.0
1214,2019/08/14,4420.0,4377.171,4375.0,35000,4420.0,4320.0
1215,2019/08/15,4320.0,4309.01,4300.0,28800,4325.0,4285.0
1216,2019/08/16,4320.0,4318.254,4305.0,20900,4350.0,4295.0
1217,2019/08/19,4405.0,4394.955,4390.0,44500,4410.0,4355.0
1218,2019/08/20,4495.0,4476.398,4460.0,39700,4505.0,4415.0
1219,2019/08/21,4460.0,4469.298,4495.0,35600,4495.0,4435.0
1220,2019/08/22,4430.0,4426.793,4475.0,44900,4475.0,4400.0
1221,2019/08/23,4445.0,4450.865,4430.0,36400,4495.0,4425.0
