ds,yhat
2019-07-16,2009.7664238146397
2019-07-17,2006.630062143222
2019-07-18,2001.5446966359448
2019-07-19,1993.9569424649933
2019-07-22,1965.3377650614507
2019-07-23,1955.1464938745908
2019-07-24,1943.7258646696032
2019-07-25,1931.5108723028445
2019-07-26,1920.2689345664505
2019-07-29,1904.5146227626387
2019-07-30,1901.7898188693796
2019-07-31,1897.370992149205
2019-08-01,1891.2751133769023
2019-08-02,1884.6688825242468
2019-08-05,1868.5541969457786
2019-08-06,1864.213316421807
2019-08-07,1861.1178686091841
2019-08-08,1860.133849353249
2019-08-09,1861.1613593681543
