ds,yhat
2019-08-22,322.97754060644127
2019-08-23,323.0134817711085
2019-08-26,314.3050180019198
2019-08-27,311.99279765217256
2019-08-28,311.2820042581216
2019-08-29,311.75911179522564
2019-08-30,312.62677213375446
2019-09-02,311.7471847956193
2019-09-03,309.9110267353254
2019-09-04,308.12158932126255
2019-09-05,307.3047097880701
2019-09-06,307.99618822215785
2019-09-09,311.24070885990136
2019-09-10,309.3533706163964
2019-09-11,306.9754181993539
2019-09-12,306.22503590543806
2019-09-13,308.461131291881
2019-09-17,322.0632695964096
2019-09-18,321.3081535769535
2019-09-19,321.23076772972036
2019-09-20,323.10952104669803
