,DateTime,Open,High,Low,Close,VWAP,Trades,Volume,DS
0,2019/11/19 9:00:00,998.0,998.0,998.0,998.0,998.0,1,1700.0,2019-11-19 09:00:00
1,2019/11/19 9:02:00,996.0,996.0,996.0,996.0,996.0,1,100.0,2019-11-19 09:02:00
2,2019/11/19 9:03:00,996.0,996.0,996.0,996.0,996.0,1,300.0,2019-11-19 09:03:00
3,2019/11/19 9:04:00,995.0,995.0,995.0,995.0,995.0,2,600.0,2019-11-19 09:04:00
4,2019/11/19 9:09:00,994.0,994.0,994.0,994.0,994.0,1,100.0,2019-11-19 09:09:00
5,2019/11/19 9:10:00,991.0,992.0,989.0,992.0,990.875,3,800.0,2019-11-19 09:10:00
6,2019/11/19 9:13:00,987.0,987.0,987.0,987.0,987.0,1,400.0,2019-11-19 09:13:00
7,2019/11/19 9:14:00,985.0,991.0,985.0,991.0,988.429,3,700.0,2019-11-19 09:14:00
8,2019/11/19 9:18:00,990.0,990.0,990.0,990.0,990.0,1,200.0,2019-11-19 09:18:00
9,2019/11/19 9:20:00,987.0,987.0,985.0,985.0,986.333,2,600.0,2019-11-19 09:20:00
10,2019/11/19 9:22:00,985.0,985.0,984.0,984.0,984.5,2,1000.0,2019-11-19 09:22:00
11,2019/11/19 9:28:00,987.0,987.0,987.0,987.0,987.0,1,100.0,2019-11-19 09:28:00
12,2019/11/19 9:37:00,987.0,987.0,987.0,987.0,987.0,1,100.0,2019-11-19 09:37:00
13,2019/11/19 9:39:00,987.0,987.0,987.0,987.0,987.0,1,200.0,2019-11-19 09:39:00
14,2019/11/19 9:40:00,986.0,986.0,986.0,986.0,986.0,1,300.0,2019-11-19 09:40:00
15,2019/11/19 9:45:00,984.0,987.0,984.0,987.0,986.6,4,1500.0,2019-11-19 09:45:00
16,2019/11/19 9:46:00,989.0,989.0,989.0,989.0,989.0,3,400.0,2019-11-19 09:46:00
17,2019/11/19 9:47:00,987.0,989.0,987.0,989.0,988.0,2,200.0,2019-11-19 09:47:00
18,2019/11/19 9:49:00,989.0,989.0,987.0,987.0,988.333,2,300.0,2019-11-19 09:49:00
19,2019/11/19 9:55:00,987.0,987.0,987.0,987.0,987.0,2,200.0,2019-11-19 09:55:00
20,2019/11/19 9:57:00,987.0,987.0,987.0,987.0,987.0,1,100.0,2019-11-19 09:57:00
21,2019/11/19 9:58:00,987.0,987.0,987.0,987.0,987.0,1,100.0,2019-11-19 09:58:00
22,2019/11/19 10:01:00,987.0,987.0,986.0,987.0,986.6,3,500.0,2019-11-19 10:01:00
23,2019/11/19 10:11:00,987.0,987.0,987.0,987.0,987.0,1,200.0,2019-11-19 10:11:00
24,2019/11/19 10:16:00,990.0,990.0,990.0,990.0,990.0,1,100.0,2019-11-19 10:16:00
25,2019/11/19 10:20:00,991.0,991.0,991.0,991.0,991.0,2,500.0,2019-11-19 10:20:00
26,2019/11/19 10:31:00,987.0,987.0,987.0,987.0,987.0,1,100.0,2019-11-19 10:31:00
27,2019/11/19 11:22:00,987.0,992.0,987.0,992.0,991.0,4,1100.0,2019-11-19 11:22:00
28,2019/11/19 11:30:00,987.0,987.0,987.0,987.0,987.0,1,100.0,2019-11-19 11:30:00
29,2019/11/19 12:30:00,987.0,989.0,987.0,989.0,987.875,4,800.0,2019-11-19 12:30:00
30,2019/11/19 12:43:00,988.0,988.0,988.0,988.0,988.0,1,200.0,2019-11-19 12:43:00
31,2019/11/19 12:47:00,988.0,988.0,986.0,986.0,986.84,5,2500.0,2019-11-19 12:47:00
32,2019/11/19 12:50:00,985.0,985.0,983.0,983.0,984.4,3,1000.0,2019-11-19 12:50:00
33,2019/11/19 12:52:00,983.0,983.0,980.0,980.0,981.0,5,2600.0,2019-11-19 12:52:00
34,2019/11/19 12:59:00,979.0,979.0,978.0,978.0,978.6,2,1000.0,2019-11-19 12:59:00
35,2019/11/19 13:01:00,978.0,978.0,976.0,976.0,976.75,3,800.0,2019-11-19 13:01:00
36,2019/11/19 13:02:00,980.0,980.0,980.0,980.0,980.0,1,200.0,2019-11-19 13:02:00
37,2019/11/19 13:05:00,978.0,978.0,978.0,978.0,978.0,1,400.0,2019-11-19 13:05:00
38,2019/11/19 13:08:00,978.0,978.0,978.0,978.0,978.0,2,500.0,2019-11-19 13:08:00
39,2019/11/19 13:31:00,978.0,978.0,977.0,977.0,977.556,2,900.0,2019-11-19 13:31:00
40,2019/11/19 13:50:00,978.0,978.0,978.0,978.0,978.0,1,100.0,2019-11-19 13:50:00
41,2019/11/19 14:09:00,982.0,982.0,982.0,982.0,982.0,1,200.0,2019-11-19 14:09:00
42,2019/11/19 14:13:00,982.0,982.0,982.0,982.0,982.0,1,200.0,2019-11-19 14:13:00
43,2019/11/19 14:44:00,980.0,980.0,980.0,980.0,980.0,2,300.0,2019-11-19 14:44:00
44,2019/11/19 14:56:00,982.0,987.0,980.0,980.0,984.759,6,2900.0,2019-11-19 14:56:00
45,2019/11/19 14:58:00,981.0,981.0,981.0,981.0,981.0,1,200.0,2019-11-19 14:58:00
46,2019/11/19 15:00:00,982.0,982.0,982.0,982.0,982.0,1,1100.0,2019-11-19 15:00:00
