,Date,Close,VWAP,Open,Volume,High,Low
0,2014/08/25,279.0,276.315,274.0,152900,281.0,271.0
1,2014/08/26,280.0,278.05,279.0,136900,280.0,275.0
2,2014/08/27,284.0,283.464,282.0,311400,286.0,280.0
3,2014/08/28,280.0,282.811,285.0,145800,285.0,280.0
4,2014/08/29,314.0,300.014,283.0,1282400,330.0,281.0
5,2014/09/01,324.0,316.156,318.0,785600,324.0,310.0
6,2014/09/02,314.0,322.285,331.0,758700,334.0,307.0
7,2014/09/03,310.0,326.031,322.0,1425300,347.0,309.0
8,2014/09/04,301.0,302.707,308.0,599800,310.0,296.0
9,2014/09/05,303.0,302.998,305.0,206100,307.0,300.0
10,2014/09/08,340.0,334.293,311.0,1781800,355.0,308.0
11,2014/09/09,326.0,327.758,340.0,909800,344.0,317.0
12,2014/09/10,316.0,317.05,321.0,283900,325.0,312.0
13,2014/09/11,312.0,318.138,318.0,260300,328.0,312.0
14,2014/09/12,310.0,311.146,312.0,162500,314.0,309.0
15,2014/09/16,318.0,318.273,312.0,258100,324.0,312.0
16,2014/09/17,313.0,315.164,320.0,260800,323.0,311.0
17,2014/09/18,309.0,312.293,316.0,121600,316.0,309.0
18,2014/09/19,313.0,310.456,312.0,138800,314.0,308.0
19,2014/09/22,320.0,318.281,315.0,211800,322.0,313.0
20,2014/09/24,329.0,326.731,320.0,382200,332.0,318.0
21,2014/09/25,329.0,328.204,333.0,193800,333.0,323.0
22,2014/09/26,335.0,332.446,326.0,218900,339.0,325.0
23,2014/09/29,337.0,337.806,341.0,139700,341.0,334.0
24,2014/09/30,334.0,330.021,334.0,320800,337.0,322.0
25,2014/10/01,313.0,321.418,328.0,398200,329.0,313.0
26,2014/10/02,302.0,301.644,301.0,571800,308.0,298.0
27,2014/10/03,317.0,311.376,307.0,191900,319.0,304.0
28,2014/10/06,326.0,326.689,322.0,236200,331.0,322.0
29,2014/10/07,311.0,317.049,326.0,280900,326.0,311.0
30,2014/10/08,297.0,294.607,289.0,499900,301.0,288.0
31,2014/10/09,285.0,291.981,299.0,280300,302.0,285.0
32,2014/10/10,278.0,276.59,277.0,281700,281.0,273.0
33,2014/10/14,266.0,264.396,262.0,392100,271.0,260.0
34,2014/10/15,268.0,266.109,271.0,197100,272.0,263.0
35,2014/10/16,261.0,261.538,263.0,207500,265.0,258.0
36,2014/10/17,253.0,255.402,261.0,303400,262.0,250.0
37,2014/10/20,269.0,264.698,262.0,173700,270.0,259.0
38,2014/10/21,269.0,270.359,275.0,146700,276.0,265.0
39,2014/10/22,276.0,274.358,277.0,69600,277.0,272.0
40,2014/10/23,275.0,272.481,274.0,48700,275.0,270.0
41,2014/10/24,272.0,273.244,278.0,104500,278.0,271.0
42,2014/10/27,270.0,270.062,271.0,85600,273.0,268.0
43,2014/10/28,267.0,266.876,269.0,86000,269.0,265.0
44,2014/10/29,272.0,270.883,270.0,71500,273.0,268.0
45,2014/10/30,273.0,271.912,271.0,44100,274.0,271.0
46,2014/10/31,274.0,273.515,274.0,134900,277.0,271.0
47,2014/11/04,277.0,280.224,280.0,191000,284.0,277.0
48,2014/11/05,289.0,284.26,277.0,177700,289.0,277.0
49,2014/11/06,285.0,286.67,289.0,185000,293.0,279.0
50,2014/11/07,285.0,286.513,289.0,97500,290.0,283.0
51,2014/11/10,289.0,288.515,290.0,87000,291.0,285.0
52,2014/11/11,294.0,291.738,290.0,212200,298.0,287.0
53,2014/11/12,299.0,299.424,294.0,293200,303.0,292.0
54,2014/11/13,303.0,300.705,298.0,194100,304.0,295.0
55,2014/11/14,299.0,300.983,303.0,204800,304.0,297.0
56,2014/11/17,296.0,297.098,300.0,156500,301.0,293.0
57,2014/11/18,294.0,293.055,292.0,186600,296.0,291.0
58,2014/11/19,296.0,295.937,298.0,89400,298.0,293.0
59,2014/11/20,295.0,295.057,296.0,68700,297.0,293.0
60,2014/11/21,294.0,291.783,296.0,83000,296.0,290.0
61,2014/11/25,292.0,292.215,292.0,60400,294.0,291.0
62,2014/11/26,294.0,293.862,292.0,52800,296.0,292.0
63,2014/11/27,296.0,295.252,295.0,36100,296.0,294.0
64,2014/11/28,294.0,294.918,296.0,57200,296.0,294.0
65,2014/12/01,292.0,294.056,296.0,106500,296.0,292.0
66,2014/12/02,290.0,289.439,291.0,137500,291.0,288.0
67,2014/12/03,287.0,287.187,290.0,180300,291.0,284.0
68,2014/12/04,286.0,285.702,284.0,101800,290.0,283.0
69,2014/12/05,285.0,286.761,288.0,91100,290.0,285.0
70,2014/12/08,285.0,284.117,285.0,86400,287.0,282.0
71,2014/12/09,282.0,283.605,285.0,93200,286.0,282.0
72,2014/12/10,273.0,273.909,280.0,344400,282.0,267.0
73,2014/12/11,274.0,272.672,270.0,178800,278.0,270.0
74,2014/12/12,280.0,277.495,273.0,74100,281.0,273.0
75,2014/12/15,281.0,280.52,282.0,62900,283.0,279.0
76,2014/12/16,277.0,277.993,281.0,75200,281.0,276.0
77,2014/12/17,273.0,274.341,276.0,114800,279.0,271.0
78,2014/12/18,271.0,269.784,268.0,219400,274.0,268.0
79,2014/12/19,283.0,280.849,274.0,191800,285.0,274.0
80,2014/12/22,280.0,282.737,285.0,101500,285.0,280.0
81,2014/12/24,281.0,281.67,283.0,51800,283.0,281.0
82,2014/12/25,285.0,283.995,284.0,165000,286.0,281.0
83,2014/12/26,288.0,285.856,285.0,82600,288.0,284.0
84,2014/12/29,295.0,292.72,289.0,257900,297.0,287.0
85,2014/12/30,300.0,298.353,295.0,423600,303.0,292.0
86,2015/01/05,308.0,303.747,298.0,303600,310.0,297.0
87,2015/01/06,305.0,302.987,305.0,180400,306.0,301.0
88,2015/01/07,305.0,303.892,303.0,112500,307.0,301.0
89,2015/01/08,304.0,303.343,305.0,148300,307.0,301.0
90,2015/01/09,290.0,290.702,292.0,407000,292.0,287.0
91,2015/01/13,285.0,287.246,288.0,133100,291.0,285.0
92,2015/01/14,283.0,284.977,284.0,69600,287.0,283.0
93,2015/01/15,287.0,285.012,285.0,40800,287.0,283.0
94,2015/01/16,284.0,283.987,287.0,86000,287.0,281.0
95,2015/01/19,286.0,285.758,286.0,42100,287.0,284.0
96,2015/01/20,289.0,288.283,287.0,62300,289.0,286.0
97,2015/01/21,287.0,286.39,289.0,42300,289.0,284.0
98,2015/01/22,286.0,285.07,285.0,30000,286.0,284.0
99,2015/01/23,288.0,286.534,288.0,40300,288.0,285.0
100,2015/01/26,287.0,286.452,288.0,60400,289.0,285.0
101,2015/01/27,288.0,287.63,288.0,26200,289.0,287.0
102,2015/01/28,290.0,288.655,289.0,37400,290.0,287.0
103,2015/01/29,291.0,289.565,290.0,60400,291.0,288.0
104,2015/01/30,290.0,289.625,289.0,38700,291.0,289.0
105,2015/02/02,290.0,289.028,289.0,28200,290.0,288.0
106,2015/02/03,286.0,287.46,291.0,111700,291.0,285.0
107,2015/02/04,288.0,286.352,288.0,56200,288.0,285.0
108,2015/02/05,286.0,286.055,287.0,45600,288.0,285.0
109,2015/02/06,285.0,284.862,286.0,69500,288.0,284.0
110,2015/02/09,287.0,286.302,287.0,24800,287.0,285.0
111,2015/02/10,287.0,286.251,286.0,31500,288.0,285.0
112,2015/02/12,288.0,287.535,287.0,66300,289.0,285.0
113,2015/02/13,288.0,287.794,288.0,39700,289.0,286.0
114,2015/02/16,284.0,286.631,288.0,129100,289.0,284.0
115,2015/02/17,283.0,283.454,284.0,152600,285.0,282.0
116,2015/02/18,285.0,282.895,282.0,145800,285.0,282.0
117,2015/02/19,283.0,283.743,285.0,136400,286.0,283.0
118,2015/02/20,285.0,283.733,284.0,175400,285.0,282.0
119,2015/02/23,285.0,285.539,285.0,181000,287.0,285.0
120,2015/02/24,287.0,286.218,286.0,243500,287.0,285.0
121,2015/02/25,278.0,279.096,280.0,252700,281.0,277.0
122,2015/02/26,277.0,277.47,278.0,134800,279.0,276.0
123,2015/02/27,277.0,276.203,277.0,81700,278.0,275.0
124,2015/03/02,275.0,275.281,275.0,112300,277.0,274.0
125,2015/03/03,276.0,276.165,277.0,50800,278.0,275.0
126,2015/03/04,273.0,273.745,276.0,76000,276.0,272.0
127,2015/03/05,271.0,272.235,274.0,64200,274.0,271.0
128,2015/03/06,272.0,271.937,271.0,53900,274.0,271.0
129,2015/03/09,273.0,273.478,274.0,71900,275.0,272.0
130,2015/03/10,272.0,272.805,274.0,71200,275.0,271.0
131,2015/03/11,272.0,271.207,272.0,57900,273.0,270.0
132,2015/03/12,273.0,271.842,272.0,51800,274.0,270.0
133,2015/03/13,275.0,273.599,274.0,168100,276.0,272.0
134,2015/03/16,282.0,279.477,277.0,227700,282.0,276.0
135,2015/03/17,282.0,282.027,283.0,54900,283.0,280.0
136,2015/03/18,279.0,279.464,280.0,72900,281.0,278.0
137,2015/03/19,281.0,279.411,279.0,76000,282.0,278.0
138,2015/03/20,281.0,280.343,280.0,44300,282.0,279.0
139,2015/03/23,282.0,281.198,282.0,67600,283.0,280.0
140,2015/03/24,280.0,279.941,282.0,86400,282.0,279.0
141,2015/03/25,279.0,279.136,279.0,59600,281.0,278.0
142,2015/03/26,280.0,277.82,280.0,82200,280.0,276.0
143,2015/03/27,277.0,277.908,277.0,46900,280.0,277.0
144,2015/03/30,278.0,277.722,277.0,21600,279.0,277.0
145,2015/03/31,281.0,279.161,279.0,61000,281.0,278.0
146,2015/04/01,279.0,279.159,281.0,33300,281.0,277.0
147,2015/04/02,280.0,279.791,281.0,35900,281.0,279.0
148,2015/04/03,281.0,279.431,280.0,61200,281.0,278.0
149,2015/04/06,281.0,279.796,279.0,53300,281.0,279.0
150,2015/04/07,282.0,281.847,280.0,104800,284.0,280.0
151,2015/04/08,290.0,288.647,287.0,423300,292.0,285.0
152,2015/04/09,286.0,288.861,291.0,166200,291.0,286.0
153,2015/04/10,284.0,284.407,287.0,88600,287.0,283.0
154,2015/04/13,285.0,284.511,285.0,54000,286.0,283.0
155,2015/04/14,292.0,287.136,285.0,177000,292.0,284.0
156,2015/04/15,311.0,317.927,320.0,2897900,327.0,311.0
157,2015/04/16,300.0,304.727,311.0,663300,311.0,299.0
158,2015/04/17,308.0,305.65,300.0,272300,309.0,300.0
159,2015/04/20,300.0,303.128,305.0,201600,308.0,299.0
160,2015/04/21,300.0,297.56,300.0,220300,301.0,295.0
161,2015/04/22,303.0,301.887,300.0,166800,305.0,298.0
162,2015/04/23,304.0,303.611,303.0,102400,305.0,303.0
163,2015/04/24,307.0,307.306,305.0,205800,309.0,304.0
164,2015/04/27,309.0,307.099,308.0,182400,309.0,305.0
165,2015/04/28,309.0,309.266,308.0,157200,312.0,306.0
166,2015/04/30,306.0,305.771,306.0,133800,309.0,303.0
167,2015/05/01,302.0,301.168,304.0,144700,305.0,298.0
168,2015/05/07,304.0,302.223,303.0,72800,304.0,300.0
169,2015/05/08,304.0,302.66,300.0,65300,304.0,300.0
170,2015/05/11,304.0,301.94,304.0,128400,304.0,300.0
171,2015/05/12,300.0,300.972,304.0,101200,304.0,300.0
172,2015/05/13,302.0,299.904,299.0,69900,302.0,299.0
173,2015/05/14,314.0,310.598,302.0,1240600,317.0,301.0
174,2015/05/15,312.0,309.67,314.0,310400,314.0,306.0
175,2015/05/18,309.0,311.624,312.0,368900,314.0,309.0
176,2015/05/19,313.0,312.302,310.0,456000,316.0,308.0
177,2015/05/20,313.0,312.867,315.0,159200,315.0,311.0
178,2015/05/21,319.0,314.517,313.0,354600,319.0,311.0
179,2015/05/22,317.0,318.009,318.0,602800,323.0,313.0
180,2015/05/25,309.0,312.317,315.0,232100,319.0,309.0
181,2015/05/26,303.0,304.821,308.0,200400,309.0,302.0
182,2015/05/27,304.0,304.638,303.0,98100,306.0,303.0
183,2015/05/28,303.0,303.824,307.0,120100,307.0,302.0
184,2015/05/29,302.0,301.979,302.0,43400,304.0,301.0
185,2015/06/01,303.0,302.975,302.0,39900,304.0,302.0
186,2015/06/02,303.0,303.897,306.0,52200,306.0,302.0
187,2015/06/03,304.0,302.448,303.0,65600,304.0,301.0
188,2015/06/04,302.0,303.228,304.0,54000,305.0,302.0
189,2015/06/05,301.0,301.753,302.0,54300,303.0,301.0
190,2015/06/08,301.0,301.118,301.0,84100,303.0,300.0
191,2015/06/09,296.0,298.269,300.0,123300,300.0,296.0
192,2015/06/10,296.0,295.927,295.0,75000,298.0,295.0
193,2015/06/11,300.0,297.871,296.0,55200,300.0,295.0
194,2015/06/12,300.0,300.965,300.0,46000,303.0,299.0
195,2015/06/15,298.0,297.536,296.0,70900,300.0,296.0
196,2015/06/16,297.0,297.177,297.0,18100,298.0,297.0
197,2015/06/17,294.0,295.102,297.0,76400,298.0,294.0
198,2015/06/18,288.0,290.864,294.0,191000,295.0,287.0
199,2015/06/19,288.0,287.574,289.0,69900,289.0,286.0
200,2015/06/22,289.0,288.455,288.0,63300,291.0,287.0
201,2015/06/23,285.0,286.573,289.0,202600,291.0,285.0
202,2015/06/24,284.0,284.115,286.0,142700,287.0,283.0
203,2015/06/25,288.0,285.364,284.0,161700,290.0,283.0
204,2015/06/26,284.0,285.945,289.0,56700,289.0,284.0
205,2015/06/29,281.0,280.182,280.0,151000,281.0,279.0
206,2015/06/30,281.0,280.014,279.0,79000,282.0,279.0
207,2015/07/01,283.0,281.196,280.0,68900,284.0,280.0
208,2015/07/02,289.0,287.19,286.0,105300,291.0,284.0
209,2015/07/03,283.0,284.659,288.0,69200,288.0,283.0
210,2015/07/06,280.0,281.238,282.0,53800,283.0,280.0
211,2015/07/07,285.0,285.063,283.0,55300,288.0,282.0
212,2015/07/08,280.0,281.155,285.0,129000,286.0,280.0
213,2015/07/09,278.0,270.222,278.0,334200,279.0,260.0
214,2015/07/10,272.0,276.866,280.0,132200,280.0,272.0
215,2015/07/13,278.0,278.273,276.0,78100,280.0,275.0
216,2015/07/14,288.0,289.714,282.0,313500,300.0,281.0
217,2015/07/15,274.0,274.077,280.0,604300,280.0,270.0
218,2015/07/16,273.0,272.509,275.0,111900,275.0,271.0
219,2015/07/17,271.0,272.186,274.0,99400,275.0,271.0
220,2015/07/21,273.0,272.889,273.0,61300,274.0,271.0
221,2015/07/22,272.0,272.576,273.0,55200,274.0,271.0
222,2015/07/23,272.0,272.679,273.0,49800,274.0,272.0
223,2015/07/24,272.0,272.867,273.0,33700,274.0,272.0
224,2015/07/27,271.0,272.04,272.0,70700,274.0,271.0
225,2015/07/28,271.0,270.914,271.0,66400,273.0,270.0
226,2015/07/29,270.0,270.916,273.0,49800,273.0,270.0
227,2015/07/30,269.0,269.19,270.0,68800,271.0,268.0
228,2015/07/31,268.0,268.33,269.0,66400,270.0,267.0
229,2015/08/03,269.0,268.006,269.0,35100,269.0,267.0
230,2015/08/04,269.0,270.004,271.0,24300,271.0,269.0
231,2015/08/05,267.0,267.791,269.0,80200,270.0,266.0
232,2015/08/06,265.0,266.571,267.0,59400,268.0,265.0
233,2015/08/07,263.0,263.934,263.0,80300,266.0,263.0
234,2015/08/10,262.0,262.851,263.0,51000,264.0,262.0
235,2015/08/11,266.0,264.708,262.0,45900,267.0,262.0
236,2015/08/12,261.0,262.95,266.0,60100,266.0,261.0
237,2015/08/13,264.0,262.993,262.0,29600,265.0,262.0
238,2015/08/14,265.0,265.533,265.0,22700,267.0,264.0
239,2015/08/17,266.0,267.846,268.0,40200,270.0,266.0
240,2015/08/18,270.0,270.674,269.0,50000,272.0,268.0
241,2015/08/19,269.0,270.586,270.0,26800,272.0,269.0
242,2015/08/20,264.0,266.067,268.0,38800,268.0,264.0
243,2015/08/21,262.0,262.435,262.0,93300,266.0,261.0
244,2015/08/24,243.0,250.28,257.0,217700,258.0,241.0
245,2015/08/25,233.0,231.428,224.0,225400,246.0,221.0
246,2015/08/26,245.0,241.067,241.0,70700,245.0,239.0
247,2015/08/27,248.0,247.986,246.0,49800,252.0,246.0
248,2015/08/28,250.0,250.926,251.0,31100,254.0,249.0
249,2015/08/31,249.0,250.296,251.0,21300,253.0,249.0
250,2015/09/01,245.0,246.927,250.0,21900,250.0,244.0
251,2015/09/02,241.0,241.887,242.0,30000,245.0,240.0
252,2015/09/03,241.0,242.781,242.0,31000,246.0,241.0
253,2015/09/04,240.0,241.242,241.0,16100,244.0,240.0
254,2015/09/07,237.0,236.77,239.0,31300,239.0,235.0
255,2015/09/08,233.0,234.16,235.0,40000,237.0,231.0
256,2015/09/09,240.0,238.1,233.0,40200,241.0,233.0
257,2015/09/10,247.0,243.031,240.0,19100,248.0,239.0
258,2015/09/11,248.0,248.944,243.0,19800,251.0,243.0
259,2015/09/14,248.0,249.887,249.0,23100,253.0,246.0
260,2015/09/15,244.0,245.972,250.0,28100,250.0,244.0
261,2015/09/16,243.0,243.238,245.0,24400,246.0,240.0
262,2015/09/17,242.0,242.447,243.0,28200,247.0,240.0
263,2015/09/18,242.0,242.33,242.0,10600,244.0,241.0
264,2015/09/24,239.0,240.231,243.0,22900,243.0,237.0
265,2015/09/25,240.0,240.23,239.0,18300,242.0,238.0
266,2015/09/28,243.0,241.608,241.0,10200,243.0,241.0
267,2015/09/29,238.0,238.388,244.0,28900,244.0,235.0
268,2015/09/30,239.0,239.326,238.0,9500,242.0,238.0
269,2015/10/01,241.0,239.717,240.0,12700,241.0,238.0
270,2015/10/02,240.0,241.246,243.0,30900,243.0,239.0
271,2015/10/05,241.0,240.644,239.0,30900,243.0,239.0
272,2015/10/06,243.0,242.846,243.0,24600,244.0,240.0
273,2015/10/07,246.0,244.708,244.0,46900,248.0,243.0
274,2015/10/08,249.0,247.541,247.0,29200,250.0,245.0
275,2015/10/09,249.0,248.523,250.0,21800,250.0,247.0
276,2015/10/13,246.0,247.858,247.0,56500,250.0,246.0
277,2015/10/14,244.0,245.921,246.0,46700,250.0,244.0
278,2015/10/15,244.0,244.388,244.0,20600,248.0,242.0
279,2015/10/16,248.0,247.478,246.0,49200,252.0,244.0
280,2015/10/19,246.0,247.86,248.0,33600,250.0,246.0
281,2015/10/20,245.0,245.399,247.0,19800,247.0,244.0
282,2015/10/21,245.0,244.446,245.0,22200,246.0,244.0
283,2015/10/22,247.0,247.103,246.0,42900,250.0,245.0
284,2015/10/23,245.0,247.284,248.0,76500,250.0,245.0
285,2015/10/26,250.0,250.505,253.0,97400,255.0,246.0
286,2015/10/27,252.0,252.644,253.0,26100,254.0,251.0
287,2015/10/28,254.0,254.613,254.0,38500,257.0,253.0
288,2015/10/29,255.0,256.305,255.0,40700,258.0,255.0
289,2015/10/30,258.0,257.163,258.0,29400,258.0,256.0
290,2015/11/02,260.0,257.885,259.0,21700,260.0,256.0
291,2015/11/04,256.0,259.749,260.0,55300,262.0,256.0
292,2015/11/05,258.0,255.142,256.0,23200,258.0,252.0
293,2015/11/06,257.0,257.137,259.0,12400,259.0,255.0
294,2015/11/09,257.0,257.567,257.0,20300,260.0,256.0
295,2015/11/10,257.0,257.445,259.0,13700,259.0,256.0
296,2015/11/11,258.0,257.0,256.0,15200,259.0,256.0
297,2015/11/12,257.0,258.192,259.0,17200,260.0,257.0
298,2015/11/13,256.0,256.791,257.0,20600,258.0,255.0
299,2015/11/16,257.0,257.35,256.0,35400,259.0,256.0
300,2015/11/17,257.0,256.215,258.0,43200,259.0,254.0
301,2015/11/18,257.0,258.405,258.0,45200,260.0,257.0
302,2015/11/19,258.0,257.623,258.0,36300,259.0,256.0
303,2015/11/20,261.0,260.105,259.0,73200,262.0,258.0
304,2015/11/24,269.0,268.729,265.0,149600,272.0,265.0
305,2015/11/25,276.0,275.504,271.0,225300,280.0,271.0
306,2015/11/26,273.0,272.942,273.0,44700,275.0,272.0
307,2015/11/27,272.0,271.365,272.0,40000,273.0,270.0
308,2015/11/30,272.0,273.133,273.0,45200,275.0,272.0
309,2015/12/01,275.0,274.698,273.0,57000,276.0,273.0
310,2015/12/02,277.0,276.932,277.0,30700,278.0,276.0
311,2015/12/03,275.0,276.302,277.0,38800,278.0,275.0
312,2015/12/04,272.0,272.59,273.0,44400,276.0,271.0
313,2015/12/07,276.0,274.581,274.0,22900,276.0,273.0
314,2015/12/08,271.0,273.625,275.0,33900,276.0,271.0
315,2015/12/09,270.0,270.275,273.0,41900,273.0,268.0
316,2015/12/10,264.0,264.74,268.0,94000,269.0,261.0
317,2015/12/11,267.0,265.759,265.0,22000,268.0,264.0
318,2015/12/14,265.0,263.566,263.0,33200,266.0,262.0
319,2015/12/15,261.0,263.958,267.0,48100,268.0,260.0
320,2015/12/16,263.0,262.88,263.0,40900,264.0,262.0
321,2015/12/17,264.0,264.748,263.0,37700,268.0,263.0
322,2015/12/18,264.0,264.513,267.0,95400,268.0,262.0
323,2015/12/21,263.0,261.655,264.0,49500,264.0,260.0
324,2015/12/22,258.0,258.456,260.0,76500,263.0,256.0
325,2015/12/24,260.0,259.204,260.0,72700,260.0,257.0
326,2015/12/25,259.0,258.456,261.0,59700,261.0,257.0
327,2015/12/28,260.0,257.266,259.0,39500,260.0,255.0
328,2015/12/29,265.0,262.822,262.0,21900,265.0,261.0
329,2015/12/30,266.0,265.063,265.0,25300,266.0,263.0
330,2016/01/04,268.0,266.136,267.0,29400,268.0,264.0
331,2016/01/05,269.0,268.02,270.0,40500,271.0,262.0
332,2016/01/06,267.0,268.547,270.0,22300,270.0,266.0
333,2016/01/07,263.0,264.068,267.0,39700,268.0,261.0
334,2016/01/08,262.0,261.301,261.0,52200,264.0,259.0
335,2016/01/12,255.0,258.048,259.0,62400,261.0,254.0
336,2016/01/13,259.0,261.3,264.0,70000,265.0,255.0
337,2016/01/14,256.0,252.792,256.0,87800,259.0,246.0
338,2016/01/15,254.0,256.324,256.0,35800,259.0,253.0
339,2016/01/18,250.0,249.59,250.0,59200,252.0,247.0
340,2016/01/19,254.0,252.035,251.0,34800,257.0,250.0
341,2016/01/20,243.0,246.806,254.0,92700,255.0,242.0
342,2016/01/21,242.0,243.687,243.0,37100,246.0,242.0
343,2016/01/22,248.0,245.489,245.0,27600,248.0,244.0
344,2016/01/25,253.0,251.612,250.0,20100,254.0,250.0
345,2016/01/26,254.0,253.566,253.0,19600,255.0,252.0
346,2016/01/27,257.0,255.696,257.0,16800,257.0,254.0
347,2016/01/28,258.0,257.83,257.0,14700,259.0,256.0
348,2016/01/29,261.0,260.152,259.0,53400,263.0,256.0
349,2016/02/01,263.0,263.212,264.0,34000,265.0,262.0
350,2016/02/02,265.0,266.191,265.0,57600,268.0,264.0
351,2016/02/03,261.0,261.556,262.0,48200,267.0,258.0
352,2016/02/04,259.0,257.865,263.0,33200,263.0,253.0
353,2016/02/05,258.0,255.214,256.0,38800,260.0,252.0
354,2016/02/08,259.0,256.087,257.0,21900,259.0,254.0
355,2016/02/09,254.0,252.294,254.0,41800,255.0,250.0
356,2016/02/10,247.0,246.333,252.0,99100,252.0,242.0
357,2016/02/12,238.0,234.547,235.0,124800,240.0,231.0
358,2016/02/15,244.0,242.956,246.0,72700,246.0,239.0
359,2016/02/16,249.0,245.792,242.0,38400,249.0,242.0
360,2016/02/17,245.0,244.417,245.0,53500,248.0,242.0
361,2016/02/18,246.0,245.788,246.0,62700,250.0,243.0
362,2016/02/19,247.0,245.377,244.0,14600,248.0,244.0
363,2016/02/22,248.0,248.607,248.0,65600,250.0,246.0
364,2016/02/23,249.0,248.531,248.0,49000,250.0,247.0
365,2016/02/24,251.0,249.38,247.0,93900,252.0,247.0
366,2016/02/25,238.0,238.832,240.0,94700,241.0,237.0
367,2016/02/26,237.0,236.598,239.0,58000,240.0,235.0
368,2016/02/29,236.0,237.634,239.0,22700,240.0,236.0
369,2016/03/01,236.0,236.202,237.0,18800,238.0,235.0
370,2016/03/02,235.0,236.359,240.0,54000,240.0,234.0
371,2016/03/03,236.0,236.501,236.0,36300,239.0,235.0
372,2016/03/04,236.0,236.798,236.0,32700,238.0,236.0
373,2016/03/07,237.0,237.887,238.0,53900,239.0,236.0
374,2016/03/08,237.0,236.916,237.0,28600,238.0,236.0
375,2016/03/09,237.0,236.987,237.0,15800,238.0,236.0
376,2016/03/10,236.0,236.412,237.0,30800,237.0,235.0
377,2016/03/11,239.0,238.081,236.0,45700,240.0,236.0
378,2016/03/14,237.0,237.946,239.0,61200,239.0,237.0
379,2016/03/15,240.0,238.919,238.0,23400,240.0,238.0
380,2016/03/16,239.0,239.921,240.0,13900,241.0,239.0
381,2016/03/17,239.0,240.625,241.0,37900,242.0,239.0
382,2016/03/18,239.0,239.178,239.0,19100,240.0,238.0
383,2016/03/22,241.0,240.206,240.0,17000,241.0,239.0
384,2016/03/23,241.0,241.295,241.0,30500,242.0,240.0
385,2016/03/24,242.0,242.265,242.0,29800,243.0,241.0
386,2016/03/25,242.0,242.81,242.0,36900,244.0,242.0
387,2016/03/28,245.0,245.225,244.0,69400,247.0,244.0
388,2016/03/29,248.0,246.289,245.0,34900,248.0,245.0
389,2016/03/30,248.0,247.75,248.0,28000,249.0,247.0
390,2016/03/31,247.0,247.808,248.0,21300,248.0,247.0
391,2016/04/01,240.0,243.588,246.0,60400,246.0,240.0
392,2016/04/04,243.0,243.908,242.0,40300,246.0,242.0
393,2016/04/05,237.0,239.638,243.0,77100,243.0,236.0
394,2016/04/06,237.0,237.572,237.0,26400,240.0,237.0
395,2016/04/07,240.0,238.271,237.0,11800,240.0,237.0
396,2016/04/08,241.0,239.032,239.0,40200,241.0,238.0
397,2016/04/11,246.0,243.442,242.0,35500,246.0,242.0
398,2016/04/12,246.0,248.096,247.0,122500,251.0,245.0
399,2016/04/13,233.0,235.974,240.0,401200,241.0,232.0
400,2016/04/14,236.0,234.313,234.0,111200,237.0,233.0
401,2016/04/15,233.0,234.199,236.0,118800,237.0,232.0
402,2016/04/18,232.0,231.714,232.0,177400,234.0,230.0
403,2016/04/19,230.0,232.182,233.0,74600,234.0,230.0
404,2016/04/20,234.0,233.313,232.0,52100,234.0,232.0
405,2016/04/21,234.0,234.248,235.0,52500,235.0,233.0
406,2016/04/22,234.0,234.658,235.0,44500,235.0,234.0
407,2016/04/25,236.0,235.263,234.0,37200,236.0,234.0
408,2016/04/26,234.0,235.43,236.0,35600,237.0,234.0
409,2016/04/27,235.0,235.57,235.0,34900,236.0,235.0
410,2016/04/28,232.0,233.596,234.0,61200,236.0,231.0
411,2016/05/02,230.0,228.762,228.0,53400,230.0,226.0
412,2016/05/06,231.0,230.402,231.0,36600,232.0,228.0
413,2016/05/09,234.0,231.979,231.0,29000,234.0,231.0
414,2016/05/10,232.0,233.265,234.0,52000,234.0,232.0
415,2016/05/11,234.0,233.088,233.0,32800,234.0,232.0
416,2016/05/12,232.0,233.205,234.0,36100,234.0,232.0
417,2016/05/13,231.0,232.759,232.0,33600,234.0,231.0
418,2016/05/16,232.0,232.22,231.0,26400,233.0,231.0
419,2016/05/17,231.0,231.96,232.0,20000,233.0,231.0
420,2016/05/18,230.0,231.616,231.0,34400,233.0,230.0
421,2016/05/19,233.0,231.703,230.0,31000,233.0,230.0
422,2016/05/20,232.0,230.992,231.0,37400,232.0,230.0
423,2016/05/23,231.0,230.783,232.0,44300,232.0,229.0
424,2016/05/24,230.0,231.773,231.0,34300,233.0,230.0
425,2016/05/25,232.0,230.931,231.0,29100,232.0,230.0
426,2016/05/26,231.0,232.425,233.0,7300,233.0,231.0
427,2016/05/27,232.0,230.908,231.0,10900,232.0,230.0
428,2016/05/30,230.0,231.119,232.0,13400,232.0,230.0
429,2016/05/31,232.0,230.732,232.0,14900,232.0,230.0
430,2016/06/01,233.0,232.268,232.0,35100,233.0,230.0
431,2016/06/02,230.0,232.436,234.0,52100,234.0,230.0
432,2016/06/03,230.0,230.726,230.0,48500,232.0,230.0
433,2016/06/06,231.0,230.344,231.0,33100,232.0,229.0
434,2016/06/07,231.0,231.481,232.0,26800,232.0,230.0
435,2016/06/08,232.0,232.28,232.0,25000,233.0,232.0
436,2016/06/09,232.0,232.546,232.0,30400,233.0,232.0
437,2016/06/10,232.0,231.923,232.0,27100,233.0,231.0
438,2016/06/13,228.0,230.065,230.0,44500,232.0,228.0
439,2016/06/14,227.0,228.695,229.0,25600,230.0,227.0
440,2016/06/15,225.0,225.855,227.0,31000,227.0,225.0
441,2016/06/16,222.0,222.236,225.0,27100,227.0,218.0
442,2016/06/17,224.0,223.603,221.0,67700,224.0,221.0
443,2016/06/20,223.0,223.351,225.0,7700,225.0,221.0
444,2016/06/21,221.0,222.019,225.0,5200,225.0,221.0
445,2016/06/22,219.0,219.646,220.0,11000,221.0,219.0
446,2016/06/23,218.0,219.105,219.0,7600,221.0,218.0
447,2016/06/24,204.0,212.778,225.0,92900,225.0,204.0
448,2016/06/27,205.0,202.063,200.0,32000,208.0,199.0
449,2016/06/28,203.0,203.926,206.0,20300,206.0,202.0
450,2016/06/29,206.0,207.528,208.0,19500,211.0,206.0
451,2016/06/30,210.0,208.733,208.0,13500,210.0,207.0
452,2016/07/01,209.0,209.086,211.0,12800,211.0,208.0
453,2016/07/04,212.0,212.147,211.0,108600,216.0,209.0
454,2016/07/05,207.0,206.748,209.0,91500,210.0,204.0
455,2016/07/06,204.0,205.115,207.0,33100,207.0,204.0
456,2016/07/07,205.0,204.243,206.0,29200,207.0,203.0
457,2016/07/08,203.0,204.326,204.0,24200,207.0,203.0
458,2016/07/11,205.0,205.158,204.0,12000,207.0,204.0
459,2016/07/12,211.0,208.158,209.0,177500,215.0,205.0
460,2016/07/13,205.0,206.185,208.0,108300,209.0,204.0
461,2016/07/14,204.0,205.015,205.0,27600,207.0,204.0
462,2016/07/15,202.0,203.721,205.0,66200,206.0,202.0
463,2016/07/19,202.0,202.773,204.0,17600,205.0,202.0
464,2016/07/20,203.0,202.5,202.0,19400,204.0,202.0
465,2016/07/21,203.0,204.006,206.0,16700,206.0,203.0
466,2016/07/22,201.0,202.953,204.0,81600,206.0,201.0
467,2016/07/25,202.0,202.343,203.0,21600,203.0,201.0
468,2016/07/26,201.0,201.62,202.0,13700,202.0,201.0
469,2016/07/27,202.0,204.258,202.0,244000,211.0,201.0
470,2016/07/28,202.0,202.697,203.0,36300,203.0,202.0
471,2016/07/29,203.0,202.387,202.0,42400,204.0,201.0
472,2016/08/01,203.0,202.595,202.0,8400,203.0,202.0
473,2016/08/02,203.0,203.606,204.0,17500,204.0,202.0
474,2016/08/03,202.0,201.971,201.0,17000,203.0,201.0
475,2016/08/04,203.0,202.708,202.0,31200,204.0,201.0
476,2016/08/05,201.0,201.724,202.0,34000,204.0,201.0
477,2016/08/08,200.0,201.325,203.0,43100,204.0,200.0
478,2016/08/09,201.0,200.726,201.0,10200,202.0,200.0
479,2016/08/10,200.0,200.281,201.0,39800,202.0,200.0
480,2016/08/12,202.0,201.097,201.0,10300,202.0,201.0
481,2016/08/15,202.0,200.865,201.0,22200,202.0,200.0
482,2016/08/16,201.0,200.977,201.0,12800,202.0,200.0
483,2016/08/17,200.0,201.112,201.0,14300,202.0,200.0
484,2016/08/18,200.0,200.343,200.0,17200,201.0,200.0
485,2016/08/19,200.0,200.14,200.0,10700,201.0,200.0
486,2016/08/22,200.0,200.295,201.0,12200,201.0,200.0
487,2016/08/23,200.0,200.047,200.0,29700,201.0,200.0
488,2016/08/24,201.0,200.777,200.0,17000,202.0,200.0
489,2016/08/25,200.0,200.587,202.0,15000,202.0,200.0
490,2016/08/26,200.0,199.975,200.0,20100,201.0,199.0
491,2016/08/29,200.0,200.277,200.0,11200,201.0,200.0
492,2016/08/30,200.0,200.464,200.0,11000,201.0,200.0
493,2016/08/31,200.0,200.442,200.0,7700,201.0,200.0
494,2016/09/01,200.0,200.264,201.0,9100,201.0,200.0
495,2016/09/02,200.0,201.439,202.0,31200,202.0,200.0
496,2016/09/05,200.0,200.406,200.0,60100,201.0,200.0
497,2016/09/06,201.0,199.579,200.0,188800,201.0,197.0
498,2016/09/07,201.0,200.32,200.0,12200,201.0,199.0
499,2016/09/08,201.0,200.626,201.0,24300,201.0,199.0
500,2016/09/09,200.0,200.029,200.0,13800,201.0,200.0
501,2016/09/12,200.0,200.862,201.0,36100,202.0,200.0
502,2016/09/13,200.0,200.029,200.0,10400,201.0,200.0
503,2016/09/14,199.0,199.51,200.0,19200,200.0,199.0
504,2016/09/15,199.0,199.0,199.0,16100,200.0,198.0
505,2016/09/16,198.0,198.154,198.0,27300,199.0,198.0
506,2016/09/20,198.0,198.254,198.0,17700,199.0,198.0
507,2016/09/21,199.0,198.794,198.0,14100,199.0,198.0
508,2016/09/23,199.0,198.614,199.0,12700,199.0,198.0
509,2016/09/26,198.0,198.38,199.0,49200,199.0,198.0
510,2016/09/27,198.0,198.437,198.0,34300,199.0,197.0
511,2016/09/28,199.0,198.26,198.0,5000,199.0,198.0
512,2016/09/29,198.0,198.233,198.0,8600,199.0,198.0
513,2016/09/30,198.0,198.609,198.0,19700,200.0,198.0
514,2016/10/03,200.0,198.816,198.0,20100,200.0,198.0
515,2016/10/04,200.0,200.592,201.0,18400,201.0,199.0
516,2016/10/05,199.0,199.536,199.0,17900,200.0,199.0
517,2016/10/06,200.0,199.798,200.0,12400,201.0,199.0
518,2016/10/07,200.0,200.112,200.0,16900,201.0,199.0
519,2016/10/11,202.0,201.626,200.0,54000,205.0,200.0
520,2016/10/12,199.0,199.975,202.0,81300,202.0,198.0
521,2016/10/13,199.0,199.949,200.0,25700,201.0,199.0
522,2016/10/14,200.0,199.415,199.0,24800,200.0,199.0
523,2016/10/17,199.0,198.803,200.0,81600,200.0,198.0
524,2016/10/18,198.0,198.12,199.0,10800,199.0,198.0
525,2016/10/19,198.0,197.844,198.0,48800,199.0,197.0
526,2016/10/20,200.0,199.033,199.0,18200,200.0,198.0
527,2016/10/21,199.0,199.38,200.0,25500,200.0,198.0
528,2016/10/24,202.0,201.096,200.0,41700,202.0,200.0
529,2016/10/25,204.0,204.482,203.0,87600,207.0,201.0
530,2016/10/26,207.0,206.585,206.0,56200,208.0,205.0
531,2016/10/27,206.0,205.27,208.0,50300,208.0,204.0
532,2016/10/28,207.0,206.791,206.0,28700,208.0,206.0
533,2016/10/31,206.0,205.586,208.0,28000,208.0,204.0
534,2016/11/01,208.0,205.04,205.0,17400,208.0,204.0
535,2016/11/02,209.0,209.717,209.0,105900,213.0,205.0
536,2016/11/04,205.0,205.065,206.0,42800,208.0,203.0
537,2016/11/07,209.0,208.871,208.0,22400,210.0,208.0
538,2016/11/08,208.0,208.607,209.0,16300,210.0,207.0
539,2016/11/09,202.0,204.181,208.0,55300,209.0,202.0
540,2016/11/10,205.0,205.888,208.0,21500,208.0,203.0
541,2016/11/11,206.0,205.277,205.0,39700,206.0,205.0
542,2016/11/14,206.0,206.548,207.0,32300,208.0,205.0
543,2016/11/15,204.0,204.637,206.0,35000,206.0,204.0
544,2016/11/16,205.0,205.072,205.0,22100,206.0,204.0
545,2016/11/17,205.0,205.439,205.0,16400,206.0,205.0
546,2016/11/18,207.0,205.827,205.0,8100,207.0,205.0
547,2016/11/21,208.0,207.152,207.0,32800,208.0,206.0
548,2016/11/22,207.0,208.243,207.0,26700,212.0,206.0
549,2016/11/24,209.0,208.406,209.0,45600,209.0,207.0
550,2016/11/25,208.0,208.553,209.0,35100,210.0,207.0
551,2016/11/28,212.0,209.817,209.0,72100,214.0,208.0
552,2016/11/29,215.0,213.526,213.0,23400,215.0,212.0
553,2016/11/30,217.0,217.66,217.0,66200,220.0,215.0
554,2016/12/01,217.0,217.719,218.0,29900,219.0,217.0
555,2016/12/02,222.0,220.185,219.0,68500,223.0,217.0
556,2016/12/05,217.0,219.75,221.0,57300,221.0,217.0
557,2016/12/06,215.0,215.162,216.0,35100,217.0,213.0
558,2016/12/07,216.0,215.757,215.0,52200,218.0,214.0
559,2016/12/08,219.0,217.48,216.0,73700,221.0,216.0
560,2016/12/09,218.0,219.327,217.0,69400,220.0,217.0
561,2016/12/12,216.0,217.579,218.0,97000,218.0,216.0
562,2016/12/13,217.0,216.399,216.0,27600,218.0,216.0
563,2016/12/14,215.0,215.561,216.0,51000,217.0,214.0
564,2016/12/15,214.0,215.058,215.0,44800,216.0,214.0
565,2016/12/16,213.0,214.079,214.0,47100,215.0,213.0
566,2016/12/19,215.0,213.906,213.0,39300,215.0,213.0
567,2016/12/20,214.0,214.836,215.0,51800,216.0,214.0
568,2016/12/21,214.0,215.386,215.0,35500,217.0,214.0
569,2016/12/22,214.0,214.356,215.0,43000,215.0,214.0
570,2016/12/26,211.0,211.903,212.0,92500,213.0,211.0
571,2016/12/27,212.0,211.472,211.0,59600,213.0,211.0
572,2016/12/28,215.0,214.621,213.0,22700,216.0,213.0
573,2016/12/29,216.0,214.684,216.0,34500,216.0,211.0
574,2016/12/30,215.0,216.036,216.0,19700,217.0,215.0
575,2017/01/04,219.0,217.361,216.0,43800,219.0,216.0
576,2017/01/05,220.0,220.119,219.0,73100,221.0,218.0
577,2017/01/06,224.0,222.152,222.0,77000,224.0,220.0
578,2017/01/10,223.0,224.796,225.0,39700,227.0,223.0
579,2017/01/11,224.0,224.474,223.0,29100,226.0,222.0
580,2017/01/12,226.0,224.556,224.0,63800,227.0,222.0
581,2017/01/13,226.0,223.264,223.0,50100,226.0,221.0
582,2017/01/16,225.0,225.239,225.0,46500,227.0,223.0
583,2017/01/17,223.0,224.549,223.0,15300,226.0,223.0
584,2017/01/18,224.0,223.456,223.0,14700,225.0,222.0
585,2017/01/19,225.0,223.8,223.0,19000,225.0,223.0
586,2017/01/20,225.0,225.015,225.0,26700,226.0,225.0
587,2017/01/23,226.0,226.249,225.0,41700,229.0,225.0
588,2017/01/24,226.0,226.383,227.0,14900,228.0,225.0
589,2017/01/25,229.0,228.064,229.0,10900,229.0,227.0
590,2017/01/26,229.0,228.497,229.0,33600,230.0,227.0
591,2017/01/27,230.0,229.739,230.0,43600,231.0,229.0
592,2017/01/30,231.0,229.291,231.0,59500,231.0,227.0
593,2017/01/31,230.0,230.163,231.0,36800,231.0,229.0
594,2017/02/01,230.0,228.81,229.0,22600,230.0,228.0
595,2017/02/02,229.0,229.531,230.0,24100,230.0,229.0
596,2017/02/03,228.0,227.555,228.0,23600,229.0,227.0
597,2017/02/06,226.0,226.403,226.0,44200,227.0,226.0
598,2017/02/07,226.0,225.113,226.0,34500,226.0,224.0
599,2017/02/08,225.0,224.542,224.0,31000,225.0,224.0
600,2017/02/09,222.0,223.521,224.0,50500,225.0,222.0
601,2017/02/10,225.0,224.961,224.0,28400,226.0,224.0
602,2017/02/13,228.0,227.503,228.0,30800,229.0,226.0
603,2017/02/14,229.0,229.259,229.0,73800,231.0,227.0
604,2017/02/15,229.0,230.16,230.0,25600,232.0,229.0
605,2017/02/16,230.0,229.592,230.0,29400,231.0,227.0
606,2017/02/17,231.0,229.764,230.0,29200,231.0,229.0
607,2017/02/20,231.0,229.73,230.0,32600,231.0,228.0
608,2017/02/21,230.0,229.711,230.0,53900,230.0,228.0
609,2017/02/22,227.0,228.35,229.0,74200,230.0,227.0
610,2017/02/23,231.0,229.31,228.0,87300,231.0,228.0
611,2017/02/24,221.0,217.915,216.0,114600,222.0,215.0
612,2017/02/27,221.0,220.272,221.0,31600,222.0,219.0
613,2017/02/28,219.0,220.106,220.0,16000,222.0,219.0
614,2017/03/01,220.0,219.386,220.0,14000,220.0,218.0
615,2017/03/02,220.0,220.192,222.0,38500,222.0,218.0
616,2017/03/03,220.0,219.605,219.0,11400,220.0,219.0
617,2017/03/06,219.0,219.424,220.0,33000,220.0,218.0
618,2017/03/07,218.0,218.154,219.0,16900,219.0,218.0
619,2017/03/08,217.0,217.055,217.0,16500,218.0,216.0
620,2017/03/09,215.0,215.006,217.0,62300,217.0,214.0
621,2017/03/10,215.0,216.022,215.0,22700,217.0,215.0
622,2017/03/13,215.0,215.145,216.0,20700,216.0,215.0
623,2017/03/14,216.0,215.539,215.0,32500,216.0,215.0
624,2017/03/15,216.0,215.808,216.0,17700,217.0,215.0
625,2017/03/16,217.0,214.986,214.0,49600,217.0,212.0
626,2017/03/17,216.0,216.279,217.0,6800,217.0,215.0
627,2017/03/21,216.0,215.867,215.0,9800,217.0,215.0
628,2017/03/22,215.0,213.722,215.0,24800,215.0,212.0
629,2017/03/23,214.0,214.081,215.0,13600,215.0,213.0
630,2017/03/24,213.0,211.886,213.0,41300,214.0,210.0
631,2017/03/27,211.0,211.516,211.0,25200,213.0,210.0
632,2017/03/28,226.0,245.661,219.0,3669800,271.0,219.0
633,2017/03/29,221.0,222.912,230.0,259900,230.0,217.0
634,2017/03/30,219.0,218.457,221.0,68100,222.0,217.0
635,2017/03/31,219.0,219.15,219.0,21300,220.0,218.0
636,2017/04/03,219.0,219.066,220.0,33600,221.0,218.0
637,2017/04/04,219.0,226.944,227.0,267400,239.0,217.0
638,2017/04/05,217.0,217.569,217.0,27600,219.0,217.0
639,2017/04/06,213.0,215.103,218.0,57500,218.0,211.0
640,2017/04/07,214.0,213.732,214.0,26900,217.0,212.0
641,2017/04/10,219.0,217.884,218.0,17200,219.0,216.0
642,2017/04/11,218.0,220.278,219.0,40300,223.0,218.0
643,2017/04/12,224.0,225.774,225.0,329400,236.0,221.0
644,2017/04/13,224.0,223.986,224.0,55000,226.0,222.0
645,2017/04/14,225.0,226.024,224.0,49400,228.0,224.0
646,2017/04/17,230.0,228.08,226.0,71200,231.0,226.0
647,2017/04/18,230.0,230.839,231.0,70200,232.0,228.0
648,2017/04/19,232.0,230.482,230.0,53500,233.0,228.0
649,2017/04/20,234.0,232.505,232.0,90900,235.0,231.0
650,2017/04/21,233.0,233.058,234.0,72400,235.0,231.0
651,2017/04/24,228.0,230.549,233.0,94600,233.0,228.0
652,2017/04/25,229.0,230.217,229.0,52100,232.0,229.0
653,2017/04/26,228.0,230.326,231.0,85500,233.0,228.0
654,2017/04/27,230.0,230.144,230.0,38900,232.0,229.0
655,2017/04/28,230.0,230.12,230.0,46000,231.0,229.0
656,2017/05/01,229.0,229.699,230.0,48800,231.0,228.0
657,2017/05/02,230.0,229.264,229.0,67800,231.0,228.0
658,2017/05/08,230.0,231.133,231.0,81100,233.0,229.0
659,2017/05/09,230.0,231.348,230.0,40000,232.0,230.0
660,2017/05/10,232.0,231.476,230.0,28800,232.0,230.0
661,2017/05/11,231.0,232.546,232.0,55900,234.0,231.0
662,2017/05/12,230.0,231.334,231.0,59000,234.0,229.0
663,2017/05/15,231.0,231.801,230.0,29200,233.0,230.0
664,2017/05/16,231.0,231.919,232.0,25900,232.0,231.0
665,2017/05/17,232.0,231.928,232.0,26200,233.0,231.0
666,2017/05/18,231.0,230.099,232.0,39600,232.0,229.0
667,2017/05/19,231.0,230.728,232.0,34600,232.0,230.0
668,2017/05/22,231.0,231.737,232.0,26600,232.0,231.0
669,2017/05/23,231.0,231.289,232.0,35600,232.0,230.0
670,2017/05/24,231.0,231.79,231.0,24700,232.0,231.0
671,2017/05/25,231.0,230.208,230.0,10600,231.0,230.0
672,2017/05/26,227.0,228.733,230.0,38500,230.0,227.0
673,2017/05/29,228.0,227.497,227.0,19100,230.0,227.0
674,2017/05/30,227.0,227.392,228.0,14800,228.0,227.0
675,2017/05/31,228.0,227.088,227.0,8000,228.0,226.0
676,2017/06/01,231.0,229.679,229.0,31800,231.0,229.0
677,2017/06/02,229.0,230.037,231.0,60300,231.0,228.0
678,2017/06/05,229.0,230.002,229.0,41100,231.0,229.0
679,2017/06/06,231.0,230.478,229.0,38700,232.0,229.0
680,2017/06/07,230.0,229.981,231.0,31400,231.0,229.0
681,2017/06/08,230.0,229.652,230.0,34200,230.0,229.0
682,2017/06/09,231.0,230.496,230.0,23200,231.0,229.0
683,2017/06/12,229.0,229.51,231.0,14500,231.0,228.0
684,2017/06/13,228.0,229.413,230.0,8000,230.0,228.0
685,2017/06/14,230.0,229.093,228.0,9700,230.0,228.0
686,2017/06/15,227.0,228.202,230.0,34200,230.0,227.0
687,2017/06/16,228.0,227.57,227.0,8600,229.0,227.0
688,2017/06/19,228.0,228.0,228.0,12700,229.0,227.0
689,2017/06/20,228.0,228.639,229.0,10800,230.0,228.0
690,2017/06/21,227.0,228.124,228.0,12100,229.0,227.0
691,2017/06/22,228.0,227.787,227.0,8900,229.0,227.0
692,2017/06/23,229.0,229.49,230.0,9600,230.0,228.0
693,2017/06/26,228.0,227.11,229.0,25400,229.0,226.0
694,2017/06/27,227.0,226.688,228.0,8000,228.0,226.0
695,2017/06/28,227.0,227.833,228.0,3000,229.0,227.0
696,2017/06/29,229.0,226.733,226.0,20200,229.0,226.0
697,2017/06/30,228.0,227.839,229.0,14900,229.0,226.0
698,2017/07/03,229.0,227.844,227.0,9000,229.0,227.0
699,2017/07/04,229.0,228.838,230.0,20400,230.0,227.0
700,2017/07/05,232.0,230.813,230.0,31500,232.0,230.0
701,2017/07/06,229.0,230.276,232.0,27200,232.0,229.0
702,2017/07/07,230.0,230.434,231.0,12900,232.0,229.0
703,2017/07/10,232.0,233.832,235.0,27300,235.0,231.0
704,2017/07/11,235.0,234.039,234.0,38500,235.0,232.0
705,2017/07/12,229.0,229.956,231.0,51800,232.0,229.0
706,2017/07/13,226.0,228.184,229.0,64600,230.0,226.0
707,2017/07/14,225.0,225.084,227.0,65700,227.0,224.0
708,2017/07/18,225.0,225.235,225.0,13600,226.0,224.0
709,2017/07/19,225.0,224.554,226.0,28000,226.0,224.0
710,2017/07/20,225.0,225.125,225.0,4000,226.0,224.0
711,2017/07/21,225.0,225.756,226.0,4500,226.0,225.0
712,2017/07/24,225.0,225.862,225.0,39100,228.0,225.0
713,2017/07/25,227.0,227.573,227.0,17100,229.0,226.0
714,2017/07/26,228.0,227.5,228.0,4800,228.0,227.0
715,2017/07/27,227.0,226.952,226.0,4200,228.0,226.0
716,2017/07/28,226.0,227.212,228.0,11800,228.0,226.0
717,2017/07/31,226.0,226.146,226.0,13000,227.0,226.0
718,2017/08/01,227.0,226.955,227.0,13300,228.0,226.0
719,2017/08/02,227.0,227.784,229.0,17100,229.0,226.0
720,2017/08/03,226.0,225.836,226.0,34700,228.0,225.0
721,2017/08/04,227.0,225.343,226.0,9900,227.0,225.0
722,2017/08/07,227.0,225.5,226.0,18600,227.0,225.0
723,2017/08/08,225.0,225.19,225.0,15800,226.0,225.0
724,2017/08/09,226.0,225.348,226.0,6900,226.0,225.0
725,2017/08/10,225.0,224.536,225.0,41600,225.0,223.0
726,2017/08/14,223.0,223.024,223.0,12300,224.0,222.0
727,2017/08/15,225.0,224.784,223.0,3700,226.0,223.0
728,2017/08/16,223.0,223.806,225.0,18000,226.0,223.0
729,2017/08/17,224.0,223.076,223.0,6600,224.0,223.0
730,2017/08/18,223.0,222.425,223.0,20700,224.0,222.0
731,2017/08/21,223.0,221.67,223.0,20600,223.0,221.0
732,2017/08/22,222.0,221.087,222.0,17300,222.0,220.0
733,2017/08/23,221.0,221.304,221.0,11200,222.0,221.0
734,2017/08/24,222.0,221.824,221.0,27800,224.0,221.0
735,2017/08/25,223.0,222.0,222.0,10800,223.0,221.0
736,2017/08/28,222.0,221.136,221.0,14700,222.0,220.0
737,2017/08/29,221.0,219.926,221.0,55500,223.0,218.0
738,2017/08/30,227.0,237.13,228.0,777700,258.0,226.0
739,2017/08/31,227.0,225.809,228.0,63900,228.0,224.0
740,2017/09/01,226.0,224.785,223.0,64300,227.0,223.0
741,2017/09/04,221.0,222.491,229.0,110700,229.0,219.0
742,2017/09/05,220.0,218.832,220.0,35700,221.0,217.0
743,2017/09/06,219.0,217.856,219.0,20200,219.0,217.0
744,2017/09/07,220.0,220.3,220.0,12000,221.0,219.0
745,2017/09/08,218.0,218.983,220.0,11700,220.0,218.0
746,2017/09/11,221.0,220.381,221.0,13400,222.0,219.0
747,2017/09/12,222.0,221.276,221.0,19600,223.0,220.0
748,2017/09/13,223.0,222.494,223.0,8900,223.0,221.0
749,2017/09/14,221.0,221.496,223.0,11100,223.0,221.0
750,2017/09/15,222.0,221.286,221.0,4900,222.0,221.0
751,2017/09/19,222.0,221.989,221.0,36900,224.0,221.0
752,2017/09/20,223.0,222.26,222.0,18500,223.0,221.0
753,2017/09/21,224.0,222.781,222.0,9600,224.0,222.0
754,2017/09/22,221.0,221.244,223.0,15600,223.0,221.0
755,2017/09/25,221.0,221.794,223.0,12600,223.0,221.0
756,2017/09/26,222.0,221.659,221.0,20800,223.0,221.0
757,2017/09/27,222.0,220.945,221.0,20000,222.0,220.0
758,2017/09/28,221.0,222.051,221.0,21800,223.0,221.0
759,2017/09/29,223.0,223.45,222.0,22900,225.0,222.0
760,2017/10/02,227.0,225.695,225.0,46500,228.0,224.0
761,2017/10/03,228.0,227.742,228.0,34500,229.0,226.0
762,2017/10/04,227.0,226.096,226.0,20800,227.0,226.0
763,2017/10/05,226.0,226.57,228.0,22800,228.0,225.0
764,2017/10/06,228.0,226.954,227.0,15300,228.0,226.0
765,2017/10/10,231.0,228.995,230.0,43800,231.0,227.0
766,2017/10/11,225.0,226.232,229.0,69900,229.0,225.0
767,2017/10/12,227.0,226.03,225.0,16500,228.0,225.0
768,2017/10/13,226.0,226.075,226.0,13400,227.0,226.0
769,2017/10/16,225.0,225.702,226.0,40900,227.0,224.0
770,2017/10/17,225.0,225.198,225.0,26800,226.0,225.0
771,2017/10/18,226.0,227.935,226.0,58100,230.0,226.0
772,2017/10/19,227.0,226.486,227.0,17500,228.0,226.0
773,2017/10/20,226.0,226.41,226.0,14400,228.0,226.0
774,2017/10/23,228.0,228.703,226.0,63200,230.0,226.0
775,2017/10/24,239.0,240.792,229.0,1500600,255.0,227.0
776,2017/10/25,240.0,244.168,240.0,467400,253.0,235.0
777,2017/10/26,242.0,235.74,240.0,209000,244.0,230.0
778,2017/10/27,248.0,249.877,244.0,299000,255.0,240.0
779,2017/10/30,241.0,241.86,240.0,134800,250.0,240.0
780,2017/10/31,244.0,246.22,241.0,174300,252.0,237.0
781,2017/11/01,251.0,248.819,246.0,219600,254.0,242.0
782,2017/11/02,255.0,251.19,249.0,298200,259.0,243.0
783,2017/11/06,249.0,251.554,253.0,72900,257.0,248.0
784,2017/11/07,245.0,243.069,246.0,123700,249.0,238.0
785,2017/11/08,247.0,244.037,245.0,75000,248.0,240.0
786,2017/11/09,241.0,243.266,248.0,62800,248.0,240.0
787,2017/11/10,237.0,238.214,239.0,87100,241.0,237.0
788,2017/11/13,242.0,239.901,237.0,30300,244.0,237.0
789,2017/11/14,246.0,243.164,240.0,35400,246.0,239.0
790,2017/11/15,240.0,246.449,246.0,113100,250.0,239.0
791,2017/11/16,248.0,243.845,239.0,60600,249.0,238.0
792,2017/11/17,247.0,244.065,248.0,29100,248.0,242.0
793,2017/11/20,260.0,264.133,260.0,1720100,280.0,250.0
794,2017/11/21,267.0,269.25,268.0,968800,277.0,260.0
795,2017/11/22,265.0,262.412,270.0,349000,270.0,258.0
796,2017/11/24,275.0,275.331,263.0,883500,284.0,260.0
797,2017/11/27,281.0,279.448,277.0,606100,285.0,269.0
798,2017/11/28,278.0,280.922,277.0,268100,288.0,277.0
799,2017/11/29,272.0,275.824,279.0,333400,279.0,271.0
800,2017/11/30,269.0,267.779,270.0,214000,271.0,265.0
801,2017/12/01,276.0,271.512,269.0,133100,276.0,267.0
802,2017/12/04,273.0,275.82,279.0,140800,279.0,272.0
803,2017/12/05,270.0,268.637,271.0,109900,272.0,263.0
804,2017/12/06,266.0,268.729,270.0,108200,274.0,265.0
805,2017/12/07,271.0,270.171,266.0,45100,272.0,266.0
806,2017/12/08,268.0,269.239,269.0,33900,272.0,268.0
807,2017/12/11,271.0,269.202,268.0,54500,271.0,268.0
808,2017/12/12,269.0,268.83,269.0,105100,274.0,264.0
809,2017/12/13,269.0,268.913,270.0,25300,271.0,267.0
810,2017/12/14,264.0,264.241,268.0,100500,269.0,261.0
811,2017/12/15,268.0,265.845,264.0,54700,268.0,264.0
812,2017/12/18,265.0,265.671,266.0,38600,267.0,265.0
813,2017/12/19,261.0,263.132,266.0,106600,266.0,260.0
814,2017/12/20,261.0,261.411,261.0,25800,263.0,261.0
815,2017/12/21,258.0,258.851,261.0,96100,261.0,257.0
816,2017/12/22,251.0,252.355,256.0,124100,256.0,250.0
817,2017/12/25,245.0,246.588,248.0,117500,249.0,245.0
818,2017/12/26,247.0,245.23,244.0,166700,249.0,242.0
819,2017/12/27,255.0,253.066,250.0,52700,257.0,250.0
820,2017/12/28,257.0,256.822,255.0,71500,260.0,255.0
821,2017/12/29,262.0,261.039,258.0,71300,263.0,258.0
822,2018/01/04,267.0,263.848,263.0,118000,267.0,261.0
823,2018/01/05,265.0,265.365,267.0,41900,267.0,264.0
824,2018/01/09,270.0,266.917,266.0,111500,270.0,263.0
825,2018/01/10,267.0,268.298,268.0,63000,271.0,266.0
826,2018/01/11,269.0,267.556,266.0,38300,269.0,265.0
827,2018/01/12,264.0,262.584,263.0,135100,266.0,258.0
828,2018/01/15,263.0,263.092,264.0,36800,265.0,261.0
829,2018/01/16,263.0,263.608,265.0,41800,265.0,262.0
830,2018/01/17,258.0,258.901,261.0,110600,262.0,257.0
831,2018/01/18,264.0,261.461,259.0,62200,264.0,258.0
832,2018/01/19,268.0,267.024,265.0,205600,270.0,263.0
833,2018/01/22,265.0,266.172,268.0,62300,269.0,264.0
834,2018/01/23,263.0,263.073,269.0,135200,269.0,259.0
835,2018/01/24,263.0,263.858,265.0,64000,266.0,262.0
836,2018/01/25,263.0,263.959,266.0,80600,266.0,262.0
837,2018/01/26,264.0,265.989,267.0,126700,269.0,263.0
838,2018/01/29,266.0,266.499,268.0,49100,268.0,265.0
839,2018/01/30,261.0,263.153,266.0,78700,267.0,260.0
840,2018/01/31,262.0,260.729,260.0,35800,264.0,258.0
841,2018/02/01,266.0,264.162,262.0,30200,266.0,262.0
842,2018/02/02,266.0,264.684,267.0,53200,267.0,261.0
843,2018/02/05,260.0,260.051,258.0,63400,263.0,258.0
844,2018/02/06,244.0,239.086,241.0,303300,246.0,226.0
845,2018/02/07,248.0,249.967,248.0,89900,253.0,248.0
846,2018/02/08,249.0,250.21,249.0,16700,252.0,249.0
847,2018/02/09,246.0,245.946,247.0,72600,249.0,241.0
848,2018/02/13,248.0,249.842,249.0,32900,254.0,248.0
849,2018/02/14,242.0,242.857,246.0,70700,248.0,241.0
850,2018/02/15,243.0,243.509,243.0,22400,245.0,242.0
851,2018/02/16,245.0,244.426,244.0,40100,246.0,244.0
852,2018/02/19,250.0,247.651,245.0,43300,250.0,245.0
853,2018/02/20,249.0,248.372,247.0,22300,250.0,247.0
854,2018/02/21,253.0,250.382,248.0,48200,253.0,248.0
855,2018/02/22,252.0,251.815,251.0,32900,253.0,250.0
856,2018/02/23,252.0,253.919,253.0,78600,257.0,250.0
857,2018/02/26,244.0,242.677,242.0,113400,246.0,240.0
858,2018/02/27,243.0,243.341,245.0,22900,245.0,242.0
859,2018/02/28,238.0,238.755,240.0,103000,242.0,235.0
860,2018/03/01,231.0,233.732,238.0,84600,238.0,231.0
861,2018/03/02,231.0,229.159,230.0,89800,232.0,228.0
862,2018/03/05,231.0,231.313,231.0,27800,233.0,230.0
863,2018/03/06,230.0,229.833,231.0,64800,233.0,228.0
864,2018/03/07,231.0,230.362,230.0,14100,231.0,229.0
865,2018/03/08,230.0,229.882,230.0,35500,231.0,229.0
866,2018/03/09,230.0,230.708,232.0,13700,232.0,230.0
867,2018/03/12,231.0,230.909,231.0,26400,232.0,230.0
868,2018/03/13,231.0,229.725,231.0,79900,232.0,227.0
869,2018/03/14,231.0,231.158,231.0,54600,233.0,230.0
870,2018/03/15,229.0,229.741,230.0,13900,231.0,229.0
871,2018/03/16,229.0,228.708,228.0,50000,231.0,228.0
872,2018/03/19,224.0,225.869,230.0,48900,230.0,224.0
873,2018/03/20,228.0,227.516,224.0,51600,230.0,224.0
874,2018/03/22,228.0,228.21,229.0,6200,229.0,227.0
875,2018/03/23,220.0,221.006,226.0,90400,226.0,218.0
876,2018/03/26,212.0,213.601,218.0,86900,218.0,210.0
877,2018/03/27,218.0,215.3,215.0,47600,218.0,214.0
878,2018/03/28,219.0,216.504,215.0,13500,219.0,215.0
879,2018/03/29,224.0,221.783,219.0,41500,224.0,219.0
880,2018/03/30,226.0,226.113,225.0,65300,228.0,223.0
881,2018/04/02,224.0,225.833,228.0,18600,228.0,224.0
882,2018/04/03,226.0,226.066,227.0,31900,228.0,224.0
883,2018/04/04,224.0,224.701,225.0,23100,226.0,224.0
884,2018/04/05,228.0,225.995,225.0,20700,228.0,224.0
885,2018/04/06,224.0,226.15,227.0,19300,228.0,224.0
886,2018/04/09,227.0,225.672,224.0,18000,227.0,224.0
887,2018/04/10,228.0,225.198,224.0,74300,228.0,223.0
888,2018/04/11,218.0,221.193,225.0,95700,225.0,218.0
889,2018/04/12,220.0,218.377,218.0,47800,220.0,217.0
890,2018/04/13,220.0,218.323,220.0,35000,221.0,217.0
891,2018/04/16,211.0,215.214,220.0,66400,221.0,211.0
892,2018/04/17,211.0,211.502,213.0,59600,213.0,211.0
893,2018/04/18,214.0,212.971,212.0,31200,215.0,212.0
894,2018/04/19,222.0,218.326,216.0,119400,225.0,214.0
895,2018/04/20,222.0,219.581,222.0,88600,222.0,217.0
896,2018/04/23,219.0,219.796,222.0,34800,223.0,218.0
897,2018/04/24,223.0,220.138,219.0,50000,223.0,218.0
898,2018/04/25,222.0,221.813,223.0,35900,223.0,220.0
899,2018/04/26,218.0,218.763,223.0,41800,223.0,217.0
900,2018/04/27,216.0,216.913,218.0,25400,219.0,216.0
901,2018/05/01,216.0,215.026,216.0,34200,217.0,214.0
902,2018/05/02,219.0,218.73,219.0,29200,220.0,217.0
903,2018/05/07,217.0,216.834,219.0,77000,219.0,215.0
904,2018/05/08,220.0,219.154,218.0,40900,221.0,218.0
905,2018/05/09,218.0,218.804,221.0,27500,221.0,217.0
906,2018/05/10,220.0,219.742,219.0,47300,221.0,218.0
907,2018/05/11,218.0,218.463,220.0,41000,220.0,217.0
908,2018/05/14,218.0,218.184,218.0,36900,220.0,217.0
909,2018/05/15,216.0,217.158,218.0,35400,218.0,216.0
910,2018/05/16,216.0,216.481,217.0,18700,217.0,216.0
911,2018/05/17,219.0,217.115,217.0,18200,219.0,216.0
912,2018/05/18,218.0,218.173,218.0,15000,219.0,217.0
913,2018/05/21,219.0,217.282,220.0,65900,220.0,216.0
914,2018/05/22,219.0,216.273,218.0,59800,219.0,215.0
915,2018/05/23,217.0,215.463,217.0,56200,218.0,214.0
916,2018/05/24,214.0,214.619,214.0,36000,216.0,214.0
917,2018/05/25,212.0,213.074,215.0,54000,215.0,212.0
918,2018/05/28,212.0,212.736,212.0,26100,214.0,212.0
919,2018/05/29,212.0,212.148,213.0,32500,214.0,211.0
920,2018/05/30,212.0,210.567,212.0,59600,212.0,209.0
921,2018/05/31,216.0,215.603,212.0,106500,218.0,212.0
922,2018/06/01,216.0,214.799,215.0,26900,217.0,213.0
923,2018/06/04,218.0,217.296,218.0,34500,218.0,215.0
924,2018/06/05,214.0,215.782,217.0,28900,218.0,214.0
925,2018/06/06,227.0,224.947,215.0,826300,234.0,211.0
926,2018/06/07,222.0,227.411,233.0,335600,233.0,221.0
927,2018/06/08,226.0,225.438,225.0,121200,230.0,222.0
928,2018/06/11,224.0,225.09,227.0,78000,228.0,222.0
929,2018/06/12,223.0,222.371,224.0,64200,226.0,220.0
930,2018/06/13,244.0,236.318,226.0,877300,245.0,225.0
931,2018/06/14,240.0,237.962,236.0,238300,243.0,234.0
932,2018/06/15,238.0,237.16,240.0,107400,240.0,234.0
933,2018/06/18,233.0,232.866,235.0,130100,235.0,230.0
934,2018/06/19,240.0,241.244,236.0,480500,246.0,235.0
935,2018/06/20,247.0,240.659,241.0,337600,247.0,231.0
936,2018/06/21,249.0,250.939,253.0,409300,254.0,246.0
937,2018/06/22,242.0,243.709,246.0,97300,247.0,241.0
938,2018/06/25,231.0,237.865,245.0,178800,246.0,230.0
939,2018/06/26,227.0,223.854,225.0,123100,228.0,219.0
940,2018/06/27,225.0,227.391,226.0,89800,232.0,225.0
941,2018/06/28,220.0,220.519,225.0,137700,225.0,217.0
942,2018/06/29,224.0,223.578,222.0,33400,225.0,221.0
943,2018/07/02,219.0,220.908,224.0,76000,224.0,218.0
944,2018/07/03,219.0,221.097,223.0,93600,227.0,218.0
945,2018/07/04,220.0,219.143,219.0,32200,221.0,218.0
946,2018/07/05,213.0,215.212,217.0,137800,219.0,212.0
947,2018/07/06,217.0,217.192,214.0,22400,220.0,214.0
948,2018/07/09,219.0,217.186,218.0,58700,220.0,213.0
949,2018/07/10,226.0,223.564,220.0,104600,227.0,220.0
950,2018/07/11,220.0,227.989,234.0,391900,239.0,220.0
951,2018/07/12,230.0,225.542,222.0,110200,230.0,222.0
952,2018/07/13,226.0,229.474,230.0,80800,234.0,226.0
953,2018/07/17,223.0,224.53,226.0,36800,226.0,223.0
954,2018/07/18,223.0,222.945,224.0,63800,225.0,221.0
955,2018/07/19,237.0,246.061,229.0,1869900,259.0,229.0
956,2018/07/20,237.0,237.704,241.0,238000,243.0,231.0
957,2018/07/23,235.0,234.281,236.0,61300,237.0,232.0
958,2018/07/24,233.0,235.332,236.0,58100,238.0,233.0
959,2018/07/25,241.0,238.882,237.0,169400,242.0,234.0
960,2018/07/26,239.0,240.103,243.0,84900,243.0,238.0
961,2018/07/27,240.0,243.584,240.0,234300,249.0,236.0
962,2018/07/30,238.0,241.197,238.0,87400,246.0,238.0
963,2018/07/31,239.0,239.59,239.0,54600,242.0,237.0
964,2018/08/01,237.0,238.012,238.0,76100,240.0,236.0
965,2018/08/02,234.0,236.398,240.0,88700,240.0,232.0
966,2018/08/03,227.0,229.922,233.0,96300,236.0,226.0
967,2018/08/06,226.0,226.869,227.0,23600,228.0,226.0
968,2018/08/07,226.0,227.67,226.0,37300,230.0,226.0
969,2018/08/08,230.0,229.725,226.0,67000,233.0,226.0
970,2018/08/09,228.0,228.241,230.0,41900,231.0,227.0
971,2018/08/10,224.0,225.102,228.0,72900,229.0,223.0
972,2018/08/13,220.0,220.704,221.0,89700,225.0,219.0
973,2018/08/14,223.0,221.304,220.0,26300,223.0,220.0
974,2018/08/15,220.0,220.994,222.0,33800,223.0,220.0
975,2018/08/16,221.0,219.731,220.0,37500,222.0,218.0
976,2018/08/17,222.0,222.564,221.0,31400,224.0,220.0
977,2018/08/20,223.0,222.681,224.0,16600,224.0,221.0
978,2018/08/21,228.0,225.949,224.0,54500,229.0,222.0
979,2018/08/22,226.0,226.029,227.0,37400,228.0,223.0
980,2018/08/23,225.0,226.286,225.0,30800,228.0,225.0
981,2018/08/24,227.0,225.706,227.0,41200,227.0,224.0
982,2018/08/27,225.0,226.428,227.0,52300,228.0,225.0
983,2018/08/28,219.0,219.167,219.0,218400,220.0,218.0
984,2018/08/29,217.0,218.24,219.0,108700,219.0,217.0
985,2018/08/30,219.0,219.127,218.0,77900,220.0,218.0
986,2018/08/31,217.0,216.17,219.0,187600,219.0,212.0
987,2018/09/03,218.0,217.791,218.0,36400,218.0,217.0
988,2018/09/04,216.0,217.166,219.0,84200,219.0,216.0
989,2018/09/05,216.0,215.849,216.0,47100,217.0,215.0
990,2018/09/06,215.0,215.092,216.0,58500,216.0,214.0
991,2018/09/07,214.0,214.961,216.0,53400,217.0,214.0
992,2018/09/10,217.0,215.272,215.0,35300,217.0,214.0
993,2018/09/11,217.0,216.116,217.0,38900,217.0,215.0
994,2018/09/12,217.0,218.477,216.0,286800,221.0,216.0
995,2018/09/13,224.0,223.33,220.0,576400,232.0,217.0
996,2018/09/14,223.0,221.959,221.0,220700,225.0,218.0
997,2018/09/18,222.0,221.021,221.0,57900,222.0,220.0
998,2018/09/19,221.0,221.189,222.0,54000,222.0,220.0
999,2018/09/20,220.0,219.688,221.0,71700,222.0,218.0
1000,2018/09/21,221.0,220.472,222.0,43000,222.0,219.0
1001,2018/09/25,223.0,221.826,221.0,68800,223.0,220.0
1002,2018/09/26,222.0,223.518,223.0,130300,226.0,222.0
1003,2018/09/27,224.0,224.613,225.0,127600,227.0,223.0
1004,2018/09/28,224.0,224.71,224.0,79000,227.0,223.0
1005,2018/10/01,226.0,225.175,226.0,56000,226.0,224.0
1006,2018/10/02,224.0,225.854,226.0,68400,228.0,224.0
1007,2018/10/03,226.0,225.696,225.0,53300,227.0,225.0
1008,2018/10/04,225.0,225.554,226.0,37900,227.0,224.0
1009,2018/10/05,225.0,224.513,225.0,42900,225.0,223.0
1010,2018/10/09,227.0,225.691,225.0,145000,228.0,223.0
1011,2018/10/10,218.0,218.01,219.0,237200,220.0,215.0
1012,2018/10/11,210.0,210.473,212.0,229500,213.0,209.0
1013,2018/10/12,212.0,211.322,210.0,38200,213.0,210.0
1014,2018/10/15,210.0,211.924,213.0,88500,214.0,210.0
1015,2018/10/16,213.0,211.151,212.0,49700,213.0,210.0
1016,2018/10/17,215.0,214.329,213.0,45300,216.0,212.0
1017,2018/10/18,214.0,214.899,215.0,21700,216.0,214.0
1018,2018/10/19,212.0,211.825,213.0,52500,214.0,210.0
1019,2018/10/22,213.0,211.948,211.0,13500,214.0,211.0
1020,2018/10/23,208.0,209.41,212.0,187100,212.0,208.0
1021,2018/10/24,208.0,209.087,209.0,57300,211.0,208.0
1022,2018/10/25,202.0,204.278,207.0,163700,208.0,202.0
1023,2018/10/26,203.0,203.807,205.0,51400,207.0,202.0
1024,2018/10/29,203.0,203.771,204.0,67800,206.0,203.0
1025,2018/10/30,204.0,202.824,202.0,53900,205.0,201.0
1026,2018/10/31,206.0,205.374,205.0,17900,207.0,205.0
1027,2018/11/01,210.0,207.831,206.0,25400,210.0,206.0
1028,2018/11/02,212.0,212.679,215.0,58200,215.0,209.0
1029,2018/11/05,210.0,211.033,210.0,42200,212.0,209.0
1030,2018/11/06,210.0,210.266,211.0,23700,212.0,210.0
1031,2018/11/07,210.0,210.834,210.0,16300,212.0,210.0
1032,2018/11/08,213.0,212.093,212.0,25900,214.0,210.0
1033,2018/11/09,213.0,213.066,214.0,15200,214.0,211.0
1034,2018/11/12,211.0,210.859,211.0,7800,212.0,210.0
1035,2018/11/13,210.0,209.845,210.0,46500,211.0,209.0
1036,2018/11/14,210.0,210.322,211.0,17400,212.0,210.0
1037,2018/11/15,211.0,210.16,210.0,23100,211.0,209.0
1038,2018/11/16,212.0,211.122,211.0,30400,212.0,210.0
1039,2018/11/19,210.0,211.022,213.0,13700,213.0,210.0
1040,2018/11/20,207.0,207.478,206.0,76600,211.0,206.0
1041,2018/11/21,207.0,206.667,206.0,31200,208.0,205.0
1042,2018/11/22,209.0,207.747,210.0,30800,210.0,206.0
1043,2018/11/26,209.0,209.488,209.0,12100,210.0,209.0
1044,2018/11/27,208.0,208.454,210.0,48700,210.0,208.0
1045,2018/11/28,207.0,209.418,209.0,90500,213.0,207.0
1046,2018/11/29,206.0,207.286,210.0,57100,210.0,206.0
1047,2018/11/30,207.0,206.596,206.0,24500,208.0,206.0
1048,2018/12/03,208.0,207.532,208.0,24800,209.0,207.0
1049,2018/12/04,205.0,207.183,210.0,66100,210.0,205.0
1050,2018/12/05,209.0,205.868,204.0,77500,209.0,204.0
1051,2018/12/06,204.0,205.682,209.0,56200,209.0,204.0
1052,2018/12/07,204.0,204.802,206.0,34800,207.0,203.0
1053,2018/12/10,202.0,203.39,204.0,54900,206.0,202.0
1054,2018/12/11,201.0,200.148,202.0,118900,203.0,197.0
1055,2018/12/12,202.0,201.974,202.0,26400,203.0,201.0
1056,2018/12/13,204.0,202.432,203.0,34500,204.0,201.0
1057,2018/12/14,201.0,201.451,203.0,46300,203.0,201.0
1058,2018/12/17,201.0,201.026,201.0,58000,202.0,200.0
1059,2018/12/18,194.0,196.905,200.0,82200,200.0,194.0
1060,2018/12/19,194.0,193.382,192.0,52300,195.0,192.0
1061,2018/12/20,188.0,191.33,192.0,98400,194.0,188.0
1062,2018/12/21,176.0,181.302,187.0,123000,187.0,175.0
1063,2018/12/25,162.0,163.396,162.0,273600,169.0,162.0
1064,2018/12/26,167.0,167.026,165.0,57900,170.0,165.0
1065,2018/12/27,177.0,175.273,175.0,65300,178.0,172.0
1066,2018/12/28,180.0,179.038,177.0,29000,182.0,177.0
1067,2019/01/04,185.0,180.077,177.0,72400,185.0,176.0
1068,2019/01/07,191.0,189.306,189.0,42800,192.0,188.0
1069,2019/01/08,191.0,190.958,190.0,31000,193.0,189.0
1070,2019/01/09,191.0,190.935,191.0,27600,192.0,189.0
1071,2019/01/10,192.0,190.583,190.0,31200,193.0,189.0
1072,2019/01/11,192.0,193.495,194.0,55200,196.0,191.0
1073,2019/01/15,193.0,192.85,192.0,8000,194.0,192.0
1074,2019/01/16,197.0,196.822,195.0,32600,199.0,195.0
1075,2019/01/17,196.0,197.394,197.0,22100,198.0,196.0
1076,2019/01/18,200.0,197.553,195.0,40000,200.0,195.0
1077,2019/01/21,200.0,200.411,200.0,24600,202.0,200.0
1078,2019/01/22,199.0,200.098,200.0,16400,202.0,199.0
1079,2019/01/23,199.0,199.603,199.0,16100,201.0,198.0
1080,2019/01/24,200.0,200.808,202.0,7800,202.0,200.0
1081,2019/01/25,202.0,200.98,202.0,24700,203.0,199.0
1082,2019/01/28,202.0,202.681,203.0,16000,204.0,201.0
1083,2019/01/29,203.0,201.518,202.0,21800,204.0,200.0
1084,2019/01/30,200.0,201.207,202.0,27500,202.0,200.0
1085,2019/01/31,202.0,200.925,201.0,22600,203.0,200.0
1086,2019/02/01,202.0,201.52,201.0,9800,202.0,201.0
1087,2019/02/04,205.0,204.021,205.0,32900,205.0,202.0
1088,2019/02/05,202.0,202.788,203.0,32500,205.0,201.0
1089,2019/02/06,204.0,203.839,202.0,15500,205.0,202.0
1090,2019/02/07,203.0,203.169,204.0,13000,204.0,203.0
1091,2019/02/08,202.0,202.973,202.0,14600,205.0,202.0
1092,2019/02/12,204.0,201.941,202.0,20400,204.0,201.0
1093,2019/02/13,201.0,202.557,203.0,51000,204.0,201.0
1094,2019/02/14,201.0,202.703,202.0,33000,204.0,201.0
1095,2019/02/15,202.0,202.29,201.0,10700,204.0,201.0
1096,2019/02/18,203.0,202.003,203.0,31200,204.0,201.0
1097,2019/02/19,202.0,202.581,203.0,19100,204.0,202.0
1098,2019/02/20,204.0,204.285,204.0,23500,205.0,203.0
1099,2019/02/21,203.0,203.678,203.0,56500,205.0,203.0
1100,2019/02/22,206.0,205.205,205.0,35600,206.0,204.0
1101,2019/02/25,202.0,203.921,206.0,96800,207.0,202.0
1102,2019/02/26,197.0,197.308,196.0,53200,199.0,196.0
1103,2019/02/27,198.0,198.492,197.0,25800,200.0,197.0
1104,2019/02/28,198.0,199.178,198.0,78200,201.0,198.0
1105,2019/03/01,199.0,198.12,197.0,23400,199.0,197.0
1106,2019/03/04,202.0,200.391,200.0,90100,202.0,199.0
1107,2019/03/05,201.0,200.234,201.0,19700,201.0,199.0
1108,2019/03/06,200.0,198.295,201.0,37000,201.0,195.0
1109,2019/03/07,196.0,196.912,200.0,34200,200.0,195.0
1110,2019/03/08,196.0,193.778,194.0,52700,196.0,192.0
1111,2019/03/11,196.0,196.356,198.0,19100,198.0,194.0
1112,2019/03/12,195.0,192.815,196.0,100500,196.0,190.0
1113,2019/03/13,195.0,193.466,193.0,41400,196.0,192.0
1114,2019/03/14,195.0,195.135,195.0,11900,196.0,194.0
1115,2019/03/15,196.0,195.992,195.0,12300,197.0,195.0
1116,2019/03/18,195.0,194.628,194.0,28200,196.0,193.0
1117,2019/03/19,194.0,193.921,195.0,43000,196.0,192.0
1118,2019/03/20,193.0,193.745,193.0,30200,195.0,192.0
1119,2019/03/22,194.0,193.701,193.0,10700,195.0,192.0
1120,2019/03/25,193.0,193.281,194.0,22800,194.0,192.0
1121,2019/03/26,193.0,194.013,193.0,22700,196.0,193.0
1122,2019/03/27,193.0,193.964,193.0,11100,196.0,193.0
1123,2019/03/28,194.0,193.344,193.0,9300,194.0,193.0
1124,2019/03/29,194.0,194.006,195.0,16400,195.0,193.0
1125,2019/04/01,196.0,196.553,196.0,49200,198.0,194.0
1126,2019/04/02,195.0,196.905,200.0,46100,200.0,194.0
1127,2019/04/03,197.0,196.168,195.0,12500,197.0,195.0
1128,2019/04/04,197.0,197.36,199.0,37500,199.0,195.0
1129,2019/04/05,197.0,197.292,197.0,20900,198.0,196.0
1130,2019/04/08,200.0,198.363,197.0,30600,200.0,197.0
1131,2019/04/09,199.0,198.438,200.0,19200,200.0,197.0
1132,2019/04/10,199.0,198.66,199.0,38500,199.0,197.0
1133,2019/04/11,204.0,200.449,199.0,138900,204.0,197.0
1134,2019/04/12,192.0,191.907,191.0,219300,195.0,190.0
1135,2019/04/15,192.0,192.919,195.0,34500,195.0,192.0
1136,2019/04/16,193.0,193.02,194.0,20200,194.0,192.0
1137,2019/04/17,193.0,193.305,193.0,18700,194.0,193.0
1138,2019/04/18,192.0,191.87,192.0,28500,193.0,191.0
1139,2019/04/19,192.0,192.094,191.0,13900,193.0,191.0
1140,2019/04/22,192.0,192.138,193.0,14500,193.0,192.0
1141,2019/04/23,191.0,191.381,191.0,21800,193.0,191.0
1142,2019/04/24,187.0,188.92,192.0,38600,192.0,187.0
1143,2019/04/25,187.0,187.97,190.0,19900,190.0,187.0
1144,2019/04/26,187.0,186.304,187.0,32600,188.0,185.0
1145,2019/05/07,188.0,184.916,183.0,33300,188.0,182.0
1146,2019/05/08,188.0,189.128,190.0,23400,190.0,187.0
1147,2019/05/09,190.0,187.827,185.0,18500,190.0,185.0
1148,2019/05/10,191.0,189.857,189.0,9800,191.0,188.0
1149,2019/05/13,190.0,190.371,189.0,17000,192.0,189.0
1150,2019/05/14,190.0,187.615,187.0,21300,190.0,186.0
1151,2019/05/15,188.0,190.491,190.0,16300,192.0,188.0
1152,2019/05/16,188.0,189.032,189.0,6300,190.0,188.0
1153,2019/05/17,188.0,189.719,188.0,13900,192.0,188.0
1154,2019/05/20,191.0,189.51,188.0,10000,191.0,188.0
1155,2019/05/21,191.0,190.107,189.0,12100,191.0,189.0
1156,2019/05/22,190.0,189.511,189.0,4500,191.0,189.0
1157,2019/05/23,188.0,189.631,189.0,17600,191.0,188.0
1158,2019/05/24,191.0,189.506,191.0,23700,192.0,188.0
1159,2019/05/27,189.0,189.388,190.0,11600,191.0,188.0
1160,2019/05/28,191.0,189.686,190.0,17500,191.0,189.0
1161,2019/05/29,189.0,189.879,190.0,3300,190.0,189.0
1162,2019/05/30,188.0,189.196,190.0,10200,190.0,188.0
1163,2019/05/31,188.0,189.364,188.0,5500,190.0,188.0
1164,2019/06/03,189.0,188.407,189.0,10800,189.0,188.0
1165,2019/06/04,189.0,190.487,191.0,15400,191.0,188.0
1166,2019/06/05,189.0,187.965,188.0,25800,189.0,187.0
1167,2019/06/06,189.0,188.252,188.0,15500,189.0,188.0
1168,2019/06/07,189.0,188.585,189.0,17600,189.0,187.0
1169,2019/06/10,189.0,188.825,189.0,5700,189.0,188.0
1170,2019/06/11,190.0,188.816,188.0,19000,190.0,188.0
1171,2019/06/12,189.0,188.619,188.0,10500,189.0,188.0
1172,2019/06/13,190.0,188.036,188.0,11100,190.0,187.0
1173,2019/06/14,188.0,189.1,190.0,12000,190.0,188.0
1174,2019/06/17,190.0,187.729,187.0,15500,190.0,187.0
1175,2019/06/18,188.0,187.816,189.0,11400,189.0,187.0
1176,2019/06/19,188.0,187.72,188.0,10700,188.0,187.0
1177,2019/06/20,189.0,187.76,187.0,5000,189.0,187.0
1178,2019/06/21,189.0,188.6,189.0,10500,189.0,188.0
1179,2019/06/24,188.0,188.771,189.0,3500,189.0,188.0
1180,2019/06/25,188.0,191.105,192.0,19100,192.0,188.0
1181,2019/06/26,187.0,187.987,189.0,7700,189.0,187.0
1182,2019/06/27,186.0,186.775,188.0,18700,188.0,186.0
1183,2019/06/28,187.0,186.65,188.0,16300,188.0,186.0
1184,2019/07/01,188.0,187.487,187.0,11700,188.0,187.0
1185,2019/07/02,187.0,187.455,188.0,27900,188.0,186.0
1186,2019/07/03,187.0,187.696,187.0,15800,189.0,187.0
1187,2019/07/04,189.0,188.398,188.0,12800,189.0,187.0
1188,2019/07/05,192.0,190.248,189.0,40300,192.0,189.0
1189,2019/07/08,192.0,191.011,192.0,17900,192.0,190.0
1190,2019/07/09,192.0,192.259,191.0,45200,194.0,190.0
1191,2019/07/10,189.0,188.654,190.0,118700,190.0,187.0
1192,2019/07/11,189.0,189.178,189.0,29300,190.0,189.0
1193,2019/07/12,190.0,190.291,190.0,20600,191.0,189.0
1194,2019/07/16,189.0,188.212,188.0,30600,189.0,187.0
1195,2019/07/17,189.0,188.04,189.0,94400,189.0,187.0
1196,2019/07/18,187.0,188.853,189.0,19000,190.0,187.0
1197,2019/07/19,188.0,188.106,188.0,4700,189.0,187.0
1198,2019/07/22,187.0,188.037,188.0,18800,189.0,187.0
1199,2019/07/23,188.0,188.88,188.0,9200,190.0,188.0
1200,2019/07/24,192.0,190.605,190.0,20000,192.0,189.0
1201,2019/07/25,191.0,191.845,192.0,27700,193.0,190.0
1202,2019/07/26,191.0,190.244,190.0,4100,191.0,190.0
1203,2019/07/29,189.0,190.516,189.0,12600,191.0,189.0
1204,2019/07/30,188.0,188.463,189.0,6700,190.0,188.0
1205,2019/07/31,188.0,187.869,188.0,6100,189.0,187.0
1206,2019/08/01,188.0,187.259,188.0,22400,188.0,187.0
1207,2019/08/02,187.0,187.621,189.0,21900,189.0,185.0
1208,2019/08/05,183.0,181.966,184.0,38600,185.0,180.0
1209,2019/08/06,181.0,180.834,180.0,18100,182.0,179.0
1210,2019/08/07,182.0,182.4,182.0,1500,183.0,182.0
1211,2019/08/08,181.0,182.006,184.0,16500,184.0,181.0
1212,2019/08/09,181.0,181.143,181.0,5600,182.0,181.0
1213,2019/08/13,179.0,180.453,181.0,24300,182.0,179.0
1214,2019/08/14,181.0,180.358,180.0,6700,181.0,180.0
1215,2019/08/15,181.0,179.878,179.0,18000,182.0,179.0
1216,2019/08/16,180.0,180.975,181.0,8100,182.0,180.0
1217,2019/08/19,180.0,180.381,180.0,8400,182.0,180.0
1218,2019/08/20,179.0,179.842,181.0,5700,181.0,179.0
1219,2019/08/21,179.0,179.661,179.0,12400,181.0,179.0
1220,2019/08/22,182.0,178.423,178.0,30500,182.0,177.0
1221,2019/08/23,182.0,181.811,182.0,9000,182.0,181.0
