,Date,Close,VWAP,Open,Volume,High,Low
0,2014/08/25,3155.0,3235.013,3280.0,152800,3305.0,3130.0
1,2014/08/26,3070.0,3120.792,3160.0,197100,3215.0,3060.0
2,2014/08/27,3080.0,3057.789,3050.0,96100,3090.0,3020.0
3,2014/08/28,3050.0,3058.319,3060.0,58000,3075.0,3050.0
4,2014/08/29,3005.0,3000.645,3040.0,105200,3045.0,2970.0
5,2014/09/01,3005.0,3013.984,3010.0,55100,3035.0,3000.0
6,2014/09/02,3000.0,3008.849,3000.0,45600,3020.0,3000.0
7,2014/09/03,3060.0,3038.379,3020.0,54600,3060.0,3005.0
8,2014/09/04,3030.0,3050.529,3055.0,39700,3080.0,3025.0
9,2014/09/05,3035.0,3030.119,3060.0,33700,3060.0,3010.0
10,2014/09/08,3150.0,3112.2,3065.0,123400,3170.0,3050.0
11,2014/09/09,3175.0,3172.388,3165.0,69300,3190.0,3150.0
12,2014/09/10,3180.0,3167.649,3170.0,75300,3190.0,3135.0
13,2014/09/11,3165.0,3182.979,3195.0,55900,3210.0,3160.0
14,2014/09/12,3115.0,3110.38,3100.0,159200,3140.0,3090.0
15,2014/09/16,3090.0,3100.825,3115.0,61800,3130.0,3080.0
16,2014/09/17,3100.0,3097.316,3115.0,62600,3115.0,3065.0
17,2014/09/18,3115.0,3111.667,3110.0,54600,3130.0,3085.0
18,2014/09/19,3070.0,3061.922,3080.0,154300,3090.0,3030.0
19,2014/09/22,3055.0,3038.115,3035.0,98400,3060.0,3020.0
20,2014/09/24,3070.0,3058.507,3040.0,56600,3085.0,3035.0
21,2014/09/25,3040.0,3039.124,3070.0,81000,3070.0,3025.0
22,2014/09/26,3010.0,3016.65,3030.0,88800,3040.0,3005.0
23,2014/09/29,2986.0,2992.713,2992.0,126800,3015.0,2973.0
24,2014/09/30,2957.0,2968.089,2984.0,92400,2995.0,2952.0
25,2014/10/01,2930.0,2944.32,2950.0,66600,2972.0,2927.0
26,2014/10/02,2906.0,2920.343,2910.0,68200,2940.0,2906.0
27,2014/10/03,2922.0,2911.432,2906.0,61100,2947.0,2901.0
28,2014/10/06,2977.0,3009.0,2973.0,164600,3065.0,2966.0
29,2014/10/07,2879.0,2910.555,2974.0,153300,3025.0,2874.0
30,2014/10/08,2817.0,2821.708,2830.0,159100,2841.0,2814.0
31,2014/10/09,2701.0,2729.449,2817.0,156000,2830.0,2693.0
32,2014/10/10,2638.0,2648.246,2651.0,138100,2685.0,2601.0
33,2014/10/14,2471.0,2545.838,2588.0,207400,2645.0,2467.0
34,2014/10/15,2550.0,2544.374,2521.0,177500,2578.0,2508.0
35,2014/10/16,2609.0,2636.618,2590.0,389800,2720.0,2515.0
36,2014/10/17,2485.0,2526.794,2605.0,334000,2626.0,2471.0
37,2014/10/20,2378.0,2424.237,2561.0,433400,2579.0,2363.0
38,2014/10/21,2302.0,2315.397,2378.0,288000,2378.0,2286.0
39,2014/10/22,2234.0,2228.523,2283.0,347400,2290.0,2203.0
40,2014/10/23,2264.0,2266.59,2227.0,231400,2320.0,2222.0
41,2014/10/24,2248.0,2251.066,2279.0,143400,2284.0,2223.0
42,2014/10/27,2245.0,2273.936,2244.0,246900,2326.0,2235.0
43,2014/10/28,2275.0,2268.542,2235.0,176500,2300.0,2215.0
44,2014/10/29,2365.0,2353.753,2335.0,314500,2393.0,2295.0
45,2014/10/30,2319.0,2329.303,2389.0,260400,2408.0,2290.0
46,2014/10/31,2420.0,2391.838,2369.0,258800,2425.0,2333.0
47,2014/11/04,2383.0,2434.244,2547.0,247300,2549.0,2381.0
48,2014/11/05,2416.0,2419.838,2433.0,192700,2450.0,2381.0
49,2014/11/06,2332.0,2392.502,2432.0,289500,2474.0,2302.0
50,2014/11/07,2407.0,2408.246,2378.0,213600,2446.0,2366.0
51,2014/11/10,2398.0,2404.622,2407.0,97800,2423.0,2384.0
52,2014/11/11,2342.0,2357.825,2398.0,147600,2406.0,2337.0
53,2014/11/12,2439.0,2420.016,2378.0,218100,2443.0,2364.0
54,2014/11/13,2590.0,2544.644,2439.0,275900,2593.0,2439.0
55,2014/11/14,2568.0,2555.536,2590.0,147100,2598.0,2520.0
56,2014/11/17,2447.0,2468.162,2597.0,179000,2597.0,2421.0
57,2014/11/18,2438.0,2428.883,2435.0,128700,2454.0,2401.0
58,2014/11/19,2465.0,2472.072,2485.0,78200,2496.0,2445.0
59,2014/11/20,2434.0,2461.492,2478.0,87900,2485.0,2428.0
60,2014/11/21,2564.0,2527.055,2435.0,157200,2575.0,2425.0
61,2014/11/25,2536.0,2546.627,2565.0,77800,2584.0,2523.0
62,2014/11/26,2623.0,2597.69,2565.0,153700,2631.0,2554.0
63,2014/11/27,2603.0,2590.079,2587.0,84500,2625.0,2561.0
64,2014/11/28,2755.0,2733.187,2637.0,332900,2770.0,2611.0
65,2014/12/01,2787.0,2787.422,2708.0,235500,2833.0,2708.0
66,2014/12/02,2735.0,2727.921,2740.0,204400,2744.0,2713.0
67,2014/12/03,2790.0,2739.095,2735.0,154400,2795.0,2711.0
68,2014/12/04,2819.0,2835.482,2830.0,144000,2867.0,2808.0
69,2014/12/05,2798.0,2795.102,2820.0,85700,2829.0,2768.0
70,2014/12/08,2921.0,2963.036,2898.0,283600,3065.0,2870.0
71,2014/12/09,2843.0,2846.349,2833.0,139300,2878.0,2826.0
72,2014/12/10,2929.0,2874.405,2793.0,124800,2929.0,2790.0
73,2014/12/11,3040.0,2989.807,2958.0,174800,3055.0,2930.0
74,2014/12/12,3050.0,3035.776,3030.0,133300,3070.0,3000.0
75,2014/12/15,3015.0,3010.221,3005.0,78900,3060.0,2976.0
76,2014/12/16,2898.0,2905.404,2945.0,92100,2970.0,2862.0
77,2014/12/17,2831.0,2868.891,2821.0,271300,2932.0,2805.0
78,2014/12/18,2985.0,2950.122,2905.0,181500,3025.0,2902.0
79,2014/12/19,2929.0,2957.442,3005.0,76400,3020.0,2906.0
80,2014/12/22,2946.0,2951.539,2932.0,67000,2996.0,2925.0
81,2014/12/24,2935.0,2941.266,2977.0,43600,2977.0,2922.0
82,2014/12/25,2898.0,2907.217,2915.0,108600,2925.0,2890.0
83,2014/12/26,2996.0,2967.498,2905.0,70500,3020.0,2893.0
84,2014/12/29,3005.0,2990.031,3015.0,77200,3040.0,2936.0
85,2014/12/30,3015.0,3029.021,3000.0,80700,3055.0,3000.0
86,2015/01/05,3015.0,3006.465,2952.0,92600,3050.0,2944.0
87,2015/01/06,2923.0,2940.253,2929.0,243600,2983.0,2920.0
88,2015/01/07,2911.0,3003.324,2921.0,515200,3200.0,2903.0
89,2015/01/08,2846.0,2881.39,2901.0,192800,2960.0,2842.0
90,2015/01/09,2850.0,2851.013,2862.0,106000,2890.0,2826.0
91,2015/01/13,2788.0,2796.613,2819.0,132700,2819.0,2780.0
92,2015/01/14,2791.0,2799.602,2795.0,70300,2836.0,2788.0
93,2015/01/15,2950.0,2965.081,2991.0,409200,3075.0,2862.0
94,2015/01/16,3095.0,3042.762,2945.0,266700,3115.0,2933.0
95,2015/01/19,3305.0,3213.311,3100.0,342400,3310.0,3100.0
96,2015/01/20,3490.0,3405.701,3300.0,317400,3495.0,3245.0
97,2015/01/21,3580.0,3524.822,3490.0,351900,3595.0,3380.0
98,2015/01/22,3420.0,3457.018,3615.0,215800,3615.0,3360.0
99,2015/01/23,3605.0,3595.524,3495.0,348000,3670.0,3425.0
100,2015/01/26,3570.0,3589.852,3555.0,178700,3640.0,3535.0
101,2015/01/27,3500.0,3508.741,3545.0,152500,3595.0,3475.0
102,2015/01/28,3610.0,3583.527,3495.0,168000,3630.0,3495.0
103,2015/01/29,3590.0,3633.877,3540.0,211100,3730.0,3540.0
104,2015/01/30,3615.0,3620.765,3600.0,134600,3670.0,3575.0
105,2015/02/02,3445.0,3508.836,3545.0,131000,3600.0,3425.0
106,2015/02/03,3395.0,3405.366,3440.0,172000,3470.0,3365.0
107,2015/02/04,3375.0,3345.768,3365.0,164100,3420.0,3285.0
108,2015/02/05,3385.0,3347.552,3315.0,169900,3445.0,3255.0
109,2015/02/06,3305.0,3323.24,3315.0,111900,3400.0,3265.0
110,2015/02/09,3340.0,3312.4,3265.0,182700,3365.0,3225.0
111,2015/02/10,3345.0,3371.32,3355.0,123900,3470.0,3290.0
112,2015/02/12,3430.0,3433.082,3415.0,110800,3485.0,3375.0
113,2015/02/13,3390.0,3391.895,3425.0,64900,3435.0,3355.0
114,2015/02/16,3385.0,3385.113,3395.0,40000,3415.0,3360.0
115,2015/02/17,3340.0,3365.588,3365.0,61200,3400.0,3325.0
116,2015/02/18,3480.0,3448.754,3390.0,105100,3500.0,3385.0
117,2015/02/19,3415.0,3433.864,3490.0,62500,3490.0,3410.0
118,2015/02/20,3425.0,3410.185,3450.0,72800,3460.0,3370.0
119,2015/02/23,3475.0,3460.794,3445.0,80600,3500.0,3415.0
120,2015/02/24,3530.0,3522.545,3500.0,83500,3560.0,3490.0
121,2015/02/25,3520.0,3512.258,3535.0,81500,3560.0,3455.0
122,2015/02/26,3630.0,3603.354,3540.0,132400,3645.0,3530.0
123,2015/02/27,3620.0,3639.542,3625.0,107000,3685.0,3595.0
124,2015/03/02,3605.0,3602.198,3590.0,51400,3630.0,3580.0
125,2015/03/03,3465.0,3494.224,3535.0,108900,3555.0,3445.0
126,2015/03/04,3370.0,3376.338,3430.0,122600,3445.0,3345.0
127,2015/03/05,3335.0,3350.769,3355.0,76100,3375.0,3320.0
128,2015/03/06,3885.0,3785.397,3620.0,744000,3920.0,3620.0
129,2015/03/09,4125.0,4012.344,3900.0,922500,4135.0,3790.0
130,2015/03/10,4200.0,4158.787,4085.0,346200,4200.0,4060.0
131,2015/03/11,4065.0,4086.367,4140.0,259300,4170.0,4040.0
132,2015/03/12,4110.0,4132.101,4095.0,191300,4185.0,4090.0
133,2015/03/13,4185.0,4154.804,4110.0,190900,4210.0,4070.0
134,2015/03/16,4130.0,4136.059,4120.0,60900,4180.0,4105.0
135,2015/03/17,4070.0,4113.277,4130.0,114900,4175.0,4060.0
136,2015/03/18,4065.0,4092.451,4070.0,127500,4155.0,4045.0
137,2015/03/19,3975.0,3980.522,4045.0,112100,4045.0,3950.0
138,2015/03/20,3955.0,3954.926,3960.0,60900,4015.0,3925.0
139,2015/03/23,3930.0,3939.211,3930.0,81100,4005.0,3915.0
140,2015/03/24,3935.0,3927.767,3905.0,83500,3965.0,3895.0
141,2015/03/25,3875.0,3875.412,3910.0,91000,3930.0,3845.0
142,2015/03/26,4005.0,3989.501,3905.0,124200,4035.0,3900.0
143,2015/03/27,4135.0,4146.054,4020.0,195900,4230.0,4020.0
144,2015/03/30,4235.0,4265.8,4205.0,227600,4325.0,4205.0
145,2015/03/31,4165.0,4144.199,4225.0,236000,4230.0,4020.0
146,2015/04/01,4085.0,4121.528,4180.0,82800,4205.0,4080.0
147,2015/04/02,4265.0,4236.361,4145.0,181800,4280.0,4130.0
148,2015/04/03,4285.0,4392.074,4300.0,329400,4545.0,4270.0
149,2015/04/06,4525.0,4547.664,4410.0,339400,4685.0,4375.0
150,2015/04/07,4390.0,4433.326,4470.0,148700,4545.0,4385.0
151,2015/04/08,4465.0,4450.247,4405.0,71000,4480.0,4400.0
152,2015/04/09,4725.0,4667.933,4535.0,234200,4750.0,4515.0
153,2015/04/10,4660.0,4706.276,4800.0,163800,4805.0,4630.0
154,2015/04/13,4610.0,4626.894,4695.0,86600,4710.0,4575.0
155,2015/04/14,4565.0,4644.516,4680.0,159100,4735.0,4550.0
156,2015/04/15,4685.0,4663.935,4565.0,192900,4710.0,4550.0
157,2015/04/16,4715.0,4768.949,4805.0,221700,4880.0,4660.0
158,2015/04/17,4860.0,4913.557,4850.0,500900,5040.0,4790.0
159,2015/04/20,4595.0,4683.79,4850.0,297500,4870.0,4575.0
160,2015/04/21,4500.0,4526.043,4605.0,226700,4650.0,4450.0
161,2015/04/22,4505.0,4542.259,4500.0,205200,4665.0,4470.0
162,2015/04/23,4540.0,4532.65,4500.0,145300,4570.0,4455.0
163,2015/04/24,4650.0,4652.086,4595.0,359800,4725.0,4500.0
164,2015/04/27,4570.0,4601.589,4695.0,156400,4710.0,4525.0
165,2015/04/28,4725.0,4677.956,4640.0,166800,4740.0,4590.0
166,2015/04/30,4620.0,4629.937,4655.0,118300,4675.0,4600.0
167,2015/05/01,4575.0,4571.289,4605.0,83400,4635.0,4535.0
168,2015/05/07,4500.0,4538.724,4585.0,91700,4635.0,4480.0
169,2015/05/08,4715.0,4723.411,4725.0,321200,4790.0,4660.0
170,2015/05/11,4615.0,4642.438,4700.0,149300,4710.0,4580.0
171,2015/05/12,4580.0,4597.092,4600.0,143200,4670.0,4570.0
172,2015/05/13,4545.0,4487.268,4470.0,112000,4570.0,4360.0
173,2015/05/14,4470.0,4470.202,4475.0,103900,4505.0,4440.0
174,2015/05/15,4585.0,4551.11,4470.0,77500,4590.0,4460.0
175,2015/05/18,4605.0,4594.991,4600.0,58200,4625.0,4555.0
176,2015/05/19,4620.0,4633.229,4590.0,59000,4660.0,4590.0
177,2015/05/20,4620.0,4617.402,4655.0,43300,4655.0,4590.0
178,2015/05/21,4620.0,4608.66,4585.0,51500,4635.0,4570.0
179,2015/05/22,4590.0,4589.651,4645.0,51600,4645.0,4565.0
180,2015/05/25,4590.0,4583.987,4600.0,70600,4615.0,4560.0
181,2015/05/26,4600.0,4593.009,4580.0,68300,4625.0,4560.0
182,2015/05/27,4695.0,4670.099,4600.0,101100,4715.0,4600.0
183,2015/05/28,4695.0,4689.765,4705.0,59600,4735.0,4660.0
184,2015/05/29,4815.0,4813.316,4705.0,168900,4895.0,4705.0
185,2015/06/01,4645.0,4676.883,4800.0,134100,4800.0,4625.0
186,2015/06/02,4610.0,4627.865,4630.0,117800,4680.0,4590.0
187,2015/06/03,4635.0,4620.58,4615.0,83600,4655.0,4590.0
188,2015/06/04,4650.0,4631.293,4635.0,63400,4655.0,4600.0
189,2015/06/05,4605.0,4598.622,4630.0,136100,4685.0,4555.0
190,2015/06/08,4925.0,4881.159,4815.0,431900,4965.0,4740.0
191,2015/06/09,4940.0,4954.215,4880.0,217200,5020.0,4880.0
192,2015/06/10,4940.0,4996.585,4945.0,209200,5120.0,4920.0
193,2015/06/11,5130.0,5076.407,4930.0,136500,5130.0,4930.0
194,2015/06/12,5170.0,5171.691,5170.0,175600,5200.0,5120.0
195,2015/06/15,5270.0,5242.629,5200.0,98900,5290.0,5200.0
196,2015/06/16,5310.0,5314.136,5260.0,126700,5380.0,5230.0
197,2015/06/17,5400.0,5391.272,5380.0,138400,5430.0,5340.0
198,2015/06/18,5290.0,5369.89,5400.0,118500,5480.0,5290.0
199,2015/06/19,5330.0,5339.233,5340.0,101700,5390.0,5270.0
200,2015/06/22,5400.0,5383.333,5420.0,55800,5420.0,5330.0
201,2015/06/23,5270.0,5284.747,5400.0,157800,5420.0,5210.0
202,2015/06/24,5300.0,5277.49,5250.0,124300,5340.0,5180.0
203,2015/06/25,5380.0,5367.412,5280.0,93500,5410.0,5280.0
204,2015/06/26,5310.0,5303.807,5380.0,50700,5380.0,5260.0
205,2015/06/29,5240.0,5247.782,5150.0,88800,5300.0,5150.0
206,2015/06/30,5280.0,5283.836,5240.0,39100,5330.0,5240.0
207,2015/07/01,5570.0,5464.864,5330.0,147000,5570.0,5260.0
208,2015/07/02,5470.0,5530.65,5610.0,140100,5650.0,5450.0
209,2015/07/03,5480.0,5403.256,5500.0,86000,5500.0,5310.0
210,2015/07/06,5570.0,5542.645,5470.0,122100,5590.0,5440.0
211,2015/07/07,5540.0,5571.284,5600.0,103600,5660.0,5490.0
212,2015/07/08,5420.0,5420.924,5510.0,118000,5530.0,5350.0
213,2015/07/09,5380.0,5255.421,5220.0,135400,5400.0,5110.0
214,2015/07/10,5320.0,5342.683,5450.0,96900,5450.0,5270.0
215,2015/07/13,5540.0,5620.09,5530.0,289100,5820.0,5480.0
216,2015/07/14,5660.0,5648.263,5700.0,132400,5700.0,5570.0
217,2015/07/15,5600.0,5586.463,5660.0,101500,5680.0,5540.0
218,2015/07/16,5650.0,5629.167,5600.0,86400,5690.0,5550.0
219,2015/07/17,5570.0,5552.377,5670.0,152300,5670.0,5490.0
220,2015/07/21,5500.0,5525.84,5580.0,106000,5590.0,5490.0
221,2015/07/22,5510.0,5477.706,5460.0,105500,5550.0,5420.0
222,2015/07/23,5770.0,5687.055,5530.0,214600,5770.0,5530.0
223,2015/07/24,5760.0,5782.451,5780.0,96700,5880.0,5730.0
224,2015/07/27,5790.0,5796.649,5780.0,93100,5840.0,5750.0
225,2015/07/28,5960.0,5894.079,5780.0,153700,5970.0,5750.0
226,2015/07/29,5950.0,5933.12,5980.0,104800,5990.0,5850.0
227,2015/07/30,5970.0,5983.864,6000.0,149600,6040.0,5910.0
228,2015/07/31,6040.0,6020.182,6000.0,131800,6070.0,5910.0
229,2015/08/03,6240.0,6214.814,6100.0,145200,6310.0,6060.0
230,2015/08/04,6370.0,6347.049,6300.0,143700,6400.0,6220.0
231,2015/08/05,6280.0,6308.716,6460.0,139400,6460.0,6220.0
232,2015/08/06,6220.0,6264.65,6400.0,108600,6400.0,6190.0
233,2015/08/07,6230.0,6160.679,6120.0,104600,6260.0,6060.0
234,2015/08/10,6240.0,6197.591,6180.0,66000,6250.0,6110.0
235,2015/08/11,6310.0,6257.296,6240.0,71000,6320.0,6200.0
236,2015/08/12,6170.0,6187.471,6210.0,86200,6260.0,6140.0
237,2015/08/13,6110.0,6071.898,6110.0,115900,6130.0,5990.0
238,2015/08/14,6300.0,6256.735,6100.0,102000,6330.0,6090.0
239,2015/08/17,6360.0,6335.888,6300.0,48400,6370.0,6300.0
240,2015/08/18,6270.0,6294.428,6350.0,61200,6370.0,6260.0
241,2015/08/19,6170.0,6192.486,6210.0,52700,6240.0,6160.0
242,2015/08/20,6160.0,6187.311,6140.0,67300,6250.0,6050.0
243,2015/08/21,5980.0,5993.335,6020.0,166700,6070.0,5920.0
244,2015/08/24,5480.0,5629.799,5780.0,303700,5840.0,5380.0
245,2015/08/25,5220.0,5306.585,5280.0,273500,5560.0,5060.0
246,2015/08/26,5350.0,5309.822,5290.0,185100,5440.0,5230.0
247,2015/08/27,5510.0,5544.46,5600.0,148000,5640.0,5450.0
248,2015/08/28,5640.0,5605.051,5660.0,68500,5660.0,5530.0
249,2015/08/31,5660.0,5637.028,5640.0,54500,5690.0,5580.0
250,2015/09/01,5460.0,5526.217,5600.0,106000,5630.0,5420.0
251,2015/09/02,5420.0,5421.377,5260.0,101700,5540.0,5260.0
252,2015/09/03,5400.0,5441.872,5500.0,90300,5550.0,5370.0
253,2015/09/04,5230.0,5246.492,5440.0,122000,5440.0,5160.0
254,2015/09/07,5130.0,5133.819,5170.0,131700,5210.0,5100.0
255,2015/09/08,5020.0,5045.689,5100.0,151600,5120.0,4995.0
256,2015/09/09,5280.0,5263.454,5200.0,94100,5380.0,5150.0
257,2015/09/10,5090.0,5090.177,5120.0,141500,5190.0,5000.0
258,2015/09/11,5240.0,5150.62,4990.0,109600,5280.0,4970.0
259,2015/09/14,5230.0,5249.351,5240.0,69300,5370.0,5200.0
260,2015/09/15,5170.0,5211.169,5190.0,67600,5270.0,5160.0
261,2015/09/16,5160.0,5181.829,5270.0,72700,5290.0,5110.0
262,2015/09/17,5340.0,5307.939,5200.0,65500,5380.0,5180.0
263,2015/09/18,5240.0,5267.118,5360.0,57600,5360.0,5210.0
264,2015/09/24,5280.0,5301.932,5190.0,64200,5370.0,5190.0
265,2015/09/25,5410.0,5371.436,5350.0,55000,5430.0,5320.0
266,2015/09/28,5550.0,5530.689,5410.0,72600,5600.0,5370.0
267,2015/09/29,5340.0,5396.86,5500.0,87900,5500.0,5340.0
268,2015/09/30,5600.0,5560.166,5410.0,66300,5620.0,5390.0
269,2015/10/01,5570.0,5634.049,5600.0,86200,5720.0,5550.0
270,2015/10/02,5580.0,5598.2,5550.0,76100,5720.0,5490.0
271,2015/10/05,5640.0,5616.456,5610.0,44300,5680.0,5550.0
272,2015/10/06,5730.0,5747.295,5740.0,70600,5810.0,5680.0
273,2015/10/07,5180.0,5214.485,5330.0,354100,5470.0,5050.0
274,2015/10/08,4875.0,4948.309,5180.0,285000,5190.0,4825.0
275,2015/10/09,4890.0,4897.264,4890.0,255800,4990.0,4815.0
276,2015/10/13,4960.0,4922.96,4880.0,212700,5030.0,4810.0
277,2015/10/14,4835.0,4887.759,4960.0,357800,5030.0,4790.0
278,2015/10/15,4815.0,4806.41,4805.0,211300,4870.0,4745.0
279,2015/10/16,4520.0,4582.252,4725.0,324200,4750.0,4480.0
280,2015/10/19,4630.0,4617.793,4505.0,213000,4680.0,4485.0
281,2015/10/20,4555.0,4580.163,4575.0,86100,4675.0,4540.0
282,2015/10/21,4500.0,4473.851,4515.0,145800,4585.0,4405.0
283,2015/10/22,4350.0,4359.696,4500.0,184300,4500.0,4305.0
284,2015/10/23,4370.0,4365.101,4400.0,113600,4400.0,4320.0
285,2015/10/26,4400.0,4394.685,4390.0,65100,4435.0,4370.0
286,2015/10/27,4435.0,4440.782,4350.0,122200,4485.0,4350.0
287,2015/10/28,4465.0,4449.737,4435.0,85500,4480.0,4390.0
288,2015/10/29,4425.0,4447.655,4480.0,95100,4500.0,4410.0
289,2015/10/30,4495.0,4495.371,4475.0,94300,4530.0,4450.0
290,2015/11/02,4445.0,4447.579,4415.0,82400,4500.0,4415.0
291,2015/11/04,4595.0,4570.752,4515.0,108400,4605.0,4505.0
292,2015/11/05,4555.0,4570.445,4585.0,120200,4630.0,4485.0
293,2015/11/06,4795.0,4775.565,4695.0,171600,4840.0,4690.0
294,2015/11/09,4850.0,4858.59,4860.0,118800,4895.0,4815.0
295,2015/11/10,4865.0,4847.826,4800.0,96600,4895.0,4765.0
296,2015/11/11,4885.0,4862.619,4845.0,124300,4900.0,4800.0
297,2015/11/12,4970.0,4955.392,4885.0,79000,5020.0,4880.0
298,2015/11/13,4955.0,4945.252,4925.0,47700,4990.0,4900.0
299,2015/11/16,4900.0,4887.543,4895.0,75900,4945.0,4800.0
300,2015/11/17,5010.0,5010.039,5020.0,65000,5040.0,4975.0
301,2015/11/18,5070.0,5074.488,5010.0,77200,5120.0,4995.0
302,2015/11/19,5150.0,5136.509,5100.0,63300,5170.0,5080.0
303,2015/11/20,5200.0,5187.831,5180.0,77900,5230.0,5150.0
304,2015/11/24,5360.0,5317.63,5250.0,86900,5380.0,5240.0
305,2015/11/25,5330.0,5335.284,5400.0,52800,5400.0,5290.0
306,2015/11/26,5400.0,5387.996,5400.0,44900,5420.0,5340.0
307,2015/11/27,5440.0,5427.368,5440.0,39900,5470.0,5360.0
308,2015/11/30,5360.0,5375.712,5450.0,109600,5450.0,5290.0
309,2015/12/01,5250.0,5208.21,5310.0,172100,5310.0,5050.0
310,2015/12/02,5250.0,5245.992,5200.0,94300,5280.0,5180.0
311,2015/12/03,5220.0,5231.785,5230.0,56600,5270.0,5210.0
312,2015/12/04,5220.0,5201.216,5160.0,81400,5230.0,5120.0
313,2015/12/07,4785.0,4858.012,5120.0,546400,5190.0,4700.0
314,2015/12/08,4825.0,4803.591,4750.0,148300,4870.0,4750.0
315,2015/12/09,4500.0,4562.677,4825.0,305000,4870.0,4465.0
316,2015/12/10,4395.0,4451.021,4490.0,215000,4545.0,4380.0
317,2015/12/11,4425.0,4425.4,4335.0,138700,4505.0,4335.0
318,2015/12/14,4430.0,4432.212,4415.0,83400,4475.0,4405.0
319,2015/12/15,4310.0,4370.537,4410.0,86600,4470.0,4290.0
320,2015/12/16,4370.0,4373.126,4425.0,75500,4445.0,4335.0
321,2015/12/17,4410.0,4440.609,4440.0,119100,4520.0,4385.0
322,2015/12/18,4400.0,4445.833,4485.0,100900,4510.0,4390.0
323,2015/12/21,4285.0,4271.297,4340.0,87500,4390.0,4185.0
324,2015/12/22,4400.0,4370.724,4335.0,100800,4430.0,4305.0
325,2015/12/24,4320.0,4359.754,4430.0,85500,4490.0,4310.0
326,2015/12/25,4395.0,4397.73,4340.0,59700,4450.0,4340.0
327,2015/12/28,4400.0,4392.006,4470.0,80500,4480.0,4320.0
328,2015/12/29,4480.0,4485.842,4465.0,75400,4550.0,4425.0
329,2015/12/30,4480.0,4479.188,4480.0,88100,4515.0,4435.0
330,2016/01/04,4400.0,4433.36,4480.0,107900,4515.0,4380.0
331,2016/01/05,4395.0,4385.295,4355.0,83100,4440.0,4300.0
332,2016/01/06,4515.0,4557.983,4700.0,287600,4700.0,4455.0
333,2016/01/07,4360.0,4404.663,4495.0,164500,4550.0,4325.0
334,2016/01/08,4370.0,4355.185,4305.0,154500,4415.0,4260.0
335,2016/01/12,4350.0,4375.625,4400.0,140800,4455.0,4335.0
336,2016/01/13,4485.0,4485.036,4440.0,236200,4535.0,4410.0
337,2016/01/14,4135.0,4098.289,4135.0,415900,4155.0,4020.0
338,2016/01/15,4355.0,4333.946,4260.0,303500,4470.0,4235.0
339,2016/01/18,4390.0,4394.014,4280.0,124700,4465.0,4280.0
340,2016/01/19,4665.0,4641.54,4430.0,259500,4730.0,4430.0
341,2016/01/20,4685.0,4722.007,4710.0,230900,4800.0,4615.0
342,2016/01/21,4555.0,4565.644,4615.0,165500,4680.0,4510.0
343,2016/01/22,4845.0,4767.915,4695.0,121600,4865.0,4635.0
344,2016/01/25,4975.0,4934.803,4900.0,109100,4995.0,4815.0
345,2016/01/26,4960.0,5048.046,4960.0,157600,5190.0,4915.0
346,2016/01/27,4895.0,4920.831,5030.0,94500,5120.0,4805.0
347,2016/01/28,5000.0,4999.004,4890.0,86300,5060.0,4880.0
348,2016/01/29,5130.0,5125.356,4995.0,167100,5220.0,4955.0
349,2016/02/01,5270.0,5259.292,5200.0,87600,5330.0,5160.0
350,2016/02/02,5380.0,5386.282,5240.0,134200,5470.0,5230.0
351,2016/02/03,5240.0,5242.668,5280.0,70100,5360.0,5160.0
352,2016/02/04,5060.0,5106.873,5210.0,74200,5230.0,5030.0
353,2016/02/05,4770.0,4820.182,4950.0,131600,4985.0,4700.0
354,2016/02/08,4765.0,4722.309,4700.0,112800,4795.0,4620.0
355,2016/02/09,4550.0,4593.315,4670.0,74200,4670.0,4525.0
356,2016/02/10,4490.0,4489.082,4560.0,82800,4575.0,4420.0
357,2016/02/12,4520.0,4465.546,4340.0,130100,4640.0,4310.0
358,2016/02/15,4680.0,4696.595,4680.0,88400,4790.0,4670.0
359,2016/02/16,4810.0,4845.824,4720.0,103200,4925.0,4720.0
360,2016/02/17,4960.0,4960.368,4880.0,180900,5090.0,4855.0
361,2016/02/18,4800.0,4851.822,5000.0,91100,5010.0,4770.0
362,2016/02/19,4735.0,4715.98,4745.0,40800,4770.0,4670.0
363,2016/02/22,4745.0,4769.449,4710.0,44500,4810.0,4695.0
364,2016/02/23,4590.0,4627.497,4780.0,85500,4795.0,4555.0
365,2016/02/24,4570.0,4592.784,4585.0,56400,4665.0,4525.0
366,2016/02/25,4730.0,4706.385,4600.0,62100,4760.0,4600.0
367,2016/02/26,4610.0,4682.772,4745.0,47800,4790.0,4605.0
368,2016/02/29,4575.0,4627.578,4625.0,47900,4685.0,4575.0
369,2016/03/01,4630.0,4631.983,4550.0,62800,4715.0,4530.0
370,2016/03/02,4680.0,4672.734,4700.0,45900,4700.0,4625.0
371,2016/03/03,4740.0,4744.244,4740.0,68100,4805.0,4680.0
372,2016/03/04,4745.0,4727.104,4700.0,47300,4765.0,4660.0
373,2016/03/07,4395.0,4424.003,4675.0,229200,4695.0,4325.0
374,2016/03/08,4380.0,4382.718,4390.0,122900,4445.0,4305.0
375,2016/03/09,4290.0,4294.193,4360.0,123300,4370.0,4260.0
376,2016/03/10,4460.0,4436.917,4350.0,85800,4475.0,4330.0
377,2016/03/11,4520.0,4478.284,4405.0,76900,4525.0,4400.0
378,2016/03/14,4350.0,4420.419,4570.0,137300,4580.0,4330.0
379,2016/03/15,4325.0,4341.112,4310.0,87700,4400.0,4290.0
380,2016/03/16,4390.0,4383.747,4325.0,89000,4425.0,4310.0
381,2016/03/17,4295.0,4337.459,4415.0,73000,4425.0,4285.0
382,2016/03/18,4335.0,4321.342,4295.0,82700,4355.0,4275.0
383,2016/03/22,4385.0,4360.14,4375.0,71700,4400.0,4305.0
384,2016/03/23,4245.0,4261.823,4370.0,122600,4380.0,4225.0
385,2016/03/24,4410.0,4349.43,4240.0,135100,4445.0,4225.0
386,2016/03/25,4310.0,4334.796,4400.0,66200,4415.0,4305.0
387,2016/03/28,4355.0,4316.795,4315.0,68800,4360.0,4270.0
388,2016/03/29,4335.0,4317.143,4285.0,53200,4345.0,4285.0
389,2016/03/30,4490.0,4460.512,4330.0,108500,4505.0,4330.0
390,2016/03/31,4400.0,4425.585,4470.0,79500,4500.0,4395.0
391,2016/04/01,4195.0,4238.355,4390.0,185100,4390.0,4165.0
392,2016/04/04,4065.0,4116.87,4180.0,111500,4215.0,4040.0
393,2016/04/05,3915.0,3937.326,4035.0,116300,4045.0,3885.0
394,2016/04/06,3605.0,3871.981,3845.0,339700,3950.0,3605.0
395,2016/04/07,3870.0,3853.171,3745.0,361100,3945.0,3720.0
396,2016/04/08,3810.0,3801.76,3750.0,206300,3830.0,3750.0
397,2016/04/11,3780.0,3789.153,3810.0,105600,3810.0,3765.0
398,2016/04/12,3795.0,3796.877,3765.0,125200,3815.0,3765.0
399,2016/04/13,3860.0,3857.186,3835.0,110500,3880.0,3820.0
400,2016/04/14,3895.0,3927.744,3910.0,244000,3985.0,3885.0
401,2016/04/15,3890.0,3867.425,3850.0,106800,3910.0,3810.0
402,2016/04/18,3805.0,3805.297,3810.0,111200,3820.0,3760.0
403,2016/04/19,3850.0,3844.08,3825.0,92900,3880.0,3815.0
404,2016/04/20,3850.0,3847.839,3815.0,103400,3890.0,3810.0
405,2016/04/21,3930.0,3916.28,3900.0,96500,3940.0,3880.0
406,2016/04/22,3965.0,3950.177,3950.0,149900,3985.0,3925.0
407,2016/04/25,3995.0,4003.033,4000.0,130900,4045.0,3960.0
408,2016/04/26,4015.0,3990.708,3950.0,119400,4020.0,3945.0
409,2016/04/27,4105.0,4070.904,4020.0,117300,4120.0,4000.0
410,2016/04/28,4085.0,4094.524,4115.0,92400,4140.0,4060.0
411,2016/05/02,3990.0,3986.33,3960.0,62400,4020.0,3915.0
412,2016/05/06,4065.0,4037.666,4010.0,120800,4080.0,3990.0
413,2016/05/09,3900.0,3868.059,3910.0,199600,3950.0,3800.0
414,2016/05/10,3950.0,3934.108,3905.0,95300,3985.0,3895.0
415,2016/05/11,3970.0,3952.117,3965.0,60700,4010.0,3900.0
416,2016/05/12,3835.0,3860.149,3935.0,63800,3935.0,3815.0
417,2016/05/13,3765.0,3788.223,3860.0,51200,3870.0,3760.0
418,2016/05/16,3645.0,3695.06,3765.0,75000,3805.0,3640.0
419,2016/05/17,3690.0,3685.176,3680.0,45500,3720.0,3655.0
420,2016/05/18,3665.0,3675.633,3690.0,32400,3725.0,3645.0
421,2016/05/19,3635.0,3645.332,3680.0,36200,3705.0,3625.0
422,2016/05/20,3625.0,3615.496,3625.0,111000,3690.0,3575.0
423,2016/05/23,3575.0,3582.031,3605.0,83700,3620.0,3555.0
424,2016/05/24,3570.0,3577.399,3575.0,39600,3610.0,3555.0
425,2016/05/25,3635.0,3637.949,3570.0,58500,3680.0,3570.0
426,2016/05/26,3630.0,3637.982,3615.0,27500,3680.0,3610.0
427,2016/05/27,3595.0,3592.945,3635.0,32600,3650.0,3580.0
428,2016/05/30,3715.0,3673.297,3575.0,45500,3730.0,3575.0
429,2016/05/31,3815.0,3779.699,3730.0,86500,3825.0,3705.0
430,2016/06/01,3740.0,3781.691,3780.0,55900,3850.0,3720.0
431,2016/06/02,3710.0,3708.421,3730.0,38000,3795.0,3670.0
432,2016/06/03,3710.0,3693.051,3700.0,39000,3720.0,3670.0
433,2016/06/06,3635.0,3631.296,3600.0,221000,3790.0,3480.0
434,2016/06/07,3860.0,3810.487,3675.0,93500,3885.0,3655.0
435,2016/06/08,3815.0,3822.44,3860.0,46100,3860.0,3775.0
436,2016/06/09,3890.0,3866.363,3845.0,43300,3905.0,3820.0
437,2016/06/10,3865.0,3877.422,3890.0,44800,3890.0,3845.0
438,2016/06/13,3635.0,3700.506,3855.0,85900,3860.0,3630.0
439,2016/06/14,3535.0,3547.474,3615.0,85500,3675.0,3495.0
440,2016/06/15,3710.0,3648.873,3540.0,65200,3725.0,3540.0
441,2016/06/16,3635.0,3690.019,3780.0,52600,3795.0,3630.0
442,2016/06/17,3710.0,3699.337,3690.0,81400,3750.0,3630.0
443,2016/06/20,3665.0,3709.63,3690.0,89200,3785.0,3665.0
444,2016/06/21,3600.0,3607.991,3615.0,64200,3645.0,3580.0
445,2016/06/22,3575.0,3572.928,3640.0,53800,3640.0,3545.0
446,2016/06/23,3705.0,3683.338,3635.0,69500,3725.0,3605.0
447,2016/06/24,3555.0,3581.184,3730.0,79800,3770.0,3450.0
448,2016/06/27,3910.0,3848.497,3660.0,191000,3930.0,3625.0
449,2016/06/28,3960.0,3996.251,3810.0,133900,4110.0,3800.0
450,2016/06/29,4065.0,4031.063,4000.0,71500,4095.0,3935.0
451,2016/06/30,4005.0,4028.924,4060.0,122200,4115.0,3995.0
452,2016/07/01,3960.0,3980.869,4005.0,48900,4040.0,3945.0
453,2016/07/04,4075.0,4053.708,4020.0,56100,4085.0,4005.0
454,2016/07/05,4050.0,4040.538,4070.0,35300,4080.0,4000.0
455,2016/07/06,4015.0,4040.883,3990.0,79300,4150.0,3980.0
456,2016/07/07,4085.0,4074.756,4030.0,39000,4100.0,4015.0
457,2016/07/08,4075.0,4137.405,4095.0,52400,4180.0,4075.0
458,2016/07/11,4315.0,4263.545,4145.0,125800,4330.0,4145.0
459,2016/07/12,4485.0,4465.149,4385.0,137200,4515.0,4380.0
460,2016/07/13,4390.0,4396.907,4465.0,102800,4465.0,4345.0
461,2016/07/14,4270.0,4284.685,4410.0,115800,4410.0,4215.0
462,2016/07/15,4150.0,4015.179,4060.0,481500,4150.0,3940.0
463,2016/07/19,4280.0,4248.548,4250.0,151900,4315.0,4150.0
464,2016/07/20,4400.0,4365.436,4210.0,123900,4450.0,4210.0
465,2016/07/21,4215.0,4222.603,4275.0,118500,4325.0,4190.0
466,2016/07/22,4265.0,4213.573,4205.0,80600,4280.0,4185.0
467,2016/07/25,4160.0,4179.986,4320.0,108000,4330.0,4125.0
468,2016/07/26,4120.0,4132.172,4110.0,82200,4185.0,4100.0
469,2016/07/27,4130.0,4116.496,4120.0,62500,4175.0,4070.0
470,2016/07/28,4100.0,4114.127,4110.0,60700,4200.0,4080.0
471,2016/07/29,4275.0,4212.299,4150.0,38500,4280.0,4130.0
472,2016/08/01,4400.0,4403.009,4215.0,132100,4490.0,4205.0
473,2016/08/02,4370.0,4381.265,4355.0,41900,4450.0,4335.0
474,2016/08/03,4315.0,4334.938,4345.0,80600,4415.0,4280.0
475,2016/08/04,4265.0,4295.993,4325.0,40800,4345.0,4255.0
476,2016/08/05,4220.0,4223.887,4265.0,31900,4275.0,4190.0
477,2016/08/08,4370.0,4336.897,4290.0,40600,4370.0,4250.0
478,2016/08/09,4455.0,4409.178,4350.0,30400,4465.0,4345.0
479,2016/08/10,4525.0,4512.757,4490.0,40800,4580.0,4475.0
480,2016/08/12,4520.0,4519.0,4525.0,23500,4550.0,4480.0
481,2016/08/15,4680.0,4637.073,4575.0,53300,4690.0,4570.0
482,2016/08/16,4660.0,4674.919,4700.0,49200,4710.0,4625.0
483,2016/08/17,4460.0,4486.163,4605.0,75700,4625.0,4415.0
484,2016/08/18,4490.0,4436.972,4415.0,50700,4520.0,4375.0
485,2016/08/19,4630.0,4561.326,4490.0,43000,4650.0,4470.0
486,2016/08/22,4460.0,4525.528,4600.0,41700,4680.0,4450.0
487,2016/08/23,4560.0,4527.588,4430.0,25500,4585.0,4400.0
488,2016/08/24,4545.0,4554.916,4580.0,17900,4585.0,4530.0
489,2016/08/25,4720.0,4682.526,4570.0,48700,4745.0,4570.0
490,2016/08/26,4705.0,4699.691,4710.0,35600,4730.0,4645.0
491,2016/08/29,4635.0,4586.274,4565.0,26300,4650.0,4545.0
492,2016/08/30,4680.0,4680.359,4655.0,36200,4705.0,4635.0
493,2016/08/31,4750.0,4711.507,4680.0,49100,4755.0,4640.0
494,2016/09/01,4695.0,4694.847,4745.0,19600,4745.0,4655.0
495,2016/09/02,4670.0,4677.563,4675.0,16000,4695.0,4645.0
496,2016/09/05,4510.0,4537.311,4630.0,31800,4635.0,4500.0
497,2016/09/06,4510.0,4505.917,4500.0,21800,4525.0,4480.0
498,2016/09/07,4530.0,4514.824,4470.0,17000,4540.0,4470.0
499,2016/09/08,4465.0,4460.143,4530.0,17500,4530.0,4425.0
500,2016/09/09,4380.0,4416.477,4450.0,28100,4450.0,4375.0
501,2016/09/12,4365.0,4355.373,4315.0,24100,4410.0,4295.0
502,2016/09/13,4285.0,4304.977,4360.0,43400,4380.0,4255.0
503,2016/09/14,4245.0,4265.996,4250.0,28100,4325.0,4210.0
504,2016/09/15,4225.0,4279.833,4315.0,35900,4385.0,4205.0
505,2016/09/16,4305.0,4318.03,4395.0,47200,4395.0,4300.0
506,2016/09/20,4430.0,4441.632,4400.0,34000,4545.0,4345.0
507,2016/09/21,4490.0,4468.049,4410.0,22300,4495.0,4410.0
508,2016/09/23,4680.0,4635.838,4555.0,38200,4705.0,4530.0
509,2016/09/26,4660.0,4678.918,4710.0,23100,4715.0,4655.0
510,2016/09/27,4795.0,4739.327,4650.0,54200,4795.0,4605.0
511,2016/09/28,4870.0,4858.132,4835.0,35600,4890.0,4820.0
512,2016/09/29,4900.0,4865.013,4890.0,39600,4925.0,4780.0
513,2016/09/30,4670.0,4686.224,4770.0,47800,4790.0,4615.0
514,2016/10/03,4860.0,4864.813,4870.0,58900,4900.0,4820.0
515,2016/10/04,4805.0,4820.0,4865.0,31500,4865.0,4780.0
516,2016/10/05,4900.0,4863.523,4795.0,28100,4900.0,4785.0
517,2016/10/06,5060.0,5003.226,4895.0,51300,5060.0,4850.0
518,2016/10/07,4985.0,4980.366,4960.0,23200,5030.0,4960.0
519,2016/10/11,4995.0,5003.182,5000.0,19800,5040.0,4950.0
520,2016/10/12,4975.0,4967.813,4930.0,32000,4995.0,4930.0
521,2016/10/13,5070.0,5060.649,4995.0,52400,5120.0,4985.0
522,2016/10/14,5070.0,5059.879,5010.0,78300,5140.0,4935.0
523,2016/10/17,5110.0,5098.982,5200.0,75600,5200.0,5030.0
524,2016/10/18,5120.0,5093.716,5000.0,81800,5130.0,5000.0
525,2016/10/19,5280.0,5234.904,5120.0,129900,5300.0,5100.0
526,2016/10/20,5270.0,5263.004,5240.0,57600,5300.0,5200.0
527,2016/10/21,5290.0,5313.767,5300.0,57600,5360.0,5270.0
528,2016/10/24,5200.0,5207.225,5190.0,47200,5280.0,5170.0
529,2016/10/25,5330.0,5314.708,5250.0,46300,5360.0,5240.0
530,2016/10/26,5580.0,5542.518,5390.0,126700,5610.0,5370.0
531,2016/10/27,5540.0,5561.824,5600.0,94300,5600.0,5500.0
532,2016/10/28,5490.0,5498.586,5540.0,70700,5580.0,5420.0
533,2016/10/31,5460.0,5457.008,5450.0,39100,5500.0,5390.0
534,2016/11/01,5480.0,5476.7,5450.0,39700,5510.0,5430.0
535,2016/11/02,5330.0,5372.61,5400.0,88500,5460.0,5320.0
536,2016/11/04,5290.0,5284.854,5230.0,51300,5330.0,5230.0
537,2016/11/07,5450.0,5429.031,5350.0,78400,5480.0,5350.0
538,2016/11/08,5480.0,5484.137,5450.0,59700,5540.0,5420.0
539,2016/11/09,5300.0,5360.807,5500.0,66900,5530.0,5210.0
540,2016/11/10,5470.0,5463.339,5500.0,57200,5530.0,5410.0
541,2016/11/11,5140.0,5213.201,5500.0,90600,5500.0,5110.0
542,2016/11/14,5000.0,5018.936,5070.0,107100,5150.0,4940.0
543,2016/11/15,4925.0,4934.609,4990.0,52400,5040.0,4900.0
544,2016/11/16,4825.0,4814.519,4900.0,106000,4900.0,4740.0
545,2016/11/17,4825.0,4814.723,4825.0,86500,4845.0,4765.0
546,2016/11/18,5070.0,5092.54,5090.0,149600,5180.0,5020.0
547,2016/11/21,5040.0,5063.135,5100.0,55500,5110.0,5010.0
548,2016/11/22,5020.0,5029.077,5060.0,37900,5060.0,5000.0
549,2016/11/24,4970.0,4981.998,5030.0,46800,5050.0,4940.0
550,2016/11/25,4870.0,4880.792,5000.0,61900,5010.0,4840.0
551,2016/11/28,4905.0,4902.682,4910.0,46800,4925.0,4870.0
552,2016/11/29,4840.0,4860.817,4905.0,46500,4905.0,4835.0
553,2016/11/30,4795.0,4803.207,4850.0,82800,4865.0,4775.0
554,2016/12/01,4810.0,4817.175,4795.0,166900,4865.0,4755.0
555,2016/12/02,4685.0,4688.177,4745.0,147300,4745.0,4635.0
556,2016/12/05,4685.0,4664.252,4655.0,72900,4695.0,4640.0
557,2016/12/06,4715.0,4717.048,4730.0,93000,4760.0,4670.0
558,2016/12/07,4670.0,4682.77,4780.0,68600,4780.0,4640.0
559,2016/12/08,4700.0,4665.296,4735.0,62500,4735.0,4610.0
560,2016/12/09,4735.0,4690.719,4640.0,70900,4755.0,4610.0
561,2016/12/12,4850.0,4823.313,4785.0,64300,4880.0,4750.0
562,2016/12/13,4980.0,4947.862,4880.0,62900,4995.0,4875.0
563,2016/12/14,4960.0,4981.62,5010.0,53700,5030.0,4950.0
564,2016/12/15,5000.0,4991.413,4985.0,37500,5010.0,4955.0
565,2016/12/16,5090.0,5089.51,5090.0,63300,5120.0,5050.0
566,2016/12/19,5120.0,5107.175,5070.0,40000,5130.0,5050.0
567,2016/12/20,5260.0,5222.975,5120.0,54800,5270.0,5080.0
568,2016/12/21,5140.0,5135.129,5210.0,54200,5210.0,5070.0
569,2016/12/22,5240.0,5193.026,5150.0,45600,5240.0,5120.0
570,2016/12/26,5220.0,5232.397,5250.0,24200,5260.0,5210.0
571,2016/12/27,5470.0,5390.088,5220.0,68000,5470.0,5220.0
572,2016/12/28,5300.0,5343.417,5440.0,55600,5440.0,5290.0
573,2016/12/29,5290.0,5281.967,5250.0,36100,5310.0,5250.0
574,2016/12/30,5390.0,5367.808,5390.0,98100,5440.0,5250.0
575,2017/01/04,5460.0,5465.325,5490.0,60100,5490.0,5440.0
576,2017/01/05,5440.0,5430.489,5450.0,73600,5470.0,5400.0
577,2017/01/06,5680.0,5631.82,5500.0,136800,5710.0,5460.0
578,2017/01/10,5790.0,5779.764,5720.0,101500,5830.0,5680.0
579,2017/01/11,5860.0,5887.128,5840.0,86000,5960.0,5820.0
580,2017/01/12,5740.0,5742.977,5840.0,100100,5850.0,5680.0
581,2017/01/13,5700.0,5772.552,5790.0,215100,5940.0,5630.0
582,2017/01/16,5880.0,5871.863,5700.0,115400,5940.0,5660.0
583,2017/01/17,5800.0,5812.975,5800.0,60500,5850.0,5750.0
584,2017/01/18,5700.0,5697.986,5770.0,58600,5810.0,5650.0
585,2017/01/19,5670.0,5695.567,5800.0,66100,5800.0,5640.0
586,2017/01/20,5680.0,5675.606,5700.0,52800,5700.0,5640.0
587,2017/01/23,5670.0,5685.584,5740.0,47100,5750.0,5660.0
588,2017/01/24,5610.0,5625.758,5630.0,38900,5680.0,5590.0
589,2017/01/25,5650.0,5648.127,5640.0,33100,5700.0,5600.0
590,2017/01/26,5670.0,5658.392,5690.0,39800,5690.0,5620.0
591,2017/01/27,5690.0,5689.927,5670.0,54500,5730.0,5650.0
592,2017/01/30,5640.0,5649.525,5710.0,37900,5750.0,5620.0
593,2017/01/31,5730.0,5731.383,5620.0,83900,5880.0,5620.0
594,2017/02/01,5900.0,5844.023,5760.0,70600,5920.0,5710.0
595,2017/02/02,5790.0,5823.525,5900.0,36600,5900.0,5770.0
596,2017/02/03,5870.0,5855.753,5790.0,29200,5890.0,5790.0
597,2017/02/06,5910.0,5942.126,5940.0,72900,6080.0,5830.0
598,2017/02/07,5870.0,5891.586,5960.0,22700,5960.0,5860.0
599,2017/02/08,5910.0,5878.103,5860.0,23200,5940.0,5810.0
600,2017/02/09,5970.0,5977.039,5910.0,26000,6020.0,5900.0
601,2017/02/10,6000.0,5992.159,6000.0,47700,6040.0,5960.0
602,2017/02/13,5980.0,5972.024,5970.0,25200,6010.0,5950.0
603,2017/02/14,5990.0,6022.625,6010.0,41900,6050.0,5990.0
604,2017/02/15,6130.0,6128.868,6050.0,59200,6170.0,6050.0
605,2017/02/16,6030.0,6072.768,6150.0,57800,6180.0,6020.0
606,2017/02/17,5900.0,5926.749,6030.0,40600,6030.0,5880.0
607,2017/02/20,5970.0,5955.576,5930.0,33000,5990.0,5890.0
608,2017/02/21,5890.0,5890.51,5970.0,25500,5970.0,5870.0
609,2017/02/22,5930.0,5907.065,5890.0,29300,5960.0,5830.0
610,2017/02/23,5940.0,5932.183,5900.0,14200,5950.0,5900.0
611,2017/02/24,5900.0,5912.247,5880.0,26700,5970.0,5860.0
612,2017/02/27,5950.0,5933.037,5890.0,61900,5960.0,5850.0
613,2017/02/28,6000.0,6031.135,5960.0,56400,6120.0,5960.0
614,2017/03/01,5940.0,5945.412,5970.0,25500,6000.0,5910.0
615,2017/03/02,6040.0,6011.56,6000.0,35900,6070.0,5940.0
616,2017/03/03,5990.0,6012.866,6010.0,15700,6040.0,5980.0
617,2017/03/06,5970.0,5963.716,5960.0,18300,5990.0,5930.0
618,2017/03/07,5860.0,5884.977,5960.0,21300,5960.0,5860.0
619,2017/03/08,5860.0,5840.158,5850.0,25400,5860.0,5800.0
620,2017/03/09,5940.0,5899.13,5880.0,13800,5940.0,5840.0
621,2017/03/10,6010.0,5997.821,5990.0,43600,6030.0,5970.0
622,2017/03/13,5910.0,5932.009,5970.0,22900,5990.0,5890.0
623,2017/03/14,5920.0,5908.929,5900.0,25200,5930.0,5870.0
624,2017/03/15,5870.0,5859.412,5900.0,20400,5900.0,5840.0
625,2017/03/16,5930.0,5882.306,5810.0,36000,5930.0,5790.0
626,2017/03/17,5950.0,5929.966,5900.0,29200,5950.0,5880.0
627,2017/03/21,6010.0,6012.471,5930.0,34400,6080.0,5910.0
628,2017/03/22,5910.0,5921.405,5890.0,17800,5960.0,5890.0
629,2017/03/23,5900.0,5888.364,5860.0,16500,5900.0,5860.0
630,2017/03/24,5910.0,5902.161,5900.0,16200,5930.0,5870.0
631,2017/03/27,5840.0,5810.708,5750.0,48000,5890.0,5710.0
632,2017/03/28,5990.0,5951.293,5890.0,41000,5990.0,5860.0
633,2017/03/29,5950.0,5953.699,6000.0,14600,6000.0,5910.0
634,2017/03/30,5910.0,5929.648,5950.0,19900,6000.0,5890.0
635,2017/03/31,5810.0,5861.826,5910.0,34500,5940.0,5810.0
636,2017/04/03,5840.0,5840.86,5810.0,18600,5880.0,5810.0
637,2017/04/04,5740.0,5780.695,5860.0,30200,5860.0,5720.0
638,2017/04/05,5670.0,5706.583,5740.0,27800,5760.0,5670.0
639,2017/04/06,5710.0,5732.437,5770.0,95600,5800.0,5670.0
640,2017/04/07,5650.0,5674.286,5710.0,32900,5770.0,5620.0
641,2017/04/10,5670.0,5633.333,5630.0,72900,5680.0,5590.0
642,2017/04/11,5860.0,5821.214,5710.0,65100,5880.0,5700.0
643,2017/04/12,5950.0,5879.208,5760.0,66900,5950.0,5760.0
644,2017/04/13,5940.0,5913.566,5890.0,35900,5950.0,5830.0
645,2017/04/14,5820.0,5901.79,5900.0,114500,6080.0,5800.0
646,2017/04/17,6050.0,5971.057,5770.0,78500,6070.0,5760.0
647,2017/04/18,5840.0,5865.435,6080.0,79300,6080.0,5780.0
648,2017/04/19,5950.0,5903.537,5830.0,68700,5990.0,5760.0
649,2017/04/20,6050.0,6041.831,5990.0,66100,6090.0,5960.0
650,2017/04/21,6040.0,6025.51,6040.0,44100,6060.0,5960.0
651,2017/04/24,6120.0,6111.601,6070.0,43100,6150.0,6060.0
652,2017/04/25,6120.0,6120.931,6130.0,29000,6150.0,6080.0
653,2017/04/26,6100.0,6139.758,6160.0,45500,6180.0,6090.0
654,2017/04/27,6080.0,6088.783,6070.0,30400,6130.0,6070.0
655,2017/04/28,6000.0,5996.035,6060.0,40600,6060.0,5960.0
656,2017/05/01,6030.0,6033.986,5970.0,27600,6080.0,5960.0
657,2017/05/02,6100.0,6083.178,6000.0,25800,6110.0,6000.0
658,2017/05/08,6180.0,6146.089,6120.0,73900,6190.0,6090.0
659,2017/05/09,6240.0,6259.148,6210.0,58700,6300.0,6180.0
660,2017/05/10,6370.0,6308.21,6240.0,77100,6370.0,6200.0
661,2017/05/11,6290.0,6311.711,6330.0,29800,6360.0,6280.0
662,2017/05/12,6360.0,6331.395,6260.0,43000,6370.0,6260.0
663,2017/05/15,6410.0,6374.582,6290.0,37100,6430.0,6280.0
664,2017/05/16,6380.0,6374.422,6410.0,39800,6440.0,6330.0
665,2017/05/17,6360.0,6351.578,6330.0,39300,6390.0,6290.0
666,2017/05/18,6270.0,6277.402,6260.0,45800,6310.0,6250.0
667,2017/05/19,6220.0,6226.614,6250.0,25100,6270.0,6180.0
668,2017/05/22,6280.0,6274.089,6290.0,38400,6310.0,6240.0
669,2017/05/23,6360.0,6365.978,6310.0,46000,6410.0,6310.0
670,2017/05/24,6440.0,6402.601,6390.0,44600,6440.0,6340.0
671,2017/05/25,6390.0,6378.469,6440.0,33300,6440.0,6320.0
672,2017/05/26,6330.0,6360.592,6440.0,45600,6440.0,6330.0
673,2017/05/29,6410.0,6393.551,6330.0,35200,6430.0,6320.0
674,2017/05/30,6450.0,6446.182,6440.0,27500,6480.0,6400.0
675,2017/05/31,6480.0,6481.901,6470.0,28400,6520.0,6440.0
676,2017/06/01,6550.0,6523.813,6460.0,43800,6570.0,6440.0
677,2017/06/02,6520.0,6526.166,6560.0,56600,6580.0,6490.0
678,2017/06/05,6580.0,6546.38,6530.0,66300,6600.0,6470.0
679,2017/06/06,6580.0,6610.305,6680.0,78600,6680.0,6540.0
680,2017/06/07,6510.0,6480.8,6590.0,50000,6630.0,6430.0
681,2017/06/08,6310.0,6344.137,6520.0,113600,6520.0,6260.0
682,2017/06/09,6240.0,6240.448,6290.0,69200,6290.0,6170.0
683,2017/06/12,6140.0,6134.935,6220.0,46000,6220.0,6080.0
684,2017/06/13,6190.0,6170.291,6170.0,24100,6190.0,6140.0
685,2017/06/14,6160.0,6199.748,6200.0,35700,6270.0,6140.0
686,2017/06/15,6210.0,6198.969,6160.0,29100,6240.0,6160.0
687,2017/06/16,6170.0,6206.332,6280.0,28900,6280.0,6160.0
688,2017/06/19,6270.0,6242.865,6170.0,19200,6270.0,6170.0
689,2017/06/20,6310.0,6302.445,6290.0,31900,6330.0,6260.0
690,2017/06/21,6330.0,6327.167,6310.0,46600,6380.0,6280.0
691,2017/06/22,6300.0,6274.835,6370.0,24200,6370.0,6230.0
692,2017/06/23,6260.0,6267.05,6300.0,27800,6320.0,6240.0
693,2017/06/26,6310.0,6294.028,6300.0,21600,6310.0,6270.0
694,2017/06/27,6310.0,6332.141,6370.0,36900,6410.0,6290.0
695,2017/06/28,6270.0,6261.229,6300.0,42300,6300.0,6220.0
696,2017/06/29,6220.0,6235.148,6300.0,47200,6300.0,6210.0
697,2017/06/30,6260.0,6198.626,6240.0,39300,6260.0,6120.0
698,2017/07/03,6160.0,6197.078,6260.0,33200,6300.0,6150.0
699,2017/07/04,6090.0,6115.419,6190.0,45400,6200.0,6070.0
700,2017/07/05,6120.0,6104.471,6140.0,34000,6140.0,6050.0
701,2017/07/06,6090.0,6128.0,6160.0,52500,6220.0,6090.0
702,2017/07/07,6050.0,6041.598,6070.0,48800,6080.0,5990.0
703,2017/07/10,6010.0,6027.345,6060.0,53100,6080.0,5990.0
704,2017/07/11,5990.0,5997.732,6000.0,56000,6040.0,5940.0
705,2017/07/12,6000.0,6007.194,6000.0,50600,6050.0,5970.0
706,2017/07/13,6000.0,6001.068,6050.0,48700,6050.0,5980.0
707,2017/07/14,6160.0,6126.013,6040.0,74500,6210.0,6000.0
708,2017/07/18,6450.0,6470.528,6510.0,253900,6560.0,6400.0
709,2017/07/19,6310.0,6357.268,6450.0,115300,6480.0,6280.0
710,2017/07/20,6270.0,6291.764,6340.0,51600,6350.0,6260.0
711,2017/07/21,6400.0,6302.676,6270.0,123700,6420.0,6160.0
712,2017/07/24,6680.0,6612.174,6400.0,138000,6690.0,6400.0
713,2017/07/25,6570.0,6611.301,6700.0,56900,6700.0,6570.0
714,2017/07/26,6620.0,6614.761,6640.0,33400,6640.0,6580.0
715,2017/07/27,6730.0,6728.34,6660.0,75900,6790.0,6660.0
716,2017/07/28,6780.0,6762.984,6730.0,56300,6790.0,6710.0
717,2017/07/31,6720.0,6741.603,6790.0,68000,6790.0,6680.0
718,2017/08/01,6710.0,6711.86,6720.0,57000,6760.0,6650.0
719,2017/08/02,6780.0,6807.041,6850.0,46300,6850.0,6760.0
720,2017/08/03,6730.0,6725.271,6780.0,42500,6800.0,6680.0
721,2017/08/04,6760.0,6737.277,6720.0,41500,6770.0,6700.0
722,2017/08/07,6660.0,6694.566,6770.0,54100,6770.0,6650.0
723,2017/08/08,6580.0,6591.291,6660.0,45700,6670.0,6550.0
724,2017/08/09,6480.0,6491.05,6570.0,80000,6570.0,6450.0
725,2017/08/10,6550.0,6519.556,6470.0,54000,6570.0,6470.0
726,2017/08/14,6450.0,6490.54,6520.0,50000,6540.0,6440.0
727,2017/08/15,6500.0,6495.716,6480.0,71200,6560.0,6420.0
728,2017/08/16,6460.0,6487.626,6530.0,51800,6530.0,6430.0
729,2017/08/17,6420.0,6446.712,6470.0,44400,6480.0,6400.0
730,2017/08/18,6310.0,6349.425,6400.0,55600,6400.0,6310.0
731,2017/08/21,6330.0,6341.985,6330.0,64500,6400.0,6320.0
732,2017/08/22,6260.0,6314.376,6390.0,66500,6390.0,6230.0
733,2017/08/23,6250.0,6267.57,6310.0,67500,6310.0,6220.0
734,2017/08/24,6230.0,6251.237,6260.0,59000,6290.0,6220.0
735,2017/08/25,6200.0,6193.345,6220.0,58000,6260.0,6150.0
736,2017/08/28,6220.0,6181.885,6170.0,204300,6230.0,6170.0
737,2017/08/29,6310.0,6244.092,6230.0,161300,6320.0,6180.0
738,2017/08/30,6350.0,6386.71,6350.0,77200,6440.0,6330.0
739,2017/08/31,6450.0,6431.279,6380.0,43800,6490.0,6340.0
740,2017/09/01,6680.0,6674.854,6550.0,116600,6750.0,6550.0
741,2017/09/04,6640.0,6619.214,6700.0,45800,6700.0,6560.0
742,2017/09/05,6570.0,6587.354,6580.0,42700,6650.0,6540.0
743,2017/09/06,6680.0,6597.569,6470.0,57600,6680.0,6420.0
744,2017/09/07,6610.0,6626.423,6600.0,67100,6730.0,6540.0
745,2017/09/08,6600.0,6634.861,6640.0,50400,6680.0,6590.0
746,2017/09/11,6640.0,6639.918,6600.0,24500,6670.0,6600.0
747,2017/09/12,6640.0,6643.431,6660.0,23900,6670.0,6610.0
748,2017/09/13,6660.0,6654.679,6620.0,32700,6690.0,6610.0
749,2017/09/14,6630.0,6646.327,6640.0,24500,6690.0,6620.0
750,2017/09/15,6600.0,6569.592,6600.0,49000,6600.0,6520.0
751,2017/09/19,6670.0,6654.174,6640.0,44800,6690.0,6570.0
752,2017/09/20,6690.0,6616.646,6600.0,64100,6690.0,6530.0
753,2017/09/21,6750.0,6724.355,6630.0,58100,6770.0,6610.0
754,2017/09/22,6930.0,6845.504,6710.0,104100,6970.0,6670.0
755,2017/09/25,6980.0,6937.798,6930.0,114000,7000.0,6820.0
756,2017/09/26,7010.0,7016.475,6980.0,60700,7080.0,6950.0
757,2017/09/27,6950.0,6972.582,6980.0,39900,7040.0,6910.0
758,2017/09/28,6950.0,6939.498,7000.0,41800,7000.0,6870.0
759,2017/09/29,7030.0,7007.526,6950.0,76000,7070.0,6870.0
760,2017/10/02,6990.0,6999.112,7090.0,42800,7090.0,6960.0
761,2017/10/03,6970.0,7009.686,7070.0,51000,7070.0,6970.0
762,2017/10/04,6890.0,6915.222,7000.0,54000,7020.0,6870.0
763,2017/10/05,6850.0,6843.166,6890.0,47700,6890.0,6800.0
764,2017/10/06,6500.0,6605.172,6830.0,217500,6850.0,6470.0
765,2017/10/10,6510.0,6490.8,6460.0,127500,6550.0,6430.0
766,2017/10/11,6560.0,6548.307,6550.0,131700,6610.0,6500.0
767,2017/10/12,6690.0,6678.086,6660.0,98200,6740.0,6600.0
768,2017/10/13,6110.0,6160.558,6390.0,596900,6390.0,6010.0
769,2017/10/16,5900.0,5973.542,6110.0,317100,6140.0,5860.0
770,2017/10/17,5960.0,5914.431,5830.0,397000,6000.0,5790.0
771,2017/10/18,6050.0,6011.531,5980.0,199900,6080.0,5860.0
772,2017/10/19,5940.0,5958.199,6030.0,129900,6050.0,5920.0
773,2017/10/20,5840.0,5865.593,5910.0,96900,5920.0,5820.0
774,2017/10/23,5940.0,5925.961,5870.0,157700,5990.0,5850.0
775,2017/10/24,5930.0,5921.232,5950.0,74700,5950.0,5880.0
776,2017/10/25,5840.0,5826.598,5800.0,179600,5900.0,5710.0
777,2017/10/26,5880.0,5891.446,5840.0,107900,5930.0,5820.0
778,2017/10/27,5820.0,5850.965,5910.0,153400,5910.0,5810.0
779,2017/10/30,5930.0,5907.077,5850.0,168300,5940.0,5840.0
780,2017/10/31,5900.0,5911.161,5970.0,99900,5970.0,5860.0
781,2017/11/01,5870.0,5896.839,5900.0,65800,5950.0,5870.0
782,2017/11/02,5930.0,5874.512,5880.0,92200,5940.0,5820.0
783,2017/11/06,5870.0,5876.661,5890.0,190200,5920.0,5770.0
784,2017/11/07,5780.0,5793.553,5870.0,156200,5890.0,5750.0
785,2017/11/08,5760.0,5751.855,5800.0,117500,5810.0,5730.0
786,2017/11/09,5730.0,5732.101,5740.0,191800,5760.0,5690.0
787,2017/11/10,5650.0,5646.229,5680.0,180600,5680.0,5610.0
788,2017/11/13,5650.0,5652.425,5680.0,106800,5690.0,5610.0
789,2017/11/14,5560.0,5575.415,5660.0,80700,5660.0,5540.0
790,2017/11/15,5440.0,5447.007,5510.0,175400,5520.0,5410.0
791,2017/11/16,5450.0,5446.332,5430.0,114500,5470.0,5410.0
792,2017/11/17,5440.0,5435.806,5450.0,144000,5460.0,5410.0
793,2017/11/20,5440.0,5439.478,5420.0,122500,5470.0,5400.0
794,2017/11/21,5450.0,5450.361,5470.0,74900,5480.0,5430.0
795,2017/11/22,5450.0,5456.571,5490.0,143200,5490.0,5430.0
796,2017/11/24,5430.0,5425.042,5420.0,131900,5460.0,5310.0
797,2017/11/27,5430.0,5441.488,5450.0,67900,5460.0,5410.0
798,2017/11/28,5440.0,5440.22,5430.0,68100,5470.0,5400.0
799,2017/11/29,5810.0,5735.606,5640.0,351400,5860.0,5560.0
800,2017/11/30,5760.0,5709.536,5820.0,398300,5830.0,5520.0
801,2017/12/01,5670.0,5712.41,5830.0,141100,5830.0,5670.0
802,2017/12/04,5580.0,5649.828,5770.0,110200,5770.0,5580.0
803,2017/12/05,5610.0,5617.925,5550.0,67000,5670.0,5550.0
804,2017/12/06,5610.0,5623.728,5560.0,138700,5710.0,5560.0
805,2017/12/07,5560.0,5550.398,5580.0,145900,5630.0,5480.0
806,2017/12/08,5690.0,5618.491,5460.0,133900,5690.0,5460.0
807,2017/12/11,5780.0,5735.287,5650.0,80200,5790.0,5640.0
808,2017/12/12,5860.0,5839.908,5790.0,108800,5880.0,5750.0
809,2017/12/13,5820.0,5857.575,5870.0,79600,5950.0,5810.0
810,2017/12/14,5910.0,5878.799,5800.0,69100,5920.0,5770.0
811,2017/12/15,6000.0,5961.296,5860.0,116500,6010.0,5850.0
812,2017/12/18,5970.0,5998.044,6040.0,140600,6140.0,5900.0
813,2017/12/19,5900.0,5921.975,5890.0,88100,5990.0,5890.0
814,2017/12/20,5880.0,5888.958,5880.0,51800,5920.0,5870.0
815,2017/12/21,5880.0,5873.3,5850.0,49400,5900.0,5850.0
816,2017/12/22,5950.0,5947.49,5880.0,50600,5980.0,5870.0
817,2017/12/25,5930.0,5934.178,5960.0,51700,5970.0,5890.0
818,2017/12/26,5950.0,5953.781,5930.0,36500,5980.0,5920.0
819,2017/12/27,5850.0,5880.791,5900.0,46800,5910.0,5850.0
820,2017/12/28,5870.0,5871.816,5800.0,51200,5920.0,5800.0
821,2017/12/29,5940.0,5937.793,5920.0,66600,6000.0,5860.0
822,2018/01/04,5940.0,5936.505,5980.0,65800,5980.0,5910.0
823,2018/01/05,5770.0,5831.487,5970.0,95500,5970.0,5770.0
824,2018/01/09,5430.0,5467.916,5770.0,698000,5780.0,5310.0
825,2018/01/10,5300.0,5363.025,5410.0,324300,5480.0,5270.0
826,2018/01/11,5260.0,5214.694,5250.0,183000,5270.0,5160.0
827,2018/01/12,4895.0,4837.934,4820.0,634400,4895.0,4730.0
828,2018/01/15,4975.0,4956.177,4905.0,199600,5030.0,4895.0
829,2018/01/16,5260.0,5236.257,5090.0,422100,5350.0,5080.0
830,2018/01/17,4985.0,5056.849,5220.0,179800,5220.0,4985.0
831,2018/01/18,4945.0,4960.614,4955.0,179200,5050.0,4935.0
832,2018/01/19,4985.0,4980.945,4950.0,116900,5030.0,4945.0
833,2018/01/22,4920.0,4913.166,4935.0,185700,5010.0,4875.0
834,2018/01/23,4935.0,4933.068,4940.0,54100,4960.0,4900.0
835,2018/01/24,4825.0,4841.289,4920.0,237000,4945.0,4805.0
836,2018/01/25,4810.0,4853.173,4830.0,157900,4945.0,4810.0
837,2018/01/26,4885.0,4872.522,4820.0,146900,4920.0,4820.0
838,2018/01/29,5010.0,4993.395,4905.0,167900,5040.0,4905.0
839,2018/01/30,4920.0,4973.176,5080.0,124200,5090.0,4920.0
840,2018/01/31,5010.0,5018.316,4990.0,140400,5060.0,4975.0
841,2018/02/01,5150.0,5110.682,5010.0,158300,5160.0,5010.0
842,2018/02/02,5060.0,5076.814,5080.0,115500,5130.0,5030.0
843,2018/02/05,5040.0,5013.359,4995.0,84400,5060.0,4965.0
844,2018/02/06,5050.0,4991.944,4945.0,227100,5070.0,4885.0
845,2018/02/07,5080.0,5166.686,5090.0,156900,5300.0,5080.0
846,2018/02/08,5310.0,5278.088,5110.0,212900,5360.0,5110.0
847,2018/02/09,5290.0,5188.515,5010.0,130000,5300.0,5010.0
848,2018/02/13,5180.0,5213.109,5290.0,105500,5300.0,5160.0
849,2018/02/14,5190.0,5170.054,5180.0,93500,5230.0,5110.0
850,2018/02/15,5140.0,5185.206,5200.0,80300,5260.0,5140.0
851,2018/02/16,5220.0,5225.676,5180.0,62900,5270.0,5170.0
852,2018/02/19,5360.0,5357.952,5270.0,66900,5390.0,5270.0
853,2018/02/20,5360.0,5363.372,5360.0,51900,5400.0,5320.0
854,2018/02/21,5240.0,5259.835,5360.0,60500,5360.0,5200.0
855,2018/02/22,5240.0,5227.479,5200.0,48400,5270.0,5150.0
856,2018/02/23,5220.0,5232.638,5280.0,25400,5280.0,5200.0
857,2018/02/26,5420.0,5385.302,5220.0,92600,5440.0,5220.0
858,2018/02/27,5280.0,5316.973,5400.0,73000,5400.0,5260.0
859,2018/02/28,5190.0,5235.149,5250.0,60400,5310.0,5190.0
860,2018/03/01,5140.0,5142.087,5180.0,62300,5200.0,5120.0
861,2018/03/02,5140.0,5163.327,5100.0,98000,5250.0,5040.0
862,2018/03/05,5110.0,5106.061,5170.0,52800,5180.0,5060.0
863,2018/03/06,5500.0,5467.297,5220.0,188700,5570.0,5210.0
864,2018/03/07,5500.0,5505.514,5500.0,59300,5540.0,5460.0
865,2018/03/08,5420.0,5441.109,5480.0,49600,5530.0,5390.0
866,2018/03/09,5310.0,5335.899,5430.0,72900,5460.0,5280.0
867,2018/03/12,5350.0,5342.222,5370.0,31500,5370.0,5300.0
868,2018/03/13,5350.0,5295.453,5280.0,62900,5350.0,5250.0
869,2018/03/14,5430.0,5379.396,5360.0,74500,5460.0,5270.0
870,2018/03/15,5410.0,5409.257,5360.0,40400,5460.0,5340.0
871,2018/03/16,5450.0,5440.257,5410.0,50500,5480.0,5340.0
872,2018/03/19,5690.0,5604.802,5480.0,146200,5710.0,5460.0
873,2018/03/20,5530.0,5588.846,5640.0,67600,5680.0,5510.0
874,2018/03/22,5590.0,5560.376,5470.0,47900,5610.0,5470.0
875,2018/03/23,5370.0,5410.726,5470.0,48200,5510.0,5340.0
876,2018/03/26,5590.0,5542.886,5410.0,102900,5620.0,5410.0
877,2018/03/27,5570.0,5544.647,5530.0,70800,5590.0,5490.0
878,2018/03/28,5700.0,5697.873,5550.0,111400,5760.0,5540.0
879,2018/03/29,5830.0,5810.353,5720.0,155900,5900.0,5720.0
880,2018/03/30,5920.0,5917.867,5860.0,108300,5980.0,5850.0
881,2018/04/02,5760.0,5791.351,5860.0,70300,5860.0,5750.0
882,2018/04/03,5820.0,5810.464,5700.0,71200,5880.0,5680.0
883,2018/04/04,5930.0,5927.772,5820.0,79000,5970.0,5800.0
884,2018/04/05,5830.0,5849.831,5880.0,106400,5910.0,5790.0
885,2018/04/06,6120.0,6232.843,6230.0,573800,6340.0,6100.0
886,2018/04/09,5860.0,5919.315,6020.0,202900,6030.0,5850.0
887,2018/04/10,5800.0,5835.326,5850.0,128800,5910.0,5790.0
888,2018/04/11,5670.0,5623.661,5750.0,218500,5750.0,5510.0
889,2018/04/12,5620.0,5646.661,5700.0,60200,5730.0,5590.0
890,2018/04/13,5620.0,5636.422,5630.0,83000,5700.0,5590.0
891,2018/04/16,5880.0,5822.019,5720.0,219900,5920.0,5630.0
892,2018/04/17,5790.0,5806.083,5860.0,145500,5950.0,5730.0
893,2018/04/18,5740.0,5776.261,5770.0,90400,5890.0,5710.0
894,2018/04/19,5730.0,5678.554,5730.0,174900,5800.0,5570.0
895,2018/04/20,5880.0,5854.314,5750.0,87400,5910.0,5720.0
896,2018/04/23,5820.0,5797.252,5790.0,65500,5830.0,5740.0
897,2018/04/24,5920.0,5886.925,5870.0,100800,5930.0,5740.0
898,2018/04/25,5940.0,5924.399,5910.0,103200,5970.0,5870.0
899,2018/04/26,6060.0,6018.196,5940.0,119200,6080.0,5910.0
900,2018/04/27,5940.0,5971.391,6060.0,102100,6080.0,5900.0
901,2018/05/01,6000.0,5947.915,5940.0,124200,6020.0,5830.0
902,2018/05/02,5710.0,5772.969,5970.0,221300,5990.0,5650.0
903,2018/05/07,5850.0,5896.11,5800.0,216200,6060.0,5800.0
904,2018/05/08,5790.0,5807.377,5880.0,114000,5900.0,5730.0
905,2018/05/09,5790.0,5886.054,5880.0,143700,6010.0,5770.0
906,2018/05/10,5860.0,5829.777,5870.0,71600,5870.0,5780.0
907,2018/05/11,5850.0,5841.691,5800.0,55000,5870.0,5790.0
908,2018/05/14,5880.0,5873.193,5900.0,85500,5930.0,5830.0
909,2018/05/15,5850.0,5849.637,5870.0,60600,5890.0,5810.0
910,2018/05/16,5890.0,5894.82,5890.0,55400,5920.0,5860.0
911,2018/05/17,5980.0,5968.442,5940.0,96900,5990.0,5900.0
912,2018/05/18,6240.0,6175.481,6020.0,163100,6250.0,6010.0
913,2018/05/21,6190.0,6200.0,6250.0,54100,6260.0,6160.0
914,2018/05/22,6230.0,6235.475,6250.0,35800,6270.0,6190.0
915,2018/05/23,6290.0,6264.743,6240.0,81600,6310.0,6220.0
916,2018/05/24,6380.0,6360.305,6350.0,128000,6410.0,6270.0
917,2018/05/25,6290.0,6303.589,6330.0,99200,6370.0,6240.0
918,2018/05/28,6200.0,6230.52,6340.0,38500,6340.0,6190.0
919,2018/05/29,6270.0,6241.677,6150.0,117500,6290.0,6150.0
920,2018/05/30,6200.0,6178.816,6220.0,82800,6220.0,6110.0
921,2018/05/31,6080.0,6148.097,6230.0,78300,6270.0,6080.0
922,2018/06/01,6050.0,6084.12,6060.0,113600,6190.0,6000.0
923,2018/06/04,6070.0,6071.816,6130.0,80400,6160.0,6020.0
924,2018/06/05,6120.0,6111.978,6100.0,46000,6140.0,6060.0
925,2018/06/06,6040.0,6063.281,6050.0,82600,6140.0,6030.0
926,2018/06/07,6040.0,6035.168,6110.0,71400,6130.0,5990.0
927,2018/06/08,6000.0,5991.511,6000.0,113200,6040.0,5930.0
928,2018/06/11,6120.0,6092.121,6040.0,69300,6160.0,6020.0
929,2018/06/12,6180.0,6161.107,6120.0,52400,6190.0,6110.0
930,2018/06/13,6570.0,6549.293,6370.0,219200,6680.0,6350.0
931,2018/06/14,6740.0,6723.592,6670.0,112200,6840.0,6600.0
932,2018/06/15,6810.0,6854.781,6830.0,98100,6920.0,6800.0
933,2018/06/18,6890.0,6884.183,6840.0,51400,6930.0,6820.0
934,2018/06/19,6820.0,6865.421,6930.0,43900,6930.0,6820.0
935,2018/06/20,6860.0,6849.219,6820.0,39700,6880.0,6810.0
936,2018/06/21,6690.0,6721.126,6770.0,92400,6800.0,6670.0
937,2018/06/22,6720.0,6717.606,6670.0,101100,6780.0,6670.0
938,2018/06/25,6600.0,6649.601,6730.0,75200,6760.0,6580.0
939,2018/06/26,6560.0,6530.765,6530.0,81000,6580.0,6480.0
940,2018/06/27,6490.0,6502.989,6510.0,45500,6550.0,6470.0
941,2018/06/28,6330.0,6346.893,6480.0,70800,6490.0,6300.0
942,2018/06/29,6330.0,6344.773,6360.0,46300,6380.0,6310.0
943,2018/07/02,6070.0,6101.197,6260.0,107800,6270.0,6040.0
944,2018/07/03,6250.0,6224.902,6100.0,121800,6290.0,6080.0
945,2018/07/04,6310.0,6270.286,6240.0,73400,6350.0,6180.0
946,2018/07/05,6410.0,6392.535,6310.0,84800,6430.0,6310.0
947,2018/07/06,6840.0,6754.796,6600.0,247700,6920.0,6580.0
948,2018/07/09,6430.0,6508.311,6800.0,152200,6800.0,6380.0
949,2018/07/10,6450.0,6437.454,6530.0,102900,6550.0,6350.0
950,2018/07/11,6320.0,6366.863,6480.0,83200,6550.0,6300.0
951,2018/07/12,6510.0,6436.357,6290.0,130100,6510.0,6290.0
952,2018/07/13,5900.0,5821.137,5810.0,517300,5940.0,5710.0
953,2018/07/17,6220.0,6099.031,5950.0,188800,6220.0,5950.0
954,2018/07/18,6370.0,6359.585,6300.0,151700,6390.0,6270.0
955,2018/07/19,6200.0,6216.525,6300.0,117400,6310.0,6150.0
956,2018/07/20,6150.0,6155.559,6200.0,67100,6220.0,6110.0
957,2018/07/23,6170.0,6126.656,6140.0,59500,6180.0,6060.0
958,2018/07/24,6280.0,6248.506,6200.0,62900,6290.0,6160.0
959,2018/07/25,6390.0,6385.195,6340.0,105300,6420.0,6330.0
960,2018/07/26,6390.0,6398.922,6410.0,77900,6470.0,6350.0
961,2018/07/27,6380.0,6365.28,6390.0,42800,6410.0,6320.0
962,2018/07/30,6340.0,6345.934,6370.0,51400,6370.0,6310.0
963,2018/07/31,6300.0,6313.771,6330.0,67100,6370.0,6260.0
964,2018/08/01,6230.0,6266.58,6310.0,50000,6320.0,6220.0
965,2018/08/02,6260.0,6258.901,6230.0,71000,6320.0,6210.0
966,2018/08/03,6100.0,6160.659,6270.0,60700,6300.0,6090.0
967,2018/08/06,6240.0,6214.845,6160.0,113100,6270.0,6130.0
968,2018/08/07,6370.0,6343.695,6270.0,77400,6400.0,6270.0
969,2018/08/08,6280.0,6301.838,6340.0,54400,6340.0,6260.0
970,2018/08/09,6220.0,6261.123,6300.0,47200,6330.0,6210.0
971,2018/08/10,6200.0,6206.177,6240.0,39500,6240.0,6170.0
972,2018/08/13,6130.0,6158.923,6200.0,54800,6210.0,6110.0
973,2018/08/14,6290.0,6234.898,6130.0,44100,6290.0,6130.0
974,2018/08/15,6250.0,6256.092,6300.0,26100,6300.0,6220.0
975,2018/08/16,6030.0,6102.393,6220.0,65200,6250.0,6020.0
976,2018/08/17,6120.0,6105.157,6130.0,63800,6130.0,6040.0
977,2018/08/20,6160.0,6155.124,6170.0,64600,6170.0,6090.0
978,2018/08/21,6100.0,6142.475,6180.0,39600,6180.0,6100.0
979,2018/08/22,5960.0,6030.025,6080.0,79700,6080.0,5950.0
980,2018/08/23,5860.0,5920.716,6000.0,170400,6000.0,5820.0
981,2018/08/24,6000.0,5922.655,5840.0,103200,6020.0,5810.0
982,2018/08/27,6010.0,6012.523,6030.0,165300,6080.0,5940.0
983,2018/08/28,5990.0,5996.862,6000.0,217000,6020.0,5970.0
984,2018/08/29,5870.0,5935.93,5960.0,124800,5980.0,5860.0
985,2018/08/30,5740.0,5791.731,5880.0,85500,5900.0,5730.0
986,2018/08/31,5710.0,5671.594,5640.0,87200,5720.0,5600.0
987,2018/09/03,5590.0,5619.294,5640.0,94900,5690.0,5560.0
988,2018/09/04,5500.0,5511.825,5620.0,91500,5620.0,5470.0
989,2018/09/05,5500.0,5532.233,5530.0,83300,5590.0,5490.0
990,2018/09/06,5420.0,5457.025,5520.0,161000,5570.0,5390.0
991,2018/09/07,5420.0,5381.46,5360.0,87000,5440.0,5320.0
992,2018/09/10,5400.0,5412.381,5420.0,42000,5460.0,5390.0
993,2018/09/11,5430.0,5431.372,5440.0,57600,5450.0,5400.0
994,2018/09/12,5310.0,5312.378,5420.0,127400,5430.0,5250.0
995,2018/09/13,5380.0,5375.181,5370.0,93800,5420.0,5320.0
996,2018/09/14,5350.0,5353.721,5410.0,99700,5420.0,5290.0
997,2018/09/18,5430.0,5417.994,5400.0,66800,5440.0,5390.0
998,2018/09/19,5590.0,5547.861,5530.0,105200,5640.0,5440.0
999,2018/09/20,5790.0,5768.921,5640.0,177000,5860.0,5610.0
1000,2018/09/21,5770.0,5792.02,5840.0,167300,5880.0,5710.0
1001,2018/09/25,5790.0,5789.912,5740.0,147600,5850.0,5730.0
1002,2018/09/26,6090.0,6020.229,5790.0,161500,6140.0,5760.0
1003,2018/09/27,6050.0,6038.553,6100.0,102300,6120.0,5950.0
1004,2018/09/28,6060.0,6083.972,6090.0,50100,6130.0,6020.0
1005,2018/10/01,6070.0,6039.776,6070.0,53500,6100.0,5960.0
1006,2018/10/02,6170.0,6183.242,6170.0,76800,6250.0,6120.0
1007,2018/10/03,6070.0,6127.887,6160.0,69100,6240.0,6070.0
1008,2018/10/04,6070.0,6052.585,6060.0,65000,6120.0,6000.0
1009,2018/10/05,6140.0,6124.81,6010.0,50100,6180.0,6000.0
1010,2018/10/09,6010.0,6053.47,6140.0,85300,6170.0,5990.0
1011,2018/10/10,6170.0,6194.013,6110.0,112400,6280.0,6110.0
1012,2018/10/11,6130.0,6165.113,6070.0,101500,6280.0,5990.0
1013,2018/10/12,6060.0,6115.473,6130.0,121700,6250.0,6060.0
1014,2018/10/15,6520.0,6387.702,6160.0,362000,6670.0,6080.0
1015,2018/10/16,6640.0,6575.067,6520.0,156300,6680.0,6470.0
1016,2018/10/17,6550.0,6528.949,6640.0,141800,6640.0,6450.0
1017,2018/10/18,6700.0,6674.008,6570.0,151200,6750.0,6560.0
1018,2018/10/19,6500.0,6504.71,6570.0,127600,6630.0,6410.0
1019,2018/10/22,6500.0,6509.919,6550.0,110900,6660.0,6440.0
1020,2018/10/23,6430.0,6395.113,6360.0,75500,6430.0,6350.0
1021,2018/10/24,6480.0,6469.702,6500.0,73700,6530.0,6400.0
1022,2018/10/25,6360.0,6397.549,6330.0,107700,6470.0,6290.0
1023,2018/10/26,6170.0,6215.504,6370.0,129000,6370.0,6140.0
1024,2018/10/29,6060.0,6149.936,6260.0,109200,6340.0,6050.0
1025,2018/10/30,6140.0,6140.445,6110.0,110200,6260.0,6080.0
1026,2018/10/31,6410.0,6356.527,6240.0,105100,6420.0,6170.0
1027,2018/11/01,6300.0,6314.291,6370.0,50100,6380.0,6250.0
1028,2018/11/02,6510.0,6434.947,6330.0,66100,6530.0,6310.0
1029,2018/11/05,6480.0,6477.029,6450.0,48800,6540.0,6390.0
1030,2018/11/06,6760.0,6718.114,6600.0,85900,6780.0,6570.0
1031,2018/11/07,6720.0,6749.42,6770.0,58600,6820.0,6690.0
1032,2018/11/08,6890.0,6849.168,6750.0,50500,6920.0,6750.0
1033,2018/11/09,6910.0,6915.807,6890.0,41500,6940.0,6860.0
1034,2018/11/12,6940.0,6948.148,6890.0,67500,7020.0,6890.0
1035,2018/11/13,6880.0,6902.379,6880.0,78600,6970.0,6830.0
1036,2018/11/14,6830.0,6867.768,6850.0,69900,6950.0,6810.0
1037,2018/11/15,6780.0,6794.807,6720.0,64900,6860.0,6720.0
1038,2018/11/16,6790.0,6812.313,6810.0,53600,6860.0,6740.0
1039,2018/11/19,6830.0,6819.646,6820.0,39500,6870.0,6770.0
1040,2018/11/20,6850.0,6825.131,6770.0,61200,6900.0,6730.0
1041,2018/11/21,6850.0,6859.14,6840.0,34900,6910.0,6820.0
1042,2018/11/22,6940.0,6896.14,6880.0,34200,6950.0,6800.0
1043,2018/11/26,6920.0,6926.456,6940.0,49100,7000.0,6840.0
1044,2018/11/27,6880.0,6917.046,6940.0,44000,7020.0,6840.0
1045,2018/11/28,6990.0,6969.458,6900.0,46100,7020.0,6900.0
1046,2018/11/29,6910.0,6988.577,7020.0,49200,7090.0,6910.0
1047,2018/11/30,7020.0,6981.49,6950.0,46300,7020.0,6930.0
1048,2018/12/03,7070.0,7058.255,7090.0,42400,7120.0,7000.0
1049,2018/12/04,6880.0,6966.833,7080.0,60300,7080.0,6880.0
1050,2018/12/05,6760.0,6800.651,6850.0,75300,6890.0,6760.0
1051,2018/12/06,6540.0,6615.75,6710.0,116700,6760.0,6520.0
1052,2018/12/07,6840.0,6787.168,6640.0,97100,6860.0,6640.0
1053,2018/12/10,6680.0,6683.294,6740.0,42800,6840.0,6600.0
1054,2018/12/11,6580.0,6599.628,6720.0,45700,6720.0,6570.0
1055,2018/12/12,6590.0,6584.183,6600.0,52600,6620.0,6540.0
1056,2018/12/13,6610.0,6630.096,6650.0,41600,6680.0,6590.0
1057,2018/12/14,6380.0,6464.213,6600.0,75000,6610.0,6350.0
1058,2018/12/17,6400.0,6385.944,6380.0,50300,6450.0,6320.0
1059,2018/12/18,6170.0,6193.251,6330.0,40300,6330.0,6140.0
1060,2018/12/19,6210.0,6197.461,6160.0,63800,6290.0,6100.0
1061,2018/12/20,6070.0,6079.182,6180.0,47700,6180.0,6040.0
1062,2018/12/21,5830.0,5867.879,6070.0,49500,6070.0,5820.0
1063,2018/12/25,5630.0,5624.164,5710.0,73000,5710.0,5520.0
1064,2018/12/26,5670.0,5710.671,5730.0,70000,5870.0,5600.0
1065,2018/12/27,5940.0,5908.691,5870.0,44300,5960.0,5810.0
1066,2018/12/28,5810.0,5783.932,5840.0,35100,5850.0,5730.0
1067,2019/01/04,5760.0,5731.964,5760.0,44300,5790.0,5660.0
1068,2019/01/07,5630.0,5592.316,5770.0,130400,5790.0,5500.0
1069,2019/01/08,5450.0,5439.126,5530.0,140700,5560.0,5350.0
1070,2019/01/09,5490.0,5476.315,5470.0,63500,5550.0,5420.0
1071,2019/01/10,5490.0,5560.41,5530.0,117000,5670.0,5450.0
1072,2019/01/11,5270.0,5281.381,5770.0,370800,5770.0,5040.0
1073,2019/01/15,5220.0,5186.679,5120.0,108400,5250.0,5070.0
1074,2019/01/16,5250.0,5294.58,5310.0,83400,5390.0,5220.0
1075,2019/01/17,5330.0,5308.408,5350.0,42700,5370.0,5260.0
1076,2019/01/18,5370.0,5375.885,5340.0,53700,5420.0,5330.0
1077,2019/01/21,5420.0,5384.187,5340.0,81200,5460.0,5280.0
1078,2019/01/22,5500.0,5534.771,5410.0,168100,5640.0,5380.0
1079,2019/01/23,5430.0,5462.713,5450.0,75200,5550.0,5420.0
1080,2019/01/24,5490.0,5467.381,5400.0,54600,5510.0,5400.0
1081,2019/01/25,5450.0,5484.246,5440.0,88800,5580.0,5430.0
1082,2019/01/28,5560.0,5559.003,5490.0,66200,5630.0,5440.0
1083,2019/01/29,5500.0,5517.331,5560.0,51700,5560.0,5480.0
1084,2019/01/30,5450.0,5483.328,5530.0,57400,5550.0,5450.0
1085,2019/01/31,5450.0,5465.492,5490.0,43700,5550.0,5410.0
1086,2019/02/01,5620.0,5625.426,5450.0,116100,5680.0,5450.0
1087,2019/02/04,5590.0,5625.81,5620.0,74700,5710.0,5580.0
1088,2019/02/05,5500.0,5512.207,5560.0,67500,5580.0,5460.0
1089,2019/02/06,5330.0,5306.461,5100.0,198900,5390.0,5100.0
1090,2019/02/07,5240.0,5315.597,5420.0,70400,5430.0,5230.0
1091,2019/02/08,5130.0,5132.361,5140.0,73700,5250.0,5090.0
1092,2019/02/12,5270.0,5265.813,5170.0,36300,5310.0,5170.0
1093,2019/02/13,5160.0,5170.744,5230.0,100800,5280.0,5100.0
1094,2019/02/14,5290.0,5300.893,5230.0,95200,5400.0,5230.0
1095,2019/02/15,5310.0,5314.926,5310.0,40600,5370.0,5280.0
1096,2019/02/18,5420.0,5408.735,5400.0,34000,5450.0,5360.0
1097,2019/02/19,5440.0,5415.354,5400.0,45200,5450.0,5390.0
1098,2019/02/20,5410.0,5410.135,5400.0,51900,5450.0,5370.0
1099,2019/02/21,5390.0,5385.302,5350.0,48100,5410.0,5350.0
1100,2019/02/22,5370.0,5395.505,5390.0,66300,5500.0,5330.0
1101,2019/02/25,5500.0,5464.55,5390.0,42200,5510.0,5390.0
1102,2019/02/26,5480.0,5476.417,5460.0,42700,5520.0,5440.0
1103,2019/02/27,5470.0,5473.462,5440.0,51700,5520.0,5430.0
1104,2019/02/28,5490.0,5474.306,5440.0,35300,5500.0,5430.0
1105,2019/03/01,5580.0,5534.432,5450.0,44000,5580.0,5450.0
1106,2019/03/04,5620.0,5605.505,5580.0,50500,5630.0,5550.0
1107,2019/03/05,5530.0,5541.633,5550.0,54500,5600.0,5510.0
1108,2019/03/06,6030.0,5947.236,5630.0,305700,6080.0,5630.0
1109,2019/03/07,6020.0,6004.719,5990.0,110400,6040.0,5920.0
1110,2019/03/08,6040.0,6026.852,5950.0,88000,6080.0,5950.0
1111,2019/03/11,5920.0,5963.471,5990.0,65400,6080.0,5910.0
1112,2019/03/12,5970.0,5984.407,5950.0,53100,6040.0,5950.0
1113,2019/03/13,5840.0,5877.937,5980.0,44100,6000.0,5840.0
1114,2019/03/14,5740.0,5761.452,5840.0,54400,5860.0,5710.0
1115,2019/03/15,5850.0,5840.571,5740.0,59600,5900.0,5730.0
1116,2019/03/18,5960.0,5947.573,5850.0,54800,5990.0,5850.0
1117,2019/03/19,5780.0,5775.356,5900.0,59000,5900.0,5720.0
1118,2019/03/20,5830.0,5808.86,5820.0,30700,5840.0,5730.0
1119,2019/03/22,5840.0,5806.306,5790.0,47100,5850.0,5760.0
1120,2019/03/25,5850.0,5817.206,5840.0,36500,5850.0,5770.0
1121,2019/03/26,5970.0,5958.05,5890.0,71800,5980.0,5890.0
1122,2019/03/27,5970.0,5971.297,5930.0,47800,6020.0,5920.0
1123,2019/03/28,5880.0,5909.177,6000.0,38900,6000.0,5870.0
1124,2019/03/29,5980.0,5967.616,5920.0,30200,6010.0,5890.0
1125,2019/04/01,6080.0,6070.671,5990.0,77500,6130.0,5990.0
1126,2019/04/02,6070.0,6108.014,6120.0,86100,6170.0,6060.0
1127,2019/04/03,5960.0,5927.615,5990.0,63300,5990.0,5870.0
1128,2019/04/04,5890.0,5896.153,5960.0,66800,5960.0,5860.0
1129,2019/04/05,5850.0,5849.33,5850.0,43300,5900.0,5810.0
1130,2019/04/08,6020.0,6005.315,5870.0,104800,6110.0,5870.0
1131,2019/04/09,6110.0,6070.825,6050.0,87300,6130.0,6000.0
1132,2019/04/10,6220.0,6219.225,6190.0,85200,6280.0,6170.0
1133,2019/04/11,6250.0,6217.005,6200.0,56100,6260.0,6150.0
1134,2019/04/12,6180.0,6210.666,6280.0,123100,6280.0,6160.0
1135,2019/04/15,6250.0,6254.022,6240.0,163600,6320.0,6180.0
1136,2019/04/16,6270.0,6268.141,6240.0,62400,6300.0,6210.0
1137,2019/04/17,6120.0,6146.623,6220.0,61600,6240.0,6120.0
1138,2019/04/18,5820.0,5901.878,6070.0,137900,6080.0,5800.0
1139,2019/04/19,5820.0,5851.023,5870.0,89000,5940.0,5800.0
1140,2019/04/22,5760.0,5720.21,5800.0,114400,5800.0,5660.0
1141,2019/04/23,5840.0,5810.52,5740.0,61500,5860.0,5710.0
1142,2019/04/24,5890.0,5838.788,5840.0,85800,5890.0,5750.0
1143,2019/04/25,5980.0,5981.879,5890.0,213900,6060.0,5880.0
1144,2019/04/26,5950.0,5946.654,5970.0,50800,6000.0,5860.0
1145,2019/05/07,5980.0,5968.386,6000.0,76200,6070.0,5910.0
1146,2019/05/08,6090.0,6071.624,5980.0,129900,6130.0,5950.0
1147,2019/05/09,6080.0,6076.086,6090.0,58500,6110.0,6030.0
1148,2019/05/10,6250.0,6226.658,6090.0,76900,6280.0,6090.0
1149,2019/05/13,6230.0,6256.394,6170.0,57400,6320.0,6150.0
1150,2019/05/14,6240.0,6194.87,6130.0,49900,6240.0,6060.0
1151,2019/05/15,6390.0,6352.391,6240.0,73600,6400.0,6230.0
1152,2019/05/16,6520.0,6491.857,6420.0,72700,6540.0,6400.0
1153,2019/05/17,6530.0,6510.053,6500.0,37700,6540.0,6470.0
1154,2019/05/20,6460.0,6497.892,6530.0,35100,6570.0,6460.0
1155,2019/05/21,6490.0,6481.366,6460.0,34400,6520.0,6400.0
1156,2019/05/22,6370.0,6402.251,6470.0,39100,6490.0,6360.0
1157,2019/05/23,6360.0,6339.514,6330.0,32900,6380.0,6260.0
1158,2019/05/24,6420.0,6387.26,6300.0,63500,6460.0,6260.0
1159,2019/05/27,6600.0,6557.459,6450.0,60200,6650.0,6400.0
1160,2019/05/28,6570.0,6580.017,6660.0,59000,6670.0,6530.0
1161,2019/05/29,6570.0,6560.832,6510.0,50500,6620.0,6490.0
1162,2019/05/30,6510.0,6520.022,6470.0,46400,6590.0,6460.0
1163,2019/05/31,6460.0,6470.143,6490.0,28000,6530.0,6440.0
1164,2019/06/03,6400.0,6406.929,6360.0,39400,6470.0,6360.0
1165,2019/06/04,6380.0,6356.832,6420.0,60600,6430.0,6300.0
1166,2019/06/05,6520.0,6499.772,6450.0,48200,6540.0,6430.0
1167,2019/06/06,6400.0,6383.319,6450.0,92200,6500.0,6310.0
1168,2019/06/07,6320.0,6343.856,6400.0,63800,6410.0,6300.0
1169,2019/06/10,6430.0,6417.517,6360.0,59600,6470.0,6330.0
1170,2019/06/11,6440.0,6454.919,6430.0,30700,6490.0,6400.0
1171,2019/06/12,6480.0,6486.73,6440.0,26300,6510.0,6430.0
1172,2019/06/13,6460.0,6491.554,6510.0,35400,6550.0,6450.0
1173,2019/06/14,6450.0,6466.495,6460.0,42800,6540.0,6430.0
1174,2019/06/17,6390.0,6393.573,6430.0,41700,6440.0,6350.0
1175,2019/06/18,6230.0,6267.797,6390.0,52200,6390.0,6200.0
1176,2019/06/19,6210.0,6238.209,6240.0,43000,6290.0,6210.0
1177,2019/06/20,6130.0,6142.098,6200.0,38600,6210.0,6110.0
1178,2019/06/21,6000.0,6045.583,6150.0,65200,6150.0,6000.0
1179,2019/06/24,6070.0,6067.812,6080.0,36100,6120.0,6020.0
1180,2019/06/25,5960.0,6006.364,6060.0,28600,6090.0,5950.0
1181,2019/06/26,5810.0,5852.46,5960.0,62200,6000.0,5810.0
1182,2019/06/27,5940.0,5889.669,5830.0,69400,5960.0,5810.0
1183,2019/06/28,5990.0,5986.0,5930.0,64500,6030.0,5930.0
1184,2019/07/01,6050.0,6032.432,6000.0,37000,6070.0,6000.0
1185,2019/07/02,6120.0,6110.313,6080.0,35200,6150.0,6070.0
1186,2019/07/03,6040.0,6052.308,6080.0,79300,6160.0,6020.0
1187,2019/07/04,6020.0,6018.526,6000.0,38000,6040.0,5990.0
1188,2019/07/05,6080.0,6047.521,5990.0,59700,6080.0,5990.0
1189,2019/07/08,6060.0,6104.686,6270.0,98600,6270.0,6020.0
1190,2019/07/09,6020.0,6045.587,6070.0,56200,6140.0,6000.0
1191,2019/07/10,5900.0,5931.345,5960.0,106300,5990.0,5890.0
1192,2019/07/11,6080.0,6029.667,5890.0,144000,6100.0,5870.0
1193,2019/07/12,6180.0,6252.73,6260.0,190500,6510.0,6100.0
1194,2019/07/16,6030.0,6085.616,6100.0,73900,6150.0,6030.0
1195,2019/07/17,6100.0,6042.064,6000.0,75600,6100.0,5950.0
1196,2019/07/18,5910.0,5959.465,6020.0,56100,6060.0,5890.0
1197,2019/07/19,5950.0,5937.194,5940.0,39200,5980.0,5890.0
1198,2019/07/22,5860.0,5898.119,5940.0,38800,5940.0,5860.0
1199,2019/07/23,5850.0,5853.534,5850.0,56600,5880.0,5830.0
1200,2019/07/24,5860.0,5854.323,5840.0,53200,5880.0,5800.0
1201,2019/07/25,5960.0,5946.988,5850.0,77700,5990.0,5850.0
1202,2019/07/26,5870.0,5891.318,5910.0,29600,5940.0,5850.0
1203,2019/07/29,5840.0,5867.919,5890.0,46600,5920.0,5820.0
1204,2019/07/30,5840.0,5839.488,5840.0,66400,5870.0,5810.0
1205,2019/07/31,5750.0,5776.426,5820.0,74700,5860.0,5720.0
1206,2019/08/01,5740.0,5723.692,5700.0,70700,5750.0,5670.0
1207,2019/08/02,5700.0,5696.46,5700.0,85300,5740.0,5660.0
1208,2019/08/05,5640.0,5648.438,5660.0,69800,5740.0,5590.0
1209,2019/08/06,5610.0,5584.249,5530.0,111800,5650.0,5480.0
1210,2019/08/07,5620.0,5608.375,5610.0,83700,5660.0,5540.0
1211,2019/08/08,5610.0,5604.808,5600.0,96500,5630.0,5560.0
1212,2019/08/09,5640.0,5635.581,5620.0,81700,5660.0,5600.0
1213,2019/08/13,5560.0,5569.774,5570.0,92900,5600.0,5530.0
1214,2019/08/14,5670.0,5649.333,5620.0,72000,5680.0,5600.0
1215,2019/08/15,5680.0,5635.797,5600.0,70900,5680.0,5600.0
1216,2019/08/16,5620.0,5664.067,5690.0,65900,5690.0,5620.0
1217,2019/08/19,5630.0,5675.245,5690.0,89800,5700.0,5630.0
1218,2019/08/20,5670.0,5661.513,5650.0,94500,5700.0,5610.0
1219,2019/08/21,5620.0,5656.802,5660.0,76300,5700.0,5620.0
1220,2019/08/22,5620.0,5644.04,5670.0,105700,5670.0,5590.0
1221,2019/08/23,5840.0,5744.814,5670.0,153100,5860.0,5660.0
