,Date,Close,VWAP,Open,Volume,High,Low
0,2014/08/25,439.0,430.279,415.0,1030800,445.0,413.0
1,2014/08/26,422.0,432.54,455.0,852500,457.0,421.0
2,2014/08/27,416.0,418.115,425.0,560900,432.0,410.0
3,2014/08/28,415.0,418.607,423.0,449600,427.0,412.0
4,2014/08/29,429.0,422.946,412.0,651600,440.0,408.0
5,2014/09/01,431.0,433.45,432.0,591600,450.0,423.0
6,2014/09/02,478.0,466.154,436.0,1980100,492.0,433.0
7,2014/09/03,540.0,512.929,473.0,3839400,549.0,462.0
8,2014/09/04,488.0,540.83,548.0,4616800,580.0,485.0
9,2014/09/05,510.0,494.523,510.0,2362300,521.0,461.0
10,2014/09/08,543.0,534.551,500.0,2114700,555.0,496.0
11,2014/09/09,525.0,537.222,547.0,1220300,559.0,522.0
12,2014/09/10,472.0,490.812,535.0,1387300,535.0,468.0
13,2014/09/11,451.0,459.234,456.0,1063400,476.0,448.0
14,2014/09/12,420.0,424.716,446.0,1612700,447.0,410.0
15,2014/09/16,404.0,408.581,413.0,815200,419.0,402.0
16,2014/09/17,415.0,412.106,404.0,875000,424.0,394.0
17,2014/09/18,384.0,392.088,399.0,1223600,409.0,381.0
18,2014/09/19,387.0,389.706,391.0,582000,397.0,382.0
19,2014/09/22,381.0,382.922,379.0,408700,393.0,377.0
20,2014/09/24,378.0,376.727,376.0,209400,381.0,373.0
21,2014/09/25,387.0,395.95,383.0,914100,405.0,382.0
22,2014/09/26,379.0,372.838,371.0,616200,382.0,364.0
23,2014/09/29,394.0,389.914,380.0,431300,400.0,380.0
24,2014/09/30,399.0,402.817,392.0,915400,414.0,390.0
25,2014/10/01,360.0,377.607,391.0,629700,399.0,354.0
26,2014/10/02,339.0,339.396,340.0,827900,354.0,327.0
27,2014/10/03,330.0,332.794,339.0,435400,344.0,325.0
28,2014/10/06,343.0,345.367,346.0,452600,354.0,339.0
29,2014/10/07,328.0,333.115,335.0,304200,342.0,328.0
30,2014/10/08,312.0,311.039,318.0,541800,319.0,307.0
31,2014/10/09,289.0,299.405,320.0,729300,324.0,286.0
32,2014/10/10,279.0,277.652,284.0,665800,288.0,268.0
33,2014/10/14,270.0,272.923,279.0,479100,279.0,265.0
34,2014/10/15,272.0,274.727,284.0,455300,287.0,263.0
35,2014/10/16,273.0,277.675,272.0,994100,288.0,268.0
36,2014/10/17,270.0,280.819,281.0,706100,289.0,270.0
37,2014/10/20,284.0,286.303,280.0,929500,293.0,280.0
38,2014/10/21,270.0,273.534,276.0,633200,280.0,269.0
39,2014/10/22,287.0,281.572,274.0,508800,289.0,273.0
40,2014/10/23,277.0,279.82,279.0,290900,284.0,275.0
41,2014/10/24,274.0,279.102,283.0,368400,289.0,273.0
42,2014/10/27,275.0,277.938,276.0,248000,283.0,274.0
43,2014/10/28,355.0,326.707,275.0,2220300,355.0,275.0
44,2014/10/29,328.0,340.044,331.0,5155600,363.0,320.0
45,2014/10/30,294.0,304.484,321.0,1374100,327.0,290.0
46,2014/10/31,270.0,259.284,246.0,2046100,273.0,245.0
47,2014/11/04,274.0,285.588,278.0,1955500,325.0,268.0
48,2014/11/05,282.0,276.546,271.0,875500,289.0,269.0
49,2014/11/06,286.0,298.388,290.0,1487000,317.0,277.0
50,2014/11/07,280.0,282.588,294.0,420200,295.0,277.0
51,2014/11/10,293.0,285.484,280.0,457100,293.0,275.0
52,2014/11/11,298.0,306.14,300.0,1158100,319.0,296.0
53,2014/11/12,288.0,293.091,299.0,449100,303.0,286.0
54,2014/11/13,278.0,280.268,284.0,240500,289.0,276.0
55,2014/11/14,271.0,275.668,281.0,355700,288.0,271.0
56,2014/11/17,270.0,269.547,274.0,213500,275.0,266.0
57,2014/11/18,274.0,278.549,271.0,275100,290.0,271.0
58,2014/11/19,301.0,292.899,274.0,976200,307.0,274.0
59,2014/11/20,282.0,288.644,298.0,471000,300.0,282.0
60,2014/11/21,283.0,281.303,280.0,184800,286.0,277.0
61,2014/11/25,283.0,285.68,285.0,149700,290.0,283.0
62,2014/11/26,289.0,289.301,281.0,375700,295.0,280.0
63,2014/11/27,369.0,357.067,345.0,9447100,369.0,336.0
64,2014/11/28,330.0,359.939,385.0,4033100,394.0,324.0
65,2014/12/01,313.0,310.476,323.0,1169800,325.0,297.0
66,2014/12/02,309.0,314.216,314.0,894900,329.0,307.0
67,2014/12/03,320.0,327.949,325.0,2328700,345.0,312.0
68,2014/12/04,305.0,310.357,313.0,631700,318.0,305.0
69,2014/12/05,306.0,302.74,303.0,287500,309.0,297.0
70,2014/12/08,301.0,304.225,308.0,253800,309.0,298.0
71,2014/12/09,299.0,301.418,300.0,280600,306.0,298.0
72,2014/12/10,294.0,296.192,298.0,317100,300.0,291.0
73,2014/12/11,303.0,294.663,290.0,359500,305.0,286.0
74,2014/12/12,298.0,298.233,305.0,229600,307.0,294.0
75,2014/12/15,285.0,292.437,298.0,304500,306.0,285.0
76,2014/12/16,275.0,276.474,280.0,250300,280.0,272.0
77,2014/12/17,267.0,270.17,270.0,203300,275.0,267.0
78,2014/12/18,268.0,271.179,270.0,188400,275.0,267.0
79,2014/12/19,272.0,269.832,274.0,211700,274.0,267.0
80,2014/12/22,264.0,266.798,270.0,291100,272.0,262.0
81,2014/12/24,251.0,256.366,262.0,394000,266.0,251.0
82,2014/12/25,260.0,253.837,248.0,466500,262.0,247.0
83,2014/12/26,276.0,273.711,257.0,483500,284.0,256.0
84,2014/12/29,267.0,270.12,273.0,261500,275.0,266.0
85,2014/12/30,270.0,270.587,263.0,178700,277.0,263.0
86,2015/01/05,273.0,274.258,271.0,139000,279.0,267.0
87,2015/01/06,269.0,269.125,266.0,157900,275.0,265.0
88,2015/01/07,268.0,268.098,267.0,127900,272.0,265.0
89,2015/01/08,268.0,267.264,270.0,83800,271.0,266.0
90,2015/01/09,266.0,263.141,269.0,206200,269.0,258.0
91,2015/01/13,278.0,281.059,277.0,1088300,294.0,274.0
92,2015/01/14,266.0,268.236,273.0,279100,275.0,262.0
93,2015/01/15,260.0,261.321,262.0,222200,267.0,259.0
94,2015/01/16,259.0,257.208,257.0,194400,262.0,253.0
95,2015/01/19,260.0,261.985,259.0,163100,270.0,257.0
96,2015/01/20,273.0,278.138,263.0,1267600,293.0,263.0
97,2015/01/21,266.0,270.376,270.0,232100,277.0,266.0
98,2015/01/22,269.0,272.69,268.0,121500,279.0,268.0
99,2015/01/23,275.0,275.811,271.0,468700,283.0,268.0
100,2015/01/26,278.0,278.436,274.0,369200,286.0,272.0
101,2015/01/27,274.0,276.218,283.0,172400,283.0,272.0
102,2015/01/28,270.0,268.069,273.0,308600,273.0,263.0
103,2015/01/29,263.0,266.098,266.0,202600,270.0,263.0
104,2015/01/30,259.0,259.874,258.0,133100,265.0,258.0
105,2015/02/02,255.0,256.45,257.0,108100,260.0,254.0
106,2015/02/03,250.0,253.025,256.0,165500,257.0,250.0
107,2015/02/04,254.0,252.347,251.0,88500,255.0,250.0
108,2015/02/05,246.0,246.622,251.0,193200,253.0,242.0
109,2015/02/06,244.0,243.243,242.0,165300,249.0,240.0
110,2015/02/09,236.0,236.691,240.0,171200,242.0,230.0
111,2015/02/10,236.0,234.404,233.0,69400,238.0,232.0
112,2015/02/12,256.0,261.987,238.0,1435300,278.0,236.0
113,2015/02/13,247.0,248.721,248.0,227900,253.0,246.0
114,2015/02/16,244.0,246.264,250.0,154500,251.0,242.0
115,2015/02/17,239.0,241.565,243.0,105100,245.0,239.0
116,2015/02/18,243.0,242.665,240.0,94600,246.0,240.0
117,2015/02/19,249.0,248.414,243.0,147700,253.0,243.0
118,2015/02/20,245.0,246.972,248.0,92300,251.0,245.0
119,2015/02/23,247.0,246.222,245.0,70800,249.0,243.0
120,2015/02/24,246.0,244.293,245.0,60700,246.0,243.0
121,2015/02/25,249.0,249.102,244.0,224700,254.0,243.0
122,2015/02/26,251.0,251.132,255.0,123600,255.0,248.0
123,2015/02/27,250.0,249.854,249.0,64300,253.0,248.0
124,2015/03/02,247.0,247.638,251.0,108000,251.0,245.0
125,2015/03/03,239.0,241.718,245.0,143900,246.0,238.0
126,2015/03/04,240.0,236.637,236.0,124100,240.0,235.0
127,2015/03/05,252.0,245.603,240.0,185500,254.0,239.0
128,2015/03/06,244.0,248.024,254.0,224500,254.0,242.0
129,2015/03/09,241.0,242.438,242.0,61600,246.0,240.0
130,2015/03/10,238.0,238.307,240.0,102600,242.0,236.0
131,2015/03/11,242.0,240.295,238.0,66500,242.0,237.0
132,2015/03/12,238.0,239.41,242.0,67500,244.0,238.0
133,2015/03/13,239.0,240.423,240.0,103200,242.0,238.0
134,2015/03/16,237.0,237.85,240.0,91300,240.0,235.0
135,2015/03/17,234.0,235.133,237.0,93500,239.0,234.0
136,2015/03/18,235.0,233.415,232.0,101400,238.0,230.0
137,2015/03/19,234.0,231.818,234.0,126300,235.0,230.0
138,2015/03/20,230.0,229.305,232.0,198800,233.0,227.0
139,2015/03/23,230.0,229.0,229.0,61600,231.0,228.0
140,2015/03/24,230.0,228.972,228.0,67400,231.0,228.0
141,2015/03/25,230.0,229.559,231.0,67800,232.0,228.0
142,2015/03/26,226.0,227.977,228.0,94200,232.0,226.0
143,2015/03/27,221.0,222.195,224.0,115600,225.0,220.0
144,2015/03/30,219.0,220.406,221.0,90000,224.0,219.0
145,2015/03/31,222.0,221.177,219.0,73900,223.0,219.0
146,2015/04/01,224.0,222.018,223.0,38600,224.0,221.0
147,2015/04/02,286.0,290.274,226.0,12446200,304.0,223.0
148,2015/04/03,366.0,330.467,305.0,22247500,366.0,297.0
149,2015/04/06,359.0,379.47,378.0,23300000,422.0,329.0
150,2015/04/07,338.0,345.925,343.0,5784900,382.0,318.0
151,2015/04/08,320.0,315.581,333.0,3297200,334.0,300.0
152,2015/04/09,390.0,368.568,331.0,17451700,400.0,322.0
153,2015/04/10,370.0,414.835,438.0,18515400,455.0,366.0
154,2015/04/13,357.0,364.471,362.0,4663500,387.0,345.0
155,2015/04/14,352.0,344.393,343.0,1895100,356.0,336.0
156,2015/04/15,358.0,362.955,348.0,2556300,381.0,344.0
157,2015/04/16,340.0,348.179,356.0,1930500,364.0,338.0
158,2015/04/17,340.0,342.762,339.0,671100,355.0,337.0
159,2015/04/20,347.0,361.533,346.0,3921300,378.0,343.0
160,2015/04/21,342.0,343.932,347.0,645700,355.0,338.0
161,2015/04/22,345.0,343.469,346.0,367000,349.0,339.0
162,2015/04/23,351.0,352.424,352.0,813300,360.0,346.0
163,2015/04/24,351.0,356.28,353.0,684200,367.0,350.0
164,2015/04/27,360.0,361.021,356.0,676400,371.0,355.0
165,2015/04/28,357.0,359.492,362.0,540700,365.0,355.0
166,2015/04/30,341.0,344.415,358.0,579700,358.0,336.0
167,2015/05/01,313.0,314.752,337.0,804000,338.0,301.0
168,2015/05/07,294.0,295.985,304.0,603300,307.0,290.0
169,2015/05/08,302.0,306.138,306.0,748900,314.0,298.0
170,2015/05/11,294.0,295.172,298.0,235200,299.0,293.0
171,2015/05/12,284.0,285.771,295.0,367700,295.0,280.0
172,2015/05/13,286.0,284.658,284.0,224600,291.0,281.0
173,2015/05/14,292.0,306.54,293.0,1652200,327.0,288.0
174,2015/05/15,286.0,286.498,292.0,224300,292.0,283.0
175,2015/05/18,265.0,269.324,279.0,438300,280.0,263.0
176,2015/05/19,275.0,277.166,266.0,1058300,291.0,262.0
177,2015/05/20,269.0,270.66,272.0,202100,276.0,265.0
178,2015/05/21,268.0,271.37,267.0,199500,278.0,267.0
179,2015/05/22,266.0,267.268,269.0,146500,271.0,265.0
180,2015/05/25,270.0,266.672,265.0,140500,271.0,264.0
181,2015/05/26,265.0,265.846,266.0,162100,269.0,264.0
182,2015/05/27,263.0,263.089,263.0,225700,267.0,261.0
183,2015/05/28,263.0,266.402,266.0,140200,272.0,263.0
184,2015/05/29,325.0,317.643,277.0,13760400,343.0,271.0
185,2015/06/01,305.0,311.721,315.0,3672500,328.0,296.0
186,2015/06/02,320.0,334.166,315.0,5224000,352.0,310.0
187,2015/06/03,308.0,313.078,312.0,1496700,327.0,306.0
188,2015/06/04,302.0,308.585,312.0,639100,320.0,302.0
189,2015/06/05,290.0,293.01,300.0,570000,300.0,288.0
190,2015/06/08,290.0,297.029,300.0,386500,304.0,290.0
191,2015/06/09,284.0,287.683,293.0,223100,294.0,284.0
192,2015/06/10,275.0,278.208,279.0,329300,282.0,275.0
193,2015/06/11,283.0,281.461,277.0,223800,288.0,275.0
194,2015/06/12,300.0,313.452,295.0,4289300,329.0,295.0
195,2015/06/15,291.0,293.438,295.0,398900,298.0,290.0
196,2015/06/16,287.0,287.261,290.0,230700,291.0,285.0
197,2015/06/17,290.0,287.578,287.0,144500,291.0,285.0
198,2015/06/18,290.0,298.339,292.0,655700,310.0,288.0
199,2015/06/19,282.0,284.056,287.0,250200,291.0,281.0
200,2015/06/22,285.0,282.641,281.0,146600,288.0,280.0
201,2015/06/23,284.0,287.337,288.0,114000,291.0,284.0
202,2015/06/24,284.0,284.854,289.0,157800,290.0,282.0
203,2015/06/25,284.0,284.868,287.0,84200,287.0,283.0
204,2015/06/26,285.0,284.476,285.0,108500,286.0,283.0
205,2015/06/29,273.0,274.547,275.0,331700,284.0,264.0
206,2015/06/30,281.0,301.91,269.0,2877200,320.0,269.0
207,2015/07/01,290.0,292.517,289.0,696000,306.0,281.0
208,2015/07/02,286.0,287.625,298.0,310400,299.0,283.0
209,2015/07/03,280.0,280.686,283.0,217500,285.0,278.0
210,2015/07/06,278.0,275.707,275.0,153500,279.0,273.0
211,2015/07/07,287.0,284.311,279.0,189000,291.0,279.0
212,2015/07/08,277.0,278.163,287.0,195300,287.0,273.0
213,2015/07/09,268.0,256.198,265.0,453400,273.0,219.0
214,2015/07/10,259.0,264.492,270.0,200800,271.0,258.0
215,2015/07/13,269.0,265.464,261.0,102700,269.0,261.0
216,2015/07/14,272.0,274.148,271.0,169700,279.0,271.0
217,2015/07/15,352.0,350.604,352.0,4913200,352.0,338.0
218,2015/07/16,311.0,333.329,360.0,9042500,363.0,306.0
219,2015/07/17,303.0,312.333,306.0,4922900,335.0,294.0
220,2015/07/21,297.0,299.42,301.0,733600,308.0,295.0
221,2015/07/22,303.0,298.686,295.0,663500,307.0,293.0
222,2015/07/23,298.0,299.243,302.0,379300,303.0,297.0
223,2015/07/24,302.0,305.936,305.0,859100,314.0,300.0
224,2015/07/27,299.0,299.282,306.0,259600,306.0,296.0
225,2015/07/28,293.0,289.174,294.0,401000,294.0,284.0
226,2015/07/29,291.0,289.438,293.0,163000,294.0,287.0
227,2015/07/30,288.0,287.788,288.0,138200,291.0,285.0
228,2015/07/31,295.0,290.594,288.0,159700,300.0,284.0
229,2015/08/03,286.0,289.374,299.0,186800,299.0,285.0
230,2015/08/04,283.0,282.775,285.0,188100,288.0,280.0
231,2015/08/05,281.0,282.543,281.0,73900,284.0,280.0
232,2015/08/06,281.0,283.037,283.0,80400,286.0,281.0
233,2015/08/07,280.0,279.788,279.0,117100,283.0,277.0
234,2015/08/10,281.0,279.826,278.0,108800,284.0,276.0
235,2015/08/11,287.0,283.672,281.0,136900,287.0,280.0
236,2015/08/12,283.0,282.62,286.0,180400,287.0,279.0
237,2015/08/13,282.0,279.609,280.0,66800,282.0,278.0
238,2015/08/14,295.0,290.779,280.0,310500,305.0,279.0
239,2015/08/17,300.0,305.613,305.0,1165700,318.0,295.0
240,2015/08/18,307.0,306.635,300.0,431800,313.0,299.0
241,2015/08/19,304.0,304.009,304.0,259400,311.0,298.0
242,2015/08/20,289.0,293.22,303.0,437500,303.0,287.0
243,2015/08/21,278.0,278.069,271.0,298300,289.0,271.0
244,2015/08/24,224.0,246.155,262.0,844300,269.0,224.0
245,2015/08/25,216.0,221.783,199.0,758300,249.0,198.0
246,2015/08/26,237.0,230.56,227.0,353200,237.0,225.0
247,2015/08/27,285.0,281.704,252.0,3569200,300.0,245.0
248,2015/08/28,314.0,306.314,305.0,2626700,318.0,296.0
249,2015/08/31,320.0,316.857,319.0,1293600,329.0,308.0
250,2015/09/01,346.0,356.313,322.0,8663100,400.0,310.0
251,2015/09/02,368.0,369.82,322.0,10092000,410.0,318.0
252,2015/09/03,380.0,400.786,390.0,9500900,420.0,374.0
253,2015/09/04,350.0,359.108,368.0,4094800,392.0,325.0
254,2015/09/07,355.0,349.08,349.0,2284100,367.0,330.0
255,2015/09/08,435.0,417.317,381.0,16673100,435.0,379.0
256,2015/09/09,451.0,438.174,443.0,12308800,465.0,413.0
257,2015/09/10,473.0,485.764,459.0,15328300,522.0,440.0
258,2015/09/11,398.0,424.665,444.0,6325700,464.0,393.0
259,2015/09/14,360.0,371.986,382.0,5612200,408.0,345.0
260,2015/09/15,352.0,366.159,375.0,3821200,383.0,349.0
261,2015/09/16,329.0,342.665,360.0,2305200,368.0,328.0
262,2015/09/17,325.0,330.322,336.0,2400900,345.0,319.0
263,2015/09/18,326.0,328.21,325.0,1364700,336.0,319.0
264,2015/09/24,305.0,315.382,329.0,1425200,332.0,304.0
265,2015/09/25,313.0,311.69,310.0,1168400,322.0,303.0
266,2015/09/28,327.0,324.887,319.0,1354000,332.0,315.0
267,2015/09/29,313.0,313.511,315.0,709700,319.0,311.0
268,2015/09/30,326.0,327.719,325.0,1386600,335.0,317.0
269,2015/10/01,359.0,353.226,330.0,4435900,374.0,328.0
270,2015/10/02,375.0,371.242,359.0,2771300,382.0,355.0
271,2015/10/05,381.0,391.183,394.0,2293200,399.0,377.0
272,2015/10/06,373.0,372.268,374.0,1457600,383.0,363.0
273,2015/10/07,406.0,395.003,368.0,3421700,408.0,366.0
274,2015/10/08,393.0,397.701,410.0,2077200,416.0,386.0
275,2015/10/09,383.0,381.636,390.0,886100,393.0,373.0
276,2015/10/13,409.0,391.913,385.0,1461300,410.0,372.0
277,2015/10/14,394.0,400.051,406.0,2379200,418.0,380.0
278,2015/10/15,403.0,402.301,389.0,954800,409.0,389.0
279,2015/10/16,390.0,393.987,402.0,918800,406.0,387.0
280,2015/10/19,367.0,374.086,383.0,1187300,388.0,365.0
281,2015/10/20,342.0,351.997,378.0,1615000,380.0,335.0
282,2015/10/21,339.0,338.032,336.0,902100,346.0,330.0
283,2015/10/22,356.0,357.368,341.0,1667800,369.0,338.0
284,2015/10/23,348.0,350.905,353.0,707300,363.0,344.0
285,2015/10/26,348.0,352.522,352.0,567300,358.0,345.0
286,2015/10/27,395.0,378.598,359.0,3609100,402.0,356.0
287,2015/10/28,346.0,366.198,387.0,3845000,399.0,346.0
288,2015/10/29,347.0,347.202,345.0,1407900,359.0,335.0
289,2015/10/30,336.0,336.938,347.0,638300,349.0,332.0
290,2015/11/02,360.0,356.346,349.0,1580700,364.0,347.0
291,2015/11/04,330.0,341.919,365.0,1516700,367.0,330.0
292,2015/11/05,301.0,308.912,320.0,1222600,322.0,299.0
293,2015/11/06,307.0,307.514,307.0,491300,317.0,303.0
294,2015/11/09,304.0,302.364,307.0,412000,309.0,298.0
295,2015/11/10,304.0,303.697,305.0,229000,309.0,299.0
296,2015/11/11,305.0,305.787,304.0,279600,311.0,301.0
297,2015/11/12,291.0,297.843,302.0,432400,304.0,291.0
298,2015/11/13,289.0,286.084,282.0,300200,295.0,281.0
299,2015/11/16,277.0,281.467,281.0,244100,285.0,277.0
300,2015/11/17,284.0,282.841,280.0,198900,287.0,278.0
301,2015/11/18,289.0,297.223,287.0,421300,306.0,287.0
302,2015/11/19,291.0,290.701,289.0,158300,295.0,286.0
303,2015/11/20,294.0,291.596,291.0,114000,295.0,288.0
304,2015/11/24,294.0,294.804,291.0,203600,300.0,290.0
305,2015/11/25,312.0,308.959,295.0,1224200,320.0,294.0
306,2015/11/26,303.0,306.338,307.0,243500,311.0,302.0
307,2015/11/27,305.0,304.575,303.0,236100,309.0,302.0
308,2015/11/30,298.0,299.042,304.0,169700,305.0,296.0
309,2015/12/01,320.0,322.027,297.0,2731400,334.0,297.0
310,2015/12/02,312.0,314.06,316.0,366900,320.0,310.0
311,2015/12/03,315.0,316.116,311.0,183300,320.0,311.0
312,2015/12/04,307.0,307.52,310.0,197000,313.0,305.0
313,2015/12/07,306.0,308.897,313.0,186100,316.0,306.0
314,2015/12/08,300.0,302.556,306.0,155700,309.0,300.0
315,2015/12/09,293.0,294.346,296.0,181900,298.0,292.0
316,2015/12/10,292.0,289.938,284.0,173100,302.0,284.0
317,2015/12/11,292.0,292.122,291.0,85300,296.0,290.0
318,2015/12/14,298.0,292.419,285.0,156400,300.0,285.0
319,2015/12/15,285.0,289.124,298.0,154700,298.0,284.0
320,2015/12/16,290.0,288.155,288.0,119300,291.0,285.0
321,2015/12/17,288.0,289.167,293.0,111100,294.0,287.0
322,2015/12/18,291.0,295.635,287.0,373400,303.0,287.0
323,2015/12/21,277.0,280.785,288.0,269100,291.0,274.0
324,2015/12/22,274.0,277.781,281.0,115400,284.0,274.0
325,2015/12/24,249.0,257.764,272.0,404500,273.0,243.0
326,2015/12/25,243.0,242.429,245.0,386900,253.0,235.0
327,2015/12/28,262.0,256.991,250.0,195400,263.0,246.0
328,2015/12/29,267.0,261.35,258.0,141700,270.0,256.0
329,2015/12/30,267.0,267.085,268.0,93500,272.0,263.0
330,2016/01/04,265.0,267.774,267.0,130300,276.0,261.0
331,2016/01/05,265.0,262.067,262.0,211400,270.0,256.0
332,2016/01/06,287.0,310.981,273.0,5123200,344.0,273.0
333,2016/01/07,266.0,277.178,284.0,805600,294.0,266.0
334,2016/01/08,269.0,263.077,260.0,263000,271.0,259.0
335,2016/01/12,253.0,255.375,262.0,312300,265.0,249.0
336,2016/01/13,257.0,257.336,255.0,168500,264.0,254.0
337,2016/01/14,250.0,245.704,256.0,333200,256.0,241.0
338,2016/01/15,250.0,285.15,250.0,5174000,310.0,245.0
339,2016/01/18,270.0,263.802,240.0,1844800,283.0,239.0
340,2016/01/19,258.0,273.669,285.0,1149100,293.0,253.0
341,2016/01/20,240.0,247.468,256.0,532700,261.0,239.0
342,2016/01/21,235.0,240.92,240.0,322900,247.0,235.0
343,2016/01/22,248.0,242.134,243.0,220700,248.0,236.0
344,2016/01/25,258.0,254.703,250.0,277700,260.0,246.0
345,2016/01/26,260.0,260.123,251.0,288400,266.0,250.0
346,2016/01/27,262.0,262.23,262.0,133800,266.0,259.0
347,2016/01/28,272.0,275.028,266.0,1374700,285.0,261.0
348,2016/01/29,272.0,274.314,274.0,576600,287.0,264.0
349,2016/02/01,269.0,266.943,265.0,366200,273.0,260.0
350,2016/02/02,261.0,265.889,264.0,233800,272.0,260.0
351,2016/02/03,259.0,258.717,260.0,152400,263.0,255.0
352,2016/02/04,251.0,254.866,253.0,191200,265.0,251.0
353,2016/02/05,233.0,238.465,243.0,456100,252.0,228.0
354,2016/02/08,240.0,238.033,235.0,163100,242.0,233.0
355,2016/02/09,217.0,224.267,232.0,301500,233.0,217.0
356,2016/02/10,210.0,212.414,225.0,440800,226.0,206.0
357,2016/02/12,192.0,198.414,201.0,488100,205.0,191.0
358,2016/02/15,242.0,231.415,210.0,2016800,242.0,207.0
359,2016/02/16,221.0,225.417,226.0,1025200,241.0,211.0
360,2016/02/17,218.0,218.505,220.0,288400,227.0,214.0
361,2016/02/18,220.0,219.991,221.0,125400,224.0,218.0
362,2016/02/19,214.0,214.871,214.0,105900,219.0,213.0
363,2016/02/22,215.0,216.557,212.0,107200,219.0,212.0
364,2016/02/23,217.0,220.783,226.0,217500,228.0,215.0
365,2016/02/24,215.0,215.477,214.0,61900,219.0,214.0
366,2016/02/25,221.0,220.403,214.0,163800,224.0,214.0
367,2016/02/26,221.0,221.886,222.0,161300,225.0,220.0
368,2016/02/29,226.0,225.116,226.0,206700,228.0,222.0
369,2016/03/01,222.0,224.039,225.0,158600,229.0,221.0
370,2016/03/02,226.0,224.179,225.0,184500,226.0,221.0
371,2016/03/03,231.0,229.307,226.0,286700,233.0,226.0
372,2016/03/04,237.0,236.813,234.0,299000,241.0,232.0
373,2016/03/07,234.0,234.819,240.0,182600,240.0,231.0
374,2016/03/08,265.0,293.94,304.0,10661700,314.0,262.0
375,2016/03/09,254.0,256.954,257.0,1568600,266.0,252.0
376,2016/03/10,250.0,256.041,255.0,868400,264.0,249.0
377,2016/03/11,241.0,244.111,246.0,1011100,252.0,241.0
378,2016/03/14,242.0,240.349,244.0,770200,246.0,234.0
379,2016/03/15,239.0,240.34,242.0,384700,248.0,236.0
380,2016/03/16,236.0,236.042,235.0,290300,239.0,233.0
381,2016/03/17,235.0,235.424,236.0,311900,239.0,234.0
382,2016/03/18,228.0,229.349,232.0,316200,233.0,226.0
383,2016/03/22,231.0,230.847,228.0,212700,235.0,228.0
384,2016/03/23,235.0,235.072,232.0,274200,239.0,232.0
385,2016/03/24,230.0,231.555,234.0,257500,236.0,229.0
386,2016/03/25,229.0,230.265,232.0,184800,234.0,228.0
387,2016/03/28,224.0,225.562,225.0,241000,227.0,224.0
388,2016/03/29,233.0,230.183,223.0,151800,234.0,223.0
389,2016/03/30,229.0,230.321,231.0,177200,235.0,227.0
390,2016/03/31,232.0,230.848,230.0,172000,234.0,228.0
391,2016/04/01,221.0,223.911,231.0,402300,232.0,221.0
392,2016/04/04,219.0,219.962,221.0,164300,225.0,217.0
393,2016/04/05,207.0,211.414,218.0,336500,218.0,205.0
394,2016/04/06,202.0,203.525,204.0,255600,209.0,201.0
395,2016/04/07,210.0,210.697,204.0,311300,220.0,204.0
396,2016/04/08,213.0,209.171,208.0,166400,214.0,204.0
397,2016/04/11,217.0,214.765,214.0,115300,219.0,211.0
398,2016/04/12,217.0,219.283,215.0,191000,223.0,215.0
399,2016/04/13,219.0,221.773,221.0,184600,225.0,219.0
400,2016/04/14,220.0,221.437,222.0,177300,224.0,219.0
401,2016/04/15,217.0,219.543,221.0,173400,223.0,217.0
402,2016/04/18,208.0,207.669,210.0,268800,212.0,205.0
403,2016/04/19,213.0,212.838,209.0,168900,217.0,209.0
404,2016/04/20,215.0,214.962,215.0,97800,217.0,213.0
405,2016/04/21,222.0,218.037,215.0,198700,223.0,215.0
406,2016/04/22,219.0,224.216,218.0,487500,234.0,217.0
407,2016/04/25,218.0,219.75,220.0,108400,223.0,217.0
408,2016/04/26,211.0,214.098,218.0,230800,221.0,210.0
409,2016/04/27,213.0,213.34,212.0,101900,216.0,211.0
410,2016/04/28,212.0,212.237,213.0,116700,215.0,209.0
411,2016/05/02,208.0,207.364,206.0,101500,211.0,205.0
412,2016/05/06,211.0,208.553,208.0,66600,211.0,206.0
413,2016/05/09,221.0,216.654,214.0,110800,221.0,211.0
414,2016/05/10,216.0,216.59,220.0,90900,220.0,215.0
415,2016/05/11,217.0,217.902,217.0,98800,220.0,216.0
416,2016/05/12,212.0,214.471,216.0,64600,217.0,212.0
417,2016/05/13,210.0,209.461,211.0,90100,214.0,207.0
418,2016/05/16,207.0,209.794,217.0,124200,217.0,206.0
419,2016/05/17,217.0,225.103,219.0,1431400,238.0,216.0
420,2016/05/18,210.0,211.901,216.0,272300,218.0,209.0
421,2016/05/19,215.0,212.481,210.0,93700,215.0,210.0
422,2016/05/20,215.0,213.829,211.0,110600,217.0,211.0
423,2016/05/23,225.0,221.987,219.0,255900,226.0,217.0
424,2016/05/24,225.0,222.254,219.0,134200,226.0,218.0
425,2016/05/25,224.0,223.959,226.0,144300,226.0,222.0
426,2016/05/26,220.0,222.306,224.0,168300,225.0,219.0
427,2016/05/27,216.0,217.714,218.0,181500,220.0,216.0
428,2016/05/30,219.0,218.556,216.0,137300,220.0,216.0
429,2016/05/31,222.0,224.287,226.0,328500,229.0,221.0
430,2016/06/01,220.0,221.196,221.0,249100,224.0,217.0
431,2016/06/02,213.0,214.862,218.0,219900,218.0,210.0
432,2016/06/03,213.0,214.885,212.0,103000,218.0,211.0
433,2016/06/06,230.0,227.866,210.0,2671900,250.0,209.0
434,2016/06/07,222.0,222.66,225.0,629000,228.0,218.0
435,2016/06/08,216.0,218.407,219.0,421100,221.0,216.0
436,2016/06/09,233.0,230.744,216.0,2661500,242.0,216.0
437,2016/06/10,237.0,239.375,233.0,1091900,247.0,229.0
438,2016/06/13,277.0,282.632,244.0,12833700,312.0,237.0
439,2016/06/14,249.0,269.486,289.0,5570500,301.0,240.0
440,2016/06/15,276.0,270.685,233.0,5311300,294.0,232.0
441,2016/06/16,270.0,285.553,274.0,7859500,310.0,256.0
442,2016/06/17,311.0,302.029,285.0,9413400,319.0,272.0
443,2016/06/20,366.0,371.846,350.0,15222000,391.0,340.0
444,2016/06/21,335.0,346.511,346.0,7029400,378.0,323.0
445,2016/06/22,404.0,380.779,330.0,19189900,410.0,320.0
446,2016/06/23,464.0,444.861,436.0,21888700,480.0,407.0
447,2016/06/24,518.0,481.942,490.0,21286100,535.0,384.0
448,2016/06/27,618.0,599.634,595.0,2535100,618.0,570.0
449,2016/06/28,526.0,606.722,648.0,18751700,686.0,518.0
450,2016/06/29,426.0,454.963,506.0,13288500,511.0,426.0
451,2016/06/30,429.0,421.087,423.0,12842800,449.0,393.0
452,2016/07/01,402.0,431.503,457.0,13047900,471.0,396.0
453,2016/07/04,392.0,398.514,389.0,6494500,427.0,384.0
454,2016/07/05,362.0,369.227,385.0,5182700,390.0,355.0
455,2016/07/06,352.0,370.012,378.0,8044800,392.0,346.0
456,2016/07/07,342.0,352.88,360.0,4708100,373.0,335.0
457,2016/07/08,337.0,338.866,350.0,3142200,353.0,323.0
458,2016/07/11,362.0,358.61,350.0,8345800,383.0,331.0
459,2016/07/12,337.0,342.797,347.0,5379600,358.0,326.0
460,2016/07/13,319.0,323.129,337.0,3844500,340.0,309.0
461,2016/07/14,312.0,316.256,324.0,2923400,329.0,307.0
462,2016/07/15,298.0,300.908,307.0,3686100,314.0,292.0
463,2016/07/19,301.0,293.778,295.0,3512200,307.0,283.0
464,2016/07/20,289.0,289.058,296.0,2482100,299.0,284.0
465,2016/07/21,297.0,291.496,287.0,2473000,307.0,281.0
466,2016/07/22,279.0,283.551,289.0,1890000,292.0,279.0
467,2016/07/25,271.0,272.107,275.0,1832400,277.0,268.0
468,2016/07/26,261.0,269.481,276.0,2254400,283.0,260.0
469,2016/07/27,266.0,268.317,265.0,2209500,282.0,261.0
470,2016/07/28,253.0,260.771,274.0,2448200,276.0,251.0
471,2016/07/29,254.0,247.171,250.0,1889500,259.0,241.0
472,2016/08/01,259.0,255.193,248.0,1349400,268.0,244.0
473,2016/08/02,254.0,249.89,251.0,1315900,257.0,245.0
474,2016/08/03,243.0,248.368,249.0,929200,256.0,243.0
475,2016/08/04,252.0,253.929,245.0,2478400,263.0,241.0
476,2016/08/05,244.0,246.215,252.0,1599600,257.0,241.0
477,2016/08/08,236.0,237.998,244.0,1040900,246.0,233.0
478,2016/08/09,239.0,234.159,230.0,1597900,249.0,227.0
479,2016/08/10,238.0,242.59,242.0,1183600,255.0,235.0
480,2016/08/12,240.0,237.969,238.0,662400,244.0,233.0
481,2016/08/15,238.0,236.393,235.0,547000,241.0,233.0
482,2016/08/16,242.0,243.261,238.0,914100,252.0,237.0
483,2016/08/17,241.0,242.122,247.0,815300,251.0,237.0
484,2016/08/18,239.0,240.257,241.0,1029100,247.0,236.0
485,2016/08/19,239.0,236.622,239.0,562400,241.0,233.0
486,2016/08/22,236.0,235.402,235.0,412800,239.0,233.0
487,2016/08/23,239.0,238.64,234.0,707400,243.0,234.0
488,2016/08/24,250.0,250.216,243.0,1987300,259.0,239.0
489,2016/08/25,292.0,279.117,251.0,8309700,307.0,251.0
490,2016/08/26,271.0,295.277,314.0,13028100,325.0,267.0
491,2016/08/29,259.0,267.379,279.0,3723800,287.0,256.0
492,2016/08/30,253.0,254.508,256.0,1545300,261.0,251.0
493,2016/08/31,243.0,246.261,252.0,1575700,252.0,243.0
494,2016/09/01,239.0,241.389,245.0,973800,245.0,238.0
495,2016/09/02,246.0,243.578,238.0,766300,247.0,238.0
496,2016/09/05,241.0,242.109,247.0,849600,247.0,240.0
497,2016/09/06,241.0,241.752,241.0,470400,245.0,240.0
498,2016/09/07,242.0,240.666,240.0,450200,244.0,238.0
499,2016/09/08,244.0,243.383,242.0,438300,247.0,241.0
500,2016/09/09,242.0,242.61,244.0,439100,244.0,241.0
501,2016/09/12,240.0,239.625,240.0,684500,244.0,238.0
502,2016/09/13,241.0,241.071,239.0,310600,243.0,239.0
503,2016/09/14,245.0,254.3,241.0,4503500,268.0,239.0
504,2016/09/15,240.0,242.582,246.0,947300,248.0,240.0
505,2016/09/16,243.0,242.156,241.0,799200,248.0,240.0
506,2016/09/20,239.0,240.016,241.0,535600,243.0,238.0
507,2016/09/21,242.0,248.113,255.0,2762200,259.0,240.0
508,2016/09/23,241.0,239.877,242.0,649500,242.0,238.0
509,2016/09/26,239.0,240.34,241.0,507200,243.0,239.0
510,2016/09/27,239.0,240.041,239.0,755200,243.0,238.0
511,2016/09/28,239.0,240.166,239.0,301400,242.0,239.0
512,2016/09/29,239.0,239.498,240.0,399200,241.0,238.0
513,2016/09/30,236.0,237.389,239.0,501200,239.0,236.0
514,2016/10/03,240.0,237.328,235.0,422700,240.0,234.0
515,2016/10/04,240.0,237.712,238.0,480500,240.0,236.0
516,2016/10/05,238.0,241.174,239.0,1247600,247.0,238.0
517,2016/10/06,242.0,243.057,239.0,1778900,251.0,238.0
518,2016/10/07,241.0,241.624,243.0,854600,246.0,239.0
519,2016/10/11,240.0,239.923,241.0,520000,243.0,239.0
520,2016/10/12,238.0,238.198,238.0,302200,240.0,237.0
521,2016/10/13,236.0,236.446,238.0,468500,239.0,235.0
522,2016/10/14,235.0,236.152,235.0,283500,238.0,235.0
523,2016/10/17,235.0,234.194,235.0,286200,236.0,233.0
524,2016/10/18,236.0,232.716,232.0,467500,236.0,231.0
525,2016/10/19,235.0,235.815,234.0,301100,239.0,234.0
526,2016/10/20,235.0,235.088,235.0,218400,236.0,234.0
527,2016/10/21,234.0,235.612,235.0,243100,238.0,234.0
528,2016/10/24,234.0,234.631,236.0,232000,236.0,233.0
529,2016/10/25,233.0,233.802,235.0,267100,236.0,232.0
530,2016/10/26,233.0,233.241,233.0,188500,235.0,232.0
531,2016/10/27,232.0,232.691,233.0,188600,234.0,232.0
532,2016/10/28,229.0,229.342,232.0,629400,233.0,227.0
533,2016/10/31,230.0,228.76,228.0,289300,230.0,228.0
534,2016/11/01,229.0,234.226,229.0,895400,245.0,229.0
535,2016/11/02,227.0,227.207,229.0,443800,232.0,225.0
536,2016/11/04,221.0,222.07,225.0,401800,225.0,220.0
537,2016/11/07,222.0,222.707,221.0,135300,224.0,221.0
538,2016/11/08,222.0,221.325,223.0,186700,223.0,220.0
539,2016/11/09,207.0,209.616,221.0,733700,221.0,201.0
540,2016/11/10,214.0,214.73,214.0,340100,217.0,211.0
541,2016/11/11,215.0,216.725,215.0,205800,220.0,215.0
542,2016/11/14,255.0,257.801,251.0,8284700,271.0,246.0
543,2016/11/15,250.0,247.681,253.0,1526100,257.0,240.0
544,2016/11/16,249.0,249.919,246.0,976600,256.0,244.0
545,2016/11/17,257.0,254.143,248.0,1397100,262.0,242.0
546,2016/11/18,266.0,268.152,265.0,2094600,275.0,260.0
547,2016/11/21,290.0,287.852,272.0,3353400,297.0,272.0
548,2016/11/22,269.0,274.801,290.0,2741600,291.0,264.0
549,2016/11/24,261.0,261.202,270.0,1524300,270.0,254.0
550,2016/11/25,252.0,256.92,265.0,1133600,267.0,248.0
551,2016/11/28,255.0,251.275,251.0,696000,258.0,247.0
552,2016/11/29,257.0,262.43,270.0,1159400,271.0,255.0
553,2016/11/30,267.0,275.581,256.0,6391500,288.0,255.0
554,2016/12/01,264.0,268.721,272.0,1779200,277.0,263.0
555,2016/12/02,249.0,252.198,260.0,1717400,261.0,249.0
556,2016/12/05,251.0,249.781,249.0,814800,256.0,244.0
557,2016/12/06,250.0,251.121,254.0,507900,254.0,249.0
558,2016/12/07,245.0,246.831,248.0,489600,249.0,245.0
559,2016/12/08,245.0,244.9,246.0,575300,248.0,243.0
560,2016/12/09,242.0,242.065,243.0,486800,244.0,240.0
561,2016/12/12,247.0,245.003,245.0,323900,248.0,243.0
562,2016/12/13,243.0,243.406,245.0,372400,246.0,241.0
563,2016/12/14,245.0,243.101,242.0,406600,246.0,240.0
564,2016/12/15,242.0,244.432,244.0,321700,248.0,242.0
565,2016/12/16,245.0,245.311,243.0,415800,249.0,242.0
566,2016/12/19,245.0,245.314,247.0,293400,248.0,244.0
567,2016/12/20,251.0,249.626,246.0,515200,254.0,245.0
568,2016/12/21,244.0,247.767,252.0,471200,253.0,244.0
569,2016/12/22,241.0,242.592,245.0,315900,245.0,241.0
570,2016/12/26,244.0,244.354,243.0,409100,248.0,242.0
571,2016/12/27,245.0,245.206,243.0,381200,248.0,243.0
572,2016/12/28,250.0,249.071,244.0,480600,252.0,244.0
573,2016/12/29,245.0,245.194,247.0,389000,249.0,243.0
574,2016/12/30,244.0,243.778,244.0,298500,246.0,241.0
575,2017/01/04,250.0,247.751,245.0,495900,251.0,245.0
576,2017/01/05,259.0,256.745,248.0,1348200,265.0,247.0
577,2017/01/06,265.0,266.302,259.0,2083800,278.0,252.0
578,2017/01/10,260.0,265.409,265.0,989900,272.0,260.0
579,2017/01/11,255.0,258.239,261.0,468400,263.0,255.0
580,2017/01/12,252.0,254.155,255.0,352000,258.0,251.0
581,2017/01/13,259.0,255.529,252.0,449100,261.0,249.0
582,2017/01/16,253.0,255.003,259.0,349300,259.0,253.0
583,2017/01/17,250.0,252.658,253.0,415000,255.0,249.0
584,2017/01/18,254.0,252.372,250.0,283000,256.0,249.0
585,2017/01/19,268.0,266.539,254.0,1864500,274.0,254.0
586,2017/01/20,257.0,258.719,265.0,814200,266.0,255.0
587,2017/01/23,259.0,260.743,265.0,477300,265.0,257.0
588,2017/01/24,257.0,256.916,261.0,409000,261.0,254.0
589,2017/01/25,272.0,273.015,262.0,3513600,281.0,261.0
590,2017/01/26,278.0,271.831,270.0,1473100,280.0,263.0
591,2017/01/27,271.0,280.493,285.0,2331100,290.0,271.0
592,2017/01/30,272.0,270.252,269.0,1002700,277.0,266.0
593,2017/01/31,269.0,270.797,268.0,409500,275.0,267.0
594,2017/02/01,267.0,268.62,269.0,442800,273.0,266.0
595,2017/02/02,260.0,264.364,267.0,455100,268.0,260.0
596,2017/02/03,265.0,263.77,260.0,228600,267.0,260.0
597,2017/02/06,269.0,266.926,267.0,248600,270.0,264.0
598,2017/02/07,272.0,271.43,269.0,417100,275.0,267.0
599,2017/02/08,270.0,270.093,272.0,261300,272.0,268.0
600,2017/02/09,273.0,272.105,269.0,361500,275.0,268.0
601,2017/02/10,274.0,272.646,272.0,284300,275.0,270.0
602,2017/02/13,231.0,239.87,274.0,5203700,274.0,224.0
603,2017/02/14,234.0,236.925,241.0,1261500,243.0,232.0
604,2017/02/15,233.0,233.252,236.0,533600,236.0,232.0
605,2017/02/16,231.0,232.116,233.0,382800,234.0,231.0
606,2017/02/17,233.0,232.495,232.0,337000,234.0,231.0
607,2017/02/20,238.0,235.891,235.0,411200,238.0,233.0
608,2017/02/21,237.0,237.111,240.0,270700,240.0,235.0
609,2017/02/22,234.0,235.004,236.0,243200,237.0,234.0
610,2017/02/23,234.0,233.552,235.0,295300,235.0,232.0
611,2017/02/24,234.0,233.548,232.0,220300,235.0,232.0
612,2017/02/27,234.0,233.572,234.0,131700,235.0,233.0
613,2017/02/28,237.0,235.677,235.0,185500,237.0,234.0
614,2017/03/01,235.0,234.717,236.0,239800,237.0,234.0
615,2017/03/02,235.0,236.113,237.0,179600,237.0,235.0
616,2017/03/03,235.0,235.549,236.0,184700,237.0,234.0
617,2017/03/06,234.0,234.527,236.0,207900,236.0,233.0
618,2017/03/07,233.0,234.089,234.0,175500,235.0,233.0
619,2017/03/08,236.0,235.401,234.0,251600,237.0,234.0
620,2017/03/09,234.0,234.501,235.0,259600,236.0,233.0
621,2017/03/10,237.0,234.635,234.0,351800,238.0,233.0
622,2017/03/13,238.0,239.768,240.0,360000,242.0,237.0
623,2017/03/14,240.0,246.264,239.0,1679100,258.0,238.0
624,2017/03/15,228.0,230.268,230.0,1030500,233.0,227.0
625,2017/03/16,229.0,227.533,226.0,299400,232.0,223.0
626,2017/03/17,223.0,224.631,228.0,430500,229.0,222.0
627,2017/03/21,217.0,219.316,221.0,431600,222.0,217.0
628,2017/03/22,214.0,214.452,216.0,472800,217.0,213.0
629,2017/03/23,217.0,215.381,213.0,135400,218.0,213.0
630,2017/03/24,214.0,215.151,217.0,246500,217.0,214.0
631,2017/03/27,211.0,212.132,215.0,300400,215.0,210.0
632,2017/03/28,211.0,212.271,212.0,131600,214.0,211.0
633,2017/03/29,216.0,215.886,212.0,118800,218.0,212.0
634,2017/03/30,216.0,217.505,218.0,68100,219.0,216.0
635,2017/03/31,212.0,214.18,219.0,197600,219.0,212.0
636,2017/04/03,214.0,212.188,212.0,97200,214.0,211.0
637,2017/04/04,207.0,211.886,219.0,456400,221.0,206.0
638,2017/04/05,210.0,207.766,207.0,159500,211.0,206.0
639,2017/04/06,203.0,204.772,209.0,304600,209.0,201.0
640,2017/04/07,208.0,204.242,206.0,347700,208.0,202.0
641,2017/04/10,209.0,207.314,204.0,128900,209.0,204.0
642,2017/04/11,207.0,207.727,207.0,125900,209.0,206.0
643,2017/04/12,195.0,199.178,206.0,667600,206.0,195.0
644,2017/04/13,196.0,193.006,191.0,302300,198.0,189.0
645,2017/04/14,192.0,196.166,196.0,237500,201.0,192.0
646,2017/04/17,195.0,191.083,186.0,232300,198.0,186.0
647,2017/04/18,206.0,201.659,199.0,241000,206.0,198.0
648,2017/04/19,204.0,203.69,202.0,140500,205.0,201.0
649,2017/04/20,207.0,206.585,204.0,97900,209.0,204.0
650,2017/04/21,207.0,209.198,212.0,144000,213.0,207.0
651,2017/04/24,200.0,203.599,208.0,153300,208.0,200.0
652,2017/04/25,203.0,202.876,200.0,109500,206.0,200.0
653,2017/04/26,207.0,207.127,205.0,184700,210.0,204.0
654,2017/04/27,207.0,206.934,208.0,112500,209.0,205.0
655,2017/04/28,207.0,207.433,208.0,43400,209.0,207.0
656,2017/05/01,209.0,208.77,210.0,35200,210.0,208.0
657,2017/05/02,209.0,209.713,209.0,103500,211.0,208.0
658,2017/05/08,213.0,215.783,217.0,473500,224.0,210.0
659,2017/05/09,214.0,212.258,215.0,161500,215.0,209.0
660,2017/05/10,212.0,212.312,214.0,107800,214.0,211.0
661,2017/05/11,210.0,210.652,211.0,63200,212.0,210.0
662,2017/05/12,209.0,209.218,210.0,80400,211.0,208.0
663,2017/05/15,212.0,209.01,209.0,102500,213.0,206.0
664,2017/05/16,215.0,212.909,212.0,102500,215.0,210.0
665,2017/05/17,211.0,212.103,215.0,98500,215.0,210.0
666,2017/05/18,207.0,206.093,206.0,171600,209.0,203.0
667,2017/05/19,209.0,210.009,209.0,227100,213.0,208.0
668,2017/05/22,193.0,189.438,183.0,1391700,197.0,183.0
669,2017/05/23,193.0,192.315,194.0,279800,195.0,191.0
670,2017/05/24,194.0,193.388,193.0,198700,195.0,191.0
671,2017/05/25,196.0,195.646,196.0,145700,198.0,194.0
672,2017/05/26,198.0,196.705,197.0,108800,198.0,195.0
673,2017/05/29,198.0,196.889,196.0,69100,198.0,196.0
674,2017/05/30,195.0,195.395,197.0,100200,197.0,194.0
675,2017/05/31,193.0,191.778,194.0,226000,194.0,190.0
676,2017/06/01,193.0,191.909,192.0,161200,193.0,191.0
677,2017/06/02,193.0,191.944,194.0,124600,194.0,190.0
678,2017/06/05,200.0,197.624,193.0,314200,202.0,192.0
679,2017/06/06,195.0,198.221,203.0,200600,204.0,195.0
680,2017/06/07,200.0,199.9,196.0,211800,203.0,195.0
681,2017/06/08,203.0,203.586,201.0,343000,206.0,200.0
682,2017/06/09,209.0,205.796,203.0,409200,209.0,200.0
683,2017/06/12,206.0,209.817,209.0,859600,219.0,200.0
684,2017/06/13,209.0,210.156,207.0,541400,217.0,206.0
685,2017/06/14,213.0,211.68,210.0,462300,216.0,207.0
686,2017/06/15,208.0,209.686,213.0,244200,213.0,208.0
687,2017/06/16,207.0,205.981,207.0,245400,210.0,204.0
688,2017/06/19,208.0,206.386,206.0,116100,209.0,205.0
689,2017/06/20,206.0,206.915,208.0,134100,208.0,206.0
690,2017/06/21,208.0,206.83,208.0,114900,208.0,206.0
691,2017/06/22,208.0,206.94,208.0,229600,208.0,206.0
692,2017/06/23,202.0,205.073,209.0,349000,209.0,202.0
693,2017/06/26,205.0,203.63,202.0,104400,205.0,202.0
694,2017/06/27,205.0,203.401,206.0,188400,206.0,202.0
695,2017/06/28,200.0,201.336,203.0,280700,204.0,200.0
696,2017/06/29,206.0,204.958,203.0,212500,207.0,203.0
697,2017/06/30,206.0,205.005,206.0,136300,206.0,203.0
698,2017/07/03,208.0,206.749,205.0,260400,208.0,205.0
699,2017/07/04,203.0,205.977,209.0,214500,209.0,203.0
700,2017/07/05,204.0,203.235,204.0,118200,205.0,202.0
701,2017/07/06,201.0,202.087,205.0,217200,205.0,201.0
702,2017/07/07,201.0,200.29,201.0,180900,202.0,199.0
703,2017/07/10,203.0,201.476,201.0,178100,203.0,201.0
704,2017/07/11,202.0,202.413,203.0,196200,204.0,201.0
705,2017/07/12,202.0,201.589,202.0,132500,203.0,200.0
706,2017/07/13,200.0,200.049,202.0,367600,203.0,199.0
707,2017/07/14,200.0,198.931,200.0,129600,201.0,198.0
708,2017/07/18,201.0,201.048,202.0,155900,203.0,200.0
709,2017/07/19,201.0,200.868,202.0,152700,202.0,200.0
710,2017/07/20,201.0,200.203,200.0,148700,201.0,200.0
711,2017/07/21,201.0,200.147,201.0,140700,201.0,199.0
712,2017/07/24,197.0,198.276,199.0,256400,200.0,197.0
713,2017/07/25,196.0,196.683,198.0,315200,199.0,195.0
714,2017/07/26,195.0,194.746,196.0,278800,197.0,193.0
715,2017/07/27,195.0,194.935,194.0,182600,198.0,193.0
716,2017/07/28,193.0,194.039,196.0,137600,196.0,193.0
717,2017/07/31,190.0,189.747,192.0,446600,193.0,188.0
718,2017/08/01,188.0,188.342,192.0,276100,192.0,186.0
719,2017/08/02,191.0,190.1,191.0,100000,191.0,188.0
720,2017/08/03,187.0,187.453,191.0,166400,191.0,186.0
721,2017/08/04,187.0,186.797,187.0,135800,188.0,186.0
722,2017/08/07,189.0,187.234,186.0,97500,189.0,186.0
723,2017/08/08,187.0,187.727,188.0,57400,189.0,187.0
724,2017/08/09,185.0,185.751,187.0,102400,187.0,185.0
725,2017/08/10,184.0,183.441,184.0,202300,185.0,181.0
726,2017/08/14,182.0,180.518,180.0,205200,183.0,178.0
727,2017/08/15,178.0,178.982,180.0,249100,181.0,178.0
728,2017/08/16,180.0,180.036,179.0,93000,182.0,178.0
729,2017/08/17,186.0,185.602,182.0,190100,189.0,181.0
730,2017/08/18,184.0,185.712,187.0,105500,187.0,184.0
731,2017/08/21,185.0,183.246,183.0,97100,185.0,182.0
732,2017/08/22,188.0,186.943,187.0,110100,188.0,186.0
733,2017/08/23,195.0,206.359,203.0,4487800,218.0,195.0
734,2017/08/24,192.0,192.178,198.0,539100,198.0,189.0
735,2017/08/25,189.0,190.207,192.0,195800,192.0,189.0
736,2017/08/28,190.0,189.897,190.0,89500,191.0,189.0
737,2017/08/29,193.0,190.365,189.0,119800,193.0,188.0
738,2017/08/30,192.0,191.655,192.0,150400,194.0,190.0
739,2017/08/31,191.0,191.044,192.0,122700,192.0,190.0
740,2017/09/01,190.0,191.238,192.0,132800,192.0,190.0
741,2017/09/04,186.0,187.674,191.0,219300,191.0,185.0
742,2017/09/05,185.0,188.257,194.0,378800,195.0,181.0
743,2017/09/06,183.0,182.346,182.0,103200,184.0,180.0
744,2017/09/07,187.0,184.999,185.0,65500,187.0,184.0
745,2017/09/08,182.0,184.021,184.0,112900,186.0,182.0
746,2017/09/11,186.0,185.663,183.0,105900,189.0,182.0
747,2017/09/12,187.0,186.946,187.0,98900,189.0,185.0
748,2017/09/13,237.0,230.281,225.0,14209100,237.0,212.0
749,2017/09/14,207.0,218.748,239.0,5492200,240.0,198.0
750,2017/09/15,206.0,203.909,200.0,1107000,212.0,199.0
751,2017/09/19,209.0,209.03,208.0,1451700,219.0,202.0
752,2017/09/20,201.0,205.525,212.0,1142500,212.0,201.0
753,2017/09/21,201.0,202.607,203.0,331800,205.0,201.0
754,2017/09/22,197.0,198.745,202.0,556500,203.0,196.0
755,2017/09/25,198.0,196.318,197.0,380800,199.0,194.0
756,2017/09/26,196.0,196.777,197.0,131000,198.0,196.0
757,2017/09/27,198.0,196.705,196.0,119500,198.0,196.0
758,2017/09/28,195.0,196.851,199.0,290900,200.0,195.0
759,2017/09/29,196.0,194.23,195.0,268200,196.0,192.0
760,2017/10/02,200.0,198.81,197.0,389500,202.0,196.0
761,2017/10/03,196.0,198.293,200.0,302900,201.0,196.0
762,2017/10/04,196.0,196.052,198.0,219700,198.0,194.0
763,2017/10/05,198.0,197.469,196.0,223500,199.0,196.0
764,2017/10/06,195.0,196.138,198.0,168500,198.0,195.0
765,2017/10/10,195.0,193.37,195.0,290200,195.0,192.0
766,2017/10/11,194.0,194.018,195.0,115000,195.0,193.0
767,2017/10/12,195.0,194.803,195.0,120000,196.0,194.0
768,2017/10/13,194.0,193.998,195.0,116400,196.0,193.0
769,2017/10/16,194.0,192.885,194.0,150700,194.0,192.0
770,2017/10/17,191.0,191.561,192.0,204900,193.0,191.0
771,2017/10/18,190.0,190.613,191.0,140000,192.0,190.0
772,2017/10/19,191.0,191.09,191.0,92200,192.0,190.0
773,2017/10/20,189.0,189.573,190.0,156600,190.0,189.0
774,2017/10/23,192.0,190.851,189.0,157900,193.0,189.0
775,2017/10/24,191.0,191.142,192.0,97400,192.0,190.0
776,2017/10/25,191.0,190.826,191.0,100500,192.0,190.0
777,2017/10/26,189.0,190.029,190.0,151400,191.0,189.0
778,2017/10/27,191.0,195.732,190.0,898000,202.0,189.0
779,2017/10/30,194.0,193.192,191.0,204700,195.0,191.0
780,2017/10/31,196.0,195.321,195.0,172100,197.0,193.0
781,2017/11/01,195.0,195.931,197.0,129500,197.0,195.0
782,2017/11/02,194.0,194.337,195.0,74300,196.0,193.0
783,2017/11/06,193.0,193.973,194.0,114400,196.0,193.0
784,2017/11/07,193.0,193.723,194.0,113500,195.0,193.0
785,2017/11/08,193.0,193.22,194.0,138000,195.0,193.0
786,2017/11/09,190.0,192.338,194.0,215500,194.0,190.0
787,2017/11/10,192.0,190.673,190.0,77700,192.0,190.0
788,2017/11/13,188.0,189.466,192.0,133100,192.0,188.0
789,2017/11/14,189.0,189.923,188.0,246800,193.0,187.0
790,2017/11/15,177.0,178.479,180.0,707100,182.0,176.0
791,2017/11/16,179.0,175.295,175.0,367800,179.0,172.0
792,2017/11/17,177.0,178.167,180.0,186100,181.0,176.0
793,2017/11/20,176.0,177.224,176.0,119000,179.0,176.0
794,2017/11/21,174.0,175.034,176.0,175600,177.0,174.0
795,2017/11/22,175.0,174.843,174.0,70800,176.0,174.0
796,2017/11/24,177.0,175.743,175.0,89800,177.0,175.0
797,2017/11/27,176.0,175.731,175.0,145100,178.0,175.0
798,2017/11/28,175.0,173.969,174.0,222200,176.0,172.0
799,2017/11/29,174.0,174.543,176.0,130900,176.0,173.0
800,2017/11/30,174.0,173.408,174.0,126100,175.0,173.0
801,2017/12/01,174.0,174.126,174.0,51500,175.0,173.0
802,2017/12/04,172.0,172.616,173.0,148000,174.0,172.0
803,2017/12/05,171.0,170.875,172.0,355600,173.0,170.0
804,2017/12/06,167.0,166.874,171.0,389700,171.0,165.0
805,2017/12/07,170.0,169.994,167.0,294500,174.0,167.0
806,2017/12/08,171.0,169.879,171.0,73500,171.0,169.0
807,2017/12/11,170.0,170.072,170.0,76500,171.0,169.0
808,2017/12/12,171.0,170.033,171.0,131700,171.0,169.0
809,2017/12/13,169.0,170.048,171.0,95600,171.0,169.0
810,2017/12/14,169.0,169.391,168.0,168300,170.0,168.0
811,2017/12/15,167.0,167.009,169.0,276000,169.0,166.0
812,2017/12/18,160.0,161.428,165.0,703500,165.0,158.0
813,2017/12/19,155.0,156.98,160.0,517300,161.0,154.0
814,2017/12/20,154.0,155.355,155.0,347500,157.0,154.0
815,2017/12/21,152.0,153.44,153.0,225400,156.0,152.0
816,2017/12/22,151.0,151.809,152.0,278500,153.0,151.0
817,2017/12/25,142.0,145.469,150.0,891700,150.0,142.0
818,2017/12/26,142.0,142.169,141.0,784200,144.0,140.0
819,2017/12/27,156.0,155.424,144.0,1955600,164.0,143.0
820,2017/12/28,148.0,151.152,154.0,428500,154.0,148.0
821,2017/12/29,152.0,151.764,150.0,258100,155.0,149.0
822,2018/01/04,156.0,153.03,153.0,221500,156.0,151.0
823,2018/01/05,153.0,153.926,155.0,281100,156.0,152.0
824,2018/01/09,155.0,154.542,154.0,236000,156.0,153.0
825,2018/01/10,156.0,155.072,155.0,132600,157.0,154.0
826,2018/01/11,159.0,158.104,156.0,342300,161.0,154.0
827,2018/01/12,167.0,163.786,159.0,550600,168.0,159.0
828,2018/01/15,167.0,166.834,167.0,320400,169.0,165.0
829,2018/01/16,164.0,164.662,167.0,204800,168.0,162.0
830,2018/01/17,159.0,161.296,164.0,226800,164.0,159.0
831,2018/01/18,163.0,161.303,160.0,88700,163.0,160.0
832,2018/01/19,162.0,162.557,163.0,82800,164.0,162.0
833,2018/01/22,163.0,162.811,163.0,127800,164.0,161.0
834,2018/01/23,166.0,165.176,165.0,129400,166.0,164.0
835,2018/01/24,165.0,164.836,166.0,162900,167.0,163.0
836,2018/01/25,165.0,164.155,163.0,69500,165.0,163.0
837,2018/01/26,163.0,164.005,163.0,123200,165.0,163.0
838,2018/01/29,164.0,163.795,164.0,168000,165.0,163.0
839,2018/01/30,163.0,163.108,164.0,146700,164.0,162.0
840,2018/01/31,161.0,161.655,163.0,82400,163.0,161.0
841,2018/02/01,163.0,160.981,160.0,51300,163.0,160.0
842,2018/02/02,160.0,160.044,162.0,110200,162.0,159.0
843,2018/02/05,157.0,156.252,156.0,109800,158.0,155.0
844,2018/02/06,149.0,146.454,147.0,401900,150.0,144.0
845,2018/02/07,160.0,159.019,152.0,549500,167.0,150.0
846,2018/02/08,162.0,159.745,163.0,108400,163.0,158.0
847,2018/02/09,160.0,156.258,155.0,131900,160.0,153.0
848,2018/02/13,155.0,159.532,162.0,358900,165.0,155.0
849,2018/02/14,158.0,156.779,155.0,205200,159.0,154.0
850,2018/02/15,160.0,157.701,158.0,100300,161.0,155.0
851,2018/02/16,164.0,161.784,158.0,117100,164.0,158.0
852,2018/02/19,165.0,164.167,165.0,84700,166.0,162.0
853,2018/02/20,166.0,164.629,163.0,69600,166.0,163.0
854,2018/02/21,167.0,166.092,165.0,143900,168.0,165.0
855,2018/02/22,164.0,165.265,166.0,65300,166.0,164.0
856,2018/02/23,165.0,164.126,164.0,32600,165.0,163.0
857,2018/02/26,166.0,165.137,165.0,24800,166.0,164.0
858,2018/02/27,164.0,165.373,166.0,55200,166.0,164.0
859,2018/02/28,165.0,165.307,165.0,40100,166.0,165.0
860,2018/03/01,164.0,164.871,164.0,48100,166.0,164.0
861,2018/03/02,170.0,173.84,164.0,3016400,181.0,164.0
862,2018/03/05,160.0,166.405,168.0,552900,174.0,160.0
863,2018/03/06,159.0,161.768,165.0,222300,166.0,159.0
864,2018/03/07,160.0,158.976,160.0,201400,162.0,156.0
865,2018/03/08,160.0,160.336,159.0,94100,162.0,159.0
866,2018/03/09,160.0,159.912,160.0,82800,161.0,159.0
867,2018/03/12,161.0,159.95,160.0,90600,161.0,159.0
868,2018/03/13,161.0,161.274,159.0,77500,163.0,159.0
869,2018/03/14,162.0,161.637,160.0,123100,164.0,160.0
870,2018/03/15,163.0,161.851,162.0,65000,163.0,160.0
871,2018/03/16,159.0,160.516,163.0,114400,163.0,159.0
872,2018/03/19,153.0,155.548,157.0,240500,158.0,153.0
873,2018/03/20,155.0,153.844,151.0,83200,156.0,151.0
874,2018/03/22,152.0,153.924,154.0,55000,156.0,152.0
875,2018/03/23,152.0,150.315,150.0,138700,153.0,149.0
876,2018/03/26,152.0,150.894,149.0,64100,153.0,149.0
877,2018/03/27,155.0,153.945,154.0,55900,155.0,152.0
878,2018/03/28,158.0,155.878,152.0,49300,158.0,152.0
879,2018/03/29,158.0,158.651,160.0,61800,160.0,157.0
880,2018/03/30,159.0,158.414,159.0,47800,160.0,157.0
881,2018/04/02,159.0,158.823,160.0,35500,160.0,158.0
882,2018/04/03,155.0,156.392,157.0,49500,158.0,155.0
883,2018/04/04,154.0,155.386,157.0,81300,157.0,154.0
884,2018/04/05,155.0,155.3,156.0,88600,158.0,153.0
885,2018/04/06,154.0,153.987,155.0,47000,155.0,153.0
886,2018/04/09,157.0,167.013,165.0,5639200,181.0,156.0
887,2018/04/10,152.0,155.25,157.0,723600,161.0,152.0
888,2018/04/11,150.0,151.104,151.0,204300,153.0,150.0
889,2018/04/12,154.0,152.671,151.0,98200,155.0,150.0
890,2018/04/13,153.0,152.939,154.0,60300,154.0,152.0
891,2018/04/16,148.0,149.325,152.0,387000,153.0,147.0
892,2018/04/17,148.0,147.623,149.0,79400,149.0,146.0
893,2018/04/18,150.0,149.136,148.0,77300,151.0,147.0
894,2018/04/19,150.0,150.066,150.0,74200,152.0,149.0
895,2018/04/20,150.0,153.015,151.0,273200,158.0,150.0
896,2018/04/23,153.0,151.59,150.0,77400,153.0,150.0
897,2018/04/24,154.0,154.565,156.0,126000,156.0,153.0
898,2018/04/25,153.0,153.269,154.0,169100,156.0,152.0
899,2018/04/26,151.0,151.992,153.0,62000,153.0,151.0
900,2018/04/27,151.0,150.933,151.0,71100,152.0,150.0
901,2018/05/01,148.0,148.989,151.0,184100,151.0,148.0
902,2018/05/02,147.0,148.372,150.0,196000,151.0,147.0
903,2018/05/07,149.0,148.285,149.0,86200,150.0,147.0
904,2018/05/08,148.0,149.334,148.0,128600,152.0,148.0
905,2018/05/09,148.0,148.197,149.0,49800,149.0,148.0
906,2018/05/10,147.0,147.743,148.0,55200,149.0,147.0
907,2018/05/11,148.0,147.818,147.0,51100,148.0,147.0
908,2018/05/14,147.0,146.854,147.0,124300,148.0,146.0
909,2018/05/15,146.0,145.875,147.0,118900,147.0,145.0
910,2018/05/16,147.0,146.363,146.0,63400,147.0,145.0
911,2018/05/17,148.0,147.348,147.0,71000,148.0,146.0
912,2018/05/18,149.0,148.72,149.0,102500,150.0,147.0
913,2018/05/21,147.0,146.384,145.0,243500,149.0,145.0
914,2018/05/22,149.0,147.956,149.0,67500,149.0,147.0
915,2018/05/23,148.0,147.469,147.0,45200,149.0,146.0
916,2018/05/24,147.0,145.713,147.0,106700,147.0,145.0
917,2018/05/25,145.0,145.329,145.0,51100,146.0,145.0
918,2018/05/28,145.0,145.043,145.0,46300,146.0,145.0
919,2018/05/29,143.0,143.324,144.0,117700,144.0,142.0
920,2018/05/30,141.0,141.887,142.0,68800,143.0,141.0
921,2018/05/31,141.0,141.743,142.0,40100,143.0,141.0
922,2018/06/01,141.0,141.381,141.0,69000,143.0,141.0
923,2018/06/04,153.0,148.172,142.0,383300,153.0,142.0
924,2018/06/05,164.0,163.901,155.0,3290800,176.0,153.0
925,2018/06/06,171.0,173.916,160.0,4889200,185.0,152.0
926,2018/06/07,165.0,169.938,172.0,1734000,176.0,162.0
927,2018/06/08,183.0,174.138,173.0,1654100,183.0,165.0
928,2018/06/11,164.0,170.439,178.0,2353100,182.0,164.0
929,2018/06/12,175.0,171.394,171.0,948600,175.0,169.0
930,2018/06/13,165.0,167.946,173.0,847700,173.0,165.0
931,2018/06/14,162.0,164.588,166.0,481600,169.0,161.0
932,2018/06/15,161.0,159.551,161.0,698700,164.0,157.0
933,2018/06/18,157.0,156.956,160.0,517400,160.0,154.0
934,2018/06/19,151.0,155.459,155.0,934100,162.0,150.0
935,2018/06/20,150.0,149.107,151.0,501800,153.0,146.0
936,2018/06/21,153.0,152.591,150.0,249400,155.0,149.0
937,2018/06/22,147.0,149.363,153.0,409600,153.0,147.0
938,2018/06/25,145.0,146.553,148.0,321800,150.0,144.0
939,2018/06/26,144.0,144.283,144.0,309100,148.0,143.0
940,2018/06/27,154.0,151.47,146.0,701000,155.0,146.0
941,2018/06/28,164.0,184.16,174.0,25820900,203.0,161.0
942,2018/06/29,117.0,125.218,140.0,9861200,141.0,115.0
943,2018/07/02,116.0,119.974,117.0,3238000,127.0,113.0
944,2018/07/03,118.0,119.961,124.0,1202300,124.0,117.0
945,2018/07/04,112.0,111.488,116.0,1331600,117.0,108.0
946,2018/07/05,108.0,110.18,112.0,801400,114.0,107.0
947,2018/07/06,108.0,108.069,109.0,373900,109.0,107.0
948,2018/07/09,108.0,106.108,106.0,487500,109.0,104.0
949,2018/07/10,107.0,109.014,109.0,354800,112.0,106.0
950,2018/07/11,104.0,105.653,106.0,275200,107.0,104.0
951,2018/07/12,107.0,106.749,103.0,450200,111.0,103.0
952,2018/07/13,107.0,106.641,105.0,264100,109.0,105.0
953,2018/07/17,107.0,107.84,109.0,218400,109.0,106.0
954,2018/07/18,110.0,109.449,108.0,675300,112.0,106.0
955,2018/07/19,109.0,109.493,110.0,206000,111.0,108.0
956,2018/07/20,108.0,109.131,109.0,157400,111.0,108.0
957,2018/07/23,107.0,107.765,108.0,136600,109.0,107.0
958,2018/07/24,108.0,108.032,108.0,93900,109.0,107.0
959,2018/07/25,108.0,108.223,109.0,75700,109.0,108.0
960,2018/07/26,109.0,109.026,108.0,96900,110.0,108.0
961,2018/07/27,110.0,108.287,108.0,248400,110.0,107.0
962,2018/07/30,110.0,109.14,110.0,80100,110.0,108.0
963,2018/07/31,109.0,110.201,109.0,249900,112.0,109.0
964,2018/08/01,112.0,110.342,108.0,135800,112.0,108.0
965,2018/08/02,112.0,111.589,110.0,159200,113.0,110.0
966,2018/08/03,110.0,116.808,113.0,1793700,124.0,110.0
967,2018/08/06,106.0,107.541,111.0,477800,112.0,105.0
968,2018/08/07,106.0,105.972,105.0,230300,109.0,105.0
969,2018/08/08,108.0,108.077,107.0,160800,110.0,106.0
970,2018/08/09,107.0,108.773,109.0,192200,112.0,107.0
971,2018/08/10,107.0,106.621,107.0,140100,108.0,106.0
972,2018/08/13,101.0,102.925,107.0,430200,107.0,100.0
973,2018/08/14,103.0,102.905,102.0,94700,104.0,102.0
974,2018/08/15,98.0,100.062,103.0,249700,103.0,98.0
975,2018/08/16,101.0,99.128,98.0,210300,101.0,96.0
976,2018/08/17,101.0,101.202,100.0,136900,102.0,100.0
977,2018/08/20,100.0,99.906,101.0,110500,102.0,99.0
978,2018/08/21,100.0,100.094,100.0,98900,102.0,99.0
979,2018/08/22,100.0,100.637,101.0,78200,102.0,99.0
980,2018/08/23,101.0,101.89,101.0,77800,103.0,100.0
981,2018/08/24,104.0,102.32,101.0,56300,104.0,101.0
982,2018/08/27,106.0,107.169,104.0,279700,109.0,104.0
983,2018/08/28,105.0,106.31,107.0,147000,108.0,105.0
984,2018/08/29,107.0,106.484,105.0,52700,108.0,105.0
985,2018/08/30,107.0,106.879,108.0,100500,108.0,106.0
986,2018/08/31,106.0,105.958,105.0,109700,107.0,105.0
987,2018/09/03,102.0,104.216,107.0,153600,107.0,102.0
988,2018/09/04,103.0,102.886,102.0,57200,104.0,102.0
989,2018/09/05,103.0,104.782,103.0,77000,107.0,103.0
990,2018/09/06,103.0,102.718,104.0,101400,104.0,102.0
991,2018/09/07,103.0,101.482,102.0,101600,103.0,100.0
992,2018/09/10,102.0,101.927,102.0,68800,103.0,101.0
993,2018/09/11,101.0,101.523,102.0,56400,102.0,101.0
994,2018/09/12,101.0,100.644,101.0,90700,102.0,100.0
995,2018/09/13,101.0,100.51,100.0,75500,101.0,100.0
996,2018/09/14,100.0,100.683,100.0,52400,102.0,100.0
997,2018/09/18,102.0,100.449,100.0,55300,102.0,100.0
998,2018/09/19,104.0,102.531,102.0,93600,104.0,101.0
999,2018/09/20,104.0,102.759,103.0,110200,104.0,102.0
1000,2018/09/21,102.0,102.044,102.0,95000,103.0,102.0
1001,2018/09/25,102.0,101.526,102.0,103100,103.0,100.0
1002,2018/09/26,105.0,105.225,101.0,295100,107.0,101.0
1003,2018/09/27,108.0,106.046,105.0,147300,108.0,104.0
1004,2018/09/28,110.0,111.016,107.0,408700,115.0,106.0
1005,2018/10/01,160.0,142.924,112.0,5193600,160.0,107.0
1006,2018/10/02,128.0,137.903,148.0,7162200,149.0,127.0
1007,2018/10/03,161.0,156.002,133.0,10096600,171.0,133.0
1008,2018/10/04,154.0,155.002,160.0,3060000,166.0,146.0
1009,2018/10/05,148.0,157.852,150.0,5749000,174.0,141.0
1010,2018/10/09,139.0,141.151,147.0,1625200,149.0,134.0
1011,2018/10/10,143.0,149.785,148.0,2134600,160.0,141.0
1012,2018/10/11,142.0,135.284,133.0,769300,142.0,132.0
1013,2018/10/12,141.0,139.585,138.0,461400,143.0,136.0
1014,2018/10/15,139.0,138.402,139.0,287900,142.0,137.0
1015,2018/10/16,128.0,131.057,137.0,868500,137.0,128.0
1016,2018/10/17,135.0,134.761,132.0,829100,141.0,129.0
1017,2018/10/18,134.0,134.894,139.0,420100,139.0,131.0
1018,2018/10/19,137.0,138.752,134.0,1049100,144.0,132.0
1019,2018/10/22,146.0,141.473,138.0,528600,146.0,137.0
1020,2018/10/23,139.0,140.45,145.0,789400,146.0,136.0
1021,2018/10/24,136.0,138.338,139.0,367800,142.0,136.0
1022,2018/10/25,135.0,133.017,133.0,436300,138.0,128.0
1023,2018/10/26,122.0,127.734,136.0,581600,137.0,121.0
1024,2018/10/29,118.0,121.853,126.0,440500,127.0,118.0
1025,2018/10/30,119.0,118.771,114.0,418100,125.0,114.0
1026,2018/10/31,123.0,122.433,119.0,226100,126.0,119.0
1027,2018/11/01,123.0,124.538,125.0,99100,128.0,122.0
1028,2018/11/02,128.0,131.302,127.0,784800,139.0,126.0
1029,2018/11/05,129.0,127.086,126.0,137500,130.0,124.0
1030,2018/11/06,124.0,126.925,130.0,131200,130.0,124.0
1031,2018/11/07,125.0,126.289,126.0,148200,128.0,125.0
1032,2018/11/08,128.0,128.541,129.0,194300,131.0,126.0
1033,2018/11/09,127.0,128.049,128.0,90800,129.0,127.0
1034,2018/11/12,128.0,126.898,126.0,87400,128.0,125.0
1035,2018/11/13,125.0,125.601,125.0,135600,128.0,124.0
1036,2018/11/14,125.0,125.342,126.0,130600,128.0,124.0
1037,2018/11/15,119.0,119.357,120.0,242300,121.0,117.0
1038,2018/11/16,118.0,119.235,120.0,71400,121.0,118.0
1039,2018/11/19,120.0,118.818,117.0,125200,121.0,117.0
1040,2018/11/20,125.0,128.064,119.0,589100,133.0,119.0
1041,2018/11/21,127.0,130.82,127.0,720800,138.0,126.0
1042,2018/11/22,139.0,138.056,129.0,865400,142.0,129.0
1043,2018/11/26,137.0,136.886,140.0,293500,141.0,134.0
1044,2018/11/27,134.0,136.057,139.0,134600,139.0,134.0
1045,2018/11/28,134.0,134.878,134.0,125900,136.0,133.0
1046,2018/11/29,133.0,135.009,136.0,88500,137.0,133.0
1047,2018/11/30,133.0,134.218,132.0,379600,138.0,131.0
1048,2018/12/03,137.0,135.591,135.0,180100,137.0,133.0
1049,2018/12/04,138.0,137.651,137.0,123900,139.0,136.0
1050,2018/12/05,143.0,139.377,137.0,307100,143.0,136.0
1051,2018/12/06,133.0,134.229,142.0,388200,143.0,128.0
1052,2018/12/07,132.0,132.872,131.0,132000,135.0,131.0
1053,2018/12/10,125.0,127.984,132.0,198800,132.0,125.0
1054,2018/12/11,121.0,123.775,124.0,170400,127.0,121.0
1055,2018/12/12,124.0,123.05,121.0,99700,126.0,121.0
1056,2018/12/13,125.0,140.389,148.0,3337100,150.0,125.0
1057,2018/12/14,121.0,123.395,125.0,683900,130.0,120.0
1058,2018/12/17,117.0,117.707,121.0,480300,123.0,115.0
1059,2018/12/18,108.0,111.173,112.0,401800,115.0,108.0
1060,2018/12/19,111.0,108.361,107.0,261300,112.0,106.0
1061,2018/12/20,101.0,104.29,107.0,347500,109.0,101.0
1062,2018/12/21,100.0,98.776,100.0,417400,102.0,96.0
1063,2018/12/25,89.0,90.942,90.0,715200,94.0,88.0
1064,2018/12/26,95.0,95.794,93.0,445000,100.0,93.0
1065,2018/12/27,105.0,101.685,104.0,233700,105.0,98.0
1066,2018/12/28,105.0,103.605,101.0,174300,106.0,101.0
1067,2019/01/04,103.0,102.046,101.0,111300,104.0,100.0
1068,2019/01/07,106.0,106.477,105.0,108500,109.0,105.0
1069,2019/01/08,107.0,107.658,108.0,79600,109.0,107.0
1070,2019/01/09,103.0,105.44,106.0,98000,107.0,103.0
1071,2019/01/10,99.0,101.37,104.0,80100,104.0,99.0
1072,2019/01/11,100.0,101.134,101.0,86800,103.0,100.0
1073,2019/01/15,101.0,100.121,100.0,187800,102.0,98.0
1074,2019/01/16,100.0,101.65,102.0,202400,104.0,100.0
1075,2019/01/17,103.0,103.791,102.0,161200,106.0,102.0
1076,2019/01/18,104.0,108.866,107.0,1057200,117.0,104.0
1077,2019/01/21,106.0,105.237,105.0,118300,107.0,104.0
1078,2019/01/22,106.0,104.395,106.0,225700,106.0,102.0
1079,2019/01/23,104.0,104.644,106.0,94900,106.0,103.0
1080,2019/01/24,104.0,104.656,104.0,62200,106.0,104.0
1081,2019/01/25,106.0,104.591,104.0,128500,107.0,103.0
1082,2019/01/28,103.0,103.817,106.0,145200,106.0,102.0
1083,2019/01/29,102.0,102.388,102.0,72000,103.0,101.0
1084,2019/01/30,99.0,100.111,103.0,141100,103.0,99.0
1085,2019/01/31,101.0,100.706,100.0,62300,102.0,100.0
1086,2019/02/01,100.0,100.942,102.0,39700,102.0,100.0
1087,2019/02/04,101.0,100.568,100.0,81000,101.0,100.0
1088,2019/02/05,99.0,100.349,100.0,127700,103.0,99.0
1089,2019/02/06,101.0,100.748,100.0,89600,102.0,100.0
1090,2019/02/07,100.0,99.229,101.0,164500,101.0,98.0
1091,2019/02/08,101.0,99.584,100.0,157800,101.0,98.0
1092,2019/02/12,102.0,100.8,100.0,95100,102.0,99.0
1093,2019/02/13,104.0,104.258,103.0,229800,107.0,102.0
1094,2019/02/14,104.0,107.764,113.0,773000,113.0,104.0
1095,2019/02/15,104.0,103.9,103.0,149900,106.0,102.0
1096,2019/02/18,104.0,105.27,106.0,103000,106.0,104.0
1097,2019/02/19,108.0,108.254,105.0,343600,112.0,105.0
1098,2019/02/20,110.0,108.57,108.0,143800,110.0,107.0
1099,2019/02/21,110.0,111.598,110.0,411100,114.0,108.0
1100,2019/02/22,111.0,110.039,112.0,171300,112.0,109.0
1101,2019/02/25,111.0,111.457,111.0,257500,114.0,110.0
1102,2019/02/26,114.0,115.054,113.0,377800,119.0,111.0
1103,2019/02/27,116.0,115.058,113.0,118400,117.0,113.0
1104,2019/02/28,114.0,115.987,116.0,99700,118.0,114.0
1105,2019/03/01,114.0,112.264,114.0,144300,114.0,111.0
1106,2019/03/04,113.0,113.112,114.0,111400,115.0,111.0
1107,2019/03/05,110.0,110.752,111.0,175000,112.0,109.0
1108,2019/03/06,112.0,111.498,111.0,59000,112.0,110.0
1109,2019/03/07,111.0,112.12,111.0,95700,114.0,110.0
1110,2019/03/08,107.0,108.229,110.0,96400,110.0,107.0
1111,2019/03/11,106.0,106.544,107.0,117000,108.0,105.0
1112,2019/03/12,106.0,107.469,106.0,57800,109.0,106.0
1113,2019/03/13,107.0,106.263,107.0,100200,108.0,105.0
1114,2019/03/14,106.0,106.744,106.0,38700,108.0,106.0
1115,2019/03/15,108.0,107.668,105.0,112600,110.0,105.0
1116,2019/03/18,106.0,106.811,106.0,99800,109.0,106.0
1117,2019/03/19,105.0,106.404,108.0,47000,108.0,105.0
1118,2019/03/20,102.0,103.867,105.0,149800,106.0,102.0
1119,2019/03/22,101.0,101.731,103.0,142100,103.0,101.0
1120,2019/03/25,105.0,106.871,106.0,518300,113.0,103.0
1121,2019/03/26,103.0,104.003,106.0,125200,106.0,103.0
1122,2019/03/27,103.0,103.706,103.0,464200,107.0,102.0
1123,2019/03/28,115.0,128.733,125.0,4490100,141.0,115.0
1124,2019/03/29,115.0,113.615,117.0,558300,118.0,111.0
1125,2019/04/01,114.0,114.496,114.0,152000,116.0,113.0
1126,2019/04/02,111.0,110.837,114.0,189500,114.0,109.0
1127,2019/04/03,109.0,108.833,108.0,223400,111.0,108.0
1128,2019/04/04,109.0,108.984,110.0,116400,110.0,108.0
1129,2019/04/05,113.0,112.248,110.0,174300,114.0,109.0
1130,2019/04/08,114.0,116.421,118.0,356200,121.0,113.0
1131,2019/04/09,113.0,113.206,113.0,97200,115.0,112.0
1132,2019/04/10,112.0,111.914,113.0,43100,113.0,111.0
1133,2019/04/11,110.0,110.625,112.0,54900,112.0,110.0
1134,2019/04/12,109.0,109.678,110.0,51000,110.0,109.0
1135,2019/04/15,110.0,110.446,110.0,61200,112.0,110.0
1136,2019/04/16,108.0,109.152,110.0,112500,110.0,108.0
1137,2019/04/17,108.0,106.898,109.0,192600,109.0,105.0
1138,2019/04/18,107.0,106.687,108.0,70200,108.0,106.0
1139,2019/04/19,107.0,107.129,106.0,31100,108.0,106.0
1140,2019/04/22,106.0,106.815,107.0,36300,108.0,106.0
1141,2019/04/23,105.0,105.774,106.0,32700,107.0,105.0
1142,2019/04/24,105.0,105.754,105.0,47500,108.0,105.0
1143,2019/04/25,105.0,105.987,106.0,31500,107.0,105.0
1144,2019/04/26,106.0,106.157,105.0,31300,107.0,105.0
1145,2019/05/07,106.0,106.83,107.0,123800,109.0,105.0
1146,2019/05/08,108.0,106.667,106.0,126600,108.0,105.0
1147,2019/05/09,107.0,105.965,107.0,37500,107.0,105.0
1148,2019/05/10,107.0,106.379,106.0,26100,107.0,106.0
1149,2019/05/13,108.0,107.854,107.0,59600,109.0,106.0
1150,2019/05/14,107.0,106.425,107.0,35500,107.0,106.0
1151,2019/05/15,108.0,106.042,107.0,79100,108.0,105.0
1152,2019/05/16,106.0,106.79,107.0,61500,108.0,106.0
1153,2019/05/17,112.0,109.766,107.0,194700,112.0,107.0
1154,2019/05/20,107.0,113.144,116.0,796400,120.0,107.0
1155,2019/05/21,106.0,106.546,108.0,89700,108.0,106.0
1156,2019/05/22,108.0,107.873,107.0,47400,109.0,107.0
1157,2019/05/23,109.0,107.225,107.0,310400,111.0,104.0
1158,2019/05/24,108.0,107.829,109.0,97500,109.0,107.0
1159,2019/05/27,107.0,107.668,108.0,28900,108.0,107.0
1160,2019/05/28,107.0,107.94,107.0,66300,110.0,107.0
1161,2019/05/29,108.0,107.276,108.0,25700,108.0,106.0
1162,2019/05/30,106.0,106.91,108.0,27900,108.0,106.0
1163,2019/05/31,107.0,106.888,107.0,19600,107.0,106.0
1164,2019/06/03,103.0,104.177,105.0,107400,106.0,103.0
1165,2019/06/04,104.0,103.035,104.0,60800,104.0,102.0
1166,2019/06/05,103.0,103.696,106.0,71600,106.0,102.0
1167,2019/06/06,103.0,103.65,104.0,70300,105.0,102.0
1168,2019/06/07,103.0,103.504,104.0,70300,105.0,103.0
1169,2019/06/10,104.0,104.272,104.0,64300,106.0,103.0
1170,2019/06/11,104.0,104.365,105.0,68200,105.0,103.0
1171,2019/06/12,105.0,116.809,105.0,2931300,133.0,103.0
1172,2019/06/13,115.0,111.059,107.0,892900,116.0,106.0
1173,2019/06/14,115.0,112.796,114.0,297700,115.0,111.0
1174,2019/06/17,117.0,122.835,115.0,2109400,130.0,112.0
1175,2019/06/18,112.0,115.228,119.0,330900,119.0,112.0
1176,2019/06/19,110.0,110.289,113.0,241600,113.0,109.0
1177,2019/06/20,110.0,110.649,111.0,162000,112.0,109.0
1178,2019/06/21,113.0,111.11,111.0,120600,113.0,110.0
1179,2019/06/24,118.0,117.312,116.0,486900,122.0,113.0
1180,2019/06/25,125.0,121.474,118.0,389000,125.0,117.0
1181,2019/06/26,135.0,131.339,123.0,954200,137.0,123.0
1182,2019/06/27,130.0,131.061,134.0,441300,135.0,129.0
1183,2019/06/28,124.0,129.818,129.0,1773100,137.0,122.0
1184,2019/07/01,150.0,145.252,131.0,4362600,155.0,128.0
1185,2019/07/02,141.0,144.341,150.0,1188300,151.0,140.0
1186,2019/07/03,139.0,135.503,139.0,1077400,141.0,132.0
1187,2019/07/04,138.0,141.621,144.0,699300,146.0,137.0
1188,2019/07/05,136.0,136.348,135.0,745100,143.0,132.0
1189,2019/07/08,143.0,150.012,137.0,4718200,163.0,132.0
1190,2019/07/09,146.0,143.882,141.0,1102400,149.0,138.0
1191,2019/07/10,147.0,143.778,143.0,354200,147.0,140.0
1192,2019/07/11,152.0,150.867,145.0,778900,154.0,145.0
1193,2019/07/12,138.0,143.995,150.0,944600,151.0,138.0
1194,2019/07/16,139.0,139.124,136.0,215600,142.0,136.0
1195,2019/07/17,134.0,133.811,137.0,497500,140.0,130.0
1196,2019/07/18,130.0,129.075,132.0,361800,133.0,127.0
1197,2019/07/19,132.0,133.673,130.0,167100,135.0,130.0
1198,2019/07/22,132.0,137.494,131.0,1100600,146.0,131.0
1199,2019/07/23,133.0,133.179,133.0,415200,136.0,131.0
1200,2019/07/24,134.0,133.486,135.0,155900,135.0,132.0
1201,2019/07/25,135.0,132.708,134.0,173100,135.0,131.0
1202,2019/07/26,136.0,134.681,135.0,118600,136.0,133.0
1203,2019/07/29,132.0,133.536,135.0,104500,135.0,132.0
1204,2019/07/30,132.0,132.044,132.0,96300,133.0,132.0
1205,2019/07/31,132.0,132.396,133.0,39100,133.0,131.0
1206,2019/08/01,132.0,132.464,131.0,57100,134.0,131.0
1207,2019/08/02,136.0,137.64,132.0,633100,142.0,132.0
1208,2019/08/05,131.0,133.13,137.0,261900,137.0,131.0
1209,2019/08/06,132.0,126.517,124.0,247600,133.0,123.0
1210,2019/08/07,134.0,133.627,132.0,159100,136.0,132.0
1211,2019/08/08,132.0,134.045,135.0,88900,135.0,132.0
1212,2019/08/09,133.0,135.413,132.0,137100,139.0,131.0
1213,2019/08/13,134.0,135.016,134.0,82400,136.0,134.0
1214,2019/08/14,138.0,136.942,136.0,106200,139.0,135.0
1215,2019/08/15,131.0,132.089,133.0,205200,134.0,130.0
1216,2019/08/16,129.0,130.703,131.0,236400,135.0,128.0
1217,2019/08/19,130.0,135.73,129.0,1250600,142.0,128.0
1218,2019/08/20,128.0,129.268,131.0,179600,131.0,128.0
1219,2019/08/21,129.0,128.986,130.0,96400,130.0,128.0
1220,2019/08/22,128.0,128.145,130.0,122200,130.0,127.0
1221,2019/08/23,129.0,127.434,128.0,113100,129.0,126.0
