,DateTime,Open,High,Low,Close,VWAP,Trades,Volume,DS
0,2019/11/19 9:00:00,8200.0,8270.0,8200.0,8230.0,8214.569,22,11600.0,2019-11-19 09:00:00
1,2019/11/19 9:01:00,8190.0,8200.0,8180.0,8200.0,8193.333,7,1200.0,2019-11-19 09:01:00
2,2019/11/19 9:02:00,8210.0,8210.0,8200.0,8200.0,8206.25,4,800.0,2019-11-19 09:02:00
3,2019/11/19 9:03:00,8200.0,8230.0,8190.0,8230.0,8208.333,5,600.0,2019-11-19 09:03:00
4,2019/11/19 9:04:00,8230.0,8280.0,8220.0,8280.0,8252.381,15,4200.0,2019-11-19 09:04:00
5,2019/11/19 9:05:00,8270.0,8280.0,8270.0,8270.0,8272.0,5,500.0,2019-11-19 09:05:00
6,2019/11/19 9:06:00,8270.0,8280.0,8270.0,8280.0,8273.333,5,900.0,2019-11-19 09:06:00
7,2019/11/19 9:07:00,8270.0,8280.0,8230.0,8240.0,8252.5,8,1200.0,2019-11-19 09:07:00
8,2019/11/19 9:08:00,8220.0,8220.0,8190.0,8200.0,8205.0,10,1000.0,2019-11-19 09:08:00
9,2019/11/19 9:09:00,8220.0,8230.0,8190.0,8200.0,8205.714,7,1400.0,2019-11-19 09:09:00
10,2019/11/19 9:10:00,8200.0,8210.0,8200.0,8210.0,8206.667,2,300.0,2019-11-19 09:10:00
11,2019/11/19 9:11:00,8220.0,8230.0,8220.0,8230.0,8225.0,4,400.0,2019-11-19 09:11:00
12,2019/11/19 9:12:00,8240.0,8270.0,8240.0,8260.0,8262.083,15,2400.0,2019-11-19 09:12:00
13,2019/11/19 9:13:00,8250.0,8250.0,8240.0,8240.0,8248.571,4,700.0,2019-11-19 09:13:00
14,2019/11/19 9:14:00,8230.0,8230.0,8220.0,8220.0,8224.0,3,500.0,2019-11-19 09:14:00
15,2019/11/19 9:15:00,8220.0,8220.0,8210.0,8210.0,8215.0,3,400.0,2019-11-19 09:15:00
16,2019/11/19 9:16:00,8220.0,8220.0,8210.0,8210.0,8216.667,3,300.0,2019-11-19 09:16:00
17,2019/11/19 9:17:00,8190.0,8200.0,8170.0,8200.0,8183.448,11,2900.0,2019-11-19 09:17:00
18,2019/11/19 9:18:00,8180.0,8200.0,8180.0,8190.0,8196.923,7,1300.0,2019-11-19 09:18:00
19,2019/11/19 9:19:00,8200.0,8200.0,8200.0,8200.0,8200.0,2,200.0,2019-11-19 09:19:00
20,2019/11/19 9:20:00,8200.0,8200.0,8200.0,8200.0,8200.0,5,500.0,2019-11-19 09:20:00
21,2019/11/19 9:22:00,8210.0,8210.0,8210.0,8210.0,8210.0,1,400.0,2019-11-19 09:22:00
22,2019/11/19 9:23:00,8210.0,8210.0,8210.0,8210.0,8210.0,1,200.0,2019-11-19 09:23:00
23,2019/11/19 9:24:00,8210.0,8210.0,8210.0,8210.0,8210.0,1,100.0,2019-11-19 09:24:00
24,2019/11/19 9:25:00,8210.0,8220.0,8210.0,8220.0,8218.108,12,3700.0,2019-11-19 09:25:00
25,2019/11/19 9:26:00,8230.0,8230.0,8230.0,8230.0,8230.0,6,800.0,2019-11-19 09:26:00
26,2019/11/19 9:27:00,8240.0,8240.0,8220.0,8220.0,8230.0,3,700.0,2019-11-19 09:27:00
27,2019/11/19 9:28:00,8220.0,8230.0,8220.0,8230.0,8223.333,2,300.0,2019-11-19 09:28:00
28,2019/11/19 9:30:00,8210.0,8220.0,8190.0,8190.0,8197.241,14,2900.0,2019-11-19 09:30:00
29,2019/11/19 9:31:00,8190.0,8200.0,8180.0,8200.0,8193.889,10,1800.0,2019-11-19 09:31:00
30,2019/11/19 9:32:00,8200.0,8220.0,8200.0,8220.0,8208.0,6,1000.0,2019-11-19 09:32:00
31,2019/11/19 9:33:00,8220.0,8220.0,8220.0,8220.0,8220.0,2,200.0,2019-11-19 09:33:00
32,2019/11/19 9:35:00,8220.0,8220.0,8220.0,8220.0,8220.0,1,100.0,2019-11-19 09:35:00
33,2019/11/19 9:38:00,8210.0,8210.0,8210.0,8210.0,8210.0,1,200.0,2019-11-19 09:38:00
34,2019/11/19 9:39:00,8210.0,8210.0,8210.0,8210.0,8210.0,1,100.0,2019-11-19 09:39:00
35,2019/11/19 9:42:00,8230.0,8240.0,8230.0,8240.0,8233.333,3,300.0,2019-11-19 09:42:00
36,2019/11/19 9:43:00,8250.0,8250.0,8240.0,8240.0,8245.714,5,700.0,2019-11-19 09:43:00
37,2019/11/19 9:46:00,8230.0,8230.0,8200.0,8200.0,8222.0,4,1000.0,2019-11-19 09:46:00
38,2019/11/19 9:47:00,8200.0,8200.0,8200.0,8200.0,8200.0,5,800.0,2019-11-19 09:47:00
39,2019/11/19 9:49:00,8210.0,8210.0,8210.0,8210.0,8210.0,1,100.0,2019-11-19 09:49:00
40,2019/11/19 9:51:00,8210.0,8210.0,8210.0,8210.0,8210.0,1,100.0,2019-11-19 09:51:00
41,2019/11/19 9:52:00,8210.0,8220.0,8210.0,8210.0,8213.333,4,600.0,2019-11-19 09:52:00
42,2019/11/19 9:53:00,8230.0,8250.0,8230.0,8250.0,8244.444,4,900.0,2019-11-19 09:53:00
43,2019/11/19 9:54:00,8260.0,8260.0,8260.0,8260.0,8260.0,2,300.0,2019-11-19 09:54:00
44,2019/11/19 9:55:00,8270.0,8270.0,8270.0,8270.0,8270.0,5,700.0,2019-11-19 09:55:00
45,2019/11/19 9:57:00,8260.0,8270.0,8260.0,8270.0,8261.667,3,600.0,2019-11-19 09:57:00
46,2019/11/19 9:58:00,8260.0,8260.0,8240.0,8240.0,8253.333,4,900.0,2019-11-19 09:58:00
47,2019/11/19 9:59:00,8240.0,8240.0,8240.0,8240.0,8240.0,3,500.0,2019-11-19 09:59:00
48,2019/11/19 10:01:00,8250.0,8250.0,8250.0,8250.0,8250.0,1,300.0,2019-11-19 10:01:00
49,2019/11/19 10:02:00,8250.0,8250.0,8250.0,8250.0,8250.0,1,100.0,2019-11-19 10:02:00
50,2019/11/19 10:03:00,8260.0,8280.0,8260.0,8270.0,8276.667,9,4200.0,2019-11-19 10:03:00
51,2019/11/19 10:05:00,8260.0,8260.0,8240.0,8240.0,8250.0,6,1300.0,2019-11-19 10:05:00
52,2019/11/19 10:06:00,8220.0,8220.0,8220.0,8220.0,8220.0,2,200.0,2019-11-19 10:06:00
53,2019/11/19 10:07:00,8220.0,8220.0,8210.0,8210.0,8215.556,11,1800.0,2019-11-19 10:07:00
54,2019/11/19 10:08:00,8220.0,8220.0,8220.0,8220.0,8220.0,3,600.0,2019-11-19 10:08:00
55,2019/11/19 10:09:00,8230.0,8240.0,8230.0,8240.0,8235.714,3,700.0,2019-11-19 10:09:00
56,2019/11/19 10:11:00,8260.0,8260.0,8260.0,8260.0,8260.0,2,200.0,2019-11-19 10:11:00
57,2019/11/19 10:12:00,8250.0,8270.0,8250.0,8270.0,8263.333,3,300.0,2019-11-19 10:12:00
58,2019/11/19 10:13:00,8270.0,8270.0,8270.0,8270.0,8270.0,2,200.0,2019-11-19 10:13:00
59,2019/11/19 10:14:00,8280.0,8280.0,8280.0,8280.0,8280.0,2,200.0,2019-11-19 10:14:00
60,2019/11/19 10:15:00,8280.0,8280.0,8260.0,8260.0,8268.75,3,800.0,2019-11-19 10:15:00
61,2019/11/19 10:17:00,8260.0,8260.0,8260.0,8260.0,8260.0,2,200.0,2019-11-19 10:17:00
62,2019/11/19 10:18:00,8260.0,8260.0,8250.0,8250.0,8255.0,2,200.0,2019-11-19 10:18:00
63,2019/11/19 10:20:00,8270.0,8280.0,8270.0,8280.0,8276.25,6,800.0,2019-11-19 10:20:00
64,2019/11/19 10:21:00,8280.0,8280.0,8270.0,8280.0,8276.667,3,300.0,2019-11-19 10:21:00
65,2019/11/19 10:23:00,8270.0,8270.0,8260.0,8260.0,8268.333,3,600.0,2019-11-19 10:23:00
66,2019/11/19 10:24:00,8280.0,8280.0,8280.0,8280.0,8280.0,3,400.0,2019-11-19 10:24:00
67,2019/11/19 10:25:00,8280.0,8290.0,8280.0,8290.0,8289.333,8,3000.0,2019-11-19 10:25:00
68,2019/11/19 10:26:00,8290.0,8300.0,8290.0,8300.0,8296.0,2,500.0,2019-11-19 10:26:00
69,2019/11/19 10:27:00,8300.0,8310.0,8300.0,8310.0,8304.828,8,2900.0,2019-11-19 10:27:00
70,2019/11/19 10:28:00,8320.0,8320.0,8310.0,8310.0,8319.167,8,1200.0,2019-11-19 10:28:00
71,2019/11/19 10:30:00,8320.0,8330.0,8320.0,8330.0,8328.333,4,600.0,2019-11-19 10:30:00
72,2019/11/19 10:31:00,8340.0,8350.0,8310.0,8310.0,8329.688,9,3200.0,2019-11-19 10:31:00
73,2019/11/19 10:32:00,8300.0,8300.0,8290.0,8290.0,8292.353,7,1700.0,2019-11-19 10:32:00
74,2019/11/19 10:33:00,8290.0,8300.0,8290.0,8300.0,8295.0,4,400.0,2019-11-19 10:33:00
75,2019/11/19 10:35:00,8300.0,8300.0,8300.0,8300.0,8300.0,1,100.0,2019-11-19 10:35:00
76,2019/11/19 10:36:00,8290.0,8290.0,8270.0,8270.0,8280.625,6,1600.0,2019-11-19 10:36:00
77,2019/11/19 10:37:00,8260.0,8270.0,8260.0,8270.0,8262.0,3,500.0,2019-11-19 10:37:00
78,2019/11/19 10:38:00,8270.0,8270.0,8270.0,8270.0,8270.0,1,100.0,2019-11-19 10:38:00
79,2019/11/19 10:40:00,8280.0,8280.0,8280.0,8280.0,8280.0,1,100.0,2019-11-19 10:40:00
80,2019/11/19 10:43:00,8290.0,8310.0,8290.0,8310.0,8300.476,8,2100.0,2019-11-19 10:43:00
81,2019/11/19 10:44:00,8320.0,8320.0,8320.0,8320.0,8320.0,3,500.0,2019-11-19 10:44:00
82,2019/11/19 10:45:00,8320.0,8320.0,8320.0,8320.0,8320.0,2,200.0,2019-11-19 10:45:00
83,2019/11/19 10:46:00,8310.0,8310.0,8310.0,8310.0,8310.0,1,400.0,2019-11-19 10:46:00
84,2019/11/19 10:47:00,8320.0,8320.0,8290.0,8290.0,8300.588,6,1700.0,2019-11-19 10:47:00
85,2019/11/19 10:51:00,8300.0,8300.0,8290.0,8290.0,8292.0,4,500.0,2019-11-19 10:51:00
86,2019/11/19 10:53:00,8290.0,8290.0,8290.0,8290.0,8290.0,1,200.0,2019-11-19 10:53:00
87,2019/11/19 10:54:00,8300.0,8300.0,8300.0,8300.0,8300.0,1,400.0,2019-11-19 10:54:00
88,2019/11/19 10:55:00,8290.0,8290.0,8290.0,8290.0,8290.0,1,400.0,2019-11-19 10:55:00
89,2019/11/19 10:58:00,8300.0,8300.0,8300.0,8300.0,8300.0,1,100.0,2019-11-19 10:58:00
90,2019/11/19 10:59:00,8290.0,8290.0,8290.0,8290.0,8290.0,1,100.0,2019-11-19 10:59:00
91,2019/11/19 11:00:00,8300.0,8310.0,8300.0,8310.0,8308.75,7,800.0,2019-11-19 11:00:00
92,2019/11/19 11:02:00,8290.0,8290.0,8290.0,8290.0,8290.0,2,200.0,2019-11-19 11:02:00
93,2019/11/19 11:07:00,8300.0,8300.0,8300.0,8300.0,8300.0,1,200.0,2019-11-19 11:07:00
94,2019/11/19 11:09:00,8310.0,8320.0,8310.0,8320.0,8312.0,4,500.0,2019-11-19 11:09:00
95,2019/11/19 11:10:00,8320.0,8320.0,8320.0,8320.0,8320.0,2,300.0,2019-11-19 11:10:00
96,2019/11/19 11:11:00,8320.0,8320.0,8320.0,8320.0,8320.0,3,400.0,2019-11-19 11:11:00
97,2019/11/19 11:12:00,8320.0,8320.0,8320.0,8320.0,8320.0,1,100.0,2019-11-19 11:12:00
98,2019/11/19 11:14:00,8320.0,8320.0,8310.0,8310.0,8310.909,5,1100.0,2019-11-19 11:14:00
99,2019/11/19 11:15:00,8290.0,8290.0,8270.0,8270.0,8285.714,5,700.0,2019-11-19 11:15:00
100,2019/11/19 11:16:00,8270.0,8270.0,8270.0,8270.0,8270.0,2,300.0,2019-11-19 11:16:00
101,2019/11/19 11:17:00,8270.0,8270.0,8270.0,8270.0,8270.0,2,500.0,2019-11-19 11:17:00
102,2019/11/19 11:19:00,8280.0,8280.0,8280.0,8280.0,8280.0,1,100.0,2019-11-19 11:19:00
103,2019/11/19 11:20:00,8280.0,8280.0,8280.0,8280.0,8280.0,1,200.0,2019-11-19 11:20:00
104,2019/11/19 11:21:00,8290.0,8290.0,8290.0,8290.0,8290.0,1,100.0,2019-11-19 11:21:00
105,2019/11/19 11:22:00,8290.0,8290.0,8280.0,8280.0,8282.5,3,400.0,2019-11-19 11:22:00
106,2019/11/19 11:25:00,8270.0,8270.0,8270.0,8270.0,8270.0,1,100.0,2019-11-19 11:25:00
107,2019/11/19 11:26:00,8280.0,8280.0,8280.0,8280.0,8280.0,1,100.0,2019-11-19 11:26:00
108,2019/11/19 11:27:00,8280.0,8280.0,8280.0,8280.0,8280.0,1,100.0,2019-11-19 11:27:00
109,2019/11/19 11:28:00,8290.0,8290.0,8290.0,8290.0,8290.0,2,200.0,2019-11-19 11:28:00
110,2019/11/19 11:29:00,8280.0,8300.0,8280.0,8300.0,8290.0,2,200.0,2019-11-19 11:29:00
111,2019/11/19 11:30:00,8300.0,8300.0,8300.0,8300.0,8300.0,1,100.0,2019-11-19 11:30:00
112,2019/11/19 12:30:00,8330.0,8330.0,8290.0,8300.0,8311.842,11,3800.0,2019-11-19 12:30:00
113,2019/11/19 12:31:00,8300.0,8310.0,8300.0,8310.0,8308.0,4,500.0,2019-11-19 12:31:00
114,2019/11/19 12:34:00,8320.0,8330.0,8320.0,8330.0,8323.333,3,300.0,2019-11-19 12:34:00
115,2019/11/19 12:35:00,8320.0,8320.0,8320.0,8320.0,8320.0,1,100.0,2019-11-19 12:35:00
116,2019/11/19 12:36:00,8320.0,8360.0,8320.0,8360.0,8337.105,6,3800.0,2019-11-19 12:36:00
117,2019/11/19 12:37:00,8360.0,8360.0,8360.0,8360.0,8360.0,1,100.0,2019-11-19 12:37:00
118,2019/11/19 12:38:00,8360.0,8370.0,8360.0,8370.0,8363.878,15,4900.0,2019-11-19 12:38:00
119,2019/11/19 12:39:00,8360.0,8360.0,8360.0,8360.0,8360.0,1,100.0,2019-11-19 12:39:00
120,2019/11/19 12:40:00,8360.0,8360.0,8360.0,8360.0,8360.0,1,100.0,2019-11-19 12:40:00
121,2019/11/19 12:41:00,8360.0,8390.0,8360.0,8390.0,8374.167,6,2400.0,2019-11-19 12:41:00
122,2019/11/19 12:42:00,8390.0,8400.0,8350.0,8350.0,8372.258,11,3100.0,2019-11-19 12:42:00
123,2019/11/19 12:44:00,8370.0,8390.0,8370.0,8390.0,8380.0,6,900.0,2019-11-19 12:44:00
124,2019/11/19 12:45:00,8390.0,8390.0,8390.0,8390.0,8390.0,1,100.0,2019-11-19 12:45:00
125,2019/11/19 12:47:00,8390.0,8390.0,8390.0,8390.0,8390.0,2,400.0,2019-11-19 12:47:00
126,2019/11/19 12:49:00,8380.0,8380.0,8370.0,8370.0,8376.667,2,300.0,2019-11-19 12:49:00
127,2019/11/19 12:50:00,8380.0,8380.0,8370.0,8370.0,8372.5,4,400.0,2019-11-19 12:50:00
128,2019/11/19 12:51:00,8360.0,8370.0,8360.0,8370.0,8365.0,2,200.0,2019-11-19 12:51:00
129,2019/11/19 12:52:00,8360.0,8360.0,8360.0,8360.0,8360.0,2,200.0,2019-11-19 12:52:00
130,2019/11/19 12:56:00,8370.0,8370.0,8370.0,8370.0,8370.0,3,400.0,2019-11-19 12:56:00
131,2019/11/19 12:57:00,8370.0,8370.0,8360.0,8360.0,8366.0,2,500.0,2019-11-19 12:57:00
132,2019/11/19 12:58:00,8350.0,8350.0,8350.0,8350.0,8350.0,1,300.0,2019-11-19 12:58:00
133,2019/11/19 12:59:00,8340.0,8340.0,8340.0,8340.0,8340.0,5,600.0,2019-11-19 12:59:00
134,2019/11/19 13:01:00,8340.0,8340.0,8340.0,8340.0,8340.0,1,400.0,2019-11-19 13:01:00
135,2019/11/19 13:02:00,8340.0,8340.0,8340.0,8340.0,8340.0,1,100.0,2019-11-19 13:02:00
136,2019/11/19 13:05:00,8340.0,8340.0,8330.0,8330.0,8336.0,2,500.0,2019-11-19 13:05:00
137,2019/11/19 13:07:00,8330.0,8330.0,8330.0,8330.0,8330.0,2,200.0,2019-11-19 13:07:00
138,2019/11/19 13:12:00,8330.0,8330.0,8320.0,8320.0,8320.833,8,1200.0,2019-11-19 13:12:00
139,2019/11/19 13:13:00,8330.0,8330.0,8330.0,8330.0,8330.0,1,600.0,2019-11-19 13:13:00
140,2019/11/19 13:14:00,8340.0,8340.0,8340.0,8340.0,8340.0,1,100.0,2019-11-19 13:14:00
141,2019/11/19 13:16:00,8330.0,8330.0,8330.0,8330.0,8330.0,1,100.0,2019-11-19 13:16:00
142,2019/11/19 13:19:00,8340.0,8340.0,8330.0,8330.0,8333.333,3,300.0,2019-11-19 13:19:00
143,2019/11/19 13:23:00,8330.0,8330.0,8320.0,8320.0,8326.667,2,300.0,2019-11-19 13:23:00
144,2019/11/19 13:24:00,8330.0,8330.0,8310.0,8310.0,8316.667,9,2400.0,2019-11-19 13:24:00
145,2019/11/19 13:25:00,8310.0,8310.0,8300.0,8300.0,8306.667,6,1200.0,2019-11-19 13:25:00
146,2019/11/19 13:28:00,8310.0,8310.0,8310.0,8310.0,8310.0,1,400.0,2019-11-19 13:28:00
147,2019/11/19 13:29:00,8310.0,8320.0,8310.0,8320.0,8315.0,2,200.0,2019-11-19 13:29:00
148,2019/11/19 13:30:00,8320.0,8320.0,8320.0,8320.0,8320.0,1,100.0,2019-11-19 13:30:00
149,2019/11/19 13:31:00,8320.0,8320.0,8320.0,8320.0,8320.0,1,100.0,2019-11-19 13:31:00
150,2019/11/19 13:32:00,8320.0,8320.0,8320.0,8320.0,8320.0,1,100.0,2019-11-19 13:32:00
151,2019/11/19 13:33:00,8320.0,8320.0,8320.0,8320.0,8320.0,1,200.0,2019-11-19 13:33:00
152,2019/11/19 13:34:00,8340.0,8340.0,8330.0,8340.0,8338.0,3,500.0,2019-11-19 13:34:00
153,2019/11/19 13:36:00,8330.0,8330.0,8330.0,8330.0,8330.0,1,100.0,2019-11-19 13:36:00
154,2019/11/19 13:40:00,8330.0,8340.0,8330.0,8340.0,8335.0,2,200.0,2019-11-19 13:40:00
155,2019/11/19 13:43:00,8340.0,8340.0,8340.0,8340.0,8340.0,1,100.0,2019-11-19 13:43:00
156,2019/11/19 13:44:00,8350.0,8350.0,8340.0,8340.0,8345.0,2,200.0,2019-11-19 13:44:00
157,2019/11/19 13:45:00,8340.0,8340.0,8340.0,8340.0,8340.0,2,300.0,2019-11-19 13:45:00
158,2019/11/19 13:47:00,8330.0,8340.0,8330.0,8340.0,8337.5,3,400.0,2019-11-19 13:47:00
159,2019/11/19 13:49:00,8340.0,8340.0,8340.0,8340.0,8340.0,1,200.0,2019-11-19 13:49:00
160,2019/11/19 13:50:00,8340.0,8340.0,8340.0,8340.0,8340.0,4,400.0,2019-11-19 13:50:00
161,2019/11/19 13:52:00,8340.0,8340.0,8340.0,8340.0,8340.0,2,200.0,2019-11-19 13:52:00
162,2019/11/19 13:54:00,8330.0,8340.0,8330.0,8340.0,8335.0,2,200.0,2019-11-19 13:54:00
163,2019/11/19 13:55:00,8350.0,8360.0,8340.0,8340.0,8352.0,3,500.0,2019-11-19 13:55:00
164,2019/11/19 13:58:00,8340.0,8340.0,8340.0,8340.0,8340.0,1,100.0,2019-11-19 13:58:00
165,2019/11/19 13:59:00,8350.0,8350.0,8350.0,8350.0,8350.0,1,100.0,2019-11-19 13:59:00
166,2019/11/19 14:00:00,8340.0,8340.0,8340.0,8340.0,8340.0,1,100.0,2019-11-19 14:00:00
167,2019/11/19 14:01:00,8340.0,8340.0,8280.0,8280.0,8309.667,13,3000.0,2019-11-19 14:01:00
168,2019/11/19 14:03:00,8290.0,8290.0,8290.0,8290.0,8290.0,1,100.0,2019-11-19 14:03:00
169,2019/11/19 14:05:00,8280.0,8280.0,8270.0,8270.0,8276.0,6,1000.0,2019-11-19 14:05:00
170,2019/11/19 14:06:00,8260.0,8260.0,8260.0,8260.0,8260.0,3,300.0,2019-11-19 14:06:00
171,2019/11/19 14:07:00,8260.0,8260.0,8260.0,8260.0,8260.0,1,100.0,2019-11-19 14:07:00
172,2019/11/19 14:08:00,8260.0,8260.0,8230.0,8240.0,8250.0,9,1500.0,2019-11-19 14:08:00
173,2019/11/19 14:10:00,8240.0,8240.0,8240.0,8240.0,8240.0,2,400.0,2019-11-19 14:10:00
174,2019/11/19 14:11:00,8250.0,8250.0,8220.0,8220.0,8235.714,5,700.0,2019-11-19 14:11:00
175,2019/11/19 14:13:00,8230.0,8230.0,8230.0,8230.0,8230.0,3,400.0,2019-11-19 14:13:00
176,2019/11/19 14:16:00,8230.0,8230.0,8230.0,8230.0,8230.0,1,100.0,2019-11-19 14:16:00
177,2019/11/19 14:19:00,8240.0,8250.0,8240.0,8240.0,8243.75,4,800.0,2019-11-19 14:19:00
178,2019/11/19 14:22:00,8250.0,8260.0,8250.0,8260.0,8257.5,2,400.0,2019-11-19 14:22:00
179,2019/11/19 14:23:00,8270.0,8270.0,8270.0,8270.0,8270.0,1,100.0,2019-11-19 14:23:00
180,2019/11/19 14:25:00,8280.0,8280.0,8260.0,8260.0,8274.0,6,1000.0,2019-11-19 14:25:00
181,2019/11/19 14:27:00,8250.0,8250.0,8250.0,8250.0,8250.0,7,1500.0,2019-11-19 14:27:00
182,2019/11/19 14:28:00,8250.0,8250.0,8240.0,8250.0,8248.0,5,500.0,2019-11-19 14:28:00
183,2019/11/19 14:29:00,8260.0,8270.0,8260.0,8260.0,8263.333,3,600.0,2019-11-19 14:29:00
184,2019/11/19 14:31:00,8270.0,8280.0,8270.0,8280.0,8276.0,2,500.0,2019-11-19 14:31:00
185,2019/11/19 14:33:00,8270.0,8270.0,8260.0,8260.0,8266.0,4,500.0,2019-11-19 14:33:00
186,2019/11/19 14:34:00,8260.0,8260.0,8260.0,8260.0,8260.0,2,200.0,2019-11-19 14:34:00
187,2019/11/19 14:35:00,8260.0,8260.0,8260.0,8260.0,8260.0,1,100.0,2019-11-19 14:35:00
188,2019/11/19 14:36:00,8260.0,8270.0,8260.0,8270.0,8268.333,3,600.0,2019-11-19 14:36:00
189,2019/11/19 14:39:00,8270.0,8270.0,8270.0,8270.0,8270.0,1,200.0,2019-11-19 14:39:00
190,2019/11/19 14:41:00,8260.0,8260.0,8260.0,8260.0,8260.0,2,200.0,2019-11-19 14:41:00
191,2019/11/19 14:43:00,8260.0,8260.0,8260.0,8260.0,8260.0,1,100.0,2019-11-19 14:43:00
192,2019/11/19 14:44:00,8260.0,8260.0,8260.0,8260.0,8260.0,1,100.0,2019-11-19 14:44:00
193,2019/11/19 14:45:00,8260.0,8270.0,8260.0,8260.0,8263.75,4,800.0,2019-11-19 14:45:00
194,2019/11/19 14:46:00,8250.0,8250.0,8240.0,8240.0,8248.571,6,700.0,2019-11-19 14:46:00
195,2019/11/19 14:47:00,8240.0,8270.0,8240.0,8270.0,8255.0,10,1400.0,2019-11-19 14:47:00
196,2019/11/19 14:48:00,8260.0,8270.0,8250.0,8260.0,8262.0,9,1000.0,2019-11-19 14:48:00
197,2019/11/19 14:49:00,8270.0,8270.0,8270.0,8270.0,8270.0,2,200.0,2019-11-19 14:49:00
198,2019/11/19 14:50:00,8270.0,8270.0,8250.0,8250.0,8260.0,3,300.0,2019-11-19 14:50:00
199,2019/11/19 14:51:00,8260.0,8260.0,8260.0,8260.0,8260.0,2,200.0,2019-11-19 14:51:00
200,2019/11/19 14:52:00,8260.0,8260.0,8260.0,8260.0,8260.0,4,400.0,2019-11-19 14:52:00
201,2019/11/19 14:53:00,8270.0,8270.0,8260.0,8260.0,8264.0,4,500.0,2019-11-19 14:53:00
202,2019/11/19 14:56:00,8260.0,8270.0,8260.0,8270.0,8267.5,3,400.0,2019-11-19 14:56:00
203,2019/11/19 14:57:00,8270.0,8270.0,8270.0,8270.0,8270.0,1,100.0,2019-11-19 14:57:00
204,2019/11/19 14:58:00,8280.0,8290.0,8280.0,8280.0,8280.909,9,1100.0,2019-11-19 14:58:00
205,2019/11/19 14:59:00,8280.0,8290.0,8260.0,8260.0,8276.667,8,900.0,2019-11-19 14:59:00
206,2019/11/19 15:00:00,8250.0,8250.0,8250.0,8250.0,8250.0,1,2200.0,2019-11-19 15:00:00
