,Date,Close,VWAP,Open,Volume,High,Low
0,2014/08/25,505.0,501.477,501.0,17400,511.0,496.5
1,2014/08/26,494.0,497.049,507.5,26800,507.5,486.0
2,2014/08/27,491.0,493.094,490.5,6400,495.5,490.5
3,2014/08/28,492.5,491.557,490.0,12200,495.5,488.0
4,2014/08/29,482.0,483.381,493.0,23600,493.0,475.0
5,2014/09/01,500.0,490.967,483.0,21400,500.0,483.0
6,2014/09/02,502.0,503.407,502.0,16200,506.5,501.5
7,2014/09/03,500.0,503.095,508.5,8400,508.5,500.0
8,2014/09/04,500.0,499.953,500.0,6400,502.0,499.5
9,2014/09/05,491.5,496.228,500.0,13600,500.0,490.0
10,2014/09/08,488.0,491.526,494.0,7800,495.0,488.0
11,2014/09/09,497.5,495.915,492.5,13000,499.5,490.0
12,2014/09/10,492.5,495.93,497.5,15600,500.0,489.5
13,2014/09/11,495.5,497.343,492.5,21600,500.5,492.5
14,2014/09/12,503.0,500.254,499.0,37000,503.0,493.0
15,2014/09/16,502.0,502.857,503.0,8400,505.0,502.0
16,2014/09/17,505.0,502.254,504.5,13000,505.0,497.5
17,2014/09/18,507.5,509.301,505.0,30600,515.0,505.0
18,2014/09/19,507.5,507.813,507.0,8000,513.5,504.5
19,2014/09/22,522.5,513.81,505.5,170000,524.5,505.5
20,2014/09/24,517.0,514.037,525.0,84200,525.5,511.5
21,2014/09/25,509.0,514.327,523.5,11000,524.0,509.0
22,2014/09/26,512.5,511.266,509.0,6400,515.0,509.0
23,2014/09/29,510.0,513.164,519.5,14000,519.5,507.5
24,2014/09/30,495.5,497.259,503.5,39800,505.0,486.0
25,2014/10/01,486.5,490.726,491.0,16400,495.5,486.0
26,2014/10/02,490.0,488.012,482.5,17400,500.0,480.0
27,2014/10/03,498.5,492.566,490.0,12200,500.0,488.5
28,2014/10/06,503.0,503.742,505.0,19400,508.5,500.5
29,2014/10/07,493.0,498.873,502.5,15800,502.5,491.5
30,2014/10/08,491.0,489.958,485.0,12000,495.0,484.0
31,2014/10/09,482.5,492.971,499.5,13600,499.5,482.5
32,2014/10/10,490.0,479.199,480.0,16600,494.0,475.0
33,2014/10/14,472.0,473.236,470.0,14000,482.5,470.0
34,2014/10/15,470.0,466.785,470.5,24600,476.0,460.0
35,2014/10/16,459.5,461.2,462.5,12000,463.0,459.0
36,2014/10/17,455.0,463.438,467.0,16200,468.5,455.0
37,2014/10/20,483.5,474.743,470.0,15200,490.0,468.0
38,2014/10/21,487.5,481.444,491.0,5400,491.0,468.0
39,2014/10/22,491.5,488.322,495.0,9000,495.0,482.5
40,2014/10/23,492.5,491.51,480.0,10000,497.5,480.0
41,2014/10/24,486.0,487.0,482.5,7400,492.0,482.5
42,2014/10/27,495.5,490.581,493.5,7400,495.5,485.0
43,2014/10/28,498.5,498.091,498.0,4400,499.0,497.5
44,2014/10/29,508.5,504.759,500.0,21600,508.5,500.0
45,2014/10/30,533.0,523.436,514.5,45000,535.5,510.0
46,2014/10/31,537.0,536.419,533.0,31000,545.0,528.0
47,2014/11/04,526.0,541.583,549.5,31400,555.0,525.0
48,2014/11/05,519.5,520.471,520.0,14000,525.0,516.5
49,2014/11/06,509.0,516.237,525.0,15600,525.0,508.0
50,2014/11/07,507.5,502.32,510.0,12200,510.0,495.0
51,2014/11/10,508.0,508.5,510.0,7800,512.5,507.5
52,2014/11/11,537.5,527.468,510.0,34400,544.0,507.5
53,2014/11/12,548.5,568.08,549.5,317800,594.5,542.5
54,2014/11/13,595.0,617.91,561.0,556200,680.0,561.0
55,2014/11/14,568.5,587.941,610.0,185600,625.0,555.0
56,2014/11/17,575.0,559.471,577.5,59000,586.5,540.5
57,2014/11/18,562.0,554.018,551.5,66200,570.0,526.0
58,2014/11/19,547.5,555.724,577.0,28600,580.5,543.0
59,2014/11/20,542.5,543.447,550.5,24600,551.0,535.0
60,2014/11/21,530.5,534.36,538.0,26400,547.0,528.5
61,2014/11/25,516.5,524.335,530.0,40600,535.0,516.5
62,2014/11/26,523.0,522.777,525.0,22000,527.5,516.5
63,2014/11/27,511.0,511.874,523.0,39000,523.0,506.5
64,2014/11/28,514.5,511.767,510.0,41600,519.0,510.0
65,2014/12/01,538.5,525.855,513.5,33000,538.5,513.5
66,2014/12/02,541.5,533.788,525.5,47200,546.5,521.0
67,2014/12/03,530.0,536.802,540.5,20200,546.0,530.0
68,2014/12/04,521.5,524.148,530.0,23000,532.0,519.5
69,2014/12/05,520.0,519.692,520.0,18200,523.5,516.0
70,2014/12/08,517.5,520.805,526.5,16400,527.0,515.0
71,2014/12/09,510.0,513.56,515.0,16600,518.0,510.0
72,2014/12/10,504.0,501.234,503.5,21400,504.0,499.0
73,2014/12/11,507.5,502.888,502.0,23200,507.5,498.0
74,2014/12/12,515.0,511.548,512.5,8400,515.0,506.0
75,2014/12/15,514.0,512.55,513.5,39800,522.0,505.0
76,2014/12/16,506.5,515.097,514.0,15400,520.5,505.5
77,2014/12/17,512.5,517.938,518.5,66000,544.5,503.5
78,2014/12/18,521.5,521.926,527.5,25800,529.5,506.5
79,2014/12/19,516.0,518.83,525.0,27600,525.0,515.0
80,2014/12/22,517.0,518.715,520.5,18600,525.0,515.0
81,2014/12/24,511.5,514.325,517.5,20000,518.0,509.0
82,2014/12/25,509.0,510.438,509.0,17800,513.0,509.0
83,2014/12/26,519.5,518.845,510.0,22000,530.0,510.0
84,2014/12/29,524.5,524.281,521.5,11400,527.5,521.5
85,2014/12/30,535.0,533.806,525.0,25200,536.5,525.0
86,2015/01/05,549.0,547.588,547.5,21600,549.5,545.0
87,2015/01/06,539.5,531.73,545.0,17800,545.0,527.5
88,2015/01/07,531.0,530.689,529.5,21200,537.0,525.5
89,2015/01/08,539.0,536.5,531.0,12200,541.5,531.0
90,2015/01/09,539.5,543.532,550.0,31600,557.5,531.5
91,2015/01/13,535.0,534.873,539.5,10200,539.5,531.0
92,2015/01/14,537.5,535.044,533.0,13600,540.5,529.5
93,2015/01/15,535.0,534.954,542.0,23800,542.5,527.5
94,2015/01/16,532.5,535.627,542.5,22000,545.5,528.0
95,2015/01/19,572.5,563.743,550.0,37800,578.0,543.5
96,2015/01/20,570.5,578.228,567.5,22400,588.0,567.5
97,2015/01/21,570.5,572.862,580.0,13000,584.5,558.5
98,2015/01/22,573.0,565.18,575.0,10000,575.0,555.5
99,2015/01/23,570.0,573.705,582.0,11200,582.0,570.0
100,2015/01/26,561.0,561.986,570.0,13800,570.0,558.0
101,2015/01/27,566.5,577.655,560.5,107000,630.0,555.5
102,2015/01/28,569.5,566.69,566.5,10000,573.0,560.5
103,2015/01/29,599.0,585.843,561.0,39600,600.0,561.0
104,2015/01/30,589.5,594.124,602.5,36200,609.0,580.0
105,2015/02/02,500.5,494.406,500.5,268200,505.0,475.5
106,2015/02/03,488.5,490.343,494.0,70800,495.5,486.0
107,2015/02/04,501.0,497.204,495.0,42600,501.0,490.5
108,2015/02/05,507.5,510.357,502.5,35000,517.5,502.5
109,2015/02/06,503.0,505.299,507.5,19400,507.5,502.5
110,2015/02/09,550.0,554.95,507.5,270600,575.0,504.5
111,2015/02/10,569.5,560.92,540.0,92200,574.0,540.0
112,2015/02/12,563.0,569.52,575.0,83400,588.5,558.0
113,2015/02/13,557.5,561.369,571.0,29000,574.0,555.0
114,2015/02/16,541.5,547.156,555.0,45600,557.5,539.5
115,2015/02/17,528.0,533.096,547.5,18800,547.5,528.0
116,2015/02/18,532.5,529.205,526.0,17600,535.0,525.5
117,2015/02/19,516.5,521.584,533.0,54800,533.5,516.5
118,2015/02/20,523.0,526.775,525.0,16000,541.0,519.5
119,2015/02/23,528.0,524.922,537.5,47200,537.5,515.0
120,2015/02/24,548.5,543.92,540.0,73400,548.5,535.5
121,2015/02/25,554.5,556.702,556.5,54000,565.0,550.0
122,2015/02/26,557.5,556.081,554.5,28400,559.0,551.5
123,2015/02/27,560.5,559.554,557.5,37000,566.0,550.5
124,2015/03/02,558.5,559.226,559.5,30600,565.5,553.0
125,2015/03/03,551.5,556.731,556.5,26000,562.5,551.5
126,2015/03/04,548.0,550.066,551.0,24400,555.0,546.0
127,2015/03/05,550.5,550.84,547.5,15600,557.0,546.5
128,2015/03/06,546.0,552.395,560.0,11400,560.0,546.0
129,2015/03/09,537.5,541.591,544.5,23000,545.0,537.5
130,2015/03/10,528.0,530.519,540.0,37800,540.0,522.5
131,2015/03/11,529.5,522.711,520.0,34200,531.0,519.0
132,2015/03/12,523.5,527.272,531.0,29400,532.0,522.0
133,2015/03/13,520.0,522.014,522.0,35200,524.5,520.0
134,2015/03/16,519.5,518.532,517.5,25400,520.0,517.5
135,2015/03/17,521.5,519.189,520.0,14800,523.0,517.5
136,2015/03/18,523.5,519.836,521.0,12200,523.5,518.0
137,2015/03/19,520.0,520.542,522.5,7200,524.0,518.0
138,2015/03/20,529.5,525.383,525.0,127600,531.5,521.5
139,2015/03/23,535.0,534.266,527.5,12800,541.0,527.5
140,2015/03/24,544.0,542.073,537.5,26200,548.0,537.5
141,2015/03/25,529.5,532.348,544.0,31600,544.0,524.0
142,2015/03/26,530.0,528.156,529.0,123400,530.0,519.0
143,2015/03/27,511.0,513.946,515.0,29400,518.0,511.0
144,2015/03/30,514.5,515.793,517.0,8200,520.0,512.5
145,2015/03/31,512.0,513.927,515.5,12400,516.0,512.0
146,2015/04/01,510.0,511.192,512.0,12000,516.0,509.5
147,2015/04/02,511.0,510.487,507.0,7400,516.0,507.0
148,2015/04/03,511.5,515.548,510.5,16800,526.0,510.0
149,2015/04/06,512.0,509.64,511.5,11400,512.5,507.5
150,2015/04/07,507.5,508.463,509.0,16400,510.5,507.5
151,2015/04/08,509.5,509.699,507.5,15600,515.0,507.5
152,2015/04/09,509.0,509.142,510.5,14800,512.5,507.5
153,2015/04/10,505.0,506.225,507.0,16000,508.5,504.0
154,2015/04/13,500.0,501.177,502.0,26000,504.5,499.0
155,2015/04/14,501.5,501.14,500.0,10000,502.5,500.0
156,2015/04/15,504.0,501.944,502.0,7200,504.0,501.0
157,2015/04/16,504.0,504.309,504.0,11000,505.0,501.5
158,2015/04/17,502.0,502.937,502.0,14200,506.5,502.0
159,2015/04/20,497.0,499.114,500.0,33400,502.0,497.0
160,2015/04/21,500.0,497.238,496.5,16800,500.0,495.0
161,2015/04/22,501.0,500.796,501.0,9800,502.5,496.0
162,2015/04/23,498.0,498.493,501.0,13600,501.0,495.5
163,2015/04/24,496.0,496.341,498.0,27000,499.5,495.0
164,2015/04/27,498.5,498.439,496.5,6600,500.0,496.5
165,2015/04/28,499.0,502.055,498.5,27200,509.0,497.5
166,2015/04/30,497.0,496.782,502.5,18800,502.5,493.5
167,2015/05/01,492.0,495.064,497.0,17200,502.0,491.0
168,2015/05/07,498.0,495.25,491.5,2400,498.5,491.5
169,2015/05/08,498.0,500.278,498.5,9000,504.0,498.0
170,2015/05/11,502.0,502.368,504.0,18200,504.5,499.5
171,2015/05/12,494.0,485.732,487.5,42600,495.0,475.5
172,2015/05/13,489.0,489.317,486.5,16400,492.0,486.0
173,2015/05/14,489.0,489.025,488.0,20000,497.5,485.0
174,2015/05/15,486.5,487.386,487.0,8800,490.0,486.5
175,2015/05/18,484.0,484.36,487.0,54200,489.0,482.5
176,2015/05/19,486.5,488.706,485.0,28200,494.5,484.5
177,2015/05/20,491.0,491.246,487.5,11800,492.5,487.5
178,2015/05/21,495.5,493.438,493.5,13000,497.5,490.0
179,2015/05/22,494.0,493.853,498.0,6800,498.0,492.0
180,2015/05/25,488.5,491.858,490.0,32400,498.0,488.5
181,2015/05/26,486.5,489.44,494.5,18200,495.0,486.5
182,2015/05/27,488.5,489.938,494.0,16200,495.0,487.0
183,2015/05/28,483.0,485.62,488.5,21600,490.0,482.5
184,2015/05/29,489.0,489.436,484.0,24800,497.5,483.5
185,2015/06/01,487.0,491.302,495.0,44000,497.0,487.0
186,2015/06/02,487.0,489.534,492.5,37800,493.0,487.0
187,2015/06/03,494.5,496.024,490.0,34000,499.5,490.0
188,2015/06/04,505.0,503.093,502.0,76400,508.0,495.0
189,2015/06/05,515.0,509.487,507.5,53400,515.0,501.5
190,2015/06/08,515.5,520.771,519.0,40200,525.0,515.5
191,2015/06/09,501.0,509.849,515.0,16600,515.5,501.0
192,2015/06/10,507.5,510.988,506.5,16600,516.5,506.0
193,2015/06/11,522.5,520.535,509.0,28800,527.5,509.0
194,2015/06/12,522.5,534.496,525.0,52400,542.0,521.5
195,2015/06/15,542.0,542.106,525.0,68800,553.0,525.0
196,2015/06/16,531.5,537.259,547.5,27000,547.5,528.5
197,2015/06/17,525.5,528.194,531.5,16000,531.5,525.5
198,2015/06/18,514.0,515.204,525.5,38200,526.0,506.0
199,2015/06/19,517.0,517.99,516.5,9600,520.5,514.0
200,2015/06/22,525.5,522.069,517.0,10200,526.0,517.0
201,2015/06/23,523.0,523.309,525.5,9400,526.5,520.5
202,2015/06/24,526.0,526.729,526.5,14400,528.5,526.0
203,2015/06/25,529.5,526.911,527.0,12400,529.5,525.5
204,2015/06/26,679.5,638.591,531.0,962000,679.5,531.0
205,2015/06/29,707.5,724.0,664.5,1094000,807.5,605.0
206,2015/06/30,857.5,830.878,720.5,881600,857.5,720.5
207,2015/07/01,737.5,790.955,897.5,732000,906.5,730.0
208,2015/07/02,668.5,690.089,701.5,309800,730.0,658.0
209,2015/07/03,647.5,652.911,683.5,163600,684.0,639.0
210,2015/07/06,797.5,771.473,698.5,1544600,797.5,678.0
211,2015/07/07,738.0,790.323,817.5,950000,875.0,715.0
212,2015/07/08,674.5,693.011,723.0,216000,735.0,660.5
213,2015/07/09,705.0,656.583,667.0,201000,709.5,618.0
214,2015/07/10,672.5,674.329,666.5,59000,690.0,666.5
215,2015/07/13,650.5,657.337,667.5,67400,667.5,645.0
216,2015/07/14,671.5,659.508,658.0,59600,672.5,645.0
217,2015/07/15,667.0,661.772,665.0,26800,667.0,655.0
218,2015/07/16,675.5,682.205,667.5,62800,700.0,667.5
219,2015/07/17,730.0,706.023,689.0,215000,741.5,675.0
220,2015/07/21,725.0,711.358,700.0,75400,730.0,700.0
221,2015/07/22,733.0,759.656,795.0,195200,795.0,715.5
222,2015/07/23,723.0,728.177,742.0,40600,745.0,717.5
223,2015/07/24,695.0,703.14,715.5,40000,718.0,693.0
224,2015/07/27,680.5,679.875,684.5,37600,705.0,666.0
225,2015/07/28,695.0,682.822,678.5,17400,697.5,670.0
226,2015/07/29,667.5,675.603,699.5,26200,699.5,667.0
227,2015/07/30,673.0,674.323,678.0,24800,678.0,668.5
228,2015/07/31,676.5,682.844,675.0,52600,697.0,673.0
229,2015/08/03,623.0,636.114,674.5,114400,680.5,617.0
230,2015/08/04,601.5,607.713,624.0,60200,626.0,593.0
231,2015/08/05,613.5,610.549,610.0,18200,616.5,603.0
232,2015/08/06,611.0,620.203,617.5,37400,643.5,608.5
233,2015/08/07,595.5,600.678,610.5,37600,611.5,594.0
234,2015/08/10,585.0,586.2,590.0,40600,615.0,576.0
235,2015/08/11,588.5,592.086,591.5,23200,601.5,583.5
236,2015/08/12,587.5,582.204,582.0,20600,588.5,579.0
237,2015/08/13,631.0,608.055,606.0,58600,631.0,595.0
238,2015/08/14,625.5,619.965,624.0,25800,630.0,605.5
239,2015/08/17,634.5,636.805,639.5,22600,642.5,630.0
240,2015/08/18,617.0,620.094,634.0,20200,640.5,613.5
241,2015/08/19,600.5,608.818,617.0,25800,623.5,600.0
242,2015/08/20,588.5,594.022,600.0,22800,600.5,588.5
243,2015/08/21,555.0,565.668,571.5,49400,585.5,555.0
244,2015/08/24,482.5,511.632,525.0,75200,540.5,482.5
245,2015/08/25,505.0,476.872,460.0,75200,522.5,439.5
246,2015/08/26,520.0,497.683,494.0,65000,527.0,475.0
247,2015/08/27,539.5,534.719,522.5,21000,544.0,522.5
248,2015/08/28,554.5,554.924,560.0,13200,562.5,543.5
249,2015/08/31,552.5,551.109,546.5,37600,553.5,540.5
250,2015/09/01,525.0,538.911,553.5,23600,575.0,507.5
251,2015/09/02,509.0,509.824,495.0,18200,527.0,495.0
252,2015/09/03,520.5,528.623,518.0,13000,543.5,516.5
253,2015/09/04,495.5,499.014,512.5,28600,515.5,490.5
254,2015/09/07,511.5,494.774,475.5,19000,515.5,475.5
255,2015/09/08,486.0,491.107,510.0,5600,510.0,485.0
256,2015/09/09,506.5,505.841,502.5,8200,509.0,502.5
257,2015/09/10,587.5,584.761,502.0,125600,625.0,500.0
258,2015/09/11,631.5,624.113,645.0,239400,650.0,602.5
259,2015/09/14,609.0,627.504,631.5,127600,631.5,590.0
260,2015/09/15,595.0,592.274,594.0,12400,605.0,583.0
261,2015/09/16,561.0,568.333,595.0,27000,597.5,555.0
262,2015/09/17,565.5,569.113,578.5,10600,579.5,560.0
263,2015/09/18,577.0,578.405,585.0,4200,585.0,568.5
264,2015/09/24,550.0,556.841,565.0,8800,570.0,549.5
265,2015/09/25,551.0,545.054,535.0,7400,562.0,533.0
266,2015/09/28,565.0,569.349,555.0,6600,578.5,553.0
267,2015/09/29,579.0,577.856,565.0,58200,604.0,533.0
268,2015/09/30,579.5,579.63,584.0,5400,584.0,575.0
269,2015/10/01,595.0,600.093,604.5,8600,604.5,595.0
270,2015/10/02,610.5,606.458,606.0,14400,617.5,587.5
271,2015/10/05,606.5,609.685,614.5,16800,618.5,605.0
272,2015/10/06,600.0,600.111,609.0,5400,609.0,595.0
273,2015/10/07,596.5,593.467,590.0,9200,600.0,585.0
274,2015/10/08,574.5,584.382,592.5,7600,596.5,574.5
275,2015/10/09,578.0,580.056,577.5,3600,585.0,576.0
276,2015/10/13,591.5,590.028,590.0,3600,592.0,587.5
277,2015/10/14,583.0,586.3,591.5,1000,591.5,582.5
278,2015/10/15,577.5,582.295,575.0,8800,590.0,560.5
279,2015/10/16,566.0,572.04,577.5,5000,583.5,565.0
280,2015/10/19,570.0,568.781,566.0,3200,581.0,566.0
281,2015/10/20,720.0,720.0,720.0,28400,720.0,720.0
282,2015/10/21,652.5,696.812,720.0,601000,777.5,647.5
283,2015/10/22,647.5,646.721,670.0,100200,673.5,625.0
284,2015/10/23,628.5,634.107,634.0,50400,643.5,626.5
285,2015/10/26,635.5,638.937,630.5,30000,648.5,630.5
286,2015/10/27,785.5,763.057,629.0,378200,785.5,610.0
287,2015/10/28,691.5,731.166,730.5,768000,780.5,690.0
288,2015/10/29,780.0,798.1,706.5,1181200,841.5,697.5
289,2015/10/30,720.0,723.433,740.0,339000,745.5,703.5
290,2015/11/02,720.0,708.567,715.5,106200,724.5,685.5
291,2015/11/04,711.5,737.683,755.0,210600,768.5,700.0
292,2015/11/05,652.5,662.806,671.5,149200,679.0,652.5
293,2015/11/06,670.0,665.063,659.5,54000,681.0,659.0
294,2015/11/09,676.0,682.59,679.0,33400,692.5,675.0
295,2015/11/10,671.0,666.523,676.0,22000,676.0,655.5
296,2015/11/11,693.0,718.947,682.0,219200,767.5,677.0
297,2015/11/12,701.5,702.472,695.0,35800,712.0,695.0
298,2015/11/13,681.0,684.802,700.5,33800,700.5,677.5
299,2015/11/16,693.5,683.946,681.0,27600,694.0,672.0
300,2015/11/17,717.5,708.532,692.5,47600,731.5,686.5
301,2015/11/18,710.0,724.656,729.5,73600,734.5,710.0
302,2015/11/19,728.0,720.366,711.0,36600,731.5,707.0
303,2015/11/20,724.0,733.96,725.5,69400,748.0,721.5
304,2015/11/24,726.5,730.08,730.0,60000,735.5,724.0
305,2015/11/25,720.0,723.704,726.0,31400,730.0,717.0
306,2015/11/26,755.5,744.266,728.0,223400,764.0,726.5
307,2015/11/27,782.5,778.333,765.0,182400,795.5,760.5
308,2015/11/30,779.0,787.178,790.5,67400,799.5,770.0
309,2015/12/01,760.0,769.504,795.0,56800,795.0,751.0
310,2015/12/02,757.0,753.368,759.0,61200,777.0,740.0
311,2015/12/03,736.0,740.26,750.0,56200,750.0,731.5
312,2015/12/04,726.5,728.05,722.0,38200,740.0,721.5
313,2015/12/07,722.0,727.513,732.5,56000,739.5,720.0
314,2015/12/08,721.5,725.226,721.0,37600,735.0,716.5
315,2015/12/09,705.5,712.104,715.5,32600,722.5,705.5
316,2015/12/10,682.5,689.833,700.0,49600,700.0,681.0
317,2015/12/11,694.0,698.548,685.5,22800,710.0,685.5
318,2015/12/14,676.5,670.219,695.0,58400,695.0,660.0
319,2015/12/15,670.0,670.234,676.5,41000,681.5,665.0
320,2015/12/16,671.0,684.099,690.5,20200,690.5,671.0
321,2015/12/17,703.0,696.492,680.0,24000,712.0,680.0
322,2015/12/18,694.5,702.9,711.0,21000,712.0,692.5
323,2015/12/21,683.0,687.207,699.5,22200,702.0,671.5
324,2015/12/22,684.0,683.934,682.0,7600,687.5,681.0
325,2015/12/24,668.0,689.14,704.0,22200,709.0,668.0
326,2015/12/25,685.5,680.604,668.0,43200,686.5,667.5
327,2015/12/28,709.5,706.658,700.5,27800,712.0,696.0
328,2015/12/29,705.0,705.968,713.0,22000,713.5,699.5
329,2015/12/30,723.5,721.101,715.0,48400,731.0,710.0
330,2016/01/04,805.0,780.083,732.5,335800,839.0,732.5
331,2016/01/05,794.5,793.048,790.0,144800,809.0,770.0
332,2016/01/06,749.0,759.839,794.5,90000,801.5,730.0
333,2016/01/07,789.5,782.112,748.5,116800,806.0,748.5
334,2016/01/08,790.0,800.434,795.0,131000,835.0,770.0
335,2016/01/12,728.5,751.464,785.0,113800,795.0,710.0
336,2016/01/13,837.5,844.395,758.5,560200,878.5,738.5
337,2016/01/14,825.0,792.077,801.5,235800,837.5,761.0
338,2016/01/15,993.5,975.934,852.5,917000,1025.0,835.5
339,2016/01/18,1158.0,1048.861,875.0,1332800,1193.5,840.0
340,2016/01/19,1157.5,1250.059,1250.0,1563000,1350.0,1105.0
341,2016/01/20,929.5,993.165,1082.5,918400,1156.5,907.5
342,2016/01/21,883.0,974.037,970.0,757200,1084.5,855.0
343,2016/01/22,920.0,951.221,925.0,538800,1010.0,903.0
344,2016/01/25,1099.5,1046.094,938.0,635800,1109.5,933.5
345,2016/01/26,1055.5,1071.211,1080.0,399000,1114.0,1029.0
346,2016/01/27,1244.0,1194.997,1078.5,833600,1298.0,1078.5
347,2016/01/28,1268.5,1266.312,1194.0,779800,1330.0,1178.0
348,2016/01/29,1140.5,1151.609,1227.5,395400,1242.5,1075.0
349,2016/02/01,1090.0,1130.61,1169.5,253600,1200.0,1083.0
350,2016/02/02,1056.5,1087.148,1098.5,187800,1133.5,1049.0
351,2016/02/03,1000.0,1009.911,1035.5,144600,1038.0,991.0
352,2016/02/04,1000.5,1056.059,1001.0,343400,1111.0,991.0
353,2016/02/05,953.5,981.368,1010.0,188000,1066.0,907.5
354,2016/02/08,964.5,965.191,950.0,93200,1020.0,915.0
355,2016/02/09,885.5,899.309,904.5,140400,925.0,879.5
356,2016/02/10,861.0,862.418,910.0,155000,931.5,820.0
357,2016/02/12,781.0,805.609,801.0,143800,834.5,781.0
358,2016/02/15,885.0,866.184,837.0,136800,908.0,817.0
359,2016/02/16,900.5,934.741,885.0,99800,965.0,880.0
360,2016/02/17,895.0,896.192,891.5,83200,934.5,862.5
361,2016/02/18,902.5,917.748,935.0,44000,935.0,901.0
362,2016/02/19,922.5,908.13,902.5,40800,939.5,890.5
363,2016/02/22,921.0,927.299,906.5,81000,946.0,895.0
364,2016/02/23,889.0,908.371,937.5,72000,937.5,875.0
365,2016/02/24,873.0,866.917,860.0,66400,888.0,856.0
366,2016/02/25,910.0,902.933,875.0,167200,933.5,872.0
367,2016/02/26,890.0,900.424,929.5,67000,929.5,878.0
368,2016/02/29,940.0,950.236,910.0,288200,997.5,893.0
369,2016/03/01,968.0,952.928,960.0,120000,970.0,928.0
370,2016/03/02,952.0,979.21,990.0,130800,996.5,950.0
371,2016/03/03,975.5,971.953,942.5,108800,991.5,941.0
372,2016/03/04,975.5,975.758,989.0,60200,989.5,965.5
373,2016/03/07,1023.0,1022.041,1000.0,197200,1060.0,992.5
374,2016/03/08,985.0,1012.819,1023.0,216600,1075.0,950.0
375,2016/03/09,976.5,966.113,969.0,57400,990.0,953.0
376,2016/03/10,995.5,994.976,982.5,66400,1014.0,970.0
377,2016/03/11,1038.5,1011.112,996.0,174600,1045.0,990.5
378,2016/03/14,1063.5,1101.156,1122.5,250000,1123.0,1060.0
379,2016/03/15,1050.0,1061.772,1088.5,58400,1088.5,1043.0
380,2016/03/16,1091.0,1068.592,1040.5,97200,1091.5,1032.5
381,2016/03/17,1049.5,1076.144,1095.5,106200,1110.0,1044.5
382,2016/03/18,1057.5,1037.682,1040.5,54000,1065.0,1023.0
383,2016/03/22,1031.5,1034.453,1050.0,76800,1062.0,1008.0
384,2016/03/23,1062.5,1052.436,1031.5,55000,1065.0,1026.5
385,2016/03/24,1066.5,1061.389,1054.0,40600,1078.0,1039.5
386,2016/03/25,1067.0,1067.835,1066.5,48000,1087.0,1046.5
387,2016/03/28,1104.0,1091.508,1078.5,101400,1105.0,1076.0
388,2016/03/29,1160.0,1142.287,1119.5,174600,1165.0,1100.0
389,2016/03/30,1136.5,1169.304,1159.5,186600,1209.0,1133.0
390,2016/03/31,1146.0,1137.011,1136.5,86200,1157.5,1121.5
391,2016/04/01,1091.5,1131.235,1171.0,178400,1175.0,1080.0
392,2016/04/04,1155.0,1113.089,1092.0,122400,1156.0,1046.0
393,2016/04/05,1076.5,1118.383,1180.0,118600,1180.0,1076.5
394,2016/04/06,1059.5,1056.446,1062.0,57600,1073.5,1032.5
395,2016/04/07,1066.0,1056.79,1046.5,72400,1100.5,1035.0
396,2016/04/08,1042.5,1044.125,1032.5,89000,1064.5,1025.0
397,2016/04/11,1085.0,1050.735,1045.0,84000,1085.0,1018.5
398,2016/04/12,1052.5,1068.218,1095.0,56400,1097.0,1051.0
399,2016/04/13,1173.0,1136.999,1084.0,272800,1174.5,1059.0
400,2016/04/14,1155.5,1167.784,1195.5,166600,1199.0,1150.0
401,2016/04/15,1213.5,1198.42,1155.5,172200,1224.5,1155.0
402,2016/04/18,1144.0,1156.218,1152.5,100200,1184.5,1130.5
403,2016/04/19,1152.5,1163.565,1160.0,124000,1192.0,1140.5
404,2016/04/20,1250.0,1211.764,1177.5,225000,1252.5,1160.5
405,2016/04/21,1305.0,1297.797,1315.0,291200,1330.0,1251.5
406,2016/04/22,1312.0,1292.29,1305.0,148800,1315.0,1255.0
407,2016/04/25,1265.0,1310.138,1350.0,159200,1357.5,1253.5
408,2016/04/26,1187.5,1199.068,1250.0,148000,1250.0,1157.5
409,2016/04/27,1224.0,1199.854,1165.5,82800,1230.5,1165.0
410,2016/04/28,1198.0,1215.724,1274.0,80800,1274.0,1165.5
411,2016/05/02,1209.5,1185.64,1158.0,49200,1212.5,1154.0
412,2016/05/06,1307.5,1278.251,1218.0,126600,1330.0,1203.5
413,2016/05/09,1333.5,1314.905,1300.0,141400,1352.5,1263.5
414,2016/05/10,1304.0,1324.506,1336.5,81400,1348.5,1301.0
415,2016/05/11,1425.0,1396.358,1329.5,428000,1435.0,1318.0
416,2016/05/12,1478.0,1438.354,1405.0,495200,1490.0,1360.5
417,2016/05/13,1355.0,1407.783,1492.5,435800,1497.5,1328.5
418,2016/05/16,1308.0,1361.731,1363.5,333600,1422.5,1300.5
419,2016/05/17,1338.5,1303.466,1283.0,197800,1356.5,1252.0
420,2016/05/18,1372.0,1364.809,1350.0,388200,1424.0,1293.0
421,2016/05/19,1415.0,1383.708,1347.0,233000,1415.0,1338.0
422,2016/05/20,1550.0,1498.685,1427.0,475000,1550.0,1415.0
423,2016/05/23,1537.5,1550.604,1570.0,357200,1625.0,1476.0
424,2016/05/24,1450.5,1494.618,1522.5,214400,1567.5,1439.0
425,2016/05/25,1429.5,1450.209,1475.5,139400,1489.0,1415.0
426,2016/05/26,1448.0,1445.26,1490.0,140200,1490.0,1419.0
427,2016/05/27,1480.0,1444.628,1448.5,113000,1480.0,1406.0
428,2016/05/30,1600.0,1555.668,1522.5,285200,1600.0,1502.5
429,2016/05/31,1530.0,1557.733,1612.5,323000,1660.0,1495.0
430,2016/06/01,1550.0,1579.609,1550.0,322600,1640.0,1527.5
431,2016/06/02,1498.0,1528.51,1532.5,135000,1590.0,1482.0
432,2016/06/03,1597.5,1569.721,1499.5,228000,1605.0,1498.0
433,2016/06/06,1550.0,1564.305,1552.5,123800,1600.0,1545.0
434,2016/06/07,1520.0,1548.172,1582.5,154000,1615.0,1510.0
435,2016/06/08,1507.5,1498.459,1525.0,129200,1527.5,1485.0
436,2016/06/09,1500.0,1504.201,1515.0,111000,1537.5,1479.0
437,2016/06/10,1470.0,1478.013,1500.0,91000,1507.5,1465.0
438,2016/06/13,1386.0,1391.154,1428.0,162800,1429.0,1355.0
439,2016/06/14,1183.0,1247.048,1330.5,262600,1336.0,1169.0
440,2016/06/15,1171.5,1167.354,1219.5,378800,1268.5,1119.5
441,2016/06/16,1020.0,1049.421,1172.0,575200,1177.5,994.0
442,2016/06/17,1003.0,1019.339,1062.5,453800,1065.0,987.0
443,2016/06/20,1068.5,1045.013,1020.0,634200,1085.0,1010.0
444,2016/06/21,1108.5,1102.978,1065.0,485400,1143.0,1045.0
445,2016/06/22,1028.0,1069.241,1090.0,379800,1120.0,1006.5
446,2016/06/23,1035.5,1024.797,1028.0,235600,1075.0,1000.5
447,2016/06/24,930.5,898.379,1044.5,751800,1074.5,785.5
448,2016/06/27,1007.5,960.958,970.5,355600,1007.5,910.5
449,2016/06/28,988.0,964.354,944.0,242200,999.5,931.0
450,2016/06/29,982.5,1002.546,1005.5,171000,1015.0,982.0
451,2016/06/30,983.5,1006.052,1010.0,184600,1022.5,983.5
452,2016/07/01,1058.5,1041.489,998.5,261800,1085.0,990.5
453,2016/07/04,1045.0,1051.233,1045.0,186200,1074.5,1036.0
454,2016/07/05,1000.0,1009.569,1045.0,130200,1045.0,993.0
455,2016/07/06,977.5,963.501,970.0,124600,979.5,944.0
456,2016/07/07,935.0,948.96,980.0,96800,980.0,924.0
457,2016/07/08,910.0,903.734,915.0,121800,934.5,872.0
458,2016/07/11,915.0,919.632,930.0,72600,941.0,904.0
459,2016/07/12,955.0,956.162,935.0,89400,969.5,932.5
460,2016/07/13,935.5,947.492,972.5,72600,973.0,934.5
461,2016/07/14,956.0,963.071,935.5,73400,984.0,935.5
462,2016/07/15,907.5,918.775,943.5,104800,965.0,899.0
463,2016/07/19,895.5,903.761,907.5,72400,929.5,885.5
464,2016/07/20,888.5,884.377,880.0,63400,902.0,877.5
465,2016/07/21,937.0,917.686,908.5,98000,937.0,895.0
466,2016/07/22,900.0,905.974,908.0,84200,937.0,893.5
467,2016/07/25,912.5,908.917,898.5,55600,921.0,895.5
468,2016/07/26,882.5,899.377,919.5,79400,925.0,877.5
469,2016/07/27,889.0,892.046,882.5,43400,910.0,882.5
470,2016/07/28,851.0,861.851,889.0,51600,889.5,850.5
471,2016/07/29,915.0,870.494,852.0,99400,915.0,836.0
472,2016/08/01,900.5,916.058,949.0,102400,949.5,900.0
473,2016/08/02,925.0,916.334,900.0,69200,934.5,886.5
474,2016/08/03,883.0,894.803,905.0,61400,910.0,883.0
475,2016/08/04,887.5,888.002,895.0,44400,908.5,869.0
476,2016/08/05,862.5,875.415,885.0,62000,896.5,855.5
477,2016/08/08,869.5,877.071,882.5,39600,884.5,865.5
478,2016/08/09,880.5,883.483,880.0,34800,900.0,870.0
479,2016/08/10,900.0,895.395,896.5,24800,900.0,886.0
480,2016/08/12,908.0,900.099,899.0,28400,908.0,890.5
481,2016/08/15,900.5,896.367,899.0,39000,907.5,889.0
482,2016/08/16,898.5,907.343,900.5,58000,920.0,890.0
483,2016/08/17,897.5,896.813,887.5,43200,907.0,887.5
484,2016/08/18,902.0,909.647,893.0,71600,914.5,893.0
485,2016/08/19,907.0,907.263,902.5,31200,916.0,900.5
486,2016/08/22,888.5,893.777,905.5,51600,907.0,880.5
487,2016/08/23,888.5,889.867,887.5,37600,898.5,882.5
488,2016/08/24,936.0,914.537,889.0,83000,936.0,889.0
489,2016/08/25,916.0,915.344,934.0,77000,934.0,900.0
490,2016/08/26,910.5,908.414,907.5,39400,920.0,901.0
491,2016/08/29,897.0,905.368,901.0,34000,920.0,896.5
492,2016/08/30,899.0,901.372,900.0,15600,906.5,897.5
493,2016/08/31,906.0,902.747,909.0,19400,909.5,892.5
494,2016/09/01,906.0,904.322,904.5,26400,912.0,899.0
495,2016/09/02,894.0,894.624,900.5,25800,904.5,887.5
496,2016/09/05,899.5,898.109,900.0,23000,904.0,892.5
497,2016/09/06,902.5,898.399,899.5,16800,903.0,894.5
498,2016/09/07,916.0,914.708,907.5,66400,920.5,903.5
499,2016/09/08,924.5,928.67,916.5,92000,946.5,916.0
500,2016/09/09,953.0,929.907,916.0,180600,970.0,906.0
501,2016/09/12,931.0,939.063,934.0,67200,950.0,930.0
502,2016/09/13,918.5,921.476,931.0,38000,944.0,907.0
503,2016/09/14,893.0,917.509,925.0,138800,929.5,892.5
504,2016/09/15,869.0,879.863,887.5,59000,893.0,863.0
505,2016/09/16,875.5,874.627,869.5,22000,881.5,869.5
506,2016/09/20,870.5,872.571,870.5,24000,880.0,868.5
507,2016/09/21,884.5,875.921,870.5,24000,890.0,868.5
508,2016/09/23,901.5,894.351,883.0,22200,901.5,883.0
509,2016/09/26,888.5,897.174,908.5,23000,910.0,888.0
510,2016/09/27,888.5,882.364,882.5,29400,891.5,872.0
511,2016/09/28,889.0,892.474,905.0,23200,905.0,886.0
512,2016/09/29,880.0,886.048,900.0,33400,900.0,879.5
513,2016/09/30,870.5,872.284,876.0,40800,880.0,866.0
514,2016/10/03,870.5,870.887,870.5,26600,876.0,867.5
515,2016/10/04,868.0,870.521,869.0,39000,875.0,865.5
516,2016/10/05,879.5,881.288,888.0,20800,888.0,873.5
517,2016/10/06,886.5,885.644,881.0,27000,892.0,878.0
518,2016/10/07,880.0,883.341,884.5,22600,887.0,879.0
519,2016/10/11,879.5,881.706,880.5,21400,886.0,877.0
520,2016/10/12,870.0,873.338,882.5,28400,882.5,869.5
521,2016/10/13,864.5,866.651,868.5,33200,870.0,863.0
522,2016/10/14,856.0,860.041,865.0,26600,869.5,853.0
523,2016/10/17,915.5,929.068,856.0,329400,986.0,853.0
524,2016/10/18,931.5,914.721,903.0,82800,934.0,902.5
525,2016/10/19,959.0,952.459,939.0,106800,969.5,932.5
526,2016/10/20,930.5,939.548,959.0,87400,968.5,921.0
527,2016/10/21,915.5,925.235,930.5,47200,946.0,912.5
528,2016/10/24,910.0,910.63,915.5,18400,915.5,905.5
529,2016/10/25,933.0,922.889,918.5,58400,940.0,902.5
530,2016/10/26,917.5,927.142,933.0,26800,934.5,916.0
531,2016/10/27,921.5,916.27,916.5,23000,930.0,906.0
532,2016/10/28,915.5,918.794,917.0,9200,922.5,915.5
533,2016/10/31,882.5,899.826,916.0,64800,924.0,872.5
534,2016/11/01,883.0,888.249,882.5,35400,898.0,882.5
535,2016/11/02,856.5,864.489,878.0,66400,881.0,853.5
536,2016/11/04,824.5,836.02,850.5,79400,855.0,821.5
537,2016/11/07,837.5,831.96,824.0,27600,838.5,824.0
538,2016/11/08,841.5,847.282,843.0,23400,855.5,841.0
539,2016/11/09,821.5,823.665,859.5,109800,864.0,789.0
540,2016/11/10,864.5,860.584,850.0,29800,874.0,850.0
541,2016/11/11,874.5,874.845,864.5,42600,884.0,864.5
542,2016/11/14,875.5,877.147,885.0,23200,885.0,865.0
543,2016/11/15,874.5,871.205,878.5,21000,878.5,863.0
544,2016/11/16,872.0,869.626,870.0,29400,876.5,864.0
545,2016/11/17,881.5,872.089,870.5,22400,882.5,864.5
546,2016/11/18,886.0,883.311,882.5,37000,886.0,879.0
547,2016/11/21,895.0,904.558,884.0,90800,926.0,884.0
548,2016/11/22,885.0,886.5,892.5,22000,892.5,880.0
549,2016/11/24,875.0,877.43,882.5,45400,885.0,875.0
550,2016/11/25,861.0,867.684,875.0,51200,875.5,860.0
551,2016/11/28,875.0,862.917,861.0,26400,875.0,856.0
552,2016/11/29,874.0,868.272,869.5,18000,877.0,863.0
553,2016/11/30,860.5,864.136,868.5,22800,869.5,860.0
554,2016/12/01,870.5,872.131,867.5,39800,884.5,862.5
555,2016/12/02,855.0,861.052,870.0,27000,870.0,854.0
556,2016/12/05,853.5,853.655,850.5,19400,868.0,850.5
557,2016/12/06,862.5,881.477,854.5,142600,905.5,854.5
558,2016/12/07,861.5,862.783,860.0,30400,876.0,854.5
559,2016/12/08,857.5,862.421,870.0,36800,870.0,855.5
560,2016/12/09,854.0,853.983,851.5,23400,861.5,851.5
561,2016/12/12,852.5,854.738,855.5,40000,860.0,852.0
562,2016/12/13,856.0,859.26,852.5,67200,879.0,852.0
563,2016/12/14,866.5,864.039,858.5,35600,873.0,858.0
564,2016/12/15,862.5,867.328,875.0,31400,875.0,862.0
565,2016/12/16,856.0,858.147,859.0,28600,862.0,855.5
566,2016/12/19,853.0,854.682,856.0,29600,857.5,852.5
567,2016/12/20,854.0,854.867,857.0,21800,857.0,853.0
568,2016/12/21,852.5,854.506,855.5,33000,857.0,852.5
569,2016/12/22,849.5,849.921,852.0,53400,853.0,847.0
570,2016/12/26,852.5,848.664,849.5,39000,856.5,845.0
571,2016/12/27,846.0,848.557,852.5,38800,852.5,846.0
572,2016/12/28,848.5,848.975,846.0,28200,855.0,846.0
573,2016/12/29,850.0,846.439,847.5,41000,856.5,841.0
574,2016/12/30,850.0,847.158,843.5,15200,853.5,842.5
575,2017/01/04,875.0,874.252,855.0,79800,892.0,852.0
576,2017/01/05,919.5,915.838,888.0,415600,944.0,876.0
577,2017/01/06,911.0,910.882,925.0,144800,925.0,895.5
578,2017/01/10,921.0,918.02,917.5,99200,923.5,906.5
579,2017/01/11,905.0,916.218,921.0,70200,925.0,905.0
580,2017/01/12,895.5,899.408,902.5,62200,911.5,890.5
581,2017/01/13,902.5,904.198,896.0,32400,909.5,896.0
582,2017/01/16,877.5,886.745,899.5,53000,899.5,875.5
583,2017/01/17,876.5,880.098,884.0,28600,889.0,876.0
584,2017/01/18,899.0,883.743,876.5,34600,899.0,876.5
585,2017/01/19,887.0,896.906,902.5,43600,905.5,883.0
586,2017/01/20,891.5,887.037,888.0,16200,892.0,881.0
587,2017/01/23,897.5,894.957,892.0,18800,900.5,890.5
588,2017/01/24,898.5,895.373,897.5,12600,899.5,889.0
589,2017/01/25,911.0,921.075,938.5,146200,945.0,903.0
590,2017/01/26,920.0,918.249,919.5,69600,930.0,910.0
591,2017/01/27,954.0,945.35,932.5,179600,959.0,932.0
592,2017/01/30,982.5,974.904,959.5,206400,993.0,955.0
593,2017/01/31,981.0,981.237,980.0,100400,998.0,961.0
594,2017/02/01,1155.0,1140.284,1157.5,1033000,1170.0,1101.0
595,2017/02/02,1152.5,1144.935,1131.5,291000,1169.5,1125.5
596,2017/02/03,1147.0,1143.064,1150.0,121400,1151.5,1134.0
597,2017/02/06,1225.0,1193.626,1152.5,336400,1225.0,1148.0
598,2017/02/07,1222.0,1216.263,1213.0,166600,1235.0,1197.5
599,2017/02/08,1196.5,1207.192,1211.0,118000,1229.5,1189.0
600,2017/02/09,1210.0,1213.88,1200.0,75600,1228.5,1196.5
601,2017/02/10,1190.5,1190.366,1211.5,101600,1215.0,1169.5
602,2017/02/13,1180.5,1164.21,1189.0,126000,1189.0,1150.0
603,2017/02/14,1159.0,1164.441,1180.5,50800,1180.5,1155.0
604,2017/02/15,1170.0,1170.535,1159.0,99400,1187.5,1155.0
605,2017/02/16,1194.0,1185.372,1170.0,75800,1195.0,1160.0
606,2017/02/17,1237.5,1223.108,1194.0,155000,1242.5,1190.0
607,2017/02/20,1295.0,1263.227,1237.5,200200,1295.0,1232.5
608,2017/02/21,1273.0,1277.892,1295.0,192800,1311.5,1253.5
609,2017/02/22,1238.5,1244.656,1273.0,85800,1273.5,1228.5
610,2017/02/23,1199.0,1200.552,1222.0,124800,1222.0,1190.0
611,2017/02/24,1185.0,1191.666,1190.0,78400,1206.5,1176.0
612,2017/02/27,1158.0,1157.916,1171.5,114400,1186.0,1142.0
613,2017/02/28,1117.5,1135.13,1147.0,119400,1164.5,1115.0
614,2017/03/01,1154.0,1139.168,1117.5,79600,1160.0,1114.5
615,2017/03/02,1160.5,1160.09,1170.0,75600,1170.5,1145.0
616,2017/03/03,1175.5,1179.595,1159.0,86800,1200.5,1150.5
617,2017/03/06,1167.0,1172.885,1181.5,50400,1193.0,1155.5
618,2017/03/07,1155.5,1165.992,1158.5,52000,1190.0,1155.5
619,2017/03/08,1144.5,1161.116,1165.0,95000,1171.0,1140.5
620,2017/03/09,1156.5,1159.265,1155.0,96600,1178.0,1154.5
621,2017/03/10,1156.5,1157.876,1155.5,20200,1165.0,1155.5
622,2017/03/13,1127.5,1144.833,1156.0,63000,1160.5,1127.5
623,2017/03/14,1112.5,1116.311,1124.0,45400,1127.5,1111.5
624,2017/03/15,1081.0,1096.601,1112.5,68400,1123.0,1078.0
625,2017/03/16,1115.5,1089.192,1072.0,49000,1117.5,1055.0
626,2017/03/17,1117.0,1131.615,1138.5,69800,1138.5,1106.0
627,2017/03/21,1143.5,1133.961,1120.0,22800,1144.0,1120.0
628,2017/03/22,1114.0,1120.726,1124.5,22600,1126.5,1111.5
629,2017/03/23,1089.0,1100.809,1125.5,46600,1137.5,1079.0
630,2017/03/24,1126.0,1108.854,1095.0,19200,1126.0,1086.0
631,2017/03/27,1107.0,1115.278,1126.0,32000,1126.0,1106.0
632,2017/03/28,1116.0,1118.032,1110.0,44200,1139.0,1109.5
633,2017/03/29,1128.0,1113.992,1102.0,24800,1129.0,1100.0
634,2017/03/30,1136.0,1131.699,1127.0,46100,1148.0,1107.0
635,2017/03/31,1140.0,1157.961,1152.0,70900,1178.0,1140.0
636,2017/04/03,1094.0,1132.31,1158.0,55800,1170.0,1091.0
637,2017/04/04,1015.0,1035.126,1074.0,108700,1086.0,1006.0
638,2017/04/05,1029.0,1035.083,1015.0,42100,1078.0,1015.0
639,2017/04/06,992.0,1004.572,1029.0,64300,1041.0,991.0
640,2017/04/07,1020.0,1001.845,998.0,46500,1037.0,978.0
641,2017/04/10,1014.0,1013.599,1020.0,13700,1021.0,1000.0
642,2017/04/11,997.0,997.944,1000.0,24800,1009.0,985.0
643,2017/04/12,936.0,941.938,973.0,85600,973.0,916.0
644,2017/04/13,948.0,932.463,911.0,31300,968.0,911.0
645,2017/04/14,932.0,938.41,948.0,15600,948.0,925.0
646,2017/04/17,995.0,968.02,928.0,30600,1004.0,928.0
647,2017/04/18,1015.0,1027.9,1055.0,98700,1061.0,1000.0
648,2017/04/19,1020.0,1025.22,1011.0,19100,1045.0,1011.0
649,2017/04/20,1034.0,1035.112,1037.0,34700,1055.0,1008.0
650,2017/04/21,1027.0,1027.586,1035.0,15700,1043.0,1022.0
651,2017/04/24,993.0,1003.217,1027.0,42900,1049.0,990.0
652,2017/04/25,1019.0,1009.798,1001.0,18300,1025.0,995.0
653,2017/04/26,1023.0,1024.96,1019.0,37600,1038.0,1016.0
654,2017/04/27,1060.0,1041.843,1024.0,40800,1060.0,1017.0
655,2017/04/28,1019.0,1034.496,1056.0,40700,1070.0,1017.0
656,2017/05/01,1060.0,1046.24,1031.0,51300,1060.0,1028.0
657,2017/05/02,1068.0,1071.492,1060.0,88100,1097.0,1040.0
658,2017/05/08,1089.0,1096.917,1098.0,69800,1110.0,1088.0
659,2017/05/09,1108.0,1101.034,1090.0,58200,1119.0,1076.0
660,2017/05/10,1149.0,1137.718,1120.0,114200,1155.0,1113.0
661,2017/05/11,1066.0,1066.427,1110.0,213800,1110.0,1033.0
662,2017/05/12,1030.0,1045.569,1070.0,62000,1078.0,1030.0
663,2017/05/15,1051.0,1040.545,1019.0,36700,1064.0,1019.0
664,2017/05/16,1050.0,1047.771,1056.0,15700,1056.0,1042.0
665,2017/05/17,1081.0,1052.269,1050.0,21900,1081.0,1040.0
666,2017/05/18,1060.0,1055.062,1051.0,42300,1066.0,1035.0
667,2017/05/19,1038.0,1051.066,1061.0,27300,1069.0,1031.0
668,2017/05/22,1052.0,1050.368,1055.0,26600,1057.0,1042.0
669,2017/05/23,1055.0,1055.994,1051.0,17800,1067.0,1051.0
670,2017/05/24,1083.0,1073.036,1068.0,41900,1084.0,1059.0
671,2017/05/25,1089.0,1081.5,1087.0,27000,1090.0,1071.0
672,2017/05/26,1066.0,1073.119,1087.0,19400,1087.0,1062.0
673,2017/05/29,1065.0,1067.796,1066.0,13700,1073.0,1064.0
674,2017/05/30,1076.0,1070.29,1065.0,25200,1080.0,1061.0
675,2017/05/31,1114.0,1096.125,1085.0,66200,1120.0,1075.0
676,2017/06/01,1172.0,1142.685,1128.0,204300,1172.0,1114.0
677,2017/06/02,1128.0,1195.842,1228.0,343400,1237.0,1128.0
678,2017/06/05,1185.0,1167.526,1149.0,91100,1190.0,1149.0
679,2017/06/06,1224.0,1193.223,1181.0,132500,1224.0,1155.0
680,2017/06/07,1201.0,1215.727,1230.0,176700,1239.0,1194.0
681,2017/06/08,1159.0,1185.587,1205.0,121600,1215.0,1155.0
682,2017/06/09,1162.0,1169.363,1162.0,45200,1183.0,1161.0
683,2017/06/12,1199.0,1168.258,1150.0,82200,1199.0,1128.0
684,2017/06/13,1180.0,1181.274,1195.0,23400,1195.0,1171.0
685,2017/06/14,1171.0,1173.525,1175.0,28200,1193.0,1164.0
686,2017/06/15,1152.0,1150.874,1164.0,34200,1167.0,1143.0
687,2017/06/16,1143.0,1137.244,1150.0,33200,1153.0,1128.0
688,2017/06/19,1159.0,1145.547,1150.0,21400,1161.0,1132.0
689,2017/06/20,1138.0,1146.007,1163.0,41600,1170.0,1130.0
690,2017/06/21,1136.0,1142.525,1138.0,44800,1151.0,1130.0
691,2017/06/22,1194.0,1172.522,1147.0,75500,1194.0,1143.0
692,2017/06/23,1169.0,1166.325,1195.0,62800,1197.0,1145.0
693,2017/06/26,1175.0,1178.631,1184.0,83400,1184.0,1166.0
694,2017/06/27,1188.0,1179.692,1186.0,46100,1190.0,1167.0
695,2017/06/28,1152.0,1167.08,1189.0,46000,1189.0,1150.0
696,2017/06/29,1163.0,1169.659,1153.0,174900,1217.0,1139.0
697,2017/06/30,1161.0,1145.012,1143.0,43300,1162.0,1130.0
698,2017/07/03,1165.0,1164.008,1161.0,23900,1180.0,1149.0
699,2017/07/04,1131.0,1144.075,1170.0,40000,1170.0,1131.0
700,2017/07/05,1125.0,1115.366,1132.0,53300,1132.0,1097.0
701,2017/07/06,1115.0,1124.641,1125.0,35100,1139.0,1115.0
702,2017/07/07,1128.0,1115.818,1108.0,31800,1128.0,1103.0
703,2017/07/10,1150.0,1142.145,1139.0,22800,1152.0,1129.0
704,2017/07/11,1139.0,1148.589,1155.0,19200,1159.0,1138.0
705,2017/07/12,1129.0,1129.685,1139.0,31100,1150.0,1116.0
706,2017/07/13,1130.0,1132.688,1137.0,14100,1140.0,1121.0
707,2017/07/14,1114.0,1120.884,1131.0,23200,1132.0,1114.0
708,2017/07/18,1102.0,1116.184,1127.0,51200,1142.0,1100.0
709,2017/07/19,1124.0,1113.918,1108.0,23100,1127.0,1108.0
710,2017/07/20,1117.0,1124.24,1122.0,21700,1134.0,1117.0
711,2017/07/21,1120.0,1118.082,1120.0,24400,1123.0,1113.0
712,2017/07/24,1113.0,1112.641,1118.0,24800,1121.0,1107.0
713,2017/07/25,1127.0,1122.62,1121.0,42100,1134.0,1111.0
714,2017/07/26,1188.0,1163.012,1143.0,167100,1188.0,1127.0
715,2017/07/27,1178.0,1172.625,1179.0,92200,1190.0,1152.0
716,2017/07/28,1150.0,1166.858,1190.0,57000,1190.0,1144.0
717,2017/07/31,1148.0,1149.524,1151.0,39700,1154.0,1141.0
718,2017/08/01,1132.0,1152.555,1175.0,79600,1180.0,1128.0
719,2017/08/02,1142.0,1145.673,1154.0,21400,1155.0,1137.0
720,2017/08/03,1115.0,1122.23,1139.0,26500,1139.0,1112.0
721,2017/08/04,1092.0,1099.39,1112.0,59000,1116.0,1088.0
722,2017/08/07,1099.0,1102.606,1094.0,19800,1121.0,1094.0
723,2017/08/08,1092.0,1095.364,1100.0,20600,1107.0,1088.0
724,2017/08/09,1081.0,1086.716,1092.0,42600,1109.0,1078.0
725,2017/08/10,1069.0,1074.755,1077.0,34700,1090.0,1067.0
726,2017/08/14,1049.0,1047.269,1053.0,45400,1060.0,1031.0
727,2017/08/15,1081.0,1074.139,1055.0,23800,1088.0,1055.0
728,2017/08/16,1112.0,1097.846,1093.0,20800,1112.0,1085.0
729,2017/08/17,1155.0,1149.532,1119.0,94200,1172.0,1119.0
730,2017/08/18,1165.0,1158.647,1136.0,53300,1183.0,1132.0
731,2017/08/21,1158.0,1164.394,1169.0,42600,1176.0,1149.0
732,2017/08/22,1165.0,1176.353,1160.0,51600,1188.0,1156.0
733,2017/08/23,1170.0,1171.014,1165.0,21200,1179.0,1165.0
734,2017/08/24,1174.0,1172.933,1170.0,16400,1181.0,1160.0
735,2017/08/25,1151.0,1156.473,1167.0,27700,1168.0,1146.0
736,2017/08/28,1179.0,1170.031,1160.0,42000,1180.0,1154.0
737,2017/08/29,1155.0,1157.147,1160.0,21100,1168.0,1152.0
738,2017/08/30,1130.0,1146.868,1154.0,37200,1179.0,1126.0
739,2017/08/31,1161.0,1153.48,1140.0,12500,1162.0,1140.0
740,2017/09/01,1145.0,1154.049,1166.0,16200,1168.0,1144.0
741,2017/09/04,1117.0,1120.844,1135.0,42900,1136.0,1105.0
742,2017/09/05,1079.0,1091.679,1117.0,50200,1122.0,1071.0
743,2017/09/06,1100.0,1080.959,1062.0,41200,1120.0,1052.0
744,2017/09/07,1085.0,1097.593,1104.0,24100,1117.0,1080.0
745,2017/09/08,1075.0,1082.0,1099.0,15600,1103.0,1067.0
746,2017/09/11,1084.0,1085.135,1095.0,16300,1095.0,1073.0
747,2017/09/12,1122.0,1110.774,1095.0,28300,1126.0,1095.0
748,2017/09/13,1130.0,1138.123,1131.0,22800,1147.0,1128.0
749,2017/09/14,1104.0,1110.373,1124.0,16900,1126.0,1098.0
750,2017/09/15,1117.0,1113.604,1100.0,11100,1125.0,1100.0
751,2017/09/19,1198.0,1183.143,1160.0,172300,1210.0,1136.0
752,2017/09/20,1179.0,1189.783,1198.0,76900,1198.0,1169.0
753,2017/09/21,1176.0,1191.024,1193.0,108100,1198.0,1176.0
754,2017/09/22,1151.0,1176.444,1186.0,108000,1187.0,1147.0
755,2017/09/25,1180.0,1170.194,1167.0,52200,1182.0,1159.0
756,2017/09/26,1163.0,1160.5,1164.0,20400,1170.0,1150.0
757,2017/09/27,1187.0,1179.151,1160.0,20600,1194.0,1156.0
758,2017/09/28,1185.0,1185.997,1179.0,29800,1198.0,1175.0
759,2017/09/29,1193.0,1189.702,1179.0,33900,1200.0,1176.0
760,2017/10/02,1188.0,1189.898,1193.0,17700,1194.0,1183.0
761,2017/10/03,1165.0,1183.116,1193.0,28400,1195.0,1165.0
762,2017/10/04,1169.0,1161.066,1163.0,15100,1172.0,1151.0
763,2017/10/05,1141.0,1150.405,1160.0,33100,1171.0,1141.0
764,2017/10/06,1132.0,1134.386,1139.0,16600,1148.0,1125.0
765,2017/10/10,1130.0,1130.797,1132.0,6400,1136.0,1126.0
766,2017/10/11,1133.0,1132.394,1147.0,21600,1147.0,1126.0
767,2017/10/12,1152.0,1145.104,1138.0,15400,1154.0,1135.0
768,2017/10/13,1142.0,1146.029,1161.0,27800,1161.0,1138.0
769,2017/10/16,1128.0,1135.972,1143.0,28900,1144.0,1127.0
770,2017/10/17,1210.0,1207.398,1176.0,290000,1235.0,1172.0
771,2017/10/18,1165.0,1181.748,1215.0,69000,1215.0,1151.0
772,2017/10/19,1156.0,1161.367,1166.0,21000,1169.0,1156.0
773,2017/10/20,1182.0,1169.904,1156.0,34300,1185.0,1146.0
774,2017/10/23,1212.0,1203.54,1205.0,84800,1214.0,1188.0
775,2017/10/24,1205.0,1211.81,1210.0,47400,1219.0,1202.0
776,2017/10/25,1194.0,1198.592,1201.0,40900,1206.0,1192.0
777,2017/10/26,1222.0,1214.29,1190.0,65500,1228.0,1186.0
778,2017/10/27,1238.0,1231.507,1222.0,60400,1240.0,1221.0
779,2017/10/30,1266.0,1265.693,1248.0,110900,1280.0,1248.0
780,2017/10/31,1250.0,1251.5,1264.0,52400,1264.0,1241.0
781,2017/11/01,1321.0,1307.61,1272.0,234300,1325.0,1272.0
782,2017/11/02,1314.0,1312.151,1321.0,76800,1339.0,1294.0
783,2017/11/06,1334.0,1339.259,1330.0,84500,1361.0,1324.0
784,2017/11/07,1293.0,1308.392,1328.0,71900,1345.0,1284.0
785,2017/11/08,1300.0,1267.863,1283.0,75000,1300.0,1241.0
786,2017/11/09,1274.0,1280.992,1296.0,52700,1301.0,1251.0
787,2017/11/10,1280.0,1267.762,1250.0,24800,1284.0,1250.0
788,2017/11/13,1285.0,1266.044,1264.0,23000,1285.0,1256.0
789,2017/11/14,1257.0,1272.505,1273.0,20800,1285.0,1255.0
790,2017/11/15,1185.0,1192.864,1246.0,126400,1257.0,1151.0
791,2017/11/16,1205.0,1190.322,1175.0,40400,1210.0,1159.0
792,2017/11/17,1230.0,1235.863,1223.0,27000,1252.0,1223.0
793,2017/11/20,1295.0,1286.318,1250.0,79300,1302.0,1250.0
794,2017/11/21,1287.0,1273.56,1295.0,52700,1295.0,1251.0
795,2017/11/22,1290.0,1301.912,1300.0,33100,1319.0,1286.0
796,2017/11/24,1299.0,1297.722,1285.0,46100,1310.0,1285.0
797,2017/11/27,1295.0,1299.979,1301.0,27900,1315.0,1276.0
798,2017/11/28,1268.0,1269.629,1277.0,32600,1288.0,1256.0
799,2017/11/29,1263.0,1262.713,1268.0,28900,1277.0,1253.0
800,2017/11/30,1258.0,1251.699,1264.0,37500,1266.0,1241.0
801,2017/12/01,1275.0,1267.229,1263.0,17000,1280.0,1254.0
802,2017/12/04,1256.0,1282.969,1276.0,48500,1308.0,1250.0
803,2017/12/05,1242.0,1242.501,1249.0,37900,1259.0,1230.0
804,2017/12/06,1232.0,1238.773,1233.0,26000,1251.0,1229.0
805,2017/12/07,1270.0,1249.044,1240.0,29700,1270.0,1232.0
806,2017/12/08,1295.0,1282.938,1280.0,51300,1295.0,1271.0
807,2017/12/11,1295.0,1295.262,1295.0,74300,1304.0,1291.0
808,2017/12/12,1278.0,1289.784,1306.0,24500,1308.0,1278.0
809,2017/12/13,1277.0,1274.349,1279.0,15200,1289.0,1266.0
810,2017/12/14,1284.0,1275.626,1279.0,19000,1284.0,1266.0
811,2017/12/15,1289.0,1281.676,1290.0,29300,1300.0,1263.0
812,2017/12/18,1371.0,1373.338,1397.0,282900,1398.0,1350.0
813,2017/12/19,1370.0,1377.16,1393.0,88000,1393.0,1361.0
814,2017/12/20,1450.0,1418.227,1371.0,162900,1450.0,1371.0
815,2017/12/21,1437.0,1441.429,1437.0,121800,1469.0,1410.0
816,2017/12/22,1539.0,1508.009,1459.0,240000,1543.0,1434.0
817,2017/12/25,1542.0,1538.715,1520.0,108700,1576.0,1515.0
818,2017/12/26,1555.0,1573.413,1579.0,120000,1606.0,1545.0
819,2017/12/27,1576.0,1574.209,1548.0,66000,1593.0,1548.0
820,2017/12/28,1624.0,1615.46,1585.0,120600,1645.0,1576.0
821,2017/12/29,1597.0,1604.439,1627.0,74000,1645.0,1570.0
822,2018/01/04,1590.0,1610.52,1643.0,74200,1643.0,1585.0
823,2018/01/05,1587.0,1578.934,1597.0,63200,1597.0,1553.0
824,2018/01/09,1692.0,1667.752,1615.0,146400,1699.0,1610.0
825,2018/01/10,1724.0,1703.842,1720.0,85500,1729.0,1670.0
826,2018/01/11,1739.0,1714.259,1712.0,58400,1743.0,1688.0
827,2018/01/12,1779.0,1830.817,1770.0,234400,1971.0,1770.0
828,2018/01/15,1794.0,1782.845,1790.0,78000,1799.0,1770.0
829,2018/01/16,1747.0,1754.894,1780.0,75600,1790.0,1735.0
830,2018/01/17,1795.0,1780.377,1758.0,60800,1809.0,1743.0
831,2018/01/18,1804.0,1841.245,1820.0,112100,1877.0,1798.0
832,2018/01/19,1807.0,1803.105,1823.0,60100,1832.0,1781.0
833,2018/01/22,1830.0,1834.211,1816.0,74600,1865.0,1807.0
834,2018/01/23,1896.0,1884.059,1831.0,94400,1927.0,1831.0
835,2018/01/24,1887.0,1894.928,1898.0,93400,1925.0,1868.0
836,2018/01/25,1864.0,1859.66,1886.0,68800,1890.0,1840.0
837,2018/01/26,1855.0,1873.315,1881.0,66400,1906.0,1841.0
838,2018/01/29,1823.0,1849.186,1865.0,86000,1881.0,1817.0
839,2018/01/30,1842.0,1847.683,1842.0,356500,1880.0,1812.0
840,2018/01/31,1712.0,1764.468,1810.0,245600,1821.0,1712.0
841,2018/02/01,1546.0,1570.239,1615.0,342200,1637.0,1540.0
842,2018/02/02,1541.0,1539.093,1560.0,185600,1571.0,1508.0
843,2018/02/05,1488.0,1480.054,1498.0,171700,1508.0,1455.0
844,2018/02/06,1378.0,1367.688,1430.0,269100,1436.0,1303.0
845,2018/02/07,1379.0,1419.814,1445.0,109600,1447.0,1379.0
846,2018/02/08,1406.0,1385.192,1349.0,91800,1420.0,1349.0
847,2018/02/09,1378.0,1352.998,1335.0,100000,1382.0,1322.0
848,2018/02/13,1370.0,1391.632,1420.0,93100,1420.0,1362.0
849,2018/02/14,1318.0,1322.491,1364.0,125000,1371.0,1296.0
850,2018/02/15,1381.0,1370.559,1328.0,80400,1401.0,1328.0
851,2018/02/16,1411.0,1411.865,1411.0,77600,1439.0,1394.0
852,2018/02/19,1461.0,1450.242,1436.0,50800,1472.0,1427.0
853,2018/02/20,1455.0,1443.876,1443.0,41900,1459.0,1423.0
854,2018/02/21,1466.0,1463.212,1465.0,50600,1482.0,1443.0
855,2018/02/22,1440.0,1434.292,1453.0,41800,1453.0,1411.0
856,2018/02/23,1483.0,1462.853,1450.0,55700,1493.0,1443.0
857,2018/02/26,1548.0,1531.756,1520.0,98600,1553.0,1504.0
858,2018/02/27,1549.0,1543.535,1576.0,120300,1577.0,1506.0
859,2018/02/28,1540.0,1542.02,1542.0,61200,1565.0,1521.0
860,2018/03/01,1513.0,1513.597,1500.0,66800,1555.0,1486.0
861,2018/03/02,1527.0,1506.002,1490.0,68700,1530.0,1478.0
862,2018/03/05,1530.0,1546.168,1549.0,137100,1573.0,1516.0
863,2018/03/06,1612.0,1590.706,1570.0,87100,1615.0,1547.0
864,2018/03/07,1589.0,1605.146,1599.0,75400,1638.0,1569.0
865,2018/03/08,1646.0,1637.941,1629.0,94600,1670.0,1609.0
866,2018/03/09,1649.0,1657.707,1670.0,63800,1688.0,1629.0
867,2018/03/12,1625.0,1635.455,1659.0,53400,1670.0,1606.0
868,2018/03/13,1659.0,1643.69,1630.0,43200,1660.0,1619.0
869,2018/03/14,1664.0,1661.219,1659.0,53100,1684.0,1646.0
870,2018/03/15,1645.0,1654.415,1655.0,42400,1671.0,1640.0
871,2018/03/16,1614.0,1616.004,1645.0,46300,1646.0,1599.0
872,2018/03/19,1558.0,1565.127,1591.0,71700,1591.0,1520.0
873,2018/03/20,1582.0,1558.119,1537.0,35300,1594.0,1521.0
874,2018/03/22,1600.0,1587.581,1578.0,29100,1604.0,1575.0
875,2018/03/23,1507.0,1528.314,1547.0,55100,1568.0,1495.0
876,2018/03/26,1508.0,1476.613,1467.0,40800,1513.0,1433.0
877,2018/03/27,1530.0,1536.04,1545.0,37900,1567.0,1510.0
878,2018/03/28,1506.0,1517.163,1515.0,24600,1553.0,1502.0
879,2018/03/29,1537.0,1536.73,1516.0,28500,1561.0,1506.0
880,2018/03/30,1570.0,1559.385,1564.0,28600,1575.0,1536.0
881,2018/04/02,1532.0,1538.524,1555.0,35300,1574.0,1520.0
882,2018/04/03,1507.0,1505.556,1499.0,21600,1521.0,1493.0
883,2018/04/04,1495.0,1492.063,1517.0,24000,1519.0,1475.0
884,2018/04/05,1516.0,1508.214,1499.0,28500,1531.0,1481.0
885,2018/04/06,1501.0,1504.474,1516.0,25300,1529.0,1493.0
886,2018/04/09,1526.0,1511.681,1484.0,37000,1535.0,1482.0
887,2018/04/10,1504.0,1502.579,1519.0,22100,1524.0,1481.0
888,2018/04/11,1481.0,1478.037,1505.0,40200,1506.0,1467.0
889,2018/04/12,1479.0,1484.385,1494.0,37900,1523.0,1455.0
890,2018/04/13,1483.0,1475.847,1476.0,36700,1494.0,1455.0
891,2018/04/16,1410.0,1425.869,1477.0,40300,1477.0,1404.0
892,2018/04/17,1395.0,1389.584,1401.0,48300,1422.0,1362.0
893,2018/04/18,1406.0,1402.975,1391.0,35300,1415.0,1383.0
894,2018/04/19,1405.0,1403.806,1403.0,20100,1417.0,1390.0
895,2018/04/20,1470.0,1457.298,1413.0,41600,1478.0,1412.0
896,2018/04/23,1496.0,1473.242,1461.0,35100,1502.0,1434.0
897,2018/04/24,1509.0,1507.274,1503.0,27000,1527.0,1487.0
898,2018/04/25,1498.0,1502.057,1485.0,31400,1518.0,1481.0
899,2018/04/26,1465.0,1470.371,1497.0,67400,1509.0,1463.0
900,2018/04/27,1458.0,1456.132,1465.0,26600,1466.0,1448.0
901,2018/05/01,1433.0,1438.707,1445.0,22900,1456.0,1430.0
902,2018/05/02,1442.0,1438.38,1427.0,12100,1448.0,1427.0
903,2018/05/07,1456.0,1453.676,1451.0,10800,1460.0,1442.0
904,2018/05/08,1491.0,1486.043,1450.0,32800,1514.0,1450.0
905,2018/05/09,1493.0,1497.615,1480.0,37400,1525.0,1473.0
906,2018/05/10,1464.0,1468.14,1485.0,25700,1494.0,1453.0
907,2018/05/11,1573.0,1596.757,1610.0,177400,1628.0,1561.0
908,2018/05/14,1613.0,1591.006,1575.0,67700,1622.0,1537.0
909,2018/05/15,1601.0,1591.632,1619.0,45100,1620.0,1556.0
910,2018/05/16,1544.0,1568.164,1562.0,48700,1599.0,1538.0
911,2018/05/17,1560.0,1539.343,1546.0,50100,1561.0,1511.0
912,2018/05/18,1683.0,1665.93,1560.0,220800,1724.0,1560.0
913,2018/05/21,1692.0,1697.37,1689.0,64900,1713.0,1671.0
914,2018/05/22,1725.0,1750.793,1713.0,126300,1791.0,1702.0
915,2018/05/23,1718.0,1696.896,1703.0,59700,1730.0,1657.0
916,2018/05/24,1680.0,1714.409,1731.0,57000,1766.0,1675.0
917,2018/05/25,1759.0,1740.309,1677.0,107600,1767.0,1656.0
918,2018/05/28,1758.0,1752.817,1760.0,58400,1780.0,1723.0
919,2018/05/29,1657.0,1681.247,1757.0,76600,1757.0,1649.0
920,2018/05/30,1700.0,1709.845,1647.0,291400,1780.0,1591.0
921,2018/05/31,1720.0,1722.17,1729.0,76500,1757.0,1694.0
922,2018/06/01,1755.0,1738.137,1707.0,76000,1766.0,1706.0
923,2018/06/04,1776.0,1776.994,1759.0,76500,1810.0,1747.0
924,2018/06/05,1732.0,1751.538,1778.0,53200,1787.0,1719.0
925,2018/06/06,1649.0,1650.299,1714.0,153700,1724.0,1625.0
926,2018/06/07,1682.0,1661.236,1655.0,58800,1690.0,1631.0
927,2018/06/08,1671.0,1672.703,1661.0,23200,1692.0,1658.0
928,2018/06/11,1660.0,1660.861,1671.0,22300,1682.0,1649.0
929,2018/06/12,1682.0,1706.239,1678.0,56100,1736.0,1671.0
930,2018/06/13,1625.0,1633.91,1695.0,90200,1695.0,1614.0
931,2018/06/14,1593.0,1605.324,1624.0,47600,1633.0,1590.0
932,2018/06/15,1613.0,1618.485,1613.0,37700,1639.0,1601.0
933,2018/06/18,1631.0,1617.976,1639.0,79200,1654.0,1587.0
934,2018/06/19,1588.0,1609.362,1650.0,55200,1661.0,1579.0
935,2018/06/20,1585.0,1556.744,1582.0,62000,1588.0,1515.0
936,2018/06/21,1608.0,1627.348,1601.0,45400,1655.0,1597.0
937,2018/06/22,1619.0,1613.031,1603.0,26200,1633.0,1592.0
938,2018/06/25,1553.0,1585.845,1631.0,44400,1647.0,1541.0
939,2018/06/26,1536.0,1527.273,1536.0,52300,1554.0,1510.0
940,2018/06/27,1522.0,1528.573,1534.0,38900,1552.0,1506.0
941,2018/06/28,1493.0,1473.395,1514.0,97300,1515.0,1447.0
942,2018/06/29,1511.0,1510.536,1518.0,56400,1541.0,1478.0
943,2018/07/02,1505.0,1523.396,1518.0,53800,1547.0,1497.0
944,2018/07/03,1478.0,1492.868,1507.0,58300,1543.0,1456.0
945,2018/07/04,1423.0,1431.014,1462.0,88800,1466.0,1408.0
946,2018/07/05,1373.0,1389.427,1414.0,108900,1439.0,1365.0
947,2018/07/06,1430.0,1404.063,1382.0,41500,1431.0,1373.0
948,2018/07/09,1459.0,1444.583,1457.0,44800,1464.0,1420.0
949,2018/07/10,1454.0,1457.624,1470.0,32400,1474.0,1439.0
950,2018/07/11,1452.0,1431.098,1433.0,88400,1467.0,1414.0
951,2018/07/12,1495.0,1476.144,1440.0,45100,1498.0,1428.0
952,2018/07/13,1504.0,1501.682,1495.0,26700,1516.0,1490.0
953,2018/07/17,1522.0,1514.291,1501.0,35000,1531.0,1495.0
954,2018/07/18,1565.0,1547.831,1533.0,50300,1568.0,1520.0
955,2018/07/19,1551.0,1554.806,1577.0,35600,1579.0,1535.0
956,2018/07/20,1521.0,1530.21,1540.0,30500,1556.0,1512.0
957,2018/07/23,1480.0,1488.454,1510.0,44100,1510.0,1478.0
958,2018/07/24,1497.0,1491.423,1469.0,32400,1515.0,1469.0
959,2018/07/25,1524.0,1505.633,1501.0,22900,1524.0,1488.0
960,2018/07/26,1515.0,1519.559,1524.0,22200,1535.0,1503.0
961,2018/07/27,1506.0,1506.973,1520.0,22100,1520.0,1498.0
962,2018/07/30,1498.0,1489.879,1506.0,42300,1506.0,1477.0
963,2018/07/31,1515.0,1503.567,1491.0,46400,1530.0,1474.0
964,2018/08/01,1370.0,1377.723,1400.0,234600,1413.0,1363.0
965,2018/08/02,1325.0,1348.802,1384.0,117400,1387.0,1324.0
966,2018/08/03,1289.0,1304.196,1328.0,114600,1332.0,1286.0
967,2018/08/06,1302.0,1303.515,1293.0,50100,1326.0,1288.0
968,2018/08/07,1309.0,1301.876,1310.0,19300,1311.0,1289.0
969,2018/08/08,1343.0,1334.759,1313.0,52600,1352.0,1313.0
970,2018/08/09,1343.0,1344.231,1370.0,21200,1370.0,1326.0
971,2018/08/10,1330.0,1337.637,1343.0,36600,1358.0,1326.0
972,2018/08/13,1288.0,1294.394,1315.0,48500,1315.0,1285.0
973,2018/08/14,1303.0,1304.872,1290.0,24300,1315.0,1290.0
974,2018/08/15,1274.0,1280.493,1301.0,53100,1301.0,1268.0
975,2018/08/16,1251.0,1256.328,1265.0,41500,1270.0,1241.0
976,2018/08/17,1355.0,1346.658,1341.0,259200,1374.0,1310.0
977,2018/08/20,1355.0,1365.378,1357.0,65100,1382.0,1348.0
978,2018/08/21,1324.0,1327.833,1355.0,59200,1361.0,1315.0
979,2018/08/22,1380.0,1370.174,1325.0,69500,1386.0,1325.0
980,2018/08/23,1430.0,1409.431,1380.0,108000,1437.0,1368.0
981,2018/08/24,1428.0,1430.877,1430.0,47200,1443.0,1417.0
982,2018/08/27,1431.0,1429.202,1439.0,33100,1443.0,1407.0
983,2018/08/28,1404.0,1409.645,1418.0,43900,1438.0,1388.0
984,2018/08/29,1377.0,1391.015,1388.0,26800,1413.0,1377.0
985,2018/08/30,1393.0,1384.468,1364.0,31000,1397.0,1363.0
986,2018/08/31,1372.0,1372.172,1373.0,24400,1385.0,1362.0
987,2018/09/03,1331.0,1332.916,1367.0,47400,1367.0,1319.0
988,2018/09/04,1355.0,1351.557,1335.0,21200,1365.0,1331.0
989,2018/09/05,1351.0,1351.651,1365.0,24900,1365.0,1345.0
990,2018/09/06,1329.0,1331.624,1335.0,33000,1341.0,1316.0
991,2018/09/07,1366.0,1344.064,1315.0,53200,1373.0,1314.0
992,2018/09/10,1387.0,1376.513,1369.0,35700,1396.0,1352.0
993,2018/09/11,1383.0,1384.353,1391.0,42500,1396.0,1365.0
994,2018/09/12,1351.0,1365.559,1389.0,31300,1396.0,1346.0
995,2018/09/13,1376.0,1359.77,1351.0,31700,1377.0,1351.0
996,2018/09/14,1397.0,1394.526,1396.0,46800,1408.0,1374.0
997,2018/09/18,1443.0,1430.923,1408.0,80100,1461.0,1398.0
998,2018/09/19,1426.0,1437.358,1461.0,32400,1461.0,1423.0
999,2018/09/20,1422.0,1423.634,1433.0,46500,1433.0,1403.0
1000,2018/09/21,1447.0,1446.443,1424.0,40900,1456.0,1418.0
1001,2018/09/25,1489.0,1465.872,1457.0,65600,1489.0,1443.0
1002,2018/09/26,1479.0,1488.77,1492.0,28300,1506.0,1474.0
1003,2018/09/27,1460.0,1477.015,1497.0,40800,1506.0,1451.0
1004,2018/09/28,1492.0,1487.115,1490.0,38200,1502.0,1473.0
1005,2018/10/01,1510.0,1518.215,1513.0,45600,1536.0,1503.0
1006,2018/10/02,1500.0,1493.264,1512.0,42500,1512.0,1476.0
1007,2018/10/03,1471.0,1472.703,1498.0,28600,1498.0,1461.0
1008,2018/10/04,1470.0,1461.972,1466.0,28300,1486.0,1441.0
1009,2018/10/05,1439.0,1439.621,1441.0,23500,1465.0,1423.0
1010,2018/10/09,1434.0,1431.189,1433.0,17500,1447.0,1410.0
1011,2018/10/10,1416.0,1427.392,1434.0,33400,1456.0,1406.0
1012,2018/10/11,1340.0,1337.114,1326.0,52000,1358.0,1320.0
1013,2018/10/12,1375.0,1356.112,1322.0,37500,1384.0,1322.0
1014,2018/10/15,1336.0,1353.116,1375.0,39700,1379.0,1332.0
1015,2018/10/16,1348.0,1331.416,1340.0,21400,1350.0,1312.0
1016,2018/10/17,1377.0,1371.87,1363.0,19200,1387.0,1363.0
1017,2018/10/18,1371.0,1379.825,1374.0,18900,1405.0,1364.0
1018,2018/10/19,1373.0,1362.175,1367.0,19400,1383.0,1333.0
1019,2018/10/22,1382.0,1361.676,1364.0,10500,1382.0,1335.0
1020,2018/10/23,1344.0,1367.38,1400.0,22100,1400.0,1342.0
1021,2018/10/24,1340.0,1335.04,1368.0,35200,1368.0,1320.0
1022,2018/10/25,1256.0,1275.072,1300.0,62900,1301.0,1252.0
1023,2018/10/26,1231.0,1241.547,1276.0,89000,1288.0,1215.0
1024,2018/10/29,1174.0,1203.323,1226.0,98600,1249.0,1167.0
1025,2018/10/30,1311.0,1229.56,1151.0,104700,1318.0,1151.0
1026,2018/10/31,1321.0,1311.18,1339.0,47300,1340.0,1272.0
1027,2018/11/01,1441.0,1406.434,1351.0,164400,1448.0,1331.0
1028,2018/11/02,1362.0,1398.906,1426.0,102200,1447.0,1362.0
1029,2018/11/05,1324.0,1343.65,1363.0,62600,1368.0,1322.0
1030,2018/11/06,1325.0,1322.444,1324.0,52300,1343.0,1301.0
1031,2018/11/07,1363.0,1367.004,1325.0,49300,1400.0,1322.0
1032,2018/11/08,1405.0,1414.863,1388.0,41000,1434.0,1388.0
1033,2018/11/09,1441.0,1435.704,1405.0,47300,1456.0,1395.0
1034,2018/11/12,1399.0,1396.791,1399.0,46800,1418.0,1384.0
1035,2018/11/13,1424.0,1376.187,1340.0,152200,1430.0,1299.0
1036,2018/11/14,1275.0,1319.748,1420.0,139500,1422.0,1273.0
1037,2018/11/15,1255.0,1274.475,1280.0,46100,1300.0,1254.0
1038,2018/11/16,1236.0,1249.074,1270.0,70000,1283.0,1225.0
1039,2018/11/19,1254.0,1266.124,1239.0,42700,1292.0,1229.0
1040,2018/11/20,1222.0,1225.667,1235.0,67800,1241.0,1201.0
1041,2018/11/21,1263.0,1242.439,1222.0,29400,1270.0,1203.0
1042,2018/11/22,1292.0,1280.819,1269.0,26000,1296.0,1250.0
1043,2018/11/26,1307.0,1319.304,1299.0,42800,1342.0,1290.0
1044,2018/11/27,1321.0,1320.493,1337.0,21700,1337.0,1308.0
1045,2018/11/28,1384.0,1375.319,1330.0,50500,1398.0,1330.0
1046,2018/11/29,1407.0,1395.945,1398.0,52300,1420.0,1376.0
1047,2018/11/30,1404.0,1418.768,1418.0,43600,1447.0,1385.0
1048,2018/12/03,1390.0,1401.502,1413.0,23700,1427.0,1381.0
1049,2018/12/04,1339.0,1358.421,1382.0,39000,1398.0,1328.0
1050,2018/12/05,1324.0,1330.54,1315.0,23700,1349.0,1310.0
1051,2018/12/06,1286.0,1292.965,1319.0,28200,1327.0,1273.0
1052,2018/12/07,1275.0,1278.996,1303.0,24900,1306.0,1263.0
1053,2018/12/10,1237.0,1245.269,1245.0,34200,1270.0,1235.0
1054,2018/12/11,1215.0,1228.182,1243.0,56100,1260.0,1208.0
1055,2018/12/12,1272.0,1242.36,1217.0,35800,1276.0,1217.0
1056,2018/12/13,1298.0,1289.154,1288.0,26700,1304.0,1265.0
1057,2018/12/14,1258.0,1278.75,1300.0,23600,1307.0,1256.0
1058,2018/12/17,1230.0,1238.285,1258.0,27700,1258.0,1219.0
1059,2018/12/18,1193.0,1198.021,1204.0,110700,1214.0,1182.0
1060,2018/12/19,1228.0,1214.777,1204.0,40300,1239.0,1183.0
1061,2018/12/20,1144.0,1157.962,1198.0,138800,1205.0,1130.0
1062,2018/12/21,1084.0,1083.303,1131.0,92800,1132.0,1038.0
1063,2018/12/25,1018.0,1008.22,995.0,93100,1036.0,985.0
1064,2018/12/26,1047.0,1046.128,1050.0,108700,1065.0,1019.0
1065,2018/12/27,1108.0,1098.342,1123.0,36800,1123.0,1074.0
1066,2018/12/28,1074.0,1077.249,1087.0,20500,1095.0,1060.0
1067,2019/01/04,1061.0,1043.969,1050.0,36000,1061.0,1024.0
1068,2019/01/07,1086.0,1092.862,1102.0,23100,1105.0,1078.0
1069,2019/01/08,1098.0,1104.297,1106.0,29300,1117.0,1094.0
1070,2019/01/09,1112.0,1128.319,1113.0,35400,1153.0,1103.0
1071,2019/01/10,1076.0,1084.239,1112.0,20900,1112.0,1066.0
1072,2019/01/11,1086.0,1089.936,1100.0,17100,1108.0,1080.0
1073,2019/01/15,1106.0,1101.828,1086.0,21500,1116.0,1077.0
1074,2019/01/16,1103.0,1107.021,1118.0,14100,1125.0,1097.0
1075,2019/01/17,1121.0,1115.669,1113.0,14500,1128.0,1100.0
1076,2019/01/18,1122.0,1124.942,1128.0,18800,1143.0,1108.0
1077,2019/01/21,1166.0,1167.926,1144.0,47200,1193.0,1141.0
1078,2019/01/22,1127.0,1138.035,1155.0,20200,1161.0,1124.0
1079,2019/01/23,1111.0,1107.515,1101.0,16500,1120.0,1096.0
1080,2019/01/24,1115.0,1105.94,1103.0,8300,1117.0,1095.0
1081,2019/01/25,1125.0,1130.058,1115.0,15600,1144.0,1115.0
1082,2019/01/28,1121.0,1121.919,1129.0,18400,1135.0,1109.0
1083,2019/01/29,1127.0,1112.215,1121.0,13000,1127.0,1101.0
1084,2019/01/30,1084.0,1096.905,1123.0,30500,1127.0,1080.0
1085,2019/01/31,1123.0,1119.968,1090.0,25000,1136.0,1090.0
1086,2019/02/01,1131.0,1158.46,1153.0,48100,1193.0,1125.0
1087,2019/02/04,1186.0,1177.59,1131.0,41000,1198.0,1131.0
1088,2019/02/05,1197.0,1202.874,1192.0,31800,1224.0,1188.0
1089,2019/02/06,1194.0,1196.069,1215.0,14500,1215.0,1182.0
1090,2019/02/07,1161.0,1159.993,1192.0,14900,1192.0,1145.0
1091,2019/02/08,1125.0,1135.581,1147.0,27700,1160.0,1118.0
1092,2019/02/12,1173.0,1165.214,1130.0,19600,1178.0,1130.0
1093,2019/02/13,1234.0,1220.547,1198.0,75500,1245.0,1190.0
1094,2019/02/14,1269.0,1273.075,1242.0,60400,1289.0,1239.0
1095,2019/02/15,1225.0,1247.097,1267.0,25700,1270.0,1222.0
1096,2019/02/18,1351.0,1309.326,1251.0,105300,1363.0,1250.0
1097,2019/02/19,1347.0,1357.555,1360.0,63400,1379.0,1339.0
1098,2019/02/20,1338.0,1344.483,1332.0,30000,1368.0,1332.0
1099,2019/02/21,1326.0,1330.614,1338.0,16300,1345.0,1319.0
1100,2019/02/22,1340.0,1327.136,1334.0,19900,1345.0,1309.0
1101,2019/02/25,1332.0,1332.523,1340.0,12800,1347.0,1321.0
1102,2019/02/26,1288.0,1295.464,1332.0,23900,1338.0,1273.0
1103,2019/02/27,1288.0,1290.664,1287.0,27400,1314.0,1276.0
1104,2019/02/28,1275.0,1283.356,1288.0,10400,1302.0,1273.0
1105,2019/03/01,1298.0,1296.32,1273.0,21900,1312.0,1273.0
1106,2019/03/04,1312.0,1314.475,1312.0,41900,1335.0,1297.0
1107,2019/03/05,1301.0,1297.894,1300.0,18000,1314.0,1288.0
1108,2019/03/06,1287.0,1286.907,1292.0,21600,1309.0,1272.0
1109,2019/03/07,1292.0,1295.906,1294.0,55200,1323.0,1275.0
1110,2019/03/08,1257.0,1271.056,1279.0,49800,1289.0,1245.0
1111,2019/03/11,1318.0,1286.276,1265.0,63500,1319.0,1255.0
1112,2019/03/12,1349.0,1355.91,1347.0,62000,1370.0,1333.0
1113,2019/03/13,1373.0,1354.42,1350.0,62700,1379.0,1331.0
1114,2019/03/14,1335.0,1378.657,1383.0,55700,1409.0,1326.0
1115,2019/03/15,1384.0,1388.4,1340.0,66500,1415.0,1340.0
1116,2019/03/18,1372.0,1384.562,1405.0,38100,1405.0,1356.0
1117,2019/03/19,1440.0,1415.502,1366.0,161500,1464.0,1344.0
1118,2019/03/20,1422.0,1421.997,1431.0,30400,1435.0,1404.0
1119,2019/03/22,1397.0,1403.621,1429.0,30900,1429.0,1380.0
1120,2019/03/25,1369.0,1359.297,1357.0,26900,1372.0,1345.0
1121,2019/03/26,1368.0,1367.597,1367.0,36000,1384.0,1360.0
1122,2019/03/27,1380.0,1375.934,1364.0,33400,1393.0,1352.0
1123,2019/03/28,1355.0,1356.18,1380.0,21700,1380.0,1343.0
1124,2019/03/29,1367.0,1350.157,1365.0,37600,1376.0,1326.0
1125,2019/04/01,1399.0,1388.687,1379.0,44700,1412.0,1357.0
1126,2019/04/02,1353.0,1371.07,1415.0,28400,1415.0,1348.0
1127,2019/04/03,1348.0,1342.158,1354.0,16500,1357.0,1326.0
1128,2019/04/04,1323.0,1339.616,1350.0,16400,1361.0,1322.0
1129,2019/04/05,1312.0,1319.496,1318.0,13900,1340.0,1311.0
1130,2019/04/08,1313.0,1313.972,1311.0,14200,1324.0,1309.0
1131,2019/04/09,1307.0,1304.193,1313.0,25400,1318.0,1293.0
1132,2019/04/10,1325.0,1312.338,1305.0,7400,1325.0,1299.0
1133,2019/04/11,1261.0,1281.203,1329.0,45800,1336.0,1258.0
1134,2019/04/12,1247.0,1251.673,1255.0,31500,1263.0,1242.0
1135,2019/04/15,1270.0,1268.81,1261.0,21100,1280.0,1260.0
1136,2019/04/16,1247.0,1259.377,1272.0,22000,1286.0,1243.0
1137,2019/04/17,1249.0,1247.587,1266.0,25900,1274.0,1237.0
1138,2019/04/18,1209.0,1216.896,1245.0,37500,1245.0,1207.0
1139,2019/04/19,1222.0,1219.315,1217.0,16200,1225.0,1212.0
1140,2019/04/22,1213.0,1214.891,1227.0,11000,1227.0,1205.0
1141,2019/04/23,1219.0,1211.366,1213.0,9300,1221.0,1201.0
1142,2019/04/24,1202.0,1210.262,1219.0,21400,1227.0,1201.0
1143,2019/04/25,1216.0,1209.603,1202.0,12100,1218.0,1198.0
1144,2019/04/26,1217.0,1210.424,1216.0,14400,1220.0,1192.0
1145,2019/05/07,1201.0,1209.153,1211.0,15700,1225.0,1197.0
1146,2019/05/08,1190.0,1191.031,1185.0,25500,1203.0,1182.0
1147,2019/05/09,1183.0,1178.211,1193.0,25100,1193.0,1166.0
1148,2019/05/10,1191.0,1186.665,1178.0,30100,1207.0,1167.0
1149,2019/05/13,1190.0,1189.222,1206.0,31600,1206.0,1172.0
1150,2019/05/14,1161.0,1096.459,1070.0,80700,1174.0,1044.0
1151,2019/05/15,1104.0,1109.693,1161.0,44000,1161.0,1093.0
1152,2019/05/16,1096.0,1092.321,1110.0,24300,1112.0,1080.0
1153,2019/05/17,1126.0,1124.89,1110.0,28200,1141.0,1108.0
1154,2019/05/20,1104.0,1111.118,1125.0,18600,1139.0,1098.0
1155,2019/05/21,1096.0,1077.774,1099.0,21200,1099.0,1059.0
1156,2019/05/22,1125.0,1119.511,1111.0,18400,1130.0,1096.0
1157,2019/05/23,1102.0,1110.654,1127.0,18200,1139.0,1100.0
1158,2019/05/24,1111.0,1106.897,1114.0,20300,1122.0,1092.0
1159,2019/05/27,1119.0,1117.792,1137.0,13000,1137.0,1105.0
1160,2019/05/28,1134.0,1125.45,1124.0,34700,1137.0,1118.0
1161,2019/05/29,1103.0,1104.961,1125.0,15400,1125.0,1095.0
1162,2019/05/30,1092.0,1094.703,1099.0,16500,1105.0,1088.0
1163,2019/05/31,1080.0,1091.894,1103.0,28300,1107.0,1080.0
1164,2019/06/03,1028.0,1035.934,1073.0,89600,1073.0,1022.0
1165,2019/06/04,1057.0,1035.618,1030.0,39800,1057.0,1020.0
1166,2019/06/05,1167.0,1132.195,1117.0,83000,1169.0,1094.0
1167,2019/06/06,1173.0,1173.676,1169.0,82300,1209.0,1142.0
1168,2019/06/07,1167.0,1185.429,1200.0,54100,1207.0,1159.0
1169,2019/06/10,1232.0,1220.112,1197.0,75300,1242.0,1185.0
1170,2019/06/11,1277.0,1268.514,1247.0,86200,1290.0,1228.0
1171,2019/06/12,1273.0,1268.333,1270.0,56400,1287.0,1243.0
1172,2019/06/13,1229.0,1235.787,1256.0,41300,1262.0,1221.0
1173,2019/06/14,1228.0,1231.679,1225.0,15900,1247.0,1214.0
1174,2019/06/17,1198.0,1201.968,1218.0,18600,1235.0,1190.0
1175,2019/06/18,1196.0,1214.306,1232.0,37600,1240.0,1194.0
1176,2019/06/19,1216.0,1222.229,1216.0,31400,1238.0,1205.0
1177,2019/06/20,1221.0,1219.637,1226.0,10200,1226.0,1205.0
1178,2019/06/21,1205.0,1208.449,1222.0,15800,1222.0,1198.0
1179,2019/06/24,1209.0,1197.343,1207.0,14000,1209.0,1182.0
1180,2019/06/25,1192.0,1197.469,1203.0,14700,1219.0,1188.0
1181,2019/06/26,1176.0,1177.3,1183.0,11000,1186.0,1166.0
1182,2019/06/27,1171.0,1173.236,1177.0,14000,1188.0,1168.0
1183,2019/06/28,1174.0,1174.504,1170.0,13300,1190.0,1161.0
1184,2019/07/01,1227.0,1213.719,1198.0,21000,1229.0,1195.0
1185,2019/07/02,1221.0,1219.932,1239.0,17600,1240.0,1208.0
1186,2019/07/03,1209.0,1209.678,1221.0,14300,1224.0,1199.0
1187,2019/07/04,1220.0,1218.049,1209.0,10300,1226.0,1209.0
1188,2019/07/05,1216.0,1215.732,1234.0,16800,1234.0,1208.0
1189,2019/07/08,1207.0,1207.837,1206.0,9200,1215.0,1205.0
1190,2019/07/09,1189.0,1191.693,1203.0,25400,1203.0,1178.0
1191,2019/07/10,1178.0,1179.927,1181.0,22000,1191.0,1175.0
1192,2019/07/11,1228.0,1209.78,1190.0,36300,1228.0,1182.0
1193,2019/07/12,1219.0,1219.865,1234.0,11100,1234.0,1211.0
1194,2019/07/16,1216.0,1211.409,1219.0,6600,1219.0,1204.0
1195,2019/07/17,1188.0,1187.447,1203.0,23700,1203.0,1181.0
1196,2019/07/18,1175.0,1182.197,1188.0,14700,1195.0,1173.0
1197,2019/07/19,1209.0,1203.912,1192.0,11300,1217.0,1190.0
1198,2019/07/22,1216.0,1213.12,1213.0,9200,1220.0,1197.0
1199,2019/07/23,1216.0,1224.467,1225.0,19900,1234.0,1209.0
1200,2019/07/24,1235.0,1229.531,1235.0,14500,1235.0,1219.0
1201,2019/07/25,1259.0,1248.563,1235.0,17400,1259.0,1235.0
1202,2019/07/26,1237.0,1245.245,1261.0,9800,1263.0,1233.0
1203,2019/07/29,1260.0,1258.36,1266.0,18600,1273.0,1250.0
1204,2019/07/30,1268.0,1260.336,1274.0,12200,1274.0,1250.0
1205,2019/07/31,1249.0,1254.045,1265.0,20000,1266.0,1244.0
1206,2019/08/01,1307.0,1286.935,1275.0,83300,1314.0,1220.0
1207,2019/08/02,1316.0,1307.47,1300.0,49800,1318.0,1285.0
1208,2019/08/05,1320.0,1310.915,1345.0,70600,1347.0,1270.0
1209,2019/08/06,1323.0,1299.364,1260.0,38500,1328.0,1254.0
1210,2019/08/07,1292.0,1302.348,1323.0,33300,1327.0,1283.0
1211,2019/08/08,1351.0,1335.879,1297.0,46200,1362.0,1282.0
1212,2019/08/09,1334.0,1337.84,1360.0,24300,1360.0,1317.0
1213,2019/08/13,1320.0,1317.396,1321.0,18200,1336.0,1288.0
1214,2019/08/14,1311.0,1315.917,1344.0,15700,1344.0,1300.0
1215,2019/08/15,1284.0,1275.919,1264.0,32000,1292.0,1264.0
1216,2019/08/16,1314.0,1297.174,1268.0,28200,1325.0,1268.0
1217,2019/08/19,1330.0,1331.653,1325.0,17000,1344.0,1318.0
1218,2019/08/20,1316.0,1327.395,1325.0,15200,1344.0,1314.0
1219,2019/08/21,1312.0,1317.433,1316.0,17800,1333.0,1310.0
1220,2019/08/22,1315.0,1313.863,1320.0,15300,1328.0,1306.0
1221,2019/08/23,1310.0,1310.623,1314.0,15400,1320.0,1305.0
