,Date,Close,VWAP,Open,Volume,High,Low
0,2014/08/25,594.0,587.228,586.0,110400,597.0,579.0
1,2014/08/26,596.0,595.0,598.0,43300,598.0,592.0
2,2014/08/27,593.0,591.32,596.0,63400,596.0,588.0
3,2014/08/28,599.0,596.733,591.0,68200,604.0,590.0
4,2014/08/29,613.0,606.101,599.0,128600,617.0,599.0
5,2014/09/01,622.0,622.141,616.0,79500,625.0,616.0
6,2014/09/02,623.0,627.396,625.0,88700,634.0,622.0
7,2014/09/03,629.0,627.55,625.0,82200,632.0,617.0
8,2014/09/04,623.0,625.383,629.0,81300,630.0,619.0
9,2014/09/05,649.0,657.111,668.0,619700,673.0,638.0
10,2014/09/08,631.0,630.696,630.0,190400,636.0,623.0
11,2014/09/09,639.0,639.355,632.0,92100,647.0,632.0
12,2014/09/10,637.0,635.214,636.0,62200,640.0,631.0
13,2014/09/11,648.0,638.745,633.0,85900,648.0,633.0
14,2014/09/12,643.0,642.319,640.0,69700,647.0,638.0
15,2014/09/16,652.0,649.186,645.0,84800,653.0,645.0
16,2014/09/17,657.0,658.037,657.0,90900,661.0,656.0
17,2014/09/18,656.0,656.12,658.0,48400,659.0,654.0
18,2014/09/19,649.0,651.254,657.0,42500,657.0,647.0
19,2014/09/22,651.0,647.005,644.0,41700,651.0,644.0
20,2014/09/24,655.0,650.089,651.0,45900,655.0,645.0
21,2014/09/25,656.0,654.179,656.0,56900,656.0,650.0
22,2014/09/26,663.0,655.874,646.0,54900,663.0,646.0
23,2014/09/29,664.0,662.286,670.0,57800,670.0,654.0
24,2014/09/30,664.0,660.946,664.0,89100,666.0,654.0
25,2014/10/01,668.0,665.152,666.0,83800,669.0,658.0
26,2014/10/02,653.0,657.388,664.0,61800,664.0,649.0
27,2014/10/03,658.0,654.04,650.0,30000,658.0,649.0
28,2014/10/06,660.0,658.776,660.0,40600,662.0,655.0
29,2014/10/07,650.0,652.257,657.0,73600,658.0,645.0
30,2014/10/08,664.0,658.651,636.0,277300,668.0,635.0
31,2014/10/09,654.0,657.122,662.0,110200,664.0,640.0
32,2014/10/10,643.0,649.992,651.0,87900,658.0,636.0
33,2014/10/14,627.0,630.232,641.0,93900,641.0,612.0
34,2014/10/15,635.0,635.228,627.0,69600,647.0,626.0
35,2014/10/16,629.0,631.95,630.0,114800,637.0,626.0
36,2014/10/17,622.0,628.999,624.0,98800,635.0,620.0
37,2014/10/20,642.0,634.93,627.0,34300,642.0,627.0
38,2014/10/21,642.0,640.02,644.0,25000,645.0,635.0
39,2014/10/22,646.0,644.546,642.0,18500,646.0,641.0
40,2014/10/23,655.0,652.028,649.0,35700,655.0,645.0
41,2014/10/24,655.0,656.519,659.0,27000,659.0,654.0
42,2014/10/27,654.0,649.302,652.0,56600,655.0,637.0
43,2014/10/28,640.0,644.725,654.0,55700,655.0,637.0
44,2014/10/29,641.0,644.18,645.0,81100,650.0,640.0
45,2014/10/30,631.0,632.295,637.0,195600,641.0,621.0
46,2014/10/31,639.0,644.857,631.0,419800,658.0,631.0
47,2014/11/04,660.0,660.192,654.0,179400,664.0,652.0
48,2014/11/05,673.0,670.382,664.0,178900,673.0,664.0
49,2014/11/06,666.0,668.387,673.0,82400,674.0,657.0
50,2014/11/07,666.0,664.391,664.0,40900,667.0,662.0
51,2014/11/10,665.0,660.438,652.0,65600,668.0,649.0
52,2014/11/11,626.0,624.933,626.0,308500,634.0,613.0
53,2014/11/12,621.0,622.283,622.0,94000,628.0,618.0
54,2014/11/13,631.0,626.662,620.0,102200,634.0,618.0
55,2014/11/14,635.0,631.918,635.0,84600,636.0,625.0
56,2014/11/17,619.0,624.805,628.0,77100,631.0,619.0
57,2014/11/18,626.0,625.395,623.0,56500,628.0,621.0
58,2014/11/19,618.0,621.448,629.0,78300,629.0,618.0
59,2014/11/20,615.0,619.005,627.0,97600,627.0,613.0
60,2014/11/21,617.0,612.841,615.0,107100,619.0,607.0
61,2014/11/25,613.0,613.252,617.0,65600,618.0,611.0
62,2014/11/26,629.0,620.077,610.0,165400,631.0,609.0
63,2014/11/27,624.0,627.21,631.0,74200,631.0,624.0
64,2014/11/28,630.0,628.902,625.0,31700,631.0,625.0
65,2014/12/01,628.0,626.54,626.0,77800,629.0,623.0
66,2014/12/02,622.0,617.915,623.0,91200,623.0,613.0
67,2014/12/03,618.0,622.666,625.0,74900,627.0,618.0
68,2014/12/04,609.0,612.442,615.0,104600,619.0,606.0
69,2014/12/05,612.0,610.148,606.0,76500,616.0,605.0
70,2014/12/08,614.0,615.549,615.0,47700,618.0,613.0
71,2014/12/09,608.0,612.179,613.0,48600,618.0,608.0
72,2014/12/10,607.0,608.65,610.0,59500,612.0,606.0
73,2014/12/11,604.0,603.093,605.0,72000,607.0,601.0
74,2014/12/12,606.0,606.571,604.0,45400,611.0,604.0
75,2014/12/15,605.0,605.541,606.0,67300,613.0,602.0
76,2014/12/16,600.0,600.413,601.0,83800,603.0,598.0
77,2014/12/17,596.0,598.602,597.0,37900,602.0,596.0
78,2014/12/18,599.0,599.424,599.0,50300,602.0,597.0
79,2014/12/19,599.0,599.162,602.0,44500,602.0,597.0
80,2014/12/22,603.0,600.634,598.0,65500,606.0,597.0
81,2014/12/24,603.0,601.455,602.0,78200,604.0,599.0
82,2014/12/25,596.0,598.281,600.0,108600,600.0,595.0
83,2014/12/26,603.0,600.68,596.0,21900,603.0,596.0
84,2014/12/29,606.0,603.894,603.0,53500,607.0,601.0
85,2014/12/30,603.0,605.497,606.0,49500,609.0,603.0
86,2015/01/05,608.0,608.336,604.0,46800,612.0,603.0
87,2015/01/06,602.0,605.568,608.0,42400,609.0,602.0
88,2015/01/07,600.0,600.623,601.0,30800,604.0,599.0
89,2015/01/08,600.0,599.605,599.0,21000,602.0,598.0
90,2015/01/09,600.0,598.896,598.0,28000,601.0,598.0
91,2015/01/13,597.0,596.268,598.0,54100,601.0,593.0
92,2015/01/14,590.0,592.011,593.0,36300,594.0,590.0
93,2015/01/15,597.0,592.896,590.0,48800,600.0,587.0
94,2015/01/16,588.0,589.451,591.0,31700,594.0,587.0
95,2015/01/19,588.0,588.884,589.0,25900,591.0,587.0
96,2015/01/20,590.0,589.234,593.0,17500,593.0,588.0
97,2015/01/21,588.0,589.311,590.0,16100,593.0,587.0
98,2015/01/22,588.0,586.84,588.0,21900,589.0,585.0
99,2015/01/23,595.0,592.558,588.0,66000,600.0,588.0
100,2015/01/26,598.0,596.786,597.0,18700,600.0,593.0
101,2015/01/27,600.0,598.902,596.0,21500,601.0,596.0
102,2015/01/28,604.0,599.043,599.0,23400,604.0,595.0
103,2015/01/29,601.0,601.255,601.0,20400,604.0,599.0
104,2015/01/30,603.0,601.341,602.0,46300,604.0,599.0
105,2015/02/02,600.0,601.401,601.0,28700,604.0,599.0
106,2015/02/03,599.0,599.901,600.0,27200,603.0,598.0
107,2015/02/04,602.0,600.053,599.0,20600,602.0,598.0
108,2015/02/05,601.0,602.178,602.0,63600,604.0,601.0
109,2015/02/06,599.0,598.229,600.0,31900,601.0,595.0
110,2015/02/09,586.0,588.053,590.0,76100,592.0,585.0
111,2015/02/10,587.0,584.28,580.0,53200,589.0,580.0
112,2015/02/12,591.0,591.497,587.0,36800,598.0,587.0
113,2015/02/13,593.0,589.58,586.0,23800,596.0,586.0
114,2015/02/16,591.0,589.752,593.0,50000,597.0,585.0
115,2015/02/17,578.0,579.683,590.0,81000,590.0,574.0
116,2015/02/18,578.0,579.347,585.0,47900,585.0,577.0
117,2015/02/19,570.0,571.725,576.0,84100,576.0,568.0
118,2015/02/20,573.0,572.231,570.0,102100,579.0,568.0
119,2015/02/23,574.0,571.603,573.0,60200,574.0,569.0
120,2015/02/24,574.0,572.837,570.0,57100,577.0,570.0
121,2015/02/25,577.0,575.403,575.0,50600,578.0,571.0
122,2015/02/26,585.0,581.557,577.0,62100,586.0,577.0
123,2015/02/27,584.0,584.66,585.0,44400,586.0,581.0
124,2015/03/02,584.0,584.896,583.0,35600,587.0,583.0
125,2015/03/03,586.0,585.777,585.0,34500,588.0,584.0
126,2015/03/04,582.0,582.462,584.0,34600,585.0,580.0
127,2015/03/05,583.0,583.513,582.0,31600,586.0,582.0
128,2015/03/06,582.0,581.099,585.0,56800,585.0,577.0
129,2015/03/09,575.0,576.368,578.0,46500,581.0,574.0
130,2015/03/10,573.0,574.386,577.0,46600,580.0,572.0
131,2015/03/11,573.0,572.015,571.0,34600,575.0,571.0
132,2015/03/12,569.0,570.33,572.0,69200,573.0,568.0
133,2015/03/13,571.0,571.393,573.0,54200,573.0,568.0
134,2015/03/16,573.0,571.992,570.0,65500,575.0,570.0
135,2015/03/17,576.0,574.952,571.0,66000,578.0,571.0
136,2015/03/18,578.0,577.012,574.0,48900,580.0,574.0
137,2015/03/19,576.0,576.22,579.0,70000,580.0,573.0
138,2015/03/20,570.0,570.998,576.0,125000,582.0,567.0
139,2015/03/23,574.0,574.015,575.0,60900,576.0,572.0
140,2015/03/24,575.0,574.977,575.0,30900,577.0,573.0
141,2015/03/25,565.0,568.094,572.0,136600,572.0,563.0
142,2015/03/26,568.0,565.297,561.0,284300,576.0,561.0
143,2015/03/27,560.0,558.071,556.0,89300,563.0,555.0
144,2015/03/30,549.0,551.048,557.0,155600,559.0,548.0
145,2015/03/31,555.0,551.958,549.0,90700,557.0,549.0
146,2015/04/01,552.0,553.525,555.0,48600,556.0,550.0
147,2015/04/02,558.0,558.462,556.0,51300,561.0,555.0
148,2015/04/03,562.0,561.436,562.0,36900,563.0,560.0
149,2015/04/06,561.0,561.003,562.0,37000,563.0,558.0
150,2015/04/07,564.0,562.158,562.0,27300,564.0,560.0
151,2015/04/08,568.0,565.74,561.0,62300,569.0,561.0
152,2015/04/09,570.0,568.494,570.0,32200,570.0,566.0
153,2015/04/10,570.0,569.187,570.0,31000,571.0,566.0
154,2015/04/13,559.0,562.986,570.0,65600,570.0,558.0
155,2015/04/14,566.0,563.428,560.0,36200,567.0,560.0
156,2015/04/15,565.0,565.683,569.0,37200,569.0,562.0
157,2015/04/16,567.0,563.219,565.0,34700,567.0,559.0
158,2015/04/17,567.0,565.731,567.0,32000,568.0,562.0
159,2015/04/20,561.0,562.167,560.0,22200,566.0,560.0
160,2015/04/21,561.0,561.481,560.0,33500,564.0,560.0
161,2015/04/22,563.0,563.169,565.0,48400,567.0,560.0
162,2015/04/23,561.0,563.321,563.0,40200,566.0,560.0
163,2015/04/24,559.0,560.795,559.0,92000,565.0,557.0
164,2015/04/27,557.0,556.565,555.0,43400,559.0,555.0
165,2015/04/28,555.0,557.184,559.0,127400,563.0,554.0
166,2015/04/30,560.0,558.676,556.0,73800,563.0,555.0
167,2015/05/01,555.0,554.122,560.0,78800,560.0,551.0
168,2015/05/07,562.0,563.404,557.0,63800,568.0,557.0
169,2015/05/08,565.0,566.484,564.0,43000,569.0,564.0
170,2015/05/11,564.0,564.65,566.0,58600,568.0,558.0
171,2015/05/12,551.0,551.053,552.0,92800,554.0,548.0
172,2015/05/13,539.0,543.828,548.0,113700,550.0,539.0
173,2015/05/14,545.0,542.208,546.0,50600,546.0,539.0
174,2015/05/15,548.0,546.739,545.0,24500,548.0,545.0
175,2015/05/18,548.0,548.401,550.0,37400,550.0,546.0
176,2015/05/19,551.0,550.92,548.0,22500,553.0,548.0
177,2015/05/20,552.0,549.614,548.0,25100,552.0,547.0
178,2015/05/21,551.0,550.889,547.0,23400,554.0,547.0
179,2015/05/22,552.0,552.047,554.0,17100,554.0,548.0
180,2015/05/25,552.0,552.207,552.0,17400,554.0,550.0
181,2015/05/26,550.0,549.923,550.0,15600,551.0,549.0
182,2015/05/27,540.0,540.424,540.0,65600,546.0,539.0
183,2015/05/28,541.0,540.886,541.0,32400,544.0,539.0
184,2015/05/29,542.0,542.818,541.0,23100,545.0,541.0
185,2015/06/01,544.0,544.711,542.0,23900,548.0,542.0
186,2015/06/02,546.0,545.913,547.0,25200,548.0,544.0
187,2015/06/03,546.0,545.99,545.0,20400,548.0,543.0
188,2015/06/04,545.0,546.981,548.0,21000,548.0,545.0
189,2015/06/05,541.0,542.453,545.0,38200,547.0,540.0
190,2015/06/08,542.0,542.94,541.0,29900,547.0,540.0
191,2015/06/09,540.0,541.93,542.0,24300,544.0,540.0
192,2015/06/10,538.0,539.888,540.0,24900,544.0,538.0
193,2015/06/11,540.0,540.04,539.0,27800,542.0,537.0
194,2015/06/12,531.0,534.625,539.0,157700,539.0,531.0
195,2015/06/15,529.0,529.043,530.0,80600,533.0,526.0
196,2015/06/16,528.0,529.658,529.0,44100,532.0,528.0
197,2015/06/17,523.0,523.987,527.0,62600,527.0,521.0
198,2015/06/18,516.0,518.789,521.0,109200,522.0,516.0
199,2015/06/19,512.0,512.373,516.0,103000,516.0,507.0
200,2015/06/22,514.0,511.335,510.0,52300,514.0,507.0
201,2015/06/23,516.0,513.156,515.0,88400,516.0,509.0
202,2015/06/24,517.0,516.706,517.0,51700,517.0,515.0
203,2015/06/25,512.0,514.61,517.0,81000,518.0,510.0
204,2015/06/26,510.0,510.544,510.0,47600,513.0,508.0
205,2015/06/29,503.0,504.994,508.0,64600,508.0,501.0
206,2015/06/30,500.0,501.482,503.0,90700,505.0,499.0
207,2015/07/01,506.0,505.378,501.0,48400,508.0,500.0
208,2015/07/02,505.0,506.1,506.0,22900,508.0,505.0
209,2015/07/03,509.0,508.554,507.0,41700,512.0,505.0
210,2015/07/06,506.0,506.559,509.0,69400,509.0,504.0
211,2015/07/07,512.0,512.761,506.0,58500,517.0,506.0
212,2015/07/08,502.0,505.594,512.0,63100,515.0,500.0
213,2015/07/09,490.0,489.633,499.0,100200,499.0,483.0
214,2015/07/10,489.0,490.537,488.0,39500,495.0,487.0
215,2015/07/13,495.0,493.18,489.0,19400,498.0,487.0
216,2015/07/14,501.0,500.686,499.0,26100,504.0,497.0
217,2015/07/15,505.0,506.238,507.0,32400,511.0,502.0
218,2015/07/16,507.0,504.802,505.0,12600,507.0,502.0
219,2015/07/17,506.0,506.0,507.0,4400,507.0,505.0
220,2015/07/21,514.0,511.819,507.0,42600,517.0,506.0
221,2015/07/22,509.0,513.756,514.0,23800,519.0,509.0
222,2015/07/23,510.0,510.686,513.0,15300,514.0,507.0
223,2015/07/24,504.0,505.099,510.0,18100,510.0,502.0
224,2015/07/27,499.0,499.98,504.0,25500,504.0,497.0
225,2015/07/28,499.0,500.086,498.0,26700,505.0,495.0
226,2015/07/29,502.0,501.07,500.0,11500,504.0,499.0
227,2015/07/30,501.0,501.387,502.0,20400,504.0,500.0
228,2015/07/31,510.0,505.14,501.0,22200,510.0,501.0
229,2015/08/03,511.0,508.952,510.0,31300,511.0,503.0
230,2015/08/04,509.0,508.88,508.0,20000,512.0,506.0
231,2015/08/05,513.0,509.397,509.0,36800,513.0,503.0
232,2015/08/06,516.0,513.967,511.0,36300,516.0,510.0
233,2015/08/07,515.0,514.158,516.0,18400,516.0,511.0
234,2015/08/10,531.0,524.689,516.0,56900,532.0,513.0
235,2015/08/11,537.0,537.525,535.0,63000,540.0,534.0
236,2015/08/12,538.0,537.873,538.0,41700,540.0,529.0
237,2015/08/13,504.0,503.802,505.0,122900,515.0,499.0
238,2015/08/14,504.0,501.646,500.0,30800,504.0,500.0
239,2015/08/17,503.0,504.143,502.0,25200,507.0,502.0
240,2015/08/18,516.0,516.027,505.0,44900,525.0,505.0
241,2015/08/19,506.0,511.604,512.0,25000,520.0,506.0
242,2015/08/20,504.0,506.879,503.0,20700,512.0,503.0
243,2015/08/21,484.0,488.027,499.0,109500,501.0,481.0
244,2015/08/24,473.0,478.026,478.0,95100,493.0,471.0
245,2015/08/25,452.0,455.323,449.0,87000,470.0,446.0
246,2015/08/26,475.0,467.299,452.0,51800,482.0,452.0
247,2015/08/27,472.0,473.034,467.0,47200,480.0,467.0
248,2015/08/28,482.0,481.089,480.0,31600,485.0,478.0
249,2015/08/31,488.0,490.21,482.0,70500,492.0,482.0
250,2015/09/01,475.0,482.686,488.0,31800,488.0,474.0
251,2015/09/02,459.0,459.876,459.0,40200,467.0,451.0
252,2015/09/03,460.0,460.937,460.0,17400,465.0,459.0
253,2015/09/04,455.0,457.426,460.0,20900,462.0,453.0
254,2015/09/07,453.0,453.456,455.0,48200,461.0,448.0
255,2015/09/08,453.0,453.385,450.0,34800,457.0,450.0
256,2015/09/09,473.0,467.156,462.0,40300,473.0,456.0
257,2015/09/10,470.0,467.434,466.0,27200,473.0,461.0
258,2015/09/11,472.0,474.086,475.0,26800,478.0,469.0
259,2015/09/14,463.0,467.75,471.0,10800,472.0,462.0
260,2015/09/15,464.0,467.741,462.0,13100,475.0,458.0
261,2015/09/16,469.0,466.421,464.0,5700,469.0,464.0
262,2015/09/17,472.0,471.801,465.0,18100,477.0,465.0
263,2015/09/18,464.0,462.146,464.0,21200,466.0,458.0
264,2015/09/24,444.0,447.687,450.0,43700,453.0,444.0
265,2015/09/25,449.0,444.335,440.0,29300,451.0,440.0
266,2015/09/28,463.0,464.283,468.0,21200,468.0,456.0
267,2015/09/29,446.0,449.344,459.0,24700,459.0,446.0
268,2015/09/30,456.0,453.765,446.0,11500,462.0,446.0
269,2015/10/01,460.0,457.542,457.0,21600,463.0,456.0
270,2015/10/02,460.0,458.702,460.0,16800,461.0,455.0
271,2015/10/05,458.0,460.409,463.0,20300,464.0,457.0
272,2015/10/06,458.0,455.356,458.0,20200,459.0,446.0
273,2015/10/07,456.0,457.565,459.0,12400,460.0,455.0
274,2015/10/08,460.0,457.402,457.0,17400,460.0,454.0
275,2015/10/09,464.0,461.388,460.0,12900,464.0,457.0
276,2015/10/13,465.0,463.719,461.0,13500,467.0,461.0
277,2015/10/14,458.0,461.093,465.0,12900,466.0,458.0
278,2015/10/15,462.0,458.872,453.0,14800,464.0,453.0
279,2015/10/16,465.0,464.651,462.0,16600,469.0,459.0
280,2015/10/19,456.0,460.014,463.0,14000,463.0,456.0
281,2015/10/20,460.0,460.992,456.0,13200,464.0,456.0
282,2015/10/21,465.0,462.759,456.0,8300,465.0,456.0
283,2015/10/22,460.0,457.945,460.0,12700,460.0,455.0
284,2015/10/23,461.0,460.672,461.0,12500,464.0,458.0
285,2015/10/26,467.0,463.421,461.0,24700,467.0,459.0
286,2015/10/27,467.0,468.319,468.0,20700,471.0,467.0
287,2015/10/28,466.0,466.667,467.0,13200,470.0,463.0
288,2015/10/29,466.0,463.436,466.0,59700,469.0,458.0
289,2015/10/30,468.0,470.26,466.0,26900,475.0,466.0
290,2015/11/02,463.0,466.678,468.0,23300,469.0,463.0
291,2015/11/04,468.0,466.862,469.0,29000,470.0,461.0
292,2015/11/05,470.0,470.383,468.0,18000,472.0,468.0
293,2015/11/06,475.0,473.607,471.0,18300,475.0,471.0
294,2015/11/09,485.0,481.438,479.0,36500,487.0,476.0
295,2015/11/10,485.0,485.473,485.0,11000,487.0,483.0
296,2015/11/11,478.0,479.181,480.0,36000,486.0,472.0
297,2015/11/12,448.0,449.316,454.0,204700,468.0,443.0
298,2015/11/13,441.0,440.02,441.0,119600,445.0,437.0
299,2015/11/16,439.0,440.031,440.0,54200,445.0,438.0
300,2015/11/17,440.0,442.219,444.0,45200,446.0,439.0
301,2015/11/18,439.0,439.729,440.0,43900,443.0,438.0
302,2015/11/19,501.0,493.895,443.0,1059600,510.0,440.0
303,2015/11/20,513.0,507.853,504.0,617800,523.0,497.0
304,2015/11/24,510.0,513.114,520.0,163600,520.0,509.0
305,2015/11/25,503.0,503.39,506.0,114200,509.0,497.0
306,2015/11/26,501.0,504.059,507.0,138900,510.0,501.0
307,2015/11/27,497.0,500.718,502.0,64100,504.0,497.0
308,2015/11/30,491.0,492.914,497.0,136600,498.0,489.0
309,2015/12/01,489.0,488.87,490.0,119700,492.0,486.0
310,2015/12/02,502.0,499.065,489.0,162800,510.0,487.0
311,2015/12/03,497.0,500.178,497.0,117800,507.0,496.0
312,2015/12/04,493.0,494.67,495.0,103300,498.0,492.0
313,2015/12/07,498.0,496.763,495.0,99600,500.0,494.0
314,2015/12/08,495.0,496.153,498.0,68200,498.0,494.0
315,2015/12/09,494.0,493.927,495.0,80800,497.0,492.0
316,2015/12/10,489.0,491.029,492.0,52000,492.0,489.0
317,2015/12/11,490.0,487.838,486.0,76600,491.0,486.0
318,2015/12/14,479.0,478.919,479.0,80400,481.0,477.0
319,2015/12/15,472.0,475.995,480.0,72500,480.0,472.0
320,2015/12/16,476.0,476.075,479.0,77800,479.0,472.0
321,2015/12/17,480.0,477.217,476.0,65800,480.0,475.0
322,2015/12/18,486.0,485.458,479.0,76200,489.0,477.0
323,2015/12/21,481.0,481.023,480.0,52400,483.0,480.0
324,2015/12/22,481.0,480.781,480.0,64300,483.0,478.0
325,2015/12/24,475.0,478.251,482.0,71600,482.0,474.0
326,2015/12/25,475.0,475.579,475.0,79800,479.0,474.0
327,2015/12/28,493.0,485.049,473.0,51200,493.0,473.0
328,2015/12/29,489.0,491.044,492.0,38300,496.0,484.0
329,2015/12/30,489.0,489.918,492.0,39100,497.0,487.0
330,2016/01/04,490.0,492.454,493.0,42700,497.0,489.0
331,2016/01/05,499.0,494.117,490.0,58000,499.0,490.0
332,2016/01/06,495.0,496.384,499.0,42700,499.0,494.0
333,2016/01/07,484.0,488.465,491.0,65200,493.0,482.0
334,2016/01/08,481.0,480.106,482.0,38600,484.0,475.0
335,2016/01/12,475.0,481.621,481.0,69600,490.0,475.0
336,2016/01/13,481.0,479.434,475.0,24200,482.0,475.0
337,2016/01/14,470.0,471.213,481.0,48000,481.0,467.0
338,2016/01/15,474.0,474.578,470.0,27000,479.0,470.0
339,2016/01/18,464.0,464.765,467.0,37800,467.0,462.0
340,2016/01/19,465.0,466.84,464.0,28700,472.0,463.0
341,2016/01/20,461.0,465.07,465.0,62700,470.0,460.0
342,2016/01/21,458.0,460.689,460.0,54900,464.0,458.0
343,2016/01/22,475.0,466.01,459.0,40300,475.0,459.0
344,2016/01/25,481.0,478.224,475.0,50500,484.0,471.0
345,2016/01/26,486.0,482.788,481.0,37700,488.0,476.0
346,2016/01/27,496.0,489.93,486.0,37000,496.0,485.0
347,2016/01/28,498.0,497.769,496.0,42400,501.0,494.0
348,2016/01/29,497.0,497.136,502.0,83400,503.0,493.0
349,2016/02/01,492.0,493.972,496.0,79300,498.0,489.0
350,2016/02/02,497.0,496.641,492.0,44900,499.0,492.0
351,2016/02/03,490.0,491.382,496.0,36900,496.0,486.0
352,2016/02/04,498.0,496.241,490.0,72900,501.0,489.0
353,2016/02/05,489.0,493.283,499.0,80100,502.0,486.0
354,2016/02/08,495.0,493.792,487.0,35500,498.0,486.0
355,2016/02/09,485.0,486.541,493.0,58200,493.0,483.0
356,2016/02/10,470.0,476.258,485.0,98700,488.0,465.0
357,2016/02/12,423.0,435.008,450.0,122700,454.0,416.0
358,2016/02/15,455.0,447.633,434.0,43000,456.0,434.0
359,2016/02/16,470.0,466.903,455.0,43200,474.0,451.0
360,2016/02/17,469.0,471.541,468.0,41200,478.0,464.0
361,2016/02/18,484.0,480.171,477.0,46100,486.0,472.0
362,2016/02/19,484.0,483.787,484.0,42300,490.0,479.0
363,2016/02/22,491.0,488.948,484.0,26900,491.0,484.0
364,2016/02/23,487.0,487.386,491.0,25400,491.0,485.0
365,2016/02/24,487.0,485.934,485.0,39200,491.0,477.0
366,2016/02/25,503.0,496.642,487.0,64300,504.0,487.0
367,2016/02/26,500.0,503.32,505.0,51900,508.0,499.0
368,2016/02/29,500.0,501.709,501.0,62200,504.0,500.0
369,2016/03/01,500.0,498.137,500.0,34200,502.0,493.0
370,2016/03/02,517.0,511.977,504.0,74600,519.0,504.0
371,2016/03/03,522.0,521.476,511.0,46200,525.0,511.0
372,2016/03/04,532.0,527.511,522.0,78800,534.0,520.0
373,2016/03/07,532.0,531.782,532.0,60000,535.0,528.0
374,2016/03/08,533.0,530.292,530.0,51800,535.0,525.0
375,2016/03/09,535.0,530.71,529.0,37900,535.0,528.0
376,2016/03/10,542.0,539.227,535.0,49800,543.0,535.0
377,2016/03/11,542.0,539.946,539.0,49500,544.0,534.0
378,2016/03/14,544.0,545.836,547.0,53000,548.0,543.0
379,2016/03/15,549.0,548.042,545.0,60300,550.0,545.0
380,2016/03/16,535.0,539.236,549.0,59800,549.0,534.0
381,2016/03/17,524.0,532.041,534.0,80300,539.0,522.0
382,2016/03/18,525.0,523.537,524.0,39500,527.0,518.0
383,2016/03/22,528.0,526.121,525.0,53600,531.0,523.0
384,2016/03/23,524.0,523.418,525.0,17700,525.0,520.0
385,2016/03/24,519.0,521.065,525.0,30900,525.0,514.0
386,2016/03/25,513.0,517.939,520.0,27800,522.0,512.0
387,2016/03/28,515.0,513.943,513.0,214800,519.0,510.0
388,2016/03/29,520.0,512.039,508.0,38100,520.0,507.0
389,2016/03/30,512.0,515.969,520.0,19100,521.0,512.0
390,2016/03/31,512.0,512.972,513.0,39400,515.0,512.0
391,2016/04/01,506.0,510.309,517.0,76100,517.0,505.0
392,2016/04/04,521.0,515.959,506.0,48600,521.0,506.0
393,2016/04/05,516.0,519.528,521.0,36400,524.0,516.0
394,2016/04/06,521.0,520.237,517.0,38800,523.0,517.0
395,2016/04/07,524.0,523.561,521.0,39200,525.0,519.0
396,2016/04/08,534.0,529.676,519.0,66000,536.0,518.0
397,2016/04/11,534.0,530.694,534.0,34000,534.0,527.0
398,2016/04/12,544.0,541.763,534.0,43900,546.0,534.0
399,2016/04/13,550.0,549.257,544.0,75900,552.0,543.0
400,2016/04/14,563.0,558.934,555.0,63400,564.0,554.0
401,2016/04/15,567.0,564.881,563.0,55500,568.0,560.0
402,2016/04/18,560.0,558.989,557.0,43300,563.0,552.0
403,2016/04/19,576.0,573.237,564.0,69700,576.0,563.0
404,2016/04/20,573.0,575.699,576.0,67200,578.0,573.0
405,2016/04/21,572.0,573.604,570.0,54800,576.0,566.0
406,2016/04/22,576.0,571.593,567.0,30200,576.0,565.0
407,2016/04/25,578.0,575.616,576.0,32800,578.0,574.0
408,2016/04/26,574.0,573.801,578.0,43700,578.0,566.0
409,2016/04/27,574.0,572.734,574.0,32300,575.0,570.0
410,2016/04/28,573.0,575.997,574.0,68600,579.0,573.0
411,2016/05/02,561.0,559.311,564.0,38600,564.0,554.0
412,2016/05/06,562.0,561.484,561.0,39500,567.0,558.0
413,2016/05/09,572.0,565.183,561.0,17500,572.0,561.0
414,2016/05/10,577.0,575.35,572.0,38600,578.0,571.0
415,2016/05/11,562.0,566.938,577.0,53200,577.0,562.0
416,2016/05/12,556.0,555.02,561.0,35200,561.0,551.0
417,2016/05/13,534.0,543.888,555.0,63300,555.0,534.0
418,2016/05/16,538.0,532.147,527.0,59400,540.0,524.0
419,2016/05/17,553.0,551.033,542.0,21500,554.0,542.0
420,2016/05/18,530.0,540.666,552.0,44900,554.0,515.0
421,2016/05/19,538.0,534.574,536.0,10800,538.0,530.0
422,2016/05/20,527.0,532.186,538.0,34400,543.0,520.0
423,2016/05/23,496.0,497.241,519.0,51100,519.0,488.0
424,2016/05/24,490.0,491.182,496.0,22000,496.0,488.0
425,2016/05/25,484.0,487.435,494.0,40200,495.0,479.0
426,2016/05/26,487.0,488.118,484.0,15200,496.0,482.0
427,2016/05/27,492.0,491.451,489.0,7100,496.0,484.0
428,2016/05/30,488.0,491.849,497.0,18500,501.0,485.0
429,2016/05/31,493.0,491.894,488.0,6600,496.0,488.0
430,2016/06/01,490.0,493.483,495.0,23400,497.0,488.0
431,2016/06/02,485.0,485.385,489.0,6500,489.0,482.0
432,2016/06/03,485.0,480.374,488.0,18200,488.0,471.0
433,2016/06/06,480.0,483.324,485.0,13900,489.0,475.0
434,2016/06/07,486.0,482.756,488.0,4100,488.0,478.0
435,2016/06/08,485.0,484.192,487.0,5200,487.0,480.0
436,2016/06/09,485.0,484.5,485.0,4400,488.0,476.0
437,2016/06/10,482.0,485.528,487.0,16300,487.0,477.0
438,2016/06/13,467.0,470.305,477.0,15100,478.0,466.0
439,2016/06/14,460.0,464.327,468.0,10400,474.0,460.0
440,2016/06/15,459.0,460.684,459.0,7900,470.0,459.0
441,2016/06/16,461.0,463.353,467.0,24900,468.0,457.0
442,2016/06/17,445.0,455.075,460.0,30500,470.0,440.0
443,2016/06/20,459.0,459.667,452.0,6900,466.0,451.0
444,2016/06/21,460.0,460.233,459.0,8600,463.0,458.0
445,2016/06/22,456.0,448.01,456.0,20000,456.0,443.0
446,2016/06/23,437.0,443.983,448.0,18100,455.0,437.0
447,2016/06/24,423.0,426.839,448.0,30400,457.0,416.0
448,2016/06/27,433.0,433.597,423.0,11400,440.0,423.0
449,2016/06/28,438.0,438.646,421.0,12700,452.0,421.0
450,2016/06/29,438.0,439.98,439.0,14900,446.0,436.0
451,2016/06/30,437.0,437.266,439.0,27400,448.0,425.0
452,2016/07/01,447.0,443.776,445.0,5800,447.0,439.0
453,2016/07/04,438.0,440.454,443.0,9700,445.0,435.0
454,2016/07/05,442.0,441.333,440.0,8700,445.0,439.0
455,2016/07/06,438.0,439.605,443.0,14700,443.0,434.0
456,2016/07/07,436.0,434.71,433.0,10000,438.0,432.0
457,2016/07/08,422.0,424.977,444.0,17500,444.0,419.0
458,2016/07/11,417.0,422.601,422.0,24300,437.0,415.0
459,2016/07/12,421.0,422.521,426.0,24200,428.0,418.0
460,2016/07/13,419.0,420.073,423.0,16400,427.0,416.0
461,2016/07/14,422.0,422.273,426.0,8800,426.0,417.0
462,2016/07/15,424.0,418.819,427.0,31000,429.0,406.0
463,2016/07/19,427.0,424.87,423.0,10000,429.0,420.0
464,2016/07/20,427.0,425.939,427.0,6600,428.0,423.0
465,2016/07/21,421.0,420.87,429.0,12300,430.0,417.0
466,2016/07/22,422.0,421.31,419.0,2900,425.0,419.0
467,2016/07/25,423.0,419.899,420.0,17800,425.0,410.0
468,2016/07/26,424.0,423.936,423.0,6200,426.0,422.0
469,2016/07/27,427.0,427.569,426.0,6500,430.0,425.0
470,2016/07/28,423.0,421.685,424.0,8900,424.0,417.0
471,2016/07/29,429.0,424.074,423.0,21600,430.0,421.0
472,2016/08/01,428.0,428.566,429.0,14500,430.0,425.0
473,2016/08/02,424.0,427.604,430.0,14400,430.0,424.0
474,2016/08/03,422.0,421.686,423.0,10500,425.0,419.0
475,2016/08/04,427.0,422.85,422.0,14700,428.0,419.0
476,2016/08/05,432.0,427.823,427.0,14700,432.0,425.0
477,2016/08/08,432.0,433.046,439.0,8800,439.0,427.0
478,2016/08/09,436.0,433.984,434.0,6400,436.0,431.0
479,2016/08/10,439.0,433.418,431.0,9100,439.0,427.0
480,2016/08/12,433.0,429.297,423.0,20900,435.0,423.0
481,2016/08/15,427.0,427.66,429.0,9700,434.0,420.0
482,2016/08/16,419.0,421.732,423.0,10800,429.0,418.0
483,2016/08/17,409.0,413.944,418.0,21300,421.0,406.0
484,2016/08/18,406.0,406.071,405.0,11300,409.0,404.0
485,2016/08/19,404.0,404.308,405.0,18500,409.0,401.0
486,2016/08/22,406.0,404.775,402.0,8000,408.0,402.0
487,2016/08/23,402.0,403.699,406.0,14300,409.0,402.0
488,2016/08/24,401.0,400.543,402.0,21200,405.0,398.0
489,2016/08/25,405.0,403.348,401.0,4600,405.0,401.0
490,2016/08/26,400.0,400.983,402.0,5800,405.0,399.0
491,2016/08/29,402.0,400.352,403.0,14200,403.0,399.0
492,2016/08/30,398.0,399.37,400.0,16200,403.0,398.0
493,2016/08/31,401.0,398.894,399.0,13200,401.0,398.0
494,2016/09/01,407.0,404.149,404.0,6700,407.0,402.0
495,2016/09/02,404.0,406.064,407.0,11000,408.0,404.0
496,2016/09/05,402.0,404.26,405.0,15400,406.0,402.0
497,2016/09/06,405.0,404.626,402.0,9900,407.0,402.0
498,2016/09/07,405.0,405.69,405.0,15800,408.0,405.0
499,2016/09/08,412.0,409.87,409.0,11500,413.0,407.0
500,2016/09/09,413.0,412.241,412.0,10800,414.0,411.0
501,2016/09/12,403.0,402.584,406.0,29800,409.0,398.0
502,2016/09/13,402.0,403.036,406.0,8400,406.0,401.0
503,2016/09/14,404.0,404.019,402.0,5300,406.0,402.0
504,2016/09/15,405.0,406.206,405.0,7300,410.0,402.0
505,2016/09/16,407.0,406.757,405.0,3700,408.0,405.0
506,2016/09/20,402.0,403.248,404.0,10500,405.0,402.0
507,2016/09/21,408.0,406.337,401.0,8300,408.0,401.0
508,2016/09/23,406.0,406.421,408.0,8800,408.0,405.0
509,2016/09/26,408.0,407.869,407.0,17600,411.0,406.0
510,2016/09/27,411.0,408.415,408.0,13000,411.0,406.0
511,2016/09/28,418.0,413.633,414.0,9000,418.0,407.0
512,2016/09/29,414.0,412.902,414.0,8200,414.0,411.0
513,2016/09/30,412.0,413.693,414.0,20200,416.0,411.0
514,2016/10/03,412.0,412.019,410.0,10500,415.0,410.0
515,2016/10/04,413.0,412.907,412.0,9700,415.0,411.0
516,2016/10/05,413.0,413.979,413.0,19300,416.0,413.0
517,2016/10/06,414.0,414.44,415.0,5000,415.0,413.0
518,2016/10/07,412.0,413.474,414.0,7800,416.0,412.0
519,2016/10/11,411.0,411.055,412.0,9100,414.0,410.0
520,2016/10/12,412.0,413.116,411.0,12900,415.0,411.0
521,2016/10/13,415.0,412.544,415.0,13600,415.0,410.0
522,2016/10/14,413.0,412.609,411.0,4600,414.0,411.0
523,2016/10/17,413.0,413.741,415.0,8500,415.0,412.0
524,2016/10/18,414.0,414.372,415.0,12900,417.0,412.0
525,2016/10/19,412.0,413.18,415.0,10000,415.0,412.0
526,2016/10/20,413.0,413.46,414.0,10000,415.0,412.0
527,2016/10/21,415.0,413.588,413.0,9700,415.0,413.0
528,2016/10/24,416.0,418.489,415.0,22700,422.0,415.0
529,2016/10/25,416.0,415.587,417.0,18400,418.0,413.0
530,2016/10/26,417.0,416.956,416.0,11300,418.0,416.0
531,2016/10/27,419.0,418.793,418.0,24600,422.0,417.0
532,2016/10/28,419.0,418.948,420.0,50000,421.0,417.0
533,2016/10/31,418.0,419.297,420.0,24900,422.0,418.0
534,2016/11/01,415.0,414.301,418.0,26900,420.0,409.0
535,2016/11/02,411.0,409.695,415.0,27200,415.0,406.0
536,2016/11/04,406.0,405.758,407.0,24800,409.0,404.0
537,2016/11/07,411.0,409.247,406.0,7700,412.0,406.0
538,2016/11/08,411.0,411.61,414.0,12300,414.0,411.0
539,2016/11/09,403.0,407.005,414.0,19800,414.0,403.0
540,2016/11/10,413.0,410.5,408.0,13400,414.0,406.0
541,2016/11/11,410.0,411.394,414.0,17000,414.0,410.0
542,2016/11/14,419.0,424.984,440.0,63700,440.0,415.0
543,2016/11/15,421.0,421.861,420.0,31000,430.0,419.0
544,2016/11/16,430.0,422.003,421.0,31000,430.0,418.0
545,2016/11/17,424.0,424.489,423.0,13100,428.0,423.0
546,2016/11/18,424.0,424.795,430.0,14600,430.0,423.0
547,2016/11/21,425.0,426.471,428.0,21000,430.0,424.0
548,2016/11/22,426.0,424.793,426.0,20800,427.0,422.0
549,2016/11/24,430.0,426.385,426.0,33800,430.0,423.0
550,2016/11/25,432.0,431.833,432.0,31700,434.0,428.0
551,2016/11/28,430.0,430.55,432.0,15100,433.0,428.0
552,2016/11/29,432.0,430.23,431.0,11300,432.0,428.0
553,2016/11/30,433.0,432.735,432.0,18500,435.0,432.0
554,2016/12/01,432.0,431.115,433.0,25200,434.0,427.0
555,2016/12/02,426.0,427.993,434.0,14000,434.0,425.0
556,2016/12/05,436.0,431.918,430.0,56300,436.0,430.0
557,2016/12/06,444.0,441.41,440.0,40700,445.0,437.0
558,2016/12/07,438.0,441.253,444.0,28900,444.0,436.0
559,2016/12/08,439.0,438.008,444.0,39600,444.0,434.0
560,2016/12/09,428.0,429.16,432.0,53900,434.0,424.0
561,2016/12/12,438.0,434.374,433.0,20600,438.0,432.0
562,2016/12/13,438.0,435.643,439.0,15700,439.0,433.0
563,2016/12/14,440.0,437.55,433.0,12000,441.0,433.0
564,2016/12/15,438.0,438.339,440.0,18900,440.0,437.0
565,2016/12/16,441.0,439.372,438.0,111100,441.0,436.0
566,2016/12/19,441.0,440.885,442.0,25200,443.0,437.0
567,2016/12/20,439.0,438.416,441.0,20900,441.0,436.0
568,2016/12/21,440.0,438.174,442.0,25800,442.0,436.0
569,2016/12/22,435.0,436.466,435.0,20800,441.0,435.0
570,2016/12/26,429.0,431.009,435.0,43800,435.0,428.0
571,2016/12/27,425.0,425.2,428.0,45900,428.0,422.0
572,2016/12/28,431.0,430.361,423.0,63100,434.0,423.0
573,2016/12/29,430.0,429.594,431.0,24400,431.0,428.0
574,2016/12/30,430.0,429.729,430.0,39800,431.0,427.0
575,2017/01/04,431.0,429.941,430.0,113300,435.0,427.0
576,2017/01/05,433.0,430.486,431.0,65200,433.0,428.0
577,2017/01/06,435.0,433.939,437.0,36300,437.0,432.0
578,2017/01/10,436.0,435.768,435.0,32700,439.0,434.0
579,2017/01/11,436.0,436.636,438.0,29700,440.0,435.0
580,2017/01/12,431.0,433.046,435.0,28400,435.0,431.0
581,2017/01/13,438.0,433.518,431.0,42100,438.0,430.0
582,2017/01/16,437.0,437.542,439.0,26400,441.0,433.0
583,2017/01/17,436.0,437.98,441.0,19900,441.0,434.0
584,2017/01/18,434.0,433.4,436.0,12500,438.0,431.0
585,2017/01/19,438.0,436.949,433.0,19500,439.0,433.0
586,2017/01/20,437.0,438.025,440.0,12200,440.0,436.0
587,2017/01/23,434.0,436.442,439.0,12900,439.0,434.0
588,2017/01/24,432.0,431.804,435.0,22400,435.0,430.0
589,2017/01/25,432.0,431.578,433.0,19900,433.0,430.0
590,2017/01/26,432.0,431.986,434.0,14000,435.0,430.0
591,2017/01/27,435.0,435.714,437.0,14000,438.0,433.0
592,2017/01/30,438.0,438.455,435.0,14300,441.0,435.0
593,2017/01/31,440.0,438.621,438.0,16900,440.0,438.0
594,2017/02/01,439.0,438.417,440.0,28800,440.0,437.0
595,2017/02/02,437.0,438.627,439.0,21700,440.0,436.0
596,2017/02/03,433.0,435.868,437.0,20500,439.0,433.0
597,2017/02/06,431.0,432.629,433.0,28600,435.0,431.0
598,2017/02/07,432.0,431.21,434.0,21400,434.0,430.0
599,2017/02/08,428.0,428.296,431.0,55800,431.0,426.0
600,2017/02/09,423.0,425.43,428.0,45800,430.0,422.0
601,2017/02/10,425.0,425.231,426.0,72200,427.0,424.0
602,2017/02/13,432.0,429.225,431.0,75500,434.0,422.0
603,2017/02/14,436.0,434.704,435.0,25000,437.0,432.0
604,2017/02/15,437.0,435.848,436.0,17100,438.0,434.0
605,2017/02/16,436.0,434.819,437.0,19900,437.0,432.0
606,2017/02/17,435.0,434.734,436.0,22900,436.0,433.0
607,2017/02/20,439.0,437.726,437.0,17900,439.0,435.0
608,2017/02/21,439.0,438.13,438.0,17700,440.0,436.0
609,2017/02/22,438.0,439.402,440.0,9700,442.0,438.0
610,2017/02/23,443.0,440.756,440.0,16000,443.0,438.0
611,2017/02/24,443.0,442.549,443.0,35000,444.0,440.0
612,2017/02/27,443.0,443.594,445.0,27100,446.0,442.0
613,2017/02/28,443.0,444.226,443.0,34500,447.0,442.0
614,2017/03/01,446.0,445.728,444.0,11400,448.0,444.0
615,2017/03/02,447.0,446.065,447.0,18400,447.0,444.0
616,2017/03/03,445.0,445.961,447.0,20700,447.0,444.0
617,2017/03/06,445.0,444.459,445.0,36200,446.0,442.0
618,2017/03/07,447.0,445.78,445.0,14100,447.0,443.0
619,2017/03/08,446.0,445.333,446.0,30300,447.0,443.0
620,2017/03/09,447.0,445.109,445.0,11900,447.0,444.0
621,2017/03/10,446.0,445.826,446.0,42500,449.0,444.0
622,2017/03/13,451.0,449.704,449.0,35500,452.0,448.0
623,2017/03/14,452.0,451.404,452.0,18300,452.0,450.0
624,2017/03/15,454.0,452.253,451.0,16600,454.0,451.0
625,2017/03/16,462.0,458.232,455.0,41000,462.0,452.0
626,2017/03/17,463.0,462.768,460.0,23300,465.0,460.0
627,2017/03/21,460.0,462.829,465.0,44400,465.0,460.0
628,2017/03/22,450.0,452.887,455.0,41700,460.0,448.0
629,2017/03/23,447.0,447.571,452.0,44800,455.0,437.0
630,2017/03/24,457.0,456.214,450.0,22400,460.0,449.0
631,2017/03/27,458.0,457.342,455.0,44500,460.0,455.0
632,2017/03/28,461.0,458.821,458.0,147700,461.0,456.0
633,2017/03/29,443.0,445.103,448.0,62900,449.0,440.0
634,2017/03/30,443.0,443.98,443.0,25000,446.0,441.0
635,2017/03/31,443.0,444.931,443.0,30500,447.0,443.0
636,2017/04/03,443.0,444.785,443.0,29700,449.0,442.0
637,2017/04/04,436.0,435.738,441.0,40400,441.0,432.0
638,2017/04/05,433.0,435.102,437.0,37300,438.0,430.0
639,2017/04/06,422.0,425.158,432.0,32300,432.0,421.0
640,2017/04/07,418.0,419.981,422.0,32300,431.0,415.0
641,2017/04/10,426.0,424.87,420.0,23900,430.0,420.0
642,2017/04/11,423.0,425.739,426.0,4600,429.0,423.0
643,2017/04/12,419.0,419.842,423.0,11400,424.0,418.0
644,2017/04/13,418.0,416.139,415.0,14400,419.0,415.0
645,2017/04/14,415.0,415.755,417.0,9800,418.0,414.0
646,2017/04/17,416.0,415.337,414.0,10100,417.0,414.0
647,2017/04/18,418.0,419.316,420.0,9500,420.0,418.0
648,2017/04/19,421.0,423.303,420.0,8900,427.0,418.0
649,2017/04/20,423.0,423.317,426.0,4100,426.0,422.0
650,2017/04/21,428.0,427.383,429.0,9400,429.0,425.0
651,2017/04/24,428.0,429.515,429.0,16700,430.0,428.0
652,2017/04/25,428.0,428.693,428.0,11400,430.0,428.0
653,2017/04/26,433.0,431.525,431.0,22300,434.0,430.0
654,2017/04/27,440.0,439.968,440.0,44000,443.0,436.0
655,2017/04/28,441.0,442.216,440.0,20800,444.0,440.0
656,2017/05/01,443.0,443.575,443.0,15300,445.0,442.0
657,2017/05/02,450.0,448.902,446.0,45900,452.0,445.0
658,2017/05/08,455.0,455.673,456.0,53800,458.0,453.0
659,2017/05/09,458.0,459.339,457.0,67500,460.0,457.0
660,2017/05/10,459.0,458.021,458.0,29200,459.0,456.0
661,2017/05/11,463.0,460.443,459.0,40400,463.0,459.0
662,2017/05/12,471.0,468.837,465.0,89200,473.0,463.0
663,2017/05/15,463.0,455.864,464.0,156900,471.0,440.0
664,2017/05/16,461.0,462.352,464.0,69700,469.0,450.0
665,2017/05/17,450.0,456.343,460.0,74700,463.0,449.0
666,2017/05/18,450.0,449.401,442.0,40200,457.0,442.0
667,2017/05/19,450.0,449.003,450.0,29100,451.0,447.0
668,2017/05/22,456.0,456.32,451.0,23100,459.0,451.0
669,2017/05/23,456.0,456.597,459.0,22600,459.0,455.0
670,2017/05/24,457.0,457.54,457.0,27800,462.0,453.0
671,2017/05/25,454.0,454.421,457.0,19700,458.0,452.0
672,2017/05/26,452.0,453.016,455.0,12800,456.0,450.0
673,2017/05/29,453.0,452.302,453.0,14900,454.0,448.0
674,2017/05/30,454.0,452.791,453.0,14800,454.0,450.0
675,2017/05/31,451.0,454.829,455.0,29200,459.0,451.0
676,2017/06/01,451.0,453.029,453.0,23800,456.0,451.0
677,2017/06/02,455.0,454.305,452.0,30200,457.0,452.0
678,2017/06/05,457.0,458.64,455.0,32500,464.0,455.0
679,2017/06/06,456.0,457.218,457.0,15600,459.0,455.0
680,2017/06/07,456.0,455.752,455.0,23400,458.0,454.0
681,2017/06/08,454.0,456.665,460.0,23000,462.0,454.0
682,2017/06/09,453.0,454.792,452.0,31700,460.0,450.0
683,2017/06/12,453.0,454.806,454.0,13400,457.0,453.0
684,2017/06/13,454.0,455.798,455.0,23700,460.0,450.0
685,2017/06/14,454.0,454.7,454.0,19300,457.0,453.0
686,2017/06/15,452.0,460.405,454.0,76400,475.0,450.0
687,2017/06/16,456.0,456.939,452.0,50800,460.0,452.0
688,2017/06/19,459.0,458.967,457.0,23900,463.0,455.0
689,2017/06/20,461.0,460.614,457.0,28000,463.0,456.0
690,2017/06/21,455.0,458.003,463.0,34400,463.0,455.0
691,2017/06/22,457.0,456.907,452.0,15100,460.0,452.0
692,2017/06/23,457.0,456.901,457.0,12100,460.0,455.0
693,2017/06/26,457.0,457.671,457.0,16400,460.0,455.0
694,2017/06/27,459.0,459.207,460.0,11100,462.0,457.0
695,2017/06/28,460.0,460.356,460.0,8700,462.0,460.0
696,2017/06/29,460.0,460.397,463.0,13600,463.0,459.0
697,2017/06/30,458.0,459.784,460.0,21300,462.0,457.0
698,2017/07/03,460.0,461.823,458.0,23200,469.0,458.0
699,2017/07/04,462.0,462.01,460.0,10300,463.0,460.0
700,2017/07/05,462.0,462.979,462.0,24300,468.0,461.0
701,2017/07/06,464.0,464.284,461.0,9500,467.0,461.0
702,2017/07/07,463.0,463.57,460.0,16500,467.0,460.0
703,2017/07/10,465.0,462.481,458.0,18500,468.0,458.0
704,2017/07/11,467.0,467.892,465.0,11100,469.0,465.0
705,2017/07/12,468.0,468.272,468.0,11400,469.0,466.0
706,2017/07/13,469.0,468.056,470.0,7100,470.0,465.0
707,2017/07/14,465.0,464.079,468.0,25400,468.0,460.0
708,2017/07/18,467.0,469.101,472.0,12900,472.0,465.0
709,2017/07/19,469.0,467.537,467.0,6700,469.0,465.0
710,2017/07/20,467.0,467.106,468.0,8500,468.0,466.0
711,2017/07/21,467.0,466.64,465.0,8600,469.0,464.0
712,2017/07/24,468.0,466.829,466.0,14600,468.0,466.0
713,2017/07/25,463.0,464.731,468.0,13400,468.0,463.0
714,2017/07/26,463.0,463.526,463.0,20900,465.0,461.0
715,2017/07/27,462.0,462.538,461.0,11900,465.0,461.0
716,2017/07/28,463.0,462.324,464.0,11100,465.0,461.0
717,2017/07/31,465.0,465.637,463.0,12400,468.0,463.0
718,2017/08/01,465.0,465.809,465.0,25700,469.0,464.0
719,2017/08/02,463.0,464.673,465.0,15000,467.0,463.0
720,2017/08/03,466.0,462.634,463.0,22100,467.0,459.0
721,2017/08/04,469.0,466.923,465.0,20800,469.0,465.0
722,2017/08/07,470.0,469.399,469.0,15800,470.0,469.0
723,2017/08/08,471.0,470.217,470.0,8300,471.0,468.0
724,2017/08/09,463.0,462.472,469.0,29000,469.0,459.0
725,2017/08/10,467.0,465.136,467.0,13200,467.0,462.0
726,2017/08/14,464.0,464.485,466.0,27200,466.0,461.0
727,2017/08/15,463.0,464.463,464.0,10800,466.0,463.0
728,2017/08/16,464.0,464.912,463.0,35200,467.0,463.0
729,2017/08/17,466.0,464.547,464.0,12800,466.0,463.0
730,2017/08/18,464.0,463.153,462.0,21600,466.0,461.0
731,2017/08/21,463.0,463.147,463.0,7500,465.0,462.0
732,2017/08/22,461.0,461.446,463.0,10100,463.0,460.0
733,2017/08/23,463.0,462.757,462.0,11100,464.0,461.0
734,2017/08/24,464.0,463.813,460.0,21900,466.0,460.0
735,2017/08/25,463.0,463.049,464.0,16300,464.0,461.0
736,2017/08/28,465.0,464.264,464.0,12900,466.0,463.0
737,2017/08/29,465.0,464.444,462.0,23900,465.0,462.0
738,2017/08/30,466.0,466.067,465.0,21000,469.0,462.0
739,2017/08/31,469.0,467.545,467.0,14500,469.0,467.0
740,2017/09/01,472.0,469.145,469.0,36500,472.0,466.0
741,2017/09/04,465.0,467.186,475.0,28500,475.0,460.0
742,2017/09/05,458.0,462.072,468.0,30500,468.0,458.0
743,2017/09/06,462.0,457.578,457.0,20600,464.0,451.0
744,2017/09/07,464.0,463.647,464.0,3400,465.0,462.0
745,2017/09/08,463.0,462.863,462.0,24800,465.0,461.0
746,2017/09/11,465.0,465.739,466.0,14200,469.0,463.0
747,2017/09/12,467.0,467.379,469.0,33000,470.0,464.0
748,2017/09/13,466.0,465.851,465.0,6700,467.0,464.0
749,2017/09/14,464.0,466.018,466.0,11000,468.0,463.0
750,2017/09/15,463.0,465.325,461.0,33800,469.0,461.0
751,2017/09/19,468.0,468.335,472.0,37000,472.0,465.0
752,2017/09/20,471.0,468.471,468.0,31200,472.0,465.0
753,2017/09/21,468.0,468.431,473.0,29900,473.0,466.0
754,2017/09/22,465.0,467.088,468.0,8000,470.0,465.0
755,2017/09/25,469.0,468.226,465.0,23000,470.0,465.0
756,2017/09/26,471.0,469.158,467.0,22100,471.0,467.0
757,2017/09/27,483.0,487.614,466.0,114900,508.0,466.0
758,2017/09/28,491.0,489.373,491.0,70000,493.0,483.0
759,2017/09/29,487.0,489.425,491.0,31300,492.0,485.0
760,2017/10/02,512.0,502.496,489.0,121400,515.0,489.0
761,2017/10/03,520.0,515.295,512.0,113800,523.0,503.0
762,2017/10/04,538.0,535.564,526.0,116300,544.0,524.0
763,2017/10/05,535.0,538.254,543.0,103600,549.0,520.0
764,2017/10/06,543.0,544.24,542.0,46600,549.0,533.0
765,2017/10/10,548.0,545.294,542.0,39100,550.0,537.0
766,2017/10/11,536.0,538.559,547.0,49200,547.0,531.0
767,2017/10/12,532.0,520.414,528.0,76800,534.0,500.0
768,2017/10/13,536.0,534.13,531.0,39100,537.0,528.0
769,2017/10/16,545.0,546.047,538.0,61200,549.0,538.0
770,2017/10/17,545.0,544.985,546.0,20200,547.0,542.0
771,2017/10/18,541.0,540.671,543.0,17300,543.0,535.0
772,2017/10/19,538.0,540.012,534.0,25900,545.0,534.0
773,2017/10/20,539.0,538.599,532.0,18200,543.0,532.0
774,2017/10/23,541.0,537.823,540.0,31700,542.0,528.0
775,2017/10/24,545.0,545.49,541.0,35900,549.0,540.0
776,2017/10/25,540.0,538.386,545.0,36500,548.0,532.0
777,2017/10/26,542.0,541.814,538.0,25300,544.0,538.0
778,2017/10/27,542.0,542.517,542.0,11600,544.0,541.0
779,2017/10/30,541.0,540.0,540.0,33200,543.0,534.0
780,2017/10/31,541.0,541.538,541.0,18600,544.0,540.0
781,2017/11/01,541.0,540.953,538.0,27900,547.0,536.0
782,2017/11/02,540.0,539.342,535.0,18700,542.0,535.0
783,2017/11/06,534.0,537.017,540.0,29700,541.0,534.0
784,2017/11/07,528.0,529.763,531.0,17300,534.0,525.0
785,2017/11/08,543.0,534.551,523.0,46300,545.0,522.0
786,2017/11/09,537.0,538.442,539.0,18100,543.0,533.0
787,2017/11/10,536.0,533.848,525.0,21000,540.0,525.0
788,2017/11/13,542.0,540.634,540.0,90700,550.0,521.0
789,2017/11/14,534.0,539.312,548.0,62100,548.0,531.0
790,2017/11/15,519.0,522.602,530.0,72100,530.0,515.0
791,2017/11/16,521.0,525.328,523.0,28400,530.0,521.0
792,2017/11/17,529.0,528.761,531.0,29700,531.0,526.0
793,2017/11/20,541.0,541.096,531.0,55400,549.0,529.0
794,2017/11/21,546.0,547.984,548.0,48400,550.0,543.0
795,2017/11/22,553.0,550.671,549.0,49000,555.0,546.0
796,2017/11/24,556.0,558.135,560.0,71300,565.0,551.0
797,2017/11/27,559.0,562.607,568.0,32600,568.0,557.0
798,2017/11/28,559.0,558.207,562.0,24200,562.0,553.0
799,2017/11/29,554.0,556.318,561.0,28000,561.0,553.0
800,2017/11/30,548.0,550.922,554.0,45000,556.0,542.0
801,2017/12/01,545.0,543.901,548.0,32200,548.0,535.0
802,2017/12/04,547.0,550.82,552.0,24400,556.0,547.0
803,2017/12/05,545.0,543.945,547.0,25500,547.0,536.0
804,2017/12/06,547.0,545.767,546.0,41700,552.0,539.0
805,2017/12/07,557.0,555.967,548.0,21200,559.0,547.0
806,2017/12/08,557.0,553.724,550.0,34800,557.0,550.0
807,2017/12/11,557.0,556.29,558.0,27900,558.0,552.0
808,2017/12/12,557.0,558.152,558.0,16400,560.0,556.0
809,2017/12/13,552.0,553.056,557.0,26600,558.0,548.0
810,2017/12/14,559.0,556.439,550.0,43500,561.0,542.0
811,2017/12/15,558.0,556.398,559.0,26400,560.0,551.0
812,2017/12/18,566.0,563.534,561.0,45700,574.0,557.0
813,2017/12/19,588.0,586.129,572.0,106300,595.0,568.0
814,2017/12/20,587.0,590.92,595.0,48900,595.0,587.0
815,2017/12/21,588.0,583.61,585.0,33100,588.0,576.0
816,2017/12/22,582.0,584.792,590.0,19700,590.0,581.0
817,2017/12/25,581.0,578.669,578.0,25400,582.0,573.0
818,2017/12/26,579.0,582.667,579.0,52900,590.0,578.0
819,2017/12/27,585.0,583.897,576.0,24300,588.0,576.0
820,2017/12/28,587.0,587.301,585.0,20900,590.0,585.0
821,2017/12/29,591.0,589.128,590.0,24300,591.0,587.0
822,2018/01/04,596.0,595.112,596.0,24200,597.0,592.0
823,2018/01/05,600.0,598.985,596.0,39100,603.0,596.0
824,2018/01/09,604.0,601.406,604.0,34500,605.0,597.0
825,2018/01/10,601.0,602.239,602.0,27200,605.0,600.0
826,2018/01/11,602.0,601.006,601.0,15900,604.0,599.0
827,2018/01/12,594.0,595.008,600.0,26200,600.0,591.0
828,2018/01/15,602.0,598.31,592.0,26100,603.0,592.0
829,2018/01/16,598.0,599.858,601.0,12000,601.0,598.0
830,2018/01/17,594.0,595.59,598.0,30700,598.0,594.0
831,2018/01/18,587.0,591.607,600.0,38400,600.0,585.0
832,2018/01/19,593.0,593.525,587.0,35800,600.0,585.0
833,2018/01/22,595.0,598.444,607.0,46800,607.0,591.0
834,2018/01/23,605.0,603.942,603.0,39900,606.0,599.0
835,2018/01/24,608.0,607.659,605.0,30200,610.0,605.0
836,2018/01/25,593.0,598.316,605.0,41800,605.0,593.0
837,2018/01/26,599.0,600.877,598.0,30100,604.0,598.0
838,2018/01/29,602.0,603.876,601.0,29800,608.0,600.0
839,2018/01/30,595.0,596.993,602.0,40300,604.0,592.0
840,2018/01/31,590.0,594.099,595.0,40600,598.0,590.0
841,2018/02/01,590.0,589.589,588.0,51300,594.0,585.0
842,2018/02/02,596.0,593.458,590.0,32100,598.0,587.0
843,2018/02/05,581.0,584.149,588.0,36300,589.0,580.0
844,2018/02/06,547.0,542.766,541.0,97700,556.0,529.0
845,2018/02/07,548.0,561.886,560.0,50900,575.0,548.0
846,2018/02/08,564.0,565.116,551.0,25100,574.0,551.0
847,2018/02/09,559.0,552.565,544.0,47300,562.0,544.0
848,2018/02/13,580.0,577.684,564.0,109800,598.0,560.0
849,2018/02/14,562.0,576.925,600.0,74500,601.0,561.0
850,2018/02/15,572.0,577.108,578.0,65900,588.0,568.0
851,2018/02/16,587.0,585.616,580.0,38000,591.0,579.0
852,2018/02/19,613.0,605.745,592.0,96300,616.0,592.0
853,2018/02/20,624.0,626.86,630.0,140100,640.0,617.0
854,2018/02/21,669.0,658.71,630.0,331500,686.0,625.0
855,2018/02/22,661.0,656.738,670.0,103400,672.0,645.0
856,2018/02/23,647.0,647.178,644.0,50700,657.0,640.0
857,2018/02/26,651.0,655.551,655.0,40500,660.0,650.0
858,2018/02/27,664.0,663.535,655.0,59400,669.0,655.0
859,2018/02/28,665.0,670.599,666.0,65400,677.0,665.0
860,2018/03/01,668.0,658.204,664.0,91100,671.0,643.0
861,2018/03/02,660.0,653.473,648.0,63900,666.0,645.0
862,2018/03/05,628.0,638.207,660.0,63300,660.0,625.0
863,2018/03/06,641.0,643.864,639.0,38900,651.0,639.0
864,2018/03/07,641.0,640.324,641.0,25000,645.0,636.0
865,2018/03/08,623.0,630.989,642.0,44300,642.0,622.0
866,2018/03/09,626.0,623.24,630.0,56600,633.0,610.0
867,2018/03/12,633.0,636.379,632.0,39600,644.0,632.0
868,2018/03/13,621.0,622.794,633.0,99800,638.0,615.0
869,2018/03/14,617.0,617.735,620.0,56300,627.0,610.0
870,2018/03/15,612.0,614.429,617.0,32200,618.0,611.0
871,2018/03/16,604.0,606.361,607.0,92200,612.0,598.0
872,2018/03/19,601.0,602.03,603.0,94900,612.0,593.0
873,2018/03/20,605.0,594.355,592.0,64200,606.0,584.0
874,2018/03/22,611.0,612.387,609.0,52200,618.0,607.0
875,2018/03/23,589.0,596.105,594.0,88000,604.0,588.0
876,2018/03/26,599.0,585.687,580.0,82200,599.0,577.0
877,2018/03/27,595.0,604.568,608.0,165700,610.0,594.0
878,2018/03/28,606.0,592.141,584.0,117400,610.0,582.0
879,2018/03/29,597.0,597.778,609.0,31500,609.0,587.0
880,2018/03/30,594.0,594.893,604.0,37500,604.0,589.0
881,2018/04/02,594.0,599.022,604.0,18100,604.0,593.0
882,2018/04/03,586.0,586.118,584.0,30400,591.0,582.0
883,2018/04/04,595.0,590.422,585.0,26100,596.0,584.0
884,2018/04/05,612.0,606.798,595.0,56500,613.0,595.0
885,2018/04/06,623.0,618.93,615.0,66900,626.0,610.0
886,2018/04/09,632.0,628.099,630.0,98600,640.0,613.0
887,2018/04/10,629.0,630.867,639.0,63100,639.0,622.0
888,2018/04/11,626.0,628.046,631.0,32400,634.0,624.0
889,2018/04/12,616.0,613.787,623.0,98300,627.0,604.0
890,2018/04/13,623.0,627.488,620.0,60200,636.0,618.0
891,2018/04/16,633.0,640.544,650.0,127700,653.0,628.0
892,2018/04/17,617.0,618.912,630.0,50000,630.0,611.0
893,2018/04/18,617.0,616.374,615.0,62600,623.0,607.0
894,2018/04/19,627.0,623.755,620.0,26900,628.0,618.0
895,2018/04/20,632.0,631.052,626.0,32500,635.0,623.0
896,2018/04/23,632.0,635.36,637.0,66200,643.0,628.0
897,2018/04/24,640.0,635.804,640.0,113700,645.0,624.0
898,2018/04/25,644.0,639.895,640.0,31500,645.0,635.0
899,2018/04/26,650.0,644.465,644.0,46200,650.0,636.0
900,2018/04/27,652.0,649.49,650.0,66100,654.0,645.0
901,2018/05/01,628.0,636.707,655.0,103400,655.0,624.0
902,2018/05/02,634.0,629.899,634.0,27600,636.0,623.0
903,2018/05/07,641.0,637.897,634.0,52300,643.0,630.0
904,2018/05/08,656.0,651.031,643.0,67200,659.0,635.0
905,2018/05/09,644.0,644.968,652.0,27900,655.0,642.0
906,2018/05/10,649.0,646.919,641.0,16100,650.0,641.0
907,2018/05/11,647.0,648.14,650.0,46500,654.0,645.0
908,2018/05/14,607.0,622.365,666.0,438700,686.0,577.0
909,2018/05/15,590.0,593.336,607.0,103900,607.0,586.0
910,2018/05/16,594.0,591.352,590.0,83500,601.0,582.0
911,2018/05/17,601.0,598.912,599.0,60200,610.0,588.0
912,2018/05/18,599.0,599.377,602.0,20700,604.0,596.0
913,2018/05/21,609.0,601.763,600.0,61100,612.0,590.0
914,2018/05/22,604.0,604.275,613.0,25500,614.0,600.0
915,2018/05/23,598.0,598.288,604.0,18400,604.0,596.0
916,2018/05/24,594.0,595.172,599.0,23300,600.0,592.0
917,2018/05/25,586.0,586.508,592.0,48800,592.0,581.0
918,2018/05/28,573.0,576.076,583.0,70000,584.0,571.0
919,2018/05/29,568.0,571.042,574.0,40400,576.0,565.0
920,2018/05/30,557.0,559.215,560.0,71700,564.0,553.0
921,2018/05/31,559.0,559.018,560.0,22900,565.0,557.0
922,2018/06/01,563.0,562.036,559.0,25200,565.0,559.0
923,2018/06/04,572.0,569.749,570.0,35400,575.0,564.0
924,2018/06/05,573.0,571.144,575.0,61200,575.0,568.0
925,2018/06/06,568.0,568.016,569.0,44900,571.0,565.0
926,2018/06/07,571.0,568.606,570.0,28900,573.0,565.0
927,2018/06/08,572.0,570.682,568.0,33000,573.0,568.0
928,2018/06/11,572.0,573.133,572.0,52700,578.0,570.0
929,2018/06/12,572.0,572.784,574.0,38000,575.0,570.0
930,2018/06/13,573.0,571.719,571.0,26700,574.0,570.0
931,2018/06/14,574.0,572.707,571.0,20500,575.0,570.0
932,2018/06/15,574.0,574.894,578.0,29100,578.0,571.0
933,2018/06/18,571.0,570.79,573.0,29100,573.0,569.0
934,2018/06/19,557.0,559.655,568.0,67200,570.0,552.0
935,2018/06/20,553.0,546.341,557.0,64000,557.0,536.0
936,2018/06/21,553.0,554.405,557.0,31400,558.0,549.0
937,2018/06/22,555.0,552.651,552.0,37200,556.0,548.0
938,2018/06/25,542.0,546.647,551.0,28600,555.0,542.0
939,2018/06/26,541.0,540.263,538.0,29700,545.0,533.0
940,2018/06/27,542.0,534.751,542.0,51300,544.0,521.0
941,2018/06/28,531.0,530.708,537.0,34900,539.0,525.0
942,2018/06/29,536.0,534.246,531.0,38600,542.0,528.0
943,2018/07/02,526.0,532.803,540.0,31400,542.0,526.0
944,2018/07/03,526.0,525.126,526.0,46000,529.0,517.0
945,2018/07/04,525.0,525.726,527.0,21500,528.0,524.0
946,2018/07/05,513.0,518.048,526.0,35700,527.0,510.0
947,2018/07/06,516.0,512.07,509.0,55400,522.0,501.0
948,2018/07/09,519.0,513.749,515.0,34700,519.0,506.0
949,2018/07/10,519.0,520.059,519.0,27300,523.0,516.0
950,2018/07/11,511.0,510.085,514.0,36500,516.0,504.0
951,2018/07/12,514.0,513.777,512.0,28700,519.0,508.0
952,2018/07/13,515.0,513.068,514.0,38100,520.0,506.0
953,2018/07/17,519.0,516.12,512.0,24100,521.0,510.0
954,2018/07/18,522.0,520.841,517.0,18900,525.0,517.0
955,2018/07/19,520.0,520.86,521.0,16400,524.0,518.0
956,2018/07/20,516.0,517.608,515.0,20900,522.0,514.0
957,2018/07/23,515.0,515.742,518.0,22900,520.0,513.0
958,2018/07/24,516.0,515.734,515.0,24100,518.0,512.0
959,2018/07/25,521.0,520.551,520.0,24300,522.0,517.0
960,2018/07/26,523.0,521.638,521.0,24000,526.0,519.0
961,2018/07/27,525.0,523.904,522.0,25100,527.0,521.0
962,2018/07/30,521.0,521.913,525.0,25400,527.0,520.0
963,2018/07/31,522.0,521.012,521.0,50100,527.0,515.0
964,2018/08/01,522.0,521.674,524.0,23900,524.0,519.0
965,2018/08/02,519.0,521.038,522.0,23700,526.0,518.0
966,2018/08/03,514.0,514.674,516.0,49700,518.0,510.0
967,2018/08/06,516.0,514.971,514.0,31400,519.0,511.0
968,2018/08/07,520.0,518.004,513.0,23400,521.0,513.0
969,2018/08/08,525.0,523.23,520.0,24400,527.0,518.0
970,2018/08/09,522.0,522.346,526.0,25700,527.0,519.0
971,2018/08/10,515.0,518.421,520.0,32300,524.0,511.0
972,2018/08/13,482.0,493.265,505.0,84400,505.0,482.0
973,2018/08/14,505.0,494.547,490.0,34900,505.0,487.0
974,2018/08/15,511.0,502.858,499.0,87700,512.0,496.0
975,2018/08/16,499.0,503.976,508.0,45200,512.0,498.0
976,2018/08/17,496.0,499.177,499.0,32300,506.0,494.0
977,2018/08/20,503.0,498.953,499.0,38500,506.0,492.0
978,2018/08/21,495.0,492.998,500.0,49400,501.0,486.0
979,2018/08/22,498.0,496.597,493.0,23300,500.0,490.0
980,2018/08/23,503.0,501.333,500.0,16800,503.0,499.0
981,2018/08/24,504.0,501.914,503.0,20800,504.0,499.0
982,2018/08/27,506.0,505.139,508.0,19400,509.0,503.0
983,2018/08/28,504.0,504.354,505.0,14400,506.0,502.0
984,2018/08/29,508.0,505.416,502.0,23300,509.0,501.0
985,2018/08/30,503.0,504.947,510.0,30400,510.0,501.0
986,2018/08/31,504.0,503.627,503.0,20100,506.0,503.0
987,2018/09/03,505.0,504.868,504.0,40900,519.0,496.0
988,2018/09/04,498.0,499.235,502.0,27700,503.0,496.0
989,2018/09/05,494.0,495.151,498.0,35800,499.0,492.0
990,2018/09/06,490.0,491.054,494.0,29800,498.0,487.0
991,2018/09/07,488.0,488.097,489.0,22800,492.0,486.0
992,2018/09/10,487.0,488.133,486.0,34700,493.0,485.0
993,2018/09/11,484.0,482.543,485.0,40000,486.0,479.0
994,2018/09/12,480.0,479.891,482.0,23800,484.0,478.0
995,2018/09/13,481.0,481.285,478.0,28800,489.0,477.0
996,2018/09/14,490.0,486.236,482.0,33100,492.0,481.0
997,2018/09/18,490.0,489.257,487.0,23700,492.0,487.0
998,2018/09/19,495.0,495.743,491.0,34200,499.0,491.0
999,2018/09/20,500.0,498.222,495.0,33400,502.0,493.0
1000,2018/09/21,500.0,500.881,500.0,38700,505.0,496.0
1001,2018/09/25,512.0,506.029,500.0,35100,512.0,498.0
1002,2018/09/26,511.0,509.907,512.0,22600,513.0,506.0
1003,2018/09/27,503.0,506.921,510.0,25300,511.0,503.0
1004,2018/09/28,507.0,505.319,503.0,43000,514.0,500.0
1005,2018/10/01,507.0,506.74,507.0,20400,510.0,504.0
1006,2018/10/02,501.0,502.635,506.0,25200,506.0,501.0
1007,2018/10/03,496.0,498.885,502.0,26100,502.0,496.0
1008,2018/10/04,494.0,494.798,495.0,20300,498.0,493.0
1009,2018/10/05,498.0,496.677,494.0,31300,502.0,492.0
1010,2018/10/09,504.0,500.618,494.0,37400,507.0,494.0
1011,2018/10/10,502.0,501.312,505.0,24400,505.0,498.0
1012,2018/10/11,492.0,489.161,489.0,60200,497.0,484.0
1013,2018/10/12,495.0,492.119,486.0,40500,499.0,486.0
1014,2018/10/15,486.0,489.38,495.0,28400,498.0,486.0
1015,2018/10/16,484.0,484.238,485.0,34500,488.0,481.0
1016,2018/10/17,495.0,491.355,492.0,40900,497.0,485.0
1017,2018/10/18,498.0,500.481,497.0,38500,514.0,494.0
1018,2018/10/19,498.0,496.272,494.0,22400,501.0,491.0
1019,2018/10/22,500.0,498.516,500.0,18800,503.0,494.0
1020,2018/10/23,496.0,496.484,500.0,42400,501.0,493.0
1021,2018/10/24,495.0,495.494,494.0,24300,500.0,493.0
1022,2018/10/25,490.0,489.002,489.0,55300,492.0,483.0
1023,2018/10/26,482.0,486.144,490.0,29900,491.0,481.0
1024,2018/10/29,470.0,478.04,483.0,35000,488.0,469.0
1025,2018/10/30,494.0,472.02,463.0,49600,494.0,461.0
1026,2018/10/31,485.0,486.432,493.0,31500,493.0,478.0
1027,2018/11/01,478.0,480.223,483.0,21100,485.0,478.0
1028,2018/11/02,480.0,481.908,484.0,13100,485.0,480.0
1029,2018/11/05,482.0,482.11,481.0,23600,485.0,480.0
1030,2018/11/06,483.0,482.731,485.0,19300,487.0,480.0
1031,2018/11/07,482.0,483.972,486.0,28700,489.0,481.0
1032,2018/11/08,486.0,485.262,485.0,21800,487.0,481.0
1033,2018/11/09,487.0,486.895,486.0,23800,489.0,485.0
1034,2018/11/12,493.0,490.582,487.0,30600,494.0,487.0
1035,2018/11/13,498.0,494.082,490.0,62400,501.0,486.0
1036,2018/11/14,495.0,492.922,495.0,75400,497.0,490.0
1037,2018/11/15,495.0,489.538,490.0,21000,495.0,485.0
1038,2018/11/16,486.0,487.715,490.0,15800,494.0,485.0
1039,2018/11/19,488.0,486.919,486.0,12300,490.0,484.0
1040,2018/11/20,480.0,481.7,488.0,11000,488.0,480.0
1041,2018/11/21,477.0,475.781,474.0,43900,481.0,471.0
1042,2018/11/22,479.0,478.215,476.0,21900,481.0,476.0
1043,2018/11/26,482.0,483.534,480.0,20400,487.0,480.0
1044,2018/11/27,482.0,484.224,485.0,19200,489.0,481.0
1045,2018/11/28,487.0,486.823,484.0,18100,489.0,484.0
1046,2018/11/29,487.0,487.667,489.0,21900,489.0,486.0
1047,2018/11/30,488.0,487.708,488.0,26400,490.0,485.0
1048,2018/12/03,490.0,490.87,492.0,13800,493.0,490.0
1049,2018/12/04,487.0,488.544,490.0,29600,492.0,485.0
1050,2018/12/05,482.0,484.954,487.0,17500,487.0,482.0
1051,2018/12/06,480.0,480.093,482.0,31100,483.0,477.0
1052,2018/12/07,476.0,477.215,481.0,30700,482.0,473.0
1053,2018/12/10,465.0,468.952,471.0,27100,472.0,465.0
1054,2018/12/11,453.0,454.237,467.0,53500,467.0,445.0
1055,2018/12/12,461.0,459.682,455.0,43400,466.0,455.0
1056,2018/12/13,466.0,464.725,465.0,26900,468.0,462.0
1057,2018/12/14,462.0,463.659,464.0,27000,469.0,461.0
1058,2018/12/17,464.0,461.532,462.0,13900,464.0,458.0
1059,2018/12/18,449.0,454.505,457.0,27700,462.0,449.0
1060,2018/12/19,446.0,446.369,452.0,52800,453.0,438.0
1061,2018/12/20,429.0,436.148,441.0,46700,442.0,429.0
1062,2018/12/21,413.0,416.772,425.0,75000,426.0,405.0
1063,2018/12/25,384.0,384.909,389.0,111200,397.0,370.0
1064,2018/12/26,390.0,392.183,397.0,51900,400.0,384.0
1065,2018/12/27,421.0,409.647,404.0,35400,421.0,399.0
1066,2018/12/28,419.0,419.055,421.0,38000,421.0,411.0
1067,2019/01/04,417.0,415.765,411.0,46400,421.0,408.0
1068,2019/01/07,424.0,425.233,427.0,30100,427.0,422.0
1069,2019/01/08,426.0,428.293,427.0,29000,432.0,425.0
1070,2019/01/09,429.0,431.282,428.0,39000,434.0,427.0
1071,2019/01/10,425.0,424.498,428.0,26500,428.0,421.0
1072,2019/01/11,431.0,427.673,427.0,27200,431.0,423.0
1073,2019/01/15,430.0,429.337,431.0,25500,431.0,428.0
1074,2019/01/16,429.0,430.3,432.0,15000,433.0,428.0
1075,2019/01/17,428.0,428.969,429.0,22400,433.0,426.0
1076,2019/01/18,430.0,428.689,428.0,19300,430.0,427.0
1077,2019/01/21,430.0,431.106,432.0,13200,433.0,430.0
1078,2019/01/22,429.0,433.676,431.0,68100,439.0,428.0
1079,2019/01/23,431.0,430.478,429.0,13600,432.0,429.0
1080,2019/01/24,440.0,438.482,431.0,42100,450.0,431.0
1081,2019/01/25,444.0,442.968,439.0,36900,447.0,438.0
1082,2019/01/28,450.0,455.823,460.0,103200,470.0,445.0
1083,2019/01/29,444.0,443.63,450.0,33800,450.0,440.0
1084,2019/01/30,443.0,444.0,445.0,22100,448.0,443.0
1085,2019/01/31,441.0,442.423,444.0,41100,446.0,440.0
1086,2019/02/01,445.0,445.343,440.0,28600,454.0,440.0
1087,2019/02/04,448.0,449.623,449.0,15100,453.0,447.0
1088,2019/02/05,459.0,457.029,450.0,31200,464.0,450.0
1089,2019/02/06,458.0,456.849,460.0,44300,461.0,451.0
1090,2019/02/07,459.0,457.571,458.0,15600,460.0,454.0
1091,2019/02/08,452.0,454.086,457.0,37300,458.0,451.0
1092,2019/02/12,466.0,461.86,452.0,37100,467.0,452.0
1093,2019/02/13,441.0,455.251,469.0,198400,489.0,427.0
1094,2019/02/14,444.0,438.196,446.0,72900,449.0,432.0
1095,2019/02/15,442.0,439.404,441.0,18800,443.0,435.0
1096,2019/02/18,442.0,441.191,442.0,21500,444.0,439.0
1097,2019/02/19,441.0,440.906,439.0,27700,445.0,438.0
1098,2019/02/20,441.0,440.633,442.0,16600,444.0,438.0
1099,2019/02/21,442.0,442.41,441.0,15600,444.0,441.0
1100,2019/02/22,445.0,441.977,442.0,60400,445.0,440.0
1101,2019/02/25,449.0,447.921,447.0,18900,451.0,445.0
1102,2019/02/26,447.0,447.829,449.0,23400,450.0,445.0
1103,2019/02/27,448.0,448.041,448.0,43600,450.0,446.0
1104,2019/02/28,446.0,447.114,448.0,40400,448.0,445.0
1105,2019/03/01,447.0,446.06,446.0,18200,448.0,444.0
1106,2019/03/04,447.0,447.981,448.0,31500,450.0,447.0
1107,2019/03/05,444.0,445.84,446.0,68300,451.0,443.0
1108,2019/03/06,446.0,445.373,446.0,46100,447.0,443.0
1109,2019/03/07,440.0,440.916,446.0,50200,446.0,437.0
1110,2019/03/08,431.0,434.831,436.0,37900,437.0,431.0
1111,2019/03/11,443.0,435.903,431.0,50700,444.0,429.0
1112,2019/03/12,446.0,443.715,444.0,38200,446.0,435.0
1113,2019/03/13,441.0,442.55,444.0,26900,445.0,439.0
1114,2019/03/14,436.0,437.486,441.0,28000,441.0,434.0
1115,2019/03/15,440.0,440.435,439.0,51700,445.0,438.0
1116,2019/03/18,444.0,442.75,441.0,31200,444.0,441.0
1117,2019/03/19,445.0,444.312,446.0,45500,447.0,442.0
1118,2019/03/20,455.0,451.133,448.0,66800,455.0,448.0
1119,2019/03/22,465.0,461.013,457.0,67000,467.0,451.0
1120,2019/03/25,458.0,455.671,459.0,83600,459.0,452.0
1121,2019/03/26,456.0,457.33,458.0,177500,460.0,454.0
1122,2019/03/27,453.0,451.138,453.0,128500,454.0,445.0
1123,2019/03/28,454.0,455.257,455.0,63800,461.0,451.0
1124,2019/03/29,460.0,456.714,455.0,39900,460.0,455.0
1125,2019/04/01,471.0,470.517,470.0,160400,478.0,465.0
1126,2019/04/02,468.0,471.094,473.0,88400,480.0,466.0
1127,2019/04/03,465.0,463.379,468.0,69400,468.0,458.0
1128,2019/04/04,461.0,463.263,467.0,31200,467.0,460.0
1129,2019/04/05,464.0,461.526,465.0,25100,465.0,458.0
1130,2019/04/08,463.0,463.309,464.0,27500,468.0,460.0
1131,2019/04/09,458.0,456.962,460.0,18500,461.0,452.0
1132,2019/04/10,468.0,467.916,461.0,66800,475.0,461.0
1133,2019/04/11,483.0,478.869,475.0,112700,485.0,470.0
1134,2019/04/12,481.0,479.739,484.0,57500,486.0,474.0
1135,2019/04/15,496.0,491.602,488.0,112200,497.0,485.0
1136,2019/04/16,539.0,530.766,500.0,426400,547.0,500.0
1137,2019/04/17,522.0,525.175,530.0,193700,534.0,520.0
1138,2019/04/18,500.0,503.475,516.0,154000,517.0,495.0
1139,2019/04/19,513.0,511.26,505.0,114800,519.0,503.0
1140,2019/04/22,496.0,499.393,505.0,69800,506.0,489.0
1141,2019/04/23,491.0,492.187,496.0,59300,496.0,489.0
1142,2019/04/24,490.0,490.396,493.0,40200,494.0,488.0
1143,2019/04/25,488.0,486.596,490.0,33900,490.0,483.0
1144,2019/04/26,486.0,485.272,488.0,37200,488.0,481.0
1145,2019/05/07,503.0,501.757,494.0,139900,514.0,494.0
1146,2019/05/08,516.0,509.647,507.0,82800,517.0,503.0
1147,2019/05/09,501.0,507.304,516.0,60500,516.0,501.0
1148,2019/05/10,591.0,562.247,500.0,924800,594.0,496.0
1149,2019/05/13,584.0,583.056,594.0,322000,595.0,570.0
1150,2019/05/14,590.0,570.43,564.0,170600,590.0,558.0
1151,2019/05/15,591.0,581.05,586.0,82600,592.0,571.0
1152,2019/05/16,579.0,578.873,585.0,61200,585.0,575.0
1153,2019/05/17,573.0,567.503,577.0,126700,577.0,559.0
1154,2019/05/20,544.0,548.339,563.0,181400,568.0,540.0
1155,2019/05/21,536.0,542.159,545.0,172600,555.0,532.0
1156,2019/05/22,536.0,538.944,541.0,82600,545.0,533.0
1157,2019/05/23,546.0,537.67,542.0,79800,549.0,531.0
1158,2019/05/24,529.0,528.861,540.0,237800,540.0,521.0
1159,2019/05/27,532.0,535.528,531.0,178100,548.0,529.0
1160,2019/05/28,539.0,535.935,536.0,64100,542.0,533.0
1161,2019/05/29,535.0,537.912,542.0,78800,545.0,533.0
1162,2019/05/30,525.0,525.015,535.0,88800,535.0,517.0
1163,2019/05/31,523.0,522.998,523.0,64000,528.0,520.0
1164,2019/06/03,514.0,510.397,515.0,65500,516.0,504.0
1165,2019/06/04,519.0,517.778,519.0,77500,523.0,510.0
1166,2019/06/05,533.0,529.367,525.0,54500,535.0,522.0
1167,2019/06/06,535.0,539.426,543.0,96300,548.0,533.0
1168,2019/06/07,531.0,529.84,535.0,70400,537.0,522.0
1169,2019/06/10,542.0,538.377,536.0,48800,544.0,533.0
1170,2019/06/11,547.0,547.823,547.0,63100,554.0,544.0
1171,2019/06/12,561.0,556.461,548.0,94600,563.0,545.0
1172,2019/06/13,557.0,556.705,558.0,75000,565.0,548.0
1173,2019/06/14,562.0,558.762,559.0,51200,564.0,551.0
1174,2019/06/17,551.0,554.26,562.0,60000,562.0,549.0
1175,2019/06/18,548.0,549.104,550.0,38300,555.0,545.0
1176,2019/06/19,552.0,551.977,550.0,51000,557.0,548.0
1177,2019/06/20,552.0,554.534,553.0,23400,559.0,549.0
1178,2019/06/21,536.0,540.183,553.0,62400,553.0,535.0
1179,2019/06/24,540.0,537.166,534.0,33200,542.0,530.0
1180,2019/06/25,534.0,536.425,535.0,24700,542.0,533.0
1181,2019/06/26,534.0,529.318,532.0,69600,536.0,523.0
1182,2019/06/27,538.0,538.503,537.0,31600,542.0,536.0
1183,2019/06/28,546.0,544.547,541.0,34200,549.0,540.0
1184,2019/07/01,555.0,556.318,560.0,34600,564.0,550.0
1185,2019/07/02,552.0,553.213,555.0,35200,558.0,547.0
1186,2019/07/03,546.0,547.589,553.0,16800,553.0,543.0
1187,2019/07/04,548.0,547.444,548.0,17100,550.0,544.0
1188,2019/07/05,541.0,544.369,549.0,22200,549.0,540.0
1189,2019/07/08,538.0,537.778,538.0,32000,540.0,534.0
1190,2019/07/09,535.0,535.156,537.0,20500,537.0,533.0
1191,2019/07/10,537.0,532.733,533.0,49100,540.0,524.0
1192,2019/07/11,545.0,540.81,540.0,23100,546.0,535.0
1193,2019/07/12,534.0,535.122,545.0,35300,548.0,528.0
1194,2019/07/16,526.0,526.72,534.0,38500,534.0,524.0
1195,2019/07/17,520.0,516.265,526.0,79600,526.0,511.0
1196,2019/07/18,506.0,509.336,517.0,36000,521.0,503.0
1197,2019/07/19,512.0,511.763,511.0,39600,517.0,507.0
1198,2019/07/22,509.0,511.235,516.0,8100,516.0,508.0
1199,2019/07/23,511.0,511.375,514.0,27200,515.0,505.0
1200,2019/07/24,511.0,511.803,514.0,24300,514.0,509.0
1201,2019/07/25,517.0,513.686,512.0,25500,517.0,508.0
1202,2019/07/26,516.0,515.14,516.0,37800,519.0,510.0
1203,2019/07/29,524.0,521.807,517.0,22800,526.0,517.0
1204,2019/07/30,528.0,525.131,527.0,30500,530.0,520.0
1205,2019/07/31,522.0,523.703,527.0,30300,527.0,519.0
1206,2019/08/01,524.0,519.954,517.0,32400,524.0,515.0
1207,2019/08/02,512.0,514.19,516.0,49900,520.0,510.0
1208,2019/08/05,507.0,507.004,513.0,49500,514.0,498.0
1209,2019/08/06,503.0,496.952,489.0,49900,506.0,488.0
1210,2019/08/07,506.0,506.385,504.0,47800,510.0,500.0
1211,2019/08/08,515.0,515.399,514.0,51700,520.0,510.0
1212,2019/08/09,514.0,542.985,519.0,799600,572.0,508.0
1213,2019/08/13,473.0,479.715,500.0,439100,501.0,469.0
1214,2019/08/14,475.0,474.193,481.0,158000,482.0,470.0
1215,2019/08/15,480.0,472.435,461.0,77400,480.0,461.0
1216,2019/08/16,484.0,483.856,483.0,36900,488.0,480.0
1217,2019/08/19,501.0,493.566,489.0,27200,501.0,485.0
1218,2019/08/20,493.0,493.639,501.0,29100,502.0,490.0
1219,2019/08/21,489.0,489.829,495.0,16400,495.0,488.0
1220,2019/08/22,482.0,483.405,489.0,24700,489.0,480.0
1221,2019/08/23,481.0,482.257,482.0,14800,485.0,480.0
