ds,yhat
2019-08-21,1411.566686148087
2019-08-22,1429.441948834019
2019-08-23,1440.104780262052
2019-08-26,1430.751653415207
2019-08-27,1434.720883805469
2019-08-28,1442.5927521651777
2019-08-29,1448.444836692931
2019-08-30,1449.77912791276
2019-09-02,1454.9314923537884
2019-09-03,1457.4436205571867
2019-09-04,1455.3549421324658
2019-09-05,1450.8859477936896
2019-09-06,1450.6454014020653
2019-09-09,1485.0318885298482
2019-09-10,1485.3615122841397
2019-09-11,1476.4959152159593
2019-09-12,1469.1405242836906
2019-09-13,1474.3694621487189
2019-09-17,1538.1343592231656
2019-09-18,1534.3037475315052
2019-09-19,1535.47345451689
