,DateTime,Open,High,Low,Close,VWAP,Trades,Volume,DS
0,2019/11/19 9:15:00,485.0,485.0,485.0,485.0,485.0,1,200.0,2019-11-19 09:15:00
1,2019/11/19 9:20:00,486.0,486.0,486.0,486.0,486.0,2,1900.0,2019-11-19 09:20:00
2,2019/11/19 10:44:00,486.0,486.0,486.0,486.0,486.0,1,100.0,2019-11-19 10:44:00
3,2019/11/19 11:17:00,485.0,485.0,485.0,485.0,485.0,1,1100.0,2019-11-19 11:17:00
4,2019/11/19 12:30:00,483.0,483.0,483.0,483.0,483.0,1,100.0,2019-11-19 12:30:00
5,2019/11/19 12:48:00,483.0,483.0,483.0,483.0,483.0,1,100.0,2019-11-19 12:48:00
6,2019/11/19 13:27:00,483.0,483.0,483.0,483.0,483.0,1,100.0,2019-11-19 13:27:00
7,2019/11/19 14:17:00,485.0,485.0,485.0,485.0,485.0,1,100.0,2019-11-19 14:17:00
8,2019/11/19 14:59:00,486.0,486.0,486.0,486.0,486.0,1,100.0,2019-11-19 14:59:00
9,2019/11/19 15:00:00,487.0,487.0,487.0,487.0,487.0,1,700.0,2019-11-19 15:00:00
