,Date,Close,VWAP,Open,Volume,High,Low
0,2014/08/25,1877.0,1880.517,1889.0,55700,1889.0,1874.0
1,2014/08/26,1871.0,1873.062,1877.0,60200,1879.0,1870.0
2,2014/08/27,1876.0,1874.616,1871.0,106300,1877.0,1871.0
3,2014/08/28,1859.0,1859.421,1872.0,140000,1872.0,1852.0
4,2014/08/29,1846.0,1847.672,1858.0,153200,1858.0,1840.0
5,2014/09/01,1848.0,1847.886,1850.0,78800,1853.0,1845.0
6,2014/09/02,1860.0,1856.716,1855.0,80200,1865.0,1848.0
7,2014/09/03,1852.0,1858.872,1869.0,74200,1872.0,1851.0
8,2014/09/04,1845.0,1847.912,1852.0,104300,1854.0,1845.0
9,2014/09/05,1841.0,1845.753,1860.0,133800,1860.0,1838.0
10,2014/09/08,1836.0,1840.202,1850.0,136000,1852.0,1832.0
11,2014/09/09,1835.0,1836.493,1844.0,78500,1844.0,1833.0
12,2014/09/10,1858.0,1852.004,1835.0,164500,1861.0,1834.0
13,2014/09/11,1856.0,1857.88,1864.0,58300,1865.0,1854.0
14,2014/09/12,1851.0,1855.512,1859.0,170100,1859.0,1846.0
15,2014/09/16,1853.0,1853.212,1859.0,129100,1859.0,1849.0
16,2014/09/17,1853.0,1854.187,1853.0,67300,1857.0,1851.0
17,2014/09/18,1856.0,1860.396,1860.0,149500,1867.0,1853.0
18,2014/09/19,1853.0,1854.877,1856.0,170400,1860.0,1851.0
19,2014/09/22,1861.0,1861.661,1860.0,146700,1865.0,1857.0
20,2014/09/24,1863.0,1861.95,1861.0,198900,1864.0,1861.0
21,2014/09/25,1857.0,1858.348,1862.0,548500,1865.0,1852.0
22,2014/09/26,1794.0,1794.646,1801.0,619500,1812.0,1790.0
23,2014/09/29,1797.0,1793.919,1800.0,311700,1801.0,1787.0
24,2014/09/30,1793.0,1790.131,1801.0,305500,1802.0,1783.0
25,2014/10/01,1780.0,1782.875,1793.0,277400,1796.0,1777.0
26,2014/10/02,1750.0,1760.117,1771.0,334700,1773.0,1750.0
27,2014/10/03,1760.0,1758.093,1750.0,170500,1764.0,1750.0
28,2014/10/06,1781.0,1783.462,1779.0,227000,1790.0,1774.0
29,2014/10/07,1779.0,1787.164,1787.0,184300,1798.0,1778.0
30,2014/10/08,1760.0,1761.389,1761.0,225300,1772.0,1755.0
31,2014/10/09,1750.0,1756.786,1760.0,204000,1769.0,1750.0
32,2014/10/10,1742.0,1735.15,1738.0,293200,1745.0,1726.0
33,2014/10/14,1727.0,1733.678,1726.0,301100,1749.0,1723.0
34,2014/10/15,1703.0,1707.409,1726.0,359200,1730.0,1698.0
35,2014/10/16,1688.0,1691.528,1691.0,262700,1704.0,1682.0
36,2014/10/17,1679.0,1685.811,1690.0,247100,1699.0,1679.0
37,2014/10/20,1720.0,1721.772,1716.0,178500,1735.0,1715.0
38,2014/10/21,1695.0,1702.339,1721.0,143300,1721.0,1692.0
39,2014/10/22,1737.0,1726.206,1709.0,131800,1739.0,1709.0
40,2014/10/23,1730.0,1733.066,1726.0,83900,1743.0,1721.0
41,2014/10/24,1745.0,1742.455,1746.0,100500,1749.0,1734.0
42,2014/10/27,1763.0,1761.645,1751.0,87800,1771.0,1751.0
43,2014/10/28,1762.0,1762.757,1762.0,63400,1771.0,1755.0
44,2014/10/29,1776.0,1777.364,1774.0,155000,1788.0,1764.0
45,2014/10/30,1792.0,1789.732,1786.0,201200,1794.0,1773.0
46,2014/10/31,1820.0,1808.494,1799.0,363900,1830.0,1784.0
47,2014/11/04,1846.0,1855.77,1838.0,507900,1873.0,1830.0
48,2014/11/05,1852.0,1844.619,1836.0,227300,1856.0,1832.0
49,2014/11/06,1830.0,1844.756,1855.0,172100,1863.0,1829.0
50,2014/11/07,1859.0,1854.653,1846.0,126700,1862.0,1838.0
51,2014/11/10,1868.0,1863.387,1857.0,111500,1868.0,1847.0
52,2014/11/11,1882.0,1877.173,1869.0,177000,1884.0,1867.0
53,2014/11/12,1876.0,1885.172,1885.0,220000,1894.0,1875.0
54,2014/11/13,1839.0,1828.598,1836.0,498800,1845.0,1806.0
55,2014/11/14,1860.0,1848.284,1851.0,268800,1860.0,1835.0
56,2014/11/17,1834.0,1839.864,1850.0,157700,1851.0,1827.0
57,2014/11/18,1839.0,1836.831,1841.0,154200,1855.0,1824.0
58,2014/11/19,1815.0,1826.591,1845.0,172500,1846.0,1814.0
59,2014/11/20,1733.0,1745.718,1787.0,844500,1789.0,1732.0
60,2014/11/21,1731.0,1727.672,1739.0,616300,1741.0,1715.0
61,2014/11/25,1722.0,1726.636,1750.0,333600,1750.0,1718.0
62,2014/11/26,1726.0,1727.179,1722.0,187100,1731.0,1721.0
63,2014/11/27,1726.0,1727.237,1726.0,208200,1733.0,1722.0
64,2014/11/28,1733.0,1732.732,1733.0,205500,1740.0,1725.0
65,2014/12/01,1736.0,1736.605,1737.0,262000,1746.0,1730.0
66,2014/12/02,1749.0,1745.077,1737.0,232200,1752.0,1734.0
67,2014/12/03,1745.0,1744.947,1752.0,306500,1755.0,1740.0
68,2014/12/04,1733.0,1742.475,1746.0,282100,1756.0,1731.0
69,2014/12/05,1738.0,1734.084,1731.0,209200,1740.0,1727.0
70,2014/12/08,1742.0,1740.103,1744.0,155700,1744.0,1737.0
71,2014/12/09,1748.0,1747.093,1741.0,159000,1752.0,1740.0
72,2014/12/10,1757.0,1753.871,1745.0,232900,1760.0,1742.0
73,2014/12/11,1750.0,1747.573,1750.0,187700,1756.0,1741.0
74,2014/12/12,1731.0,1738.717,1741.0,257500,1749.0,1731.0
75,2014/12/15,1741.0,1744.54,1730.0,251900,1758.0,1727.0
76,2014/12/16,1728.0,1728.291,1731.0,182200,1738.0,1720.0
77,2014/12/17,1723.0,1724.662,1726.0,243600,1733.0,1716.0
78,2014/12/18,1726.0,1732.695,1739.0,275100,1747.0,1725.0
79,2014/12/19,1751.0,1745.201,1749.0,250900,1752.0,1734.0
80,2014/12/22,1763.0,1756.495,1752.0,212600,1763.0,1746.0
81,2014/12/24,1774.0,1770.07,1776.0,134900,1780.0,1762.0
82,2014/12/25,1775.0,1775.332,1780.0,107000,1780.0,1770.0
83,2014/12/26,1772.0,1773.856,1775.0,118800,1781.0,1768.0
84,2014/12/29,1781.0,1776.794,1782.0,209800,1788.0,1764.0
85,2014/12/30,1774.0,1776.114,1771.0,207500,1785.0,1771.0
86,2015/01/05,1760.0,1773.075,1775.0,274300,1787.0,1758.0
87,2015/01/06,1732.0,1743.04,1754.0,238400,1757.0,1730.0
88,2015/01/07,1730.0,1732.368,1732.0,137000,1739.0,1727.0
89,2015/01/08,1737.0,1740.844,1744.0,123500,1750.0,1734.0
90,2015/01/09,1727.0,1732.819,1740.0,186200,1747.0,1725.0
91,2015/01/13,1731.0,1723.116,1727.0,282700,1732.0,1715.0
92,2015/01/14,1742.0,1740.732,1730.0,197800,1750.0,1729.0
93,2015/01/15,1767.0,1762.226,1744.0,197700,1773.0,1743.0
94,2015/01/16,1757.0,1750.919,1753.0,160700,1760.0,1737.0
95,2015/01/19,1780.0,1774.0,1769.0,192600,1784.0,1759.0
96,2015/01/20,1810.0,1802.253,1783.0,297600,1810.0,1780.0
97,2015/01/21,1807.0,1807.168,1810.0,174500,1814.0,1798.0
98,2015/01/22,1791.0,1788.428,1803.0,233800,1803.0,1779.0
99,2015/01/23,1794.0,1795.32,1802.0,206600,1809.0,1783.0
100,2015/01/26,1806.0,1801.754,1794.0,190300,1809.0,1793.0
101,2015/01/27,1818.0,1812.024,1810.0,200500,1819.0,1802.0
102,2015/01/28,1837.0,1830.217,1817.0,161100,1840.0,1812.0
103,2015/01/29,1850.0,1848.987,1830.0,271500,1858.0,1829.0
104,2015/01/30,1862.0,1856.353,1859.0,214500,1865.0,1842.0
105,2015/02/02,1886.0,1879.871,1852.0,298800,1897.0,1844.0
106,2015/02/03,1877.0,1881.127,1888.0,300000,1889.0,1871.0
107,2015/02/04,1881.0,1886.108,1887.0,180800,1898.0,1879.0
108,2015/02/05,1892.0,1883.881,1880.0,212900,1893.0,1866.0
109,2015/02/06,1890.0,1892.065,1892.0,139400,1899.0,1887.0
110,2015/02/09,1956.0,1938.107,1895.0,599600,1960.0,1893.0
111,2015/02/10,1945.0,1948.097,1950.0,327800,1969.0,1934.0
112,2015/02/12,1943.0,1953.897,1954.0,269700,1969.0,1941.0
113,2015/02/13,1962.0,1956.905,1945.0,216500,1969.0,1935.0
114,2015/02/16,1979.0,1977.372,1957.0,203200,1985.0,1957.0
115,2015/02/17,1969.0,1974.986,1975.0,138100,1985.0,1968.0
116,2015/02/18,1991.0,1993.394,1984.0,352400,2000.0,1973.0
117,2015/02/19,1988.0,1994.419,1991.0,243200,2004.0,1984.0
118,2015/02/20,1969.0,1974.063,1990.0,208900,1995.0,1964.0
119,2015/02/23,1969.0,1970.096,1969.0,218400,1983.0,1951.0
120,2015/02/24,1978.0,1980.947,1972.0,159300,1990.0,1969.0
121,2015/02/25,1983.0,1980.355,1986.0,107700,1987.0,1971.0
122,2015/02/26,1998.0,1994.137,1985.0,140500,1999.0,1980.0
123,2015/02/27,1991.0,1995.355,2000.0,188900,2005.0,1983.0
124,2015/03/02,2004.0,2000.64,1991.0,144700,2007.0,1989.0
125,2015/03/03,2017.0,2010.956,2005.0,213000,2020.0,1997.0
126,2015/03/04,2013.0,2005.255,2001.0,176200,2017.0,1992.0
127,2015/03/05,2018.0,2013.07,2013.0,162000,2018.0,2003.0
128,2015/03/06,2021.0,2014.606,2015.0,331800,2024.0,2000.0
129,2015/03/09,2034.0,2027.74,2019.0,229500,2039.0,2005.0
130,2015/03/10,2034.0,2037.048,2044.0,189400,2049.0,2027.0
131,2015/03/11,2113.0,2087.633,2036.0,553600,2124.0,2036.0
132,2015/03/12,2115.0,2114.392,2113.0,252800,2125.0,2101.0
133,2015/03/13,2145.0,2134.071,2128.0,437100,2150.0,2115.0
134,2015/03/16,2114.0,2120.863,2149.0,321100,2154.0,2099.0
135,2015/03/17,2115.0,2113.265,2126.0,128200,2133.0,2101.0
136,2015/03/18,2127.0,2120.86,2115.0,243500,2128.0,2109.0
137,2015/03/19,2141.0,2136.373,2122.0,244000,2150.0,2121.0
138,2015/03/20,2157.0,2150.198,2150.0,237100,2162.0,2133.0
139,2015/03/23,2184.0,2175.068,2160.0,219900,2186.0,2160.0
140,2015/03/24,2174.0,2173.709,2170.0,246800,2184.0,2160.0
141,2015/03/25,2165.0,2169.266,2185.0,207500,2195.0,2153.0
142,2015/03/26,2129.0,2136.624,2164.0,453500,2168.0,2109.0
143,2015/03/27,2090.0,2099.356,2060.0,458200,2129.0,2060.0
144,2015/03/30,2069.0,2071.819,2088.0,367300,2114.0,2047.0
145,2015/03/31,2080.0,2092.059,2092.0,224900,2110.0,2074.0
146,2015/04/01,2090.0,2086.823,2078.0,320200,2104.0,2064.0
147,2015/04/02,2083.0,2088.661,2069.0,213200,2102.0,2069.0
148,2015/04/03,2071.0,2072.369,2075.0,130700,2084.0,2055.0
149,2015/04/06,2059.0,2060.231,2056.0,142600,2072.0,2052.0
150,2015/04/07,2086.0,2073.197,2052.0,232100,2091.0,2037.0
151,2015/04/08,2089.0,2094.196,2095.0,119900,2110.0,2085.0
152,2015/04/09,2102.0,2099.281,2092.0,223900,2106.0,2089.0
153,2015/04/10,2098.0,2099.177,2101.0,127500,2107.0,2088.0
154,2015/04/13,2093.0,2091.565,2104.0,98600,2104.0,2082.0
155,2015/04/14,2095.0,2091.043,2081.0,94600,2103.0,2075.0
156,2015/04/15,2074.0,2075.305,2090.0,84500,2091.0,2066.0
157,2015/04/16,2103.0,2090.659,2077.0,162200,2109.0,2071.0
158,2015/04/17,2101.0,2102.805,2093.0,171900,2110.0,2081.0
159,2015/04/20,2065.0,2076.598,2083.0,112800,2100.0,2061.0
160,2015/04/21,2062.0,2058.319,2053.0,131900,2067.0,2051.0
161,2015/04/22,2081.0,2077.58,2071.0,96700,2085.0,2067.0
162,2015/04/23,2081.0,2083.528,2081.0,85800,2092.0,2075.0
163,2015/04/24,2074.0,2070.81,2075.0,184900,2085.0,2061.0
164,2015/04/27,2075.0,2069.302,2079.0,121400,2079.0,2053.0
165,2015/04/28,2058.0,2061.405,2075.0,104400,2075.0,2052.0
166,2015/04/30,2054.0,2043.469,2049.0,177500,2055.0,2025.0
167,2015/05/01,2022.0,2028.443,2035.0,95600,2049.0,2020.0
168,2015/05/07,2022.0,2026.716,2015.0,137300,2040.0,2007.0
169,2015/05/08,2027.0,2027.383,2020.0,110500,2038.0,2015.0
170,2015/05/11,2083.0,2078.888,2051.0,171700,2090.0,2050.0
171,2015/05/12,2075.0,2069.79,2068.0,84200,2079.0,2055.0
172,2015/05/13,2061.0,2066.628,2081.0,69100,2081.0,2055.0
173,2015/05/14,2036.0,2037.433,2050.0,95300,2055.0,2029.0
174,2015/05/15,2073.0,2054.458,2028.0,105300,2075.0,2020.0
175,2015/05/18,2024.0,2048.889,2100.0,486400,2103.0,2020.0
176,2015/05/19,2042.0,2034.025,2010.0,345500,2057.0,2002.0
177,2015/05/20,2059.0,2050.358,2042.0,159100,2067.0,2027.0
178,2015/05/21,2053.0,2056.124,2060.0,82300,2066.0,2047.0
179,2015/05/22,2065.0,2060.184,2060.0,103300,2069.0,2052.0
180,2015/05/25,2052.0,2052.684,2072.0,149900,2077.0,2041.0
181,2015/05/26,2063.0,2063.055,2060.0,153400,2074.0,2052.0
182,2015/05/27,2055.0,2054.646,2062.0,150900,2069.0,2040.0
183,2015/05/28,2044.0,2043.864,2055.0,108800,2056.0,2038.0
184,2015/05/29,2042.0,2044.547,2046.0,90900,2054.0,2033.0
185,2015/06/01,2034.0,2035.703,2042.0,89600,2057.0,2028.0
186,2015/06/02,2036.0,2033.134,2034.0,126700,2042.0,2022.0
187,2015/06/03,2095.0,2078.075,2036.0,230500,2099.0,2036.0
188,2015/06/04,2138.0,2129.721,2105.0,385900,2146.0,2100.0
189,2015/06/05,2149.0,2146.932,2134.0,287800,2160.0,2108.0
190,2015/06/08,2159.0,2151.196,2150.0,195400,2159.0,2140.0
191,2015/06/09,2160.0,2159.892,2130.0,194400,2172.0,2130.0
192,2015/06/10,2155.0,2159.652,2170.0,151700,2179.0,2151.0
193,2015/06/11,2176.0,2168.386,2155.0,166700,2176.0,2154.0
194,2015/06/12,2165.0,2181.337,2195.0,275400,2195.0,2158.0
195,2015/06/15,2171.0,2165.508,2160.0,119000,2181.0,2155.0
196,2015/06/16,2161.0,2150.309,2160.0,174200,2164.0,2130.0
197,2015/06/17,2166.0,2162.35,2161.0,218900,2176.0,2148.0
198,2015/06/18,2108.0,2119.975,2160.0,284200,2160.0,2107.0
199,2015/06/19,2128.0,2127.133,2119.0,138400,2140.0,2112.0
200,2015/06/22,2132.0,2130.768,2122.0,78300,2148.0,2116.0
201,2015/06/23,2135.0,2136.411,2141.0,153700,2158.0,2122.0
202,2015/06/24,2144.0,2144.779,2150.0,124600,2155.0,2137.0
203,2015/06/25,2120.0,2131.01,2144.0,107700,2144.0,2118.0
204,2015/06/26,2131.0,2118.902,2122.0,119500,2131.0,2097.0
205,2015/06/29,2096.0,2099.492,2097.0,129800,2114.0,2082.0
206,2015/06/30,2115.0,2103.473,2100.0,145200,2117.0,2087.0
207,2015/07/01,2117.0,2117.062,2118.0,88800,2124.0,2108.0
208,2015/07/02,2137.0,2136.255,2132.0,201700,2146.0,2118.0
209,2015/07/03,2140.0,2138.729,2142.0,94500,2148.0,2127.0
210,2015/07/06,2136.0,2134.836,2106.0,132600,2148.0,2098.0
211,2015/07/07,2140.0,2141.891,2144.0,193000,2148.0,2137.0
212,2015/07/08,2133.0,2137.387,2133.0,223700,2146.0,2125.0
213,2015/07/09,2040.0,2037.902,2070.0,417900,2070.0,2013.0
214,2015/07/10,2048.0,2057.401,2050.0,178500,2079.0,2041.0
215,2015/07/13,2076.0,2091.463,2080.0,237200,2121.0,2065.0
216,2015/07/14,2114.0,2104.115,2111.0,93400,2114.0,2088.0
217,2015/07/15,2123.0,2121.483,2120.0,113200,2132.0,2112.0
218,2015/07/16,2130.0,2132.002,2128.0,128200,2148.0,2114.0
219,2015/07/17,2132.0,2129.442,2131.0,78000,2136.0,2122.0
220,2015/07/21,2136.0,2136.525,2135.0,104500,2145.0,2130.0
221,2015/07/22,2117.0,2120.075,2128.0,68200,2128.0,2113.0
222,2015/07/23,2137.0,2126.37,2118.0,112200,2139.0,2106.0
223,2015/07/24,2134.0,2136.339,2141.0,57900,2144.0,2131.0
224,2015/07/27,2135.0,2134.306,2146.0,94100,2146.0,2123.0
225,2015/07/28,2132.0,2118.494,2120.0,112100,2143.0,2092.0
226,2015/07/29,2147.0,2136.767,2135.0,61400,2148.0,2117.0
227,2015/07/30,2160.0,2159.579,2127.0,107300,2174.0,2127.0
228,2015/07/31,2351.0,2328.204,2275.0,581200,2355.0,2275.0
229,2015/08/03,2423.0,2391.02,2351.0,371600,2433.0,2340.0
230,2015/08/04,2452.0,2434.019,2386.0,488600,2465.0,2385.0
231,2015/08/05,2464.0,2461.839,2440.0,380700,2482.0,2430.0
232,2015/08/06,2488.0,2489.14,2475.0,337700,2504.0,2467.0
233,2015/08/07,2444.0,2454.603,2488.0,260800,2488.0,2437.0
234,2015/08/10,2461.0,2462.456,2462.0,254300,2469.0,2446.0
235,2015/08/11,2453.0,2455.916,2463.0,275000,2467.0,2427.0
236,2015/08/12,2453.0,2459.078,2453.0,256900,2470.0,2434.0
237,2015/08/13,2446.0,2450.369,2437.0,253800,2468.0,2429.0
238,2015/08/14,2441.0,2447.494,2442.0,151600,2464.0,2428.0
239,2015/08/17,2460.0,2458.768,2441.0,227900,2468.0,2435.0
240,2015/08/18,2496.0,2489.989,2460.0,184700,2499.0,2460.0
241,2015/08/19,2450.0,2481.386,2485.0,263200,2532.0,2448.0
242,2015/08/20,2406.0,2423.291,2435.0,280100,2450.0,2404.0
243,2015/08/21,2381.0,2386.666,2377.0,271700,2405.0,2369.0
244,2015/08/24,2258.0,2302.232,2331.0,392000,2353.0,2257.0
245,2015/08/25,2245.0,2245.327,2200.0,417400,2310.0,2153.0
246,2015/08/26,2325.0,2300.639,2245.0,382900,2334.0,2245.0
247,2015/08/27,2393.0,2391.746,2365.0,301600,2423.0,2355.0
248,2015/08/28,2389.0,2403.288,2435.0,362900,2452.0,2381.0
249,2015/08/31,2415.0,2402.856,2396.0,324600,2418.0,2375.0
250,2015/09/01,2268.0,2323.169,2408.0,373700,2413.0,2264.0
251,2015/09/02,2217.0,2239.986,2238.0,326900,2281.0,2208.0
252,2015/09/03,2209.0,2230.744,2230.0,222000,2263.0,2205.0
253,2015/09/04,2175.0,2184.684,2217.0,183700,2219.0,2161.0
254,2015/09/07,2178.0,2172.025,2160.0,141200,2204.0,2141.0
255,2015/09/08,2104.0,2127.978,2178.0,199900,2192.0,2097.0
256,2015/09/09,2160.0,2149.133,2172.0,243500,2182.0,2132.0
257,2015/09/10,2155.0,2143.951,2126.0,221800,2163.0,2116.0
258,2015/09/11,2170.0,2141.575,2112.0,228700,2180.0,2112.0
259,2015/09/14,2158.0,2173.901,2198.0,123200,2211.0,2158.0
260,2015/09/15,2161.0,2166.036,2162.0,124600,2185.0,2155.0
261,2015/09/16,2135.0,2135.648,2173.0,160500,2177.0,2124.0
262,2015/09/17,2114.0,2107.898,2137.0,240200,2137.0,2086.0
263,2015/09/18,2112.0,2111.003,2112.0,164800,2133.0,2081.0
264,2015/09/24,2061.0,2096.182,2100.0,293800,2141.0,2059.0
265,2015/09/25,2114.0,2102.559,2073.0,475300,2144.0,2073.0
266,2015/09/28,2205.0,2185.799,2123.0,363500,2214.0,2118.0
267,2015/09/29,2158.0,2161.611,2177.0,298500,2190.0,2140.0
268,2015/09/30,2166.0,2172.401,2187.0,298500,2197.0,2159.0
269,2015/10/01,2161.0,2167.878,2179.0,196500,2184.0,2158.0
270,2015/10/02,2153.0,2154.817,2153.0,194900,2177.0,2137.0
271,2015/10/05,2202.0,2199.899,2168.0,193000,2219.0,2152.0
272,2015/10/06,2195.0,2202.36,2214.0,158600,2232.0,2182.0
273,2015/10/07,2155.0,2166.819,2205.0,210000,2207.0,2149.0
274,2015/10/08,2122.0,2127.584,2126.0,155400,2140.0,2114.0
275,2015/10/09,2135.0,2129.429,2123.0,158500,2148.0,2101.0
276,2015/10/13,2127.0,2129.804,2125.0,140000,2150.0,2107.0
277,2015/10/14,2089.0,2098.06,2099.0,211400,2126.0,2085.0
278,2015/10/15,2106.0,2108.8,2084.0,156200,2126.0,2080.0
279,2015/10/16,2071.0,2092.971,2106.0,191400,2128.0,2070.0
280,2015/10/19,2054.0,2067.334,2070.0,157400,2093.0,2052.0
281,2015/10/20,2042.0,2044.818,2064.0,136600,2074.0,2035.0
282,2015/10/21,2062.0,2062.217,2038.0,130700,2076.0,2038.0
283,2015/10/22,2049.0,2053.443,2043.0,137800,2070.0,2037.0
284,2015/10/23,2078.0,2081.329,2085.0,122200,2097.0,2059.0
285,2015/10/26,2066.0,2074.317,2094.0,117500,2094.0,2064.0
286,2015/10/27,2061.0,2072.706,2066.0,101800,2092.0,2060.0
287,2015/10/28,2061.0,2059.913,2061.0,81900,2070.0,2048.0
288,2015/10/29,2078.0,2076.443,2070.0,199500,2092.0,2056.0
289,2015/10/30,2081.0,2081.225,2078.0,149100,2098.0,2053.0
290,2015/11/02,2055.0,2061.164,2093.0,194900,2093.0,2053.0
291,2015/11/04,2080.0,2085.04,2096.0,208500,2120.0,2060.0
292,2015/11/05,2076.0,2087.853,2093.0,169100,2114.0,2072.0
293,2015/11/06,2096.0,2094.141,2089.0,124500,2109.0,2076.0
294,2015/11/09,2100.0,2100.92,2113.0,126700,2118.0,2086.0
295,2015/11/10,2098.0,2099.466,2093.0,96400,2114.0,2092.0
296,2015/11/11,2112.0,2106.865,2095.0,125500,2118.0,2093.0
297,2015/11/12,2130.0,2127.328,2111.0,144100,2143.0,2104.0
298,2015/11/13,2120.0,2119.968,2120.0,110100,2132.0,2108.0
299,2015/11/16,2084.0,2084.28,2095.0,125800,2098.0,2069.0
300,2015/11/17,2188.0,2171.458,2119.0,288900,2194.0,2119.0
301,2015/11/18,2194.0,2199.568,2194.0,174200,2218.0,2178.0
302,2015/11/19,2217.0,2217.814,2220.0,127900,2237.0,2197.0
303,2015/11/20,2236.0,2224.66,2220.0,129800,2240.0,2210.0
304,2015/11/24,2248.0,2228.022,2214.0,340700,2253.0,2208.0
305,2015/11/25,2261.0,2268.694,2260.0,202100,2295.0,2249.0
306,2015/11/26,2293.0,2272.441,2238.0,252900,2300.0,2231.0
307,2015/11/27,2268.0,2265.41,2293.0,123400,2293.0,2254.0
308,2015/11/30,2258.0,2257.789,2266.0,161500,2272.0,2244.0
309,2015/12/01,2377.0,2349.167,2280.0,317800,2377.0,2274.0
310,2015/12/02,2343.0,2348.717,2378.0,279100,2378.0,2325.0
311,2015/12/03,2333.0,2334.689,2343.0,174400,2361.0,2322.0
312,2015/12/04,2258.0,2277.477,2300.0,217300,2318.0,2253.0
313,2015/12/07,2300.0,2309.515,2281.0,206000,2339.0,2281.0
314,2015/12/08,2331.0,2332.491,2312.0,256500,2365.0,2304.0
315,2015/12/09,2299.0,2312.754,2325.0,153800,2350.0,2295.0
316,2015/12/10,2274.0,2290.023,2295.0,174000,2317.0,2271.0
317,2015/12/11,2244.0,2254.267,2264.0,217100,2283.0,2231.0
318,2015/12/14,2223.0,2209.518,2194.0,145300,2227.0,2177.0
319,2015/12/15,2188.0,2204.407,2221.0,111100,2248.0,2184.0
320,2015/12/16,2195.0,2189.032,2209.0,161400,2221.0,2171.0
321,2015/12/17,2232.0,2228.316,2225.0,193400,2242.0,2201.0
322,2015/12/18,2200.0,2219.823,2227.0,255400,2249.0,2200.0
323,2015/12/21,2194.0,2186.965,2205.0,126800,2230.0,2161.0
324,2015/12/22,2197.0,2196.063,2193.0,55200,2207.0,2181.0
325,2015/12/24,2163.0,2170.165,2200.0,160300,2210.0,2158.0
326,2015/12/25,2162.0,2171.122,2188.0,49900,2194.0,2157.0
327,2015/12/28,2178.0,2164.284,2167.0,92000,2182.0,2132.0
328,2015/12/29,2216.0,2205.292,2178.0,123800,2216.0,2170.0
329,2015/12/30,2203.0,2198.925,2200.0,164400,2210.0,2178.0
330,2016/01/04,2150.0,2165.923,2199.0,141100,2202.0,2142.0
331,2016/01/05,2157.0,2158.799,2140.0,116500,2186.0,2130.0
332,2016/01/06,2143.0,2150.411,2160.0,156200,2183.0,2127.0
333,2016/01/07,2151.0,2148.96,2143.0,191400,2169.0,2122.0
334,2016/01/08,2126.0,2137.76,2137.0,140100,2164.0,2122.0
335,2016/01/12,2057.0,2082.713,2110.0,160400,2121.0,2054.0
336,2016/01/13,2052.0,2046.349,2075.0,333500,2082.0,2014.0
337,2016/01/14,1974.0,1968.09,2007.0,466400,2010.0,1939.0
338,2016/01/15,1995.0,2004.896,2000.0,185800,2023.0,1991.0
339,2016/01/18,1988.0,1977.008,1970.0,142000,1992.0,1952.0
340,2016/01/19,1968.0,1976.481,1991.0,169700,2014.0,1955.0
341,2016/01/20,1920.0,1951.719,1971.0,292200,1994.0,1919.0
342,2016/01/21,1842.0,1884.476,1906.0,249800,1934.0,1841.0
343,2016/01/22,1977.0,1934.509,1894.0,199100,1978.0,1877.0
344,2016/01/25,2004.0,1998.729,2009.0,149600,2013.0,1978.0
345,2016/01/26,2014.0,2015.567,2000.0,180300,2033.0,1991.0
346,2016/01/27,2066.0,2056.672,2050.0,174200,2071.0,2030.0
347,2016/01/28,2076.0,2069.311,2053.0,243200,2085.0,2046.0
348,2016/01/29,2134.0,2104.896,2089.0,218600,2138.0,2060.0
349,2016/02/01,2196.0,2192.219,2172.0,166600,2210.0,2148.0
350,2016/02/02,2182.0,2185.901,2180.0,199000,2219.0,2163.0
351,2016/02/03,2209.0,2193.0,2167.0,206100,2218.0,2156.0
352,2016/02/04,2153.0,2168.675,2193.0,161000,2198.0,2151.0
353,2016/02/05,2122.0,2123.366,2125.0,182700,2157.0,2096.0
354,2016/02/08,2236.0,2205.862,2133.0,261300,2242.0,2123.0
355,2016/02/09,2117.0,2135.957,2151.0,179600,2190.0,2108.0
356,2016/02/10,2066.0,2073.778,2119.0,187700,2142.0,2035.0
357,2016/02/12,2005.0,2023.701,2025.0,210200,2060.0,1995.0
358,2016/02/15,2134.0,2112.695,2092.0,192200,2148.0,2061.0
359,2016/02/16,2115.0,2127.473,2115.0,145600,2157.0,2108.0
360,2016/02/17,2107.0,2096.607,2110.0,223200,2127.0,2069.0
361,2016/02/18,2118.0,2125.938,2148.0,147600,2149.0,2104.0
362,2016/02/19,2113.0,2099.114,2093.0,129800,2124.0,2064.0
363,2016/02/22,2160.0,2145.6,2105.0,132700,2167.0,2105.0
364,2016/02/23,2131.0,2138.223,2162.0,137300,2178.0,2115.0
365,2016/02/24,2159.0,2155.091,2120.0,134800,2174.0,2119.0
366,2016/02/25,2189.0,2179.36,2159.0,85200,2195.0,2152.0
367,2016/02/26,2152.0,2160.501,2189.0,164800,2200.0,2144.0
368,2016/02/29,2097.0,2125.767,2167.0,188000,2178.0,2097.0
369,2016/03/01,2122.0,2114.052,2091.0,124700,2129.0,2091.0
370,2016/03/02,2144.0,2141.547,2152.0,112400,2152.0,2129.0
371,2016/03/03,2130.0,2124.7,2125.0,113400,2138.0,2113.0
372,2016/03/04,2126.0,2113.275,2117.0,171900,2140.0,2085.0
373,2016/03/07,2098.0,2100.21,2126.0,148800,2134.0,2089.0
374,2016/03/08,2075.0,2073.299,2090.0,98600,2094.0,2052.0
375,2016/03/09,2047.0,2049.554,2070.0,82900,2076.0,2038.0
376,2016/03/10,2093.0,2087.629,2063.0,94900,2097.0,2063.0
377,2016/03/11,2088.0,2081.934,2073.0,188000,2100.0,2068.0
378,2016/03/14,2092.0,2086.658,2114.0,191700,2114.0,2063.0
379,2016/03/15,2125.0,2123.008,2105.0,163200,2138.0,2103.0
380,2016/03/16,2135.0,2137.552,2122.0,128700,2149.0,2112.0
381,2016/03/17,2144.0,2148.458,2148.0,148800,2167.0,2136.0
382,2016/03/18,2092.0,2096.443,2136.0,267600,2139.0,2082.0
383,2016/03/22,2127.0,2117.207,2107.0,149500,2128.0,2102.0
384,2016/03/23,2128.0,2134.115,2135.0,124300,2146.0,2126.0
385,2016/03/24,2138.0,2138.422,2120.0,139200,2146.0,2119.0
386,2016/03/25,2079.0,2094.05,2138.0,246500,2139.0,2073.0
387,2016/03/28,2082.0,2070.621,2090.0,431400,2094.0,2043.0
388,2016/03/29,2088.0,2074.104,2059.0,215400,2088.0,2050.0
389,2016/03/30,2081.0,2086.607,2086.0,118400,2100.0,2074.0
390,2016/03/31,2022.0,2040.29,2083.0,136900,2085.0,2018.0
391,2016/04/01,1999.0,2010.356,2051.0,211600,2051.0,1999.0
392,2016/04/04,2032.0,2033.296,2003.0,162000,2060.0,2001.0
393,2016/04/05,1982.0,2000.153,2026.0,132300,2039.0,1982.0
394,2016/04/06,1988.0,1983.86,1979.0,164600,1996.0,1966.0
395,2016/04/07,1998.0,1988.949,1985.0,102900,1998.0,1971.0
396,2016/04/08,2005.0,1993.578,1968.0,174800,2026.0,1952.0
397,2016/04/11,1980.0,1971.442,2001.0,152000,2002.0,1952.0
398,2016/04/12,1977.0,1977.208,1979.0,106600,1988.0,1961.0
399,2016/04/13,2002.0,1999.414,1990.0,151700,2015.0,1971.0
400,2016/04/14,2048.0,2031.439,2037.0,133600,2048.0,2004.0
401,2016/04/15,2043.0,2046.292,2039.0,145000,2061.0,2034.0
402,2016/04/18,2031.0,2022.264,1993.0,180600,2038.0,1989.0
403,2016/04/19,2084.0,2079.054,2075.0,176500,2091.0,2072.0
404,2016/04/20,2085.0,2093.006,2093.0,204600,2115.0,2073.0
405,2016/04/21,2090.0,2089.153,2110.0,152500,2110.0,2077.0
406,2016/04/22,2100.0,2089.14,2082.0,107000,2100.0,2072.0
407,2016/04/25,2109.0,2112.505,2105.0,184500,2129.0,2086.0
408,2016/04/26,2096.0,2096.201,2105.0,125600,2116.0,2080.0
409,2016/04/27,2038.0,2036.977,2100.0,808700,2100.0,2016.0
410,2016/04/28,2003.0,2032.265,2059.0,244600,2094.0,2000.0
411,2016/05/02,1962.0,1962.187,1979.0,195600,1985.0,1952.0
412,2016/05/06,1971.0,1966.616,1968.0,167400,1993.0,1953.0
413,2016/05/09,1976.0,1983.54,1993.0,117000,2009.0,1976.0
414,2016/05/10,2005.0,1997.153,1988.0,133100,2007.0,1979.0
415,2016/05/11,2009.0,2004.082,2005.0,110400,2013.0,1987.0
416,2016/05/12,2023.0,2014.612,2000.0,127500,2029.0,1998.0
417,2016/05/13,2012.0,2019.762,2034.0,210700,2045.0,2003.0
418,2016/05/16,1881.0,1906.004,1989.0,447200,1989.0,1873.0
419,2016/05/17,1895.0,1891.874,1886.0,212700,1901.0,1882.0
420,2016/05/18,1895.0,1898.61,1896.0,210100,1914.0,1890.0
421,2016/05/19,1903.0,1906.322,1912.0,115800,1919.0,1897.0
422,2016/05/20,1915.0,1910.674,1903.0,136300,1919.0,1898.0
423,2016/05/23,1894.0,1888.611,1915.0,191100,1916.0,1871.0
424,2016/05/24,1911.0,1908.144,1894.0,130400,1917.0,1894.0
425,2016/05/25,1914.0,1918.388,1930.0,75800,1935.0,1908.0
426,2016/05/26,1920.0,1930.258,1935.0,132400,1943.0,1917.0
427,2016/05/27,1924.0,1927.961,1937.0,95600,1938.0,1921.0
428,2016/05/30,1964.0,1954.138,1942.0,99700,1965.0,1933.0
429,2016/05/31,1907.0,1905.956,1930.0,449800,1941.0,1892.0
430,2016/06/01,1880.0,1886.692,1900.0,319800,1909.0,1876.0
431,2016/06/02,1866.0,1870.178,1873.0,158100,1887.0,1861.0
432,2016/06/03,1846.0,1842.639,1859.0,341500,1864.0,1830.0
433,2016/06/06,1844.0,1830.031,1835.0,202600,1844.0,1820.0
434,2016/06/07,1841.0,1837.017,1842.0,121700,1843.0,1830.0
435,2016/06/08,1851.0,1843.137,1842.0,141100,1854.0,1831.0
436,2016/06/09,1840.0,1836.352,1845.0,124300,1848.0,1828.0
437,2016/06/10,1847.0,1849.47,1851.0,199200,1861.0,1841.0
438,2016/06/13,1801.0,1812.586,1829.0,214000,1829.0,1801.0
439,2016/06/14,1771.0,1781.607,1800.0,147700,1804.0,1767.0
440,2016/06/15,1784.0,1781.478,1771.0,147800,1798.0,1763.0
441,2016/06/16,1742.0,1753.419,1786.0,208600,1791.0,1738.0
442,2016/06/17,1722.0,1738.284,1760.0,275000,1770.0,1722.0
443,2016/06/20,1750.0,1756.397,1747.0,146000,1773.0,1745.0
444,2016/06/21,1754.0,1742.196,1745.0,131600,1757.0,1723.0
445,2016/06/22,1738.0,1738.989,1753.0,138600,1753.0,1729.0
446,2016/06/23,1728.0,1728.781,1731.0,97000,1739.0,1723.0
447,2016/06/24,1646.0,1676.475,1746.0,282000,1760.0,1626.0
448,2016/06/27,1717.0,1705.906,1668.0,129300,1721.0,1668.0
449,2016/06/28,1734.0,1730.441,1703.0,136300,1748.0,1694.0
450,2016/06/29,1742.0,1740.64,1750.0,99200,1752.0,1727.0
451,2016/06/30,1727.0,1738.038,1750.0,84800,1754.0,1726.0
452,2016/07/01,1743.0,1735.791,1728.0,93700,1746.0,1718.0
453,2016/07/04,1731.0,1727.96,1730.0,82500,1732.0,1718.0
454,2016/07/05,1722.0,1719.875,1729.0,65700,1730.0,1713.0
455,2016/07/06,1707.0,1696.102,1710.0,178900,1711.0,1678.0
456,2016/07/07,1709.0,1707.199,1711.0,80900,1721.0,1701.0
457,2016/07/08,1692.0,1708.831,1717.0,180200,1736.0,1691.0
458,2016/07/11,1736.0,1735.457,1713.0,138900,1748.0,1713.0
459,2016/07/12,1737.0,1739.242,1748.0,249700,1754.0,1731.0
460,2016/07/13,1745.0,1744.818,1759.0,184900,1759.0,1736.0
461,2016/07/14,1783.0,1783.961,1760.0,212200,1807.0,1755.0
462,2016/07/15,1749.0,1755.314,1782.0,186500,1782.0,1746.0
463,2016/07/19,1767.0,1762.043,1760.0,124700,1769.0,1749.0
464,2016/07/20,1770.0,1762.559,1769.0,143800,1772.0,1751.0
465,2016/07/21,1779.0,1778.417,1786.0,115000,1796.0,1770.0
466,2016/07/22,1790.0,1784.066,1778.0,130100,1790.0,1771.0
467,2016/07/25,1826.0,1821.722,1804.0,188700,1834.0,1799.0
468,2016/07/26,1818.0,1821.732,1830.0,231700,1833.0,1816.0
469,2016/07/27,1844.0,1843.625,1826.0,184100,1854.0,1826.0
470,2016/07/28,1868.0,1855.061,1840.0,190400,1869.0,1833.0
471,2016/07/29,1872.0,1859.184,1866.0,255500,1872.0,1842.0
472,2016/08/01,1867.0,1877.527,1880.0,260300,1901.0,1853.0
473,2016/08/02,1849.0,1859.452,1859.0,158000,1874.0,1841.0
474,2016/08/03,1789.0,1800.407,1820.0,253900,1820.0,1783.0
475,2016/08/04,1767.0,1778.624,1790.0,227400,1800.0,1759.0
476,2016/08/05,1795.0,1791.568,1769.0,155600,1804.0,1769.0
477,2016/08/08,1738.0,1749.665,1795.0,269100,1799.0,1725.0
478,2016/08/09,1744.0,1743.27,1736.0,224700,1758.0,1722.0
479,2016/08/10,1743.0,1746.306,1744.0,150700,1758.0,1728.0
480,2016/08/12,1766.0,1759.747,1754.0,139400,1767.0,1742.0
481,2016/08/15,1767.0,1767.649,1766.0,111900,1773.0,1762.0
482,2016/08/16,1746.0,1754.561,1765.0,155800,1768.0,1745.0
483,2016/08/17,1729.0,1724.539,1740.0,189700,1742.0,1713.0
484,2016/08/18,1738.0,1735.38,1715.0,168600,1745.0,1715.0
485,2016/08/19,1726.0,1731.643,1735.0,165500,1744.0,1723.0
486,2016/08/22,1775.0,1768.29,1740.0,171600,1783.0,1740.0
487,2016/08/23,1758.0,1764.982,1760.0,123600,1775.0,1756.0
488,2016/08/24,1782.0,1776.163,1764.0,141600,1788.0,1758.0
489,2016/08/25,1794.0,1789.437,1782.0,114800,1798.0,1777.0
490,2016/08/26,1785.0,1790.798,1783.0,158200,1799.0,1779.0
491,2016/08/29,1797.0,1798.989,1810.0,213800,1818.0,1783.0
492,2016/08/30,1782.0,1780.535,1791.0,134100,1791.0,1774.0
493,2016/08/31,1776.0,1774.722,1788.0,184200,1790.0,1763.0
494,2016/09/01,1811.0,1804.45,1780.0,116600,1815.0,1780.0
495,2016/09/02,1810.0,1811.738,1811.0,112300,1819.0,1803.0
496,2016/09/05,1831.0,1830.357,1823.0,111400,1845.0,1814.0
497,2016/09/06,1867.0,1865.026,1840.0,125400,1873.0,1839.0
498,2016/09/07,1864.0,1860.04,1865.0,149600,1866.0,1852.0
499,2016/09/08,1864.0,1863.339,1867.0,157300,1871.0,1845.0
500,2016/09/09,1858.0,1863.173,1864.0,137100,1872.0,1857.0
501,2016/09/12,1831.0,1834.365,1842.0,127600,1850.0,1827.0
502,2016/09/13,1836.0,1833.363,1832.0,136200,1840.0,1822.0
503,2016/09/14,1827.0,1832.07,1830.0,112400,1841.0,1825.0
504,2016/09/15,1817.0,1817.222,1826.0,110300,1830.0,1811.0
505,2016/09/16,1837.0,1833.912,1824.0,91100,1839.0,1824.0
506,2016/09/20,1841.0,1842.956,1837.0,215100,1858.0,1830.0
507,2016/09/21,1900.0,1872.713,1851.0,232600,1900.0,1842.0
508,2016/09/23,1931.0,1923.898,1900.0,436500,1944.0,1891.0
509,2016/09/26,1938.0,1936.294,1932.0,210000,1944.0,1922.0
510,2016/09/27,1957.0,1932.251,1919.0,372700,1957.0,1905.0
511,2016/09/28,1875.0,1887.623,1912.0,264500,1916.0,1866.0
512,2016/09/29,1885.0,1883.771,1886.0,144100,1890.0,1871.0
513,2016/09/30,1879.0,1872.609,1862.0,109900,1883.0,1852.0
514,2016/10/03,1902.0,1901.878,1885.0,96500,1911.0,1885.0
515,2016/10/04,1929.0,1918.846,1896.0,124400,1932.0,1895.0
516,2016/10/05,1930.0,1935.641,1930.0,124100,1942.0,1928.0
517,2016/10/06,1922.0,1933.109,1939.0,165400,1960.0,1918.0
518,2016/10/07,1929.0,1924.81,1922.0,69100,1931.0,1914.0
519,2016/10/11,1942.0,1939.672,1929.0,71700,1945.0,1922.0
520,2016/10/12,1934.0,1940.648,1930.0,102900,1950.0,1921.0
521,2016/10/13,1945.0,1942.403,1936.0,104100,1950.0,1936.0
522,2016/10/14,1947.0,1948.058,1942.0,89000,1952.0,1937.0
523,2016/10/17,1960.0,1957.859,1947.0,112900,1964.0,1941.0
524,2016/10/18,1976.0,1970.062,1962.0,101700,1976.0,1956.0
525,2016/10/19,1973.0,1981.788,1968.0,128800,1999.0,1963.0
526,2016/10/20,2000.0,1996.951,1979.0,132700,2002.0,1979.0
527,2016/10/21,1984.0,1988.17,2004.0,92200,2004.0,1979.0
528,2016/10/24,1993.0,1985.897,1978.0,84100,1995.0,1967.0
529,2016/10/25,1995.0,1995.717,1980.0,123900,2002.0,1978.0
530,2016/10/26,2009.0,2004.962,2000.0,148900,2010.0,1994.0
531,2016/10/27,2010.0,2012.594,2009.0,119100,2017.0,2005.0
532,2016/10/28,2017.0,2020.065,2017.0,191100,2028.0,2011.0
533,2016/10/31,2018.0,2017.968,2021.0,133300,2024.0,2008.0
534,2016/11/01,2095.0,2076.499,2025.0,320700,2099.0,2025.0
535,2016/11/02,2138.0,2119.476,2096.0,321300,2148.0,2087.0
536,2016/11/04,2115.0,2098.322,2087.0,193000,2121.0,2067.0
537,2016/11/07,2136.0,2129.814,2106.0,152900,2142.0,2103.0
538,2016/11/08,2137.0,2145.561,2113.0,185700,2170.0,2112.0
539,2016/11/09,2081.0,2111.252,2156.0,212800,2174.0,2061.0
540,2016/11/10,2149.0,2154.215,2168.0,170800,2180.0,2140.0
541,2016/11/11,2170.0,2182.5,2169.0,317900,2214.0,2159.0
542,2016/11/14,2168.0,2173.762,2170.0,142900,2196.0,2150.0
543,2016/11/15,2149.0,2146.966,2157.0,173700,2158.0,2131.0
544,2016/11/16,2186.0,2181.183,2179.0,176400,2187.0,2162.0
545,2016/11/17,2216.0,2216.164,2187.0,263500,2240.0,2186.0
546,2016/11/18,2258.0,2252.928,2242.0,226400,2261.0,2227.0
547,2016/11/21,2277.0,2271.541,2260.0,191400,2285.0,2248.0
548,2016/11/22,2289.0,2285.451,2277.0,134700,2297.0,2272.0
549,2016/11/24,2295.0,2291.497,2295.0,150800,2299.0,2274.0
550,2016/11/25,2298.0,2295.049,2274.0,178400,2307.0,2269.0
551,2016/11/28,2341.0,2328.741,2283.0,206500,2349.0,2283.0
552,2016/11/29,2335.0,2335.425,2338.0,114900,2347.0,2327.0
553,2016/11/30,2299.0,2308.346,2328.0,214100,2328.0,2295.0
554,2016/12/01,2348.0,2347.454,2330.0,240200,2359.0,2330.0
555,2016/12/02,2307.0,2312.272,2336.0,204400,2336.0,2297.0
556,2016/12/05,2299.0,2294.317,2294.0,121700,2302.0,2282.0
557,2016/12/06,2273.0,2280.154,2300.0,183700,2300.0,2273.0
558,2016/12/07,2276.0,2274.18,2273.0,150800,2280.0,2258.0
559,2016/12/08,2282.0,2277.433,2288.0,171600,2292.0,2260.0
560,2016/12/09,2297.0,2287.791,2269.0,188900,2301.0,2269.0
561,2016/12/12,2303.0,2305.423,2300.0,166200,2324.0,2290.0
562,2016/12/13,2313.0,2318.087,2309.0,220600,2333.0,2309.0
563,2016/12/14,2307.0,2307.129,2317.0,152500,2326.0,2290.0
564,2016/12/15,2318.0,2323.103,2307.0,179000,2338.0,2305.0
565,2016/12/16,2330.0,2334.497,2332.0,222500,2345.0,2324.0
566,2016/12/19,2324.0,2322.694,2323.0,145300,2330.0,2305.0
567,2016/12/20,2343.0,2345.036,2327.0,161700,2359.0,2316.0
568,2016/12/21,2316.0,2326.347,2346.0,99000,2349.0,2315.0
569,2016/12/22,2326.0,2325.523,2319.0,91000,2334.0,2311.0
570,2016/12/26,2341.0,2343.465,2335.0,115400,2354.0,2320.0
571,2016/12/27,2338.0,2344.578,2342.0,73000,2362.0,2336.0
572,2016/12/28,2367.0,2358.292,2340.0,116100,2372.0,2330.0
573,2016/12/29,2386.0,2377.82,2370.0,121200,2387.0,2361.0
574,2016/12/30,2403.0,2393.632,2379.0,188700,2413.0,2367.0
575,2017/01/04,2420.0,2416.738,2414.0,172200,2427.0,2408.0
576,2017/01/05,2462.0,2455.124,2424.0,242300,2479.0,2420.0
577,2017/01/06,2417.0,2422.265,2437.0,184600,2445.0,2403.0
578,2017/01/10,2391.0,2395.832,2419.0,279200,2419.0,2381.0
579,2017/01/11,2408.0,2412.354,2417.0,81900,2420.0,2405.0
580,2017/01/12,2405.0,2404.451,2413.0,142700,2417.0,2386.0
581,2017/01/13,2422.0,2415.895,2395.0,149000,2429.0,2386.0
582,2017/01/16,2386.0,2390.814,2406.0,111000,2407.0,2382.0
583,2017/01/17,2346.0,2352.326,2374.0,127500,2374.0,2340.0
584,2017/01/18,2341.0,2333.338,2330.0,115200,2346.0,2321.0
585,2017/01/19,2342.0,2352.429,2350.0,106400,2376.0,2342.0
586,2017/01/20,2356.0,2351.696,2336.0,106100,2363.0,2331.0
587,2017/01/23,2332.0,2335.683,2334.0,71000,2345.0,2330.0
588,2017/01/24,2332.0,2332.345,2328.0,75100,2340.0,2323.0
589,2017/01/25,2349.0,2347.846,2357.0,86400,2365.0,2336.0
590,2017/01/26,2371.0,2370.117,2373.0,93400,2385.0,2359.0
591,2017/01/27,2360.0,2365.397,2400.0,105500,2400.0,2350.0
592,2017/01/30,2466.0,2451.089,2367.0,279200,2480.0,2367.0
593,2017/01/31,2466.0,2461.804,2444.0,174500,2474.0,2442.0
594,2017/02/01,2521.0,2506.996,2470.0,257900,2526.0,2462.0
595,2017/02/02,2497.0,2502.905,2527.0,249300,2537.0,2480.0
596,2017/02/03,2533.0,2526.538,2500.0,179600,2540.0,2497.0
597,2017/02/06,2529.0,2524.904,2531.0,111700,2534.0,2510.0
598,2017/02/07,2509.0,2514.545,2505.0,139800,2532.0,2502.0
599,2017/02/08,2527.0,2516.59,2510.0,102600,2527.0,2496.0
600,2017/02/09,2524.0,2529.131,2520.0,151400,2544.0,2514.0
601,2017/02/10,2513.0,2530.151,2550.0,338300,2560.0,2505.0
602,2017/02/13,2505.0,2508.982,2531.0,167000,2531.0,2496.0
603,2017/02/14,2474.0,2489.536,2506.0,140400,2512.0,2470.0
604,2017/02/15,2470.0,2472.239,2490.0,146300,2507.0,2458.0
605,2017/02/16,2460.0,2463.354,2485.0,108100,2485.0,2452.0
606,2017/02/17,2447.0,2440.243,2456.0,133300,2458.0,2422.0
607,2017/02/20,2441.0,2437.396,2436.0,92500,2446.0,2426.0
608,2017/02/21,2444.0,2441.12,2441.0,78300,2452.0,2431.0
609,2017/02/22,2428.0,2427.669,2450.0,161200,2460.0,2417.0
610,2017/02/23,2472.0,2465.064,2461.0,124300,2477.0,2445.0
611,2017/02/24,2456.0,2456.365,2460.0,151700,2470.0,2445.0
612,2017/02/27,2447.0,2444.457,2450.0,81900,2455.0,2431.0
613,2017/02/28,2464.0,2468.941,2445.0,95600,2486.0,2444.0
614,2017/03/01,2468.0,2459.469,2455.0,186700,2473.0,2438.0
615,2017/03/02,2467.0,2468.862,2480.0,164700,2488.0,2456.0
616,2017/03/03,2441.0,2450.076,2460.0,137400,2468.0,2434.0
617,2017/03/06,2441.0,2434.247,2430.0,165800,2447.0,2406.0
618,2017/03/07,2449.0,2454.453,2449.0,95700,2461.0,2447.0
619,2017/03/08,2455.0,2459.299,2449.0,146600,2472.0,2449.0
620,2017/03/09,2485.0,2478.343,2460.0,126800,2491.0,2455.0
621,2017/03/10,2543.0,2541.794,2505.0,329900,2595.0,2505.0
622,2017/03/13,2535.0,2544.931,2550.0,95700,2564.0,2534.0
623,2017/03/14,2558.0,2552.337,2541.0,91100,2566.0,2528.0
624,2017/03/15,2560.0,2550.509,2549.0,123000,2563.0,2531.0
625,2017/03/16,2558.0,2556.35,2562.0,87800,2562.0,2539.0
626,2017/03/17,2568.0,2559.655,2550.0,96100,2568.0,2543.0
627,2017/03/21,2579.0,2575.602,2563.0,97500,2587.0,2558.0
628,2017/03/22,2529.0,2542.245,2557.0,80300,2557.0,2529.0
629,2017/03/23,2494.0,2500.266,2520.0,113100,2520.0,2487.0
630,2017/03/24,2522.0,2515.759,2498.0,122200,2531.0,2497.0
631,2017/03/27,2487.0,2499.931,2516.0,107600,2516.0,2487.0
632,2017/03/28,2525.0,2515.631,2514.0,231500,2525.0,2501.0
633,2017/03/29,2492.0,2488.004,2500.0,113000,2501.0,2471.0
634,2017/03/30,2467.0,2471.659,2477.0,78200,2486.0,2458.0
635,2017/03/31,2428.0,2451.185,2473.0,134300,2484.0,2427.0
636,2017/04/03,2457.0,2457.826,2438.0,125600,2473.0,2436.0
637,2017/04/04,2447.0,2440.674,2450.0,254900,2458.0,2419.0
638,2017/04/05,2501.0,2504.147,2480.0,262600,2519.0,2478.0
639,2017/04/06,2445.0,2463.686,2500.0,144500,2508.0,2439.0
640,2017/04/07,2467.0,2466.66,2449.0,127600,2483.0,2449.0
641,2017/04/10,2435.0,2435.485,2463.0,211800,2468.0,2420.0
642,2017/04/11,2454.0,2448.125,2420.0,129700,2462.0,2420.0
643,2017/04/12,2430.0,2430.464,2439.0,134800,2444.0,2420.0
644,2017/04/13,2394.0,2392.73,2408.0,123200,2416.0,2379.0
645,2017/04/14,2366.0,2374.122,2390.0,90200,2395.0,2360.0
646,2017/04/17,2395.0,2384.639,2356.0,89000,2395.0,2352.0
647,2017/04/18,2395.0,2402.004,2420.0,111000,2426.0,2391.0
648,2017/04/19,2422.0,2422.314,2396.0,138800,2436.0,2392.0
649,2017/04/20,2409.0,2406.31,2410.0,84100,2415.0,2393.0
650,2017/04/21,2426.0,2425.078,2411.0,105800,2435.0,2410.0
651,2017/04/24,2461.0,2459.66,2465.0,118000,2474.0,2446.0
652,2017/04/25,2447.0,2443.725,2433.0,152600,2454.0,2428.0
653,2017/04/26,2471.0,2467.272,2451.0,161600,2478.0,2445.0
654,2017/04/27,2515.0,2504.573,2476.0,299800,2516.0,2470.0
655,2017/04/28,2500.0,2504.388,2503.0,181800,2518.0,2497.0
656,2017/05/01,2517.0,2504.803,2492.0,91900,2518.0,2483.0
657,2017/05/02,2521.0,2522.555,2521.0,109000,2537.0,2513.0
658,2017/05/08,2599.0,2585.179,2550.0,198800,2600.0,2544.0
659,2017/05/09,2629.0,2620.433,2590.0,219400,2629.0,2590.0
660,2017/05/10,2642.0,2634.891,2627.0,143200,2644.0,2623.0
661,2017/05/11,2641.0,2644.168,2642.0,95100,2663.0,2637.0
662,2017/05/12,2649.0,2640.645,2642.0,98300,2649.0,2629.0
663,2017/05/15,2672.0,2661.358,2647.0,147900,2676.0,2638.0
664,2017/05/16,2775.0,2766.606,2680.0,358700,2802.0,2680.0
665,2017/05/17,2776.0,2771.708,2742.0,178600,2791.0,2741.0
666,2017/05/18,2786.0,2783.463,2745.0,191700,2796.0,2741.0
667,2017/05/19,2782.0,2787.538,2778.0,127700,2812.0,2770.0
668,2017/05/22,2780.0,2775.503,2781.0,145300,2789.0,2760.0
669,2017/05/23,2774.0,2788.497,2790.0,176700,2812.0,2773.0
670,2017/05/24,2764.0,2769.439,2793.0,117600,2800.0,2758.0
671,2017/05/25,2756.0,2762.702,2763.0,193800,2775.0,2749.0
672,2017/05/26,2720.0,2731.627,2760.0,228800,2769.0,2713.0
673,2017/05/29,2741.0,2749.472,2730.0,191000,2766.0,2730.0
674,2017/05/30,2741.0,2740.425,2736.0,119300,2762.0,2724.0
675,2017/05/31,2773.0,2762.067,2740.0,202400,2775.0,2738.0
676,2017/06/01,2847.0,2829.089,2780.0,191200,2848.0,2780.0
677,2017/06/02,2862.0,2857.181,2848.0,162100,2869.0,2833.0
678,2017/06/05,2892.0,2883.592,2860.0,140500,2900.0,2854.0
679,2017/06/06,2883.0,2892.547,2900.0,165300,2918.0,2880.0
680,2017/06/07,2914.0,2906.592,2898.0,191300,2919.0,2885.0
681,2017/06/08,2910.0,2918.01,2920.0,154000,2940.0,2905.0
682,2017/06/09,2885.0,2894.381,2901.0,152100,2913.0,2883.0
683,2017/06/12,2885.0,2871.36,2870.0,93900,2889.0,2830.0
684,2017/06/13,2905.0,2898.057,2879.0,125300,2909.0,2872.0
685,2017/06/14,2915.0,2917.342,2909.0,99000,2933.0,2908.0
686,2017/06/15,2909.0,2906.308,2905.0,99100,2917.0,2887.0
687,2017/06/16,2909.0,2915.58,2916.0,123500,2932.0,2907.0
688,2017/06/19,2944.0,2945.814,2915.0,102900,2960.0,2915.0
689,2017/06/20,2968.0,2964.679,2950.0,101100,2974.0,2947.0
690,2017/06/21,2976.0,2989.328,2968.0,154800,3015.0,2966.0
691,2017/06/22,2954.0,2965.93,2985.0,178200,2991.0,2949.0
692,2017/06/23,2923.0,2927.721,2957.0,197200,2957.0,2918.0
693,2017/06/26,2932.0,2936.58,2938.0,102300,2942.0,2932.0
694,2017/06/27,2929.0,2927.801,2940.0,97800,2942.0,2916.0
695,2017/06/28,2918.0,2926.707,2942.0,159900,2944.0,2915.0
696,2017/06/29,2929.0,2928.102,2928.0,103900,2940.0,2919.0
697,2017/06/30,2889.0,2890.269,2915.0,133300,2915.0,2875.0
698,2017/07/03,2896.0,2893.849,2886.0,102100,2904.0,2881.0
699,2017/07/04,2845.0,2860.632,2897.0,136500,2898.0,2840.0
700,2017/07/05,2848.0,2833.964,2838.0,106600,2849.0,2816.0
701,2017/07/06,2820.0,2825.004,2831.0,135300,2859.0,2811.0
702,2017/07/07,2807.0,2809.297,2813.0,94900,2826.0,2798.0
703,2017/07/10,2809.0,2812.48,2816.0,70400,2823.0,2805.0
704,2017/07/11,2823.0,2818.729,2809.0,70200,2829.0,2799.0
705,2017/07/12,2819.0,2821.168,2818.0,81800,2835.0,2809.0
706,2017/07/13,2818.0,2818.563,2821.0,86500,2827.0,2803.0
707,2017/07/14,2823.0,2831.586,2816.0,70100,2849.0,2815.0
708,2017/07/18,2817.0,2808.841,2822.0,83000,2822.0,2789.0
709,2017/07/19,2867.0,2857.984,2815.0,140100,2882.0,2814.0
710,2017/07/20,2910.0,2901.315,2873.0,100700,2917.0,2869.0
711,2017/07/21,2936.0,2922.53,2901.0,87000,2939.0,2894.0
712,2017/07/24,2938.0,2930.089,2920.0,158200,2942.0,2902.0
713,2017/07/25,2923.0,2924.204,2938.0,100800,2938.0,2908.0
714,2017/07/26,2838.0,2844.183,2920.0,270600,2920.0,2814.0
715,2017/07/27,2837.0,2841.433,2839.0,111900,2866.0,2822.0
716,2017/07/28,2834.0,2836.217,2838.0,108000,2850.0,2826.0
717,2017/07/31,2995.0,2990.551,2940.0,812400,3025.0,2934.0
718,2017/08/01,2997.0,2997.896,3000.0,275700,3010.0,2976.0
719,2017/08/02,3140.0,3098.844,3020.0,608700,3150.0,3015.0
720,2017/08/03,3115.0,3116.984,3130.0,296700,3145.0,3090.0
721,2017/08/04,3130.0,3133.428,3110.0,168300,3150.0,3110.0
722,2017/08/07,3170.0,3168.531,3130.0,178000,3190.0,3130.0
723,2017/08/08,3165.0,3162.093,3170.0,133800,3190.0,3140.0
724,2017/08/09,3090.0,3102.456,3140.0,239600,3150.0,3080.0
725,2017/08/10,3105.0,3106.887,3105.0,166700,3130.0,3090.0
726,2017/08/14,3060.0,3082.952,3085.0,261700,3115.0,3060.0
727,2017/08/15,3085.0,3098.653,3100.0,169300,3125.0,3085.0
728,2017/08/16,3070.0,3081.368,3085.0,144700,3110.0,3055.0
729,2017/08/17,3110.0,3113.124,3075.0,118600,3140.0,3075.0
730,2017/08/18,3080.0,3083.543,3075.0,129400,3105.0,3070.0
731,2017/08/21,3105.0,3106.857,3090.0,149400,3130.0,3090.0
732,2017/08/22,3150.0,3139.792,3125.0,141900,3160.0,3115.0
733,2017/08/23,3135.0,3156.278,3200.0,186300,3210.0,3135.0
734,2017/08/24,3150.0,3153.32,3150.0,75600,3165.0,3135.0
735,2017/08/25,3130.0,3144.458,3170.0,114300,3170.0,3130.0
736,2017/08/28,3135.0,3138.845,3170.0,85700,3175.0,3130.0
737,2017/08/29,3160.0,3148.539,3125.0,89000,3165.0,3120.0
738,2017/08/30,3180.0,3175.937,3180.0,91800,3195.0,3155.0
739,2017/08/31,3175.0,3176.009,3190.0,105100,3190.0,3165.0
740,2017/09/01,3170.0,3172.642,3185.0,81200,3195.0,3155.0
741,2017/09/04,3100.0,3115.162,3160.0,98600,3160.0,3100.0
742,2017/09/05,3025.0,3043.25,3095.0,116000,3095.0,3025.0
743,2017/09/06,3075.0,3050.47,3005.0,136300,3080.0,2986.0
744,2017/09/07,3080.0,3094.809,3075.0,112400,3130.0,3070.0
745,2017/09/08,3060.0,3064.927,3060.0,117100,3080.0,3050.0
746,2017/09/11,3095.0,3100.361,3090.0,91300,3120.0,3085.0
747,2017/09/12,3095.0,3092.332,3105.0,80200,3115.0,3080.0
748,2017/09/13,3100.0,3100.813,3095.0,80000,3115.0,3090.0
749,2017/09/14,3075.0,3085.923,3120.0,76900,3120.0,3075.0
750,2017/09/15,3065.0,3065.228,3075.0,129200,3080.0,3050.0
751,2017/09/19,3100.0,3085.942,3085.0,97700,3100.0,3065.0
752,2017/09/20,3125.0,3118.027,3100.0,129000,3135.0,3090.0
753,2017/09/21,3070.0,3091.078,3140.0,167500,3145.0,3055.0
754,2017/09/22,3050.0,3053.547,3080.0,109400,3090.0,3035.0
755,2017/09/25,3095.0,3086.461,3070.0,140000,3100.0,3070.0
756,2017/09/26,3090.0,3080.998,3075.0,176900,3095.0,3075.0
757,2017/09/27,3035.0,3041.704,3070.0,103600,3085.0,3020.0
758,2017/09/28,3120.0,3086.111,3070.0,186700,3125.0,3035.0
759,2017/09/29,3170.0,3148.663,3120.0,128300,3175.0,3115.0
760,2017/10/02,3100.0,3121.03,3140.0,102900,3150.0,3095.0
761,2017/10/03,3065.0,3066.735,3080.0,94800,3095.0,3055.0
762,2017/10/04,3045.0,3045.828,3065.0,100300,3070.0,3030.0
763,2017/10/05,3010.0,3019.444,3030.0,81800,3040.0,3010.0
764,2017/10/06,3005.0,3006.538,3015.0,53000,3015.0,3000.0
765,2017/10/10,3035.0,3034.362,3010.0,100300,3050.0,3010.0
766,2017/10/11,3070.0,3066.245,3050.0,114100,3080.0,3045.0
767,2017/10/12,3085.0,3098.409,3100.0,109700,3135.0,3085.0
768,2017/10/13,3235.0,3200.235,3150.0,458800,3240.0,3150.0
769,2017/10/16,3200.0,3205.507,3250.0,205000,3250.0,3185.0
770,2017/10/17,3205.0,3199.846,3215.0,113400,3215.0,3180.0
771,2017/10/18,3155.0,3167.321,3205.0,123200,3205.0,3145.0
772,2017/10/19,3160.0,3167.731,3160.0,75800,3185.0,3160.0
773,2017/10/20,3150.0,3148.601,3145.0,95400,3170.0,3120.0
774,2017/10/23,3160.0,3156.54,3170.0,72400,3170.0,3135.0
775,2017/10/24,3185.0,3182.374,3160.0,89500,3195.0,3155.0
776,2017/10/25,3160.0,3166.128,3185.0,81100,3190.0,3155.0
777,2017/10/26,3165.0,3165.232,3160.0,79900,3175.0,3155.0
778,2017/10/27,3175.0,3173.302,3170.0,74200,3180.0,3160.0
779,2017/10/30,3150.0,3146.171,3155.0,131100,3160.0,3130.0
780,2017/10/31,3100.0,3098.885,3110.0,138600,3120.0,3085.0
781,2017/11/01,3050.0,3068.596,3140.0,263600,3155.0,3040.0
782,2017/11/02,3015.0,3015.69,3045.0,179600,3050.0,3000.0
783,2017/11/06,3035.0,3020.131,3010.0,141700,3045.0,2991.0
784,2017/11/07,3035.0,3025.452,3010.0,99600,3040.0,3000.0
785,2017/11/08,3025.0,3015.121,3025.0,74200,3030.0,3000.0
786,2017/11/09,3015.0,3019.11,3035.0,165700,3045.0,2991.0
787,2017/11/10,2996.0,2990.968,2981.0,101200,3015.0,2980.0
788,2017/11/13,2964.0,2969.405,2983.0,100300,2988.0,2958.0
789,2017/11/14,2915.0,2918.239,2940.0,133400,2940.0,2901.0
790,2017/11/15,2839.0,2856.36,2900.0,156000,2900.0,2831.0
791,2017/11/16,2858.0,2849.829,2828.0,94800,2874.0,2818.0
792,2017/11/17,2837.0,2843.56,2871.0,109000,2872.0,2829.0
793,2017/11/20,2876.0,2863.535,2837.0,86300,2887.0,2826.0
794,2017/11/21,2868.0,2873.6,2885.0,86500,2889.0,2852.0
795,2017/11/22,2855.0,2852.757,2868.0,90600,2870.0,2844.0
796,2017/11/24,2906.0,2900.11,2865.0,99200,2920.0,2865.0
797,2017/11/27,2950.0,2952.591,2950.0,136900,2975.0,2939.0
798,2017/11/28,2936.0,2950.3,2960.0,134700,2987.0,2933.0
799,2017/11/29,2940.0,2935.312,2943.0,59900,2946.0,2918.0
800,2017/11/30,2928.0,2914.707,2938.0,152300,2938.0,2880.0
801,2017/12/01,2930.0,2928.799,2947.0,78900,2950.0,2914.0
802,2017/12/04,2911.0,2931.795,2930.0,92200,2957.0,2911.0
803,2017/12/05,2988.0,2963.302,2902.0,184100,2994.0,2894.0
804,2017/12/06,2907.0,2924.723,2949.0,176000,2971.0,2901.0
805,2017/12/07,2971.0,2956.168,2925.0,123000,2977.0,2918.0
806,2017/12/08,2967.0,2944.776,2921.0,134700,2970.0,2921.0
807,2017/12/11,2952.0,2947.046,2960.0,74500,2967.0,2934.0
808,2017/12/12,2951.0,2947.793,2955.0,64200,2967.0,2934.0
809,2017/12/13,2935.0,2934.415,2931.0,70300,2948.0,2930.0
810,2017/12/14,2963.0,2957.302,2950.0,62300,2964.0,2941.0
811,2017/12/15,2962.0,2958.715,2960.0,124600,2976.0,2931.0
812,2017/12/18,2973.0,2971.994,2980.0,62700,2983.0,2963.0
813,2017/12/19,2984.0,2981.394,2976.0,75600,2990.0,2967.0
814,2017/12/20,2988.0,2985.011,2980.0,66300,2995.0,2972.0
815,2017/12/21,3005.0,3003.288,2990.0,90700,3015.0,2985.0
816,2017/12/22,3015.0,3018.456,3010.0,68000,3035.0,3010.0
817,2017/12/25,3010.0,3008.636,3010.0,103800,3020.0,2971.0
818,2017/12/26,3015.0,3014.369,3015.0,87100,3025.0,2999.0
819,2017/12/27,2990.0,3002.7,3030.0,108000,3030.0,2989.0
820,2017/12/28,2983.0,2986.226,2988.0,76200,3005.0,2972.0
821,2017/12/29,2973.0,2975.007,2975.0,88200,2987.0,2961.0
822,2018/01/04,3020.0,3009.502,3000.0,74500,3020.0,2999.0
823,2018/01/05,3010.0,3003.727,3025.0,111500,3030.0,2984.0
824,2018/01/09,3035.0,3014.117,3000.0,148500,3045.0,2981.0
825,2018/01/10,3030.0,3036.389,3025.0,70900,3050.0,3025.0
826,2018/01/11,3065.0,3054.577,3030.0,95700,3065.0,3030.0
827,2018/01/12,3005.0,3005.312,3050.0,114900,3050.0,2988.0
828,2018/01/15,3030.0,3030.753,3035.0,53800,3040.0,3020.0
829,2018/01/16,3020.0,3021.707,3035.0,58000,3035.0,3010.0
830,2018/01/17,3005.0,3003.235,3010.0,61300,3020.0,2985.0
831,2018/01/18,2966.0,2986.625,3035.0,77100,3035.0,2966.0
832,2018/01/19,2981.0,2983.315,2972.0,70900,2999.0,2972.0
833,2018/01/22,2955.0,2959.406,2981.0,84300,2986.0,2947.0
834,2018/01/23,2977.0,2971.49,2955.0,56100,2985.0,2955.0
835,2018/01/24,3000.0,2991.254,2970.0,57800,3010.0,2969.0
836,2018/01/25,2979.0,2982.384,2991.0,55200,2997.0,2973.0
837,2018/01/26,2977.0,2981.946,2973.0,69900,2997.0,2973.0
838,2018/01/29,3010.0,3018.196,2999.0,116100,3040.0,2994.0
839,2018/01/30,2972.0,2975.855,2971.0,186300,2990.0,2961.0
840,2018/01/31,2828.0,2890.88,3010.0,414400,3015.0,2821.0
841,2018/02/01,2853.0,2848.157,2856.0,226200,2876.0,2819.0
842,2018/02/02,2839.0,2832.811,2828.0,159900,2844.0,2810.0
843,2018/02/05,2847.0,2834.299,2815.0,188200,2862.0,2810.0
844,2018/02/06,2685.0,2710.082,2797.0,236900,2797.0,2643.0
845,2018/02/07,2679.0,2723.115,2750.0,176200,2784.0,2678.0
846,2018/02/08,2671.0,2679.979,2679.0,194900,2712.0,2665.0
847,2018/02/09,2630.0,2622.46,2630.0,137400,2635.0,2602.0
848,2018/02/13,2616.0,2637.615,2667.0,130200,2679.0,2612.0
849,2018/02/14,2565.0,2583.362,2613.0,137700,2625.0,2560.0
850,2018/02/15,2552.0,2561.672,2586.0,141600,2594.0,2549.0
851,2018/02/16,2610.0,2605.356,2560.0,110700,2623.0,2560.0
852,2018/02/19,2659.0,2648.327,2637.0,77500,2660.0,2626.0
853,2018/02/20,2652.0,2646.829,2652.0,92700,2658.0,2626.0
854,2018/02/21,2668.0,2670.348,2654.0,109400,2688.0,2638.0
855,2018/02/22,2662.0,2657.097,2635.0,90900,2673.0,2627.0
856,2018/02/23,2659.0,2642.295,2660.0,168300,2660.0,2630.0
857,2018/02/26,2647.0,2648.868,2680.0,136300,2688.0,2630.0
858,2018/02/27,2638.0,2634.208,2671.0,133100,2674.0,2617.0
859,2018/02/28,2651.0,2662.689,2628.0,297300,2699.0,2623.0
860,2018/03/01,2628.0,2629.104,2652.0,116500,2655.0,2611.0
861,2018/03/02,2595.0,2585.91,2590.0,161400,2603.0,2566.0
862,2018/03/05,2603.0,2601.062,2592.0,104600,2621.0,2586.0
863,2018/03/06,2608.0,2614.629,2605.0,75500,2632.0,2596.0
864,2018/03/07,2604.0,2611.581,2601.0,103600,2637.0,2596.0
865,2018/03/08,2603.0,2602.532,2626.0,109100,2626.0,2588.0
866,2018/03/09,2618.0,2623.182,2628.0,146400,2669.0,2597.0
867,2018/03/12,2629.0,2629.41,2643.0,91200,2651.0,2616.0
868,2018/03/13,2681.0,2660.988,2623.0,168300,2681.0,2623.0
869,2018/03/14,2674.0,2667.703,2685.0,170200,2688.0,2640.0
870,2018/03/15,2681.0,2664.799,2674.0,87700,2683.0,2626.0
871,2018/03/16,2692.0,2689.287,2687.0,152700,2709.0,2673.0
872,2018/03/19,2662.0,2664.292,2685.0,88500,2685.0,2644.0
873,2018/03/20,2664.0,2649.592,2651.0,101600,2664.0,2626.0
874,2018/03/22,2666.0,2656.133,2669.0,109500,2674.0,2637.0
875,2018/03/23,2580.0,2591.707,2628.0,168300,2628.0,2569.0
876,2018/03/26,2592.0,2566.11,2570.0,176700,2593.0,2522.0
877,2018/03/27,2651.0,2633.511,2615.0,298000,2651.0,2598.0
878,2018/03/28,2645.0,2623.617,2601.0,126400,2646.0,2581.0
879,2018/03/29,2634.0,2641.067,2668.0,101000,2673.0,2610.0
880,2018/03/30,2697.0,2686.215,2659.0,160600,2707.0,2643.0
881,2018/04/02,2688.0,2684.03,2692.0,130400,2698.0,2655.0
882,2018/04/03,2749.0,2732.688,2679.0,217200,2760.0,2658.0
883,2018/04/04,2781.0,2777.636,2767.0,149700,2796.0,2742.0
884,2018/04/05,2806.0,2811.282,2800.0,158000,2831.0,2787.0
885,2018/04/06,2801.0,2810.584,2820.0,142700,2839.0,2793.0
886,2018/04/09,2784.0,2786.217,2801.0,73400,2809.0,2773.0
887,2018/04/10,2718.0,2735.793,2783.0,124800,2783.0,2710.0
888,2018/04/11,2708.0,2697.117,2728.0,127800,2741.0,2671.0
889,2018/04/12,2676.0,2682.647,2698.0,120300,2725.0,2660.0
890,2018/04/13,2688.0,2686.76,2698.0,69700,2698.0,2670.0
891,2018/04/16,2714.0,2697.796,2675.0,112600,2717.0,2674.0
892,2018/04/17,2685.0,2695.17,2708.0,61700,2724.0,2682.0
893,2018/04/18,2714.0,2710.487,2688.0,89300,2721.0,2678.0
894,2018/04/19,2732.0,2729.749,2726.0,67400,2741.0,2702.0
895,2018/04/20,2730.0,2732.222,2725.0,68600,2743.0,2717.0
896,2018/04/23,2704.0,2710.163,2730.0,78700,2734.0,2699.0
897,2018/04/24,2730.0,2717.589,2715.0,72200,2734.0,2686.0
898,2018/04/25,2744.0,2736.031,2719.0,81500,2753.0,2706.0
899,2018/04/26,2740.0,2732.914,2748.0,74600,2748.0,2714.0
900,2018/04/27,2759.0,2746.66,2750.0,68000,2759.0,2721.0
901,2018/05/01,2752.0,2747.618,2759.0,59200,2759.0,2725.0
902,2018/05/02,2744.0,2739.364,2760.0,60500,2760.0,2727.0
903,2018/05/07,2749.0,2742.019,2759.0,64900,2759.0,2722.0
904,2018/05/08,2816.0,2811.128,2765.0,150300,2835.0,2765.0
905,2018/05/09,2863.0,2860.628,2824.0,226700,2907.0,2824.0
906,2018/05/10,2840.0,2849.538,2875.0,153700,2880.0,2824.0
907,2018/05/11,2859.0,2844.68,2840.0,98500,2862.0,2825.0
908,2018/05/14,2905.0,2889.479,2880.0,154700,2908.0,2869.0
909,2018/05/15,2883.0,2885.488,2905.0,130700,2905.0,2873.0
910,2018/05/16,2699.0,2710.596,2783.0,452700,2783.0,2685.0
911,2018/05/17,2642.0,2640.701,2697.0,318400,2697.0,2620.0
912,2018/05/18,2624.0,2622.484,2638.0,198200,2638.0,2605.0
913,2018/05/21,2617.0,2618.203,2625.0,122100,2631.0,2605.0
914,2018/05/22,2624.0,2618.28,2621.0,108900,2627.0,2607.0
915,2018/05/23,2640.0,2636.695,2616.0,144400,2662.0,2615.0
916,2018/05/24,2651.0,2649.132,2635.0,135900,2664.0,2633.0
917,2018/05/25,2668.0,2669.738,2660.0,202600,2688.0,2648.0
918,2018/05/28,2671.0,2669.526,2652.0,80300,2685.0,2642.0
919,2018/05/29,2669.0,2666.455,2675.0,125300,2698.0,2646.0
920,2018/05/30,2645.0,2644.063,2645.0,94700,2654.0,2624.0
921,2018/05/31,2638.0,2636.494,2645.0,192900,2648.0,2612.0
922,2018/06/01,2607.0,2606.27,2627.0,150200,2627.0,2586.0
923,2018/06/04,2640.0,2640.441,2627.0,103200,2650.0,2627.0
924,2018/06/05,2660.0,2649.331,2639.0,77000,2661.0,2627.0
925,2018/06/06,2671.0,2670.057,2661.0,110400,2686.0,2642.0
926,2018/06/07,2665.0,2669.968,2686.0,86400,2686.0,2664.0
927,2018/06/08,2675.0,2665.283,2655.0,156000,2683.0,2651.0
928,2018/06/11,2701.0,2695.373,2675.0,68900,2709.0,2674.0
929,2018/06/12,2740.0,2731.519,2709.0,159400,2746.0,2694.0
930,2018/06/13,2794.0,2782.973,2749.0,170000,2804.0,2749.0
931,2018/06/14,2794.0,2797.24,2790.0,99900,2811.0,2775.0
932,2018/06/15,2786.0,2794.85,2810.0,144200,2813.0,2785.0
933,2018/06/18,2786.0,2789.14,2792.0,80800,2806.0,2773.0
934,2018/06/19,2780.0,2790.736,2786.0,116600,2819.0,2776.0
935,2018/06/20,2793.0,2786.814,2786.0,103700,2823.0,2765.0
936,2018/06/21,2771.0,2785.922,2794.0,95400,2813.0,2771.0
937,2018/06/22,2784.0,2771.432,2755.0,78200,2785.0,2737.0
938,2018/06/25,2703.0,2714.475,2765.0,119100,2765.0,2695.0
939,2018/06/26,2728.0,2708.94,2695.0,76700,2729.0,2677.0
940,2018/06/27,2749.0,2744.919,2737.0,66600,2760.0,2727.0
941,2018/06/28,2763.0,2752.818,2745.0,101300,2766.0,2722.0
942,2018/06/29,2763.0,2761.413,2763.0,73600,2781.0,2740.0
943,2018/07/02,2693.0,2716.092,2759.0,122500,2761.0,2688.0
944,2018/07/03,2631.0,2648.507,2700.0,147800,2709.0,2612.0
945,2018/07/04,2655.0,2645.59,2620.0,67300,2664.0,2613.0
946,2018/07/05,2636.0,2644.014,2655.0,73100,2665.0,2625.0
947,2018/07/06,2624.0,2627.01,2636.0,92000,2656.0,2615.0
948,2018/07/09,2665.0,2656.331,2651.0,49600,2665.0,2632.0
949,2018/07/10,2635.0,2648.79,2671.0,96600,2686.0,2635.0
950,2018/07/11,2597.0,2605.051,2620.0,113600,2626.0,2594.0
951,2018/07/12,2609.0,2616.944,2614.0,83800,2633.0,2605.0
952,2018/07/13,2633.0,2632.438,2627.0,83600,2647.0,2611.0
953,2018/07/17,2687.0,2681.367,2630.0,96900,2699.0,2630.0
954,2018/07/18,2679.0,2685.117,2687.0,59000,2710.0,2668.0
955,2018/07/19,2654.0,2662.538,2679.0,87300,2681.0,2649.0
956,2018/07/20,2640.0,2633.953,2631.0,75000,2641.0,2625.0
957,2018/07/23,2641.0,2649.592,2639.0,43100,2669.0,2634.0
958,2018/07/24,2641.0,2649.09,2668.0,51100,2668.0,2634.0
959,2018/07/25,2624.0,2627.24,2645.0,81700,2645.0,2616.0
960,2018/07/26,2658.0,2653.827,2654.0,87700,2667.0,2640.0
961,2018/07/27,2707.0,2701.026,2679.0,96200,2714.0,2675.0
962,2018/07/30,2686.0,2680.858,2688.0,120000,2692.0,2668.0
963,2018/07/31,2828.0,2795.794,2713.0,461700,2867.0,2713.0
964,2018/08/01,2913.0,2892.82,2828.0,261900,2920.0,2824.0
965,2018/08/02,2861.0,2910.623,2910.0,216900,2958.0,2859.0
966,2018/08/03,2777.0,2794.113,2870.0,111800,2872.0,2768.0
967,2018/08/06,2725.0,2747.334,2776.0,95500,2788.0,2717.0
968,2018/08/07,2755.0,2727.453,2725.0,82500,2759.0,2688.0
969,2018/08/08,2778.0,2781.666,2772.0,154000,2816.0,2752.0
970,2018/08/09,2768.0,2772.81,2778.0,73100,2792.0,2765.0
971,2018/08/10,2726.0,2728.834,2768.0,71700,2768.0,2715.0
972,2018/08/13,2700.0,2699.121,2718.0,81900,2718.0,2681.0
973,2018/08/14,2822.0,2786.838,2730.0,118200,2822.0,2728.0
974,2018/08/15,2798.0,2809.345,2807.0,121900,2828.0,2797.0
975,2018/08/16,2771.0,2762.898,2768.0,110600,2782.0,2734.0
976,2018/08/17,2726.0,2728.978,2740.0,125300,2746.0,2716.0
977,2018/08/20,2671.0,2681.723,2715.0,110400,2722.0,2666.0
978,2018/08/21,2630.0,2639.645,2668.0,103400,2668.0,2629.0
979,2018/08/22,2637.0,2633.128,2638.0,87600,2650.0,2621.0
980,2018/08/23,2637.0,2641.171,2651.0,94200,2664.0,2625.0
981,2018/08/24,2656.0,2658.526,2659.0,106300,2669.0,2645.0
982,2018/08/27,2641.0,2642.668,2650.0,171900,2654.0,2635.0
983,2018/08/28,2630.0,2633.126,2647.0,95700,2653.0,2622.0
984,2018/08/29,2627.0,2629.937,2626.0,100700,2649.0,2618.0
985,2018/08/30,2674.0,2665.917,2647.0,101500,2675.0,2638.0
986,2018/08/31,2674.0,2681.589,2680.0,146800,2698.0,2673.0
987,2018/09/03,2644.0,2649.558,2675.0,87900,2675.0,2631.0
988,2018/09/04,2652.0,2656.582,2652.0,91400,2677.0,2640.0
989,2018/09/05,2681.0,2673.574,2659.0,91600,2692.0,2653.0
990,2018/09/06,2658.0,2660.471,2670.0,63500,2672.0,2652.0
991,2018/09/07,2655.0,2644.223,2650.0,80700,2659.0,2624.0
992,2018/09/10,2645.0,2650.696,2650.0,87700,2662.0,2635.0
993,2018/09/11,2659.0,2654.473,2657.0,72300,2664.0,2634.0
994,2018/09/12,2661.0,2659.16,2693.0,106400,2698.0,2636.0
995,2018/09/13,2697.0,2693.793,2671.0,100200,2716.0,2671.0
996,2018/09/14,2711.0,2726.282,2735.0,129700,2742.0,2705.0
997,2018/09/18,2790.0,2763.516,2725.0,108900,2793.0,2701.0
998,2018/09/19,2802.0,2804.445,2815.0,112100,2823.0,2785.0
999,2018/09/20,2805.0,2803.949,2812.0,76300,2813.0,2791.0
1000,2018/09/21,2794.0,2800.612,2814.0,115800,2820.0,2789.0
1001,2018/09/25,2871.0,2830.647,2788.0,262200,2871.0,2785.0
1002,2018/09/26,2892.0,2871.16,2830.0,154000,2897.0,2813.0
1003,2018/09/27,2810.0,2830.001,2857.0,136200,2876.0,2810.0
1004,2018/09/28,2772.0,2788.478,2810.0,138200,2826.0,2769.0
1005,2018/10/01,2795.0,2798.836,2775.0,93500,2834.0,2768.0
1006,2018/10/02,2793.0,2798.108,2801.0,76100,2834.0,2779.0
1007,2018/10/03,2766.0,2779.992,2798.0,73700,2822.0,2757.0
1008,2018/10/04,2757.0,2760.202,2794.0,66500,2794.0,2745.0
1009,2018/10/05,2775.0,2775.165,2752.0,69600,2792.0,2749.0
1010,2018/10/09,2746.0,2744.06,2770.0,79600,2770.0,2731.0
1011,2018/10/10,2742.0,2750.675,2754.0,68000,2791.0,2726.0
1012,2018/10/11,2679.0,2680.393,2692.0,136200,2711.0,2666.0
1013,2018/10/12,2634.0,2646.793,2666.0,153700,2695.0,2631.0
1014,2018/10/15,2601.0,2610.688,2637.0,161400,2650.0,2596.0
1015,2018/10/16,2665.0,2637.567,2590.0,162700,2666.0,2575.0
1016,2018/10/17,2698.0,2690.358,2688.0,86500,2700.0,2656.0
1017,2018/10/18,2694.0,2701.851,2698.0,69300,2719.0,2682.0
1018,2018/10/19,2699.0,2688.027,2674.0,97400,2708.0,2659.0
1019,2018/10/22,2692.0,2686.972,2693.0,81200,2705.0,2661.0
1020,2018/10/23,2620.0,2636.126,2685.0,76300,2685.0,2616.0
1021,2018/10/24,2637.0,2629.311,2638.0,63000,2646.0,2598.0
1022,2018/10/25,2568.0,2573.867,2580.0,104200,2596.0,2561.0
1023,2018/10/26,2523.0,2544.18,2592.0,128400,2597.0,2519.0
1024,2018/10/29,2493.0,2512.707,2524.0,91700,2558.0,2493.0
1025,2018/10/30,2493.0,2490.457,2490.0,148300,2504.0,2475.0
1026,2018/10/31,2568.0,2551.194,2531.0,98900,2569.0,2512.0
1027,2018/11/01,2363.0,2387.99,2468.0,271700,2481.0,2363.0
1028,2018/11/02,2371.0,2354.058,2366.0,199500,2373.0,2331.0
1029,2018/11/05,2421.0,2412.996,2380.0,176300,2433.0,2375.0
1030,2018/11/06,2401.0,2405.019,2397.0,145500,2429.0,2380.0
1031,2018/11/07,2396.0,2415.232,2405.0,84500,2441.0,2391.0
1032,2018/11/08,2430.0,2431.248,2440.0,64600,2447.0,2421.0
1033,2018/11/09,2454.0,2451.018,2430.0,67300,2464.0,2428.0
1034,2018/11/12,2463.0,2466.387,2448.0,51200,2481.0,2442.0
1035,2018/11/13,2433.0,2429.99,2430.0,107900,2446.0,2405.0
1036,2018/11/14,2412.0,2422.246,2441.0,82700,2449.0,2410.0
1037,2018/11/15,2435.0,2426.342,2406.0,57600,2438.0,2405.0
1038,2018/11/16,2388.0,2398.942,2429.0,138900,2433.0,2385.0
1039,2018/11/19,2549.0,2521.439,2399.0,310900,2555.0,2395.0
1040,2018/11/20,2510.0,2516.846,2526.0,137200,2557.0,2495.0
1041,2018/11/21,2524.0,2509.338,2450.0,120900,2533.0,2443.0
1042,2018/11/22,2573.0,2556.382,2522.0,92700,2578.0,2522.0
1043,2018/11/26,2588.0,2605.985,2588.0,116400,2633.0,2588.0
1044,2018/11/27,2588.0,2602.967,2597.0,121900,2632.0,2588.0
1045,2018/11/28,2613.0,2618.952,2593.0,89500,2629.0,2593.0
1046,2018/11/29,2646.0,2655.523,2642.0,102800,2667.0,2642.0
1047,2018/11/30,2617.0,2627.106,2643.0,213300,2655.0,2617.0
1048,2018/12/03,2656.0,2649.385,2646.0,78000,2661.0,2626.0
1049,2018/12/04,2597.0,2624.931,2657.0,105000,2664.0,2597.0
1050,2018/12/05,2568.0,2566.286,2560.0,100400,2589.0,2547.0
1051,2018/12/06,2509.0,2512.694,2540.0,82300,2543.0,2501.0
1052,2018/12/07,2567.0,2548.828,2511.0,113800,2574.0,2509.0
1053,2018/12/10,2500.0,2508.055,2507.0,85200,2531.0,2500.0
1054,2018/12/11,2446.0,2456.466,2501.0,95300,2505.0,2441.0
1055,2018/12/12,2538.0,2525.173,2496.0,107800,2540.0,2482.0
1056,2018/12/13,2548.0,2549.507,2556.0,105700,2565.0,2527.0
1057,2018/12/14,2503.0,2533.694,2548.0,102000,2555.0,2503.0
1058,2018/12/17,2492.0,2496.539,2506.0,47500,2511.0,2490.0
1059,2018/12/18,2456.0,2464.009,2488.0,70800,2489.0,2453.0
1060,2018/12/19,2490.0,2486.362,2461.0,94500,2504.0,2461.0
1061,2018/12/20,2402.0,2419.265,2467.0,106500,2483.0,2389.0
1062,2018/12/21,2320.0,2328.381,2402.0,149800,2407.0,2300.0
1063,2018/12/25,2174.0,2202.422,2294.0,105900,2294.0,2160.0
1064,2018/12/26,2228.0,2220.76,2187.0,92600,2245.0,2185.0
1065,2018/12/27,2373.0,2355.083,2299.0,95100,2388.0,2293.0
1066,2018/12/28,2405.0,2384.936,2371.0,89500,2405.0,2347.0
1067,2019/01/04,2458.0,2468.767,2379.0,245900,2520.0,2375.0
1068,2019/01/07,2466.0,2482.257,2516.0,133700,2532.0,2463.0
1069,2019/01/08,2444.0,2442.715,2471.0,111400,2488.0,2398.0
1070,2019/01/09,2470.0,2476.453,2479.0,50300,2496.0,2466.0
1071,2019/01/10,2472.0,2461.547,2458.0,63600,2476.0,2413.0
1072,2019/01/11,2473.0,2465.603,2493.0,67500,2493.0,2442.0
1073,2019/01/15,2430.0,2442.559,2458.0,96500,2477.0,2425.0
1074,2019/01/16,2444.0,2446.283,2437.0,52300,2465.0,2422.0
1075,2019/01/17,2476.0,2468.563,2463.0,51900,2485.0,2446.0
1076,2019/01/18,2510.0,2511.642,2490.0,67800,2529.0,2483.0
1077,2019/01/21,2516.0,2524.772,2520.0,60200,2540.0,2516.0
1078,2019/01/22,2494.0,2502.33,2529.0,54500,2529.0,2486.0
1079,2019/01/23,2491.0,2488.968,2480.0,53400,2510.0,2469.0
1080,2019/01/24,2512.0,2515.149,2495.0,80500,2531.0,2483.0
1081,2019/01/25,2517.0,2517.16,2509.0,70500,2538.0,2502.0
1082,2019/01/28,2477.0,2493.635,2511.0,63900,2524.0,2472.0
1083,2019/01/29,2502.0,2491.31,2480.0,53600,2506.0,2466.0
1084,2019/01/30,2498.0,2498.534,2502.0,125400,2510.0,2487.0
1085,2019/01/31,2618.0,2588.003,2538.0,206800,2618.0,2514.0
1086,2019/02/01,2564.0,2578.293,2604.0,78800,2622.0,2555.0
1087,2019/02/04,2581.0,2578.381,2588.0,84600,2605.0,2556.0
1088,2019/02/05,2564.0,2570.139,2594.0,58300,2597.0,2556.0
1089,2019/02/06,2532.0,2541.787,2585.0,81100,2587.0,2523.0
1090,2019/02/07,2517.0,2514.513,2539.0,53800,2548.0,2502.0
1091,2019/02/08,2451.0,2463.622,2492.0,95700,2509.0,2443.0
1092,2019/02/12,2593.0,2573.815,2505.0,125600,2593.0,2504.0
1093,2019/02/13,2630.0,2663.344,2712.0,236700,2735.0,2625.0
1094,2019/02/14,2635.0,2631.3,2637.0,113500,2653.0,2587.0
1095,2019/02/15,2637.0,2624.923,2620.0,96600,2645.0,2583.0
1096,2019/02/18,2665.0,2667.922,2687.0,125000,2702.0,2646.0
1097,2019/02/19,2690.0,2685.294,2671.0,117800,2697.0,2656.0
1098,2019/02/20,2710.0,2712.424,2700.0,178200,2728.0,2697.0
1099,2019/02/21,2756.0,2741.71,2716.0,224000,2765.0,2711.0
1100,2019/02/22,2756.0,2764.706,2747.0,202000,2779.0,2746.0
1101,2019/02/25,2756.0,2747.548,2757.0,97900,2761.0,2721.0
1102,2019/02/26,2749.0,2753.633,2764.0,69000,2776.0,2738.0
1103,2019/02/27,2775.0,2775.597,2767.0,180000,2788.0,2755.0
1104,2019/02/28,2762.0,2764.188,2767.0,156300,2783.0,2747.0
1105,2019/03/01,2779.0,2770.715,2763.0,132700,2785.0,2745.0
1106,2019/03/04,2759.0,2772.518,2800.0,146000,2811.0,2750.0
1107,2019/03/05,2751.0,2745.929,2747.0,116900,2760.0,2733.0
1108,2019/03/06,2697.0,2702.574,2741.0,193000,2743.0,2691.0
1109,2019/03/07,2653.0,2665.969,2682.0,275600,2699.0,2649.0
1110,2019/03/08,2654.0,2645.06,2640.0,211800,2661.0,2630.0
1111,2019/03/11,2651.0,2647.832,2661.0,95000,2667.0,2633.0
1112,2019/03/12,2681.0,2677.096,2675.0,125700,2692.0,2659.0
1113,2019/03/13,2643.0,2646.488,2671.0,129400,2685.0,2628.0
1114,2019/03/14,2621.0,2632.576,2675.0,99100,2685.0,2618.0
1115,2019/03/15,2620.0,2627.23,2622.0,159300,2650.0,2615.0
1116,2019/03/18,2640.0,2629.885,2642.0,136600,2642.0,2613.0
1117,2019/03/19,2636.0,2627.767,2644.0,115700,2644.0,2609.0
1118,2019/03/20,2659.0,2646.556,2636.0,99000,2659.0,2630.0
1119,2019/03/22,2647.0,2648.654,2661.0,121800,2670.0,2636.0
1120,2019/03/25,2611.0,2601.402,2610.0,123600,2616.0,2588.0
1121,2019/03/26,2691.0,2674.716,2643.0,231600,2697.0,2635.0
1122,2019/03/27,2675.0,2671.627,2662.0,115400,2683.0,2657.0
1123,2019/03/28,2616.0,2617.387,2649.0,113500,2653.0,2606.0
1124,2019/03/29,2635.0,2630.335,2633.0,128100,2640.0,2614.0
1125,2019/04/01,2705.0,2701.756,2672.0,173500,2719.0,2665.0
1126,2019/04/02,2694.0,2690.153,2709.0,112900,2709.0,2669.0
1127,2019/04/03,2712.0,2701.153,2694.0,89300,2715.0,2671.0
1128,2019/04/04,2678.0,2691.059,2712.0,110000,2712.0,2678.0
1129,2019/04/05,2681.0,2674.29,2682.0,125900,2705.0,2657.0
1130,2019/04/08,2652.0,2648.485,2668.0,133700,2668.0,2620.0
1131,2019/04/09,2632.0,2626.138,2651.0,115400,2659.0,2592.0
1132,2019/04/10,2607.0,2602.123,2596.0,145300,2623.0,2581.0
1133,2019/04/11,2620.0,2616.156,2618.0,129300,2633.0,2587.0
1134,2019/04/12,2659.0,2654.835,2644.0,151100,2671.0,2614.0
1135,2019/04/15,2715.0,2712.212,2694.0,116300,2726.0,2694.0
1136,2019/04/16,2717.0,2714.87,2715.0,69000,2723.0,2697.0
1137,2019/04/17,2701.0,2703.471,2709.0,130100,2713.0,2694.0
1138,2019/04/18,2667.0,2673.146,2707.0,108100,2708.0,2659.0
1139,2019/04/19,2673.0,2680.604,2684.0,70500,2699.0,2669.0
1140,2019/04/22,2679.0,2674.661,2652.0,59200,2687.0,2645.0
1141,2019/04/23,2703.0,2690.528,2680.0,115000,2705.0,2659.0
1142,2019/04/24,2709.0,2720.968,2716.0,106900,2739.0,2708.0
1143,2019/04/25,2740.0,2734.633,2721.0,169300,2742.0,2706.0
1144,2019/04/26,2738.0,2731.686,2738.0,141000,2746.0,2707.0
1145,2019/05/07,2736.0,2737.672,2756.0,123400,2768.0,2713.0
1146,2019/05/08,2726.0,2711.988,2705.0,163000,2726.0,2690.0
1147,2019/05/09,2686.0,2693.944,2705.0,119700,2708.0,2678.0
1148,2019/05/10,2681.0,2693.315,2698.0,146800,2730.0,2668.0
1149,2019/05/13,2691.0,2701.789,2682.0,102800,2728.0,2682.0
1150,2019/05/14,2688.0,2673.61,2642.0,104100,2696.0,2623.0
1151,2019/05/15,2684.0,2686.973,2689.0,125200,2715.0,2650.0
1152,2019/05/16,2717.0,2720.774,2684.0,216600,2787.0,2680.0
1153,2019/05/17,2807.0,2805.78,2766.0,207600,2828.0,2766.0
1154,2019/05/20,2823.0,2816.39,2802.0,74100,2827.0,2796.0
1155,2019/05/21,2794.0,2790.76,2761.0,136500,2815.0,2761.0
1156,2019/05/22,2753.0,2760.876,2788.0,140200,2793.0,2742.0
1157,2019/05/23,2803.0,2802.541,2760.0,109300,2818.0,2760.0
1158,2019/05/24,2824.0,2817.955,2779.0,74900,2830.0,2776.0
1159,2019/05/27,2823.0,2827.801,2825.0,117200,2848.0,2811.0
1160,2019/05/28,2858.0,2849.411,2822.0,192800,2867.0,2819.0
1161,2019/05/29,2876.0,2870.348,2825.0,177500,2885.0,2825.0
1162,2019/05/30,2857.0,2858.652,2877.0,166300,2895.0,2832.0
1163,2019/05/31,2841.0,2849.484,2840.0,147200,2866.0,2836.0
1164,2019/06/03,2820.0,2826.995,2811.0,97500,2849.0,2811.0
1165,2019/06/04,2803.0,2795.412,2829.0,135100,2830.0,2775.0
1166,2019/06/05,2894.0,2873.795,2849.0,160700,2896.0,2835.0
1167,2019/06/06,2900.0,2907.262,2888.0,145400,2926.0,2869.0
1168,2019/06/07,2906.0,2914.564,2926.0,114600,2947.0,2895.0
1169,2019/06/10,2982.0,2962.948,2924.0,172100,2990.0,2924.0
1170,2019/06/11,2916.0,2927.948,2974.0,119200,2974.0,2908.0
1171,2019/06/12,2956.0,2955.685,2925.0,157200,2974.0,2925.0
1172,2019/06/13,2919.0,2918.772,2947.0,113200,2950.0,2896.0
1173,2019/06/14,2913.0,2912.35,2927.0,109600,2927.0,2895.0
1174,2019/06/17,2902.0,2906.475,2895.0,69300,2920.0,2895.0
1175,2019/06/18,2880.0,2892.788,2920.0,114100,2944.0,2871.0
1176,2019/06/19,2918.0,2909.081,2909.0,122500,2923.0,2877.0
1177,2019/06/20,2897.0,2906.302,2918.0,68000,2928.0,2889.0
1178,2019/06/21,2879.0,2878.265,2895.0,142200,2899.0,2867.0
1179,2019/06/24,2862.0,2866.348,2874.0,84400,2875.0,2856.0
1180,2019/06/25,2875.0,2889.648,2893.0,102400,2919.0,2874.0
1181,2019/06/26,2811.0,2819.852,2853.0,117100,2859.0,2805.0
1182,2019/06/27,2836.0,2826.295,2819.0,89800,2840.0,2791.0
1183,2019/06/28,2831.0,2831.054,2840.0,158800,2854.0,2818.0
1184,2019/07/01,2927.0,2908.308,2871.0,117500,2932.0,2866.0
1185,2019/07/02,2943.0,2937.381,2918.0,135600,2954.0,2908.0
1186,2019/07/03,2917.0,2922.107,2933.0,103600,2942.0,2914.0
1187,2019/07/04,2977.0,2973.781,2946.0,118100,2983.0,2946.0
1188,2019/07/05,2960.0,2957.485,2969.0,65200,2970.0,2945.0
1189,2019/07/08,2925.0,2932.83,2945.0,67000,2954.0,2920.0
1190,2019/07/09,2896.0,2906.511,2938.0,113900,2954.0,2884.0
1191,2019/07/10,2902.0,2899.096,2883.0,104800,2912.0,2878.0
1192,2019/07/11,2956.0,2950.053,2930.0,109300,2958.0,2929.0
1193,2019/07/12,2972.0,2969.359,2950.0,126000,2981.0,2950.0
1194,2019/07/16,2980.0,2981.391,2982.0,135400,2998.0,2963.0
1195,2019/07/17,2969.0,2971.178,2976.0,115700,2992.0,2960.0
1196,2019/07/18,2877.0,2893.655,2945.0,148800,2948.0,2867.0
1197,2019/07/19,2954.0,2937.825,2888.0,80400,2961.0,2888.0
1198,2019/07/22,2952.0,2951.991,2937.0,88000,2964.0,2928.0
1199,2019/07/23,3005.0,3003.285,2967.0,202500,3025.0,2967.0
1200,2019/07/24,2930.0,2953.035,3005.0,183500,3005.0,2927.0
1201,2019/07/25,2937.0,2932.854,2930.0,96300,2950.0,2903.0
1202,2019/07/26,2962.0,2957.792,2952.0,90800,2968.0,2934.0
1203,2019/07/29,2943.0,2950.295,2966.0,86800,2988.0,2933.0
1204,2019/07/30,2983.0,2978.325,2970.0,113100,2986.0,2961.0
1205,2019/07/31,2896.0,2904.595,2936.0,217500,2936.0,2887.0
1206,2019/08/01,2871.0,2862.448,2855.0,90200,2878.0,2831.0
1207,2019/08/02,2817.0,2818.168,2827.0,126200,2851.0,2792.0
1208,2019/08/05,2777.0,2770.94,2782.0,112800,2803.0,2740.0
1209,2019/08/06,2797.0,2764.841,2732.0,123600,2799.0,2726.0
1210,2019/08/07,2811.0,2803.676,2768.0,67600,2815.0,2768.0
1211,2019/08/08,2833.0,2828.909,2801.0,107200,2844.0,2796.0
1212,2019/08/09,2778.0,2781.937,2834.0,111100,2845.0,2753.0
1213,2019/08/13,2705.0,2711.38,2736.0,123800,2736.0,2700.0
1214,2019/08/14,2725.0,2721.468,2721.0,86700,2731.0,2708.0
1215,2019/08/15,2681.0,2670.057,2662.0,83100,2691.0,2640.0
1216,2019/08/16,2692.0,2684.999,2670.0,69700,2701.0,2657.0
1217,2019/08/19,2724.0,2723.296,2721.0,76600,2732.0,2706.0
1218,2019/08/20,2767.0,2753.185,2743.0,63100,2770.0,2737.0
1219,2019/08/21,2754.0,2749.552,2750.0,60200,2764.0,2730.0
1220,2019/08/22,2735.0,2730.7,2755.0,73900,2758.0,2718.0
1221,2019/08/23,2749.0,2753.926,2753.0,61000,2773.0,2740.0
