,Date,Close,VWAP,Open,Volume,High,Low
0,2014/08/25,1727.0,1715.293,1752.0,471300,1752.0,1695.0
1,2014/08/26,1701.0,1724.168,1735.0,341900,1776.0,1698.0
2,2014/08/27,1702.0,1707.201,1703.0,129000,1726.0,1701.0
3,2014/08/28,1696.0,1699.719,1705.0,156500,1715.0,1685.0
4,2014/08/29,1712.0,1688.917,1677.0,196600,1718.0,1656.0
5,2014/09/01,1736.0,1753.071,1780.0,215400,1785.0,1721.0
6,2014/09/02,1748.0,1733.964,1751.0,187000,1765.0,1708.0
7,2014/09/03,1734.0,1748.51,1755.0,121300,1770.0,1722.0
8,2014/09/04,1685.0,1714.365,1750.0,160700,1760.0,1672.0
9,2014/09/05,1677.0,1678.922,1685.0,102300,1706.0,1662.0
10,2014/09/08,1680.0,1671.477,1680.0,109200,1692.0,1655.0
11,2014/09/09,1683.0,1698.059,1680.0,98100,1719.0,1676.0
12,2014/09/10,1605.0,1609.916,1670.0,343700,1675.0,1570.0
13,2014/09/11,1641.0,1629.12,1606.0,218100,1670.0,1581.0
14,2014/09/12,1660.0,1651.045,1641.0,109200,1665.0,1626.0
15,2014/09/16,1640.0,1658.144,1670.0,127500,1689.0,1634.0
16,2014/09/17,1649.0,1632.546,1660.0,133500,1662.0,1608.0
17,2014/09/18,1762.0,1732.109,1660.0,754500,1780.0,1645.0
18,2014/09/19,1722.0,1726.723,1745.0,247200,1757.0,1702.0
19,2014/09/22,1716.0,1723.161,1710.0,148900,1745.0,1702.0
20,2014/09/24,1625.0,1633.041,1650.0,287300,1669.0,1612.0
21,2014/09/25,1610.0,1621.437,1652.0,130800,1655.0,1608.0
22,2014/09/26,1630.0,1612.575,1585.0,197200,1648.0,1565.0
23,2014/09/29,1638.0,1640.555,1649.0,175400,1663.0,1620.0
24,2014/09/30,1600.0,1614.004,1610.0,148600,1640.0,1600.0
25,2014/10/01,1498.0,1546.311,1588.0,262100,1606.0,1488.0
26,2014/10/02,1430.0,1416.974,1382.0,360000,1470.0,1382.0
27,2014/10/03,1450.0,1426.496,1430.0,290900,1480.0,1395.0
28,2014/10/06,1494.0,1490.921,1475.0,206000,1514.0,1461.0
29,2014/10/07,1441.0,1444.942,1472.0,189600,1484.0,1415.0
30,2014/10/08,1406.0,1399.431,1381.0,159800,1421.0,1373.0
31,2014/10/09,1350.0,1373.352,1420.0,213600,1427.0,1349.0
32,2014/10/10,1285.0,1287.373,1290.0,287000,1337.0,1250.0
33,2014/10/14,1221.0,1240.486,1225.0,187800,1271.0,1221.0
34,2014/10/15,1272.0,1256.498,1251.0,191400,1295.0,1217.0
35,2014/10/16,1198.0,1219.441,1215.0,253800,1263.0,1196.0
36,2014/10/17,1218.0,1222.333,1218.0,188800,1255.0,1198.0
37,2014/10/20,1325.0,1302.974,1270.0,234100,1337.0,1252.0
38,2014/10/21,1292.0,1297.219,1312.0,154500,1324.0,1278.0
39,2014/10/22,1341.0,1335.658,1325.0,130800,1350.0,1322.0
40,2014/10/23,1333.0,1329.721,1312.0,88400,1349.0,1309.0
41,2014/10/24,1333.0,1371.607,1401.0,274600,1428.0,1311.0
42,2014/10/27,1322.0,1340.581,1344.0,156500,1370.0,1316.0
43,2014/10/28,1307.0,1307.225,1310.0,68100,1330.0,1280.0
44,2014/10/29,1334.0,1327.655,1316.0,98700,1348.0,1304.0
45,2014/10/30,1282.0,1292.418,1318.0,163200,1328.0,1266.0
46,2014/10/31,1350.0,1314.95,1297.0,203500,1350.0,1270.0
47,2014/11/04,1619.0,1554.048,1470.0,1163000,1627.0,1401.0
48,2014/11/05,1608.0,1596.635,1570.0,875800,1690.0,1551.0
49,2014/11/06,1499.0,1505.102,1520.0,901500,1550.0,1455.0
50,2014/11/07,1506.0,1509.684,1529.0,332100,1549.0,1471.0
51,2014/11/10,1465.0,1458.889,1475.0,159900,1480.0,1447.0
52,2014/11/11,1434.0,1441.873,1480.0,155200,1480.0,1423.0
53,2014/11/12,1432.0,1449.216,1450.0,250700,1497.0,1410.0
54,2014/11/13,1423.0,1404.104,1402.0,198000,1440.0,1375.0
55,2014/11/14,1378.0,1390.073,1423.0,183900,1455.0,1366.0
56,2014/11/17,1397.0,1432.417,1427.0,338900,1489.0,1382.0
57,2014/11/18,1472.0,1449.39,1408.0,217500,1476.0,1404.0
58,2014/11/19,1449.0,1450.172,1461.0,128800,1481.0,1430.0
59,2014/11/20,1390.0,1416.257,1459.0,147800,1459.0,1389.0
60,2014/11/21,1466.0,1489.87,1450.0,751600,1550.0,1439.0
61,2014/11/25,1449.0,1454.61,1460.0,155000,1485.0,1435.0
62,2014/11/26,1427.0,1439.12,1464.0,129800,1464.0,1419.0
63,2014/11/27,1402.0,1411.248,1420.0,136700,1425.0,1390.0
64,2014/11/28,1401.0,1408.255,1395.0,132700,1425.0,1395.0
65,2014/12/01,1458.0,1418.337,1395.0,180800,1466.0,1386.0
66,2014/12/02,1434.0,1444.795,1441.0,155900,1466.0,1426.0
67,2014/12/03,1496.0,1484.97,1425.0,673100,1524.0,1421.0
68,2014/12/04,1510.0,1513.768,1542.0,551700,1560.0,1462.0
69,2014/12/05,1643.0,1583.262,1531.0,956600,1650.0,1518.0
70,2014/12/08,1791.0,1939.453,1923.0,5178900,2043.0,1771.0
71,2014/12/09,2191.0,2047.964,1770.0,8619500,2191.0,1723.0
72,2014/12/10,2244.0,2183.844,2170.0,8748600,2342.0,2002.0
73,2014/12/11,2246.0,2239.377,2198.0,5514000,2315.0,2150.0
74,2014/12/12,1917.0,2068.387,2210.0,4190200,2268.0,1902.0
75,2014/12/15,2000.0,2026.094,1950.0,3638000,2137.0,1918.0
76,2014/12/16,1940.0,1973.026,1970.0,2212600,2050.0,1912.0
77,2014/12/17,2137.0,2090.213,2045.0,5115700,2176.0,1961.0
78,2014/12/18,2063.0,2095.956,2137.0,4101200,2210.0,2000.0
79,2014/12/19,1933.0,1983.43,2110.0,1905800,2120.0,1890.0
80,2014/12/22,1838.0,1874.848,1905.0,1222700,1973.0,1830.0
81,2014/12/24,1795.0,1800.508,1799.0,930000,1846.0,1746.0
82,2014/12/25,1830.0,1837.284,1802.0,1195900,1888.0,1789.0
83,2014/12/26,1888.0,1888.25,1800.0,865100,1944.0,1800.0
84,2014/12/29,1896.0,1907.147,1880.0,1061300,1957.0,1832.0
85,2014/12/30,1900.0,1890.838,1880.0,608600,1940.0,1855.0
86,2015/01/05,1907.0,1912.167,1930.0,466200,1942.0,1885.0
87,2015/01/06,1825.0,1841.417,1855.0,495100,1870.0,1825.0
88,2015/01/07,1720.0,1742.22,1785.0,632000,1818.0,1705.0
89,2015/01/08,1752.0,1732.825,1727.0,343100,1756.0,1705.0
90,2015/01/09,1659.0,1689.477,1750.0,475300,1765.0,1646.0
91,2015/01/13,1635.0,1607.764,1601.0,421700,1650.0,1575.0
92,2015/01/14,1559.0,1581.984,1618.0,366600,1627.0,1523.0
93,2015/01/15,1718.0,1735.425,1660.0,3135700,1824.0,1625.0
94,2015/01/16,1634.0,1644.862,1678.0,786200,1712.0,1585.0
95,2015/01/19,1614.0,1607.296,1606.0,305100,1634.0,1590.0
96,2015/01/20,1670.0,1646.14,1601.0,586900,1689.0,1571.0
97,2015/01/21,1636.0,1632.051,1630.0,645400,1710.0,1580.0
98,2015/01/22,1593.0,1596.79,1616.0,323500,1631.0,1571.0
99,2015/01/23,1563.0,1583.564,1594.0,329900,1612.0,1558.0
100,2015/01/26,1522.0,1536.694,1571.0,293000,1574.0,1508.0
101,2015/01/27,1562.0,1570.828,1584.0,554000,1599.0,1541.0
102,2015/01/28,1626.0,1596.289,1550.0,391000,1638.0,1537.0
103,2015/01/29,1643.0,1673.42,1634.0,738600,1745.0,1632.0
104,2015/01/30,1662.0,1631.608,1616.0,291900,1663.0,1606.0
105,2015/02/02,1631.0,1671.956,1652.0,324600,1710.0,1616.0
106,2015/02/03,1700.0,1698.816,1652.0,559900,1750.0,1652.0
107,2015/02/04,1688.0,1840.104,1820.0,6539000,1955.0,1669.0
108,2015/02/05,1585.0,1621.027,1672.0,883300,1683.0,1575.0
109,2015/02/06,1564.0,1579.532,1569.0,507300,1625.0,1556.0
110,2015/02/09,1579.0,1582.365,1580.0,231400,1605.0,1567.0
111,2015/02/10,1604.0,1610.781,1590.0,376300,1636.0,1587.0
112,2015/02/12,1610.0,1616.535,1630.0,245100,1645.0,1600.0
113,2015/02/13,1564.0,1580.629,1612.0,309100,1620.0,1561.0
114,2015/02/16,1557.0,1562.107,1568.0,179700,1588.0,1550.0
115,2015/02/17,1532.0,1539.499,1548.0,209700,1554.0,1527.0
116,2015/02/18,1565.0,1545.071,1518.0,422900,1586.0,1500.0
117,2015/02/19,1546.0,1557.604,1567.0,153200,1577.0,1541.0
118,2015/02/20,1544.0,1543.613,1550.0,121300,1554.0,1533.0
119,2015/02/23,1595.0,1573.36,1538.0,234100,1596.0,1536.0
120,2015/02/24,1658.0,1629.756,1600.0,480600,1658.0,1585.0
121,2015/02/25,1622.0,1634.692,1657.0,233600,1657.0,1601.0
122,2015/02/26,1582.0,1591.545,1612.0,199500,1613.0,1577.0
123,2015/02/27,1615.0,1601.868,1582.0,165400,1619.0,1578.0
124,2015/03/02,1598.0,1599.064,1606.0,120600,1619.0,1590.0
125,2015/03/03,1544.0,1556.755,1590.0,177000,1597.0,1540.0
126,2015/03/04,1548.0,1548.873,1539.0,118900,1570.0,1536.0
127,2015/03/05,1557.0,1571.56,1555.0,100400,1596.0,1553.0
128,2015/03/06,1580.0,1568.707,1546.0,278100,1595.0,1539.0
129,2015/03/09,1551.0,1565.839,1575.0,102000,1580.0,1551.0
130,2015/03/10,1520.0,1532.04,1560.0,175900,1566.0,1515.0
131,2015/03/11,1513.0,1511.187,1502.0,120600,1529.0,1500.0
132,2015/03/12,1511.0,1518.557,1537.0,95400,1537.0,1502.0
133,2015/03/13,1529.0,1525.612,1521.0,142600,1542.0,1511.0
134,2015/03/16,1516.0,1511.699,1511.0,133700,1523.0,1507.0
135,2015/03/17,1508.0,1505.567,1511.0,162400,1524.0,1500.0
136,2015/03/18,1509.0,1499.766,1507.0,136200,1529.0,1475.0
137,2015/03/19,1559.0,1519.706,1510.0,215500,1559.0,1485.0
138,2015/03/20,1580.0,1573.97,1567.0,344000,1596.0,1536.0
139,2015/03/23,1646.0,1624.067,1590.0,448600,1655.0,1590.0
140,2015/03/24,1596.0,1609.532,1632.0,260600,1640.0,1585.0
141,2015/03/25,1567.0,1587.179,1596.0,182200,1606.0,1565.0
142,2015/03/26,1526.0,1534.382,1550.0,121600,1556.0,1520.0
143,2015/03/27,1540.0,1543.45,1520.0,84200,1566.0,1515.0
144,2015/03/30,1667.0,1635.978,1620.0,848600,1668.0,1590.0
145,2015/03/31,1600.0,1614.23,1660.0,343900,1660.0,1593.0
146,2015/04/01,1579.0,1581.568,1586.0,131600,1597.0,1567.0
147,2015/04/02,1638.0,1652.614,1640.0,624000,1686.0,1627.0
148,2015/04/03,1605.0,1601.226,1611.0,195300,1632.0,1583.0
149,2015/04/06,1629.0,1607.662,1603.0,138000,1629.0,1582.0
150,2015/04/07,1605.0,1607.798,1620.0,120500,1623.0,1599.0
151,2015/04/08,1601.0,1604.139,1605.0,213200,1616.0,1591.0
152,2015/04/09,1601.0,1611.59,1607.0,161800,1637.0,1597.0
153,2015/04/10,1627.0,1619.385,1585.0,205200,1636.0,1585.0
154,2015/04/13,1699.0,1677.543,1650.0,443200,1700.0,1630.0
155,2015/04/14,1670.0,1675.948,1689.0,252300,1698.0,1663.0
156,2015/04/15,1647.0,1655.502,1666.0,209600,1694.0,1605.0
157,2015/04/16,1632.0,1633.516,1652.0,86000,1658.0,1621.0
158,2015/04/17,1610.0,1611.76,1630.0,137500,1630.0,1601.0
159,2015/04/20,1591.0,1601.344,1600.0,168000,1628.0,1585.0
160,2015/04/21,1597.0,1595.816,1595.0,92800,1603.0,1585.0
161,2015/04/22,1617.0,1606.601,1605.0,122400,1626.0,1592.0
162,2015/04/23,1615.0,1616.32,1628.0,100800,1638.0,1607.0
163,2015/04/24,1601.0,1604.27,1610.0,70700,1615.0,1597.0
164,2015/04/27,1581.0,1587.185,1602.0,104200,1603.0,1580.0
165,2015/04/28,1587.0,1597.381,1585.0,134400,1607.0,1585.0
166,2015/04/30,1594.0,1627.269,1580.0,725600,1690.0,1550.0
167,2015/05/01,1550.0,1553.82,1567.0,208500,1579.0,1541.0
168,2015/05/07,1539.0,1537.804,1560.0,183400,1565.0,1525.0
169,2015/05/08,1595.0,1573.487,1543.0,155400,1595.0,1543.0
170,2015/05/11,1616.0,1600.904,1599.0,145100,1616.0,1581.0
171,2015/05/12,1575.0,1606.118,1660.0,466100,1660.0,1555.0
172,2015/05/13,1568.0,1566.85,1581.0,156100,1585.0,1555.0
173,2015/05/14,1566.0,1570.082,1562.0,89500,1580.0,1558.0
174,2015/05/15,1569.0,1563.102,1566.0,62500,1575.0,1555.0
175,2015/05/18,1575.0,1574.714,1580.0,61200,1584.0,1565.0
176,2015/05/19,1616.0,1598.59,1571.0,193900,1616.0,1568.0
177,2015/05/20,1615.0,1620.439,1626.0,178000,1629.0,1608.0
178,2015/05/21,1625.0,1657.11,1625.0,559800,1695.0,1621.0
179,2015/05/22,1613.0,1626.797,1633.0,142200,1659.0,1608.0
180,2015/05/25,1639.0,1632.479,1630.0,151200,1645.0,1621.0
181,2015/05/26,1614.0,1618.173,1635.0,145400,1637.0,1609.0
182,2015/05/27,1605.0,1615.605,1603.0,300300,1657.0,1591.0
183,2015/05/28,1590.0,1593.03,1599.0,204900,1618.0,1583.0
184,2015/05/29,1610.0,1597.269,1583.0,76100,1610.0,1583.0
185,2015/06/01,1611.0,1608.66,1605.0,113500,1628.0,1600.0
186,2015/06/02,1605.0,1602.375,1605.0,116200,1611.0,1598.0
187,2015/06/03,1630.0,1613.646,1600.0,207000,1630.0,1599.0
188,2015/06/04,1624.0,1654.853,1667.0,490800,1685.0,1615.0
189,2015/06/05,1619.0,1618.597,1611.0,117900,1629.0,1610.0
190,2015/06/08,1610.0,1619.126,1623.0,147700,1635.0,1606.0
191,2015/06/09,1581.0,1596.291,1602.0,203100,1612.0,1581.0
192,2015/06/10,1571.0,1570.46,1560.0,129100,1585.0,1560.0
193,2015/06/11,1595.0,1584.696,1573.0,114400,1601.0,1573.0
194,2015/06/12,1595.0,1594.903,1592.0,106000,1604.0,1590.0
195,2015/06/15,1577.0,1580.392,1589.0,138500,1592.0,1574.0
196,2015/06/16,1569.0,1574.043,1580.0,131200,1583.0,1565.0
197,2015/06/17,1557.0,1563.438,1567.0,124700,1575.0,1554.0
198,2015/06/18,1544.0,1545.479,1555.0,151700,1565.0,1532.0
199,2015/06/19,1570.0,1545.536,1530.0,188200,1576.0,1530.0
200,2015/06/22,1634.0,1612.347,1580.0,504300,1634.0,1579.0
201,2015/06/23,1611.0,1610.618,1628.0,261300,1630.0,1594.0
202,2015/06/24,1625.0,1619.289,1603.0,234600,1635.0,1598.0
203,2015/06/25,1590.0,1607.964,1612.0,210700,1632.0,1590.0
204,2015/06/26,1564.0,1571.099,1580.0,204200,1585.0,1561.0
205,2015/06/29,1502.0,1510.688,1500.0,397900,1540.0,1485.0
206,2015/06/30,1484.0,1491.956,1496.0,402800,1520.0,1473.0
207,2015/07/01,1516.0,1499.88,1499.0,172700,1520.0,1480.0
208,2015/07/02,1600.0,1635.744,1530.0,1640700,1719.0,1525.0
209,2015/07/03,1660.0,1618.37,1591.0,816000,1670.0,1557.0
210,2015/07/06,1777.0,1750.393,1631.0,2342400,1819.0,1631.0
211,2015/07/07,1848.0,1833.219,1850.0,1919800,1882.0,1781.0
212,2015/07/08,1727.0,1775.573,1815.0,1312500,1846.0,1721.0
213,2015/07/09,1817.0,1709.496,1680.0,2112600,1848.0,1558.0
214,2015/07/10,1809.0,1823.919,1897.0,2065000,1930.0,1750.0
215,2015/07/13,1928.0,1873.216,1786.0,1427200,1928.0,1778.0
216,2015/07/14,1915.0,1945.034,1950.0,1371600,1993.0,1893.0
217,2015/07/15,1775.0,1857.594,1915.0,1795300,1959.0,1773.0
218,2015/07/16,1901.0,1839.923,1809.0,1195300,1905.0,1760.0
219,2015/07/17,1887.0,1879.361,1881.0,905400,1930.0,1839.0
220,2015/07/21,1892.0,1883.57,1910.0,606700,1920.0,1859.0
221,2015/07/22,1974.0,1939.868,1875.0,1360400,1982.0,1852.0
222,2015/07/23,2022.0,2001.017,1974.0,1080100,2042.0,1941.0
223,2015/07/24,1997.0,2005.07,2000.0,797700,2055.0,1957.0
224,2015/07/27,2280.0,2291.073,2210.0,10998300,2397.0,2174.0
225,2015/07/28,2333.0,2243.592,2182.0,6564600,2441.0,2070.0
226,2015/07/29,2219.0,2278.074,2325.0,3045100,2348.0,2211.0
227,2015/07/30,2100.0,2157.912,2260.0,2112200,2265.0,2081.0
228,2015/07/31,1996.0,2075.508,2080.0,3346600,2196.0,1963.0
229,2015/08/03,1833.0,1892.882,1960.0,2352200,1980.0,1833.0
230,2015/08/04,1797.0,1823.585,1868.0,1654500,1894.0,1789.0
231,2015/08/05,1860.0,1838.607,1837.0,1587700,1879.0,1783.0
232,2015/08/06,1752.0,1773.457,1831.0,1959100,1857.0,1730.0
233,2015/08/07,1831.0,1824.1,1778.0,1540700,1887.0,1748.0
234,2015/08/10,1792.0,1792.237,1790.0,675300,1839.0,1765.0
235,2015/08/11,1794.0,1792.133,1756.0,616000,1830.0,1756.0
236,2015/08/12,1815.0,1822.35,1795.0,1020000,1869.0,1784.0
237,2015/08/13,1787.0,1791.68,1820.0,517000,1832.0,1769.0
238,2015/08/14,1749.0,1755.263,1787.0,478900,1794.0,1731.0
239,2015/08/17,1661.0,1679.806,1744.0,702000,1744.0,1650.0
240,2015/08/18,1662.0,1661.412,1630.0,479400,1696.0,1625.0
241,2015/08/19,1622.0,1630.96,1655.0,552100,1684.0,1600.0
242,2015/08/20,1613.0,1638.464,1646.0,380700,1662.0,1612.0
243,2015/08/21,1531.0,1550.551,1548.0,697800,1580.0,1531.0
244,2015/08/24,1275.0,1360.348,1457.0,1507600,1477.0,1256.0
245,2015/08/25,1314.0,1345.078,1305.0,2152900,1449.0,1198.0
246,2015/08/26,1457.0,1407.202,1388.0,946600,1457.0,1359.0
247,2015/08/27,1447.0,1452.573,1457.0,968200,1498.0,1421.0
248,2015/08/28,1465.0,1467.689,1466.0,886400,1510.0,1447.0
249,2015/08/31,1418.0,1428.69,1448.0,807300,1476.0,1386.0
250,2015/09/01,1354.0,1387.318,1405.0,584300,1432.0,1349.0
251,2015/09/02,1363.0,1350.104,1316.0,420700,1391.0,1306.0
252,2015/09/03,1389.0,1388.593,1390.0,315800,1415.0,1367.0
253,2015/09/04,1301.0,1320.752,1394.0,412800,1399.0,1283.0
254,2015/09/07,1317.0,1297.757,1301.0,294300,1338.0,1250.0
255,2015/09/08,1255.0,1284.761,1301.0,315800,1331.0,1251.0
256,2015/09/09,1351.0,1328.845,1311.0,353900,1368.0,1287.0
257,2015/09/10,1408.0,1370.216,1321.0,357300,1410.0,1301.0
258,2015/09/11,1442.0,1425.376,1380.0,231500,1447.0,1380.0
259,2015/09/14,1420.0,1414.527,1429.0,296600,1442.0,1382.0
260,2015/09/15,1371.0,1393.415,1400.0,214700,1419.0,1368.0
261,2015/09/16,1362.0,1378.229,1385.0,248800,1400.0,1357.0
262,2015/09/17,1406.0,1388.378,1379.0,159100,1411.0,1351.0
263,2015/09/18,1397.0,1395.011,1377.0,100000,1414.0,1377.0
264,2015/09/24,1378.0,1381.163,1378.0,116000,1403.0,1365.0
265,2015/09/25,1336.0,1333.132,1365.0,289500,1378.0,1300.0
266,2015/09/28,1331.0,1325.375,1351.0,136700,1351.0,1309.0
267,2015/09/29,1269.0,1287.732,1309.0,206600,1335.0,1258.0
268,2015/09/30,1294.0,1276.832,1290.0,129900,1300.0,1254.0
269,2015/10/01,1327.0,1323.875,1304.0,195400,1342.0,1299.0
270,2015/10/02,1365.0,1347.496,1304.0,151100,1367.0,1304.0
271,2015/10/05,1406.0,1408.639,1365.0,253100,1438.0,1360.0
272,2015/10/06,1418.0,1421.343,1415.0,140100,1435.0,1410.0
273,2015/10/07,1432.0,1420.803,1412.0,144800,1434.0,1390.0
274,2015/10/08,1395.0,1416.571,1432.0,184600,1448.0,1381.0
275,2015/10/09,1432.0,1419.236,1417.0,112600,1437.0,1395.0
276,2015/10/13,1422.0,1425.365,1440.0,77100,1440.0,1414.0
277,2015/10/14,1362.0,1381.573,1390.0,139700,1407.0,1361.0
278,2015/10/15,1374.0,1366.24,1332.0,101900,1393.0,1331.0
279,2015/10/16,1391.0,1382.836,1376.0,65200,1395.0,1364.0
280,2015/10/19,1380.0,1381.126,1400.0,68400,1401.0,1370.0
281,2015/10/20,1342.0,1350.484,1380.0,109000,1392.0,1335.0
282,2015/10/21,1370.0,1364.131,1365.0,63600,1376.0,1351.0
283,2015/10/22,1340.0,1347.462,1371.0,98900,1371.0,1339.0
284,2015/10/23,1346.0,1361.687,1367.0,200800,1379.0,1340.0
285,2015/10/26,1433.0,1416.905,1357.0,334800,1441.0,1354.0
286,2015/10/27,1436.0,1449.388,1418.0,314000,1480.0,1418.0
287,2015/10/28,1438.0,1446.435,1430.0,137800,1470.0,1430.0
288,2015/10/29,1410.0,1415.954,1440.0,155000,1458.0,1391.0
289,2015/10/30,1426.0,1404.999,1398.0,151700,1426.0,1382.0
290,2015/11/02,1445.0,1438.042,1430.0,122700,1449.0,1425.0
291,2015/11/04,1404.0,1420.729,1446.0,173900,1458.0,1401.0
292,2015/11/05,1334.0,1380.818,1464.0,1076600,1478.0,1311.0
293,2015/11/06,1347.0,1347.844,1336.0,268400,1370.0,1331.0
294,2015/11/09,1319.0,1333.997,1340.0,277200,1365.0,1313.0
295,2015/11/10,1349.0,1342.094,1319.0,130700,1359.0,1319.0
296,2015/11/11,1340.0,1337.449,1350.0,141800,1352.0,1329.0
297,2015/11/12,1332.0,1331.826,1348.0,97200,1348.0,1322.0
298,2015/11/13,1339.0,1331.531,1330.0,128300,1348.0,1317.0
299,2015/11/16,1324.0,1331.819,1321.0,88200,1343.0,1320.0
300,2015/11/17,1330.0,1329.214,1335.0,72300,1338.0,1324.0
301,2015/11/18,1331.0,1333.289,1334.0,66700,1338.0,1329.0
302,2015/11/19,1391.0,1403.6,1440.0,854200,1440.0,1359.0
303,2015/11/20,1412.0,1402.657,1390.0,187000,1414.0,1387.0
304,2015/11/24,1440.0,1431.61,1428.0,327500,1447.0,1411.0
305,2015/11/25,1467.0,1460.869,1420.0,486300,1492.0,1415.0
306,2015/11/26,1559.0,1564.453,1482.0,1289500,1631.0,1480.0
307,2015/11/27,1582.0,1553.554,1555.0,582300,1586.0,1506.0
308,2015/11/30,1617.0,1622.962,1630.0,508100,1642.0,1590.0
309,2015/12/01,1567.0,1594.34,1625.0,439900,1635.0,1561.0
310,2015/12/02,1695.0,1647.417,1557.0,988500,1695.0,1538.0
311,2015/12/03,1676.0,1723.209,1712.0,1546300,1790.0,1661.0
312,2015/12/04,1859.0,1772.304,1636.0,2588100,1875.0,1633.0
313,2015/12/07,1883.0,1859.85,1859.0,1891400,1903.0,1795.0
314,2015/12/08,1879.0,1876.151,1910.0,1000600,1922.0,1822.0
315,2015/12/09,1889.0,1881.661,1853.0,780600,1915.0,1840.0
316,2015/12/10,1888.0,1885.986,1855.0,686700,1917.0,1847.0
317,2015/12/11,1923.0,1907.27,1906.0,708500,1929.0,1887.0
318,2015/12/14,1949.0,1920.73,1880.0,1064700,1959.0,1874.0
319,2015/12/15,1760.0,1920.405,1965.0,3523200,2084.0,1734.0
320,2015/12/16,1751.0,1766.036,1795.0,1208200,1841.0,1712.0
321,2015/12/17,1750.0,1764.161,1745.0,520700,1810.0,1735.0
322,2015/12/18,1716.0,1757.727,1777.0,608100,1814.0,1708.0
323,2015/12/21,1680.0,1691.132,1710.0,404800,1733.0,1665.0
324,2015/12/22,1685.0,1698.462,1700.0,355300,1725.0,1685.0
325,2015/12/24,1533.0,1576.784,1655.0,862100,1664.0,1506.0
326,2015/12/25,1520.0,1521.474,1510.0,467800,1566.0,1510.0
327,2015/12/28,1568.0,1556.532,1522.0,297300,1584.0,1522.0
328,2015/12/29,1549.0,1552.154,1562.0,196900,1568.0,1540.0
329,2015/12/30,1543.0,1546.548,1552.0,245900,1576.0,1538.0
330,2016/01/04,1530.0,1557.627,1550.0,401200,1616.0,1522.0
331,2016/01/05,1486.0,1484.433,1501.0,487700,1530.0,1448.0
332,2016/01/06,1490.0,1494.355,1514.0,306600,1525.0,1461.0
333,2016/01/07,1509.0,1524.084,1488.0,589000,1567.0,1451.0
334,2016/01/08,1527.0,1503.309,1492.0,336900,1544.0,1455.0
335,2016/01/12,1424.0,1454.659,1490.0,461300,1497.0,1401.0
336,2016/01/13,1490.0,1480.53,1457.0,329500,1525.0,1430.0
337,2016/01/14,1447.0,1431.074,1450.0,274200,1460.0,1406.0
338,2016/01/15,1398.0,1423.992,1457.0,318300,1485.0,1375.0
339,2016/01/18,1347.0,1333.025,1311.0,338900,1363.0,1300.0
340,2016/01/19,1376.0,1353.697,1358.0,243900,1393.0,1318.0
341,2016/01/20,1255.0,1293.823,1356.0,371700,1363.0,1246.0
342,2016/01/21,1254.0,1285.433,1270.0,288300,1334.0,1243.0
343,2016/01/22,1343.0,1326.818,1340.0,252200,1355.0,1279.0
344,2016/01/25,1354.0,1347.079,1345.0,217200,1367.0,1311.0
345,2016/01/26,1345.0,1342.456,1315.0,213500,1373.0,1310.0
346,2016/01/27,1363.0,1362.01,1373.0,282400,1396.0,1345.0
347,2016/01/28,1362.0,1371.028,1349.0,248200,1397.0,1345.0
348,2016/01/29,1384.0,1355.423,1360.0,291100,1389.0,1324.0
349,2016/02/01,1535.0,1477.071,1426.0,516200,1540.0,1416.0
350,2016/02/02,1495.0,1549.25,1505.0,603500,1624.0,1490.0
351,2016/02/03,1501.0,1490.217,1450.0,461500,1566.0,1437.0
352,2016/02/04,1391.0,1448.159,1470.0,619700,1531.0,1391.0
353,2016/02/05,1308.0,1323.642,1353.0,442800,1363.0,1289.0
354,2016/02/08,1322.0,1307.944,1281.0,330700,1352.0,1270.0
355,2016/02/09,1219.0,1245.381,1260.0,508200,1275.0,1211.0
356,2016/02/10,1160.0,1172.204,1240.0,418400,1249.0,1122.0
357,2016/02/12,1002.0,1037.356,1064.0,611700,1100.0,999.0
358,2016/02/15,1099.0,1086.856,1100.0,351600,1119.0,1025.0
359,2016/02/16,1166.0,1165.608,1113.0,384800,1198.0,1113.0
360,2016/02/17,1155.0,1162.484,1138.0,225200,1208.0,1133.0
361,2016/02/18,1220.0,1218.398,1212.0,301900,1233.0,1201.0
362,2016/02/19,1243.0,1221.847,1190.0,263500,1250.0,1186.0
363,2016/02/22,1343.0,1310.599,1249.0,408800,1353.0,1239.0
364,2016/02/23,1339.0,1366.303,1366.0,454400,1417.0,1318.0
365,2016/02/24,1365.0,1345.377,1312.0,249800,1380.0,1301.0
366,2016/02/25,1379.0,1395.298,1390.0,195700,1428.0,1370.0
367,2016/02/26,1389.0,1392.298,1412.0,153600,1414.0,1372.0
368,2016/02/29,1354.0,1371.403,1362.0,173800,1400.0,1354.0
369,2016/03/01,1438.0,1407.288,1361.0,289000,1438.0,1361.0
370,2016/03/02,1584.0,1571.449,1480.0,1193900,1650.0,1464.0
371,2016/03/03,1566.0,1589.736,1580.0,555500,1627.0,1541.0
372,2016/03/04,1550.0,1572.07,1537.0,398700,1600.0,1532.0
373,2016/03/07,1612.0,1631.213,1642.0,616300,1679.0,1587.0
374,2016/03/08,1571.0,1570.69,1612.0,393000,1636.0,1530.0
375,2016/03/09,1513.0,1506.17,1547.0,399500,1547.0,1471.0
376,2016/03/10,1535.0,1523.006,1529.0,172600,1539.0,1494.0
377,2016/03/11,1545.0,1538.462,1498.0,162900,1567.0,1492.0
378,2016/03/14,1600.0,1591.315,1578.0,255900,1609.0,1561.0
379,2016/03/15,1592.0,1596.982,1609.0,146000,1619.0,1575.0
380,2016/03/16,1617.0,1621.542,1604.0,181900,1645.0,1596.0
381,2016/03/17,1582.0,1610.177,1621.0,215800,1638.0,1562.0
382,2016/03/18,1614.0,1579.767,1560.0,218900,1619.0,1540.0
383,2016/03/22,1633.0,1632.357,1639.0,176600,1648.0,1611.0
384,2016/03/23,1640.0,1642.685,1630.0,200600,1662.0,1620.0
385,2016/03/24,1673.0,1669.489,1639.0,271100,1695.0,1622.0
386,2016/03/25,1620.0,1642.598,1671.0,167300,1690.0,1615.0
387,2016/03/28,1580.0,1590.849,1610.0,146000,1620.0,1563.0
388,2016/03/29,1625.0,1604.706,1584.0,116100,1625.0,1570.0
389,2016/03/30,1672.0,1667.22,1607.0,297200,1695.0,1606.0
390,2016/03/31,1652.0,1657.531,1675.0,119500,1688.0,1637.0
391,2016/04/01,1549.0,1566.9,1652.0,311300,1652.0,1519.0
392,2016/04/04,1491.0,1510.2,1501.0,216400,1547.0,1486.0
393,2016/04/05,1375.0,1411.141,1491.0,315700,1497.0,1370.0
394,2016/04/06,1398.0,1361.441,1330.0,362000,1400.0,1330.0
395,2016/04/07,1419.0,1413.486,1390.0,241700,1458.0,1375.0
396,2016/04/08,1447.0,1416.059,1384.0,161800,1461.0,1371.0
397,2016/04/11,1463.0,1432.581,1450.0,168200,1475.0,1403.0
398,2016/04/12,1437.0,1451.917,1454.0,198300,1482.0,1423.0
399,2016/04/13,1458.0,1458.199,1435.0,164100,1474.0,1435.0
400,2016/04/14,1464.0,1465.796,1480.0,193300,1486.0,1432.0
401,2016/04/15,1439.0,1441.87,1450.0,142400,1460.0,1431.0
402,2016/04/18,1394.0,1393.047,1381.0,160500,1415.0,1380.0
403,2016/04/19,1488.0,1461.113,1420.0,236300,1492.0,1420.0
404,2016/04/20,1447.0,1477.544,1520.0,232900,1528.0,1435.0
405,2016/04/21,1527.0,1517.337,1478.0,238000,1548.0,1474.0
406,2016/04/22,1515.0,1508.51,1519.0,123000,1542.0,1486.0
407,2016/04/25,1486.0,1508.788,1519.0,193700,1547.0,1485.0
408,2016/04/26,1473.0,1477.386,1490.0,206000,1513.0,1441.0
409,2016/04/27,1485.0,1486.119,1493.0,90900,1503.0,1460.0
410,2016/04/28,1410.0,1407.988,1440.0,412800,1448.0,1380.0
411,2016/05/02,1393.0,1376.967,1362.0,104400,1399.0,1340.0
412,2016/05/06,1465.0,1434.548,1420.0,168400,1465.0,1405.0
413,2016/05/09,1498.0,1483.527,1462.0,165500,1510.0,1450.0
414,2016/05/10,1485.0,1471.511,1491.0,153900,1492.0,1438.0
415,2016/05/11,1442.0,1487.422,1516.0,480700,1525.0,1440.0
416,2016/05/12,1430.0,1442.205,1445.0,187900,1473.0,1425.0
417,2016/05/13,1392.0,1396.482,1420.0,208400,1430.0,1382.0
418,2016/05/16,1345.0,1367.373,1377.0,253700,1405.0,1342.0
419,2016/05/17,1405.0,1396.667,1360.0,174500,1425.0,1360.0
420,2016/05/18,1377.0,1374.35,1406.0,233600,1420.0,1348.0
421,2016/05/19,1415.0,1401.341,1394.0,154500,1425.0,1372.0
422,2016/05/20,1531.0,1527.808,1510.0,765100,1578.0,1486.0
423,2016/05/23,1931.0,1898.779,1930.0,4067300,1931.0,1830.0
424,2016/05/24,1702.0,1778.45,1858.0,3838500,1895.0,1692.0
425,2016/05/25,1688.0,1723.086,1710.0,1120600,1776.0,1670.0
426,2016/05/26,1615.0,1611.624,1608.0,1024500,1646.0,1571.0
427,2016/05/27,1562.0,1586.578,1616.0,579400,1636.0,1544.0
428,2016/05/30,1614.0,1593.319,1558.0,349800,1622.0,1554.0
429,2016/05/31,1657.0,1629.048,1640.0,617600,1663.0,1586.0
430,2016/06/01,1667.0,1724.733,1705.0,2094800,1815.0,1626.0
431,2016/06/02,1602.0,1611.919,1650.0,525300,1650.0,1586.0
432,2016/06/03,1628.0,1614.686,1610.0,237100,1634.0,1596.0
433,2016/06/06,1598.0,1571.492,1565.0,350300,1603.0,1540.0
434,2016/06/07,1594.0,1594.063,1608.0,196100,1610.0,1582.0
435,2016/06/08,1568.0,1574.687,1588.0,218900,1596.0,1557.0
436,2016/06/09,1578.0,1573.441,1555.0,245200,1597.0,1552.0
437,2016/06/10,1614.0,1619.598,1599.0,571200,1671.0,1594.0
438,2016/06/13,1564.0,1578.212,1574.0,341800,1605.0,1555.0
439,2016/06/14,1421.0,1474.079,1544.0,703200,1550.0,1412.0
440,2016/06/15,1406.0,1413.148,1395.0,377500,1460.0,1386.0
441,2016/06/16,1296.0,1339.547,1407.0,512600,1416.0,1293.0
442,2016/06/17,1317.0,1314.305,1350.0,306000,1352.0,1276.0
443,2016/06/20,1353.0,1358.54,1347.0,235000,1389.0,1326.0
444,2016/06/21,1351.0,1334.581,1317.0,288100,1357.0,1314.0
445,2016/06/22,1315.0,1334.983,1358.0,249300,1386.0,1310.0
446,2016/06/23,1320.0,1310.392,1310.0,195500,1335.0,1299.0
447,2016/06/24,1234.0,1236.943,1361.0,628100,1369.0,1079.0
448,2016/06/27,1239.0,1239.135,1264.0,257100,1266.0,1196.0
449,2016/06/28,1303.0,1269.937,1219.0,214000,1320.0,1200.0
450,2016/06/29,1296.0,1306.459,1318.0,173600,1329.0,1285.0
451,2016/06/30,1303.0,1310.578,1313.0,153000,1324.0,1299.0
452,2016/07/01,1365.0,1345.377,1312.0,233600,1365.0,1312.0
453,2016/07/04,1415.0,1405.765,1395.0,211600,1424.0,1390.0
454,2016/07/05,1405.0,1392.755,1409.0,116400,1413.0,1365.0
455,2016/07/06,1368.0,1369.491,1380.0,178500,1400.0,1341.0
456,2016/07/07,1337.0,1353.048,1377.0,99400,1377.0,1335.0
457,2016/07/08,1307.0,1319.021,1325.0,128100,1359.0,1298.0
458,2016/07/11,1342.0,1338.628,1340.0,84100,1353.0,1328.0
459,2016/07/12,1360.0,1361.853,1342.0,132100,1382.0,1342.0
460,2016/07/13,1390.0,1375.369,1381.0,190200,1394.0,1345.0
461,2016/07/14,1376.0,1388.897,1366.0,143500,1417.0,1364.0
462,2016/07/15,1324.0,1346.2,1406.0,246200,1410.0,1318.0
463,2016/07/19,1310.0,1310.595,1324.0,160800,1343.0,1295.0
464,2016/07/20,1295.0,1312.38,1321.0,179000,1349.0,1283.0
465,2016/07/21,1320.0,1309.74,1310.0,94800,1325.0,1295.0
466,2016/07/22,1439.0,1426.904,1325.0,1323300,1524.0,1292.0
467,2016/07/25,1357.0,1361.28,1399.0,399000,1406.0,1325.0
468,2016/07/26,1320.0,1327.535,1327.0,164300,1356.0,1312.0
469,2016/07/27,1334.0,1337.348,1320.0,126300,1357.0,1316.0
470,2016/07/28,1291.0,1306.79,1320.0,206700,1339.0,1288.0
471,2016/07/29,1422.0,1394.584,1286.0,1175400,1456.0,1286.0
472,2016/08/01,1500.0,1465.942,1401.0,777300,1515.0,1370.0
473,2016/08/02,1432.0,1460.259,1473.0,412900,1510.0,1430.0
474,2016/08/03,1336.0,1385.91,1402.0,394000,1424.0,1333.0
475,2016/08/04,1498.0,1470.016,1366.0,1208300,1524.0,1366.0
476,2016/08/05,1451.0,1461.096,1480.0,243000,1489.0,1437.0
477,2016/08/08,1374.0,1392.924,1431.0,299800,1439.0,1363.0
478,2016/08/09,1386.0,1387.337,1385.0,143700,1420.0,1360.0
479,2016/08/10,1392.0,1386.707,1386.0,107400,1404.0,1360.0
480,2016/08/12,1410.0,1400.205,1390.0,101100,1413.0,1387.0
481,2016/08/15,1419.0,1412.473,1410.0,60200,1423.0,1397.0
482,2016/08/16,1434.0,1417.43,1420.0,189400,1438.0,1385.0
483,2016/08/17,1384.0,1391.473,1434.0,266500,1434.0,1372.0
484,2016/08/18,1373.0,1369.496,1378.0,129500,1393.0,1356.0
485,2016/08/19,1375.0,1365.629,1381.0,53900,1381.0,1352.0
486,2016/08/22,1366.0,1372.674,1388.0,66200,1395.0,1361.0
487,2016/08/23,1428.0,1436.351,1360.0,400900,1478.0,1360.0
488,2016/08/24,1437.0,1431.466,1428.0,97200,1453.0,1406.0
489,2016/08/25,1440.0,1437.566,1443.0,102600,1447.0,1425.0
490,2016/08/26,1425.0,1429.808,1436.0,111200,1450.0,1415.0
491,2016/08/29,1429.0,1420.364,1420.0,113600,1435.0,1407.0
492,2016/08/30,1417.0,1409.791,1411.0,66000,1429.0,1397.0
493,2016/08/31,1406.0,1399.425,1406.0,108000,1416.0,1387.0
494,2016/09/01,1425.0,1414.692,1415.0,85000,1425.0,1401.0
495,2016/09/02,1444.0,1429.75,1403.0,89100,1444.0,1403.0
496,2016/09/05,1437.0,1462.746,1448.0,170300,1487.0,1436.0
497,2016/09/06,1468.0,1468.671,1436.0,153100,1483.0,1436.0
498,2016/09/07,1479.0,1469.288,1447.0,104800,1480.0,1447.0
499,2016/09/08,1442.0,1455.779,1466.0,143500,1476.0,1440.0
500,2016/09/09,1482.0,1465.429,1460.0,172000,1485.0,1446.0
501,2016/09/12,1479.0,1475.564,1466.0,167200,1495.0,1463.0
502,2016/09/13,1544.0,1531.066,1494.0,343400,1567.0,1488.0
503,2016/09/14,1521.0,1561.785,1529.0,334700,1592.0,1505.0
504,2016/09/15,1481.0,1501.504,1515.0,167200,1536.0,1480.0
505,2016/09/16,1477.0,1450.905,1476.0,202600,1498.0,1420.0
506,2016/09/20,1439.0,1451.263,1461.0,73800,1473.0,1438.0
507,2016/09/21,1474.0,1465.716,1450.0,127800,1490.0,1442.0
508,2016/09/23,1476.0,1473.337,1469.0,82500,1486.0,1456.0
509,2016/09/26,1526.0,1507.731,1471.0,156700,1528.0,1466.0
510,2016/09/27,1551.0,1533.099,1508.0,173100,1554.0,1496.0
511,2016/09/28,1537.0,1532.528,1536.0,155200,1569.0,1515.0
512,2016/09/29,1525.0,1519.909,1535.0,87100,1540.0,1509.0
513,2016/09/30,1549.0,1530.622,1503.0,87200,1549.0,1499.0
514,2016/10/03,1584.0,1583.176,1550.0,240800,1604.0,1540.0
515,2016/10/04,1582.0,1590.244,1593.0,128900,1614.0,1568.0
516,2016/10/05,1575.0,1572.411,1578.0,56900,1580.0,1562.0
517,2016/10/06,1613.0,1609.072,1567.0,234700,1628.0,1567.0
518,2016/10/07,1597.0,1591.744,1598.0,85500,1604.0,1580.0
519,2016/10/11,1620.0,1627.062,1611.0,142300,1642.0,1610.0
520,2016/10/12,1565.0,1578.803,1600.0,132100,1620.0,1546.0
521,2016/10/13,1585.0,1585.992,1566.0,91600,1605.0,1565.0
522,2016/10/14,1612.0,1599.916,1587.0,86000,1613.0,1579.0
523,2016/10/17,1612.0,1603.331,1614.0,82500,1619.0,1578.0
524,2016/10/18,1627.0,1613.051,1611.0,155100,1636.0,1578.0
525,2016/10/19,1654.0,1642.447,1628.0,180800,1660.0,1614.0
526,2016/10/20,1642.0,1642.508,1630.0,77200,1661.0,1629.0
527,2016/10/21,1616.0,1623.944,1631.0,84000,1645.0,1614.0
528,2016/10/24,1586.0,1590.355,1620.0,152500,1621.0,1577.0
529,2016/10/25,1580.0,1580.926,1586.0,95000,1598.0,1570.0
530,2016/10/26,1572.0,1572.733,1580.0,71200,1595.0,1562.0
531,2016/10/27,1594.0,1594.083,1579.0,112700,1614.0,1573.0
532,2016/10/28,1605.0,1585.234,1587.0,119500,1623.0,1561.0
533,2016/10/31,1541.0,1561.415,1600.0,194500,1626.0,1511.0
534,2016/11/01,1631.0,1608.39,1539.0,437500,1640.0,1539.0
535,2016/11/02,1613.0,1617.418,1605.0,261300,1657.0,1587.0
536,2016/11/04,1582.0,1578.03,1593.0,134500,1613.0,1557.0
537,2016/11/07,1565.0,1569.065,1590.0,82700,1597.0,1552.0
538,2016/11/08,1525.0,1541.105,1560.0,95700,1574.0,1525.0
539,2016/11/09,1438.0,1443.987,1557.0,288600,1558.0,1350.0
540,2016/11/10,1476.0,1485.823,1502.0,156100,1515.0,1470.0
541,2016/11/11,1472.0,1461.268,1476.0,191500,1491.0,1432.0
542,2016/11/14,1431.0,1434.923,1442.0,273400,1470.0,1400.0
543,2016/11/15,1567.0,1575.46,1437.0,1524100,1687.0,1433.0
544,2016/11/16,1593.0,1565.28,1527.0,509500,1600.0,1518.0
545,2016/11/17,1705.0,1671.403,1650.0,986900,1717.0,1619.0
546,2016/11/18,1738.0,1740.468,1730.0,670400,1778.0,1706.0
547,2016/11/21,1721.0,1726.68,1750.0,407600,1768.0,1671.0
548,2016/11/22,1700.0,1700.426,1700.0,402100,1736.0,1655.0
549,2016/11/24,1699.0,1720.396,1700.0,313200,1754.0,1684.0
550,2016/11/25,1678.0,1693.543,1713.0,269400,1725.0,1655.0
551,2016/11/28,1699.0,1687.167,1665.0,184000,1705.0,1657.0
552,2016/11/29,1765.0,1735.831,1688.0,290600,1768.0,1686.0
553,2016/11/30,1783.0,1787.878,1789.0,428600,1813.0,1753.0
554,2016/12/01,1710.0,1735.111,1790.0,351300,1790.0,1710.0
555,2016/12/02,1687.0,1692.65,1710.0,186700,1729.0,1666.0
556,2016/12/05,1695.0,1702.484,1687.0,195200,1725.0,1673.0
557,2016/12/06,1684.0,1680.735,1701.0,167500,1713.0,1656.0
558,2016/12/07,1710.0,1720.708,1705.0,196400,1744.0,1696.0
559,2016/12/08,1681.0,1687.314,1711.0,102400,1711.0,1676.0
560,2016/12/09,1681.0,1677.269,1686.0,97700,1693.0,1669.0
561,2016/12/12,1681.0,1676.856,1678.0,133700,1693.0,1662.0
562,2016/12/13,1735.0,1711.847,1672.0,144500,1736.0,1670.0
563,2016/12/14,1738.0,1752.733,1745.0,213500,1771.0,1735.0
564,2016/12/15,1731.0,1732.922,1740.0,102500,1750.0,1718.0
565,2016/12/16,1701.0,1712.342,1746.0,139700,1753.0,1692.0
566,2016/12/19,1705.0,1703.461,1700.0,137900,1722.0,1676.0
567,2016/12/20,1739.0,1723.478,1710.0,166500,1742.0,1700.0
568,2016/12/21,1699.0,1699.744,1727.0,182900,1739.0,1683.0
569,2016/12/22,1659.0,1668.455,1702.0,169300,1705.0,1654.0
570,2016/12/26,1674.0,1676.153,1641.0,111200,1695.0,1641.0
571,2016/12/27,1704.0,1697.598,1678.0,167700,1712.0,1672.0
572,2016/12/28,1733.0,1730.338,1724.0,167200,1748.0,1704.0
573,2016/12/29,1720.0,1711.49,1730.0,77600,1730.0,1691.0
574,2016/12/30,1745.0,1733.912,1720.0,131300,1747.0,1703.0
575,2017/01/04,1746.0,1737.011,1737.0,132500,1749.0,1719.0
576,2017/01/05,1795.0,1783.568,1750.0,236700,1797.0,1750.0
577,2017/01/06,1791.0,1806.962,1798.0,273900,1839.0,1783.0
578,2017/01/10,1833.0,1808.05,1799.0,423800,1835.0,1766.0
579,2017/01/11,1800.0,1832.56,1840.0,248100,1871.0,1795.0
580,2017/01/12,1749.0,1765.586,1794.0,193900,1809.0,1740.0
581,2017/01/13,1803.0,1798.079,1754.0,199600,1815.0,1752.0
582,2017/01/16,1782.0,1787.488,1800.0,112400,1813.0,1760.0
583,2017/01/17,1778.0,1771.495,1785.0,102500,1790.0,1744.0
584,2017/01/18,1795.0,1787.48,1759.0,163900,1803.0,1759.0
585,2017/01/19,1762.0,1771.829,1792.0,164000,1808.0,1747.0
586,2017/01/20,1749.0,1741.0,1758.0,127100,1764.0,1729.0
587,2017/01/23,1753.0,1748.098,1750.0,79800,1761.0,1735.0
588,2017/01/24,1760.0,1763.957,1750.0,103100,1780.0,1746.0
589,2017/01/25,1805.0,1800.675,1773.0,315100,1827.0,1766.0
590,2017/01/26,1788.0,1800.449,1806.0,139000,1820.0,1783.0
591,2017/01/27,1776.0,1775.929,1795.0,132900,1798.0,1765.0
592,2017/01/30,1779.0,1788.447,1774.0,152500,1813.0,1772.0
593,2017/01/31,1776.0,1778.606,1775.0,152700,1796.0,1765.0
594,2017/02/01,1897.0,1875.433,1818.0,822900,1905.0,1810.0
595,2017/02/02,2018.0,1988.012,1920.0,967900,2033.0,1920.0
596,2017/02/03,2043.0,2024.364,2000.0,529200,2054.0,1985.0
597,2017/02/06,2111.0,2064.734,2043.0,504400,2117.0,1997.0
598,2017/02/07,2054.0,2057.935,2075.0,408400,2090.0,2030.0
599,2017/02/08,2123.0,2074.793,2039.0,337400,2128.0,2020.0
600,2017/02/09,2200.0,2184.605,2100.0,598600,2226.0,2100.0
601,2017/02/10,2276.0,2255.99,2200.0,538000,2293.0,2189.0
602,2017/02/13,2345.0,2334.496,2285.0,568900,2378.0,2280.0
603,2017/02/14,2360.0,2352.283,2342.0,495700,2395.0,2300.0
604,2017/02/15,2350.0,2356.709,2335.0,336100,2394.0,2316.0
605,2017/02/16,2410.0,2381.454,2359.0,399800,2418.0,2334.0
606,2017/02/17,2189.0,2260.806,2382.0,1025300,2400.0,2169.0
607,2017/02/20,2214.0,2175.638,2160.0,687400,2242.0,2090.0
608,2017/02/21,2162.0,2176.465,2194.0,300300,2233.0,2140.0
609,2017/02/22,2225.0,2201.447,2174.0,284800,2225.0,2163.0
610,2017/02/23,2182.0,2196.946,2230.0,343600,2250.0,2151.0
611,2017/02/24,2181.0,2173.04,2184.0,169700,2187.0,2160.0
612,2017/02/27,2194.0,2197.085,2191.0,164400,2214.0,2170.0
613,2017/02/28,2184.0,2209.744,2200.0,273800,2238.0,2184.0
614,2017/03/01,2187.0,2165.637,2201.0,259100,2204.0,2130.0
615,2017/03/02,2214.0,2221.662,2235.0,237900,2238.0,2188.0
616,2017/03/03,2394.0,2358.087,2250.0,1170600,2399.0,2231.0
617,2017/03/06,2537.0,2493.04,2420.0,1324900,2550.0,2400.0
618,2017/03/07,2527.0,2538.32,2537.0,700200,2589.0,2491.0
619,2017/03/08,2554.0,2543.978,2550.0,539600,2595.0,2492.0
620,2017/03/09,2574.0,2546.362,2554.0,308100,2580.0,2506.0
621,2017/03/10,2486.0,2510.346,2594.0,419300,2594.0,2453.0
622,2017/03/13,2325.0,2398.257,2499.0,651400,2515.0,2324.0
623,2017/03/14,2372.0,2316.864,2300.0,579400,2390.0,2239.0
624,2017/03/15,2225.0,2258.013,2345.0,573600,2372.0,2190.0
625,2017/03/16,2289.0,2270.619,2211.0,373300,2316.0,2207.0
626,2017/03/17,2227.0,2238.548,2289.0,346300,2304.0,2199.0
627,2017/03/21,2252.0,2242.741,2227.0,259100,2267.0,2205.0
628,2017/03/22,2201.0,2206.807,2191.0,195200,2240.0,2191.0
629,2017/03/23,2229.0,2216.277,2219.0,204000,2244.0,2193.0
630,2017/03/24,2253.0,2258.493,2232.0,151200,2277.0,2227.0
631,2017/03/27,2139.0,2160.154,2201.0,396500,2216.0,2115.0
632,2017/03/28,2160.0,2172.547,2148.0,181300,2194.0,2148.0
633,2017/03/29,2262.0,2243.228,2187.0,257100,2284.0,2175.0
634,2017/03/30,2191.0,2234.533,2292.0,288100,2298.0,2177.0
635,2017/03/31,2190.0,2209.427,2229.0,145600,2230.0,2188.0
636,2017/04/03,2181.0,2185.507,2208.0,135800,2219.0,2159.0
637,2017/04/04,2076.0,2095.131,2181.0,449800,2200.0,2013.0
638,2017/04/05,2057.0,2054.243,2071.0,230100,2109.0,2013.0
639,2017/04/06,1969.0,1974.783,2010.0,397200,2025.0,1936.0
640,2017/04/07,2033.0,2012.106,2003.0,350300,2050.0,1941.0
641,2017/04/10,2017.0,2032.905,2055.0,162000,2067.0,2014.0
642,2017/04/11,1965.0,1978.388,2000.0,212400,2022.0,1956.0
643,2017/04/12,1880.0,1891.681,1900.0,342400,1929.0,1866.0
644,2017/04/13,1947.0,1916.198,1880.0,270800,1966.0,1850.0
645,2017/04/14,1915.0,1930.903,1910.0,145600,1965.0,1894.0
646,2017/04/17,1968.0,1961.153,1911.0,159900,1993.0,1911.0
647,2017/04/18,1954.0,1966.298,2000.0,156500,2010.0,1937.0
648,2017/04/19,2016.0,2005.268,1974.0,161500,2028.0,1968.0
649,2017/04/20,1980.0,1990.693,2011.0,177000,2030.0,1964.0
650,2017/04/21,1976.0,1977.911,1999.0,106900,2005.0,1961.0
651,2017/04/24,1947.0,1960.683,1980.0,102200,1995.0,1947.0
652,2017/04/25,1973.0,1963.153,1947.0,81100,1982.0,1941.0
653,2017/04/26,2078.0,2040.251,1986.0,263400,2078.0,1985.0
654,2017/04/27,2120.0,2078.203,2086.0,299600,2120.0,2034.0
655,2017/04/28,2142.0,2090.848,2089.0,663500,2144.0,2030.0
656,2017/05/01,2115.0,2121.814,2142.0,188800,2159.0,2106.0
657,2017/05/02,2150.0,2123.164,2120.0,208800,2150.0,2090.0
658,2017/05/08,2140.0,2149.534,2180.0,265800,2180.0,2125.0
659,2017/05/09,2097.0,2091.31,2143.0,341400,2149.0,2060.0
660,2017/05/10,2411.0,2336.628,2160.0,1246600,2415.0,2160.0
661,2017/05/11,2435.0,2395.544,2378.0,611700,2447.0,2317.0
662,2017/05/12,2425.0,2393.669,2398.0,347900,2437.0,2352.0
663,2017/05/15,2422.0,2400.048,2388.0,343500,2433.0,2358.0
664,2017/05/16,2438.0,2417.833,2429.0,281900,2447.0,2380.0
665,2017/05/17,2487.0,2513.791,2449.0,559800,2575.0,2449.0
666,2017/05/18,2451.0,2447.167,2414.0,269200,2487.0,2407.0
667,2017/05/19,2451.0,2482.559,2451.0,347000,2547.0,2430.0
668,2017/05/22,2480.0,2476.159,2495.0,146200,2498.0,2451.0
669,2017/05/23,2500.0,2492.739,2510.0,204100,2540.0,2452.0
670,2017/05/24,2540.0,2533.348,2502.0,250300,2567.0,2482.0
671,2017/05/25,2507.0,2507.042,2559.0,242800,2560.0,2471.0
672,2017/05/26,2473.0,2470.513,2517.0,212100,2517.0,2446.0
673,2017/05/29,2420.0,2444.052,2451.0,216500,2488.0,2405.0
674,2017/05/30,2401.0,2386.605,2392.0,230000,2425.0,2341.0
675,2017/05/31,2437.0,2524.158,2401.0,1460900,2696.0,2388.0
676,2017/06/01,2382.0,2388.134,2436.0,351800,2450.0,2363.0
677,2017/06/02,2315.0,2344.542,2380.0,333100,2393.0,2314.0
678,2017/06/05,2350.0,2354.924,2316.0,222400,2386.0,2316.0
679,2017/06/06,2227.0,2268.621,2340.0,488000,2353.0,2227.0
680,2017/06/07,2296.0,2269.315,2249.0,248000,2296.0,2232.0
681,2017/06/08,2324.0,2340.402,2309.0,319600,2369.0,2305.0
682,2017/06/09,2319.0,2327.062,2340.0,223100,2355.0,2298.0
683,2017/06/12,2326.0,2323.946,2301.0,337400,2383.0,2240.0
684,2017/06/13,2325.0,2308.31,2326.0,123400,2329.0,2286.0
685,2017/06/14,2343.0,2360.231,2353.0,414400,2413.0,2315.0
686,2017/06/15,2306.0,2311.857,2343.0,196500,2361.0,2280.0
687,2017/06/16,2351.0,2358.268,2345.0,213200,2391.0,2306.0
688,2017/06/19,2633.0,2561.007,2400.0,1913800,2642.0,2380.0
689,2017/06/20,2720.0,2630.467,2590.0,1334600,2740.0,2522.0
690,2017/06/21,2690.0,2750.242,2702.0,1317600,2827.0,2661.0
691,2017/06/22,2832.0,2791.552,2732.0,793600,2835.0,2732.0
692,2017/06/23,2646.0,2696.137,2750.0,1389100,2788.0,2600.0
693,2017/06/26,2687.0,2669.303,2630.0,392400,2705.0,2630.0
694,2017/06/27,2711.0,2707.394,2700.0,270700,2749.0,2643.0
695,2017/06/28,2625.0,2657.068,2699.0,340200,2715.0,2618.0
696,2017/06/29,2656.0,2673.237,2675.0,222500,2697.0,2632.0
697,2017/06/30,2656.0,2622.75,2621.0,236700,2663.0,2568.0
698,2017/07/03,2605.0,2629.813,2670.0,170300,2700.0,2604.0
699,2017/07/04,2530.0,2553.41,2610.0,338200,2624.0,2503.0
700,2017/07/05,2556.0,2520.521,2514.0,235700,2556.0,2482.0
701,2017/07/06,2546.0,2547.111,2586.0,179700,2595.0,2509.0
702,2017/07/07,2595.0,2574.449,2536.0,175900,2602.0,2516.0
703,2017/07/10,2663.0,2661.528,2631.0,298600,2699.0,2600.0
704,2017/07/11,2627.0,2645.0,2690.0,215000,2690.0,2617.0
705,2017/07/12,2635.0,2627.646,2637.0,155500,2674.0,2602.0
706,2017/07/13,3065.0,3016.896,2660.0,5196900,3135.0,2621.0
707,2017/07/14,3100.0,3056.738,2995.0,1961800,3145.0,2960.0
708,2017/07/18,3000.0,3088.705,3085.0,1421600,3265.0,2990.0
709,2017/07/19,3050.0,3034.139,2985.0,729800,3095.0,2968.0
710,2017/07/20,3005.0,3046.257,3050.0,541900,3135.0,2999.0
711,2017/07/21,3060.0,3031.571,3045.0,290300,3060.0,3005.0
712,2017/07/24,3055.0,3232.052,3340.0,4732100,3455.0,3000.0
713,2017/07/25,3170.0,3115.971,3050.0,1078500,3195.0,2996.0
714,2017/07/26,3010.0,3050.983,3140.0,1075600,3170.0,2999.0
715,2017/07/27,2856.0,2898.97,2972.0,1163400,2980.0,2850.0
716,2017/07/28,2767.0,2806.879,2872.0,969300,2872.0,2767.0
717,2017/07/31,2759.0,2736.296,2767.0,779200,2800.0,2704.0
718,2017/08/01,2665.0,2717.186,2802.0,1341500,2878.0,2605.0
719,2017/08/02,2747.0,2699.966,2670.0,632100,2754.0,2643.0
720,2017/08/03,2599.0,2623.783,2730.0,1045300,2730.0,2565.0
721,2017/08/04,2650.0,2618.445,2570.0,658200,2672.0,2541.0
722,2017/08/07,2656.0,2646.964,2650.0,512900,2697.0,2612.0
723,2017/08/08,2735.0,2708.237,2668.0,514900,2736.0,2661.0
724,2017/08/09,2642.0,2661.032,2722.0,522000,2723.0,2634.0
725,2017/08/10,2605.0,2612.13,2650.0,465500,2694.0,2570.0
726,2017/08/14,2592.0,2587.912,2517.0,414600,2626.0,2513.0
727,2017/08/15,2725.0,2721.71,2661.0,1287600,2816.0,2629.0
728,2017/08/16,2747.0,2743.232,2710.0,466800,2771.0,2694.0
729,2017/08/17,2745.0,2733.165,2750.0,459700,2775.0,2685.0
730,2017/08/18,2684.0,2699.961,2695.0,398000,2734.0,2672.0
731,2017/08/21,2627.0,2646.949,2700.0,450400,2710.0,2608.0
732,2017/08/22,2690.0,2688.509,2655.0,338900,2726.0,2645.0
733,2017/08/23,2680.0,2700.21,2734.0,331600,2740.0,2665.0
734,2017/08/24,2674.0,2675.803,2685.0,184000,2693.0,2662.0
735,2017/08/25,2655.0,2671.071,2698.0,216100,2707.0,2641.0
736,2017/08/28,2702.0,2678.608,2655.0,184500,2702.0,2650.0
737,2017/08/29,2746.0,2733.038,2679.0,341400,2770.0,2671.0
738,2017/08/30,2697.0,2702.524,2760.0,422700,2768.0,2667.0
739,2017/08/31,2684.0,2691.297,2705.0,172500,2715.0,2667.0
740,2017/09/01,2850.0,2803.713,2705.0,1065100,2865.0,2678.0
741,2017/09/04,2780.0,2808.707,2826.0,930100,2918.0,2740.0
742,2017/09/05,2579.0,2657.016,2793.0,1160700,2821.0,2575.0
743,2017/09/06,2527.0,2510.375,2481.0,1018100,2558.0,2455.0
744,2017/09/07,2490.0,2513.107,2570.0,618200,2575.0,2475.0
745,2017/09/08,2476.0,2474.247,2476.0,497600,2525.0,2437.0
746,2017/09/11,2521.0,2503.173,2517.0,280300,2529.0,2475.0
747,2017/09/12,2541.0,2543.614,2545.0,273000,2583.0,2515.0
748,2017/09/13,2601.0,2610.622,2579.0,585200,2670.0,2541.0
749,2017/09/14,2517.0,2544.667,2601.0,398600,2601.0,2510.0
750,2017/09/15,2541.0,2528.714,2502.0,235300,2549.0,2502.0
751,2017/09/19,2620.0,2610.105,2601.0,352100,2640.0,2580.0
752,2017/09/20,2671.0,2648.678,2648.0,347300,2684.0,2611.0
753,2017/09/21,2736.0,2718.406,2689.0,527100,2749.0,2678.0
754,2017/09/22,2620.0,2616.458,2720.0,763300,2725.0,2571.0
755,2017/09/25,2682.0,2673.23,2644.0,303600,2702.0,2631.0
756,2017/09/26,2705.0,2671.43,2661.0,305800,2709.0,2625.0
757,2017/09/27,2770.0,2753.381,2702.0,328300,2776.0,2694.0
758,2017/09/28,2865.0,2831.487,2804.0,629600,2870.0,2784.0
759,2017/09/29,2961.0,2906.637,2866.0,873300,2962.0,2825.0
760,2017/10/02,3025.0,3021.955,3005.0,821700,3080.0,2973.0
761,2017/10/03,3035.0,3033.294,3000.0,564000,3090.0,2981.0
762,2017/10/04,3050.0,3003.296,3020.0,645800,3060.0,2944.0
763,2017/10/05,3035.0,3033.144,3025.0,615900,3085.0,2974.0
764,2017/10/06,3105.0,3055.237,3030.0,537400,3120.0,2985.0
765,2017/10/10,3230.0,3192.084,3140.0,840100,3250.0,3135.0
766,2017/10/11,3160.0,3135.236,3245.0,1000700,3245.0,3040.0
767,2017/10/12,3195.0,3156.142,3115.0,626500,3220.0,3110.0
768,2017/10/13,3200.0,3142.535,3155.0,728500,3210.0,3100.0
769,2017/10/16,3155.0,3211.302,3230.0,691600,3310.0,3150.0
770,2017/10/17,3235.0,3210.407,3135.0,586100,3260.0,3135.0
771,2017/10/18,3155.0,3184.187,3215.0,351100,3250.0,3140.0
772,2017/10/19,3165.0,3155.515,3135.0,351500,3185.0,3115.0
773,2017/10/20,3190.0,3168.49,3150.0,261600,3190.0,3135.0
774,2017/10/23,3325.0,3319.884,3260.0,1053100,3395.0,3240.0
775,2017/10/24,3400.0,3378.012,3320.0,714400,3445.0,3280.0
776,2017/10/25,3435.0,3446.451,3430.0,637200,3490.0,3390.0
777,2017/10/26,3585.0,3515.076,3415.0,719900,3590.0,3395.0
778,2017/10/27,3665.0,3621.465,3600.0,700400,3665.0,3555.0
779,2017/10/30,3535.0,3607.533,3685.0,801200,3710.0,3530.0
780,2017/10/31,3605.0,3576.414,3490.0,639100,3645.0,3465.0
781,2017/11/01,3970.0,3880.651,3745.0,2053800,3975.0,3735.0
782,2017/11/02,4020.0,3949.341,3930.0,1327800,4065.0,3830.0
783,2017/11/06,3320.0,3339.573,3320.0,1829000,3465.0,3320.0
784,2017/11/07,3130.0,3179.921,3380.0,2722900,3390.0,3055.0
785,2017/11/08,3105.0,3117.599,3145.0,852500,3175.0,3060.0
786,2017/11/09,3095.0,3086.501,3140.0,927000,3150.0,3000.0
787,2017/11/10,3100.0,3075.201,3055.0,480600,3115.0,3045.0
788,2017/11/13,3185.0,3209.136,3125.0,954300,3280.0,3110.0
789,2017/11/14,3185.0,3177.895,3160.0,642500,3235.0,3120.0
790,2017/11/15,3235.0,3265.909,3235.0,1014600,3350.0,3180.0
791,2017/11/16,3385.0,3334.219,3250.0,682900,3385.0,3230.0
792,2017/11/17,3455.0,3452.392,3490.0,1021000,3545.0,3385.0
793,2017/11/20,3685.0,3614.1,3500.0,1193800,3710.0,3460.0
794,2017/11/21,3585.0,3594.469,3700.0,1119300,3705.0,3505.0
795,2017/11/22,3510.0,3507.622,3570.0,928900,3630.0,3370.0
796,2017/11/24,3605.0,3530.092,3455.0,530100,3610.0,3450.0
797,2017/11/27,3695.0,3649.976,3615.0,631700,3725.0,3580.0
798,2017/11/28,3710.0,3718.832,3770.0,767400,3820.0,3640.0
799,2017/11/29,3785.0,3761.948,3720.0,707300,3810.0,3690.0
800,2017/11/30,3720.0,3680.431,3775.0,1006200,3785.0,3600.0
801,2017/12/01,3725.0,3693.285,3690.0,456600,3760.0,3625.0
802,2017/12/04,3635.0,3687.187,3720.0,601800,3760.0,3635.0
803,2017/12/05,3510.0,3504.161,3580.0,919500,3605.0,3425.0
804,2017/12/06,3425.0,3468.222,3465.0,565700,3540.0,3425.0
805,2017/12/07,3495.0,3470.79,3445.0,400800,3515.0,3430.0
806,2017/12/08,3430.0,3437.086,3490.0,609100,3500.0,3395.0
807,2017/12/11,3400.0,3411.276,3445.0,427800,3460.0,3375.0
808,2017/12/12,3420.0,3427.79,3385.0,361800,3485.0,3380.0
809,2017/12/13,3415.0,3413.451,3465.0,323200,3465.0,3380.0
810,2017/12/14,3505.0,3484.709,3405.0,444600,3550.0,3395.0
811,2017/12/15,3425.0,3424.913,3485.0,474400,3495.0,3385.0
812,2017/12/18,3530.0,3487.647,3450.0,366500,3530.0,3440.0
813,2017/12/19,3580.0,3539.501,3580.0,422500,3585.0,3490.0
814,2017/12/20,3695.0,3692.936,3585.0,838800,3785.0,3570.0
815,2017/12/21,3610.0,3587.8,3665.0,585800,3680.0,3535.0
816,2017/12/22,3570.0,3538.784,3600.0,373700,3600.0,3500.0
817,2017/12/25,3510.0,3514.754,3565.0,325500,3565.0,3480.0
818,2017/12/26,3600.0,3601.359,3515.0,601100,3665.0,3505.0
819,2017/12/27,3730.0,3714.206,3620.0,685500,3755.0,3620.0
820,2017/12/28,3690.0,3693.135,3720.0,399500,3745.0,3665.0
821,2017/12/29,3675.0,3678.584,3690.0,352700,3720.0,3635.0
822,2018/01/04,3895.0,3867.645,3735.0,1217300,3965.0,3695.0
823,2018/01/05,3935.0,3911.709,3865.0,465200,3950.0,3865.0
824,2018/01/09,3995.0,3994.906,4000.0,848900,4070.0,3935.0
825,2018/01/10,3970.0,3982.649,3980.0,648300,4040.0,3940.0
826,2018/01/11,3960.0,3956.119,3915.0,686700,4040.0,3885.0
827,2018/01/12,4190.0,4124.212,3965.0,1383200,4225.0,3965.0
828,2018/01/15,3490.0,3490.0,3490.0,165800,3490.0,3490.0
829,2018/01/16,3695.0,3534.462,3350.0,3784700,3785.0,3325.0
830,2018/01/17,3515.0,3540.624,3625.0,1513500,3645.0,3470.0
831,2018/01/18,3555.0,3438.936,3535.0,1476400,3575.0,3365.0
832,2018/01/19,3575.0,3701.726,3710.0,3736400,3900.0,3570.0
833,2018/01/22,3430.0,3442.926,3560.0,1292000,3560.0,3400.0
834,2018/01/23,3420.0,3419.074,3465.0,661100,3465.0,3385.0
835,2018/01/24,3415.0,3422.212,3420.0,770400,3480.0,3380.0
836,2018/01/25,3465.0,3450.64,3415.0,529100,3495.0,3385.0
837,2018/01/26,3440.0,3446.79,3480.0,379700,3490.0,3420.0
838,2018/01/29,3455.0,3480.471,3475.0,439500,3515.0,3445.0
839,2018/01/30,3505.0,3458.825,3455.0,659800,3515.0,3415.0
840,2018/01/31,3450.0,3501.206,3495.0,646100,3565.0,3450.0
841,2018/02/01,3395.0,3383.601,3405.0,803500,3430.0,3330.0
842,2018/02/02,3375.0,3383.642,3395.0,680000,3460.0,3345.0
843,2018/02/05,3370.0,3336.167,3260.0,720000,3395.0,3250.0
844,2018/02/06,3060.0,3069.042,3200.0,1556600,3220.0,2910.0
845,2018/02/07,3065.0,3156.561,3225.0,738000,3225.0,3065.0
846,2018/02/08,3185.0,3128.438,3060.0,646800,3200.0,3060.0
847,2018/02/09,3170.0,3086.357,3010.0,685900,3175.0,3005.0
848,2018/02/13,3100.0,3149.622,3225.0,491700,3245.0,3080.0
849,2018/02/14,3000.0,3017.057,3100.0,682000,3140.0,2920.0
850,2018/02/15,3150.0,3111.453,3035.0,532100,3175.0,3010.0
851,2018/02/16,3230.0,3215.253,3175.0,413200,3250.0,3140.0
852,2018/02/19,3405.0,3340.801,3270.0,445100,3415.0,3240.0
853,2018/02/20,3440.0,3417.611,3400.0,382100,3465.0,3360.0
854,2018/02/21,3425.0,3419.965,3435.0,339700,3465.0,3385.0
855,2018/02/22,3365.0,3396.323,3440.0,252100,3440.0,3365.0
856,2018/02/23,3390.0,3396.562,3370.0,299700,3430.0,3365.0
857,2018/02/26,3460.0,3438.668,3440.0,361900,3465.0,3405.0
858,2018/02/27,3380.0,3382.124,3450.0,502800,3460.0,3335.0
859,2018/02/28,3420.0,3392.365,3360.0,384300,3440.0,3345.0
860,2018/03/01,3420.0,3412.498,3400.0,311200,3445.0,3375.0
861,2018/03/02,3440.0,3395.79,3370.0,316500,3440.0,3340.0
862,2018/03/05,3290.0,3351.243,3425.0,499600,3440.0,3275.0
863,2018/03/06,3480.0,3442.605,3375.0,535800,3510.0,3330.0
864,2018/03/07,3480.0,3495.506,3460.0,408900,3550.0,3445.0
865,2018/03/08,3610.0,3558.48,3520.0,549300,3625.0,3480.0
866,2018/03/09,3610.0,3605.23,3650.0,358000,3660.0,3570.0
867,2018/03/12,3735.0,3663.039,3635.0,570500,3735.0,3600.0
868,2018/03/13,3795.0,3770.305,3705.0,472400,3815.0,3705.0
869,2018/03/14,3870.0,3854.824,3800.0,421400,3900.0,3800.0
870,2018/03/15,3865.0,3856.164,3840.0,351100,3885.0,3810.0
871,2018/03/16,3860.0,3883.178,3880.0,486600,3930.0,3850.0
872,2018/03/19,3885.0,3881.398,3925.0,535600,3930.0,3820.0
873,2018/03/20,3875.0,3844.344,3840.0,384000,3895.0,3790.0
874,2018/03/22,3890.0,3856.888,3860.0,344500,3895.0,3825.0
875,2018/03/23,3750.0,3777.376,3770.0,633300,3830.0,3735.0
876,2018/03/26,3850.0,3767.085,3720.0,466500,3855.0,3660.0
877,2018/03/27,3970.0,3954.427,3905.0,531600,4010.0,3905.0
878,2018/03/28,4120.0,4047.045,3930.0,737600,4140.0,3920.0
879,2018/03/29,4210.0,4140.712,4145.0,734800,4240.0,4025.0
880,2018/03/30,4305.0,4266.636,4210.0,727300,4310.0,4180.0
881,2018/04/02,4240.0,4294.422,4310.0,560000,4360.0,4240.0
882,2018/04/03,4325.0,4302.685,4170.0,539400,4375.0,4170.0
883,2018/04/04,4475.0,4393.48,4325.0,655400,4495.0,4265.0
884,2018/04/05,4690.0,4614.658,4500.0,953200,4725.0,4475.0
885,2018/04/06,4765.0,4732.243,4695.0,985600,4795.0,4605.0
886,2018/04/09,4755.0,4745.444,4800.0,856000,4820.0,4680.0
887,2018/04/10,4890.0,4850.173,4755.0,906600,4915.0,4730.0
888,2018/04/11,4705.0,4792.246,4910.0,954800,4955.0,4680.0
889,2018/04/12,4985.0,4928.233,4680.0,1269400,5080.0,4670.0
890,2018/04/13,5210.0,5137.42,4990.0,1123300,5230.0,4990.0
891,2018/04/16,4655.0,4731.72,5200.0,2172200,5210.0,4510.0
892,2018/04/17,4840.0,4712.082,4725.0,1080700,4855.0,4555.0
893,2018/04/18,4570.0,4487.552,4560.0,4459300,4750.0,4145.0
894,2018/04/19,4300.0,4406.622,4500.0,1590300,4640.0,4280.0
895,2018/04/20,4360.0,4344.468,4185.0,1068600,4470.0,4180.0
896,2018/04/23,4330.0,4308.194,4360.0,724500,4465.0,4235.0
897,2018/04/24,4305.0,4325.002,4355.0,336000,4385.0,4285.0
898,2018/04/25,4315.0,4321.084,4265.0,309000,4360.0,4265.0
899,2018/04/26,4535.0,4498.006,4355.0,963100,4590.0,4325.0
900,2018/04/27,4635.0,4604.727,4595.0,495400,4650.0,4545.0
901,2018/05/01,4620.0,4576.404,4640.0,363200,4645.0,4490.0
902,2018/05/02,4545.0,4600.5,4600.0,1146000,4770.0,4445.0
903,2018/05/07,4480.0,4477.811,4500.0,293900,4540.0,4425.0
904,2018/05/08,4515.0,4585.212,4470.0,815700,4695.0,4465.0
905,2018/05/09,4325.0,4297.65,4515.0,1800400,4595.0,4115.0
906,2018/05/10,4255.0,4263.441,4305.0,556600,4335.0,4220.0
907,2018/05/11,4235.0,4144.937,4220.0,845800,4255.0,4050.0
908,2018/05/14,4315.0,4314.007,4300.0,613200,4385.0,4240.0
909,2018/05/15,3670.0,3816.122,4035.0,3017300,4065.0,3630.0
910,2018/05/16,3530.0,3537.206,3625.0,1693000,3690.0,3415.0
911,2018/05/17,3545.0,3538.989,3530.0,606300,3615.0,3480.0
912,2018/05/18,3510.0,3509.266,3550.0,382300,3555.0,3465.0
913,2018/05/21,3565.0,3551.699,3520.0,856600,3620.0,3405.0
914,2018/05/22,3475.0,3510.699,3565.0,673600,3620.0,3465.0
915,2018/05/23,3530.0,3477.302,3500.0,762600,3560.0,3385.0
916,2018/05/24,3670.0,3592.577,3500.0,681100,3670.0,3475.0
917,2018/05/25,3750.0,3720.504,3655.0,744600,3785.0,3615.0
918,2018/05/28,3785.0,3774.59,3800.0,578600,3840.0,3720.0
919,2018/05/29,3755.0,3694.988,3775.0,620400,3785.0,3590.0
920,2018/05/30,3740.0,3714.377,3625.0,375400,3770.0,3625.0
921,2018/05/31,3640.0,3628.659,3740.0,746600,3750.0,3560.0
922,2018/06/01,3840.0,3815.535,3635.0,1363900,3910.0,3625.0
923,2018/06/04,4110.0,4025.497,4020.0,1600400,4130.0,3890.0
924,2018/06/05,4230.0,4213.282,4060.0,1621700,4325.0,4045.0
925,2018/06/06,4215.0,4268.54,4330.0,1762400,4390.0,4125.0
926,2018/06/07,4105.0,4113.762,4225.0,1586300,4270.0,3985.0
927,2018/06/08,4180.0,4138.199,4065.0,558300,4210.0,4040.0
928,2018/06/11,4280.0,4280.112,4225.0,933400,4355.0,4180.0
929,2018/06/12,4015.0,4098.252,4235.0,1911400,4255.0,3960.0
930,2018/06/13,4065.0,4028.204,3945.0,896600,4110.0,3910.0
931,2018/06/14,3995.0,4033.322,4055.0,454200,4095.0,3990.0
932,2018/06/15,4100.0,4108.603,4000.0,1172800,4180.0,3995.0
933,2018/06/18,3855.0,3866.183,4055.0,1582500,4110.0,3700.0
934,2018/06/19,3480.0,3626.277,3735.0,3478100,3865.0,3460.0
935,2018/06/20,3205.0,3277.802,3460.0,1981000,3515.0,3150.0
936,2018/06/21,3110.0,3150.839,3140.0,1305600,3250.0,3065.0
937,2018/06/22,3015.0,3040.393,3075.0,920100,3140.0,2991.0
938,2018/06/25,2811.0,2865.136,2975.0,1400900,2996.0,2769.0
939,2018/06/26,2701.0,2734.839,2741.0,1920000,2807.0,2682.0
940,2018/06/27,2655.0,2654.995,2700.0,2167500,2733.0,2589.0
941,2018/06/28,2598.0,2634.514,2693.0,944300,2750.0,2588.0
942,2018/06/29,2671.0,2647.286,2611.0,1079300,2688.0,2600.0
943,2018/07/02,2558.0,2620.449,2721.0,1260300,2749.0,2532.0
944,2018/07/03,2481.0,2503.068,2576.0,1052500,2619.0,2434.0
945,2018/07/04,2463.0,2445.938,2453.0,686300,2488.0,2406.0
946,2018/07/05,2411.0,2412.101,2449.0,806200,2499.0,2361.0
947,2018/07/06,2467.0,2439.309,2411.0,706400,2482.0,2395.0
948,2018/07/09,2494.0,2453.74,2470.0,460500,2494.0,2401.0
949,2018/07/10,2471.0,2495.493,2517.0,572500,2548.0,2451.0
950,2018/07/11,2386.0,2402.541,2450.0,678900,2470.0,2364.0
951,2018/07/12,2425.0,2417.004,2392.0,372500,2443.0,2372.0
952,2018/07/13,2410.0,2418.609,2431.0,370700,2457.0,2391.0
953,2018/07/17,2352.0,2366.243,2424.0,377900,2429.0,2336.0
954,2018/07/18,2405.0,2394.646,2350.0,457200,2438.0,2326.0
955,2018/07/19,2425.0,2459.894,2402.0,913100,2522.0,2402.0
956,2018/07/20,2418.0,2423.656,2417.0,423500,2463.0,2401.0
957,2018/07/23,2407.0,2391.95,2418.0,284400,2427.0,2363.0
958,2018/07/24,2398.0,2409.858,2416.0,189700,2433.0,2391.0
959,2018/07/25,2409.0,2401.075,2416.0,193900,2420.0,2384.0
960,2018/07/26,2392.0,2436.969,2420.0,607200,2489.0,2387.0
961,2018/07/27,2420.0,2414.272,2410.0,341200,2435.0,2394.0
962,2018/07/30,2395.0,2417.333,2451.0,347600,2455.0,2393.0
963,2018/07/31,2326.0,2336.158,2375.0,522900,2390.0,2301.0
964,2018/08/01,2311.0,2314.155,2320.0,237600,2358.0,2286.0
965,2018/08/02,2393.0,2381.525,2338.0,472700,2421.0,2330.0
966,2018/08/03,2357.0,2364.637,2429.0,559800,2443.0,2331.0
967,2018/08/06,2701.0,2641.838,2442.0,5514600,2792.0,2430.0
968,2018/08/07,2730.0,2688.615,2701.0,4584000,2824.0,2570.0
969,2018/08/08,2666.0,2671.438,2699.0,1375400,2738.0,2625.0
970,2018/08/09,2652.0,2698.425,2670.0,1241500,2774.0,2647.0
971,2018/08/10,2543.0,2556.988,2565.0,928300,2615.0,2527.0
972,2018/08/13,2523.0,2495.454,2500.0,662300,2545.0,2451.0
973,2018/08/14,2630.0,2629.694,2547.0,850800,2673.0,2546.0
974,2018/08/15,2635.0,2659.087,2637.0,495500,2708.0,2596.0
975,2018/08/16,2539.0,2554.76,2599.0,529200,2601.0,2524.0
976,2018/08/17,2549.0,2572.45,2571.0,296200,2617.0,2538.0
977,2018/08/20,2523.0,2550.762,2582.0,339800,2605.0,2516.0
978,2018/08/21,2452.0,2456.163,2491.0,468800,2513.0,2418.0
979,2018/08/22,2539.0,2527.048,2460.0,487500,2566.0,2450.0
980,2018/08/23,2638.0,2624.068,2544.0,597800,2657.0,2542.0
981,2018/08/24,2640.0,2644.092,2645.0,316800,2684.0,2613.0
982,2018/08/27,2697.0,2669.568,2670.0,310200,2697.0,2641.0
983,2018/08/28,2739.0,2752.587,2729.0,643800,2793.0,2711.0
984,2018/08/29,2875.0,2835.755,2730.0,914900,2884.0,2725.0
985,2018/08/30,3120.0,3053.687,2925.0,1523300,3140.0,2925.0
986,2018/08/31,3065.0,3077.087,3120.0,696500,3125.0,3015.0
987,2018/09/03,3010.0,3003.882,3075.0,573700,3075.0,2960.0
988,2018/09/04,2980.0,2996.156,2979.0,539400,3070.0,2956.0
989,2018/09/05,2917.0,2957.186,3000.0,471000,3050.0,2890.0
990,2018/09/06,2886.0,2869.031,2890.0,419600,2925.0,2823.0
991,2018/09/07,2774.0,2803.149,2867.0,509400,2881.0,2756.0
992,2018/09/10,2896.0,2875.63,2776.0,476600,2917.0,2774.0
993,2018/09/11,2744.0,2798.1,2910.0,525400,2916.0,2739.0
994,2018/09/12,2748.0,2764.741,2760.0,366600,2815.0,2720.0
995,2018/09/13,2709.0,2743.582,2747.0,215700,2781.0,2709.0
996,2018/09/14,2812.0,2789.788,2756.0,287100,2817.0,2735.0
997,2018/09/18,2815.0,2797.937,2830.0,472800,2854.0,2753.0
998,2018/09/19,2889.0,2887.878,2850.0,356700,2913.0,2845.0
999,2018/09/20,2794.0,2811.227,2919.0,491300,2928.0,2766.0
1000,2018/09/21,2849.0,2824.477,2821.0,307400,2854.0,2792.0
1001,2018/09/25,2933.0,2889.004,2847.0,626600,2952.0,2775.0
1002,2018/09/26,2945.0,2959.876,2924.0,440800,3020.0,2891.0
1003,2018/09/27,2809.0,2859.306,2944.0,608000,2948.0,2805.0
1004,2018/09/28,2812.0,2812.757,2858.0,351300,2869.0,2772.0
1005,2018/10/01,2807.0,2807.727,2803.0,229900,2851.0,2779.0
1006,2018/10/02,2705.0,2740.598,2791.0,336500,2812.0,2701.0
1007,2018/10/03,2663.0,2682.666,2702.0,238600,2734.0,2642.0
1008,2018/10/04,2649.0,2649.993,2661.0,216900,2705.0,2607.0
1009,2018/10/05,2539.0,2574.531,2599.0,323700,2638.0,2532.0
1010,2018/10/09,2475.0,2465.514,2539.0,333300,2539.0,2410.0
1011,2018/10/10,2523.0,2495.89,2486.0,166100,2530.0,2446.0
1012,2018/10/11,2420.0,2415.532,2373.0,375500,2488.0,2366.0
1013,2018/10/12,2607.0,2550.188,2391.0,421400,2621.0,2391.0
1014,2018/10/15,2516.0,2559.257,2598.0,201100,2630.0,2507.0
1015,2018/10/16,2535.0,2531.974,2510.0,148800,2565.0,2510.0
1016,2018/10/17,2594.0,2591.608,2603.0,165900,2619.0,2570.0
1017,2018/10/18,2554.0,2565.131,2579.0,153300,2598.0,2541.0
1018,2018/10/19,2516.0,2501.481,2500.0,170600,2532.0,2463.0
1019,2018/10/22,2585.0,2539.744,2516.0,151300,2593.0,2477.0
1020,2018/10/23,2546.0,2564.227,2558.0,121800,2596.0,2532.0
1021,2018/10/24,2546.0,2547.221,2590.0,132800,2602.0,2503.0
1022,2018/10/25,2347.0,2391.223,2446.0,363300,2462.0,2346.0
1023,2018/10/26,2245.0,2292.886,2410.0,403800,2420.0,2233.0
1024,2018/10/29,2173.0,2220.478,2245.0,292500,2294.0,2163.0
1025,2018/10/30,2218.0,2163.283,2115.0,377500,2240.0,2085.0
1026,2018/10/31,2363.0,2317.023,2255.0,328700,2376.0,2251.0
1027,2018/11/01,2005.0,2094.455,2255.0,809000,2263.0,2002.0
1028,2018/11/02,2244.0,2153.432,1999.0,640000,2244.0,1999.0
1029,2018/11/05,2347.0,2311.089,2194.0,461100,2372.0,2159.0
1030,2018/11/06,2361.0,2351.234,2345.0,336500,2394.0,2292.0
1031,2018/11/07,2385.0,2388.599,2356.0,280800,2409.0,2341.0
1032,2018/11/08,2379.0,2430.13,2425.0,312100,2484.0,2378.0
1033,2018/11/09,2397.0,2405.168,2372.0,199300,2452.0,2372.0
1034,2018/11/12,2308.0,2327.749,2370.0,171800,2395.0,2295.0
1035,2018/11/13,2274.0,2273.009,2221.0,252000,2341.0,2213.0
1036,2018/11/14,2239.0,2253.3,2276.0,116500,2313.0,2223.0
1037,2018/11/15,2269.0,2247.895,2192.0,160200,2295.0,2191.0
1038,2018/11/16,2095.0,2160.212,2250.0,323700,2254.0,2092.0
1039,2018/11/19,2169.0,2130.202,2109.0,235200,2175.0,2064.0
1040,2018/11/20,2060.0,2066.314,2095.0,245300,2101.0,2036.0
1041,2018/11/21,2054.0,2060.681,2003.0,219700,2116.0,2003.0
1042,2018/11/22,2081.0,2073.047,2100.0,116000,2105.0,2039.0
1043,2018/11/26,2072.0,2064.054,2091.0,167000,2098.0,2023.0
1044,2018/11/27,2102.0,2099.767,2082.0,151700,2129.0,2067.0
1045,2018/11/28,2118.0,2109.658,2097.0,185500,2125.0,2078.0
1046,2018/11/29,2112.0,2137.435,2140.0,223800,2173.0,2104.0
1047,2018/11/30,2095.0,2098.243,2106.0,128600,2141.0,2072.0
1048,2018/12/03,2117.0,2118.433,2110.0,191000,2144.0,2089.0
1049,2018/12/04,2011.0,2059.719,2105.0,275200,2154.0,2010.0
1050,2018/12/05,1986.0,2000.857,1965.0,249800,2039.0,1961.0
1051,2018/12/06,1877.0,1905.71,1976.0,354200,1989.0,1866.0
1052,2018/12/07,1862.0,1873.608,1892.0,237300,1927.0,1846.0
1053,2018/12/10,1792.0,1795.984,1806.0,315900,1833.0,1776.0
1054,2018/12/11,1777.0,1799.178,1802.0,243500,1836.0,1777.0
1055,2018/12/12,1811.0,1820.031,1782.0,317600,1863.0,1771.0
1056,2018/12/13,1852.0,1847.149,1820.0,158600,1868.0,1816.0
1057,2018/12/14,1789.0,1792.788,1848.0,264600,1849.0,1752.0
1058,2018/12/17,1716.0,1740.537,1758.0,215900,1785.0,1712.0
1059,2018/12/18,1665.0,1672.382,1661.0,304800,1705.0,1647.0
1060,2018/12/19,1676.0,1670.502,1639.0,273500,1712.0,1621.0
1061,2018/12/20,1594.0,1611.061,1657.0,303700,1669.0,1573.0
1062,2018/12/21,1508.0,1536.888,1572.0,565300,1602.0,1490.0
1063,2018/12/25,1351.0,1380.221,1400.0,831100,1442.0,1340.0
1064,2018/12/26,1423.0,1417.086,1376.0,507100,1454.0,1376.0
1065,2018/12/27,1521.0,1511.404,1511.0,372500,1544.0,1475.0
1066,2018/12/28,1478.0,1479.029,1492.0,261300,1516.0,1450.0
1067,2019/01/04,1459.0,1427.533,1418.0,273000,1464.0,1390.0
1068,2019/01/07,1499.0,1506.596,1489.0,345600,1537.0,1489.0
1069,2019/01/08,1533.0,1532.084,1499.0,231100,1559.0,1497.0
1070,2019/01/09,1502.0,1520.76,1533.0,178600,1562.0,1494.0
1071,2019/01/10,1491.0,1490.463,1500.0,181700,1518.0,1464.0
1072,2019/01/11,1554.0,1555.401,1501.0,340300,1586.0,1499.0
1073,2019/01/15,1551.0,1550.713,1537.0,140100,1567.0,1518.0
1074,2019/01/16,1578.0,1577.152,1579.0,241300,1601.0,1541.0
1075,2019/01/17,1558.0,1551.09,1570.0,236800,1579.0,1531.0
1076,2019/01/18,1605.0,1602.684,1534.0,284800,1629.0,1525.0
1077,2019/01/21,1540.0,1580.36,1624.0,381400,1647.0,1529.0
1078,2019/01/22,1525.0,1525.607,1542.0,201700,1558.0,1507.0
1079,2019/01/23,1545.0,1543.135,1510.0,144700,1565.0,1501.0
1080,2019/01/24,1589.0,1561.749,1547.0,184200,1593.0,1514.0
1081,2019/01/25,1588.0,1593.492,1608.0,161300,1615.0,1578.0
1082,2019/01/28,1607.0,1620.56,1610.0,259800,1656.0,1598.0
1083,2019/01/29,1619.0,1609.23,1603.0,212500,1627.0,1581.0
1084,2019/01/30,1529.0,1550.538,1608.0,390700,1616.0,1515.0
1085,2019/01/31,1606.0,1584.705,1547.0,309800,1626.0,1532.0
1086,2019/02/01,1449.0,1452.32,1566.0,838800,1569.0,1407.0
1087,2019/02/04,1516.0,1503.935,1447.0,446500,1530.0,1435.0
1088,2019/02/05,1549.0,1520.872,1527.0,236200,1551.0,1479.0
1089,2019/02/06,1547.0,1552.667,1558.0,239800,1579.0,1536.0
1090,2019/02/07,1503.0,1511.28,1532.0,166900,1550.0,1494.0
1091,2019/02/08,1484.0,1489.894,1485.0,198400,1525.0,1466.0
1092,2019/02/12,1525.0,1540.963,1540.0,222100,1577.0,1517.0
1093,2019/02/13,1553.0,1546.814,1535.0,161500,1562.0,1510.0
1094,2019/02/14,1615.0,1625.891,1578.0,429200,1664.0,1577.0
1095,2019/02/15,1573.0,1599.849,1655.0,278600,1655.0,1564.0
1096,2019/02/18,1624.0,1616.478,1600.0,210300,1640.0,1585.0
1097,2019/02/19,1638.0,1638.356,1624.0,101000,1656.0,1613.0
1098,2019/02/20,1607.0,1611.653,1630.0,143800,1643.0,1598.0
1099,2019/02/21,1610.0,1607.133,1620.0,88000,1621.0,1590.0
1100,2019/02/22,1642.0,1628.501,1602.0,182100,1647.0,1594.0
1101,2019/02/25,1676.0,1684.861,1655.0,231500,1720.0,1642.0
1102,2019/02/26,1600.0,1631.385,1698.0,271000,1698.0,1597.0
1103,2019/02/27,1635.0,1628.005,1616.0,132100,1643.0,1605.0
1104,2019/02/28,1602.0,1616.784,1646.0,175000,1646.0,1599.0
1105,2019/03/01,1608.0,1599.932,1602.0,125500,1616.0,1584.0
1106,2019/03/04,1615.0,1610.733,1608.0,92400,1626.0,1591.0
1107,2019/03/05,1582.0,1589.272,1600.0,142300,1619.0,1575.0
1108,2019/03/06,1595.0,1589.134,1582.0,102700,1605.0,1573.0
1109,2019/03/07,1532.0,1543.799,1585.0,214700,1585.0,1515.0
1110,2019/03/08,1466.0,1478.552,1504.0,265000,1518.0,1449.0
1111,2019/03/11,1447.0,1441.362,1474.0,167600,1480.0,1402.0
1112,2019/03/12,1480.0,1481.265,1466.0,130500,1498.0,1463.0
1113,2019/03/13,1459.0,1454.664,1472.0,117600,1486.0,1437.0
1114,2019/03/14,1448.0,1450.409,1468.0,95900,1472.0,1435.0
1115,2019/03/15,1438.0,1441.756,1441.0,128900,1462.0,1431.0
1116,2019/03/18,1474.0,1459.149,1440.0,114800,1474.0,1428.0
1117,2019/03/19,1445.0,1449.167,1470.0,98300,1471.0,1436.0
1118,2019/03/20,1455.0,1449.268,1442.0,76800,1462.0,1431.0
1119,2019/03/22,1481.0,1469.107,1455.0,98300,1481.0,1450.0
1120,2019/03/25,1448.0,1433.695,1435.0,153500,1450.0,1411.0
1121,2019/03/26,1469.0,1465.988,1450.0,164500,1484.0,1440.0
1122,2019/03/27,1517.0,1506.932,1479.0,217400,1521.0,1479.0
1123,2019/03/28,1508.0,1507.096,1504.0,156500,1535.0,1478.0
1124,2019/03/29,1517.0,1518.256,1542.0,103900,1544.0,1501.0
1125,2019/04/01,1510.0,1516.4,1530.0,97800,1531.0,1505.0
1126,2019/04/02,1509.0,1509.565,1518.0,185300,1547.0,1487.0
1127,2019/04/03,1514.0,1508.614,1501.0,102700,1526.0,1479.0
1128,2019/04/04,1513.0,1536.084,1554.0,150800,1554.0,1511.0
1129,2019/04/05,1549.0,1535.692,1513.0,114500,1549.0,1513.0
1130,2019/04/08,1560.0,1563.251,1568.0,150000,1576.0,1552.0
1131,2019/04/09,1546.0,1554.993,1570.0,163700,1581.0,1533.0
1132,2019/04/10,1547.0,1542.904,1536.0,105000,1558.0,1520.0
1133,2019/04/11,1499.0,1509.333,1547.0,151500,1549.0,1493.0
1134,2019/04/12,1467.0,1476.476,1500.0,190500,1511.0,1460.0
1135,2019/04/15,1520.0,1509.727,1480.0,147900,1527.0,1480.0
1136,2019/04/16,1498.0,1506.055,1515.0,71400,1527.0,1492.0
1137,2019/04/17,1523.0,1507.468,1498.0,116400,1523.0,1487.0
1138,2019/04/18,1459.0,1486.115,1528.0,204800,1536.0,1459.0
1139,2019/04/19,1453.0,1453.839,1469.0,185100,1477.0,1437.0
1140,2019/04/22,1429.0,1439.12,1453.0,133400,1467.0,1422.0
1141,2019/04/23,1419.0,1410.469,1424.0,223500,1436.0,1388.0
1142,2019/04/24,1456.0,1455.427,1429.0,192100,1471.0,1417.0
1143,2019/04/25,1482.0,1468.231,1460.0,147400,1484.0,1439.0
1144,2019/04/26,1424.0,1423.721,1479.0,523400,1488.0,1402.0
1145,2019/05/07,1457.0,1463.477,1432.0,296800,1500.0,1422.0
1146,2019/05/08,1445.0,1449.301,1427.0,191100,1478.0,1427.0
1147,2019/05/09,1371.0,1385.985,1451.0,572400,1465.0,1356.0
1148,2019/05/10,1646.0,1590.018,1457.0,3260900,1659.0,1451.0
1149,2019/05/13,1412.0,1527.775,1630.0,1424000,1632.0,1412.0
1150,2019/05/14,1333.0,1359.558,1395.0,907900,1419.0,1330.0
1151,2019/05/15,1418.0,1391.317,1357.0,621500,1420.0,1349.0
1152,2019/05/16,1452.0,1462.286,1411.0,540900,1504.0,1411.0
1153,2019/05/17,1475.0,1473.924,1464.0,276600,1498.0,1453.0
1154,2019/05/20,1505.0,1501.096,1465.0,340200,1513.0,1465.0
1155,2019/05/21,1477.0,1469.767,1489.0,200900,1499.0,1442.0
1156,2019/05/22,1471.0,1480.572,1482.0,230100,1505.0,1455.0
1157,2019/05/23,1429.0,1450.512,1463.0,214500,1480.0,1429.0
1158,2019/05/24,1398.0,1394.663,1399.0,314600,1418.0,1378.0
1159,2019/05/27,1392.0,1396.801,1400.0,161200,1413.0,1383.0
1160,2019/05/28,1428.0,1410.675,1388.0,199500,1432.0,1384.0
1161,2019/05/29,1403.0,1412.855,1410.0,178200,1435.0,1399.0
1162,2019/05/30,1411.0,1397.246,1396.0,168500,1414.0,1386.0
1163,2019/05/31,1416.0,1417.21,1409.0,167500,1437.0,1397.0
1164,2019/06/03,1272.0,1306.101,1386.0,918500,1386.0,1268.0
1165,2019/06/04,1269.0,1269.577,1262.0,327600,1290.0,1250.0
1166,2019/06/05,1308.0,1316.01,1290.0,397600,1338.0,1290.0
1167,2019/06/06,1375.0,1360.67,1309.0,454200,1387.0,1309.0
1168,2019/06/07,1365.0,1362.483,1361.0,230000,1393.0,1343.0
1169,2019/06/10,1408.0,1404.495,1380.0,198300,1422.0,1380.0
1170,2019/06/11,1478.0,1460.974,1411.0,398000,1487.0,1411.0
1171,2019/06/12,1499.0,1493.268,1485.0,282300,1513.0,1464.0
1172,2019/06/13,1470.0,1479.402,1490.0,185900,1505.0,1466.0
1173,2019/06/14,1480.0,1473.632,1474.0,158300,1490.0,1460.0
1174,2019/06/17,1476.0,1472.061,1477.0,82000,1498.0,1459.0
1175,2019/06/18,1438.0,1449.829,1467.0,144100,1473.0,1435.0
1176,2019/06/19,1473.0,1466.168,1460.0,132000,1480.0,1455.0
1177,2019/06/20,1505.0,1499.965,1471.0,238800,1513.0,1470.0
1178,2019/06/21,1519.0,1520.492,1518.0,322400,1548.0,1488.0
1179,2019/06/24,1459.0,1478.162,1508.0,161300,1511.0,1459.0
1180,2019/06/25,1461.0,1459.508,1470.0,100100,1480.0,1446.0
1181,2019/06/26,1466.0,1465.662,1450.0,97400,1486.0,1437.0
1182,2019/06/27,1487.0,1475.925,1487.0,164800,1496.0,1458.0
1183,2019/06/28,1481.0,1492.566,1495.0,122300,1511.0,1474.0
1184,2019/07/01,1531.0,1529.986,1501.0,258700,1546.0,1491.0
1185,2019/07/02,1542.0,1535.156,1529.0,179100,1554.0,1513.0
1186,2019/07/03,1526.0,1533.095,1542.0,188800,1559.0,1517.0
1187,2019/07/04,1552.0,1544.387,1539.0,110900,1555.0,1530.0
1188,2019/07/05,1533.0,1537.605,1556.0,105500,1556.0,1528.0
1189,2019/07/08,1515.0,1528.7,1539.0,152100,1564.0,1507.0
1190,2019/07/09,1477.0,1490.733,1504.0,134900,1530.0,1474.0
1191,2019/07/10,1478.0,1467.46,1475.0,108600,1484.0,1447.0
1192,2019/07/11,1473.0,1461.054,1471.0,171700,1478.0,1448.0
1193,2019/07/12,1417.0,1441.733,1473.0,226700,1479.0,1417.0
1194,2019/07/16,1420.0,1415.365,1419.0,180600,1439.0,1401.0
1195,2019/07/17,1402.0,1398.068,1420.0,186800,1420.0,1388.0
1196,2019/07/18,1362.0,1380.53,1394.0,167500,1413.0,1360.0
1197,2019/07/19,1391.0,1394.486,1365.0,164200,1410.0,1365.0
1198,2019/07/22,1396.0,1382.286,1391.0,94100,1397.0,1368.0
1199,2019/07/23,1385.0,1387.961,1383.0,154700,1405.0,1377.0
1200,2019/07/24,1382.0,1384.338,1396.0,81000,1401.0,1377.0
1201,2019/07/25,1383.0,1387.991,1385.0,94600,1400.0,1378.0
1202,2019/07/26,1377.0,1377.141,1390.0,77400,1390.0,1370.0
1203,2019/07/29,1414.0,1418.349,1389.0,206900,1448.0,1384.0
1204,2019/07/30,1453.0,1443.108,1410.0,203700,1455.0,1410.0
1205,2019/07/31,1414.0,1422.937,1454.0,208700,1458.0,1407.0
1206,2019/08/01,1300.0,1306.208,1344.0,676200,1353.0,1274.0
1207,2019/08/02,1270.0,1261.901,1275.0,426400,1281.0,1251.0
1208,2019/08/05,1200.0,1201.298,1261.0,621600,1268.0,1167.0
1209,2019/08/06,1194.0,1156.111,1140.0,423200,1199.0,1114.0
1210,2019/08/07,1180.0,1183.628,1171.0,192900,1206.0,1171.0
1211,2019/08/08,1201.0,1191.328,1199.0,200900,1206.0,1173.0
1212,2019/08/09,1163.0,1176.514,1201.0,199600,1201.0,1162.0
1213,2019/08/13,1144.0,1141.249,1140.0,171700,1153.0,1130.0
1214,2019/08/14,1150.0,1137.063,1146.0,290200,1167.0,1120.0
1215,2019/08/15,1122.0,1109.913,1103.0,295600,1128.0,1094.0
1216,2019/08/16,1116.0,1120.436,1125.0,113800,1132.0,1110.0
1217,2019/08/19,1140.0,1133.895,1140.0,166800,1146.0,1123.0
1218,2019/08/20,1133.0,1125.925,1127.0,182800,1134.0,1117.0
1219,2019/08/21,1135.0,1126.017,1119.0,92700,1135.0,1114.0
1220,2019/08/22,1113.0,1119.361,1133.0,171000,1134.0,1110.0
1221,2019/08/23,1134.0,1130.922,1113.0,129200,1138.0,1113.0
