,DateTime,Open,High,Low,Close,VWAP,Trades,Volume,DS
0,2019/11/19 9:00:00,1435.0,1445.0,1435.0,1445.0,1440.333,7,2700.0,2019-11-19 09:00:00
1,2019/11/19 9:01:00,1445.0,1445.0,1440.0,1440.0,1443.5,3,400.0,2019-11-19 09:01:00
2,2019/11/19 9:02:00,1440.0,1440.0,1440.0,1440.0,1440.0,1,100.0,2019-11-19 09:02:00
3,2019/11/19 9:03:00,1438.0,1438.0,1438.0,1438.0,1438.0,1,100.0,2019-11-19 09:03:00
4,2019/11/19 9:08:00,1438.0,1438.0,1437.0,1437.0,1437.2,2,500.0,2019-11-19 09:08:00
5,2019/11/19 9:10:00,1435.0,1435.0,1433.0,1433.0,1434.0,3,400.0,2019-11-19 09:10:00
6,2019/11/19 9:19:00,1426.0,1426.0,1422.0,1422.0,1423.2,3,500.0,2019-11-19 09:19:00
7,2019/11/19 9:20:00,1422.0,1422.0,1422.0,1422.0,1422.0,1,100.0,2019-11-19 09:20:00
8,2019/11/19 9:22:00,1421.0,1421.0,1420.0,1420.0,1420.333,2,300.0,2019-11-19 09:22:00
9,2019/11/19 9:30:00,1419.0,1419.0,1417.0,1417.0,1418.0,3,400.0,2019-11-19 09:30:00
10,2019/11/19 9:35:00,1416.0,1416.0,1406.0,1409.0,1412.455,8,1100.0,2019-11-19 09:35:00
11,2019/11/19 9:37:00,1413.0,1415.0,1413.0,1415.0,1414.0,2,200.0,2019-11-19 09:37:00
12,2019/11/19 9:41:00,1420.0,1420.0,1420.0,1420.0,1420.0,1,100.0,2019-11-19 09:41:00
13,2019/11/19 9:45:00,1421.0,1422.0,1421.0,1422.0,1421.5,2,200.0,2019-11-19 09:45:00
14,2019/11/19 9:49:00,1421.0,1421.0,1421.0,1421.0,1421.0,2,200.0,2019-11-19 09:49:00
15,2019/11/19 10:41:00,1416.0,1416.0,1416.0,1416.0,1416.0,1,100.0,2019-11-19 10:41:00
16,2019/11/19 10:46:00,1412.0,1412.0,1412.0,1412.0,1412.0,1,100.0,2019-11-19 10:46:00
17,2019/11/19 10:48:00,1411.0,1411.0,1401.0,1411.0,1405.359,17,3900.0,2019-11-19 10:48:00
18,2019/11/19 10:54:00,1412.0,1412.0,1412.0,1412.0,1412.0,1,100.0,2019-11-19 10:54:00
19,2019/11/19 11:30:00,1412.0,1412.0,1412.0,1412.0,1412.0,1,100.0,2019-11-19 11:30:00
20,2019/11/19 12:30:00,1421.0,1421.0,1421.0,1421.0,1421.0,1,900.0,2019-11-19 12:30:00
21,2019/11/19 12:31:00,1421.0,1421.0,1421.0,1421.0,1421.0,2,1000.0,2019-11-19 12:31:00
22,2019/11/19 12:33:00,1420.0,1420.0,1420.0,1420.0,1420.0,3,600.0,2019-11-19 12:33:00
23,2019/11/19 12:34:00,1414.0,1414.0,1412.0,1412.0,1412.8,2,500.0,2019-11-19 12:34:00
24,2019/11/19 12:36:00,1413.0,1413.0,1412.0,1412.0,1412.5,3,400.0,2019-11-19 12:36:00
25,2019/11/19 12:42:00,1411.0,1411.0,1411.0,1411.0,1411.0,1,500.0,2019-11-19 12:42:00
26,2019/11/19 12:43:00,1409.0,1409.0,1408.0,1408.0,1408.571,3,700.0,2019-11-19 12:43:00
27,2019/11/19 12:46:00,1413.0,1413.0,1413.0,1413.0,1413.0,1,200.0,2019-11-19 12:46:00
28,2019/11/19 12:53:00,1408.0,1408.0,1398.0,1398.0,1401.435,7,2300.0,2019-11-19 12:53:00
29,2019/11/19 13:09:00,1407.0,1407.0,1407.0,1407.0,1407.0,1,100.0,2019-11-19 13:09:00
30,2019/11/19 13:17:00,1412.0,1416.0,1412.0,1416.0,1414.75,3,800.0,2019-11-19 13:17:00
31,2019/11/19 13:45:00,1414.0,1414.0,1414.0,1414.0,1414.0,4,400.0,2019-11-19 13:45:00
32,2019/11/19 14:25:00,1416.0,1418.0,1416.0,1418.0,1417.0,3,500.0,2019-11-19 14:25:00
33,2019/11/19 14:29:00,1418.0,1418.0,1418.0,1418.0,1418.0,1,100.0,2019-11-19 14:29:00
34,2019/11/19 14:41:00,1414.0,1414.0,1414.0,1414.0,1414.0,1,100.0,2019-11-19 14:41:00
35,2019/11/19 14:58:00,1412.0,1412.0,1412.0,1412.0,1412.0,1,100.0,2019-11-19 14:58:00
36,2019/11/19 14:59:00,1410.0,1417.0,1410.0,1417.0,1412.333,3,300.0,2019-11-19 14:59:00
37,2019/11/19 15:00:00,1411.0,1411.0,1411.0,1411.0,1411.0,1,300.0,2019-11-19 15:00:00
