,Date,Close,VWAP,Open,Volume,High,Low
0,2014/08/25,1056.0,1054.553,1054.0,4700,1057.0,1052.0
1,2014/08/26,1062.0,1059.158,1056.0,12700,1064.0,1051.0
2,2014/08/27,1076.0,1072.211,1072.0,25100,1077.0,1065.0
3,2014/08/28,1070.0,1069.621,1075.0,6600,1075.0,1066.0
4,2014/08/29,1070.0,1068.583,1070.0,12000,1071.0,1064.0
5,2014/09/01,1071.0,1070.165,1070.0,10900,1073.0,1065.0
6,2014/09/02,1083.0,1077.985,1067.0,32400,1085.0,1066.0
7,2014/09/03,1078.0,1080.554,1083.0,18400,1086.0,1077.0
8,2014/09/04,1074.0,1078.951,1082.0,26300,1086.0,1072.0
9,2014/09/05,1069.0,1072.952,1087.0,18600,1087.0,1068.0
10,2014/09/08,1078.0,1075.378,1075.0,29400,1080.0,1070.0
11,2014/09/09,1080.0,1077.751,1080.0,19300,1083.0,1074.0
12,2014/09/10,1088.0,1086.629,1073.0,19400,1090.0,1073.0
13,2014/09/11,1091.0,1089.597,1088.0,15400,1092.0,1086.0
14,2014/09/12,1097.0,1096.507,1095.0,38700,1100.0,1094.0
15,2014/09/16,1100.0,1094.287,1097.0,20200,1100.0,1083.0
16,2014/09/17,1097.0,1097.624,1099.0,10900,1100.0,1094.0
17,2014/09/18,1102.0,1099.739,1094.0,13000,1102.0,1094.0
18,2014/09/19,1106.0,1103.125,1102.0,33700,1113.0,1099.0
19,2014/09/22,1110.0,1109.968,1112.0,15700,1115.0,1104.0
20,2014/09/24,1116.0,1113.976,1113.0,33400,1119.0,1111.0
21,2014/09/25,1130.0,1127.113,1121.0,40000,1130.0,1121.0
22,2014/09/26,1121.0,1111.35,1110.0,33700,1125.0,1097.0
23,2014/09/29,1117.0,1109.176,1121.0,22700,1121.0,1080.0
24,2014/09/30,1107.0,1103.223,1100.0,22000,1111.0,1096.0
25,2014/10/01,1106.0,1108.282,1105.0,18100,1115.0,1101.0
26,2014/10/02,1060.0,1072.997,1079.0,33600,1088.0,1060.0
27,2014/10/03,1065.0,1063.714,1060.0,15400,1072.0,1060.0
28,2014/10/06,1088.0,1086.473,1076.0,14600,1093.0,1073.0
29,2014/10/07,1098.0,1101.547,1092.0,34200,1111.0,1091.0
30,2014/10/08,1082.0,1080.97,1079.0,30400,1087.0,1076.0
31,2014/10/09,1075.0,1081.614,1085.0,32600,1093.0,1069.0
32,2014/10/10,1060.0,1063.114,1055.0,29800,1076.0,1055.0
33,2014/10/14,1030.0,1030.257,1027.0,30700,1044.0,1022.0
34,2014/10/15,1048.0,1035.113,1030.0,30000,1049.0,1025.0
35,2014/10/16,1019.0,1020.347,1020.0,36900,1032.0,1013.0
36,2014/10/17,1010.0,1012.478,1019.0,34700,1038.0,1006.0
37,2014/10/20,1034.0,1031.575,1023.0,18100,1037.0,1023.0
38,2014/10/21,1035.0,1035.711,1040.0,19700,1045.0,1031.0
39,2014/10/22,1046.0,1041.974,1040.0,11500,1047.0,1038.0
40,2014/10/23,1045.0,1046.734,1040.0,12400,1056.0,1039.0
41,2014/10/24,1048.0,1047.813,1048.0,12300,1060.0,1038.0
42,2014/10/27,1057.0,1056.438,1057.0,9600,1061.0,1053.0
43,2014/10/28,1055.0,1057.591,1057.0,25900,1067.0,1051.0
44,2014/10/29,1069.0,1071.088,1051.0,26100,1090.0,1051.0
45,2014/10/30,1053.0,1058.048,1058.0,86300,1069.0,1053.0
46,2014/10/31,1091.0,1079.683,1059.0,57400,1098.0,1058.0
47,2014/11/04,1116.0,1113.236,1100.0,67700,1123.0,1100.0
48,2014/11/05,1145.0,1133.146,1116.0,97300,1149.0,1116.0
49,2014/11/06,1148.0,1152.354,1150.0,50300,1160.0,1145.0
50,2014/11/07,1155.0,1151.65,1148.0,34000,1159.0,1148.0
51,2014/11/10,1170.0,1163.438,1150.0,34700,1172.0,1150.0
52,2014/11/11,1153.0,1162.158,1169.0,44900,1179.0,1145.0
53,2014/11/12,1152.0,1156.571,1164.0,50300,1164.0,1149.0
54,2014/11/13,1149.0,1143.313,1149.0,22400,1151.0,1133.0
55,2014/11/14,1147.0,1150.979,1145.0,43500,1168.0,1144.0
56,2014/11/17,1132.0,1133.728,1147.0,33500,1147.0,1115.0
57,2014/11/18,1131.0,1129.685,1134.0,34900,1134.0,1117.0
58,2014/11/19,1127.0,1134.954,1133.0,21500,1143.0,1126.0
59,2014/11/20,1131.0,1135.344,1144.0,12800,1144.0,1131.0
60,2014/11/21,1128.0,1122.065,1127.0,24600,1132.0,1115.0
61,2014/11/25,1154.0,1147.721,1135.0,32300,1154.0,1135.0
62,2014/11/26,1172.0,1168.201,1150.0,43900,1174.0,1150.0
63,2014/11/27,1176.0,1170.767,1157.0,34400,1176.0,1157.0
64,2014/11/28,1195.0,1189.007,1177.0,70500,1199.0,1177.0
65,2014/12/01,1201.0,1198.886,1198.0,60500,1206.0,1192.0
66,2014/12/02,1216.0,1203.283,1196.0,61800,1216.0,1188.0
67,2014/12/03,1222.0,1220.087,1217.0,58600,1227.0,1210.0
68,2014/12/04,1254.0,1242.985,1230.0,119100,1257.0,1229.0
69,2014/12/05,1257.0,1249.829,1250.0,45100,1258.0,1241.0
70,2014/12/08,1261.0,1260.457,1258.0,32400,1268.0,1256.0
71,2014/12/09,1235.0,1244.144,1250.0,38100,1253.0,1235.0
72,2014/12/10,1203.0,1212.22,1221.0,41300,1223.0,1201.0
73,2014/12/11,1181.0,1180.619,1173.0,41500,1189.0,1173.0
74,2014/12/12,1162.0,1166.758,1157.0,55400,1186.0,1157.0
75,2014/12/15,1163.0,1164.963,1163.0,24400,1177.0,1153.0
76,2014/12/16,1145.0,1151.178,1150.0,37700,1163.0,1143.0
77,2014/12/17,1134.0,1142.214,1138.0,20600,1149.0,1134.0
78,2014/12/18,1176.0,1177.714,1178.0,37100,1198.0,1152.0
79,2014/12/19,1159.0,1172.633,1190.0,54700,1191.0,1158.0
80,2014/12/22,1182.0,1177.793,1169.0,19800,1188.0,1167.0
81,2014/12/24,1188.0,1192.442,1198.0,18100,1198.0,1184.0
82,2014/12/25,1189.0,1189.143,1188.0,26600,1200.0,1180.0
83,2014/12/26,1201.0,1197.529,1185.0,8700,1204.0,1185.0
84,2014/12/29,1201.0,1202.25,1201.0,27600,1210.0,1193.0
85,2014/12/30,1193.0,1203.592,1206.0,16900,1208.0,1189.0
86,2015/01/05,1202.0,1203.135,1202.0,22200,1214.0,1193.0
87,2015/01/06,1178.0,1181.477,1186.0,27700,1186.0,1177.0
88,2015/01/07,1179.0,1174.292,1168.0,15400,1181.0,1168.0
89,2015/01/08,1192.0,1190.035,1181.0,14500,1197.0,1181.0
90,2015/01/09,1195.0,1196.262,1194.0,17200,1204.0,1193.0
91,2015/01/13,1197.0,1196.22,1195.0,37200,1212.0,1188.0
92,2015/01/14,1176.0,1180.578,1185.0,10200,1190.0,1176.0
93,2015/01/15,1188.0,1182.846,1175.0,14900,1190.0,1173.0
94,2015/01/16,1180.0,1174.264,1179.0,30700,1183.0,1163.0
95,2015/01/19,1158.0,1167.445,1180.0,23600,1180.0,1150.0
96,2015/01/20,1183.0,1179.645,1169.0,20000,1183.0,1162.0
97,2015/01/21,1180.0,1179.785,1187.0,13000,1187.0,1173.0
98,2015/01/22,1182.0,1176.534,1191.0,26200,1191.0,1169.0
99,2015/01/23,1183.0,1188.793,1188.0,18800,1197.0,1179.0
100,2015/01/26,1198.0,1190.236,1156.0,23300,1206.0,1156.0
101,2015/01/27,1204.0,1201.833,1199.0,14400,1209.0,1190.0
102,2015/01/28,1211.0,1207.037,1203.0,19100,1216.0,1193.0
103,2015/01/29,1203.0,1204.486,1210.0,10900,1210.0,1192.0
104,2015/01/30,1223.0,1215.345,1203.0,25200,1230.0,1196.0
105,2015/02/02,1248.0,1242.759,1230.0,49000,1250.0,1219.0
106,2015/02/03,1258.0,1249.049,1248.0,36800,1262.0,1237.0
107,2015/02/04,1273.0,1264.898,1249.0,50200,1283.0,1249.0
108,2015/02/05,1270.0,1263.366,1280.0,45600,1280.0,1251.0
109,2015/02/06,1267.0,1268.106,1282.0,38600,1284.0,1260.0
110,2015/02/09,1289.0,1281.324,1276.0,37700,1291.0,1262.0
111,2015/02/10,1298.0,1286.098,1281.0,41000,1298.0,1276.0
112,2015/02/12,1306.0,1308.872,1299.0,50600,1325.0,1299.0
113,2015/02/13,1286.0,1291.674,1306.0,26700,1306.0,1275.0
114,2015/02/16,1295.0,1293.653,1286.0,24800,1300.0,1286.0
115,2015/02/17,1311.0,1307.418,1295.0,16500,1316.0,1295.0
116,2015/02/18,1326.0,1324.201,1312.0,43300,1332.0,1312.0
117,2015/02/19,1345.0,1339.985,1337.0,34000,1346.0,1333.0
118,2015/02/20,1346.0,1347.523,1349.0,34400,1353.0,1321.0
119,2015/02/23,1357.0,1354.699,1347.0,31900,1365.0,1347.0
120,2015/02/24,1358.0,1361.049,1363.0,22600,1371.0,1346.0
121,2015/02/25,1355.0,1354.646,1369.0,14700,1370.0,1347.0
122,2015/02/26,1378.0,1372.357,1359.0,31700,1380.0,1359.0
123,2015/02/27,1379.0,1382.357,1380.0,24900,1388.0,1371.0
124,2015/03/02,1371.0,1380.85,1385.0,14700,1387.0,1371.0
125,2015/03/03,1344.0,1351.43,1371.0,27700,1371.0,1344.0
126,2015/03/04,1345.0,1332.339,1328.0,33600,1353.0,1316.0
127,2015/03/05,1365.0,1355.611,1343.0,21600,1368.0,1342.0
128,2015/03/06,1393.0,1389.843,1366.0,35600,1398.0,1366.0
129,2015/03/09,1387.0,1384.936,1375.0,26600,1397.0,1370.0
130,2015/03/10,1387.0,1392.031,1388.0,19300,1400.0,1384.0
131,2015/03/11,1393.0,1393.25,1384.0,12800,1400.0,1384.0
132,2015/03/12,1395.0,1394.23,1394.0,15200,1399.0,1391.0
133,2015/03/13,1406.0,1403.002,1397.0,43600,1418.0,1395.0
134,2015/03/16,1418.0,1409.718,1415.0,25500,1418.0,1400.0
135,2015/03/17,1434.0,1436.449,1420.0,26700,1446.0,1420.0
136,2015/03/18,1447.0,1450.258,1450.0,44500,1467.0,1443.0
137,2015/03/19,1429.0,1434.097,1449.0,30800,1449.0,1420.0
138,2015/03/20,1420.0,1417.447,1430.0,56600,1432.0,1403.0
139,2015/03/23,1436.0,1442.737,1450.0,26200,1451.0,1427.0
140,2015/03/24,1452.0,1448.281,1433.0,40200,1454.0,1433.0
141,2015/03/25,1453.0,1447.259,1450.0,25500,1455.0,1436.0
142,2015/03/26,1455.0,1455.054,1457.0,40600,1464.0,1449.0
143,2015/03/27,1439.0,1444.435,1441.0,63200,1455.0,1421.0
144,2015/03/30,1423.0,1414.731,1439.0,45700,1439.0,1387.0
145,2015/03/31,1435.0,1435.188,1435.0,34600,1447.0,1426.0
146,2015/04/01,1413.0,1410.297,1413.0,52800,1421.0,1391.0
147,2015/04/02,1442.0,1432.889,1420.0,38600,1450.0,1414.0
148,2015/04/03,1449.0,1444.78,1450.0,22700,1452.0,1439.0
149,2015/04/06,1464.0,1454.471,1448.0,28000,1464.0,1444.0
150,2015/04/07,1455.0,1460.247,1464.0,29600,1480.0,1445.0
151,2015/04/08,1460.0,1456.174,1446.0,19600,1465.0,1446.0
152,2015/04/09,1456.0,1452.376,1468.0,23400,1468.0,1438.0
153,2015/04/10,1456.0,1458.123,1463.0,21900,1463.0,1452.0
154,2015/04/13,1456.0,1454.558,1461.0,13800,1461.0,1450.0
155,2015/04/14,1459.0,1453.543,1456.0,22100,1460.0,1447.0
156,2015/04/15,1450.0,1447.067,1443.0,20900,1453.0,1439.0
157,2015/04/16,1455.0,1449.639,1448.0,20500,1455.0,1447.0
158,2015/04/17,1449.0,1450.296,1449.0,21600,1455.0,1446.0
159,2015/04/20,1433.0,1432.361,1435.0,23800,1440.0,1404.0
160,2015/04/21,1432.0,1427.672,1433.0,26200,1435.0,1418.0
161,2015/04/22,1441.0,1439.433,1441.0,14100,1444.0,1432.0
162,2015/04/23,1448.0,1447.746,1441.0,18900,1457.0,1436.0
163,2015/04/24,1452.0,1452.881,1456.0,11800,1459.0,1447.0
164,2015/04/27,1469.0,1473.298,1444.0,28200,1494.0,1444.0
165,2015/04/28,1472.0,1474.09,1469.0,18800,1485.0,1465.0
166,2015/04/30,1461.0,1458.633,1458.0,31100,1475.0,1451.0
167,2015/05/01,1371.0,1383.161,1445.0,156400,1446.0,1363.0
168,2015/05/07,1373.0,1375.442,1358.0,48400,1393.0,1358.0
169,2015/05/08,1369.0,1377.975,1387.0,32300,1395.0,1366.0
170,2015/05/11,1395.0,1398.602,1398.0,46200,1409.0,1392.0
171,2015/05/12,1396.0,1399.454,1395.0,38100,1415.0,1394.0
172,2015/05/13,1400.0,1401.944,1398.0,17900,1409.0,1397.0
173,2015/05/14,1414.0,1422.731,1409.0,45300,1440.0,1406.0
174,2015/05/15,1436.0,1434.611,1426.0,19000,1440.0,1423.0
175,2015/05/18,1473.0,1460.917,1436.0,36100,1479.0,1436.0
176,2015/05/19,1477.0,1473.735,1474.0,24500,1480.0,1460.0
177,2015/05/20,1486.0,1477.031,1479.0,38700,1486.0,1462.0
178,2015/05/21,1479.0,1479.358,1485.0,34100,1486.0,1475.0
179,2015/05/22,1489.0,1484.76,1479.0,20400,1489.0,1479.0
180,2015/05/25,1493.0,1492.386,1489.0,17600,1498.0,1485.0
181,2015/05/26,1487.0,1492.03,1493.0,16900,1497.0,1487.0
182,2015/05/27,1466.0,1467.926,1492.0,44800,1492.0,1440.0
183,2015/05/28,1480.0,1481.994,1466.0,17000,1497.0,1466.0
184,2015/05/29,1499.0,1499.902,1488.0,38900,1507.0,1484.0
185,2015/06/01,1521.0,1512.784,1509.0,25900,1522.0,1501.0
186,2015/06/02,1525.0,1523.256,1521.0,23800,1545.0,1513.0
187,2015/06/03,1499.0,1499.981,1525.0,15900,1525.0,1491.0
188,2015/06/04,1483.0,1489.135,1501.0,38400,1505.0,1481.0
189,2015/06/05,1487.0,1480.133,1460.0,27100,1492.0,1460.0
190,2015/06/08,1482.0,1485.176,1485.0,16500,1499.0,1474.0
191,2015/06/09,1473.0,1480.075,1473.0,17400,1489.0,1468.0
192,2015/06/10,1477.0,1482.984,1474.0,19000,1495.0,1474.0
193,2015/06/11,1456.0,1470.449,1472.0,48300,1494.0,1453.0
194,2015/06/12,1445.0,1450.161,1455.0,71300,1474.0,1440.0
195,2015/06/15,1489.0,1464.518,1445.0,31500,1494.0,1445.0
196,2015/06/16,1463.0,1471.552,1495.0,22100,1498.0,1455.0
197,2015/06/17,1464.0,1468.32,1466.0,32200,1495.0,1463.0
198,2015/06/18,1429.0,1450.14,1470.0,51300,1477.0,1429.0
199,2015/06/19,1540.0,1508.346,1440.0,82500,1540.0,1440.0
200,2015/06/22,1487.0,1499.245,1500.0,67900,1529.0,1481.0
201,2015/06/23,1513.0,1492.565,1477.0,35200,1516.0,1455.0
202,2015/06/24,1520.0,1519.075,1519.0,68100,1538.0,1483.0
203,2015/06/25,1515.0,1515.73,1520.0,16300,1526.0,1508.0
204,2015/06/26,1515.0,1513.439,1516.0,15500,1526.0,1508.0
205,2015/06/29,1468.0,1470.267,1480.0,29200,1490.0,1452.0
206,2015/06/30,1500.0,1484.143,1468.0,25200,1505.0,1465.0
207,2015/07/01,1495.0,1494.595,1505.0,25700,1509.0,1482.0
208,2015/07/02,1506.0,1501.008,1513.0,12200,1513.0,1492.0
209,2015/07/03,1489.0,1491.426,1506.0,9400,1506.0,1481.0
210,2015/07/06,1476.0,1477.013,1480.0,22500,1487.0,1469.0
211,2015/07/07,1464.0,1471.6,1476.0,17500,1486.0,1461.0
212,2015/07/08,1428.0,1442.85,1466.0,36700,1466.0,1428.0
213,2015/07/09,1406.0,1388.259,1391.0,46400,1418.0,1361.0
214,2015/07/10,1414.0,1414.018,1410.0,22900,1437.0,1399.0
215,2015/07/13,1445.0,1438.29,1434.0,18300,1452.0,1423.0
216,2015/07/14,1493.0,1483.767,1466.0,19700,1508.0,1466.0
217,2015/07/15,1494.0,1488.61,1492.0,16400,1499.0,1475.0
218,2015/07/16,1507.0,1502.409,1500.0,18100,1510.0,1491.0
219,2015/07/17,1508.0,1506.371,1507.0,10500,1516.0,1502.0
220,2015/07/21,1523.0,1523.659,1515.0,22000,1532.0,1508.0
221,2015/07/22,1523.0,1514.252,1520.0,16700,1528.0,1502.0
222,2015/07/23,1533.0,1524.25,1524.0,16800,1534.0,1516.0
223,2015/07/24,1513.0,1514.141,1527.0,7100,1527.0,1501.0
224,2015/07/27,1492.0,1496.424,1505.0,15800,1509.0,1490.0
225,2015/07/28,1486.0,1476.404,1482.0,16600,1490.0,1453.0
226,2015/07/29,1502.0,1497.309,1493.0,16200,1510.0,1487.0
227,2015/07/30,1517.0,1510.766,1502.0,10700,1517.0,1502.0
228,2015/07/31,1525.0,1522.95,1517.0,24100,1535.0,1508.0
229,2015/08/03,1522.0,1519.839,1530.0,19300,1530.0,1481.0
230,2015/08/04,1520.0,1519.715,1515.0,27400,1529.0,1505.0
231,2015/08/05,1503.0,1504.615,1517.0,26000,1517.0,1492.0
232,2015/08/06,1502.0,1506.542,1500.0,37800,1520.0,1495.0
233,2015/08/07,1499.0,1501.36,1502.0,16100,1508.0,1490.0
234,2015/08/10,1500.0,1500.004,1502.0,23100,1505.0,1485.0
235,2015/08/11,1499.0,1502.533,1509.0,26100,1513.0,1484.0
236,2015/08/12,1480.0,1477.772,1490.0,39400,1502.0,1454.0
237,2015/08/13,1452.0,1459.168,1451.0,35100,1480.0,1450.0
238,2015/08/14,1464.0,1461.395,1452.0,12900,1472.0,1452.0
239,2015/08/17,1490.0,1482.741,1474.0,18900,1490.0,1472.0
240,2015/08/18,1486.0,1487.606,1490.0,17000,1499.0,1476.0
241,2015/08/19,1484.0,1483.847,1485.0,15700,1495.0,1477.0
242,2015/08/20,1471.0,1469.685,1484.0,16800,1484.0,1450.0
243,2015/08/21,1441.0,1449.156,1467.0,42200,1467.0,1425.0
244,2015/08/24,1326.0,1370.955,1390.0,33200,1405.0,1323.0
245,2015/08/25,1276.0,1294.333,1270.0,41500,1350.0,1263.0
246,2015/08/26,1326.0,1319.96,1280.0,35300,1338.0,1280.0
247,2015/08/27,1374.0,1374.437,1346.0,31600,1404.0,1341.0
248,2015/08/28,1410.0,1410.187,1409.0,16600,1424.0,1388.0
249,2015/08/31,1408.0,1406.09,1400.0,22200,1410.0,1398.0
250,2015/09/01,1368.0,1381.946,1405.0,24000,1405.0,1362.0
251,2015/09/02,1365.0,1366.207,1340.0,37200,1382.0,1340.0
252,2015/09/03,1359.0,1358.75,1373.0,15600,1376.0,1347.0
253,2015/09/04,1334.0,1345.646,1365.0,22000,1367.0,1325.0
254,2015/09/07,1335.0,1327.297,1329.0,19900,1348.0,1299.0
255,2015/09/08,1313.0,1322.038,1329.0,15700,1337.0,1312.0
256,2015/09/09,1384.0,1358.536,1360.0,28200,1391.0,1344.0
257,2015/09/10,1349.0,1357.076,1350.0,13100,1385.0,1331.0
258,2015/09/11,1351.0,1348.46,1337.0,44400,1368.0,1330.0
259,2015/09/14,1352.0,1360.204,1358.0,32800,1384.0,1349.0
260,2015/09/15,1356.0,1365.7,1358.0,22300,1379.0,1354.0
261,2015/09/16,1377.0,1374.781,1363.0,24200,1395.0,1356.0
262,2015/09/17,1355.0,1363.702,1372.0,31500,1382.0,1352.0
263,2015/09/18,1297.0,1311.454,1355.0,65900,1363.0,1297.0
264,2015/09/24,1255.0,1273.238,1276.0,50900,1291.0,1254.0
265,2015/09/25,1296.0,1287.88,1265.0,54200,1309.0,1265.0
266,2015/09/28,1284.0,1277.44,1290.0,31400,1300.0,1263.0
267,2015/09/29,1240.0,1239.351,1263.0,66700,1268.0,1213.0
268,2015/09/30,1252.0,1252.556,1240.0,41900,1266.0,1232.0
269,2015/10/01,1277.0,1276.963,1272.0,24300,1287.0,1270.0
270,2015/10/02,1291.0,1286.388,1278.0,21900,1301.0,1268.0
271,2015/10/05,1340.0,1324.691,1291.0,37200,1347.0,1291.0
272,2015/10/06,1402.0,1386.13,1350.0,41700,1412.0,1347.0
273,2015/10/07,1403.0,1389.983,1402.0,17600,1404.0,1373.0
274,2015/10/08,1380.0,1385.567,1403.0,24000,1403.0,1373.0
275,2015/10/09,1443.0,1424.099,1399.0,32400,1452.0,1398.0
276,2015/10/13,1421.0,1421.28,1439.0,15000,1439.0,1410.0
277,2015/10/14,1413.0,1414.508,1439.0,19100,1439.0,1403.0
278,2015/10/15,1414.0,1412.518,1413.0,19300,1419.0,1395.0
279,2015/10/16,1403.0,1412.154,1420.0,16900,1420.0,1399.0
280,2015/10/19,1424.0,1414.912,1403.0,33100,1442.0,1396.0
281,2015/10/20,1410.0,1410.681,1418.0,14100,1427.0,1400.0
282,2015/10/21,1472.0,1449.376,1412.0,39900,1482.0,1412.0
283,2015/10/22,1430.0,1440.018,1471.0,10900,1471.0,1429.0
284,2015/10/23,1464.0,1455.044,1458.0,13800,1466.0,1438.0
285,2015/10/26,1474.0,1475.757,1472.0,14000,1489.0,1461.0
286,2015/10/27,1463.0,1467.36,1474.0,11400,1479.0,1454.0
287,2015/10/28,1433.0,1440.551,1478.0,23600,1478.0,1412.0
288,2015/10/29,1419.0,1424.72,1427.0,80600,1455.0,1394.0
289,2015/10/30,1422.0,1437.125,1434.0,26500,1458.0,1418.0
290,2015/11/02,1333.0,1344.812,1392.0,51500,1399.0,1316.0
291,2015/11/04,1357.0,1347.478,1360.0,37700,1369.0,1331.0
292,2015/11/05,1371.0,1374.467,1359.0,27000,1391.0,1359.0
293,2015/11/06,1384.0,1385.44,1371.0,32300,1400.0,1371.0
294,2015/11/09,1390.0,1396.989,1389.0,45700,1406.0,1381.0
295,2015/11/10,1383.0,1380.401,1380.0,15200,1390.0,1363.0
296,2015/11/11,1391.0,1387.621,1374.0,14500,1395.0,1374.0
297,2015/11/12,1405.0,1399.799,1397.0,13400,1407.0,1391.0
298,2015/11/13,1379.0,1386.848,1400.0,21000,1405.0,1377.0
299,2015/11/16,1371.0,1361.572,1350.0,18000,1376.0,1350.0
300,2015/11/17,1388.0,1385.411,1380.0,23100,1394.0,1373.0
301,2015/11/18,1388.0,1398.353,1407.0,16700,1411.0,1384.0
302,2015/11/19,1399.0,1405.095,1411.0,11600,1417.0,1393.0
303,2015/11/20,1375.0,1375.8,1400.0,30000,1400.0,1362.0
304,2015/11/24,1376.0,1374.141,1370.0,22000,1382.0,1366.0
305,2015/11/25,1353.0,1359.742,1385.0,15100,1385.0,1353.0
306,2015/11/26,1328.0,1339.095,1352.0,23200,1357.0,1323.0
307,2015/11/27,1333.0,1334.65,1331.0,14300,1340.0,1331.0
308,2015/11/30,1315.0,1322.682,1346.0,38700,1346.0,1313.0
309,2015/12/01,1328.0,1333.16,1340.0,26200,1345.0,1326.0
310,2015/12/02,1318.0,1322.607,1328.0,21100,1333.0,1314.0
311,2015/12/03,1314.0,1314.941,1312.0,23700,1330.0,1302.0
312,2015/12/04,1294.0,1298.927,1301.0,24600,1305.0,1294.0
313,2015/12/07,1295.0,1302.0,1317.0,22000,1317.0,1295.0
314,2015/12/08,1289.0,1290.241,1302.0,22400,1302.0,1280.0
315,2015/12/09,1275.0,1281.1,1292.0,23900,1296.0,1269.0
316,2015/12/10,1261.0,1255.35,1258.0,22600,1264.0,1248.0
317,2015/12/11,1276.0,1295.224,1310.0,51400,1310.0,1269.0
318,2015/12/14,1250.0,1248.569,1241.0,39000,1265.0,1232.0
319,2015/12/15,1267.0,1271.76,1263.0,31600,1280.0,1263.0
320,2015/12/16,1269.0,1268.222,1269.0,25700,1285.0,1255.0
321,2015/12/17,1264.0,1276.518,1287.0,33600,1297.0,1261.0
322,2015/12/18,1223.0,1249.49,1277.0,38200,1283.0,1223.0
323,2015/12/21,1228.0,1225.356,1235.0,31500,1241.0,1206.0
324,2015/12/22,1225.0,1223.634,1228.0,23200,1233.0,1215.0
325,2015/12/24,1197.0,1208.188,1225.0,25000,1233.0,1191.0
326,2015/12/25,1173.0,1172.995,1170.0,42400,1180.0,1164.0
327,2015/12/28,1215.0,1215.028,1193.0,21100,1237.0,1193.0
328,2015/12/29,1228.0,1223.327,1213.0,16800,1231.0,1211.0
329,2015/12/30,1225.0,1227.867,1228.0,20300,1244.0,1216.0
330,2016/01/04,1206.0,1209.925,1215.0,26800,1220.0,1202.0
331,2016/01/05,1203.0,1208.414,1211.0,28500,1225.0,1201.0
332,2016/01/06,1213.0,1206.611,1207.0,32900,1222.0,1193.0
333,2016/01/07,1161.0,1185.86,1200.0,27900,1216.0,1161.0
334,2016/01/08,1150.0,1163.148,1165.0,36400,1188.0,1148.0
335,2016/01/12,1111.0,1123.588,1151.0,25700,1151.0,1111.0
336,2016/01/13,1136.0,1131.906,1120.0,16000,1144.0,1120.0
337,2016/01/14,1124.0,1115.997,1133.0,30400,1134.0,1102.0
338,2016/01/15,1123.0,1127.032,1127.0,18600,1142.0,1115.0
339,2016/01/18,1117.0,1116.0,1114.0,20300,1126.0,1102.0
340,2016/01/19,1104.0,1110.784,1111.0,23100,1129.0,1098.0
341,2016/01/20,1079.0,1089.857,1104.0,41900,1104.0,1077.0
342,2016/01/21,1027.0,1058.034,1058.0,40800,1087.0,1027.0
343,2016/01/22,1125.0,1094.718,1055.0,35100,1128.0,1055.0
344,2016/01/25,1113.0,1116.195,1129.0,16400,1129.0,1110.0
345,2016/01/26,1083.0,1090.0,1090.0,8200,1108.0,1082.0
346,2016/01/27,1098.0,1093.766,1106.0,15800,1110.0,1080.0
347,2016/01/28,1118.0,1113.955,1093.0,17800,1121.0,1087.0
348,2016/01/29,1144.0,1124.628,1104.0,22600,1149.0,1095.0
349,2016/02/01,1168.0,1163.133,1147.0,24100,1180.0,1147.0
350,2016/02/02,1143.0,1152.545,1169.0,10100,1169.0,1134.0
351,2016/02/03,1111.0,1104.154,1117.0,24000,1120.0,1084.0
352,2016/02/04,1097.0,1100.016,1086.0,6200,1112.0,1086.0
353,2016/02/05,1061.0,1062.278,1080.0,28100,1086.0,1049.0
354,2016/02/08,1076.0,1062.612,1042.0,13400,1092.0,1041.0
355,2016/02/09,1015.0,1025.11,1041.0,20900,1044.0,1015.0
356,2016/02/10,984.0,996.951,1015.0,36600,1026.0,978.0
357,2016/02/12,929.0,948.317,969.0,36300,980.0,925.0
358,2016/02/15,981.0,977.532,959.0,21600,995.0,959.0
359,2016/02/16,973.0,972.574,970.0,35900,987.0,958.0
360,2016/02/17,959.0,968.189,966.0,22700,994.0,956.0
361,2016/02/18,969.0,976.423,974.0,34300,986.0,968.0
362,2016/02/19,948.0,948.299,969.0,50800,969.0,937.0
363,2016/02/22,931.0,939.372,943.0,52400,953.0,930.0
364,2016/02/23,907.0,918.741,936.0,80700,967.0,905.0
365,2016/02/24,892.0,899.991,907.0,64500,913.0,891.0
366,2016/02/25,911.0,911.523,894.0,32500,926.0,894.0
367,2016/02/26,914.0,920.605,917.0,34200,931.0,911.0
368,2016/02/29,913.0,927.46,932.0,42800,943.0,913.0
369,2016/03/01,907.0,916.454,923.0,38300,929.0,903.0
370,2016/03/02,938.0,935.026,933.0,45800,943.0,922.0
371,2016/03/03,958.0,950.25,938.0,46000,961.0,937.0
372,2016/03/04,978.0,967.777,959.0,50600,981.0,943.0
373,2016/03/07,989.0,989.045,987.0,50900,998.0,968.0
374,2016/03/08,981.0,983.927,989.0,50600,998.0,972.0
375,2016/03/09,960.0,960.178,975.0,51100,975.0,952.0
376,2016/03/10,988.0,980.572,971.0,47000,991.0,966.0
377,2016/03/11,980.0,976.062,969.0,51700,989.0,968.0
378,2016/03/14,1005.0,1003.499,990.0,46900,1010.0,990.0
379,2016/03/15,1012.0,1014.532,1006.0,33100,1026.0,1005.0
380,2016/03/16,1005.0,1010.75,1004.0,27200,1029.0,1003.0
381,2016/03/17,1001.0,1012.209,1013.0,30100,1028.0,996.0
382,2016/03/18,971.0,983.737,990.0,103100,1004.0,971.0
383,2016/03/22,1009.0,1003.817,1000.0,59700,1022.0,990.0
384,2016/03/23,1011.0,1009.454,1021.0,34600,1021.0,1001.0
385,2016/03/24,1000.0,1001.532,1008.0,39300,1008.0,993.0
386,2016/03/25,1003.0,1004.04,1001.0,25000,1017.0,995.0
387,2016/03/28,1017.0,1011.953,1015.0,27900,1017.0,1007.0
388,2016/03/29,1006.0,1000.716,999.0,20800,1006.0,995.0
389,2016/03/30,992.0,996.292,1001.0,23300,1002.0,991.0
390,2016/03/31,991.0,995.159,996.0,29600,1002.0,991.0
391,2016/04/01,904.0,913.242,971.0,197800,971.0,889.0
392,2016/04/04,906.0,907.125,905.0,93700,926.0,896.0
393,2016/04/05,870.0,883.961,906.0,73600,906.0,870.0
394,2016/04/06,868.0,868.353,870.0,40200,882.0,855.0
395,2016/04/07,861.0,866.929,866.0,51900,887.0,858.0
396,2016/04/08,866.0,856.037,851.0,54200,881.0,838.0
397,2016/04/11,857.0,853.767,866.0,20600,866.0,844.0
398,2016/04/12,883.0,881.231,860.0,27700,889.0,860.0
399,2016/04/13,898.0,896.959,890.0,22000,904.0,887.0
400,2016/04/14,911.0,911.604,904.0,39100,920.0,904.0
401,2016/04/15,909.0,908.901,907.0,18100,916.0,905.0
402,2016/04/18,883.0,886.184,905.0,48300,905.0,878.0
403,2016/04/19,911.0,908.274,898.0,34700,913.0,898.0
404,2016/04/20,901.0,909.802,912.0,37800,920.0,896.0
405,2016/04/21,927.0,924.181,916.0,35900,929.0,913.0
406,2016/04/22,939.0,931.961,921.0,25300,940.0,920.0
407,2016/04/25,945.0,942.746,942.0,25200,950.0,936.0
408,2016/04/26,926.0,925.823,934.0,29400,939.0,916.0
409,2016/04/27,931.0,931.54,930.0,22400,938.0,926.0
410,2016/04/28,922.0,948.648,932.0,55100,975.0,918.0
411,2016/05/02,896.0,899.434,923.0,61000,923.0,890.0
412,2016/05/06,906.0,897.711,898.0,35000,911.0,887.0
413,2016/05/09,911.0,913.62,916.0,15800,926.0,908.0
414,2016/05/10,926.0,918.802,908.0,26800,929.0,903.0
415,2016/05/11,934.0,936.176,931.0,18200,943.0,930.0
416,2016/05/12,937.0,930.552,929.0,14500,940.0,921.0
417,2016/05/13,913.0,917.84,937.0,21300,937.0,913.0
418,2016/05/16,917.0,920.568,915.0,15500,927.0,911.0
419,2016/05/17,928.0,926.067,929.0,14900,931.0,919.0
420,2016/05/18,928.0,928.541,928.0,8500,937.0,923.0
421,2016/05/19,922.0,924.409,934.0,11500,934.0,917.0
422,2016/05/20,922.0,921.309,920.0,11000,929.0,917.0
423,2016/05/23,917.0,919.103,925.0,20300,928.0,912.0
424,2016/05/24,912.0,914.39,917.0,13600,918.0,911.0
425,2016/05/25,922.0,919.976,920.0,4200,923.0,918.0
426,2016/05/26,921.0,923.692,926.0,14300,930.0,921.0
427,2016/05/27,919.0,920.867,916.0,9000,927.0,916.0
428,2016/05/30,925.0,927.947,928.0,5700,932.0,923.0
429,2016/05/31,934.0,932.79,925.0,11900,938.0,925.0
430,2016/06/01,930.0,934.465,940.0,12700,940.0,929.0
431,2016/06/02,919.0,922.78,927.0,13200,928.0,919.0
432,2016/06/03,917.0,918.784,919.0,11100,928.0,912.0
433,2016/06/06,907.0,909.281,912.0,28100,915.0,904.0
434,2016/06/07,914.0,913.862,910.0,6500,917.0,910.0
435,2016/06/08,920.0,918.602,918.0,8800,922.0,912.0
436,2016/06/09,914.0,917.1,920.0,11000,922.0,913.0
437,2016/06/10,908.0,911.813,915.0,40000,915.0,908.0
438,2016/06/13,890.0,895.38,906.0,24200,906.0,890.0
439,2016/06/14,876.0,880.502,891.0,22700,895.0,872.0
440,2016/06/15,869.0,871.992,871.0,23600,880.0,869.0
441,2016/06/16,853.0,862.529,872.0,29500,872.0,852.0
442,2016/06/17,854.0,861.825,868.0,21100,868.0,854.0
443,2016/06/20,873.0,874.647,874.0,27200,879.0,867.0
444,2016/06/21,880.0,878.502,870.0,24300,885.0,870.0
445,2016/06/22,863.0,866.756,875.0,35700,875.0,863.0
446,2016/06/23,863.0,860.415,863.0,40500,869.0,853.0
447,2016/06/24,853.0,856.033,883.0,67600,884.0,845.0
448,2016/06/27,851.0,852.395,853.0,38500,862.0,849.0
449,2016/06/28,841.0,844.439,850.0,52200,851.0,841.0
450,2016/06/29,847.0,848.802,845.0,29300,855.0,843.0
451,2016/06/30,852.0,854.968,848.0,40200,866.0,848.0
452,2016/07/01,862.0,861.401,860.0,47100,872.0,857.0
453,2016/07/04,861.0,861.583,855.0,31900,869.0,853.0
454,2016/07/05,862.0,863.712,855.0,18400,877.0,855.0
455,2016/07/06,856.0,852.542,862.0,38200,862.0,847.0
456,2016/07/07,861.0,860.316,858.0,18700,865.0,854.0
457,2016/07/08,850.0,852.951,861.0,22500,865.0,850.0
458,2016/07/11,863.0,861.906,863.0,30800,865.0,856.0
459,2016/07/12,873.0,870.233,863.0,46700,878.0,861.0
460,2016/07/13,887.0,885.838,888.0,26500,890.0,877.0
461,2016/07/14,882.0,885.734,891.0,22200,893.0,880.0
462,2016/07/15,892.0,889.817,888.0,25100,894.0,883.0
463,2016/07/19,902.0,898.399,892.0,28300,910.0,889.0
464,2016/07/20,906.0,902.563,897.0,15100,906.0,897.0
465,2016/07/21,917.0,912.132,909.0,21200,919.0,908.0
466,2016/07/22,915.0,911.792,912.0,17800,916.0,908.0
467,2016/07/25,935.0,930.66,921.0,30900,935.0,919.0
468,2016/07/26,925.0,926.362,928.0,23200,931.0,923.0
469,2016/07/27,936.0,934.467,932.0,25900,940.0,920.0
470,2016/07/28,933.0,926.838,934.0,29700,934.0,918.0
471,2016/07/29,933.0,927.243,933.0,10300,936.0,922.0
472,2016/08/01,911.0,912.081,905.0,35800,926.0,897.0
473,2016/08/02,905.0,902.8,905.0,20000,912.0,898.0
474,2016/08/03,895.0,896.813,892.0,19200,902.0,892.0
475,2016/08/04,905.0,899.7,895.0,17000,907.0,894.0
476,2016/08/05,904.0,907.274,909.0,9500,915.0,901.0
477,2016/08/08,916.0,911.674,912.0,9800,916.0,905.0
478,2016/08/09,910.0,907.697,918.0,9900,918.0,902.0
479,2016/08/10,915.0,910.521,905.0,9600,915.0,903.0
480,2016/08/12,921.0,920.16,918.0,21200,925.0,913.0
481,2016/08/15,916.0,917.752,923.0,10500,923.0,911.0
482,2016/08/16,903.0,908.929,916.0,19700,917.0,902.0
483,2016/08/17,897.0,897.4,893.0,35500,906.0,893.0
484,2016/08/18,890.0,891.696,893.0,18100,896.0,890.0
485,2016/08/19,892.0,893.333,889.0,15000,900.0,888.0
486,2016/08/22,894.0,896.436,900.0,9400,900.0,893.0
487,2016/08/23,884.0,886.67,889.0,20300,893.0,882.0
488,2016/08/24,888.0,891.574,890.0,6100,896.0,888.0
489,2016/08/25,890.0,892.056,888.0,8900,899.0,888.0
490,2016/08/26,895.0,888.505,894.0,28300,895.0,881.0
491,2016/08/29,905.0,902.324,900.0,13900,905.0,897.0
492,2016/08/30,904.0,904.375,906.0,8800,906.0,902.0
493,2016/08/31,909.0,905.8,907.0,17500,909.0,900.0
494,2016/09/01,911.0,911.56,913.0,10900,916.0,908.0
495,2016/09/02,906.0,905.338,911.0,15100,911.0,901.0
496,2016/09/05,908.0,909.327,912.0,11000,912.0,906.0
497,2016/09/06,913.0,913.229,908.0,14000,916.0,908.0
498,2016/09/07,912.0,912.288,914.0,14600,914.0,910.0
499,2016/09/08,913.0,912.654,914.0,12700,916.0,910.0
500,2016/09/09,912.0,911.295,910.0,25100,915.0,910.0
501,2016/09/12,907.0,906.173,905.0,18500,910.0,904.0
502,2016/09/13,908.0,908.786,912.0,15400,916.0,907.0
503,2016/09/14,905.0,904.581,904.0,20300,909.0,903.0
504,2016/09/15,899.0,900.164,903.0,17700,903.0,899.0
505,2016/09/16,890.0,897.029,894.0,44600,908.0,890.0
506,2016/09/20,893.0,897.236,895.0,28400,908.0,893.0
507,2016/09/21,902.0,897.002,900.0,46600,910.0,891.0
508,2016/09/23,919.0,913.247,905.0,35600,919.0,897.0
509,2016/09/26,922.0,922.055,919.0,31200,928.0,917.0
510,2016/09/27,935.0,926.921,925.0,38000,935.0,917.0
511,2016/09/28,920.0,917.188,920.0,17000,927.0,907.0
512,2016/09/29,937.0,931.134,914.0,21600,938.0,914.0
513,2016/09/30,926.0,925.913,924.0,15000,932.0,922.0
514,2016/10/03,920.0,927.23,941.0,20400,941.0,919.0
515,2016/10/04,928.0,927.231,926.0,14300,931.0,922.0
516,2016/10/05,933.0,929.621,930.0,21100,933.0,925.0
517,2016/10/06,933.0,934.266,939.0,16900,939.0,929.0
518,2016/10/07,933.0,927.918,930.0,14600,934.0,919.0
519,2016/10/11,926.0,927.555,930.0,24700,932.0,923.0
520,2016/10/12,920.0,920.825,919.0,17100,925.0,919.0
521,2016/10/13,921.0,917.409,918.0,28600,925.0,910.0
522,2016/10/14,922.0,918.792,918.0,10100,922.0,915.0
523,2016/10/17,916.0,918.617,923.0,23500,924.0,912.0
524,2016/10/18,929.0,921.385,918.0,17400,930.0,915.0
525,2016/10/19,935.0,934.146,933.0,24700,937.0,931.0
526,2016/10/20,937.0,936.713,935.0,20200,940.0,935.0
527,2016/10/21,941.0,940.449,939.0,21400,942.0,939.0
528,2016/10/24,942.0,943.271,943.0,24000,947.0,941.0
529,2016/10/25,944.0,943.47,944.0,25100,946.0,942.0
530,2016/10/26,952.0,950.865,950.0,29600,954.0,946.0
531,2016/10/27,952.0,952.93,952.0,19900,956.0,950.0
532,2016/10/28,964.0,961.092,956.0,95200,965.0,953.0
533,2016/10/31,975.0,969.009,962.0,80200,985.0,958.0
534,2016/11/01,930.0,934.853,945.0,134900,952.0,922.0
535,2016/11/02,933.0,932.813,925.0,61500,941.0,924.0
536,2016/11/04,934.0,929.108,925.0,41700,936.0,921.0
537,2016/11/07,947.0,945.955,937.0,29100,951.0,937.0
538,2016/11/08,952.0,951.391,955.0,20700,955.0,948.0
539,2016/11/09,923.0,933.352,957.0,40900,957.0,917.0
540,2016/11/10,949.0,949.553,948.0,41200,953.0,940.0
541,2016/11/11,942.0,947.037,951.0,29500,959.0,940.0
542,2016/11/14,967.0,964.584,942.0,43500,975.0,942.0
543,2016/11/15,971.0,968.523,967.0,19500,974.0,963.0
544,2016/11/16,980.0,978.69,970.0,31000,983.0,970.0
545,2016/11/17,986.0,983.99,980.0,20900,986.0,980.0
546,2016/11/18,968.0,976.56,994.0,65600,994.0,967.0
547,2016/11/21,970.0,970.923,968.0,44300,979.0,968.0
548,2016/11/22,990.0,987.324,976.0,33000,993.0,976.0
549,2016/11/24,1005.0,998.296,992.0,49700,1007.0,990.0
550,2016/11/25,1009.0,1008.034,1005.0,32000,1014.0,1004.0
551,2016/11/28,1024.0,1017.407,1003.0,27500,1027.0,1002.0
552,2016/11/29,1008.0,1008.841,1017.0,22000,1019.0,1004.0
553,2016/11/30,1004.0,1007.541,1009.0,25700,1021.0,1001.0
554,2016/12/01,1016.0,1026.129,1027.0,49600,1036.0,1014.0
555,2016/12/02,1010.0,1010.945,1016.0,18100,1016.0,1007.0
556,2016/12/05,1019.0,1016.093,1010.0,16200,1021.0,1010.0
557,2016/12/06,1019.0,1019.529,1019.0,26100,1023.0,1016.0
558,2016/12/07,1021.0,1021.767,1020.0,19700,1028.0,1019.0
559,2016/12/08,1027.0,1025.712,1025.0,48200,1029.0,1021.0
560,2016/12/09,1034.0,1030.987,1025.0,44700,1040.0,1023.0
561,2016/12/12,1037.0,1038.692,1038.0,33100,1046.0,1031.0
562,2016/12/13,1027.0,1027.93,1032.0,51400,1036.0,1007.0
563,2016/12/14,1030.0,1030.197,1024.0,20300,1035.0,1024.0
564,2016/12/15,1030.0,1029.344,1030.0,18900,1032.0,1025.0
565,2016/12/16,1022.0,1023.871,1028.0,31700,1028.0,1021.0
566,2016/12/19,1031.0,1027.48,1023.0,21900,1031.0,1023.0
567,2016/12/20,1023.0,1024.399,1029.0,27800,1034.0,1020.0
568,2016/12/21,1031.0,1029.593,1023.0,31700,1035.0,1021.0
569,2016/12/22,1034.0,1030.159,1031.0,22000,1036.0,1024.0
570,2016/12/26,1041.0,1037.96,1032.0,34800,1045.0,1029.0
571,2016/12/27,1039.0,1040.822,1045.0,30400,1045.0,1038.0
572,2016/12/28,1038.0,1036.612,1042.0,15700,1042.0,1030.0
573,2016/12/29,1033.0,1032.918,1035.0,31800,1037.0,1028.0
574,2016/12/30,1040.0,1033.066,1033.0,18300,1040.0,1022.0
575,2017/01/04,1070.0,1057.426,1041.0,43700,1076.0,1041.0
576,2017/01/05,1073.0,1079.374,1075.0,40100,1093.0,1070.0
577,2017/01/06,1072.0,1070.081,1073.0,38500,1073.0,1066.0
578,2017/01/10,1067.0,1067.316,1080.0,23100,1080.0,1062.0
579,2017/01/11,1058.0,1057.294,1062.0,32300,1063.0,1051.0
580,2017/01/12,1046.0,1043.224,1055.0,29500,1055.0,1031.0
581,2017/01/13,1039.0,1036.075,1040.0,21400,1041.0,1026.0
582,2017/01/16,1036.0,1034.928,1045.0,19400,1050.0,1025.0
583,2017/01/17,1027.0,1026.892,1025.0,15800,1030.0,1021.0
584,2017/01/18,1031.0,1024.303,1030.0,21100,1031.0,1016.0
585,2017/01/19,1031.0,1029.489,1030.0,13500,1037.0,1022.0
586,2017/01/20,1035.0,1030.187,1031.0,16600,1036.0,1020.0
587,2017/01/23,1028.0,1030.117,1033.0,12800,1035.0,1025.0
588,2017/01/24,1025.0,1023.699,1023.0,9300,1030.0,1019.0
589,2017/01/25,1020.0,1022.233,1029.0,18000,1032.0,1018.0
590,2017/01/26,1027.0,1027.325,1031.0,24000,1031.0,1022.0
591,2017/01/27,1024.0,1026.814,1037.0,17700,1037.0,1021.0
592,2017/01/30,1028.0,1024.953,1024.0,25300,1032.0,1020.0
593,2017/01/31,1026.0,1024.632,1022.0,15200,1029.0,1021.0
594,2017/02/01,1033.0,1031.754,1032.0,18300,1034.0,1028.0
595,2017/02/02,1027.0,1025.477,1034.0,38800,1034.0,1021.0
596,2017/02/03,1022.0,1025.325,1025.0,11700,1029.0,1022.0
597,2017/02/06,1028.0,1026.328,1029.0,18000,1030.0,1022.0
598,2017/02/07,1022.0,1022.878,1021.0,24600,1027.0,1020.0
599,2017/02/08,1024.0,1022.467,1024.0,18200,1026.0,1020.0
600,2017/02/09,1029.0,1026.856,1024.0,13200,1033.0,1021.0
601,2017/02/10,1035.0,1032.939,1037.0,22800,1038.0,1021.0
602,2017/02/13,1044.0,1042.643,1040.0,30000,1048.0,1040.0
603,2017/02/14,1053.0,1057.319,1059.0,32600,1065.0,1050.0
604,2017/02/15,1069.0,1062.228,1062.0,21500,1072.0,1050.0
605,2017/02/16,1070.0,1074.783,1069.0,22600,1080.0,1069.0
606,2017/02/17,1076.0,1076.868,1070.0,25700,1081.0,1070.0
607,2017/02/20,1077.0,1078.555,1080.0,19100,1081.0,1075.0
608,2017/02/21,1086.0,1086.597,1080.0,18100,1091.0,1079.0
609,2017/02/22,1108.0,1097.077,1091.0,39200,1110.0,1085.0
610,2017/02/23,1111.0,1111.168,1114.0,22000,1114.0,1105.0
611,2017/02/24,1120.0,1117.572,1111.0,16600,1130.0,1108.0
612,2017/02/27,1113.0,1113.425,1121.0,33900,1123.0,1105.0
613,2017/02/28,1120.0,1125.73,1114.0,34100,1133.0,1114.0
614,2017/03/01,1125.0,1122.467,1123.0,12000,1127.0,1118.0
615,2017/03/02,1122.0,1124.042,1125.0,21300,1129.0,1119.0
616,2017/03/03,1117.0,1119.047,1122.0,29700,1130.0,1103.0
617,2017/03/06,1115.0,1110.157,1117.0,19700,1120.0,1096.0
618,2017/03/07,1096.0,1098.079,1107.0,21500,1107.0,1095.0
619,2017/03/08,1095.0,1092.8,1102.0,31000,1102.0,1084.0
620,2017/03/09,1094.0,1096.444,1095.0,23200,1104.0,1083.0
621,2017/03/10,1099.0,1094.4,1091.0,39800,1102.0,1085.0
622,2017/03/13,1091.0,1092.629,1091.0,24000,1104.0,1090.0
623,2017/03/14,1088.0,1091.224,1099.0,22300,1099.0,1088.0
624,2017/03/15,1086.0,1087.357,1088.0,12900,1090.0,1084.0
625,2017/03/16,1086.0,1085.757,1086.0,18900,1097.0,1080.0
626,2017/03/17,1082.0,1082.59,1082.0,8300,1084.0,1080.0
627,2017/03/21,1094.0,1090.728,1085.0,20200,1096.0,1085.0
628,2017/03/22,1083.0,1084.414,1085.0,32600,1091.0,1080.0
629,2017/03/23,1091.0,1089.748,1084.0,15500,1096.0,1082.0
630,2017/03/24,1093.0,1093.671,1091.0,28900,1102.0,1086.0
631,2017/03/27,1081.0,1083.685,1094.0,29800,1094.0,1080.0
632,2017/03/28,1095.0,1090.761,1091.0,35500,1095.0,1082.0
633,2017/03/29,1073.0,1074.696,1090.0,16100,1090.0,1070.0
634,2017/03/30,1060.0,1063.821,1074.0,22900,1076.0,1059.0
635,2017/03/31,1031.0,1047.504,1060.0,36300,1068.0,1031.0
636,2017/04/03,1034.0,1033.426,1031.0,28900,1040.0,1026.0
637,2017/04/04,1032.0,1032.08,1041.0,16300,1041.0,1027.0
638,2017/04/05,1019.0,1023.022,1032.0,22700,1035.0,1016.0
639,2017/04/06,1006.0,1011.679,1019.0,26800,1019.0,1005.0
640,2017/04/07,1009.0,1011.214,1007.0,21500,1023.0,1005.0
641,2017/04/10,1017.0,1011.605,1003.0,12400,1019.0,1003.0
642,2017/04/11,1002.0,1005.243,1008.0,22600,1015.0,1001.0
643,2017/04/12,982.0,988.625,1001.0,33100,1001.0,980.0
644,2017/04/13,978.0,978.108,980.0,17600,982.0,974.0
645,2017/04/14,976.0,976.852,979.0,15500,982.0,975.0
646,2017/04/17,985.0,981.918,980.0,12200,986.0,978.0
647,2017/04/18,985.0,986.77,986.0,17800,996.0,981.0
648,2017/04/19,991.0,995.183,991.0,20800,1000.0,990.0
649,2017/04/20,992.0,994.321,993.0,14000,999.0,992.0
650,2017/04/21,1000.0,997.318,992.0,26400,1000.0,992.0
651,2017/04/24,1007.0,1004.913,1000.0,46000,1015.0,1000.0
652,2017/04/25,1146.0,1153.368,1127.0,824600,1217.0,1110.0
653,2017/04/26,1191.0,1170.824,1149.0,291900,1195.0,1148.0
654,2017/04/27,1191.0,1184.535,1190.0,136200,1195.0,1170.0
655,2017/04/28,1190.0,1185.94,1187.0,75500,1196.0,1174.0
656,2017/05/01,1360.0,1314.305,1279.0,541400,1363.0,1265.0
657,2017/05/02,1390.0,1370.745,1369.0,361900,1394.0,1348.0
658,2017/05/08,1410.0,1411.414,1404.0,205300,1434.0,1395.0
659,2017/05/09,1381.0,1389.784,1404.0,161900,1408.0,1373.0
660,2017/05/10,1382.0,1383.825,1381.0,123100,1399.0,1375.0
661,2017/05/11,1376.0,1379.446,1396.0,110000,1396.0,1369.0
662,2017/05/12,1359.0,1363.226,1361.0,105800,1378.0,1354.0
663,2017/05/15,1332.0,1341.074,1346.0,90900,1358.0,1328.0
664,2017/05/16,1344.0,1347.627,1338.0,79700,1360.0,1337.0
665,2017/05/17,1372.0,1362.407,1340.0,133200,1383.0,1317.0
666,2017/05/18,1388.0,1372.603,1342.0,195400,1390.0,1333.0
667,2017/05/19,1386.0,1385.657,1374.0,146100,1399.0,1371.0
668,2017/05/22,1382.0,1389.388,1400.0,131900,1409.0,1378.0
669,2017/05/23,1420.0,1414.731,1396.0,178600,1431.0,1395.0
670,2017/05/24,1453.0,1441.281,1434.0,150100,1455.0,1418.0
671,2017/05/25,1455.0,1449.543,1453.0,91000,1464.0,1425.0
672,2017/05/26,1404.0,1421.968,1453.0,117300,1453.0,1401.0
673,2017/05/29,1389.0,1400.369,1404.0,82100,1414.0,1389.0
674,2017/05/30,1382.0,1383.94,1390.0,61800,1400.0,1375.0
675,2017/05/31,1394.0,1386.904,1382.0,75000,1397.0,1376.0
676,2017/06/01,1383.0,1386.994,1394.0,68500,1398.0,1381.0
677,2017/06/02,1385.0,1389.388,1397.0,124600,1397.0,1381.0
678,2017/06/05,1381.0,1374.687,1385.0,107700,1386.0,1355.0
679,2017/06/06,1406.0,1401.503,1386.0,122500,1416.0,1377.0
680,2017/06/07,1441.0,1430.071,1406.0,131600,1447.0,1402.0
681,2017/06/08,1452.0,1461.078,1435.0,223100,1487.0,1433.0
682,2017/06/09,1424.0,1436.758,1428.0,124100,1462.0,1417.0
683,2017/06/12,1398.0,1403.689,1416.0,81700,1420.0,1396.0
684,2017/06/13,1409.0,1408.122,1398.0,67300,1416.0,1392.0
685,2017/06/14,1406.0,1431.317,1420.0,88600,1448.0,1406.0
686,2017/06/15,1392.0,1403.751,1406.0,66200,1415.0,1391.0
687,2017/06/16,1391.0,1397.858,1411.0,85400,1415.0,1391.0
688,2017/06/19,1394.0,1397.925,1398.0,41100,1403.0,1393.0
689,2017/06/20,1424.0,1417.204,1397.0,63700,1428.0,1397.0
690,2017/06/21,1396.0,1410.219,1422.0,48400,1425.0,1396.0
691,2017/06/22,1404.0,1402.642,1409.0,58100,1411.0,1391.0
692,2017/06/23,1395.0,1404.679,1405.0,67600,1417.0,1388.0
693,2017/06/26,1393.0,1396.863,1400.0,44600,1406.0,1387.0
694,2017/06/27,1409.0,1403.898,1400.0,44300,1409.0,1388.0
695,2017/06/28,1405.0,1400.475,1399.0,65300,1409.0,1390.0
696,2017/06/29,1436.0,1426.945,1408.0,60200,1438.0,1408.0
697,2017/06/30,1422.0,1415.62,1412.0,52400,1423.0,1407.0
698,2017/07/03,1436.0,1442.84,1437.0,74800,1456.0,1424.0
699,2017/07/04,1404.0,1422.59,1452.0,89500,1452.0,1400.0
700,2017/07/05,1434.0,1424.432,1407.0,59100,1438.0,1407.0
701,2017/07/06,1467.0,1453.556,1439.0,85500,1470.0,1431.0
702,2017/07/07,1458.0,1469.245,1457.0,112000,1484.0,1448.0
703,2017/07/10,1460.0,1464.45,1456.0,82000,1473.0,1455.0
704,2017/07/11,1477.0,1473.639,1459.0,75600,1483.0,1459.0
705,2017/07/12,1462.0,1464.865,1462.0,69100,1475.0,1456.0
706,2017/07/13,1462.0,1475.561,1462.0,88400,1492.0,1462.0
707,2017/07/14,1463.0,1472.852,1465.0,71100,1486.0,1462.0
708,2017/07/18,1470.0,1469.872,1468.0,175600,1485.0,1456.0
709,2017/07/19,1478.0,1489.461,1470.0,149400,1509.0,1461.0
710,2017/07/20,1474.0,1479.637,1479.0,78700,1493.0,1467.0
711,2017/07/21,1470.0,1473.052,1474.0,65900,1483.0,1466.0
712,2017/07/24,1456.0,1454.859,1470.0,102500,1470.0,1446.0
713,2017/07/25,1456.0,1456.484,1456.0,86400,1474.0,1446.0
714,2017/07/26,1452.0,1453.934,1465.0,120500,1471.0,1444.0
715,2017/07/27,1439.0,1444.175,1450.0,113200,1456.0,1434.0
716,2017/07/28,1474.0,1463.262,1440.0,129600,1482.0,1432.0
717,2017/07/31,1486.0,1489.589,1483.0,144200,1506.0,1478.0
718,2017/08/01,1551.0,1559.282,1530.0,486100,1595.0,1521.0
719,2017/08/02,1590.0,1576.755,1559.0,137300,1595.0,1550.0
720,2017/08/03,1568.0,1570.095,1590.0,107300,1590.0,1557.0
721,2017/08/04,1568.0,1559.314,1566.0,149100,1573.0,1535.0
722,2017/08/07,1584.0,1584.149,1570.0,173600,1598.0,1561.0
723,2017/08/08,1588.0,1589.451,1584.0,94500,1604.0,1564.0
724,2017/08/09,1560.0,1552.981,1576.0,139400,1577.0,1531.0
725,2017/08/10,1576.0,1572.917,1560.0,89100,1587.0,1553.0
726,2017/08/14,1567.0,1562.983,1572.0,122200,1583.0,1547.0
727,2017/08/15,1555.0,1569.986,1568.0,76000,1587.0,1554.0
728,2017/08/16,1556.0,1554.866,1556.0,117400,1566.0,1537.0
729,2017/08/17,1584.0,1577.3,1558.0,101400,1592.0,1558.0
730,2017/08/18,1560.0,1559.052,1558.0,90900,1571.0,1551.0
731,2017/08/21,1558.0,1556.069,1562.0,36300,1566.0,1548.0
732,2017/08/22,1561.0,1564.147,1558.0,37500,1571.0,1550.0
733,2017/08/23,1554.0,1558.335,1564.0,50800,1574.0,1547.0
734,2017/08/24,1568.0,1568.433,1554.0,65200,1581.0,1552.0
735,2017/08/25,1573.0,1570.683,1568.0,66600,1583.0,1561.0
736,2017/08/28,1565.0,1566.136,1573.0,58800,1579.0,1552.0
737,2017/08/29,1591.0,1580.478,1563.0,102800,1596.0,1550.0
738,2017/08/30,1619.0,1609.2,1594.0,116800,1626.0,1594.0
739,2017/08/31,1623.0,1629.952,1630.0,103900,1650.0,1614.0
740,2017/09/01,1634.0,1622.585,1626.0,58800,1637.0,1610.0
741,2017/09/04,1555.0,1575.381,1634.0,127500,1634.0,1546.0
742,2017/09/05,1489.0,1506.67,1560.0,154000,1562.0,1477.0
743,2017/09/06,1497.0,1489.136,1478.0,84900,1512.0,1461.0
744,2017/09/07,1516.0,1519.276,1514.0,63100,1535.0,1504.0
745,2017/09/08,1515.0,1517.042,1516.0,59600,1532.0,1507.0
746,2017/09/11,1540.0,1542.542,1531.0,82700,1556.0,1528.0
747,2017/09/12,1573.0,1574.715,1543.0,86300,1587.0,1543.0
748,2017/09/13,1585.0,1591.927,1585.0,62000,1609.0,1579.0
749,2017/09/14,1620.0,1611.704,1590.0,106200,1623.0,1590.0
750,2017/09/15,1642.0,1638.49,1618.0,124900,1652.0,1618.0
751,2017/09/19,1670.0,1675.361,1659.0,113300,1690.0,1659.0
752,2017/09/20,1663.0,1673.65,1677.0,73100,1690.0,1659.0
753,2017/09/21,1651.0,1649.365,1655.0,83800,1660.0,1637.0
754,2017/09/22,1648.0,1652.378,1641.0,83300,1684.0,1637.0
755,2017/09/25,1667.0,1669.923,1660.0,73000,1682.0,1657.0
756,2017/09/26,1663.0,1665.348,1652.0,69900,1679.0,1650.0
757,2017/09/27,1660.0,1660.627,1659.0,97400,1674.0,1642.0
758,2017/09/28,1704.0,1688.967,1689.0,120800,1705.0,1670.0
759,2017/09/29,1704.0,1699.669,1700.0,87000,1714.0,1690.0
760,2017/10/02,1718.0,1719.156,1712.0,77100,1731.0,1706.0
761,2017/10/03,1734.0,1730.492,1730.0,104000,1740.0,1718.0
762,2017/10/04,1738.0,1733.65,1734.0,103800,1742.0,1716.0
763,2017/10/05,1710.0,1727.608,1740.0,81700,1752.0,1706.0
764,2017/10/06,1694.0,1703.095,1710.0,54800,1727.0,1689.0
765,2017/10/10,1718.0,1703.761,1691.0,75800,1718.0,1685.0
766,2017/10/11,1715.0,1716.392,1704.0,58400,1726.0,1704.0
767,2017/10/12,1720.0,1717.387,1715.0,36200,1724.0,1709.0
768,2017/10/13,1731.0,1730.81,1730.0,64800,1742.0,1716.0
769,2017/10/16,1704.0,1721.513,1737.0,69200,1745.0,1701.0
770,2017/10/17,1707.0,1704.155,1701.0,49000,1715.0,1695.0
771,2017/10/18,1720.0,1707.077,1719.0,62500,1720.0,1687.0
772,2017/10/19,1713.0,1710.593,1716.0,44500,1719.0,1698.0
773,2017/10/20,1687.0,1691.47,1696.0,34700,1698.0,1686.0
774,2017/10/23,1705.0,1703.903,1702.0,47400,1711.0,1692.0
775,2017/10/24,1733.0,1723.009,1713.0,69200,1733.0,1705.0
776,2017/10/25,1721.0,1728.027,1743.0,73600,1747.0,1712.0
777,2017/10/26,1703.0,1704.353,1715.0,47300,1720.0,1696.0
778,2017/10/27,1722.0,1712.315,1705.0,45700,1723.0,1699.0
779,2017/10/30,1716.0,1723.202,1738.0,203700,1754.0,1708.0
780,2017/10/31,1746.0,1727.335,1712.0,137200,1750.0,1695.0
781,2017/11/01,1720.0,1726.906,1768.0,224800,1772.0,1698.0
782,2017/11/02,1727.0,1720.455,1748.0,108700,1748.0,1688.0
783,2017/11/06,1732.0,1724.722,1732.0,100400,1740.0,1705.0
784,2017/11/07,1764.0,1771.781,1733.0,132100,1796.0,1725.0
785,2017/11/08,1810.0,1778.583,1770.0,150500,1810.0,1730.0
786,2017/11/09,1824.0,1821.513,1810.0,197700,1844.0,1790.0
787,2017/11/10,1791.0,1812.426,1802.0,125200,1839.0,1787.0
788,2017/11/13,1787.0,1799.621,1808.0,52300,1818.0,1785.0
789,2017/11/14,1791.0,1794.401,1799.0,80000,1809.0,1786.0
790,2017/11/15,1731.0,1768.967,1809.0,104500,1818.0,1731.0
791,2017/11/16,1774.0,1765.474,1711.0,79200,1795.0,1701.0
792,2017/11/17,1774.0,1799.442,1800.0,78900,1830.0,1773.0
793,2017/11/20,1763.0,1778.726,1764.0,66500,1804.0,1763.0
794,2017/11/21,1801.0,1811.391,1793.0,99000,1828.0,1785.0
795,2017/11/22,1769.0,1786.493,1815.0,53100,1818.0,1769.0
796,2017/11/24,1757.0,1766.008,1779.0,53000,1779.0,1757.0
797,2017/11/27,1889.0,1917.396,1974.0,290500,1985.0,1876.0
798,2017/11/28,1829.0,1853.209,1911.0,150400,1911.0,1829.0
799,2017/11/29,1818.0,1824.741,1842.0,91800,1850.0,1810.0
800,2017/11/30,1916.0,1885.267,1830.0,147800,1928.0,1816.0
801,2017/12/01,1899.0,1893.919,1925.0,91600,1925.0,1872.0
802,2017/12/04,1889.0,1911.256,1925.0,77000,1948.0,1887.0
803,2017/12/05,1847.0,1850.154,1872.0,65600,1872.0,1830.0
804,2017/12/06,1855.0,1856.714,1844.0,72400,1877.0,1835.0
805,2017/12/07,1879.0,1886.437,1873.0,54500,1905.0,1864.0
806,2017/12/08,1891.0,1887.436,1886.0,82800,1902.0,1876.0
807,2017/12/11,1883.0,1879.337,1906.0,40100,1909.0,1865.0
808,2017/12/12,1878.0,1874.008,1884.0,53100,1894.0,1858.0
809,2017/12/13,1865.0,1876.614,1881.0,45300,1897.0,1858.0
810,2017/12/14,1873.0,1873.327,1879.0,37600,1889.0,1862.0
811,2017/12/15,1867.0,1859.35,1874.0,58000,1874.0,1843.0
812,2017/12/18,1892.0,1895.522,1874.0,69300,1909.0,1874.0
813,2017/12/19,1870.0,1875.929,1895.0,35100,1896.0,1864.0
814,2017/12/20,1904.0,1888.816,1870.0,61500,1905.0,1864.0
815,2017/12/21,1926.0,1920.639,1910.0,76100,1930.0,1898.0
816,2017/12/22,1921.0,1924.217,1940.0,46200,1940.0,1910.0
817,2017/12/25,1933.0,1921.292,1930.0,30800,1934.0,1903.0
818,2017/12/26,1930.0,1929.653,1933.0,41200,1947.0,1918.0
819,2017/12/27,1924.0,1921.36,1930.0,38900,1933.0,1912.0
820,2017/12/28,1970.0,1967.341,1936.0,134700,1985.0,1932.0
821,2017/12/29,1939.0,1938.293,1960.0,45700,1962.0,1928.0
822,2018/01/04,1960.0,1947.011,1931.0,66600,1963.0,1926.0
823,2018/01/05,1959.0,1958.861,1970.0,48100,1970.0,1944.0
824,2018/01/09,1951.0,1956.993,1970.0,45400,1978.0,1946.0
825,2018/01/10,1941.0,1940.705,1952.0,41000,1954.0,1931.0
826,2018/01/11,1995.0,1976.297,1948.0,103300,2000.0,1935.0
827,2018/01/12,1998.0,1988.889,1995.0,90300,2008.0,1967.0
828,2018/01/15,2012.0,2008.805,1999.0,63500,2023.0,1995.0
829,2018/01/16,2006.0,2004.081,2017.0,34600,2017.0,1996.0
830,2018/01/17,1987.0,1985.024,1989.0,67200,2006.0,1968.0
831,2018/01/18,1968.0,1982.098,1987.0,67300,2004.0,1967.0
832,2018/01/19,1964.0,1969.143,1964.0,52500,1986.0,1955.0
833,2018/01/22,1996.0,1995.251,2000.0,68200,2006.0,1975.0
834,2018/01/23,2013.0,2011.228,2025.0,54400,2028.0,1998.0
835,2018/01/24,2001.0,2007.81,2020.0,52500,2030.0,1992.0
836,2018/01/25,1969.0,1977.782,2000.0,61900,2000.0,1960.0
837,2018/01/26,1968.0,1975.958,1980.0,47300,1992.0,1964.0
838,2018/01/29,1960.0,1950.344,1968.0,93000,1968.0,1888.0
839,2018/01/30,1928.0,1937.107,1957.0,53400,1959.0,1919.0
840,2018/01/31,1958.0,1960.171,1922.0,102100,1994.0,1898.0
841,2018/02/01,1979.0,1956.345,1958.0,86900,1985.0,1925.0
842,2018/02/02,1961.0,1957.905,1979.0,44300,1984.0,1930.0
843,2018/02/05,1874.0,1871.97,1912.0,114600,1912.0,1844.0
844,2018/02/06,1697.0,1686.755,1634.0,137200,1764.0,1625.0
845,2018/02/07,1709.0,1740.172,1769.0,66200,1775.0,1708.0
846,2018/02/08,1704.0,1708.115,1709.0,54000,1733.0,1690.0
847,2018/02/09,1662.0,1646.329,1624.0,85100,1665.0,1615.0
848,2018/02/13,1658.0,1662.478,1701.0,132500,1713.0,1635.0
849,2018/02/14,1466.0,1490.346,1518.0,273000,1553.0,1462.0
850,2018/02/15,1482.0,1483.319,1476.0,156600,1502.0,1467.0
851,2018/02/16,1513.0,1512.354,1500.0,79100,1530.0,1482.0
852,2018/02/19,1615.0,1598.031,1575.0,107200,1620.0,1558.0
853,2018/02/20,1619.0,1595.736,1603.0,94000,1621.0,1570.0
854,2018/02/21,1632.0,1621.537,1605.0,52100,1634.0,1591.0
855,2018/02/22,1639.0,1628.252,1630.0,55500,1642.0,1602.0
856,2018/02/23,1674.0,1660.761,1638.0,69000,1677.0,1629.0
857,2018/02/26,1700.0,1695.37,1700.0,72200,1713.0,1672.0
858,2018/02/27,1728.0,1714.791,1700.0,59200,1739.0,1689.0
859,2018/02/28,1720.0,1735.106,1720.0,66900,1757.0,1709.0
860,2018/03/01,1691.0,1683.471,1690.0,91500,1700.0,1671.0
861,2018/03/02,1664.0,1670.871,1651.0,103000,1690.0,1651.0
862,2018/03/05,1625.0,1644.714,1670.0,139700,1682.0,1610.0
863,2018/03/06,1630.0,1639.092,1652.0,69800,1673.0,1624.0
864,2018/03/07,1610.0,1611.843,1629.0,121000,1630.0,1590.0
865,2018/03/08,1614.0,1610.666,1610.0,103200,1620.0,1593.0
866,2018/03/09,1604.0,1616.724,1618.0,70300,1649.0,1596.0
867,2018/03/12,1619.0,1618.814,1629.0,62500,1649.0,1602.0
868,2018/03/13,1650.0,1632.479,1603.0,55800,1650.0,1603.0
869,2018/03/14,1636.0,1643.532,1632.0,32500,1658.0,1631.0
870,2018/03/15,1636.0,1633.445,1632.0,47900,1647.0,1624.0
871,2018/03/16,1634.0,1636.164,1656.0,48200,1656.0,1626.0
872,2018/03/19,1617.0,1622.173,1640.0,50400,1645.0,1606.0
873,2018/03/20,1598.0,1597.623,1599.0,33400,1607.0,1584.0
874,2018/03/22,1586.0,1591.337,1618.0,50800,1618.0,1582.0
875,2018/03/23,1516.0,1525.657,1550.0,67300,1551.0,1509.0
876,2018/03/26,1519.0,1507.732,1508.0,76000,1520.0,1490.0
877,2018/03/27,1576.0,1566.564,1535.0,65600,1581.0,1529.0
878,2018/03/28,1548.0,1543.339,1545.0,62500,1558.0,1533.0
879,2018/03/29,1553.0,1545.835,1560.0,89500,1561.0,1534.0
880,2018/03/30,1562.0,1558.903,1582.0,91800,1590.0,1543.0
881,2018/04/02,1575.0,1595.78,1642.0,452500,1666.0,1549.0
882,2018/04/03,1543.0,1540.401,1535.0,135700,1549.0,1526.0
883,2018/04/04,1573.0,1572.958,1575.0,109900,1590.0,1553.0
884,2018/04/05,1581.0,1572.527,1588.0,149000,1588.0,1562.0
885,2018/04/06,1628.0,1617.051,1585.0,157600,1639.0,1585.0
886,2018/04/09,1607.0,1615.354,1618.0,100700,1637.0,1599.0
887,2018/04/10,1656.0,1635.691,1612.0,104200,1660.0,1606.0
888,2018/04/11,1661.0,1660.045,1662.0,99700,1678.0,1634.0
889,2018/04/12,1645.0,1651.417,1661.0,48900,1663.0,1644.0
890,2018/04/13,1672.0,1673.338,1659.0,81600,1688.0,1655.0
891,2018/04/16,1648.0,1655.582,1675.0,54300,1687.0,1641.0
892,2018/04/17,1612.0,1623.948,1650.0,54200,1663.0,1601.0
893,2018/04/18,1627.0,1628.804,1624.0,53100,1648.0,1608.0
894,2018/04/19,1637.0,1646.934,1628.0,67000,1663.0,1628.0
895,2018/04/20,1631.0,1633.867,1657.0,51800,1657.0,1624.0
896,2018/04/23,1634.0,1637.099,1631.0,25200,1648.0,1630.0
897,2018/04/24,1636.0,1635.321,1633.0,40500,1647.0,1628.0
898,2018/04/25,1639.0,1633.483,1630.0,67700,1639.0,1620.0
899,2018/04/26,1632.0,1633.738,1637.0,69800,1646.0,1622.0
900,2018/04/27,1606.0,1611.063,1632.0,92200,1636.0,1596.0
901,2018/05/01,1893.0,1876.545,1726.0,750100,1970.0,1721.0
902,2018/05/02,1892.0,1888.428,1867.0,200800,1908.0,1853.0
903,2018/05/07,1850.0,1856.25,1892.0,67200,1892.0,1846.0
904,2018/05/08,1855.0,1855.549,1840.0,65600,1871.0,1837.0
905,2018/05/09,1834.0,1850.886,1861.0,84500,1885.0,1831.0
906,2018/05/10,1856.0,1855.06,1837.0,34800,1864.0,1837.0
907,2018/05/11,1873.0,1869.637,1852.0,50400,1879.0,1852.0
908,2018/05/14,1865.0,1864.329,1862.0,33700,1875.0,1853.0
909,2018/05/15,1866.0,1862.562,1863.0,53400,1872.0,1855.0
910,2018/05/16,1867.0,1858.112,1851.0,40200,1870.0,1839.0
911,2018/05/17,1851.0,1853.802,1867.0,68600,1874.0,1844.0
912,2018/05/18,1859.0,1856.903,1853.0,58500,1868.0,1843.0
913,2018/05/21,1866.0,1862.919,1864.0,33200,1869.0,1853.0
914,2018/05/22,1856.0,1849.689,1866.0,57900,1866.0,1835.0
915,2018/05/23,1828.0,1835.049,1860.0,30400,1862.0,1827.0
916,2018/05/24,1796.0,1797.911,1825.0,67600,1828.0,1782.0
917,2018/05/25,1776.0,1779.428,1783.0,45300,1797.0,1767.0
918,2018/05/28,1781.0,1780.126,1773.0,43600,1790.0,1765.0
919,2018/05/29,1752.0,1751.055,1766.0,49300,1768.0,1733.0
920,2018/05/30,1714.0,1720.864,1723.0,30200,1738.0,1710.0
921,2018/05/31,1708.0,1711.435,1724.0,23000,1734.0,1702.0
922,2018/06/01,1711.0,1707.684,1689.0,45200,1721.0,1687.0
923,2018/06/04,1716.0,1713.237,1715.0,49300,1727.0,1704.0
924,2018/06/05,1734.0,1719.613,1720.0,63600,1738.0,1703.0
925,2018/06/06,1734.0,1733.196,1740.0,53000,1748.0,1723.0
926,2018/06/07,1771.0,1759.461,1734.0,53400,1775.0,1732.0
927,2018/06/08,1803.0,1787.126,1759.0,66600,1808.0,1759.0
928,2018/06/11,1779.0,1780.314,1806.0,28700,1815.0,1768.0
929,2018/06/12,1777.0,1774.347,1783.0,29100,1811.0,1763.0
930,2018/06/13,1771.0,1764.407,1770.0,39600,1773.0,1751.0
931,2018/06/14,1749.0,1754.969,1750.0,42000,1769.0,1738.0
932,2018/06/15,1716.0,1726.385,1766.0,51500,1766.0,1713.0
933,2018/06/18,1704.0,1715.644,1720.0,64100,1742.0,1701.0
934,2018/06/19,1660.0,1662.884,1700.0,62700,1700.0,1648.0
935,2018/06/20,1671.0,1639.277,1660.0,66000,1673.0,1606.0
936,2018/06/21,1660.0,1663.074,1654.0,47200,1679.0,1648.0
937,2018/06/22,1666.0,1644.991,1645.0,65900,1669.0,1614.0
938,2018/06/25,1641.0,1653.572,1666.0,47000,1667.0,1638.0
939,2018/06/26,1652.0,1639.875,1637.0,43300,1661.0,1606.0
940,2018/06/27,1644.0,1640.909,1650.0,29500,1655.0,1627.0
941,2018/06/28,1644.0,1623.326,1644.0,74200,1650.0,1594.0
942,2018/06/29,1650.0,1645.932,1645.0,34000,1660.0,1622.0
943,2018/07/02,1631.0,1649.752,1668.0,55600,1686.0,1630.0
944,2018/07/03,1603.0,1609.515,1631.0,50500,1633.0,1591.0
945,2018/07/04,1554.0,1563.272,1589.0,36400,1593.0,1552.0
946,2018/07/05,1525.0,1537.295,1554.0,36600,1563.0,1520.0
947,2018/07/06,1542.0,1532.424,1525.0,33500,1544.0,1515.0
948,2018/07/09,1562.0,1551.851,1542.0,24800,1566.0,1531.0
949,2018/07/10,1550.0,1555.592,1555.0,72300,1575.0,1547.0
950,2018/07/11,1560.0,1550.851,1550.0,68500,1563.0,1531.0
951,2018/07/12,1537.0,1541.505,1554.0,55900,1555.0,1532.0
952,2018/07/13,1541.0,1536.811,1536.0,75500,1550.0,1521.0
953,2018/07/17,1551.0,1554.896,1543.0,31700,1566.0,1534.0
954,2018/07/18,1559.0,1557.359,1555.0,40900,1566.0,1544.0
955,2018/07/19,1579.0,1572.757,1560.0,36200,1583.0,1558.0
956,2018/07/20,1561.0,1564.04,1566.0,47400,1583.0,1557.0
957,2018/07/23,1541.0,1544.876,1541.0,44500,1558.0,1532.0
958,2018/07/24,1554.0,1544.547,1542.0,36400,1560.0,1530.0
959,2018/07/25,1553.0,1553.965,1555.0,28900,1570.0,1547.0
960,2018/07/26,1562.0,1560.289,1554.0,46000,1571.0,1551.0
961,2018/07/27,1588.0,1579.72,1562.0,37900,1590.0,1558.0
962,2018/07/30,1578.0,1572.332,1585.0,70200,1586.0,1562.0
963,2018/07/31,1596.0,1588.763,1581.0,154300,1607.0,1563.0
964,2018/08/01,1611.0,1590.111,1572.0,185400,1614.0,1552.0
965,2018/08/02,1627.0,1630.517,1613.0,118500,1658.0,1604.0
966,2018/08/03,1593.0,1602.261,1625.0,67400,1625.0,1591.0
967,2018/08/06,1593.0,1601.337,1601.0,52600,1620.0,1592.0
968,2018/08/07,1595.0,1597.179,1593.0,60400,1609.0,1590.0
969,2018/08/08,1600.0,1596.388,1600.0,51000,1606.0,1586.0
970,2018/08/09,1635.0,1621.803,1605.0,76500,1640.0,1593.0
971,2018/08/10,1628.0,1634.129,1635.0,58800,1659.0,1626.0
972,2018/08/13,1589.0,1592.068,1611.0,55900,1614.0,1577.0
973,2018/08/14,1601.0,1597.657,1597.0,31800,1612.0,1585.0
974,2018/08/15,1556.0,1567.584,1605.0,22100,1606.0,1550.0
975,2018/08/16,1510.0,1508.098,1516.0,45800,1528.0,1497.0
976,2018/08/17,1512.0,1510.889,1511.0,19800,1523.0,1506.0
977,2018/08/20,1485.0,1491.044,1512.0,27500,1512.0,1481.0
978,2018/08/21,1475.0,1471.055,1476.0,27200,1482.0,1461.0
979,2018/08/22,1502.0,1496.83,1476.0,21800,1506.0,1472.0
980,2018/08/23,1523.0,1515.681,1509.0,16600,1525.0,1503.0
981,2018/08/24,1524.0,1525.863,1527.0,10200,1531.0,1523.0
982,2018/08/27,1569.0,1562.022,1552.0,32500,1572.0,1538.0
983,2018/08/28,1603.0,1598.073,1589.0,54800,1608.0,1588.0
984,2018/08/29,1616.0,1611.592,1603.0,22300,1619.0,1602.0
985,2018/08/30,1624.0,1622.702,1620.0,29900,1633.0,1612.0
986,2018/08/31,1632.0,1630.642,1616.0,37400,1641.0,1603.0
987,2018/09/03,1614.0,1610.174,1640.0,44800,1640.0,1590.0
988,2018/09/04,1609.0,1614.37,1614.0,24300,1638.0,1596.0
989,2018/09/05,1592.0,1593.869,1609.0,18300,1609.0,1589.0
990,2018/09/06,1594.0,1592.053,1580.0,20800,1602.0,1578.0
991,2018/09/07,1560.0,1563.767,1579.0,25300,1584.0,1557.0
992,2018/09/10,1553.0,1555.494,1560.0,16800,1569.0,1547.0
993,2018/09/11,1549.0,1547.304,1554.0,26000,1555.0,1533.0
994,2018/09/12,1519.0,1521.931,1545.0,30300,1545.0,1513.0
995,2018/09/13,1526.0,1521.703,1519.0,33700,1545.0,1506.0
996,2018/09/14,1545.0,1530.977,1514.0,61100,1554.0,1514.0
997,2018/09/18,1553.0,1551.918,1566.0,24300,1568.0,1540.0
998,2018/09/19,1586.0,1585.019,1572.0,31800,1595.0,1568.0
999,2018/09/20,1585.0,1581.853,1587.0,18300,1590.0,1570.0
1000,2018/09/21,1606.0,1604.211,1586.0,17100,1612.0,1586.0
1001,2018/09/25,1623.0,1619.106,1614.0,40600,1624.0,1600.0
1002,2018/09/26,1611.0,1611.483,1626.0,43300,1626.0,1603.0
1003,2018/09/27,1596.0,1599.478,1601.0,34500,1612.0,1582.0
1004,2018/09/28,1595.0,1596.604,1611.0,35100,1613.0,1585.0
1005,2018/10/01,1597.0,1602.61,1604.0,22300,1614.0,1594.0
1006,2018/10/02,1583.0,1595.834,1597.0,28900,1617.0,1582.0
1007,2018/10/03,1561.0,1573.049,1583.0,26500,1594.0,1561.0
1008,2018/10/04,1622.0,1609.398,1576.0,74200,1631.0,1565.0
1009,2018/10/05,1616.0,1613.803,1613.0,44700,1625.0,1604.0
1010,2018/10/09,1607.0,1609.566,1612.0,55500,1619.0,1598.0
1011,2018/10/10,1610.0,1618.945,1616.0,45500,1631.0,1608.0
1012,2018/10/11,1512.0,1525.034,1544.0,100800,1554.0,1512.0
1013,2018/10/12,1523.0,1522.495,1506.0,48500,1538.0,1505.0
1014,2018/10/15,1505.0,1509.768,1526.0,58500,1527.0,1498.0
1015,2018/10/16,1495.0,1491.589,1496.0,45000,1510.0,1479.0
1016,2018/10/17,1522.0,1524.74,1511.0,38900,1537.0,1511.0
1017,2018/10/18,1499.0,1509.89,1522.0,37100,1525.0,1499.0
1018,2018/10/19,1465.0,1468.063,1484.0,42600,1489.0,1461.0
1019,2018/10/22,1508.0,1491.194,1465.0,53200,1513.0,1453.0
1020,2018/10/23,1439.0,1458.875,1496.0,59800,1498.0,1439.0
1021,2018/10/24,1446.0,1433.027,1451.0,51700,1457.0,1416.0
1022,2018/10/25,1399.0,1399.12,1392.0,57400,1422.0,1391.0
1023,2018/10/26,1385.0,1395.781,1426.0,59000,1428.0,1375.0
1024,2018/10/29,1347.0,1362.599,1371.0,53300,1401.0,1344.0
1025,2018/10/30,1236.0,1230.58,1213.0,275800,1269.0,1209.0
1026,2018/10/31,1279.0,1264.321,1236.0,90800,1287.0,1236.0
1027,2018/11/01,1289.0,1286.736,1309.0,71600,1309.0,1278.0
1028,2018/11/02,1347.0,1332.911,1312.0,51900,1348.0,1306.0
1029,2018/11/05,1344.0,1348.222,1348.0,62700,1367.0,1334.0
1030,2018/11/06,1368.0,1375.243,1353.0,40800,1386.0,1351.0
1031,2018/11/07,1347.0,1364.647,1386.0,39900,1390.0,1340.0
1032,2018/11/08,1346.0,1350.723,1345.0,38300,1368.0,1343.0
1033,2018/11/09,1354.0,1351.575,1347.0,23500,1363.0,1335.0
1034,2018/11/12,1352.0,1345.953,1342.0,21100,1354.0,1334.0
1035,2018/11/13,1321.0,1308.467,1312.0,31500,1323.0,1293.0
1036,2018/11/14,1328.0,1325.511,1319.0,30900,1339.0,1313.0
1037,2018/11/15,1333.0,1324.833,1317.0,22200,1335.0,1309.0
1038,2018/11/16,1291.0,1294.977,1324.0,30900,1324.0,1285.0
1039,2018/11/19,1281.0,1278.698,1297.0,37400,1302.0,1266.0
1040,2018/11/20,1294.0,1285.641,1281.0,32300,1294.0,1270.0
1041,2018/11/21,1290.0,1281.27,1281.0,41500,1294.0,1265.0
1042,2018/11/22,1290.0,1287.226,1291.0,32300,1309.0,1277.0
1043,2018/11/26,1296.0,1297.105,1302.0,30600,1308.0,1280.0
1044,2018/11/27,1304.0,1299.653,1309.0,21300,1309.0,1285.0
1045,2018/11/28,1344.0,1332.351,1305.0,26800,1344.0,1305.0
1046,2018/11/29,1338.0,1339.785,1346.0,17200,1359.0,1332.0
1047,2018/11/30,1339.0,1334.506,1325.0,15800,1342.0,1324.0
1048,2018/12/03,1351.0,1356.313,1346.0,24600,1371.0,1345.0
1049,2018/12/04,1332.0,1349.317,1371.0,31900,1371.0,1328.0
1050,2018/12/05,1313.0,1314.074,1317.0,33800,1327.0,1300.0
1051,2018/12/06,1309.0,1309.412,1325.0,39300,1325.0,1298.0
1052,2018/12/07,1299.0,1294.388,1298.0,35800,1311.0,1277.0
1053,2018/12/10,1275.0,1281.377,1300.0,42700,1304.0,1269.0
1054,2018/12/11,1239.0,1258.24,1280.0,38400,1284.0,1238.0
1055,2018/12/12,1246.0,1244.002,1244.0,43500,1264.0,1235.0
1056,2018/12/13,1252.0,1250.05,1250.0,30200,1261.0,1244.0
1057,2018/12/14,1224.0,1232.721,1242.0,39400,1244.0,1215.0
1058,2018/12/17,1215.0,1222.031,1222.0,41500,1244.0,1211.0
1059,2018/12/18,1181.0,1182.758,1209.0,51200,1209.0,1175.0
1060,2018/12/19,1171.0,1167.648,1173.0,43800,1181.0,1149.0
1061,2018/12/20,1112.0,1133.669,1150.0,43200,1170.0,1106.0
1062,2018/12/21,1112.0,1102.97,1105.0,85200,1119.0,1087.0
1063,2018/12/25,1033.0,1043.304,1064.0,54900,1065.0,1029.0
1064,2018/12/26,1053.0,1050.664,1040.0,42600,1067.0,1040.0
1065,2018/12/27,1136.0,1121.684,1092.0,49600,1136.0,1092.0
1066,2018/12/28,1130.0,1126.863,1133.0,27000,1136.0,1118.0
1067,2019/01/04,1099.0,1090.928,1100.0,41700,1105.0,1069.0
1068,2019/01/07,1145.0,1142.894,1136.0,46200,1154.0,1123.0
1069,2019/01/08,1151.0,1146.159,1143.0,32100,1158.0,1134.0
1070,2019/01/09,1163.0,1159.939,1150.0,26000,1173.0,1140.0
1071,2019/01/10,1151.0,1146.255,1152.0,26700,1158.0,1132.0
1072,2019/01/11,1145.0,1140.97,1142.0,26200,1148.0,1135.0
1073,2019/01/15,1187.0,1163.767,1133.0,50100,1187.0,1130.0
1074,2019/01/16,1154.0,1163.844,1178.0,28200,1187.0,1153.0
1075,2019/01/17,1143.0,1148.819,1155.0,33100,1170.0,1139.0
1076,2019/01/18,1154.0,1153.955,1141.0,35500,1164.0,1141.0
1077,2019/01/21,1171.0,1170.174,1167.0,35100,1179.0,1162.0
1078,2019/01/22,1161.0,1162.052,1176.0,25000,1176.0,1153.0
1079,2019/01/23,1139.0,1144.686,1149.0,29000,1157.0,1132.0
1080,2019/01/24,1153.0,1150.363,1137.0,19300,1160.0,1136.0
1081,2019/01/25,1179.0,1174.029,1151.0,38100,1188.0,1147.0
1082,2019/01/28,1166.0,1177.833,1200.0,38800,1200.0,1166.0
1083,2019/01/29,1167.0,1152.885,1163.0,38400,1168.0,1139.0
1084,2019/01/30,1145.0,1150.113,1167.0,30200,1167.0,1145.0
1085,2019/01/31,1156.0,1153.907,1152.0,38500,1167.0,1142.0
1086,2019/02/01,1145.0,1153.459,1161.0,25500,1173.0,1142.0
1087,2019/02/04,1171.0,1164.925,1159.0,32000,1171.0,1150.0
1088,2019/02/05,1184.0,1180.059,1171.0,32400,1187.0,1166.0
1089,2019/02/06,1185.0,1183.539,1184.0,23200,1192.0,1174.0
1090,2019/02/07,1185.0,1177.152,1178.0,27600,1185.0,1167.0
1091,2019/02/08,1156.0,1155.19,1166.0,25800,1170.0,1146.0
1092,2019/02/12,1186.0,1183.18,1158.0,26700,1192.0,1158.0
1093,2019/02/13,1219.0,1202.755,1190.0,38800,1220.0,1180.0
1094,2019/02/14,1198.0,1196.586,1169.0,33800,1214.0,1169.0
1095,2019/02/15,1194.0,1189.167,1186.0,27500,1208.0,1172.0
1096,2019/02/18,1227.0,1224.413,1220.0,32000,1234.0,1212.0
1097,2019/02/19,1239.0,1233.749,1227.0,25100,1240.0,1222.0
1098,2019/02/20,1234.0,1232.725,1240.0,31300,1249.0,1224.0
1099,2019/02/21,1231.0,1227.429,1230.0,28000,1237.0,1212.0
1100,2019/02/22,1236.0,1229.9,1229.0,14000,1237.0,1216.0
1101,2019/02/25,1233.0,1232.457,1241.0,16400,1245.0,1227.0
1102,2019/02/26,1239.0,1236.161,1248.0,29900,1248.0,1219.0
1103,2019/02/27,1238.0,1234.301,1239.0,21300,1244.0,1226.0
1104,2019/02/28,1220.0,1224.854,1233.0,20500,1237.0,1219.0
1105,2019/03/01,1240.0,1241.559,1240.0,37900,1252.0,1226.0
1106,2019/03/04,1266.0,1255.275,1251.0,26200,1266.0,1241.0
1107,2019/03/05,1257.0,1256.026,1268.0,27300,1270.0,1246.0
1108,2019/03/06,1257.0,1256.267,1257.0,21000,1266.0,1248.0
1109,2019/03/07,1239.0,1234.25,1249.0,33600,1249.0,1224.0
1110,2019/03/08,1198.0,1207.666,1220.0,53300,1229.0,1191.0
1111,2019/03/11,1200.0,1197.443,1192.0,18500,1205.0,1190.0
1112,2019/03/12,1231.0,1228.695,1203.0,20000,1235.0,1203.0
1113,2019/03/13,1201.0,1207.513,1213.0,19900,1228.0,1200.0
1114,2019/03/14,1190.0,1195.302,1203.0,24500,1206.0,1186.0
1115,2019/03/15,1231.0,1220.961,1191.0,40600,1239.0,1188.0
1116,2019/03/18,1250.0,1237.315,1229.0,34300,1250.0,1217.0
1117,2019/03/19,1238.0,1233.827,1238.0,22500,1239.0,1220.0
1118,2019/03/20,1231.0,1230.739,1241.0,23000,1245.0,1223.0
1119,2019/03/22,1245.0,1237.432,1231.0,19200,1246.0,1226.0
1120,2019/03/25,1208.0,1204.894,1232.0,35900,1232.0,1194.0
1121,2019/03/26,1256.0,1245.792,1238.0,58100,1256.0,1227.0
1122,2019/03/27,1231.0,1226.005,1220.0,21500,1237.0,1209.0
1123,2019/03/28,1177.0,1183.432,1218.0,26400,1218.0,1175.0
1124,2019/03/29,1173.0,1178.168,1207.0,16700,1207.0,1170.0
1125,2019/04/01,1216.0,1211.84,1195.0,36900,1223.0,1195.0
1126,2019/04/02,1223.0,1221.38,1227.0,17100,1227.0,1211.0
1127,2019/04/03,1233.0,1227.773,1223.0,16700,1234.0,1206.0
1128,2019/04/04,1230.0,1228.53,1233.0,16800,1237.0,1220.0
1129,2019/04/05,1258.0,1243.669,1221.0,37800,1258.0,1221.0
1130,2019/04/08,1235.0,1237.536,1256.0,24800,1259.0,1225.0
1131,2019/04/09,1244.0,1232.991,1236.0,32600,1249.0,1214.0
1132,2019/04/10,1224.0,1216.573,1221.0,27600,1229.0,1202.0
1133,2019/04/11,1209.0,1211.363,1215.0,25900,1221.0,1197.0
1134,2019/04/12,1209.0,1205.631,1209.0,17600,1212.0,1197.0
1135,2019/04/15,1235.0,1227.931,1218.0,37700,1236.0,1213.0
1136,2019/04/16,1232.0,1231.0,1231.0,12100,1240.0,1219.0
1137,2019/04/17,1233.0,1236.658,1231.0,19900,1246.0,1227.0
1138,2019/04/18,1215.0,1216.571,1230.0,21700,1232.0,1207.0
1139,2019/04/19,1218.0,1216.475,1224.0,24400,1229.0,1210.0
1140,2019/04/22,1215.0,1213.957,1218.0,11500,1224.0,1206.0
1141,2019/04/23,1218.0,1210.65,1208.0,18300,1222.0,1196.0
1142,2019/04/24,1202.0,1209.889,1218.0,16200,1224.0,1200.0
1143,2019/04/25,1216.0,1208.584,1204.0,16100,1220.0,1193.0
1144,2019/04/26,1203.0,1200.444,1209.0,19600,1210.0,1187.0
1145,2019/05/07,1157.0,1175.875,1209.0,25500,1210.0,1157.0
1146,2019/05/08,1156.0,1159.42,1157.0,27600,1180.0,1153.0
1147,2019/05/09,1182.0,1192.258,1212.0,76900,1221.0,1178.0
1148,2019/05/10,1153.0,1168.144,1185.0,54800,1197.0,1149.0
1149,2019/05/13,1142.0,1152.404,1160.0,28200,1170.0,1141.0
1150,2019/05/14,1157.0,1140.154,1130.0,30500,1158.0,1111.0
1151,2019/05/15,1157.0,1149.838,1158.0,19700,1158.0,1131.0
1152,2019/05/16,1148.0,1145.72,1160.0,24600,1160.0,1139.0
1153,2019/05/17,1175.0,1168.054,1157.0,20500,1181.0,1150.0
1154,2019/05/20,1173.0,1171.24,1179.0,20400,1179.0,1159.0
1155,2019/05/21,1156.0,1156.076,1164.0,23700,1167.0,1148.0
1156,2019/05/22,1161.0,1163.887,1173.0,15900,1173.0,1158.0
1157,2019/05/23,1154.0,1149.611,1158.0,36500,1162.0,1134.0
1158,2019/05/24,1164.0,1152.955,1138.0,24200,1167.0,1130.0
1159,2019/05/27,1182.0,1175.358,1176.0,25700,1184.0,1162.0
1160,2019/05/28,1188.0,1188.557,1180.0,24400,1197.0,1176.0
1161,2019/05/29,1176.0,1170.147,1180.0,26600,1180.0,1160.0
1162,2019/05/30,1171.0,1166.284,1173.0,14100,1175.0,1156.0
1163,2019/05/31,1147.0,1152.343,1171.0,23600,1171.0,1145.0
1164,2019/06/03,1116.0,1122.599,1132.0,23700,1132.0,1114.0
1165,2019/06/04,1125.0,1123.23,1121.0,17400,1130.0,1112.0
1166,2019/06/05,1153.0,1147.211,1148.0,27500,1154.0,1134.0
1167,2019/06/06,1159.0,1162.834,1170.0,25900,1172.0,1149.0
1168,2019/06/07,1152.0,1155.11,1160.0,29000,1166.0,1149.0
1169,2019/06/10,1176.0,1163.29,1166.0,39300,1179.0,1147.0
1170,2019/06/11,1190.0,1180.742,1175.0,21700,1190.0,1166.0
1171,2019/06/12,1176.0,1178.837,1185.0,21500,1190.0,1173.0
1172,2019/06/13,1159.0,1150.929,1170.0,36800,1170.0,1135.0
1173,2019/06/14,1150.0,1147.453,1155.0,44600,1157.0,1137.0
1174,2019/06/17,1136.0,1137.443,1141.0,22800,1143.0,1133.0
1175,2019/06/18,1122.0,1130.355,1138.0,25100,1144.0,1121.0
1176,2019/06/19,1154.0,1152.452,1141.0,26100,1159.0,1141.0
1177,2019/06/20,1148.0,1147.272,1154.0,26100,1156.0,1142.0
1178,2019/06/21,1197.0,1185.078,1155.0,121300,1197.0,1153.0
1179,2019/06/24,1205.0,1205.924,1192.0,40600,1221.0,1183.0
1180,2019/06/25,1201.0,1207.813,1213.0,22400,1217.0,1201.0
1181,2019/06/26,1189.0,1198.445,1208.0,25400,1211.0,1186.0
1182,2019/06/27,1216.0,1213.096,1197.0,22000,1222.0,1196.0
1183,2019/06/28,1208.0,1205.812,1211.0,39300,1211.0,1196.0
1184,2019/07/01,1248.0,1237.308,1230.0,70200,1248.0,1222.0
1185,2019/07/02,1302.0,1268.138,1257.0,99400,1306.0,1246.0
1186,2019/07/03,1288.0,1289.459,1294.0,57500,1301.0,1275.0
1187,2019/07/04,1287.0,1288.4,1295.0,23000,1295.0,1278.0
1188,2019/07/05,1283.0,1282.313,1284.0,20100,1289.0,1277.0
1189,2019/07/08,1269.0,1274.427,1279.0,17100,1287.0,1268.0
1190,2019/07/09,1246.0,1253.57,1265.0,25800,1268.0,1245.0
1191,2019/07/10,1233.0,1231.675,1234.0,24900,1241.0,1213.0
1192,2019/07/11,1249.0,1238.923,1225.0,15600,1250.0,1225.0
1193,2019/07/12,1258.0,1254.208,1253.0,20200,1263.0,1240.0
1194,2019/07/16,1247.0,1249.042,1252.0,21400,1256.0,1239.0
1195,2019/07/17,1225.0,1228.931,1230.0,20200,1245.0,1223.0
1196,2019/07/18,1199.0,1206.541,1228.0,42900,1228.0,1199.0
1197,2019/07/19,1232.0,1223.733,1201.0,17200,1239.0,1201.0
1198,2019/07/22,1230.0,1233.478,1235.0,13600,1242.0,1226.0
1199,2019/07/23,1237.0,1242.641,1227.0,36500,1252.0,1227.0
1200,2019/07/24,1246.0,1240.619,1237.0,31000,1250.0,1230.0
1201,2019/07/25,1263.0,1259.909,1257.0,28600,1265.0,1252.0
1202,2019/07/26,1245.0,1252.566,1263.0,24400,1263.0,1240.0
1203,2019/07/29,1239.0,1238.768,1248.0,24100,1248.0,1230.0
1204,2019/07/30,1236.0,1237.286,1243.0,23400,1249.0,1227.0
1205,2019/07/31,1230.0,1236.892,1238.0,20300,1251.0,1230.0
1206,2019/08/01,1200.0,1198.414,1210.0,54600,1214.0,1176.0
1207,2019/08/02,1163.0,1171.069,1187.0,68200,1190.0,1155.0
1208,2019/08/05,1136.0,1139.563,1155.0,57600,1157.0,1120.0
1209,2019/08/06,1121.0,1117.233,1106.0,46800,1136.0,1099.0
1210,2019/08/07,1118.0,1128.076,1122.0,57600,1141.0,1118.0
1211,2019/08/08,1118.0,1120.651,1121.0,43200,1135.0,1112.0
1212,2019/08/09,1091.0,1100.255,1124.0,117500,1128.0,1088.0
1213,2019/08/13,1084.0,1083.524,1081.0,35100,1092.0,1076.0
1214,2019/08/14,1115.0,1110.252,1105.0,23800,1116.0,1105.0
1215,2019/08/15,1102.0,1095.256,1081.0,16400,1105.0,1081.0
1216,2019/08/16,1103.0,1103.934,1103.0,30300,1111.0,1094.0
1217,2019/08/19,1123.0,1115.36,1105.0,16400,1124.0,1102.0
1218,2019/08/20,1121.0,1122.481,1129.0,26400,1129.0,1119.0
1219,2019/08/21,1098.0,1100.136,1116.0,53000,1116.0,1094.0
1220,2019/08/22,1100.0,1102.244,1101.0,38600,1109.0,1099.0
1221,2019/08/23,1084.0,1087.476,1101.0,42200,1107.0,1083.0
