,Date,Close,VWAP,Open,Volume,High,Low
0,2014/08/25,451.0,447.217,445.0,78000,451.0,444.0
1,2014/08/26,448.0,450.166,452.0,30700,452.0,448.0
2,2014/08/27,450.0,449.006,450.0,16900,450.0,448.0
3,2014/08/28,449.0,448.532,452.0,29300,452.0,447.0
4,2014/08/29,446.0,445.516,447.0,28100,448.0,443.0
5,2014/09/01,447.0,445.611,447.0,20300,449.0,443.0
6,2014/09/02,454.0,452.933,449.0,54900,455.0,447.0
7,2014/09/03,457.0,455.778,455.0,32400,457.0,454.0
8,2014/09/04,451.0,453.701,455.0,33100,457.0,451.0
9,2014/09/05,449.0,450.008,451.0,36100,454.0,448.0
10,2014/09/08,452.0,451.355,448.0,36100,455.0,448.0
11,2014/09/09,448.0,449.083,454.0,28900,454.0,447.0
12,2014/09/10,448.0,447.237,448.0,30000,450.0,445.0
13,2014/09/11,446.0,446.479,449.0,45500,449.0,444.0
14,2014/09/12,448.0,445.802,445.0,47000,448.0,444.0
15,2014/09/16,446.0,446.119,448.0,26000,448.0,445.0
16,2014/09/17,444.0,444.591,446.0,33000,446.0,443.0
17,2014/09/18,444.0,443.7,444.0,24300,445.0,443.0
18,2014/09/19,443.0,442.594,445.0,64200,446.0,441.0
19,2014/09/22,443.0,441.235,442.0,80400,444.0,439.0
20,2014/09/24,441.0,440.168,439.0,71500,444.0,439.0
21,2014/09/25,447.0,444.653,442.0,44600,447.0,442.0
22,2014/09/26,476.0,470.635,463.0,362800,484.0,445.0
23,2014/09/29,477.0,477.162,476.0,146200,480.0,471.0
24,2014/09/30,471.0,471.148,475.0,74600,476.0,468.0
25,2014/10/01,472.0,471.736,468.0,49300,475.0,468.0
26,2014/10/02,460.0,464.378,470.0,134500,474.0,456.0
27,2014/10/03,463.0,462.387,462.0,75800,473.0,459.0
28,2014/10/06,470.0,468.784,467.0,49900,471.0,465.0
29,2014/10/07,468.0,469.753,470.0,37200,471.0,468.0
30,2014/10/08,469.0,466.169,465.0,198700,471.0,462.0
31,2014/10/09,468.0,469.982,468.0,72400,472.0,467.0
32,2014/10/10,459.0,461.214,462.0,69100,465.0,459.0
33,2014/10/14,442.0,446.931,454.0,117600,455.0,442.0
34,2014/10/15,446.0,446.17,446.0,52300,450.0,443.0
35,2014/10/16,432.0,438.273,441.0,80100,444.0,432.0
36,2014/10/17,426.0,429.31,428.0,93200,436.0,425.0
37,2014/10/20,439.0,436.714,437.0,52400,442.0,433.0
38,2014/10/21,439.0,435.688,441.0,181000,445.0,427.0
39,2014/10/22,447.0,444.002,440.0,146900,448.0,438.0
40,2014/10/23,445.0,445.33,446.0,38500,448.0,443.0
41,2014/10/24,437.0,439.817,445.0,98200,447.0,435.0
42,2014/10/27,439.0,437.542,440.0,62500,441.0,434.0
43,2014/10/28,435.0,435.22,434.0,59100,438.0,433.0
44,2014/10/29,439.0,438.278,438.0,59700,441.0,434.0
45,2014/10/30,438.0,437.727,439.0,223100,440.0,435.0
46,2014/10/31,446.0,444.791,439.0,229100,460.0,437.0
47,2014/11/04,474.0,480.017,494.0,299900,495.0,471.0
48,2014/11/05,500.0,488.187,482.0,288800,500.0,476.0
49,2014/11/06,501.0,500.783,500.0,212300,508.0,494.0
50,2014/11/07,500.0,501.947,503.0,102500,505.0,499.0
51,2014/11/10,512.0,505.029,500.0,191700,513.0,500.0
52,2014/11/11,520.0,516.935,512.0,113300,521.0,512.0
53,2014/11/12,520.0,519.831,518.0,119800,522.0,515.0
54,2014/11/13,539.0,528.58,516.0,186600,539.0,516.0
55,2014/11/14,546.0,539.407,538.0,180600,549.0,530.0
56,2014/11/17,533.0,540.286,548.0,97900,548.0,531.0
57,2014/11/18,542.0,538.502,530.0,84000,543.0,529.0
58,2014/11/19,542.0,544.412,544.0,82600,549.0,540.0
59,2014/11/20,536.0,538.809,540.0,45100,542.0,536.0
60,2014/11/21,527.0,528.929,535.0,102700,536.0,525.0
61,2014/11/25,531.0,529.016,527.0,68100,532.0,525.0
62,2014/11/26,545.0,538.169,526.0,139300,547.0,526.0
63,2014/11/27,528.0,533.957,539.0,85400,540.0,528.0
64,2014/11/28,538.0,536.555,530.0,52600,540.0,530.0
65,2014/12/01,538.0,538.994,542.0,50500,542.0,535.0
66,2014/12/02,534.0,533.136,534.0,50900,536.0,530.0
67,2014/12/03,535.0,537.793,536.0,80100,542.0,530.0
68,2014/12/04,530.0,531.835,532.0,46600,538.0,529.0
69,2014/12/05,535.0,532.661,530.0,51000,535.0,530.0
70,2014/12/08,536.0,534.649,536.0,38200,538.0,529.0
71,2014/12/09,542.0,539.855,536.0,71800,542.0,533.0
72,2014/12/10,540.0,539.828,540.0,71900,541.0,538.0
73,2014/12/11,540.0,538.535,534.0,44300,541.0,534.0
74,2014/12/12,560.0,551.765,546.0,131900,560.0,539.0
75,2014/12/15,544.0,550.48,555.0,57500,555.0,544.0
76,2014/12/16,539.0,539.837,543.0,104700,543.0,537.0
77,2014/12/17,535.0,537.983,539.0,71000,542.0,535.0
78,2014/12/18,542.0,541.111,540.0,62200,544.0,540.0
79,2014/12/19,546.0,544.537,542.0,67800,547.0,542.0
80,2014/12/22,549.0,547.436,547.0,42900,549.0,547.0
81,2014/12/24,549.0,548.711,549.0,50800,551.0,546.0
82,2014/12/25,543.0,544.747,549.0,44300,549.0,541.0
83,2014/12/26,544.0,543.773,543.0,74500,546.0,540.0
84,2014/12/29,546.0,546.288,544.0,66700,551.0,541.0
85,2014/12/30,548.0,548.447,549.0,71100,550.0,545.0
86,2015/01/05,554.0,553.762,549.0,80100,557.0,549.0
87,2015/01/06,559.0,557.752,553.0,320600,568.0,551.0
88,2015/01/07,550.0,553.008,553.0,106200,555.0,550.0
89,2015/01/08,555.0,553.466,555.0,67800,556.0,550.0
90,2015/01/09,554.0,553.474,555.0,48100,556.0,551.0
91,2015/01/13,553.0,553.392,554.0,56100,555.0,552.0
92,2015/01/14,550.0,549.068,548.0,55600,554.0,547.0
93,2015/01/15,552.0,551.023,549.0,51600,554.0,549.0
94,2015/01/16,547.0,545.896,550.0,41400,552.0,543.0
95,2015/01/19,546.0,546.962,547.0,23500,550.0,545.0
96,2015/01/20,555.0,551.483,549.0,41800,555.0,546.0
97,2015/01/21,552.0,552.366,554.0,25400,554.0,550.0
98,2015/01/22,546.0,545.915,553.0,59000,553.0,540.0
99,2015/01/23,548.0,546.272,547.0,25000,549.0,544.0
100,2015/01/26,544.0,542.746,540.0,35800,548.0,539.0
101,2015/01/27,550.0,549.203,550.0,28600,552.0,545.0
102,2015/01/28,552.0,551.398,551.0,45000,555.0,548.0
103,2015/01/29,551.0,550.259,548.0,37400,555.0,548.0
104,2015/01/30,552.0,551.095,550.0,65200,555.0,547.0
105,2015/02/02,544.0,548.356,552.0,56400,556.0,543.0
106,2015/02/03,537.0,535.104,545.0,150800,545.0,521.0
107,2015/02/04,539.0,538.735,537.0,43400,545.0,536.0
108,2015/02/05,538.0,539.321,544.0,35200,544.0,536.0
109,2015/02/06,546.0,544.34,541.0,46500,550.0,540.0
110,2015/02/09,544.0,545.084,550.0,40500,550.0,542.0
111,2015/02/10,533.0,536.219,543.0,64000,545.0,530.0
112,2015/02/12,537.0,537.775,537.0,101500,541.0,534.0
113,2015/02/13,535.0,536.023,537.0,81100,540.0,534.0
114,2015/02/16,539.0,538.557,537.0,61100,543.0,535.0
115,2015/02/17,537.0,536.513,538.0,64000,543.0,533.0
116,2015/02/18,538.0,538.722,537.0,82100,542.0,536.0
117,2015/02/19,537.0,537.127,537.0,78800,539.0,536.0
118,2015/02/20,539.0,537.892,537.0,68300,543.0,535.0
119,2015/02/23,539.0,538.698,537.0,80100,541.0,537.0
120,2015/02/24,541.0,540.208,541.0,53300,543.0,537.0
121,2015/02/25,545.0,545.359,545.0,64100,547.0,543.0
122,2015/02/26,556.0,551.673,546.0,104900,556.0,546.0
123,2015/02/27,551.0,552.722,557.0,62600,557.0,549.0
124,2015/03/02,550.0,549.46,552.0,65500,552.0,546.0
125,2015/03/03,550.0,548.668,552.0,57200,552.0,546.0
126,2015/03/04,550.0,546.816,550.0,87700,550.0,545.0
127,2015/03/05,549.0,548.231,550.0,58400,550.0,546.0
128,2015/03/06,550.0,548.311,550.0,66600,551.0,546.0
129,2015/03/09,549.0,548.52,550.0,83900,551.0,546.0
130,2015/03/10,546.0,547.555,549.0,91600,550.0,546.0
131,2015/03/11,550.0,547.25,545.0,69500,550.0,545.0
132,2015/03/12,552.0,551.177,550.0,76700,553.0,549.0
133,2015/03/13,549.0,549.88,550.0,122100,551.0,549.0
134,2015/03/16,548.0,548.558,550.0,50000,550.0,547.0
135,2015/03/17,548.0,547.833,549.0,45600,549.0,546.0
136,2015/03/18,546.0,546.779,548.0,61100,549.0,545.0
137,2015/03/19,545.0,545.107,546.0,52500,546.0,544.0
138,2015/03/20,542.0,542.746,544.0,71600,544.0,541.0
139,2015/03/23,544.0,543.597,544.0,59100,545.0,542.0
140,2015/03/24,550.0,546.919,545.0,121200,551.0,544.0
141,2015/03/25,550.0,550.12,550.0,121200,551.0,549.0
142,2015/03/26,547.0,549.495,550.0,543800,551.0,547.0
143,2015/03/27,529.0,535.085,540.0,136100,540.0,527.0
144,2015/03/30,528.0,527.605,529.0,105300,531.0,522.0
145,2015/03/31,528.0,530.054,529.0,77200,533.0,528.0
146,2015/04/01,523.0,520.554,526.0,133300,529.0,513.0
147,2015/04/02,528.0,525.731,525.0,70300,530.0,521.0
148,2015/04/03,534.0,529.504,523.0,46400,534.0,523.0
149,2015/04/06,534.0,532.962,530.0,37000,536.0,528.0
150,2015/04/07,533.0,533.271,535.0,71100,536.0,528.0
151,2015/04/08,537.0,538.629,534.0,101200,542.0,532.0
152,2015/04/09,537.0,534.515,534.0,36100,538.0,531.0
153,2015/04/10,533.0,531.252,532.0,53900,535.0,528.0
154,2015/04/13,534.0,532.064,533.0,31300,534.0,530.0
155,2015/04/14,535.0,534.218,534.0,17000,536.0,531.0
156,2015/04/15,538.0,535.689,535.0,35400,539.0,532.0
157,2015/04/16,543.0,538.077,537.0,58500,543.0,534.0
158,2015/04/17,544.0,541.872,537.0,76400,545.0,537.0
159,2015/04/20,537.0,537.709,537.0,66300,540.0,534.0
160,2015/04/21,539.0,537.907,534.0,58100,544.0,534.0
161,2015/04/22,546.0,541.571,536.0,73100,547.0,535.0
162,2015/04/23,543.0,543.22,542.0,32700,545.0,541.0
163,2015/04/24,542.0,539.214,538.0,49600,542.0,536.0
164,2015/04/27,542.0,535.826,542.0,115700,542.0,532.0
165,2015/04/28,535.0,535.794,537.0,36400,539.0,534.0
166,2015/04/30,541.0,537.697,536.0,71700,541.0,534.0
167,2015/05/01,536.0,530.132,538.0,116200,538.0,524.0
168,2015/05/07,530.0,527.707,531.0,40300,533.0,521.0
169,2015/05/08,560.0,554.977,539.0,370000,565.0,539.0
170,2015/05/11,551.0,556.642,554.0,122800,562.0,551.0
171,2015/05/12,559.0,558.766,556.0,93200,561.0,555.0
172,2015/05/13,567.0,563.097,560.0,96600,567.0,559.0
173,2015/05/14,563.0,565.723,567.0,127400,569.0,563.0
174,2015/05/15,569.0,568.094,563.0,87200,572.0,562.0
175,2015/05/18,570.0,568.909,568.0,104900,572.0,566.0
176,2015/05/19,578.0,575.272,570.0,117200,579.0,570.0
177,2015/05/20,589.0,582.369,579.0,270700,590.0,570.0
178,2015/05/21,583.0,582.501,581.0,96600,586.0,577.0
179,2015/05/22,580.0,580.483,583.0,94900,583.0,579.0
180,2015/05/25,585.0,584.835,580.0,79400,587.0,580.0
181,2015/05/26,581.0,582.245,585.0,127400,587.0,580.0
182,2015/05/27,583.0,583.093,581.0,73400,585.0,580.0
183,2015/05/28,576.0,578.546,583.0,97900,585.0,575.0
184,2015/05/29,574.0,572.628,576.0,106900,580.0,564.0
185,2015/06/01,577.0,579.798,579.0,87100,586.0,572.0
186,2015/06/02,578.0,579.817,580.0,42500,582.0,577.0
187,2015/06/03,581.0,580.131,578.0,55100,583.0,576.0
188,2015/06/04,588.0,587.223,581.0,125500,591.0,581.0
189,2015/06/05,591.0,591.544,588.0,87100,594.0,588.0
190,2015/06/08,600.0,597.172,593.0,159200,600.0,592.0
191,2015/06/09,587.0,595.586,599.0,77800,600.0,587.0
192,2015/06/10,594.0,593.23,585.0,99300,600.0,585.0
193,2015/06/11,592.0,593.565,594.0,39800,599.0,590.0
194,2015/06/12,605.0,602.13,600.0,209000,607.0,596.0
195,2015/06/15,623.0,618.131,609.0,174700,625.0,609.0
196,2015/06/16,613.0,616.812,623.0,79700,624.0,612.0
197,2015/06/17,621.0,619.634,612.0,109200,625.0,612.0
198,2015/06/18,620.0,622.402,625.0,85800,627.0,614.0
199,2015/06/19,612.0,615.734,621.0,58700,623.0,612.0
200,2015/06/22,635.0,627.874,612.0,174900,635.0,612.0
201,2015/06/23,645.0,640.393,637.0,156400,646.0,636.0
202,2015/06/24,643.0,642.699,645.0,65100,647.0,639.0
203,2015/06/25,645.0,643.269,640.0,109500,649.0,636.0
204,2015/06/26,645.0,645.979,647.0,62400,649.0,643.0
205,2015/06/29,629.0,634.561,639.0,158100,641.0,624.0
206,2015/06/30,632.0,628.641,628.0,70500,634.0,624.0
207,2015/07/01,646.0,640.734,635.0,61000,647.0,631.0
208,2015/07/02,649.0,650.468,649.0,93400,653.0,649.0
209,2015/07/03,636.0,639.955,649.0,70700,650.0,632.0
210,2015/07/06,631.0,631.547,627.0,80600,638.0,626.0
211,2015/07/07,635.0,641.163,635.0,83400,648.0,633.0
212,2015/07/08,609.0,617.081,636.0,121400,636.0,609.0
213,2015/07/09,597.0,582.394,581.0,145600,599.0,562.0
214,2015/07/10,595.0,600.523,595.0,76900,613.0,593.0
215,2015/07/13,600.0,600.657,599.0,56600,608.0,596.0
216,2015/07/14,619.0,614.403,610.0,74200,619.0,603.0
217,2015/07/15,620.0,621.201,619.0,135300,630.0,615.0
218,2015/07/16,633.0,631.182,627.0,101500,635.0,625.0
219,2015/07/17,632.0,635.059,636.0,97600,640.0,631.0
220,2015/07/21,631.0,631.51,633.0,72000,638.0,628.0
221,2015/07/22,622.0,624.817,628.0,88500,629.0,620.0
222,2015/07/23,632.0,627.303,623.0,30700,636.0,619.0
223,2015/07/24,625.0,627.258,628.0,68500,632.0,624.0
224,2015/07/27,613.0,617.313,625.0,67200,627.0,612.0
225,2015/07/28,604.0,606.883,613.0,84700,614.0,603.0
226,2015/07/29,609.0,608.454,610.0,22900,613.0,606.0
227,2015/07/30,612.0,610.372,609.0,28200,612.0,608.0
228,2015/07/31,612.0,611.688,613.0,34300,614.0,610.0
229,2015/08/03,610.0,608.917,615.0,69800,617.0,602.0
230,2015/08/04,616.0,614.238,614.0,68400,617.0,610.0
231,2015/08/05,613.0,612.814,615.0,48400,616.0,609.0
232,2015/08/06,609.0,613.822,616.0,71900,618.0,609.0
233,2015/08/07,612.0,611.88,611.0,44200,614.0,609.0
234,2015/08/10,613.0,610.929,612.0,60500,613.0,606.0
235,2015/08/11,610.0,613.734,617.0,65900,619.0,610.0
236,2015/08/12,612.0,604.274,611.0,169600,614.0,598.0
237,2015/08/13,600.0,602.978,604.0,94800,607.0,598.0
238,2015/08/14,602.0,606.876,603.0,41800,611.0,602.0
239,2015/08/17,598.0,599.584,605.0,46200,606.0,597.0
240,2015/08/18,601.0,601.485,602.0,26400,606.0,596.0
241,2015/08/19,602.0,599.235,596.0,45500,603.0,596.0
242,2015/08/20,596.0,599.569,600.0,28300,607.0,595.0
243,2015/08/21,581.0,585.581,585.0,90500,596.0,581.0
244,2015/08/24,529.0,547.912,568.0,146100,570.0,528.0
245,2015/08/25,512.0,515.375,501.0,146100,551.0,490.0
246,2015/08/26,530.0,529.162,516.0,78300,537.0,516.0
247,2015/08/27,545.0,554.862,557.0,70500,567.0,545.0
248,2015/08/28,576.0,573.784,565.0,63300,583.0,562.0
249,2015/08/31,598.0,592.237,586.0,95400,598.0,582.0
250,2015/09/01,581.0,591.468,598.0,109400,598.0,579.0
251,2015/09/02,581.0,579.863,563.0,86900,590.0,563.0
252,2015/09/03,582.0,585.387,582.0,111500,596.0,579.0
253,2015/09/04,583.0,581.455,588.0,202000,590.0,576.0
254,2015/09/07,574.0,573.495,578.0,85000,581.0,567.0
255,2015/09/08,564.0,569.463,576.0,32400,578.0,564.0
256,2015/09/09,583.0,580.16,580.0,72300,583.0,574.0
257,2015/09/10,590.0,589.124,583.0,77300,594.0,582.0
258,2015/09/11,589.0,591.49,594.0,62400,596.0,585.0
259,2015/09/14,578.0,581.186,582.0,42000,587.0,575.0
260,2015/09/15,579.0,582.18,584.0,45600,587.0,578.0
261,2015/09/16,575.0,578.119,585.0,43800,587.0,571.0
262,2015/09/17,578.0,573.719,575.0,37000,578.0,570.0
263,2015/09/18,572.0,574.15,578.0,31400,580.0,571.0
264,2015/09/24,563.0,565.118,562.0,33900,574.0,561.0
265,2015/09/25,572.0,564.952,561.0,47400,572.0,558.0
266,2015/09/28,566.0,569.379,563.0,72600,579.0,562.0
267,2015/09/29,551.0,553.188,559.0,60100,559.0,549.0
268,2015/09/30,557.0,558.554,558.0,45100,563.0,550.0
269,2015/10/01,566.0,566.058,564.0,41100,573.0,560.0
270,2015/10/02,564.0,564.572,561.0,50700,572.0,557.0
271,2015/10/05,555.0,557.554,563.0,61600,563.0,554.0
272,2015/10/06,557.0,557.37,565.0,53500,565.0,552.0
273,2015/10/07,552.0,550.953,556.0,86600,560.0,542.0
274,2015/10/08,557.0,555.741,554.0,69800,561.0,551.0
275,2015/10/09,553.0,556.393,553.0,65200,564.0,552.0
276,2015/10/13,562.0,557.24,555.0,43300,563.0,551.0
277,2015/10/14,556.0,555.333,557.0,51700,558.0,552.0
278,2015/10/15,562.0,558.778,556.0,42700,563.0,554.0
279,2015/10/16,546.0,551.401,558.0,89800,560.0,546.0
280,2015/10/19,544.0,543.273,547.0,46900,547.0,540.0
281,2015/10/20,541.0,540.041,543.0,51300,547.0,537.0
282,2015/10/21,538.0,536.106,535.0,54500,541.0,533.0
283,2015/10/22,551.0,549.097,538.0,32000,554.0,538.0
284,2015/10/23,552.0,553.456,551.0,28500,555.0,551.0
285,2015/10/26,551.0,549.216,551.0,29700,553.0,546.0
286,2015/10/27,543.0,546.56,550.0,47500,553.0,542.0
287,2015/10/28,548.0,543.975,540.0,36300,549.0,538.0
288,2015/10/29,553.0,549.991,546.0,80900,555.0,543.0
289,2015/10/30,553.0,552.655,553.0,197000,558.0,546.0
290,2015/11/02,549.0,545.136,553.0,76000,553.0,538.0
291,2015/11/04,542.0,544.878,551.0,83900,552.0,539.0
292,2015/11/05,503.0,507.039,530.0,372600,530.0,500.0
293,2015/11/06,508.0,505.732,502.0,139300,512.0,501.0
294,2015/11/09,507.0,508.361,510.0,132400,511.0,504.0
295,2015/11/10,507.0,506.628,509.0,177300,509.0,504.0
296,2015/11/11,513.0,513.017,507.0,92900,521.0,506.0
297,2015/11/12,520.0,518.262,523.0,77100,525.0,512.0
298,2015/11/13,518.0,517.154,518.0,45400,519.0,514.0
299,2015/11/16,510.0,512.624,515.0,46000,515.0,510.0
300,2015/11/17,520.0,517.082,515.0,50200,522.0,512.0
301,2015/11/18,516.0,517.715,521.0,37900,523.0,513.0
302,2015/11/19,520.0,519.967,520.0,83700,524.0,518.0
303,2015/11/20,517.0,515.504,517.0,48600,518.0,513.0
304,2015/11/24,522.0,516.453,515.0,82500,522.0,512.0
305,2015/11/25,519.0,519.103,522.0,42600,522.0,517.0
306,2015/11/26,517.0,517.892,522.0,50700,522.0,516.0
307,2015/11/27,517.0,516.036,517.0,64100,518.0,513.0
308,2015/11/30,516.0,516.403,517.0,40900,518.0,515.0
309,2015/12/01,515.0,516.114,517.0,45700,520.0,514.0
310,2015/12/02,517.0,516.643,516.0,63600,520.0,514.0
311,2015/12/03,519.0,517.272,518.0,45300,520.0,515.0
312,2015/12/04,515.0,515.11,517.0,63400,519.0,513.0
313,2015/12/07,515.0,516.331,518.0,38100,519.0,515.0
314,2015/12/08,514.0,512.219,515.0,103400,516.0,508.0
315,2015/12/09,507.0,506.973,509.0,89500,510.0,503.0
316,2015/12/10,502.0,502.827,505.0,80500,505.0,501.0
317,2015/12/11,506.0,502.81,501.0,73700,506.0,501.0
318,2015/12/14,502.0,501.778,505.0,65300,505.0,500.0
319,2015/12/15,500.0,500.519,503.0,70900,504.0,498.0
320,2015/12/16,505.0,504.645,505.0,57400,507.0,501.0
321,2015/12/17,508.0,509.476,505.0,102300,512.0,505.0
322,2015/12/18,510.0,509.954,507.0,139000,515.0,504.0
323,2015/12/21,513.0,511.355,510.0,175000,515.0,508.0
324,2015/12/22,520.0,516.729,515.0,85000,521.0,510.0
325,2015/12/24,519.0,521.885,522.0,79900,525.0,517.0
326,2015/12/25,512.0,510.96,510.0,109600,516.0,503.0
327,2015/12/28,519.0,519.63,515.0,68700,525.0,514.0
328,2015/12/29,539.0,533.234,523.0,191800,540.0,520.0
329,2015/12/30,541.0,543.227,543.0,108700,548.0,539.0
330,2016/01/04,544.0,547.3,542.0,116700,556.0,541.0
331,2016/01/05,545.0,543.199,540.0,87000,548.0,537.0
332,2016/01/06,533.0,541.273,550.0,110100,551.0,531.0
333,2016/01/07,516.0,522.449,536.0,100400,536.0,513.0
334,2016/01/08,512.0,513.312,511.0,56500,521.0,510.0
335,2016/01/12,492.0,499.542,512.0,136300,512.0,491.0
336,2016/01/13,498.0,497.834,494.0,53100,504.0,494.0
337,2016/01/14,497.0,488.556,495.0,110200,501.0,479.0
338,2016/01/15,493.0,496.252,500.0,59200,503.0,492.0
339,2016/01/18,479.0,476.36,482.0,86500,482.0,470.0
340,2016/01/19,474.0,473.316,476.0,48800,477.0,470.0
341,2016/01/20,463.0,468.171,475.0,83000,478.0,461.0
342,2016/01/21,454.0,465.79,460.0,195000,472.0,454.0
343,2016/01/22,476.0,471.235,458.0,48500,479.0,458.0
344,2016/01/25,485.0,481.164,476.0,52500,487.0,474.0
345,2016/01/26,475.0,477.775,480.0,21300,483.0,475.0
346,2016/01/27,492.0,489.989,483.0,54100,498.0,483.0
347,2016/01/28,495.0,491.487,490.0,37000,500.0,486.0
348,2016/01/29,519.0,507.566,495.0,99900,519.0,491.0
349,2016/02/01,523.0,525.561,525.0,148600,530.0,517.0
350,2016/02/02,514.0,517.262,517.0,61800,524.0,510.0
351,2016/02/03,524.0,522.602,510.0,173000,535.0,506.0
352,2016/02/04,530.0,529.118,529.0,123500,534.0,523.0
353,2016/02/05,512.0,516.63,531.0,80600,531.0,508.0
354,2016/02/08,514.0,507.295,502.0,122500,522.0,500.0
355,2016/02/09,493.0,494.328,502.0,149200,502.0,490.0
356,2016/02/10,464.0,470.843,490.0,144900,492.0,460.0
357,2016/02/12,459.0,459.181,456.0,173500,478.0,445.0
358,2016/02/15,476.0,477.922,475.0,102800,490.0,471.0
359,2016/02/16,488.0,488.547,478.0,89600,498.0,477.0
360,2016/02/17,485.0,484.417,484.0,47200,491.0,478.0
361,2016/02/18,488.0,489.898,494.0,66600,497.0,485.0
362,2016/02/19,495.0,490.903,488.0,71100,496.0,484.0
363,2016/02/22,497.0,499.179,497.0,67700,508.0,493.0
364,2016/02/23,491.0,491.296,502.0,78000,502.0,485.0
365,2016/02/24,487.0,489.298,490.0,36600,498.0,484.0
366,2016/02/25,500.0,497.157,485.0,55600,501.0,485.0
367,2016/02/26,490.0,494.299,504.0,110000,508.0,489.0
368,2016/02/29,489.0,493.542,498.0,79200,498.0,489.0
369,2016/03/01,494.0,494.021,493.0,51800,497.0,490.0
370,2016/03/02,502.0,501.495,499.0,54600,508.0,497.0
371,2016/03/03,507.0,504.233,502.0,38600,509.0,500.0
372,2016/03/04,515.0,509.489,504.0,41700,515.0,501.0
373,2016/03/07,515.0,515.646,519.0,60400,520.0,512.0
374,2016/03/08,520.0,514.243,517.0,71700,522.0,507.0
375,2016/03/09,509.0,511.295,516.0,52300,519.0,507.0
376,2016/03/10,523.0,520.379,517.0,65700,524.0,515.0
377,2016/03/11,536.0,531.618,520.0,79900,543.0,519.0
378,2016/03/14,535.0,539.897,539.0,123700,548.0,535.0
379,2016/03/15,535.0,537.3,535.0,97300,545.0,531.0
380,2016/03/16,533.0,533.694,530.0,50600,537.0,530.0
381,2016/03/17,531.0,532.696,534.0,52600,538.0,527.0
382,2016/03/18,530.0,529.245,531.0,51900,533.0,525.0
383,2016/03/22,534.0,535.025,535.0,32300,541.0,532.0
384,2016/03/23,536.0,535.184,540.0,48800,540.0,527.0
385,2016/03/24,532.0,531.049,535.0,69700,536.0,525.0
386,2016/03/25,534.0,534.862,530.0,46500,539.0,530.0
387,2016/03/28,536.0,535.444,535.0,408500,541.0,534.0
388,2016/03/29,529.0,524.405,519.0,112800,531.0,517.0
389,2016/03/30,519.0,521.724,525.0,47900,525.0,518.0
390,2016/03/31,513.0,517.872,519.0,29000,524.0,512.0
391,2016/04/01,499.0,502.409,513.0,73200,513.0,490.0
392,2016/04/04,500.0,500.079,494.0,35500,505.0,494.0
393,2016/04/05,480.0,483.211,499.0,70000,499.0,476.0
394,2016/04/06,479.0,475.478,480.0,55700,482.0,468.0
395,2016/04/07,481.0,478.748,477.0,29800,484.0,474.0
396,2016/04/08,480.0,481.193,475.0,33200,489.0,474.0
397,2016/04/11,480.0,479.136,480.0,20600,481.0,475.0
398,2016/04/12,484.0,484.923,481.0,20700,489.0,481.0
399,2016/04/13,490.0,490.05,486.0,28000,495.0,484.0
400,2016/04/14,499.0,498.041,496.0,39400,501.0,493.0
401,2016/04/15,491.0,494.659,500.0,36700,500.0,488.0
402,2016/04/18,486.0,483.496,480.0,26000,488.0,479.0
403,2016/04/19,489.0,490.453,497.0,20300,497.0,488.0
404,2016/04/20,490.0,491.8,495.0,29500,496.0,489.0
405,2016/04/21,499.0,498.106,495.0,35000,501.0,494.0
406,2016/04/22,498.0,499.859,498.0,41000,507.0,494.0
407,2016/04/25,499.0,499.763,506.0,39600,506.0,496.0
408,2016/04/26,515.0,522.884,536.0,154800,536.0,511.0
409,2016/04/27,513.0,509.519,513.0,127300,521.0,497.0
410,2016/04/28,510.0,509.864,516.0,72200,521.0,501.0
411,2016/05/02,499.0,496.148,492.0,52800,502.0,491.0
412,2016/05/06,499.0,496.822,496.0,28700,504.0,491.0
413,2016/05/09,496.0,496.023,504.0,73400,504.0,489.0
414,2016/05/10,508.0,504.603,497.0,69800,509.0,497.0
415,2016/05/11,515.0,510.968,498.0,131700,518.0,498.0
416,2016/05/12,522.0,518.404,508.0,88200,523.0,508.0
417,2016/05/13,516.0,514.223,520.0,26000,520.0,507.0
418,2016/05/16,512.0,512.837,509.0,22700,517.0,509.0
419,2016/05/17,506.0,509.534,514.0,27900,516.0,505.0
420,2016/05/18,510.0,508.76,508.0,83000,513.0,503.0
421,2016/05/19,514.0,511.73,511.0,31800,515.0,505.0
422,2016/05/20,515.0,516.711,518.0,35300,520.0,514.0
423,2016/05/23,514.0,511.549,517.0,31700,517.0,505.0
424,2016/05/24,516.0,515.7,513.0,25000,519.0,513.0
425,2016/05/25,514.0,515.467,516.0,27000,519.0,513.0
426,2016/05/26,513.0,515.887,520.0,38000,520.0,513.0
427,2016/05/27,515.0,515.073,513.0,61500,519.0,510.0
428,2016/05/30,516.0,515.816,515.0,24400,518.0,514.0
429,2016/05/31,517.0,516.299,517.0,21400,518.0,513.0
430,2016/06/01,521.0,519.541,515.0,33300,524.0,514.0
431,2016/06/02,514.0,517.247,518.0,29600,521.0,514.0
432,2016/06/03,518.0,515.41,511.0,22200,519.0,511.0
433,2016/06/06,514.0,512.907,515.0,29100,518.0,511.0
434,2016/06/07,506.0,508.789,512.0,28000,513.0,506.0
435,2016/06/08,505.0,506.796,508.0,42200,509.0,505.0
436,2016/06/09,503.0,502.311,505.0,22800,506.0,500.0
437,2016/06/10,504.0,503.669,504.0,51000,507.0,501.0
438,2016/06/13,492.0,494.642,501.0,49700,502.0,490.0
439,2016/06/14,482.0,484.71,490.0,31400,490.0,480.0
440,2016/06/15,485.0,487.352,484.0,33800,494.0,483.0
441,2016/06/16,467.0,473.008,486.0,65300,488.0,463.0
442,2016/06/17,471.0,472.3,473.0,11000,479.0,470.0
443,2016/06/20,477.0,478.972,484.0,25400,484.0,476.0
444,2016/06/21,482.0,479.489,478.0,18600,484.0,474.0
445,2016/06/22,480.0,480.385,482.0,19500,486.0,477.0
446,2016/06/23,480.0,477.22,476.0,21400,484.0,474.0
447,2016/06/24,483.0,488.93,510.0,162200,511.0,465.0
448,2016/06/27,485.0,486.06,491.0,78800,491.0,482.0
449,2016/06/28,487.0,485.699,482.0,48900,494.0,480.0
450,2016/06/29,500.0,498.695,490.0,58000,505.0,489.0
451,2016/06/30,502.0,502.336,508.0,22900,508.0,501.0
452,2016/07/01,499.0,502.992,502.0,23500,510.0,499.0
453,2016/07/04,502.0,500.323,498.0,31000,505.0,498.0
454,2016/07/05,503.0,501.746,502.0,22000,504.0,499.0
455,2016/07/06,502.0,498.704,498.0,46300,504.0,494.0
456,2016/07/07,498.0,496.906,500.0,25600,500.0,495.0
457,2016/07/08,491.0,492.814,499.0,35000,499.0,491.0
458,2016/07/11,496.0,496.316,491.0,31300,500.0,491.0
459,2016/07/12,506.0,506.683,500.0,42000,509.0,500.0
460,2016/07/13,510.0,510.69,515.0,37100,515.0,507.0
461,2016/07/14,511.0,512.063,512.0,22400,514.0,509.0
462,2016/07/15,512.0,510.983,510.0,17300,514.0,507.0
463,2016/07/19,508.0,506.205,508.0,25900,510.0,498.0
464,2016/07/20,510.0,509.67,513.0,42400,513.0,503.0
465,2016/07/21,509.0,508.165,510.0,24300,512.0,505.0
466,2016/07/22,505.0,504.577,507.0,12300,507.0,502.0
467,2016/07/25,504.0,503.715,504.0,28100,508.0,501.0
468,2016/07/26,500.0,500.789,504.0,12800,504.0,499.0
469,2016/07/27,500.0,503.015,501.0,59000,509.0,498.0
470,2016/07/28,500.0,499.16,500.0,21300,503.0,496.0
471,2016/07/29,497.0,498.064,500.0,45700,504.0,494.0
472,2016/08/01,504.0,500.623,497.0,40100,506.0,497.0
473,2016/08/02,504.0,509.532,513.0,75800,514.0,504.0
474,2016/08/03,501.0,500.334,501.0,29900,502.0,497.0
475,2016/08/04,504.0,499.558,500.0,48600,505.0,495.0
476,2016/08/05,505.0,504.683,504.0,26500,507.0,503.0
477,2016/08/08,516.0,514.318,511.0,46800,519.0,509.0
478,2016/08/09,514.0,515.602,517.0,27400,518.0,513.0
479,2016/08/10,513.0,512.899,516.0,7900,516.0,511.0
480,2016/08/12,510.0,511.607,517.0,23900,518.0,508.0
481,2016/08/15,513.0,513.39,510.0,17200,515.0,510.0
482,2016/08/16,515.0,514.838,516.0,28300,516.0,512.0
483,2016/08/17,518.0,516.541,511.0,45500,519.0,509.0
484,2016/08/18,515.0,515.714,516.0,25500,517.0,513.0
485,2016/08/19,518.0,517.811,520.0,21200,520.0,514.0
486,2016/08/22,517.0,516.612,511.0,55900,520.0,511.0
487,2016/08/23,517.0,517.061,518.0,31200,519.0,514.0
488,2016/08/24,516.0,517.524,518.0,55400,519.0,515.0
489,2016/08/25,518.0,516.119,513.0,17600,519.0,513.0
490,2016/08/26,516.0,514.997,516.0,33200,517.0,512.0
491,2016/08/29,517.0,516.203,515.0,34900,518.0,514.0
492,2016/08/30,517.0,514.664,516.0,55600,517.0,510.0
493,2016/08/31,516.0,514.675,515.0,27700,517.0,511.0
494,2016/09/01,517.0,514.833,514.0,14400,517.0,510.0
495,2016/09/02,515.0,514.219,512.0,47000,516.0,512.0
496,2016/09/05,517.0,516.719,515.0,37400,518.0,512.0
497,2016/09/06,516.0,515.153,513.0,44500,517.0,513.0
498,2016/09/07,517.0,516.648,514.0,63000,519.0,512.0
499,2016/09/08,517.0,517.273,517.0,53900,519.0,514.0
500,2016/09/09,522.0,520.069,518.0,80200,523.0,516.0
501,2016/09/12,520.0,518.353,517.0,62300,521.0,514.0
502,2016/09/13,519.0,519.513,520.0,22600,521.0,516.0
503,2016/09/14,518.0,517.882,515.0,28000,521.0,515.0
504,2016/09/15,517.0,516.174,513.0,57000,520.0,513.0
505,2016/09/16,506.0,510.017,516.0,57800,517.0,504.0
506,2016/09/20,515.0,512.052,508.0,33000,516.0,507.0
507,2016/09/21,518.0,515.772,513.0,36000,519.0,512.0
508,2016/09/23,517.0,517.987,520.0,92300,520.0,516.0
509,2016/09/26,516.0,516.277,519.0,29300,519.0,514.0
510,2016/09/27,539.0,534.379,533.0,245800,543.0,527.0
511,2016/09/28,536.0,534.778,531.0,51900,538.0,531.0
512,2016/09/29,528.0,530.577,536.0,54100,536.0,527.0
513,2016/09/30,527.0,527.269,527.0,67700,533.0,522.0
514,2016/10/03,524.0,526.646,529.0,27700,531.0,522.0
515,2016/10/04,528.0,526.84,527.0,49500,530.0,523.0
516,2016/10/05,523.0,525.736,529.0,83700,536.0,520.0
517,2016/10/06,538.0,535.068,527.0,66200,539.0,527.0
518,2016/10/07,527.0,540.798,540.0,98100,552.0,527.0
519,2016/10/11,543.0,542.361,535.0,52700,549.0,535.0
520,2016/10/12,547.0,546.95,542.0,40000,550.0,542.0
521,2016/10/13,544.0,548.408,547.0,67600,557.0,542.0
522,2016/10/14,553.0,551.406,550.0,54400,554.0,548.0
523,2016/10/17,567.0,564.663,554.0,55700,570.0,553.0
524,2016/10/18,566.0,568.632,571.0,42900,573.0,564.0
525,2016/10/19,576.0,571.869,565.0,46400,577.0,564.0
526,2016/10/20,585.0,584.222,578.0,67900,588.0,575.0
527,2016/10/21,586.0,582.345,587.0,58300,587.0,575.0
528,2016/10/24,593.0,589.88,589.0,87800,595.0,582.0
529,2016/10/25,592.0,590.052,595.0,84700,600.0,584.0
530,2016/10/26,600.0,592.552,590.0,76500,600.0,580.0
531,2016/10/27,607.0,605.051,600.0,60700,610.0,600.0
532,2016/10/28,617.0,614.407,607.0,81800,619.0,607.0
533,2016/10/31,624.0,621.07,618.0,68500,625.0,615.0
534,2016/11/01,607.0,612.072,621.0,87200,622.0,606.0
535,2016/11/02,596.0,595.636,597.0,91800,603.0,589.0
536,2016/11/04,599.0,599.809,606.0,193600,615.0,588.0
537,2016/11/07,607.0,605.332,600.0,108300,608.0,600.0
538,2016/11/08,613.0,612.366,605.0,164700,617.0,604.0
539,2016/11/09,608.0,604.426,618.0,192000,619.0,581.0
540,2016/11/10,616.0,620.295,616.0,112200,630.0,615.0
541,2016/11/11,633.0,628.016,614.0,209300,634.0,614.0
542,2016/11/14,651.0,649.23,643.0,124000,654.0,641.0
543,2016/11/15,673.0,668.441,654.0,162000,677.0,654.0
544,2016/11/16,683.0,684.912,675.0,199300,695.0,673.0
545,2016/11/17,690.0,681.048,683.0,138600,690.0,672.0
546,2016/11/18,699.0,692.101,688.0,184600,700.0,682.0
547,2016/11/21,715.0,710.395,696.0,248500,718.0,690.0
548,2016/11/22,710.0,711.8,714.0,82000,717.0,706.0
549,2016/11/24,679.0,680.617,700.0,175500,700.0,673.0
550,2016/11/25,669.0,670.616,683.0,131100,683.0,665.0
551,2016/11/28,684.0,677.267,672.0,133100,686.0,666.0
552,2016/11/29,677.0,674.105,684.0,101600,684.0,669.0
553,2016/11/30,708.0,704.388,684.0,261400,717.0,683.0
554,2016/12/01,716.0,712.756,710.0,128400,721.0,700.0
555,2016/12/02,712.0,713.225,717.0,88900,720.0,703.0
556,2016/12/05,721.0,715.661,709.0,63100,722.0,704.0
557,2016/12/06,738.0,734.576,728.0,119700,739.0,728.0
558,2016/12/07,726.0,728.769,731.0,70100,737.0,720.0
559,2016/12/08,734.0,730.415,726.0,76400,734.0,724.0
560,2016/12/09,737.0,736.735,738.0,174300,740.0,731.0
561,2016/12/12,758.0,750.194,749.0,108100,758.0,738.0
562,2016/12/13,755.0,754.862,758.0,59600,760.0,747.0
563,2016/12/14,730.0,732.56,753.0,132300,753.0,714.0
564,2016/12/15,745.0,743.34,738.0,113200,750.0,732.0
565,2016/12/16,744.0,745.254,750.0,56700,753.0,741.0
566,2016/12/19,735.0,734.339,736.0,68500,740.0,728.0
567,2016/12/20,745.0,744.041,743.0,93800,749.0,732.0
568,2016/12/21,733.0,736.686,748.0,56100,748.0,728.0
569,2016/12/22,736.0,734.364,735.0,39800,740.0,730.0
570,2016/12/26,734.0,733.129,732.0,33400,735.0,728.0
571,2016/12/27,727.0,727.582,729.0,49800,731.0,725.0
572,2016/12/28,734.0,728.897,730.0,68600,735.0,720.0
573,2016/12/29,734.0,731.424,734.0,44300,734.0,727.0
574,2016/12/30,733.0,731.374,728.0,27000,735.0,725.0
575,2017/01/04,745.0,742.374,739.0,92900,747.0,735.0
576,2017/01/05,742.0,741.027,743.0,45300,744.0,738.0
577,2017/01/06,750.0,747.056,745.0,76200,750.0,736.0
578,2017/01/10,758.0,754.538,750.0,88500,760.0,742.0
579,2017/01/11,749.0,742.456,759.0,75600,759.0,729.0
580,2017/01/12,760.0,751.369,753.0,89600,760.0,740.0
581,2017/01/13,767.0,764.73,749.0,108200,785.0,748.0
582,2017/01/16,741.0,751.241,770.0,74200,770.0,735.0
583,2017/01/17,732.0,739.229,740.0,47600,755.0,730.0
584,2017/01/18,738.0,735.375,726.0,53900,743.0,725.0
585,2017/01/19,738.0,737.758,738.0,33900,741.0,733.0
586,2017/01/20,730.0,730.255,738.0,48200,738.0,725.0
587,2017/01/23,743.0,736.95,730.0,52100,745.0,727.0
588,2017/01/24,726.0,727.028,735.0,60300,735.0,723.0
589,2017/01/25,726.0,719.876,727.0,75100,733.0,700.0
590,2017/01/26,745.0,744.918,731.0,63000,756.0,728.0
591,2017/01/27,734.0,737.924,742.0,56800,745.0,727.0
592,2017/01/30,756.0,746.349,730.0,65100,760.0,728.0
593,2017/01/31,743.0,745.251,750.0,36600,750.0,737.0
594,2017/02/01,758.0,751.303,745.0,60500,760.0,736.0
595,2017/02/02,750.0,754.212,762.0,59900,762.0,746.0
596,2017/02/03,775.0,787.204,780.0,273900,825.0,768.0
597,2017/02/06,773.0,778.74,790.0,61500,793.0,772.0
598,2017/02/07,768.0,771.24,770.0,95400,779.0,762.0
599,2017/02/08,772.0,775.462,772.0,37200,786.0,771.0
600,2017/02/09,775.0,775.695,773.0,46500,780.0,772.0
601,2017/02/10,776.0,779.109,784.0,55000,788.0,774.0
602,2017/02/13,780.0,780.318,781.0,30200,788.0,777.0
603,2017/02/14,780.0,781.585,780.0,36100,788.0,780.0
604,2017/02/15,780.0,781.495,780.0,48100,788.0,779.0
605,2017/02/16,781.0,780.782,782.0,31200,785.0,777.0
606,2017/02/17,784.0,781.456,780.0,18200,784.0,778.0
607,2017/02/20,807.0,799.006,786.0,54800,808.0,784.0
608,2017/02/21,816.0,813.53,810.0,50800,816.0,808.0
609,2017/02/22,789.0,800.262,819.0,67300,820.0,788.0
610,2017/02/23,795.0,793.62,790.0,29500,799.0,790.0
611,2017/02/24,788.0,793.84,800.0,55100,800.0,785.0
612,2017/02/27,783.0,784.887,790.0,47000,791.0,778.0
613,2017/02/28,786.0,785.316,785.0,47100,794.0,781.0
614,2017/03/01,848.0,825.923,809.0,283400,848.0,799.0
615,2017/03/02,851.0,859.385,881.0,184800,882.0,841.0
616,2017/03/03,853.0,851.003,850.0,96800,855.0,847.0
617,2017/03/06,892.0,870.563,856.0,147400,893.0,855.0
618,2017/03/07,882.0,882.555,891.0,74400,891.0,874.0
619,2017/03/08,869.0,870.904,880.0,84400,880.0,863.0
620,2017/03/09,896.0,888.436,878.0,92500,896.0,876.0
621,2017/03/10,935.0,917.751,899.0,161300,936.0,899.0
622,2017/03/13,921.0,925.107,943.0,145200,946.0,912.0
623,2017/03/14,945.0,937.134,922.0,70100,945.0,922.0
624,2017/03/15,985.0,970.242,949.0,135800,986.0,949.0
625,2017/03/16,961.0,961.178,960.0,161200,978.0,953.0
626,2017/03/17,995.0,977.674,969.0,156600,997.0,951.0
627,2017/03/21,1003.0,1004.94,1010.0,182400,1015.0,993.0
628,2017/03/22,994.0,992.23,1002.0,190100,1005.0,971.0
629,2017/03/23,1004.0,1001.407,994.0,122000,1006.0,989.0
630,2017/03/24,1052.0,1026.413,998.0,184200,1058.0,994.0
631,2017/03/27,1047.0,1052.345,1060.0,164300,1076.0,1032.0
632,2017/03/28,1031.0,1023.402,1055.0,432700,1055.0,955.0
633,2017/03/29,1007.0,1009.873,1012.0,240700,1021.0,991.0
634,2017/03/30,975.0,991.126,1005.0,215500,1032.0,968.0
635,2017/03/31,965.0,973.991,990.0,229200,997.0,963.0
636,2017/04/03,976.0,974.909,971.0,139400,993.0,955.0
637,2017/04/04,981.0,975.168,975.0,234000,996.0,960.0
638,2017/04/05,989.0,978.683,990.0,160700,999.0,961.0
639,2017/04/06,936.0,947.372,992.0,162500,992.0,929.0
640,2017/04/07,950.0,950.974,946.0,80300,964.0,941.0
641,2017/04/10,952.0,945.232,940.0,71500,957.0,932.0
642,2017/04/11,926.0,928.083,940.0,51600,942.0,920.0
643,2017/04/12,913.0,903.569,900.0,138500,916.0,895.0
644,2017/04/13,896.0,897.481,898.0,72200,905.0,890.0
645,2017/04/14,909.0,904.662,890.0,75100,913.0,890.0
646,2017/04/17,932.0,924.136,900.0,61900,936.0,900.0
647,2017/04/18,957.0,954.265,953.0,86800,965.0,943.0
648,2017/04/19,946.0,949.348,950.0,71000,960.0,944.0
649,2017/04/20,971.0,965.169,954.0,76800,973.0,953.0
650,2017/04/21,990.0,990.4,978.0,122400,1003.0,976.0
651,2017/04/24,981.0,985.189,993.0,141400,1004.0,973.0
652,2017/04/25,977.0,981.082,982.0,80400,989.0,970.0
653,2017/04/26,1005.0,1000.458,990.0,173300,1012.0,982.0
654,2017/04/27,998.0,997.808,1009.0,138900,1009.0,990.0
655,2017/04/28,951.0,958.117,993.0,126800,993.0,947.0
656,2017/05/01,958.0,950.748,951.0,71500,962.0,943.0
657,2017/05/02,965.0,973.621,966.0,150000,994.0,959.0
658,2017/05/08,997.0,995.728,988.0,124000,1005.0,978.0
659,2017/05/09,999.0,998.761,998.0,99200,1007.0,984.0
660,2017/05/10,870.0,898.509,944.0,642700,949.0,870.0
661,2017/05/11,858.0,865.234,869.0,292800,889.0,852.0
662,2017/05/12,865.0,861.201,858.0,203400,873.0,852.0
663,2017/05/15,883.0,877.046,870.0,199500,885.0,867.0
664,2017/05/16,890.0,884.844,889.0,155900,890.0,878.0
665,2017/05/17,886.0,884.037,885.0,199800,894.0,876.0
666,2017/05/18,845.0,851.561,857.0,209300,868.0,844.0
667,2017/05/19,845.0,843.133,847.0,138100,852.0,836.0
668,2017/05/22,853.0,852.651,853.0,96600,859.0,848.0
669,2017/05/23,850.0,849.741,853.0,101700,856.0,844.0
670,2017/05/24,843.0,845.166,852.0,104300,854.0,840.0
671,2017/05/25,843.0,846.426,844.0,87400,853.0,842.0
672,2017/05/26,846.0,844.106,845.0,102300,849.0,839.0
673,2017/05/29,851.0,851.375,846.0,72200,857.0,844.0
674,2017/05/30,848.0,846.034,848.0,124700,853.0,833.0
675,2017/05/31,821.0,831.542,848.0,195400,849.0,820.0
676,2017/06/01,834.0,833.568,825.0,111200,842.0,825.0
677,2017/06/02,822.0,832.352,839.0,197200,846.0,821.0
678,2017/06/05,804.0,808.413,825.0,201700,827.0,802.0
679,2017/06/06,811.0,812.928,804.0,187700,824.0,800.0
680,2017/06/07,797.0,797.591,805.0,213100,807.0,791.0
681,2017/06/08,799.0,799.975,800.0,173800,810.0,794.0
682,2017/06/09,802.0,804.691,805.0,222900,817.0,796.0
683,2017/06/12,796.0,798.865,797.0,170000,811.0,793.0
684,2017/06/13,828.0,832.39,804.0,333900,850.0,803.0
685,2017/06/14,831.0,838.783,835.0,254300,851.0,827.0
686,2017/06/15,845.0,846.014,832.0,189100,856.0,832.0
687,2017/06/16,820.0,831.201,854.0,202700,859.0,819.0
688,2017/06/19,837.0,837.292,823.0,85300,845.0,823.0
689,2017/06/20,850.0,849.671,849.0,120900,854.0,843.0
690,2017/06/21,832.0,838.763,855.0,80100,855.0,832.0
691,2017/06/22,825.0,829.873,833.0,91500,838.0,824.0
692,2017/06/23,880.0,880.638,870.0,538600,896.0,864.0
693,2017/06/26,853.0,867.6,881.0,180600,883.0,853.0
694,2017/06/27,852.0,853.03,858.0,101500,862.0,842.0
695,2017/06/28,843.0,846.159,855.0,102800,857.0,842.0
696,2017/06/29,851.0,850.242,846.0,94200,854.0,842.0
697,2017/06/30,843.0,848.091,851.0,138300,856.0,842.0
698,2017/07/03,859.0,859.645,849.0,176800,870.0,849.0
699,2017/07/04,833.0,843.647,865.0,184300,865.0,832.0
700,2017/07/05,833.0,833.126,833.0,134600,838.0,826.0
701,2017/07/06,841.0,844.058,834.0,110600,854.0,834.0
702,2017/07/07,837.0,839.231,839.0,91200,845.0,834.0
703,2017/07/10,844.0,844.983,841.0,77500,850.0,838.0
704,2017/07/11,850.0,851.499,844.0,74900,858.0,844.0
705,2017/07/12,844.0,845.904,850.0,91000,851.0,843.0
706,2017/07/13,845.0,844.882,845.0,81500,848.0,842.0
707,2017/07/14,848.0,846.554,849.0,35200,849.0,842.0
708,2017/07/18,865.0,859.571,848.0,185000,868.0,848.0
709,2017/07/19,873.0,873.203,861.0,129300,882.0,857.0
710,2017/07/20,884.0,881.238,883.0,112400,885.0,877.0
711,2017/07/21,879.0,876.256,884.0,83700,886.0,871.0
712,2017/07/24,888.0,883.458,879.0,73100,888.0,877.0
713,2017/07/25,888.0,889.408,887.0,82700,894.0,885.0
714,2017/07/26,881.0,880.049,888.0,103900,888.0,875.0
715,2017/07/27,891.0,890.083,879.0,113900,899.0,879.0
716,2017/07/28,888.0,884.321,891.0,95600,891.0,873.0
717,2017/07/31,888.0,886.497,888.0,57600,892.0,881.0
718,2017/08/01,896.0,899.321,891.0,174700,908.0,890.0
719,2017/08/02,840.0,845.614,881.0,374600,883.0,836.0
720,2017/08/03,851.0,846.398,845.0,135800,852.0,842.0
721,2017/08/04,866.0,860.415,854.0,84300,868.0,850.0
722,2017/08/07,865.0,864.453,868.0,62500,869.0,861.0
723,2017/08/08,870.0,871.257,870.0,94100,877.0,863.0
724,2017/08/09,870.0,869.325,871.0,131200,880.0,861.0
725,2017/08/10,872.0,870.533,866.0,79300,874.0,866.0
726,2017/08/14,878.0,876.821,861.0,139300,886.0,861.0
727,2017/08/15,902.0,895.766,880.0,148500,905.0,878.0
728,2017/08/16,909.0,905.473,902.0,80600,912.0,900.0
729,2017/08/17,912.0,907.595,909.0,77500,913.0,901.0
730,2017/08/18,899.0,895.765,882.0,78700,905.0,882.0
731,2017/08/21,909.0,904.495,899.0,46500,909.0,894.0
732,2017/08/22,912.0,905.473,899.0,55800,912.0,894.0
733,2017/08/23,910.0,911.986,919.0,56000,920.0,905.0
734,2017/08/24,915.0,917.491,910.0,64300,921.0,910.0
735,2017/08/25,910.0,910.867,915.0,57300,918.0,903.0
736,2017/08/28,917.0,914.277,910.0,65000,920.0,907.0
737,2017/08/29,916.0,913.512,907.0,65800,918.0,905.0
738,2017/08/30,958.0,939.945,916.0,142800,958.0,909.0
739,2017/08/31,960.0,958.316,973.0,124200,973.0,943.0
740,2017/09/01,951.0,950.821,960.0,79100,960.0,944.0
741,2017/09/04,940.0,939.451,946.0,58300,948.0,928.0
742,2017/09/05,938.0,941.487,940.0,62800,952.0,934.0
743,2017/09/06,952.0,942.404,925.0,72500,960.0,921.0
744,2017/09/07,949.0,950.077,953.0,87100,958.0,942.0
745,2017/09/08,956.0,954.73,950.0,55200,960.0,948.0
746,2017/09/11,960.0,961.318,956.0,51600,969.0,954.0
747,2017/09/12,966.0,966.428,969.0,53000,974.0,959.0
748,2017/09/13,970.0,966.767,966.0,42100,973.0,959.0
749,2017/09/14,960.0,958.167,968.0,111500,969.0,951.0
750,2017/09/15,954.0,958.614,960.0,85500,968.0,952.0
751,2017/09/19,972.0,967.033,951.0,66500,976.0,951.0
752,2017/09/20,976.0,976.203,970.0,52800,980.0,970.0
753,2017/09/21,978.0,979.84,974.0,63000,988.0,974.0
754,2017/09/22,982.0,979.595,977.0,49400,987.0,972.0
755,2017/09/25,983.0,980.927,978.0,42700,986.0,975.0
756,2017/09/26,978.0,976.492,983.0,31100,983.0,971.0
757,2017/09/27,972.0,967.64,979.0,36100,979.0,960.0
758,2017/09/28,988.0,981.122,978.0,39200,988.0,970.0
759,2017/09/29,984.0,984.447,984.0,24600,987.0,982.0
760,2017/10/02,976.0,974.134,981.0,33700,981.0,968.0
761,2017/10/03,978.0,977.451,975.0,33900,982.0,972.0
762,2017/10/04,980.0,979.613,987.0,28900,987.0,972.0
763,2017/10/05,971.0,969.872,977.0,32100,978.0,966.0
764,2017/10/06,980.0,979.013,979.0,37900,983.0,965.0
765,2017/10/10,999.0,986.339,980.0,109300,999.0,968.0
766,2017/10/11,984.0,983.674,997.0,57000,997.0,976.0
767,2017/10/12,984.0,982.598,978.0,34600,987.0,978.0
768,2017/10/13,996.0,986.069,980.0,42100,997.0,974.0
769,2017/10/16,999.0,1002.63,994.0,86500,1015.0,994.0
770,2017/10/17,973.0,981.836,993.0,76100,1002.0,964.0
771,2017/10/18,961.0,960.534,973.0,56200,977.0,950.0
772,2017/10/19,962.0,965.671,963.0,49300,974.0,961.0
773,2017/10/20,952.0,954.802,963.0,41000,963.0,951.0
774,2017/10/23,949.0,951.958,959.0,49600,962.0,947.0
775,2017/10/24,950.0,948.119,945.0,48100,953.0,940.0
776,2017/10/25,933.0,935.896,950.0,66200,951.0,929.0
777,2017/10/26,940.0,937.069,933.0,36500,941.0,931.0
778,2017/10/27,958.0,951.988,938.0,50400,960.0,936.0
779,2017/10/30,964.0,963.542,965.0,155300,974.0,952.0
780,2017/10/31,971.0,970.494,964.0,62400,975.0,963.0
781,2017/11/01,976.0,980.421,978.0,48500,986.0,974.0
782,2017/11/02,972.0,969.375,976.0,68300,976.0,960.0
783,2017/11/06,950.0,938.856,935.0,116400,952.0,924.0
784,2017/11/07,949.0,941.629,940.0,104500,949.0,932.0
785,2017/11/08,956.0,950.339,946.0,91000,957.0,936.0
786,2017/11/09,964.0,959.555,959.0,130000,966.0,952.0
787,2017/11/10,964.0,960.04,952.0,42900,968.0,950.0
788,2017/11/13,957.0,955.512,961.0,123900,962.0,951.0
789,2017/11/14,954.0,952.55,950.0,85300,959.0,941.0
790,2017/11/15,967.0,953.567,951.0,167800,967.0,943.0
791,2017/11/16,966.0,963.486,957.0,58800,973.0,953.0
792,2017/11/17,966.0,965.689,970.0,116500,973.0,959.0
793,2017/11/20,970.0,970.331,970.0,54100,974.0,959.0
794,2017/11/21,967.0,968.011,965.0,54900,972.0,961.0
795,2017/11/22,974.0,972.534,964.0,41800,978.0,963.0
796,2017/11/24,977.0,974.737,965.0,31900,979.0,965.0
797,2017/11/27,982.0,980.851,978.0,40900,984.0,977.0
798,2017/11/28,983.0,980.162,981.0,30900,984.0,972.0
799,2017/11/29,997.0,992.501,979.0,75600,1006.0,971.0
800,2017/11/30,994.0,994.839,997.0,78100,1000.0,988.0
801,2017/12/01,1000.0,994.835,994.0,37000,1000.0,988.0
802,2017/12/04,999.0,1005.21,1000.0,85700,1018.0,999.0
803,2017/12/05,1010.0,1009.732,999.0,86600,1016.0,999.0
804,2017/12/06,1000.0,1004.214,999.0,90600,1014.0,999.0
805,2017/12/07,1014.0,1007.034,1000.0,113300,1014.0,991.0
806,2017/12/08,1018.0,1018.22,1006.0,67300,1033.0,1006.0
807,2017/12/11,1017.0,1014.488,1011.0,53500,1022.0,1006.0
808,2017/12/12,1029.0,1028.003,1019.0,38500,1038.0,1018.0
809,2017/12/13,1034.0,1036.39,1029.0,44900,1044.0,1028.0
810,2017/12/14,1037.0,1038.268,1034.0,71200,1046.0,1032.0
811,2017/12/15,1031.0,1030.564,1029.0,95500,1035.0,1025.0
812,2017/12/18,1007.0,1018.121,1032.0,43800,1032.0,1007.0
813,2017/12/19,999.0,1000.84,1005.0,53200,1010.0,995.0
814,2017/12/20,991.0,989.875,999.0,76200,999.0,979.0
815,2017/12/21,1007.0,1001.603,991.0,72000,1013.0,981.0
816,2017/12/22,1014.0,1013.483,1007.0,23200,1019.0,1005.0
817,2017/12/25,1010.0,1010.013,1008.0,15800,1015.0,1007.0
818,2017/12/26,996.0,997.653,997.0,27400,1000.0,996.0
819,2017/12/27,1005.0,1005.16,993.0,30700,1015.0,993.0
820,2017/12/28,996.0,998.134,1005.0,26800,1011.0,991.0
821,2017/12/29,988.0,991.824,995.0,29500,999.0,987.0
822,2018/01/04,1000.0,993.657,986.0,35900,1000.0,985.0
823,2018/01/05,997.0,997.184,1000.0,36400,1002.0,993.0
824,2018/01/09,998.0,997.867,1000.0,38300,1006.0,992.0
825,2018/01/10,994.0,994.79,998.0,30000,1001.0,992.0
826,2018/01/11,1002.0,997.6,995.0,37700,1004.0,992.0
827,2018/01/12,990.0,991.872,998.0,40700,998.0,988.0
828,2018/01/15,991.0,991.101,990.0,27700,994.0,989.0
829,2018/01/16,987.0,988.671,994.0,24000,994.0,986.0
830,2018/01/17,979.0,980.206,987.0,47700,989.0,976.0
831,2018/01/18,977.0,977.124,984.0,39600,984.0,973.0
832,2018/01/19,969.0,970.556,974.0,33100,974.0,967.0
833,2018/01/22,976.0,967.362,970.0,51900,976.0,960.0
834,2018/01/23,975.0,978.92,983.0,32600,988.0,972.0
835,2018/01/24,977.0,978.472,975.0,42800,985.0,972.0
836,2018/01/25,986.0,985.559,977.0,41700,993.0,975.0
837,2018/01/26,1006.0,1000.725,991.0,61700,1008.0,987.0
838,2018/01/29,1009.0,1008.305,1010.0,43000,1013.0,1001.0
839,2018/01/30,990.0,996.621,1009.0,45600,1009.0,988.0
840,2018/01/31,960.0,971.277,983.0,66400,984.0,960.0
841,2018/02/01,970.0,965.764,961.0,39900,973.0,960.0
842,2018/02/02,958.0,959.851,964.0,47100,966.0,954.0
843,2018/02/05,922.0,918.057,910.0,129600,932.0,904.0
844,2018/02/06,873.0,879.31,900.0,123800,902.0,856.0
845,2018/02/07,873.0,886.596,884.0,98500,904.0,873.0
846,2018/02/08,875.0,878.275,883.0,44800,890.0,872.0
847,2018/02/09,870.0,861.513,855.0,71900,871.0,847.0
848,2018/02/13,855.0,866.387,884.0,86100,884.0,855.0
849,2018/02/14,838.0,841.679,855.0,84600,857.0,831.0
850,2018/02/15,843.0,842.009,835.0,57900,849.0,830.0
851,2018/02/16,850.0,851.974,846.0,79100,865.0,845.0
852,2018/02/19,876.0,870.728,856.0,36400,877.0,856.0
853,2018/02/20,886.0,878.975,876.0,44300,888.0,869.0
854,2018/02/21,862.0,869.474,888.0,70500,889.0,861.0
855,2018/02/22,860.0,860.46,863.0,42000,866.0,855.0
856,2018/02/23,887.0,882.454,869.0,36100,892.0,868.0
857,2018/02/26,897.0,895.964,900.0,63000,904.0,888.0
858,2018/02/27,881.0,886.594,900.0,75200,900.0,875.0
859,2018/02/28,879.0,889.946,881.0,66000,915.0,879.0
860,2018/03/01,872.0,874.212,875.0,73500,887.0,867.0
861,2018/03/02,863.0,861.283,863.0,59800,868.0,854.0
862,2018/03/05,846.0,848.865,862.0,67500,862.0,840.0
863,2018/03/06,850.0,850.222,855.0,54100,859.0,844.0
864,2018/03/07,848.0,847.698,850.0,49700,858.0,837.0
865,2018/03/08,851.0,851.772,855.0,55800,856.0,844.0
866,2018/03/09,850.0,852.602,856.0,69100,861.0,845.0
867,2018/03/12,860.0,865.702,857.0,110500,878.0,851.0
868,2018/03/13,859.0,858.522,860.0,98800,861.0,851.0
869,2018/03/14,858.0,858.386,858.0,70700,864.0,852.0
870,2018/03/15,832.0,842.057,852.0,170600,855.0,829.0
871,2018/03/16,835.0,834.118,831.0,130300,841.0,831.0
872,2018/03/19,826.0,831.344,832.0,137700,844.0,825.0
873,2018/03/20,823.0,821.197,820.0,129000,829.0,815.0
874,2018/03/22,835.0,829.81,827.0,137900,838.0,825.0
875,2018/03/23,814.0,818.127,819.0,207500,822.0,813.0
876,2018/03/26,814.0,808.463,814.0,333900,815.0,793.0
877,2018/03/27,879.0,868.391,874.0,593800,888.0,836.0
878,2018/03/28,859.0,854.776,859.0,248300,863.0,834.0
879,2018/03/29,874.0,867.416,859.0,100000,875.0,859.0
880,2018/03/30,860.0,863.655,874.0,58200,874.0,854.0
881,2018/04/02,854.0,860.348,865.0,60000,867.0,853.0
882,2018/04/03,845.0,843.863,842.0,46600,848.0,835.0
883,2018/04/04,860.0,857.462,849.0,114900,864.0,844.0
884,2018/04/05,855.0,855.747,860.0,56400,865.0,850.0
885,2018/04/06,847.0,848.541,850.0,64100,854.0,844.0
886,2018/04/09,841.0,842.663,848.0,33200,848.0,839.0
887,2018/04/10,836.0,836.502,841.0,55600,841.0,832.0
888,2018/04/11,838.0,833.829,834.0,37900,840.0,827.0
889,2018/04/12,832.0,832.99,836.0,20200,836.0,830.0
890,2018/04/13,845.0,840.91,835.0,40900,847.0,833.0
891,2018/04/16,842.0,839.928,840.0,47300,844.0,835.0
892,2018/04/17,834.0,836.116,845.0,25900,845.0,833.0
893,2018/04/18,838.0,833.79,833.0,37100,840.0,827.0
894,2018/04/19,842.0,839.596,837.0,36600,845.0,835.0
895,2018/04/20,838.0,835.573,843.0,48000,843.0,832.0
896,2018/04/23,830.0,830.747,841.0,48600,842.0,828.0
897,2018/04/24,835.0,833.057,832.0,38500,839.0,829.0
898,2018/04/25,843.0,838.838,835.0,35200,844.0,834.0
899,2018/04/26,851.0,849.577,848.0,50100,853.0,846.0
900,2018/04/27,859.0,856.55,855.0,74900,865.0,851.0
901,2018/05/01,866.0,859.808,856.0,29100,867.0,849.0
902,2018/05/02,859.0,860.574,865.0,39900,866.0,855.0
903,2018/05/07,873.0,866.314,861.0,85000,874.0,860.0
904,2018/05/08,880.0,879.609,872.0,63900,884.0,871.0
905,2018/05/09,976.0,974.22,951.0,513100,994.0,943.0
906,2018/05/10,985.0,989.161,968.0,275500,1004.0,959.0
907,2018/05/11,980.0,983.81,989.0,110500,997.0,976.0
908,2018/05/14,998.0,994.553,980.0,133600,1005.0,980.0
909,2018/05/15,989.0,988.418,989.0,155700,998.0,976.0
910,2018/05/16,984.0,980.911,980.0,84600,985.0,976.0
911,2018/05/17,985.0,983.041,983.0,87100,989.0,974.0
912,2018/05/18,993.0,988.582,990.0,90900,997.0,974.0
913,2018/05/21,997.0,996.522,995.0,71600,1002.0,991.0
914,2018/05/22,982.0,989.456,1002.0,72200,1002.0,980.0
915,2018/05/23,988.0,986.503,982.0,138400,998.0,973.0
916,2018/05/24,977.0,979.813,990.0,50200,992.0,970.0
917,2018/05/25,962.0,962.298,973.0,55700,973.0,954.0
918,2018/05/28,972.0,974.146,962.0,101400,980.0,962.0
919,2018/05/29,953.0,957.543,980.0,77600,980.0,942.0
920,2018/05/30,976.0,969.673,945.0,149800,980.0,944.0
921,2018/05/31,1012.0,992.44,977.0,183300,1013.0,973.0
922,2018/06/01,1004.0,1005.181,1004.0,151700,1012.0,998.0
923,2018/06/04,1011.0,998.624,1007.0,131200,1012.0,987.0
924,2018/06/05,1035.0,1018.881,1010.0,195800,1035.0,997.0
925,2018/06/06,1069.0,1056.801,1040.0,226100,1070.0,1029.0
926,2018/06/07,1086.0,1068.897,1058.0,153900,1087.0,1044.0
927,2018/06/08,1029.0,1036.074,1075.0,218700,1075.0,1017.0
928,2018/06/11,1060.0,1035.7,1023.0,146100,1065.0,1011.0
929,2018/06/12,1046.0,1049.41,1059.0,120400,1059.0,1041.0
930,2018/06/13,1059.0,1045.011,1036.0,132200,1066.0,1032.0
931,2018/06/14,1078.0,1064.64,1057.0,170000,1081.0,1039.0
932,2018/06/15,1081.0,1071.591,1077.0,153100,1085.0,1057.0
933,2018/06/18,1077.0,1066.456,1070.0,157600,1079.0,1045.0
934,2018/06/19,1072.0,1071.538,1066.0,137300,1083.0,1053.0
935,2018/06/20,1087.0,1078.231,1072.0,126700,1094.0,1066.0
936,2018/06/21,1070.0,1076.805,1087.0,114600,1088.0,1068.0
937,2018/06/22,1098.0,1076.785,1070.0,203900,1098.0,1048.0
938,2018/06/25,1050.0,1057.545,1093.0,159400,1093.0,1043.0
939,2018/06/26,1037.0,1031.351,1039.0,168600,1042.0,1018.0
940,2018/06/27,1038.0,1033.622,1039.0,146000,1050.0,1018.0
941,2018/06/28,1030.0,1013.746,1038.0,146300,1040.0,990.0
942,2018/06/29,1024.0,1019.674,1030.0,110600,1031.0,1009.0
943,2018/07/02,998.0,1011.887,1024.0,146500,1025.0,995.0
944,2018/07/03,996.0,992.666,998.0,114600,1003.0,985.0
945,2018/07/04,999.0,991.67,981.0,66600,1001.0,981.0
946,2018/07/05,998.0,997.488,995.0,74600,1004.0,989.0
947,2018/07/06,1008.0,1002.519,1005.0,98900,1009.0,987.0
948,2018/07/09,1023.0,1020.988,1012.0,123100,1033.0,997.0
949,2018/07/10,999.0,1003.29,1025.0,76100,1026.0,993.0
950,2018/07/11,986.0,988.593,993.0,63600,993.0,984.0
951,2018/07/12,1001.0,998.811,996.0,55000,1008.0,988.0
952,2018/07/13,1001.0,996.311,998.0,30200,1002.0,989.0
953,2018/07/17,1005.0,1009.105,1001.0,44600,1015.0,1001.0
954,2018/07/18,1016.0,1014.0,1008.0,26300,1018.0,1008.0
955,2018/07/19,1020.0,1018.475,1015.0,78600,1025.0,1008.0
956,2018/07/20,1014.0,1011.261,1022.0,86100,1022.0,1001.0
957,2018/07/23,1007.0,1010.964,1004.0,52600,1022.0,1002.0
958,2018/07/24,1003.0,1005.579,1011.0,47500,1015.0,1000.0
959,2018/07/25,1000.0,1001.155,1005.0,45300,1012.0,994.0
960,2018/07/26,1007.0,1007.7,1001.0,42700,1010.0,1001.0
961,2018/07/27,1015.0,1012.694,1010.0,49600,1018.0,1002.0
962,2018/07/30,1001.0,1000.36,1007.0,55500,1012.0,996.0
963,2018/07/31,1020.0,1009.978,1000.0,126500,1024.0,986.0
964,2018/08/01,1013.0,1012.332,1019.0,108400,1025.0,1000.0
965,2018/08/02,1005.0,1008.176,1020.0,83900,1021.0,1000.0
966,2018/08/03,997.0,996.271,1005.0,62000,1006.0,992.0
967,2018/08/06,989.0,991.782,1007.0,53700,1007.0,986.0
968,2018/08/07,992.0,986.145,983.0,37300,994.0,977.0
969,2018/08/08,1003.0,1001.037,995.0,51900,1007.0,994.0
970,2018/08/09,997.0,998.349,1000.0,75900,1003.0,994.0
971,2018/08/10,1001.0,997.382,997.0,101400,1004.0,987.0
972,2018/08/13,970.0,970.413,997.0,94100,997.0,957.0
973,2018/08/14,1002.0,992.325,973.0,76000,1003.0,972.0
974,2018/08/15,985.0,989.717,1004.0,85100,1010.0,981.0
975,2018/08/16,972.0,969.618,978.0,73800,978.0,962.0
976,2018/08/17,968.0,967.048,972.0,60700,975.0,957.0
977,2018/08/20,970.0,969.631,968.0,43400,977.0,959.0
978,2018/08/21,962.0,959.936,966.0,66000,966.0,951.0
979,2018/08/22,965.0,963.789,962.0,62500,971.0,955.0
980,2018/08/23,962.0,964.064,967.0,80200,970.0,958.0
981,2018/08/24,963.0,963.14,965.0,45700,968.0,956.0
982,2018/08/27,963.0,961.673,964.0,57400,969.0,953.0
983,2018/08/28,956.0,959.429,967.0,42000,973.0,954.0
984,2018/08/29,958.0,957.804,954.0,46300,966.0,952.0
985,2018/08/30,959.0,953.902,967.0,90900,967.0,948.0
986,2018/08/31,968.0,962.734,952.0,72200,969.0,952.0
987,2018/09/03,924.0,931.874,960.0,234200,960.0,916.0
988,2018/09/04,897.0,900.701,903.0,240400,919.0,885.0
989,2018/09/05,892.0,890.947,895.0,107200,898.0,885.0
990,2018/09/06,887.0,884.837,890.0,77400,891.0,881.0
991,2018/09/07,881.0,882.987,881.0,147900,892.0,877.0
992,2018/09/10,872.0,876.168,880.0,88800,885.0,871.0
993,2018/09/11,855.0,861.828,867.0,98900,871.0,851.0
994,2018/09/12,851.0,850.359,851.0,79900,858.0,846.0
995,2018/09/13,852.0,855.374,850.0,71900,864.0,850.0
996,2018/09/14,865.0,858.369,853.0,96500,867.0,849.0
997,2018/09/18,886.0,883.194,866.0,104100,893.0,861.0
998,2018/09/19,905.0,900.562,900.0,110300,907.0,890.0
999,2018/09/20,893.0,896.995,908.0,56700,908.0,889.0
1000,2018/09/21,908.0,908.546,901.0,74500,914.0,899.0
1001,2018/09/25,913.0,910.818,911.0,96900,915.0,904.0
1002,2018/09/26,920.0,919.315,923.0,183800,929.0,908.0
1003,2018/09/27,899.0,905.777,920.0,138300,922.0,897.0
1004,2018/09/28,901.0,904.318,907.0,96200,910.0,901.0
1005,2018/10/01,902.0,899.758,900.0,118200,902.0,891.0
1006,2018/10/02,902.0,900.944,908.0,108600,909.0,895.0
1007,2018/10/03,895.0,896.827,902.0,107300,906.0,892.0
1008,2018/10/04,896.0,896.364,895.0,89400,902.0,892.0
1009,2018/10/05,880.0,884.785,891.0,126700,894.0,880.0
1010,2018/10/09,869.0,868.847,872.0,170400,878.0,863.0
1011,2018/10/10,871.0,879.246,878.0,181900,892.0,870.0
1012,2018/10/11,857.0,853.827,850.0,138500,863.0,844.0
1013,2018/10/12,859.0,858.022,858.0,91600,865.0,850.0
1014,2018/10/15,850.0,851.236,855.0,116800,856.0,848.0
1015,2018/10/16,847.0,850.703,850.0,75700,859.0,844.0
1016,2018/10/17,856.0,854.405,853.0,97700,859.0,848.0
1017,2018/10/18,847.0,849.493,859.0,117800,860.0,845.0
1018,2018/10/19,838.0,839.247,844.0,79400,844.0,834.0
1019,2018/10/22,839.0,838.711,840.0,76800,847.0,833.0
1020,2018/10/23,831.0,832.048,835.0,70900,838.0,829.0
1021,2018/10/24,830.0,830.097,832.0,85200,838.0,825.0
1022,2018/10/25,804.0,804.616,817.0,129200,819.0,798.0
1023,2018/10/26,802.0,802.892,806.0,97400,816.0,795.0
1024,2018/10/29,796.0,801.329,802.0,112200,816.0,794.0
1025,2018/10/30,810.0,806.222,794.0,92400,814.0,788.0
1026,2018/10/31,835.0,831.177,835.0,140400,843.0,822.0
1027,2018/11/01,836.0,835.09,836.0,122400,840.0,829.0
1028,2018/11/02,903.0,892.165,875.0,375500,911.0,858.0
1029,2018/11/05,899.0,889.475,891.0,117100,901.0,876.0
1030,2018/11/06,901.0,903.256,901.0,94600,909.0,898.0
1031,2018/11/07,905.0,905.532,900.0,92500,913.0,897.0
1032,2018/11/08,921.0,917.884,914.0,135000,926.0,908.0
1033,2018/11/09,931.0,924.648,921.0,77200,931.0,913.0
1034,2018/11/12,924.0,922.676,921.0,54600,929.0,914.0
1035,2018/11/13,904.0,901.688,906.0,105300,907.0,891.0
1036,2018/11/14,930.0,920.766,900.0,140600,935.0,900.0
1037,2018/11/15,921.0,916.801,920.0,91900,923.0,909.0
1038,2018/11/16,926.0,928.675,919.0,138900,938.0,912.0
1039,2018/11/19,916.0,916.42,920.0,73900,921.0,912.0
1040,2018/11/20,925.0,918.55,905.0,83700,926.0,905.0
1041,2018/11/21,924.0,919.728,918.0,78400,926.0,910.0
1042,2018/11/22,928.0,927.085,927.0,42300,933.0,920.0
1043,2018/11/26,928.0,926.65,928.0,31700,935.0,922.0
1044,2018/11/27,935.0,936.202,940.0,96200,942.0,930.0
1045,2018/11/28,944.0,942.582,940.0,57600,948.0,937.0
1046,2018/11/29,958.0,957.468,950.0,110900,965.0,950.0
1047,2018/11/30,944.0,946.256,957.0,57100,957.0,942.0
1048,2018/12/03,939.0,937.16,945.0,91900,945.0,932.0
1049,2018/12/04,925.0,929.214,945.0,71900,945.0,922.0
1050,2018/12/05,923.0,915.556,915.0,56500,923.0,905.0
1051,2018/12/06,927.0,923.885,911.0,76500,931.0,911.0
1052,2018/12/07,904.0,906.448,922.0,55100,923.0,901.0
1053,2018/12/10,880.0,885.335,899.0,78600,899.0,878.0
1054,2018/12/11,877.0,873.772,885.0,65300,885.0,870.0
1055,2018/12/12,895.0,887.74,885.0,54200,895.0,883.0
1056,2018/12/13,919.0,915.362,897.0,71200,921.0,897.0
1057,2018/12/14,903.0,906.383,909.0,88900,910.0,898.0
1058,2018/12/17,912.0,909.063,902.0,49500,916.0,902.0
1059,2018/12/18,899.0,898.443,900.0,53300,902.0,891.0
1060,2018/12/19,894.0,892.899,893.0,48300,901.0,887.0
1061,2018/12/20,887.0,878.135,892.0,105600,892.0,863.0
1062,2018/12/21,828.0,838.366,872.0,109900,873.0,823.0
1063,2018/12/25,804.0,806.514,819.0,114400,820.0,795.0
1064,2018/12/26,833.0,829.721,819.0,60900,838.0,818.0
1065,2018/12/27,882.0,875.351,874.0,77500,883.0,865.0
1066,2018/12/28,891.0,888.376,883.0,70700,893.0,873.0
1067,2019/01/04,886.0,876.856,876.0,63800,887.0,863.0
1068,2019/01/07,891.0,896.461,901.0,64200,916.0,889.0
1069,2019/01/08,892.0,886.659,892.0,49600,895.0,874.0
1070,2019/01/09,890.0,890.054,898.0,62600,900.0,881.0
1071,2019/01/10,898.0,888.234,890.0,75500,902.0,876.0
1072,2019/01/11,885.0,886.782,901.0,48200,901.0,882.0
1073,2019/01/15,903.0,892.707,877.0,86600,903.0,872.0
1074,2019/01/16,918.0,913.849,897.0,103100,924.0,896.0
1075,2019/01/17,910.0,914.017,921.0,59000,930.0,905.0
1076,2019/01/18,921.0,921.203,920.0,66400,931.0,911.0
1077,2019/01/21,908.0,909.26,924.0,76200,924.0,900.0
1078,2019/01/22,909.0,908.917,908.0,37200,914.0,906.0
1079,2019/01/23,931.0,925.612,906.0,92600,935.0,904.0
1080,2019/01/24,923.0,923.242,931.0,68900,933.0,915.0
1081,2019/01/25,947.0,949.05,928.0,101300,963.0,927.0
1082,2019/01/28,937.0,938.604,946.0,65400,946.0,936.0
1083,2019/01/29,940.0,940.755,939.0,59200,947.0,936.0
1084,2019/01/30,931.0,935.626,940.0,79600,948.0,930.0
1085,2019/01/31,917.0,919.659,931.0,118300,937.0,911.0
1086,2019/02/01,913.0,914.032,921.0,97400,924.0,908.0
1087,2019/02/04,908.0,913.686,918.0,118700,928.0,902.0
1088,2019/02/05,893.0,905.571,915.0,121500,925.0,892.0
1089,2019/02/06,866.0,877.692,897.0,133600,899.0,862.0
1090,2019/02/07,868.0,866.785,870.0,96000,876.0,860.0
1091,2019/02/08,863.0,862.276,863.0,88200,868.0,857.0
1092,2019/02/12,871.0,867.615,865.0,92900,875.0,861.0
1093,2019/02/13,861.0,858.792,871.0,94400,873.0,852.0
1094,2019/02/14,877.0,876.201,862.0,82200,886.0,862.0
1095,2019/02/15,879.0,879.86,874.0,84700,888.0,873.0
1096,2019/02/18,891.0,890.292,893.0,52100,898.0,883.0
1097,2019/02/19,888.0,886.874,890.0,49200,892.0,882.0
1098,2019/02/20,887.0,889.0,891.0,44700,895.0,884.0
1099,2019/02/21,875.0,879.528,891.0,68200,891.0,873.0
1100,2019/02/22,872.0,871.314,870.0,50400,877.0,865.0
1101,2019/02/25,884.0,882.965,882.0,60500,889.0,877.0
1102,2019/02/26,876.0,880.839,889.0,62700,892.0,874.0
1103,2019/02/27,893.0,891.317,879.0,138000,903.0,879.0
1104,2019/02/28,916.0,912.739,901.0,103600,922.0,896.0
1105,2019/03/01,919.0,919.529,916.0,68600,926.0,915.0
1106,2019/03/04,929.0,928.527,925.0,84200,932.0,923.0
1107,2019/03/05,924.0,924.893,928.0,69100,929.0,920.0
1108,2019/03/06,907.0,914.336,919.0,138000,928.0,906.0
1109,2019/03/07,906.0,902.444,907.0,103100,910.0,893.0
1110,2019/03/08,885.0,890.57,904.0,103700,904.0,879.0
1111,2019/03/11,894.0,890.468,885.0,107300,899.0,882.0
1112,2019/03/12,891.0,891.945,893.0,88400,903.0,886.0
1113,2019/03/13,880.0,884.927,894.0,63000,895.0,878.0
1114,2019/03/14,865.0,875.033,886.0,97900,889.0,865.0
1115,2019/03/15,884.0,878.506,872.0,90600,887.0,870.0
1116,2019/03/18,901.0,888.325,884.0,143300,903.0,883.0
1117,2019/03/19,892.0,894.998,896.0,83900,900.0,890.0
1118,2019/03/20,891.0,892.029,891.0,76900,900.0,886.0
1119,2019/03/22,899.0,893.687,891.0,127000,900.0,891.0
1120,2019/03/25,891.0,892.771,897.0,172400,902.0,882.0
1121,2019/03/26,910.0,906.265,898.0,272500,917.0,898.0
1122,2019/03/27,877.0,883.674,889.0,175500,889.0,869.0
1123,2019/03/28,854.0,859.447,869.0,76800,872.0,853.0
1124,2019/03/29,853.0,849.768,851.0,54300,857.0,843.0
1125,2019/04/01,866.0,865.764,860.0,43200,870.0,860.0
1126,2019/04/02,843.0,849.049,865.0,73800,866.0,842.0
1127,2019/04/03,848.0,844.537,843.0,45400,848.0,840.0
1128,2019/04/04,919.0,930.326,935.0,862600,960.0,904.0
1129,2019/04/05,956.0,943.893,917.0,351000,958.0,910.0
1130,2019/04/08,931.0,940.7,948.0,182900,957.0,929.0
1131,2019/04/09,920.0,922.07,926.0,128200,931.0,917.0
1132,2019/04/10,926.0,919.492,915.0,67700,929.0,907.0
1133,2019/04/11,914.0,912.564,924.0,55100,924.0,904.0
1134,2019/04/12,912.0,913.008,910.0,75600,920.0,908.0
1135,2019/04/15,920.0,920.374,921.0,44700,929.0,915.0
1136,2019/04/16,927.0,923.532,919.0,50200,927.0,918.0
1137,2019/04/17,917.0,920.624,927.0,99500,931.0,913.0
1138,2019/04/18,907.0,910.149,917.0,70700,918.0,906.0
1139,2019/04/19,909.0,907.618,909.0,24600,910.0,903.0
1140,2019/04/22,911.0,911.176,914.0,25000,915.0,907.0
1141,2019/04/23,914.0,911.211,911.0,34200,915.0,907.0
1142,2019/04/24,910.0,907.841,917.0,49800,917.0,901.0
1143,2019/04/25,908.0,907.998,909.0,40200,913.0,902.0
1144,2019/04/26,890.0,890.502,902.0,86700,902.0,885.0
1145,2019/05/07,903.0,902.918,892.0,103300,919.0,888.0
1146,2019/05/08,888.0,888.045,895.0,48700,896.0,883.0
1147,2019/05/09,878.0,876.729,881.0,114500,887.0,861.0
1148,2019/05/10,963.0,971.517,953.0,505400,994.0,947.0
1149,2019/05/13,978.0,978.748,956.0,179500,995.0,950.0
1150,2019/05/14,980.0,976.471,955.0,133300,981.0,954.0
1151,2019/05/15,967.0,967.269,980.0,58800,980.0,960.0
1152,2019/05/16,975.0,965.381,965.0,71400,977.0,955.0
1153,2019/05/17,975.0,973.421,975.0,45100,979.0,967.0
1154,2019/05/20,976.0,979.127,975.0,57600,986.0,973.0
1155,2019/05/21,963.0,965.441,967.0,33100,973.0,962.0
1156,2019/05/22,953.0,957.066,963.0,61800,968.0,950.0
1157,2019/05/23,953.0,955.584,955.0,46600,969.0,950.0
1158,2019/05/24,970.0,963.121,955.0,29700,970.0,950.0
1159,2019/05/27,962.0,962.57,973.0,56300,976.0,956.0
1160,2019/05/28,967.0,964.178,966.0,49000,970.0,961.0
1161,2019/05/29,980.0,975.136,963.0,106300,980.0,957.0
1162,2019/05/30,970.0,965.819,979.0,43700,979.0,957.0
1163,2019/05/31,959.0,961.132,968.0,81700,968.0,955.0
1164,2019/06/03,955.0,952.626,947.0,77900,965.0,939.0
1165,2019/06/04,968.0,962.138,967.0,34700,970.0,955.0
1166,2019/06/05,971.0,972.151,979.0,95900,984.0,959.0
1167,2019/06/06,974.0,979.297,980.0,81500,983.0,974.0
1168,2019/06/07,1011.0,996.901,977.0,142800,1016.0,973.0
1169,2019/06/10,1008.0,1005.82,1010.0,117400,1025.0,980.0
1170,2019/06/11,1027.0,1011.348,1000.0,95700,1029.0,985.0
1171,2019/06/12,1049.0,1049.99,1023.0,107000,1060.0,1023.0
1172,2019/06/13,1070.0,1066.671,1044.0,80600,1073.0,1040.0
1173,2019/06/14,1096.0,1096.879,1080.0,152400,1107.0,1076.0
1174,2019/06/17,1119.0,1123.243,1109.0,197700,1141.0,1104.0
1175,2019/06/18,1096.0,1120.621,1127.0,165000,1147.0,1096.0
1176,2019/06/19,1131.0,1126.139,1119.0,156100,1145.0,1096.0
1177,2019/06/20,1145.0,1144.214,1139.0,98000,1154.0,1125.0
1178,2019/06/21,1149.0,1144.188,1150.0,193500,1157.0,1123.0
1179,2019/06/24,1142.0,1144.593,1145.0,114700,1151.0,1135.0
1180,2019/06/25,1111.0,1116.664,1137.0,128400,1142.0,1100.0
1181,2019/06/26,1091.0,1103.571,1110.0,130100,1118.0,1091.0
1182,2019/06/27,1050.0,1058.132,1088.0,212600,1088.0,1042.0
1183,2019/06/28,1040.0,1048.654,1050.0,167700,1072.0,1038.0
1184,2019/07/01,1078.0,1072.53,1055.0,113900,1087.0,1051.0
1185,2019/07/02,1116.0,1108.389,1078.0,176700,1135.0,1075.0
1186,2019/07/03,1112.0,1112.022,1121.0,100500,1122.0,1101.0
1187,2019/07/04,1119.0,1116.891,1112.0,45900,1124.0,1104.0
1188,2019/07/05,1141.0,1139.007,1128.0,94000,1148.0,1127.0
1189,2019/07/08,1129.0,1132.399,1140.0,66100,1141.0,1125.0
1190,2019/07/09,1097.0,1102.79,1122.0,96500,1125.0,1089.0
1191,2019/07/10,1101.0,1095.998,1089.0,94700,1109.0,1072.0
1192,2019/07/11,1083.0,1080.52,1100.0,127400,1100.0,1067.0
1193,2019/07/12,1076.0,1075.409,1085.0,163700,1088.0,1064.0
1194,2019/07/16,1073.0,1066.547,1073.0,109200,1077.0,1055.0
1195,2019/07/17,1065.0,1065.16,1067.0,104000,1077.0,1052.0
1196,2019/07/18,1033.0,1044.256,1053.0,82300,1064.0,1033.0
1197,2019/07/19,1070.0,1062.699,1034.0,104800,1077.0,1025.0
1198,2019/07/22,1057.0,1065.239,1070.0,98800,1075.0,1056.0
1199,2019/07/23,1068.0,1068.075,1052.0,45300,1076.0,1050.0
1200,2019/07/24,1049.0,1056.988,1065.0,121200,1074.0,1045.0
1201,2019/07/25,1057.0,1060.648,1049.0,102800,1072.0,1046.0
1202,2019/07/26,1078.0,1073.83,1052.0,104200,1080.0,1052.0
1203,2019/07/29,1092.0,1086.425,1078.0,100100,1096.0,1066.0
1204,2019/07/30,1086.0,1087.731,1092.0,66100,1097.0,1082.0
1205,2019/07/31,1066.0,1069.986,1084.0,106600,1085.0,1065.0
1206,2019/08/01,1057.0,1058.331,1055.0,60800,1067.0,1051.0
1207,2019/08/02,1048.0,1056.991,1096.0,241200,1111.0,1030.0
1208,2019/08/05,1029.0,1021.399,1041.0,142800,1041.0,1003.0
1209,2019/08/06,1018.0,1013.955,993.0,127600,1027.0,982.0
1210,2019/08/07,1007.0,1007.9,1018.0,133200,1020.0,999.0
1211,2019/08/08,998.0,1004.584,1007.0,75200,1012.0,998.0
1212,2019/08/09,1010.0,1008.055,1001.0,72800,1015.0,1000.0
1213,2019/08/13,1013.0,1012.549,1007.0,136900,1024.0,1004.0
1214,2019/08/14,1036.0,1030.454,1029.0,66700,1037.0,1015.0
1215,2019/08/15,1006.0,1007.209,1006.0,129000,1024.0,998.0
1216,2019/08/16,1007.0,1006.08,1006.0,93800,1019.0,995.0
1217,2019/08/19,1026.0,1024.178,1018.0,91600,1029.0,1013.0
1218,2019/08/20,1040.0,1040.829,1035.0,103800,1047.0,1034.0
1219,2019/08/21,1033.0,1034.777,1026.0,50700,1045.0,1026.0
1220,2019/08/22,1013.0,1013.901,1034.0,95100,1036.0,1005.0
1221,2019/08/23,1013.0,1013.672,1013.0,58900,1023.0,1006.0
