ds,yhat
2019-08-05,739.6603668841645
2019-08-06,737.1898655229596
2019-08-07,740.8110887650812
2019-08-08,747.4017516610157
2019-08-09,751.1138196832007
2019-08-13,739.1483268038991
2019-08-14,748.7866902402851
2019-08-15,759.9928379060775
2019-08-16,766.2817969066414
2019-08-19,755.6939364060354
2019-08-20,755.6689040753425
2019-08-21,758.8217670775412
2019-08-22,761.6713798905471
2019-08-23,761.7202735766093
2019-08-26,754.6715648603727
2019-08-27,754.1175105024137
2019-08-28,754.2625288297368
2019-08-29,755.5561987784431
2019-08-30,759.2351763164152
