,Date,Close,VWAP,Open,Volume,High,Low
0,2014/08/25,1861.0,1857.691,1864.0,703000,1867.0,1843.0
1,2014/08/26,1828.0,1829.725,1856.0,738000,1856.0,1813.0
2,2014/08/27,1840.0,1838.332,1829.0,509000,1849.0,1829.0
3,2014/08/28,1884.0,1873.672,1837.0,810000,1886.0,1836.0
4,2014/08/29,1870.0,1872.078,1888.0,576000,1888.0,1861.0
5,2014/09/01,1888.0,1876.566,1858.0,357000,1890.0,1848.0
6,2014/09/02,1953.0,1942.589,1895.0,981000,1962.0,1894.0
7,2014/09/03,1964.0,1966.254,1953.0,859000,1981.0,1953.0
8,2014/09/04,1922.0,1931.712,1961.0,649000,1963.0,1919.0
9,2014/09/05,1909.0,1907.146,1922.0,357000,1926.0,1897.0
10,2014/09/08,1909.0,1908.242,1900.0,595000,1922.0,1900.0
11,2014/09/09,1935.0,1934.141,1911.0,555000,1950.0,1911.0
12,2014/09/10,1967.0,1958.811,1935.0,609000,1972.0,1935.0
13,2014/09/11,2000.0,1998.409,1980.0,816000,2009.0,1980.0
14,2014/09/12,1995.0,2001.561,2010.0,603000,2017.0,1986.0
15,2014/09/16,1913.0,1922.369,1976.0,2256000,1983.0,1893.0
16,2014/09/17,1899.0,1887.006,1904.0,2419000,1908.0,1836.0
17,2014/09/18,1930.0,1928.521,1922.0,1012000,1943.0,1909.0
18,2014/09/19,1974.0,1962.67,1920.0,2941000,1978.0,1906.0
19,2014/09/22,1989.0,1979.778,1969.0,851000,1993.0,1964.0
20,2014/09/24,1974.0,1980.958,1960.0,801000,2004.0,1958.0
21,2014/09/25,1982.0,1977.566,1998.0,913000,1998.0,1961.0
22,2014/09/26,1986.0,1978.226,1932.0,527000,1995.0,1932.0
23,2014/09/29,2015.0,2013.499,2000.0,675000,2030.0,1990.0
24,2014/09/30,2019.0,2013.637,2010.0,924000,2025.0,1995.0
25,2014/10/01,1995.0,1999.876,2010.0,638000,2016.0,1990.0
26,2014/10/02,1929.0,1938.703,1965.0,647000,1965.0,1920.0
27,2014/10/03,1928.0,1924.123,1915.0,636000,1939.0,1915.0
28,2014/10/06,1960.0,1959.057,1943.0,475000,1970.0,1936.0
29,2014/10/07,1860.0,1876.524,1932.0,1432000,1934.0,1853.0
30,2014/10/08,1832.0,1837.683,1820.0,713000,1857.0,1809.0
31,2014/10/09,1793.0,1816.366,1858.0,451000,1868.0,1787.0
32,2014/10/10,1732.0,1729.536,1728.0,888000,1766.0,1715.0
33,2014/10/14,1651.0,1653.136,1667.0,1794000,1696.0,1635.0
34,2014/10/15,1683.0,1671.771,1648.0,1548000,1688.0,1622.0
35,2014/10/16,1585.0,1606.048,1617.0,1969000,1632.0,1582.0
36,2014/10/17,1635.0,1680.557,1664.0,3626000,1747.0,1625.0
37,2014/10/20,1688.0,1688.326,1702.0,1532000,1711.0,1659.0
38,2014/10/21,1609.0,1627.268,1685.0,1435000,1685.0,1605.0
39,2014/10/22,1648.0,1642.003,1657.0,1195000,1668.0,1614.0
40,2014/10/23,1635.0,1640.955,1653.0,782000,1656.0,1630.0
41,2014/10/24,1637.0,1636.861,1659.0,734000,1667.0,1623.0
42,2014/10/27,1620.0,1623.113,1637.0,978000,1640.0,1616.0
43,2014/10/28,1599.0,1595.32,1614.0,1163000,1614.0,1581.0
44,2014/10/29,1652.0,1651.612,1637.0,926000,1668.0,1637.0
45,2014/10/30,1667.0,1668.103,1669.0,1409000,1688.0,1650.0
46,2014/10/31,1637.0,1632.041,1680.0,2986000,1687.0,1612.0
47,2014/11/04,1765.0,1756.621,1750.0,2121000,1779.0,1727.0
48,2014/11/05,1751.0,1751.321,1760.0,1830000,1770.0,1744.0
49,2014/11/06,1688.0,1715.947,1741.0,1476000,1765.0,1688.0
50,2014/11/07,1650.0,1655.454,1659.0,2130000,1673.0,1638.0
51,2014/11/10,1671.0,1665.008,1653.0,746000,1678.0,1651.0
52,2014/11/11,1658.0,1674.533,1697.0,1197000,1710.0,1653.0
53,2014/11/12,1634.0,1648.825,1666.0,1266000,1675.0,1630.0
54,2014/11/13,1620.0,1627.115,1652.0,1494000,1656.0,1616.0
55,2014/11/14,1574.0,1575.775,1620.0,2390000,1620.0,1558.0
56,2014/11/17,1571.0,1579.699,1590.0,1305000,1595.0,1567.0
57,2014/11/18,1626.0,1614.082,1596.0,1072000,1629.0,1593.0
58,2014/11/19,1669.0,1659.512,1644.0,1224000,1670.0,1644.0
59,2014/11/20,1669.0,1668.616,1678.0,885000,1684.0,1652.0
60,2014/11/21,1680.0,1673.853,1668.0,818000,1683.0,1661.0
61,2014/11/25,1714.0,1705.796,1702.0,977000,1717.0,1688.0
62,2014/11/26,1708.0,1712.06,1705.0,687000,1725.0,1703.0
63,2014/11/27,1696.0,1699.002,1708.0,504000,1708.0,1684.0
64,2014/11/28,1734.0,1723.541,1700.0,1525000,1735.0,1690.0
65,2014/12/01,1703.0,1709.469,1736.0,1027000,1745.0,1694.0
66,2014/12/02,1685.0,1685.781,1700.0,843000,1704.0,1675.0
67,2014/12/03,1623.0,1635.268,1660.0,1997000,1665.0,1601.0
68,2014/12/04,1620.0,1619.596,1623.0,1811000,1637.0,1605.0
69,2014/12/05,1653.0,1648.291,1638.0,914000,1661.0,1626.0
70,2014/12/08,1661.0,1665.853,1675.0,590000,1677.0,1659.0
71,2014/12/09,1618.0,1628.287,1646.0,735000,1649.0,1617.0
72,2014/12/10,1579.0,1588.641,1611.0,882000,1611.0,1572.0
73,2014/12/11,1562.0,1555.457,1553.0,864000,1566.0,1541.0
74,2014/12/12,1600.0,1597.316,1574.0,1186000,1624.0,1572.0
75,2014/12/15,1566.0,1574.939,1585.0,740000,1586.0,1563.0
76,2014/12/16,1462.0,1478.085,1544.0,2072000,1545.0,1450.0
77,2014/12/17,1431.0,1441.084,1450.0,1479000,1457.0,1429.0
78,2014/12/18,1450.0,1456.147,1450.0,1274000,1482.0,1446.0
79,2014/12/19,1479.0,1464.742,1481.0,1120000,1482.0,1451.0
80,2014/12/22,1493.0,1485.358,1500.0,1077000,1501.0,1475.0
81,2014/12/24,1537.0,1533.892,1531.0,1191000,1542.0,1515.0
82,2014/12/25,1530.0,1523.143,1538.0,558000,1538.0,1509.0
83,2014/12/26,1542.0,1542.576,1531.0,552000,1555.0,1531.0
84,2014/12/29,1517.0,1520.156,1542.0,846000,1550.0,1493.0
85,2014/12/30,1502.0,1503.118,1517.0,527000,1518.0,1498.0
86,2015/01/05,1495.0,1499.783,1507.0,438000,1509.0,1488.0
87,2015/01/06,1424.0,1436.397,1460.0,1031000,1464.0,1423.0
88,2015/01/07,1430.0,1428.727,1417.0,828000,1437.0,1411.0
89,2015/01/08,1469.0,1464.353,1447.0,889000,1479.0,1443.0
90,2015/01/09,1458.0,1462.718,1470.0,489000,1480.0,1452.0
91,2015/01/13,1406.0,1395.787,1430.0,1049000,1436.0,1379.0
92,2015/01/14,1366.0,1376.826,1404.0,1208000,1404.0,1357.0
93,2015/01/15,1378.0,1378.881,1360.0,1242000,1392.0,1360.0
94,2015/01/16,1346.0,1350.437,1364.0,1449000,1367.0,1340.0
95,2015/01/19,1359.0,1365.746,1363.0,1430000,1385.0,1353.0
96,2015/01/20,1389.0,1372.953,1354.0,1568000,1391.0,1353.0
97,2015/01/21,1370.0,1365.807,1373.0,1505000,1385.0,1354.0
98,2015/01/22,1370.0,1369.034,1368.0,1725000,1382.0,1355.0
99,2015/01/23,1383.0,1392.608,1393.0,1003000,1409.0,1379.0
100,2015/01/26,1458.0,1434.636,1383.0,1778000,1459.0,1382.0
101,2015/01/27,1455.0,1455.509,1463.0,1294000,1479.0,1443.0
102,2015/01/28,1445.0,1433.794,1427.0,1067000,1452.0,1400.0
103,2015/01/29,1402.0,1411.332,1425.0,943000,1442.0,1397.0
104,2015/01/30,1431.0,1425.974,1424.0,1272000,1449.0,1405.0
105,2015/02/02,1469.0,1498.566,1491.0,3585000,1547.0,1463.0
106,2015/02/03,1437.0,1459.581,1469.0,1036000,1489.0,1428.0
107,2015/02/04,1453.0,1462.03,1467.0,1756000,1484.0,1440.0
108,2015/02/05,1402.0,1411.188,1437.0,1310000,1442.0,1398.0
109,2015/02/06,1423.0,1424.357,1420.0,836000,1431.0,1411.0
110,2015/02/09,1436.0,1440.447,1453.0,797000,1453.0,1431.0
111,2015/02/10,1454.0,1446.642,1444.0,754000,1455.0,1431.0
112,2015/02/12,1465.0,1458.706,1462.0,831000,1465.0,1443.0
113,2015/02/13,1433.0,1438.984,1462.0,812000,1462.0,1426.0
114,2015/02/16,1461.0,1465.592,1449.0,812000,1477.0,1449.0
115,2015/02/17,1430.0,1431.105,1441.0,1128000,1441.0,1419.0
116,2015/02/18,1423.0,1427.596,1446.0,1128000,1448.0,1420.0
117,2015/02/19,1442.0,1437.731,1423.0,835000,1445.0,1423.0
118,2015/02/20,1418.0,1427.993,1448.0,1142000,1449.0,1412.0
119,2015/02/23,1435.0,1431.081,1427.0,1473000,1444.0,1420.0
120,2015/02/24,1461.0,1447.703,1437.0,1013000,1463.0,1430.0
121,2015/02/25,1517.0,1516.729,1480.0,2625000,1539.0,1478.0
122,2015/02/26,1537.0,1533.876,1528.0,1321000,1546.0,1515.0
123,2015/02/27,1549.0,1556.144,1547.0,1184000,1570.0,1538.0
124,2015/03/02,1560.0,1564.709,1550.0,1080000,1578.0,1550.0
125,2015/03/03,1537.0,1540.329,1578.0,1090000,1578.0,1523.0
126,2015/03/04,1544.0,1529.604,1513.0,1259000,1551.0,1503.0
127,2015/03/05,1563.0,1565.297,1543.0,1241000,1580.0,1540.0
128,2015/03/06,1533.0,1543.58,1553.0,1144000,1573.0,1525.0
129,2015/03/09,1570.0,1561.743,1526.0,1386000,1574.0,1517.0
130,2015/03/10,1574.0,1571.624,1577.0,926000,1580.0,1563.0
131,2015/03/11,1571.0,1569.504,1540.0,482000,1580.0,1540.0
132,2015/03/12,1570.0,1574.207,1553.0,697000,1584.0,1553.0
133,2015/03/13,1610.0,1613.536,1604.0,1458000,1630.0,1598.0
134,2015/03/16,1631.0,1622.539,1619.0,1101000,1636.0,1593.0
135,2015/03/17,1662.0,1664.987,1638.0,1264000,1680.0,1638.0
136,2015/03/18,1628.0,1628.137,1665.0,1338000,1668.0,1606.0
137,2015/03/19,1629.0,1626.738,1621.0,656000,1644.0,1613.0
138,2015/03/20,1632.0,1621.347,1635.0,798000,1635.0,1612.0
139,2015/03/23,1675.0,1660.658,1633.0,1329000,1683.0,1630.0
140,2015/03/24,1649.0,1650.811,1678.0,757000,1678.0,1638.0
141,2015/03/25,1650.0,1644.078,1649.0,693000,1651.0,1634.0
142,2015/03/26,1639.0,1633.837,1616.0,734000,1643.0,1616.0
143,2015/03/27,1620.0,1633.252,1628.0,847000,1660.0,1600.0
144,2015/03/30,1597.0,1600.04,1620.0,934000,1627.0,1591.0
145,2015/03/31,1616.0,1627.081,1600.0,939000,1642.0,1600.0
146,2015/04/01,1569.0,1578.727,1602.0,807000,1608.0,1566.0
147,2015/04/02,1607.0,1598.74,1576.0,534000,1613.0,1573.0
148,2015/04/03,1598.0,1594.797,1607.0,561000,1613.0,1584.0
149,2015/04/06,1581.0,1576.797,1584.0,429000,1584.0,1566.0
150,2015/04/07,1599.0,1597.877,1599.0,765000,1605.0,1590.0
151,2015/04/08,1599.0,1604.521,1614.0,528000,1617.0,1596.0
152,2015/04/09,1575.0,1579.817,1594.0,858000,1595.0,1572.0
153,2015/04/10,1587.0,1581.661,1577.0,557000,1595.0,1570.0
154,2015/04/13,1596.0,1589.098,1587.0,697000,1599.0,1573.0
155,2015/04/14,1625.0,1627.278,1625.0,870000,1639.0,1613.0
156,2015/04/15,1614.0,1612.509,1606.0,564000,1619.0,1604.0
157,2015/04/16,1619.0,1616.446,1616.0,690000,1626.0,1603.0
158,2015/04/17,1619.0,1616.279,1627.0,678000,1627.0,1605.0
159,2015/04/20,1594.0,1597.801,1601.0,548000,1609.0,1592.0
160,2015/04/21,1613.0,1611.427,1600.0,599000,1618.0,1599.0
161,2015/04/22,1635.0,1628.549,1618.0,799000,1635.0,1610.0
162,2015/04/23,1652.0,1649.832,1635.0,821000,1663.0,1630.0
163,2015/04/24,1658.0,1648.278,1660.0,609000,1660.0,1637.0
164,2015/04/27,1650.0,1646.322,1645.0,668000,1656.0,1630.0
165,2015/04/28,1671.0,1663.254,1655.0,859000,1672.0,1651.0
166,2015/04/30,1739.0,1728.565,1720.0,3229000,1766.0,1680.0
167,2015/05/01,1679.0,1681.875,1710.0,946000,1727.0,1666.0
168,2015/05/07,1701.0,1704.512,1659.0,1173000,1736.0,1659.0
169,2015/05/08,1698.0,1700.466,1708.0,782000,1715.0,1687.0
170,2015/05/11,1695.0,1704.699,1715.0,661000,1732.0,1691.0
171,2015/05/12,1713.0,1711.302,1709.0,500000,1720.0,1692.0
172,2015/05/13,1742.0,1735.536,1727.0,729000,1746.0,1712.0
173,2015/05/14,1682.0,1684.801,1720.0,1302000,1728.0,1661.0
174,2015/05/15,1623.0,1631.283,1678.0,1436000,1680.0,1614.0
175,2015/05/18,1642.0,1632.503,1635.0,735000,1646.0,1610.0
176,2015/05/19,1690.0,1683.273,1668.0,1048000,1700.0,1652.0
177,2015/05/20,1697.0,1692.54,1700.0,942000,1701.0,1675.0
178,2015/05/21,1672.0,1674.249,1688.0,453000,1688.0,1668.0
179,2015/05/22,1688.0,1692.423,1672.0,666000,1704.0,1672.0
180,2015/05/25,1695.0,1693.748,1692.0,511000,1703.0,1687.0
181,2015/05/26,1659.0,1666.866,1700.0,867000,1710.0,1655.0
182,2015/05/27,1671.0,1663.444,1668.0,660000,1671.0,1652.0
183,2015/05/28,1673.0,1669.884,1684.0,863000,1684.0,1660.0
184,2015/05/29,1670.0,1649.759,1656.0,1450000,1673.0,1628.0
185,2015/06/01,1673.0,1663.407,1660.0,577000,1674.0,1652.0
186,2015/06/02,1666.0,1671.034,1675.0,508000,1686.0,1657.0
187,2015/06/03,1674.0,1672.838,1666.0,407000,1682.0,1660.0
188,2015/06/04,1690.0,1691.003,1683.0,954000,1706.0,1679.0
189,2015/06/05,1727.0,1720.273,1698.0,1284000,1729.0,1695.0
190,2015/06/08,1783.0,1767.22,1745.0,1283000,1788.0,1744.0
191,2015/06/09,1746.0,1751.339,1766.0,932000,1767.0,1741.0
192,2015/06/10,1823.0,1813.553,1783.0,1866000,1836.0,1783.0
193,2015/06/11,1868.0,1842.53,1825.0,1936000,1875.0,1801.0
194,2015/06/12,1851.0,1851.048,1855.0,1736000,1865.0,1831.0
195,2015/06/15,1891.0,1878.083,1861.0,1199000,1897.0,1851.0
196,2015/06/16,1891.0,1898.827,1899.0,1690000,1941.0,1869.0
197,2015/06/17,1910.0,1910.252,1900.0,674000,1925.0,1900.0
198,2015/06/18,1889.0,1891.793,1910.0,734000,1920.0,1860.0
199,2015/06/19,1905.0,1903.345,1903.0,789000,1918.0,1890.0
200,2015/06/22,1898.0,1885.956,1891.0,887000,1898.0,1872.0
201,2015/06/23,1893.0,1886.41,1898.0,1083000,1898.0,1871.0
202,2015/06/24,1887.0,1887.672,1895.0,713000,1899.0,1880.0
203,2015/06/25,1899.0,1882.11,1863.0,593000,1903.0,1853.0
204,2015/06/26,1899.0,1889.093,1899.0,539000,1902.0,1871.0
205,2015/06/29,1833.0,1841.188,1840.0,814000,1857.0,1831.0
206,2015/06/30,1830.0,1821.065,1828.0,785000,1838.0,1803.0
207,2015/07/01,1825.0,1831.17,1851.0,436000,1855.0,1819.0
208,2015/07/02,1823.0,1826.108,1828.0,676000,1849.0,1811.0
209,2015/07/03,1822.0,1831.468,1823.0,464000,1850.0,1818.0
210,2015/07/06,1781.0,1785.516,1808.0,537000,1808.0,1771.0
211,2015/07/07,1824.0,1830.718,1837.0,893000,1855.0,1814.0
212,2015/07/08,1764.0,1774.357,1820.0,434000,1820.0,1759.0
213,2015/07/09,1758.0,1732.411,1714.0,891000,1766.0,1693.0
214,2015/07/10,1760.0,1763.834,1777.0,477000,1782.0,1744.0
215,2015/07/13,1805.0,1801.762,1790.0,484000,1811.0,1785.0
216,2015/07/14,1862.0,1860.134,1842.0,733000,1880.0,1827.0
217,2015/07/15,1850.0,1843.848,1857.0,643000,1870.0,1832.0
218,2015/07/16,1871.0,1865.872,1850.0,642000,1874.0,1848.0
219,2015/07/17,1868.0,1869.676,1872.0,463000,1888.0,1860.0
220,2015/07/21,1910.0,1910.964,1887.0,806000,1927.0,1887.0
221,2015/07/22,1915.0,1899.325,1890.0,1152000,1927.0,1875.0
222,2015/07/23,1900.0,1904.941,1907.0,559000,1919.0,1894.0
223,2015/07/24,1853.0,1861.132,1886.0,1002000,1895.0,1836.0
224,2015/07/27,1877.0,1877.483,1872.0,572000,1900.0,1864.0
225,2015/07/28,1845.0,1842.482,1852.0,448000,1860.0,1825.0
226,2015/07/29,1864.0,1849.292,1845.0,717000,1870.0,1818.0
227,2015/07/30,1878.0,1878.839,1850.0,479000,1897.0,1850.0
228,2015/07/31,2000.0,1954.423,1897.0,1991000,2019.0,1855.0
229,2015/08/03,1986.0,1985.529,1992.0,919000,2017.0,1967.0
230,2015/08/04,2003.0,2004.607,1993.0,1210000,2024.0,1974.0
231,2015/08/05,2016.0,2028.306,1985.0,1105000,2075.0,1984.0
232,2015/08/06,1968.0,1979.876,1999.0,694000,2002.0,1968.0
233,2015/08/07,1935.0,1945.537,1942.0,874000,1964.0,1928.0
234,2015/08/10,1949.0,1943.82,1925.0,456000,1954.0,1925.0
235,2015/08/11,1972.0,1974.675,1968.0,520000,1985.0,1961.0
236,2015/08/12,1883.0,1903.881,1932.0,959000,1950.0,1883.0
237,2015/08/13,1808.0,1811.704,1849.0,1755000,1857.0,1789.0
238,2015/08/14,1805.0,1808.509,1811.0,664000,1832.0,1792.0
239,2015/08/17,1792.0,1793.525,1794.0,712000,1810.0,1772.0
240,2015/08/18,1783.0,1785.035,1792.0,434000,1793.0,1775.0
241,2015/08/19,1828.0,1866.736,1900.0,1456000,1904.0,1825.0
242,2015/08/20,1822.0,1826.217,1808.0,881000,1848.0,1799.0
243,2015/08/21,1730.0,1741.772,1760.0,975000,1773.0,1726.0
244,2015/08/24,1599.0,1637.269,1670.0,910000,1675.0,1594.0
245,2015/08/25,1555.0,1582.584,1527.0,1288000,1648.0,1506.0
246,2015/08/26,1602.0,1590.268,1570.0,511000,1618.0,1554.0
247,2015/08/27,1602.0,1625.807,1642.0,1023000,1663.0,1597.0
248,2015/08/28,1693.0,1689.589,1645.0,1043000,1723.0,1643.0
249,2015/08/31,1649.0,1646.474,1668.0,711000,1685.0,1627.0
250,2015/09/01,1546.0,1559.856,1600.0,1777000,1610.0,1543.0
251,2015/09/02,1493.0,1501.605,1523.0,1698000,1535.0,1471.0
252,2015/09/03,1453.0,1475.862,1493.0,2470000,1527.0,1446.0
253,2015/09/04,1460.0,1476.657,1462.0,1941000,1514.0,1439.0
254,2015/09/07,1442.0,1447.042,1440.0,1067000,1493.0,1412.0
255,2015/09/08,1432.0,1451.351,1442.0,758000,1477.0,1428.0
256,2015/09/09,1541.0,1511.46,1474.0,1907000,1546.0,1460.0
257,2015/09/10,1513.0,1503.518,1498.0,1504000,1527.0,1479.0
258,2015/09/11,1496.0,1484.895,1474.0,1051000,1502.0,1465.0
259,2015/09/14,1479.0,1478.4,1508.0,1105000,1508.0,1462.0
260,2015/09/15,1456.0,1473.93,1489.0,673000,1502.0,1451.0
261,2015/09/16,1465.0,1468.249,1464.0,402000,1487.0,1459.0
262,2015/09/17,1518.0,1504.296,1491.0,817000,1518.0,1482.0
263,2015/09/18,1471.0,1458.244,1470.0,1223000,1482.0,1435.0
264,2015/09/24,1412.0,1420.649,1445.0,1015000,1464.0,1410.0
265,2015/09/25,1415.0,1398.465,1413.0,780000,1415.0,1373.0
266,2015/09/28,1392.0,1394.248,1400.0,497000,1410.0,1383.0
267,2015/09/29,1319.0,1330.753,1369.0,730000,1369.0,1319.0
268,2015/09/30,1321.0,1314.795,1319.0,1128000,1335.0,1277.0
269,2015/10/01,1369.0,1374.754,1334.0,779000,1401.0,1334.0
270,2015/10/02,1324.0,1330.154,1360.0,821000,1364.0,1318.0
271,2015/10/05,1358.0,1362.427,1350.0,972000,1393.0,1349.0
272,2015/10/06,1397.0,1407.972,1410.0,1518000,1439.0,1391.0
273,2015/10/07,1444.0,1442.813,1402.0,2449000,1473.0,1396.0
274,2015/10/08,1436.0,1450.368,1431.0,1735000,1515.0,1418.0
275,2015/10/09,1485.0,1478.056,1462.0,1038000,1499.0,1444.0
276,2015/10/13,1441.0,1451.403,1460.0,981000,1487.0,1434.0
277,2015/10/14,1378.0,1386.247,1412.0,1097000,1423.0,1372.0
278,2015/10/15,1402.0,1400.417,1371.0,1033000,1428.0,1361.0
279,2015/10/16,1366.0,1366.088,1403.0,1569000,1404.0,1350.0
280,2015/10/19,1344.0,1343.161,1363.0,1359000,1370.0,1324.0
281,2015/10/20,1351.0,1345.746,1341.0,694000,1354.0,1331.0
282,2015/10/21,1387.0,1380.783,1351.0,575000,1390.0,1351.0
283,2015/10/22,1384.0,1387.478,1367.0,626000,1408.0,1364.0
284,2015/10/23,1424.0,1423.003,1420.0,777000,1429.0,1411.0
285,2015/10/26,1469.0,1463.978,1463.0,888000,1475.0,1448.0
286,2015/10/27,1448.0,1468.726,1494.0,1599000,1516.0,1439.0
287,2015/10/28,1435.0,1435.568,1440.0,904000,1456.0,1430.0
288,2015/10/29,1476.0,1468.192,1459.0,1310000,1487.0,1453.0
289,2015/10/30,1454.0,1454.453,1457.0,1072000,1473.0,1433.0
290,2015/11/02,1478.0,1495.589,1510.0,1492000,1525.0,1478.0
291,2015/11/04,1528.0,1531.344,1508.0,1560000,1546.0,1502.0
292,2015/11/05,1533.0,1531.52,1529.0,1038000,1549.0,1524.0
293,2015/11/06,1559.0,1558.019,1547.0,640000,1568.0,1542.0
294,2015/11/09,1562.0,1559.316,1561.0,871000,1572.0,1538.0
295,2015/11/10,1575.0,1564.68,1552.0,588000,1579.0,1531.0
296,2015/11/11,1565.0,1560.363,1562.0,468000,1574.0,1552.0
297,2015/11/12,1574.0,1559.164,1551.0,446000,1578.0,1535.0
298,2015/11/13,1549.0,1541.679,1546.0,589000,1552.0,1527.0
299,2015/11/16,1523.0,1528.369,1511.0,648000,1544.0,1511.0
300,2015/11/17,1553.0,1562.633,1538.0,656000,1591.0,1538.0
301,2015/11/18,1552.0,1560.599,1578.0,384000,1592.0,1548.0
302,2015/11/19,1551.0,1551.898,1558.0,423000,1566.0,1535.0
303,2015/11/20,1558.0,1553.172,1537.0,414000,1563.0,1537.0
304,2015/11/24,1564.0,1558.892,1544.0,776000,1567.0,1544.0
305,2015/11/25,1600.0,1593.282,1570.0,1086000,1607.0,1556.0
306,2015/11/26,1588.0,1592.678,1595.0,597000,1615.0,1585.0
307,2015/11/27,1577.0,1582.855,1600.0,351000,1600.0,1574.0
308,2015/11/30,1591.0,1587.325,1589.0,449000,1596.0,1572.0
309,2015/12/01,1621.0,1611.607,1592.0,596000,1622.0,1592.0
310,2015/12/02,1613.0,1610.56,1623.0,821000,1628.0,1591.0
311,2015/12/03,1610.0,1601.585,1598.0,632000,1617.0,1591.0
312,2015/12/04,1578.0,1577.543,1580.0,403000,1589.0,1573.0
313,2015/12/07,1589.0,1595.54,1610.0,376000,1610.0,1586.0
314,2015/12/08,1553.0,1556.978,1589.0,598000,1589.0,1545.0
315,2015/12/09,1532.0,1535.238,1541.0,627000,1550.0,1528.0
316,2015/12/10,1509.0,1516.816,1550.0,642000,1552.0,1506.0
317,2015/12/11,1534.0,1528.657,1517.0,1172000,1539.0,1505.0
318,2015/12/14,1500.0,1490.373,1501.0,426000,1501.0,1472.0
319,2015/12/15,1481.0,1492.488,1493.0,424000,1510.0,1480.0
320,2015/12/16,1520.0,1517.024,1516.0,866000,1534.0,1504.0
321,2015/12/17,1522.0,1532.896,1550.0,720000,1557.0,1516.0
322,2015/12/18,1452.0,1472.906,1513.0,1095000,1516.0,1444.0
323,2015/12/21,1443.0,1436.406,1450.0,621000,1450.0,1417.0
324,2015/12/22,1446.0,1443.07,1426.0,613000,1455.0,1426.0
325,2015/12/24,1455.0,1458.081,1463.0,631000,1480.0,1448.0
326,2015/12/25,1425.0,1431.559,1446.0,592000,1446.0,1411.0
327,2015/12/28,1470.0,1469.185,1438.0,491000,1483.0,1430.0
328,2015/12/29,1496.0,1482.559,1479.0,802000,1508.0,1457.0
329,2015/12/30,1476.0,1489.376,1505.0,322000,1510.0,1471.0
330,2016/01/04,1431.0,1441.925,1450.0,413000,1475.0,1426.0
331,2016/01/05,1425.0,1427.261,1426.0,556000,1451.0,1403.0
332,2016/01/06,1285.0,1293.945,1335.0,3583000,1350.0,1276.0
333,2016/01/07,1289.0,1288.518,1290.0,1717000,1302.0,1279.0
334,2016/01/08,1281.0,1294.344,1279.0,1687000,1315.0,1276.0
335,2016/01/12,1235.0,1255.795,1300.0,1069000,1305.0,1235.0
336,2016/01/13,1282.0,1277.497,1258.0,737000,1293.0,1255.0
337,2016/01/14,1233.0,1228.001,1242.0,864000,1245.0,1215.0
338,2016/01/15,1242.0,1245.098,1263.0,891000,1269.0,1233.0
339,2016/01/18,1228.0,1219.437,1202.0,957000,1234.0,1195.0
340,2016/01/19,1232.0,1226.37,1214.0,682000,1248.0,1202.0
341,2016/01/20,1178.0,1197.998,1236.0,574000,1237.0,1176.0
342,2016/01/21,1160.0,1188.642,1170.0,783000,1225.0,1160.0
343,2016/01/22,1219.0,1203.876,1200.0,603000,1219.0,1188.0
344,2016/01/25,1251.0,1254.615,1255.0,1530000,1274.0,1235.0
345,2016/01/26,1181.0,1197.414,1238.0,684000,1238.0,1177.0
346,2016/01/27,1217.0,1214.935,1216.0,613000,1228.0,1203.0
347,2016/01/28,1163.0,1169.955,1200.0,1030000,1204.0,1154.0
348,2016/01/29,1194.0,1169.104,1163.0,1344000,1195.0,1142.0
349,2016/02/01,1214.0,1204.59,1221.0,1512000,1240.0,1175.0
350,2016/02/02,1187.0,1192.984,1211.0,704000,1211.0,1182.0
351,2016/02/03,1118.0,1125.793,1159.0,909000,1159.0,1108.0
352,2016/02/04,1029.0,1040.039,1039.0,1872000,1068.0,1024.0
353,2016/02/05,1036.0,1029.071,1026.0,1414000,1048.0,1008.0
354,2016/02/08,1046.0,1038.289,1031.0,764000,1053.0,1002.0
355,2016/02/09,970.0,981.219,999.0,693000,1010.0,967.0
356,2016/02/10,946.0,951.859,975.0,816000,989.0,926.0
357,2016/02/12,860.0,879.935,896.0,1289000,905.0,858.0
358,2016/02/15,943.0,938.01,935.0,959000,953.0,912.0
359,2016/02/16,964.0,972.399,953.0,900000,997.0,939.0
360,2016/02/17,955.0,960.979,964.0,954000,991.0,937.0
361,2016/02/18,1004.0,1004.264,999.0,723000,1018.0,990.0
362,2016/02/19,981.0,977.814,995.0,806000,995.0,961.0
363,2016/02/22,974.0,972.577,971.0,648000,991.0,965.0
364,2016/02/23,988.0,989.892,1000.0,655000,1015.0,973.0
365,2016/02/24,953.0,961.462,970.0,993000,981.0,947.0
366,2016/02/25,967.0,962.282,967.0,703000,972.0,946.0
367,2016/02/26,977.0,981.16,990.0,544000,999.0,971.0
368,2016/02/29,967.0,981.362,977.0,608000,1002.0,967.0
369,2016/03/01,967.0,965.689,966.0,954000,976.0,952.0
370,2016/03/02,1038.0,1036.24,1007.0,1461000,1061.0,997.0
371,2016/03/03,1051.0,1048.451,1031.0,909000,1059.0,1031.0
372,2016/03/04,1086.0,1090.153,1064.0,1033000,1113.0,1059.0
373,2016/03/07,1079.0,1084.57,1093.0,803000,1110.0,1075.0
374,2016/03/08,1086.0,1084.169,1082.0,829000,1106.0,1063.0
375,2016/03/09,1036.0,1037.009,1056.0,690000,1060.0,1022.0
376,2016/03/10,1054.0,1053.824,1061.0,585000,1067.0,1046.0
377,2016/03/11,1050.0,1034.866,1027.0,708000,1057.0,1013.0
378,2016/03/14,1083.0,1079.157,1076.0,477000,1090.0,1066.0
379,2016/03/15,1059.0,1063.98,1061.0,507000,1082.0,1053.0
380,2016/03/16,1061.0,1062.32,1065.0,746000,1073.0,1047.0
381,2016/03/17,1067.0,1076.798,1070.0,569000,1102.0,1050.0
382,2016/03/18,1042.0,1046.262,1067.0,803000,1071.0,1032.0
383,2016/03/22,1064.0,1066.535,1072.0,1190000,1097.0,1041.0
384,2016/03/23,1062.0,1065.476,1071.0,614000,1077.0,1053.0
385,2016/03/24,1029.0,1037.626,1061.0,628000,1063.0,1027.0
386,2016/03/25,1046.0,1038.772,1049.0,470000,1050.0,1027.0
387,2016/03/28,1067.0,1057.407,1054.0,442000,1067.0,1044.0
388,2016/03/29,1062.0,1058.218,1044.0,445000,1066.0,1044.0
389,2016/03/30,1048.0,1056.675,1060.0,495000,1081.0,1045.0
390,2016/03/31,1045.0,1052.744,1051.0,493000,1062.0,1044.0
391,2016/04/01,995.0,1010.366,1045.0,950800,1053.0,991.0
392,2016/04/04,984.0,989.919,991.0,776300,1021.0,976.0
393,2016/04/05,951.0,965.238,984.0,883200,1002.0,946.0
394,2016/04/06,943.0,948.938,962.0,778100,979.0,930.0
395,2016/04/07,939.0,940.574,952.0,765500,958.0,929.0
396,2016/04/08,966.0,954.52,925.0,752000,979.0,915.0
397,2016/04/11,960.0,951.594,958.0,378100,967.0,932.0
398,2016/04/12,971.0,958.943,951.0,1858000,978.0,938.0
399,2016/04/13,1016.0,1010.745,990.0,1036300,1021.0,990.0
400,2016/04/14,1075.0,1065.493,1037.0,886100,1078.0,1036.0
401,2016/04/15,1066.0,1069.703,1073.0,557300,1085.0,1060.0
402,2016/04/18,1011.0,1009.709,1008.0,916200,1028.0,999.0
403,2016/04/19,1074.0,1068.053,1050.0,725400,1076.0,1049.0
404,2016/04/20,1088.0,1100.599,1102.0,716100,1126.0,1085.0
405,2016/04/21,1122.0,1122.195,1125.0,920100,1132.0,1110.0
406,2016/04/22,1126.0,1116.661,1105.0,987300,1134.0,1093.0
407,2016/04/25,1149.0,1157.785,1146.0,958100,1184.0,1135.0
408,2016/04/26,1116.0,1116.216,1138.0,1484600,1140.0,1100.0
409,2016/04/27,1101.0,1105.628,1118.0,761100,1123.0,1099.0
410,2016/04/28,1073.0,1097.894,1118.0,1399500,1151.0,1073.0
411,2016/05/02,986.0,980.32,1001.0,1675900,1011.0,965.0
412,2016/05/06,977.0,971.338,986.0,665200,987.0,965.0
413,2016/05/09,974.0,974.57,980.0,606800,988.0,969.0
414,2016/05/10,1015.0,1002.064,979.0,1283600,1017.0,968.0
415,2016/05/11,1010.0,1017.773,1027.0,495800,1039.0,1002.0
416,2016/05/12,1028.0,1017.093,1009.0,620400,1032.0,993.0
417,2016/05/13,1004.0,1012.67,1030.0,491400,1034.0,1002.0
418,2016/05/16,1020.0,1020.085,1009.0,364700,1032.0,1005.0
419,2016/05/17,1027.0,1025.588,1028.0,501800,1048.0,1018.0
420,2016/05/18,1020.0,1012.016,1026.0,894400,1031.0,998.0
421,2016/05/19,1060.0,1066.206,1036.0,1286600,1103.0,1036.0
422,2016/05/20,1055.0,1051.897,1051.0,614300,1067.0,1038.0
423,2016/05/23,1051.0,1043.24,1051.0,452500,1054.0,1030.0
424,2016/05/24,956.0,960.673,1007.0,2277700,1009.0,946.0
425,2016/05/25,966.0,968.065,965.0,980900,979.0,958.0
426,2016/05/26,983.0,984.561,979.0,777400,997.0,973.0
427,2016/05/27,987.0,986.455,990.0,487700,991.0,981.0
428,2016/05/30,1003.0,996.867,987.0,421400,1007.0,983.0
429,2016/05/31,1010.0,1010.587,1007.0,705900,1018.0,1002.0
430,2016/06/01,989.0,996.181,1014.0,861300,1014.0,986.0
431,2016/06/02,961.0,965.666,988.0,806100,988.0,955.0
432,2016/06/03,967.0,966.875,962.0,481500,980.0,960.0
433,2016/06/06,952.0,947.44,949.0,500300,955.0,936.0
434,2016/06/07,985.0,984.55,967.0,593800,993.0,965.0
435,2016/06/08,1020.0,1012.819,999.0,1081600,1022.0,997.0
436,2016/06/09,989.0,990.303,990.0,1079300,1002.0,977.0
437,2016/06/10,973.0,970.93,984.0,1439800,988.0,956.0
438,2016/06/13,930.0,933.531,943.0,766000,949.0,925.0
439,2016/06/14,913.0,911.321,922.0,588400,926.0,906.0
440,2016/06/15,914.0,913.952,905.0,570200,925.0,897.0
441,2016/06/16,885.0,890.601,905.0,962400,911.0,883.0
442,2016/06/17,887.0,891.1,889.0,1367000,910.0,887.0
443,2016/06/20,929.0,927.959,915.0,679600,937.0,908.0
444,2016/06/21,934.0,928.046,924.0,408800,936.0,912.0
445,2016/06/22,918.0,916.334,925.0,542700,927.0,909.0
446,2016/06/23,941.0,933.725,916.0,517000,945.0,912.0
447,2016/06/24,863.0,880.481,950.0,1210000,959.0,849.0
448,2016/06/27,839.0,845.542,874.0,678900,886.0,829.0
449,2016/06/28,828.0,823.198,828.0,750400,839.0,805.0
450,2016/06/29,850.0,843.236,840.0,447800,852.0,826.0
451,2016/06/30,846.0,854.581,863.0,466300,869.0,844.0
452,2016/07/01,864.0,864.203,860.0,546100,879.0,851.0
453,2016/07/04,865.0,862.132,864.0,430500,871.0,838.0
454,2016/07/05,845.0,848.883,854.0,294700,860.0,842.0
455,2016/07/06,813.0,806.618,817.0,694000,823.0,793.0
456,2016/07/07,813.0,814.755,803.0,618300,827.0,801.0
457,2016/07/08,787.0,792.364,805.0,856100,809.0,785.0
458,2016/07/11,828.0,823.482,802.0,719700,835.0,802.0
459,2016/07/12,861.0,862.712,845.0,1034600,877.0,845.0
460,2016/07/13,894.0,897.046,898.0,615400,911.0,887.0
461,2016/07/14,901.0,894.43,887.0,548500,906.0,881.0
462,2016/07/15,930.0,929.931,916.0,838500,943.0,911.0
463,2016/07/19,937.0,932.414,945.0,735300,947.0,923.0
464,2016/07/20,934.0,928.426,933.0,339900,935.0,917.0
465,2016/07/21,955.0,952.806,949.0,720500,962.0,940.0
466,2016/07/22,971.0,971.883,956.0,709200,986.0,950.0
467,2016/07/25,985.0,986.517,976.0,729000,1001.0,970.0
468,2016/07/26,972.0,975.785,984.0,1230500,987.0,954.0
469,2016/07/27,994.0,994.277,984.0,970700,1008.0,973.0
470,2016/07/28,979.0,979.431,987.0,665400,993.0,971.0
471,2016/07/29,1005.0,1002.387,984.0,1025300,1020.0,982.0
472,2016/08/01,932.0,949.104,985.0,2424700,991.0,926.0
473,2016/08/02,915.0,924.34,947.0,1188700,955.0,906.0
474,2016/08/03,883.0,890.027,888.0,1013400,903.0,880.0
475,2016/08/04,918.0,896.42,884.0,998700,919.0,875.0
476,2016/08/05,910.0,910.497,903.0,481500,922.0,897.0
477,2016/08/08,949.0,942.929,925.0,488300,952.0,921.0
478,2016/08/09,971.0,963.31,949.0,473000,971.0,949.0
479,2016/08/10,926.0,928.882,956.0,924300,957.0,922.0
480,2016/08/12,944.0,939.071,935.0,495100,945.0,927.0
481,2016/08/15,949.0,945.939,945.0,361000,952.0,930.0
482,2016/08/16,950.0,960.939,954.0,678400,982.0,947.0
483,2016/08/17,955.0,950.599,940.0,447600,957.0,934.0
484,2016/08/18,945.0,947.983,945.0,418500,958.0,936.0
485,2016/08/19,974.0,972.694,954.0,686100,984.0,953.0
486,2016/08/22,985.0,984.441,989.0,477700,996.0,970.0
487,2016/08/23,966.0,971.805,979.0,536800,989.0,962.0
488,2016/08/24,1000.0,1002.33,986.0,862900,1018.0,984.0
489,2016/08/25,996.0,992.819,1000.0,640100,1005.0,983.0
490,2016/08/26,1004.0,1008.887,999.0,913800,1022.0,988.0
491,2016/08/29,1037.0,1039.01,1030.0,703300,1053.0,1020.0
492,2016/08/30,1055.0,1051.741,1040.0,535400,1059.0,1038.0
493,2016/08/31,1027.0,1019.095,1025.0,1328700,1030.0,994.0
494,2016/09/01,1007.0,1008.348,1021.0,993000,1022.0,1002.0
495,2016/09/02,996.0,992.851,990.0,901100,1004.0,982.0
496,2016/09/05,1008.0,1013.994,1016.0,443500,1022.0,1005.0
497,2016/09/06,1015.0,1016.772,1021.0,396700,1029.0,1003.0
498,2016/09/07,992.0,990.922,998.0,492600,1000.0,982.0
499,2016/09/08,982.0,980.06,983.0,800400,988.0,967.0
500,2016/09/09,987.0,983.533,980.0,808300,990.0,973.0
501,2016/09/12,939.0,941.239,957.0,1348100,963.0,930.0
502,2016/09/13,936.0,934.268,939.0,838700,939.0,927.0
503,2016/09/14,938.0,936.921,935.0,567500,945.0,927.0
504,2016/09/15,920.0,916.38,930.0,620000,930.0,906.0
505,2016/09/16,934.0,934.177,920.0,468500,940.0,920.0
506,2016/09/20,916.0,920.208,922.0,1026700,934.0,912.0
507,2016/09/21,954.0,933.719,917.0,769600,957.0,907.0
508,2016/09/23,963.0,958.857,953.0,630300,967.0,939.0
509,2016/09/26,954.0,956.139,964.0,466900,964.0,950.0
510,2016/09/27,969.0,953.285,940.0,560500,969.0,932.0
511,2016/09/28,955.0,957.616,969.0,584500,974.0,948.0
512,2016/09/29,1004.0,1005.233,983.0,1010000,1019.0,970.0
513,2016/09/30,986.0,991.161,1011.0,654200,1011.0,979.0
514,2016/10/03,997.0,993.471,1000.0,666400,1002.0,984.0
515,2016/10/04,1024.0,1024.217,1012.0,886700,1035.0,1008.0
516,2016/10/05,1075.0,1064.588,1042.0,1320900,1078.0,1036.0
517,2016/10/06,1089.0,1092.547,1089.0,1035100,1102.0,1082.0
518,2016/10/07,1096.0,1093.207,1089.0,708200,1100.0,1077.0
519,2016/10/11,1167.0,1144.984,1109.0,1963800,1168.0,1109.0
520,2016/10/12,1182.0,1185.634,1168.0,2430800,1198.0,1162.0
521,2016/10/13,1210.0,1238.546,1200.0,3401800,1295.0,1200.0
522,2016/10/14,1223.0,1220.12,1210.0,1674700,1234.0,1204.0
523,2016/10/17,1254.0,1248.666,1235.0,1307800,1259.0,1227.0
524,2016/10/18,1220.0,1221.043,1240.0,1515600,1241.0,1208.0
525,2016/10/19,1195.0,1204.52,1220.0,1673000,1229.0,1190.0
526,2016/10/20,1179.0,1157.541,1176.0,2277600,1180.0,1123.0
527,2016/10/21,1194.0,1196.056,1191.0,1044500,1207.0,1182.0
528,2016/10/24,1197.0,1193.015,1188.0,784100,1206.0,1173.0
529,2016/10/25,1195.0,1200.194,1190.0,846000,1219.0,1190.0
530,2016/10/26,1182.0,1168.382,1174.0,1484200,1190.0,1136.0
531,2016/10/27,1165.0,1165.131,1182.0,704600,1185.0,1158.0
532,2016/10/28,1181.0,1177.816,1169.0,2252100,1194.0,1148.0
533,2016/10/31,1180.0,1168.397,1170.0,1534500,1182.0,1153.0
534,2016/11/01,1106.0,1104.48,1090.0,2641000,1130.0,1066.0
535,2016/11/02,1077.0,1075.827,1087.0,2297800,1091.0,1061.0
536,2016/11/04,1057.0,1057.632,1061.0,830500,1078.0,1047.0
537,2016/11/07,1088.0,1081.61,1068.0,1483700,1091.0,1068.0
538,2016/11/08,1066.0,1069.227,1076.0,2092300,1083.0,1061.0
539,2016/11/09,1017.0,1047.304,1077.0,1747000,1100.0,994.0
540,2016/11/10,1146.0,1174.97,1115.0,5602800,1237.0,1112.0
541,2016/11/11,1158.0,1169.301,1170.0,1588600,1197.0,1152.0
542,2016/11/14,1218.0,1210.988,1176.0,2274900,1225.0,1173.0
543,2016/11/15,1219.0,1216.903,1217.0,1286000,1238.0,1200.0
544,2016/11/16,1236.0,1234.818,1240.0,922700,1246.0,1228.0
545,2016/11/17,1244.0,1241.096,1230.0,1220100,1255.0,1221.0
546,2016/11/18,1252.0,1260.059,1260.0,919800,1272.0,1250.0
547,2016/11/21,1252.0,1257.197,1264.0,626300,1267.0,1250.0
548,2016/11/22,1232.0,1234.454,1236.0,743500,1241.0,1216.0
549,2016/11/24,1247.0,1242.12,1250.0,1119800,1252.0,1216.0
550,2016/11/25,1274.0,1272.319,1250.0,924400,1291.0,1249.0
551,2016/11/28,1239.0,1233.074,1252.0,954400,1254.0,1217.0
552,2016/11/29,1221.0,1212.566,1215.0,1154600,1224.0,1202.0
553,2016/11/30,1218.0,1219.4,1236.0,740600,1236.0,1212.0
554,2016/12/01,1317.0,1322.09,1308.0,2470900,1353.0,1266.0
555,2016/12/02,1396.0,1396.945,1377.0,3707900,1420.0,1363.0
556,2016/12/05,1426.0,1425.665,1400.0,1937700,1454.0,1400.0
557,2016/12/06,1479.0,1466.03,1423.0,1591100,1484.0,1423.0
558,2016/12/07,1470.0,1475.393,1492.0,1153900,1498.0,1453.0
559,2016/12/08,1495.0,1491.152,1484.0,1083800,1503.0,1476.0
560,2016/12/09,1514.0,1500.262,1483.0,1212700,1516.0,1478.0
561,2016/12/12,1518.0,1532.537,1549.0,1103600,1578.0,1495.0
562,2016/12/13,1474.0,1462.921,1480.0,1323700,1480.0,1447.0
563,2016/12/14,1493.0,1487.494,1487.0,1107100,1503.0,1469.0
564,2016/12/15,1515.0,1514.464,1503.0,1225900,1538.0,1498.0
565,2016/12/16,1580.0,1575.351,1540.0,1941300,1595.0,1539.0
566,2016/12/19,1573.0,1567.776,1580.0,1581900,1591.0,1542.0
567,2016/12/20,1591.0,1585.524,1588.0,1861700,1617.0,1562.0
568,2016/12/21,1500.0,1516.313,1557.0,2135700,1571.0,1484.0
569,2016/12/22,1487.0,1483.033,1494.0,1417300,1497.0,1469.0
570,2016/12/26,1497.0,1501.631,1513.0,893400,1519.0,1490.0
571,2016/12/27,1486.0,1492.678,1506.0,440400,1508.0,1480.0
572,2016/12/28,1512.0,1506.035,1504.0,818900,1513.0,1493.0
573,2016/12/29,1468.0,1468.088,1491.0,740300,1494.0,1456.0
574,2016/12/30,1472.0,1463.64,1447.0,507300,1480.0,1425.0
575,2017/01/04,1487.0,1483.702,1482.0,1221600,1494.0,1461.0
576,2017/01/05,1478.0,1485.1,1490.0,696000,1499.0,1472.0
577,2017/01/06,1454.0,1438.183,1448.0,1224000,1458.0,1417.0
578,2017/01/10,1445.0,1440.884,1424.0,1009300,1460.0,1414.0
579,2017/01/11,1469.0,1467.857,1465.0,1178700,1481.0,1457.0
580,2017/01/12,1467.0,1467.381,1476.0,661800,1479.0,1456.0
581,2017/01/13,1461.0,1463.763,1467.0,508600,1478.0,1457.0
582,2017/01/16,1437.0,1436.257,1455.0,649400,1457.0,1427.0
583,2017/01/17,1417.0,1416.505,1428.0,788800,1435.0,1387.0
584,2017/01/18,1424.0,1413.921,1404.0,541700,1430.0,1392.0
585,2017/01/19,1470.0,1472.188,1460.0,757500,1488.0,1460.0
586,2017/01/20,1492.0,1490.023,1467.0,1076800,1500.0,1464.0
587,2017/01/23,1443.0,1454.445,1462.0,612600,1470.0,1443.0
588,2017/01/24,1424.0,1419.63,1423.0,828500,1435.0,1395.0
589,2017/01/25,1486.0,1478.648,1463.0,1193800,1491.0,1462.0
590,2017/01/26,1494.0,1496.52,1501.0,635500,1515.0,1483.0
591,2017/01/27,1492.0,1495.415,1486.0,606700,1505.0,1480.0
592,2017/01/30,1454.0,1446.489,1485.0,1145100,1485.0,1426.0
593,2017/01/31,1389.0,1396.191,1422.0,1279400,1423.0,1384.0
594,2017/02/01,1444.0,1438.85,1400.0,1468400,1470.0,1394.0
595,2017/02/02,1442.0,1458.134,1458.0,1329000,1483.0,1439.0
596,2017/02/03,1447.0,1448.252,1434.0,488400,1462.0,1424.0
597,2017/02/06,1442.0,1449.862,1475.0,376600,1481.0,1439.0
598,2017/02/07,1416.0,1418.663,1420.0,465300,1430.0,1408.0
599,2017/02/08,1418.0,1415.888,1410.0,454900,1424.0,1404.0
600,2017/02/09,1394.0,1397.978,1407.0,458900,1415.0,1391.0
601,2017/02/10,1457.0,1455.153,1445.0,807700,1471.0,1435.0
602,2017/02/13,1466.0,1464.642,1463.0,314100,1471.0,1454.0
603,2017/02/14,1441.0,1456.587,1469.0,542100,1479.0,1438.0
604,2017/02/15,1486.0,1483.861,1469.0,589700,1493.0,1461.0
605,2017/02/16,1476.0,1476.385,1479.0,294900,1485.0,1469.0
606,2017/02/17,1478.0,1470.189,1460.0,272700,1479.0,1452.0
607,2017/02/20,1460.0,1451.558,1470.0,531700,1470.0,1437.0
608,2017/02/21,1485.0,1478.935,1470.0,371100,1485.0,1461.0
609,2017/02/22,1519.0,1513.053,1494.0,1156100,1525.0,1494.0
610,2017/02/23,1501.0,1506.566,1526.0,425800,1537.0,1486.0
611,2017/02/24,1450.0,1453.385,1468.0,888800,1471.0,1427.0
612,2017/02/27,1426.0,1419.374,1431.0,730100,1440.0,1397.0
613,2017/02/28,1446.0,1452.543,1443.0,614500,1465.0,1442.0
614,2017/03/01,1518.0,1496.884,1459.0,924500,1523.0,1454.0
615,2017/03/02,1549.0,1557.665,1558.0,993300,1577.0,1539.0
616,2017/03/03,1532.0,1531.488,1532.0,504900,1549.0,1523.0
617,2017/03/06,1525.0,1522.93,1518.0,430600,1534.0,1505.0
618,2017/03/07,1513.0,1510.232,1521.0,384500,1521.0,1497.0
619,2017/03/08,1504.0,1499.603,1513.0,402200,1520.0,1486.0
620,2017/03/09,1503.0,1506.382,1511.0,325300,1516.0,1497.0
621,2017/03/10,1534.0,1521.653,1516.0,1020500,1540.0,1499.0
622,2017/03/13,1518.0,1516.863,1535.0,728100,1545.0,1508.0
623,2017/03/14,1535.0,1531.177,1523.0,423800,1539.0,1518.0
624,2017/03/15,1504.0,1505.047,1521.0,844900,1525.0,1492.0
625,2017/03/16,1504.0,1496.66,1487.0,1152500,1514.0,1475.0
626,2017/03/17,1477.0,1482.961,1492.0,935500,1502.0,1474.0
627,2017/03/21,1460.0,1451.412,1459.0,889000,1464.0,1430.0
628,2017/03/22,1412.0,1413.122,1402.0,1063800,1430.0,1384.0
629,2017/03/23,1414.0,1411.146,1396.0,599700,1416.0,1395.0
630,2017/03/24,1403.0,1401.884,1397.0,739400,1408.0,1394.0
631,2017/03/27,1371.0,1373.775,1388.0,1055800,1390.0,1365.0
632,2017/03/28,1380.0,1373.224,1369.0,907900,1380.0,1362.0
633,2017/03/29,1370.0,1374.115,1390.0,618000,1398.0,1361.0
634,2017/03/30,1319.0,1326.935,1314.0,1550600,1344.0,1302.0
635,2017/03/31,1299.0,1315.226,1330.0,1198600,1333.0,1298.0
636,2017/04/03,1294.0,1293.026,1300.0,1007600,1305.0,1278.0
637,2017/04/04,1275.0,1273.777,1281.0,1123400,1286.0,1260.0
638,2017/04/05,1282.0,1283.208,1298.0,1346400,1309.0,1265.0
639,2017/04/06,1275.0,1279.814,1282.0,1302000,1306.0,1264.0
640,2017/04/07,1294.0,1298.759,1295.0,1222700,1316.0,1278.0
641,2017/04/10,1389.0,1399.169,1384.0,3461800,1436.0,1373.0
642,2017/04/11,1375.0,1378.622,1376.0,1528500,1404.0,1361.0
643,2017/04/12,1318.0,1314.451,1305.0,2188700,1333.0,1301.0
644,2017/04/13,1303.0,1289.704,1288.0,1325000,1304.0,1274.0
645,2017/04/14,1283.0,1284.978,1286.0,872500,1299.0,1272.0
646,2017/04/17,1291.0,1276.736,1275.0,1069200,1292.0,1251.0
647,2017/04/18,1306.0,1306.022,1310.0,1004300,1324.0,1290.0
648,2017/04/19,1318.0,1320.592,1300.0,835300,1328.0,1295.0
649,2017/04/20,1304.0,1306.13,1304.0,848300,1316.0,1296.0
650,2017/04/21,1325.0,1323.859,1334.0,655200,1335.0,1315.0
651,2017/04/24,1344.0,1342.045,1355.0,795100,1361.0,1332.0
652,2017/04/25,1389.0,1383.748,1359.0,1175800,1396.0,1358.0
653,2017/04/26,1439.0,1434.703,1448.0,1391700,1452.0,1423.0
654,2017/04/27,1440.0,1436.991,1421.0,916500,1454.0,1417.0
655,2017/04/28,1438.0,1441.822,1454.0,815400,1464.0,1432.0
656,2017/05/01,1392.0,1386.952,1400.0,2197000,1406.0,1372.0
657,2017/05/02,1395.0,1382.558,1362.0,1848900,1398.0,1350.0
658,2017/05/08,1374.0,1390.085,1423.0,1556700,1435.0,1373.0
659,2017/05/09,1364.0,1366.956,1377.0,743500,1379.0,1356.0
660,2017/05/10,1390.0,1396.939,1380.0,1077700,1410.0,1380.0
661,2017/05/11,1400.0,1393.371,1389.0,1197800,1406.0,1367.0
662,2017/05/12,1404.0,1393.974,1408.0,859100,1408.0,1381.0
663,2017/05/15,1380.0,1373.603,1379.0,847800,1381.0,1359.0
664,2017/05/16,1362.0,1372.566,1396.0,1021900,1403.0,1360.0
665,2017/05/17,1310.0,1318.198,1351.0,1367400,1352.0,1307.0
666,2017/05/18,1294.0,1284.022,1280.0,997600,1296.0,1266.0
667,2017/05/19,1316.0,1302.887,1288.0,896500,1318.0,1276.0
668,2017/05/22,1318.0,1324.201,1333.0,670800,1342.0,1314.0
669,2017/05/23,1311.0,1309.367,1308.0,507700,1319.0,1303.0
670,2017/05/24,1334.0,1333.309,1340.0,749400,1349.0,1324.0
671,2017/05/25,1335.0,1340.043,1338.0,602800,1350.0,1328.0
672,2017/05/26,1297.0,1307.67,1336.0,829800,1341.0,1296.0
673,2017/05/29,1313.0,1306.906,1320.0,1080400,1320.0,1284.0
674,2017/05/30,1331.0,1315.584,1305.0,911300,1332.0,1296.0
675,2017/05/31,1358.0,1349.553,1332.0,1127500,1358.0,1319.0
676,2017/06/01,1371.0,1371.858,1365.0,1259200,1381.0,1363.0
677,2017/06/02,1417.0,1414.389,1382.0,1327700,1437.0,1381.0
678,2017/06/05,1373.0,1384.299,1400.0,904700,1409.0,1372.0
679,2017/06/06,1322.0,1337.591,1365.0,1079500,1365.0,1317.0
680,2017/06/07,1339.0,1329.143,1313.0,790400,1341.0,1307.0
681,2017/06/08,1334.0,1338.594,1342.0,616000,1348.0,1331.0
682,2017/06/09,1338.0,1337.488,1337.0,669300,1347.0,1323.0
683,2017/06/12,1334.0,1338.245,1349.0,484200,1360.0,1327.0
684,2017/06/13,1335.0,1333.553,1337.0,678200,1342.0,1322.0
685,2017/06/14,1317.0,1327.988,1340.0,525100,1347.0,1317.0
686,2017/06/15,1294.0,1290.451,1297.0,1214500,1301.0,1279.0
687,2017/06/16,1264.0,1276.781,1294.0,1548700,1303.0,1260.0
688,2017/06/19,1280.0,1282.447,1281.0,434700,1292.0,1268.0
689,2017/06/20,1304.0,1305.077,1292.0,781100,1315.0,1292.0
690,2017/06/21,1279.0,1285.609,1295.0,895600,1300.0,1276.0
691,2017/06/22,1245.0,1253.273,1260.0,1265400,1268.0,1243.0
692,2017/06/23,1238.0,1239.363,1243.0,1400900,1249.0,1231.0
693,2017/06/26,1263.0,1261.618,1259.0,925600,1267.0,1247.0
694,2017/06/27,1301.0,1302.007,1281.0,1342400,1323.0,1281.0
695,2017/06/28,1297.0,1301.746,1292.0,722600,1315.0,1292.0
696,2017/06/29,1337.0,1330.951,1320.0,1093500,1338.0,1318.0
697,2017/06/30,1349.0,1337.401,1315.0,1086600,1350.0,1310.0
698,2017/07/03,1348.0,1347.17,1355.0,617200,1357.0,1337.0
699,2017/07/04,1365.0,1365.953,1362.0,1089700,1377.0,1358.0
700,2017/07/05,1398.0,1385.895,1356.0,1067200,1399.0,1355.0
701,2017/07/06,1378.0,1379.258,1385.0,471900,1396.0,1372.0
702,2017/07/07,1371.0,1373.646,1361.0,438400,1386.0,1352.0
703,2017/07/10,1364.0,1371.245,1397.0,605700,1403.0,1361.0
704,2017/07/11,1351.0,1354.215,1360.0,665200,1364.0,1348.0
705,2017/07/12,1363.0,1353.591,1341.0,608300,1367.0,1335.0
706,2017/07/13,1377.0,1370.627,1365.0,659900,1379.0,1358.0
707,2017/07/14,1407.0,1398.712,1377.0,767100,1411.0,1375.0
708,2017/07/18,1390.0,1387.71,1383.0,870600,1398.0,1370.0
709,2017/07/19,1365.0,1367.185,1379.0,610000,1382.0,1358.0
710,2017/07/20,1379.0,1381.774,1375.0,495100,1393.0,1373.0
711,2017/07/21,1360.0,1360.972,1365.0,525000,1372.0,1353.0
712,2017/07/24,1342.0,1338.871,1355.0,536500,1355.0,1329.0
713,2017/07/25,1332.0,1334.406,1337.0,414500,1341.0,1328.0
714,2017/07/26,1362.0,1359.307,1340.0,559200,1370.0,1337.0
715,2017/07/27,1350.0,1351.179,1354.0,484300,1361.0,1342.0
716,2017/07/28,1338.0,1351.297,1367.0,695900,1382.0,1337.0
717,2017/07/31,1371.0,1368.547,1332.0,1052700,1387.0,1330.0
718,2017/08/01,1316.0,1318.671,1299.0,2275400,1338.0,1294.0
719,2017/08/02,1343.0,1341.683,1322.0,1016100,1355.0,1322.0
720,2017/08/03,1359.0,1348.687,1340.0,724300,1364.0,1330.0
721,2017/08/04,1351.0,1354.407,1362.0,472200,1364.0,1348.0
722,2017/08/07,1369.0,1367.062,1360.0,714400,1376.0,1356.0
723,2017/08/08,1366.0,1367.004,1381.0,637400,1386.0,1359.0
724,2017/08/09,1330.0,1336.055,1360.0,812400,1361.0,1327.0
725,2017/08/10,1312.0,1316.951,1326.0,520200,1333.0,1311.0
726,2017/08/14,1269.0,1273.753,1282.0,1006500,1288.0,1266.0
727,2017/08/15,1266.0,1273.848,1280.0,1055000,1289.0,1262.0
728,2017/08/16,1261.0,1262.835,1251.0,899900,1271.0,1250.0
729,2017/08/17,1262.0,1261.434,1256.0,651300,1270.0,1252.0
730,2017/08/18,1248.0,1245.703,1247.0,726400,1251.0,1235.0
731,2017/08/21,1262.0,1253.985,1254.0,949600,1266.0,1237.0
732,2017/08/22,1248.0,1247.399,1254.0,583700,1265.0,1240.0
733,2017/08/23,1222.0,1233.904,1277.0,1037300,1277.0,1220.0
734,2017/08/24,1197.0,1205.083,1217.0,1417400,1223.0,1195.0
735,2017/08/25,1232.0,1223.788,1200.0,1079800,1236.0,1198.0
736,2017/08/28,1236.0,1231.629,1231.0,842600,1238.0,1215.0
737,2017/08/29,1258.0,1252.011,1224.0,1096500,1264.0,1221.0
738,2017/08/30,1276.0,1274.794,1258.0,1301600,1289.0,1258.0
739,2017/08/31,1284.0,1284.194,1286.0,1178400,1293.0,1279.0
740,2017/09/01,1278.0,1277.826,1284.0,637300,1291.0,1271.0
741,2017/09/04,1249.0,1254.976,1270.0,767200,1273.0,1243.0
742,2017/09/05,1236.0,1242.871,1252.0,674300,1264.0,1229.0
743,2017/09/06,1241.0,1231.136,1211.0,414000,1244.0,1205.0
744,2017/09/07,1258.0,1250.702,1249.0,523900,1258.0,1230.0
745,2017/09/08,1244.0,1252.452,1250.0,768900,1271.0,1239.0
746,2017/09/11,1269.0,1269.2,1251.0,496100,1277.0,1248.0
747,2017/09/12,1283.0,1281.897,1300.0,662200,1301.0,1268.0
748,2017/09/13,1305.0,1305.606,1293.0,641800,1317.0,1293.0
749,2017/09/14,1286.0,1290.804,1293.0,363500,1304.0,1283.0
750,2017/09/15,1311.0,1300.918,1281.0,575800,1311.0,1279.0
751,2017/09/19,1335.0,1340.385,1335.0,773800,1356.0,1327.0
752,2017/09/20,1342.0,1340.167,1331.0,484400,1347.0,1331.0
753,2017/09/21,1330.0,1340.092,1347.0,663800,1356.0,1326.0
754,2017/09/22,1309.0,1312.506,1337.0,577600,1337.0,1301.0
755,2017/09/25,1325.0,1327.755,1319.0,475400,1343.0,1317.0
756,2017/09/26,1336.0,1332.02,1320.0,389200,1343.0,1315.0
757,2017/09/27,1325.0,1327.358,1330.0,338300,1335.0,1319.0
758,2017/09/28,1331.0,1333.539,1335.0,564100,1349.0,1324.0
759,2017/09/29,1315.0,1320.096,1323.0,488700,1333.0,1312.0
760,2017/10/02,1293.0,1297.985,1326.0,835600,1326.0,1289.0
761,2017/10/03,1299.0,1297.889,1301.0,900200,1309.0,1290.0
762,2017/10/04,1294.0,1290.026,1290.0,707900,1295.0,1282.0
763,2017/10/05,1291.0,1291.179,1300.0,812300,1315.0,1287.0
764,2017/10/06,1325.0,1323.9,1305.0,1015700,1336.0,1305.0
765,2017/10/10,1319.0,1316.257,1326.0,1114100,1334.0,1301.0
766,2017/10/11,1335.0,1333.774,1330.0,1128600,1347.0,1312.0
767,2017/10/12,1322.0,1322.029,1338.0,625500,1338.0,1314.0
768,2017/10/13,1333.0,1326.813,1325.0,619100,1337.0,1312.0
769,2017/10/16,1367.0,1360.018,1350.0,955700,1372.0,1343.0
770,2017/10/17,1417.0,1413.178,1389.0,1610200,1437.0,1389.0
771,2017/10/18,1421.0,1417.286,1409.0,858600,1424.0,1402.0
772,2017/10/19,1422.0,1425.641,1433.0,1150100,1464.0,1414.0
773,2017/10/20,1409.0,1410.121,1408.0,551600,1421.0,1394.0
774,2017/10/23,1402.0,1398.14,1429.0,1120000,1429.0,1385.0
775,2017/10/24,1383.0,1379.98,1372.0,809600,1388.0,1371.0
776,2017/10/25,1382.0,1389.269,1394.0,993700,1404.0,1378.0
777,2017/10/26,1411.0,1402.78,1383.0,1055500,1414.0,1381.0
778,2017/10/27,1418.0,1415.144,1405.0,701000,1424.0,1400.0
779,2017/10/30,1423.0,1417.906,1390.0,1868600,1438.0,1379.0
780,2017/10/31,1715.0,1687.566,1662.0,7594100,1723.0,1598.0
781,2017/11/01,1722.0,1696.644,1675.0,3331500,1725.0,1659.0
782,2017/11/02,1753.0,1736.065,1750.0,1432400,1758.0,1712.0
783,2017/11/06,1770.0,1770.577,1743.0,1449400,1795.0,1737.0
784,2017/11/07,1763.0,1764.128,1747.0,1442700,1781.0,1736.0
785,2017/11/08,1797.0,1786.308,1740.0,1308300,1808.0,1739.0
786,2017/11/09,1815.0,1827.927,1807.0,2583100,1866.0,1787.0
787,2017/11/10,1809.0,1805.867,1775.0,1511000,1827.0,1774.0
788,2017/11/13,1822.0,1829.633,1837.0,1108500,1848.0,1811.0
789,2017/11/14,1824.0,1834.246,1815.0,898700,1853.0,1810.0
790,2017/11/15,1721.0,1730.423,1752.0,1880600,1761.0,1714.0
791,2017/11/16,1712.0,1712.112,1704.0,991900,1724.0,1695.0
792,2017/11/17,1720.0,1733.358,1743.0,1018100,1763.0,1713.0
793,2017/11/20,1692.0,1698.892,1702.0,772700,1719.0,1685.0
794,2017/11/21,1741.0,1735.04,1718.0,690000,1746.0,1715.0
795,2017/11/22,1778.0,1786.232,1789.0,1181200,1797.0,1774.0
796,2017/11/24,1762.0,1761.92,1771.0,1404800,1782.0,1737.0
797,2017/11/27,1731.0,1734.716,1752.0,897300,1763.0,1726.0
798,2017/11/28,1721.0,1722.398,1731.0,708400,1736.0,1711.0
799,2017/11/29,1705.0,1717.202,1724.0,661200,1737.0,1699.0
800,2017/11/30,1706.0,1707.649,1699.0,717900,1717.0,1698.0
801,2017/12/01,1762.0,1755.241,1735.0,1114000,1771.0,1727.0
802,2017/12/04,1725.0,1733.741,1749.0,654600,1756.0,1722.0
803,2017/12/05,1726.0,1724.058,1712.0,468500,1735.0,1712.0
804,2017/12/06,1721.0,1729.299,1717.0,872900,1754.0,1712.0
805,2017/12/07,1734.0,1729.286,1711.0,673000,1740.0,1699.0
806,2017/12/08,1776.0,1767.244,1724.0,905300,1797.0,1724.0
807,2017/12/11,1830.0,1813.543,1805.0,861300,1833.0,1785.0
808,2017/12/12,1824.0,1822.492,1820.0,615300,1837.0,1810.0
809,2017/12/13,1768.0,1776.761,1810.0,679700,1819.0,1764.0
810,2017/12/14,1740.0,1740.742,1741.0,759000,1755.0,1724.0
811,2017/12/15,1727.0,1727.479,1734.0,643800,1743.0,1708.0
812,2017/12/18,1757.0,1746.692,1736.0,737900,1761.0,1727.0
813,2017/12/19,1750.0,1759.216,1769.0,773400,1780.0,1749.0
814,2017/12/20,1769.0,1773.771,1753.0,706300,1789.0,1753.0
815,2017/12/21,1793.0,1796.651,1782.0,798100,1813.0,1773.0
816,2017/12/22,1837.0,1821.565,1800.0,760400,1841.0,1791.0
817,2017/12/25,1803.0,1816.907,1841.0,638600,1844.0,1797.0
818,2017/12/26,1816.0,1816.566,1817.0,407300,1822.0,1809.0
819,2017/12/27,1849.0,1845.622,1820.0,1150400,1855.0,1818.0
820,2017/12/28,1868.0,1883.441,1866.0,1261500,1912.0,1865.0
821,2017/12/29,1871.0,1873.247,1880.0,520900,1884.0,1863.0
822,2018/01/04,1921.0,1908.491,1901.0,689400,1921.0,1883.0
823,2018/01/05,1954.0,1953.926,1952.0,825900,1966.0,1945.0
824,2018/01/09,2049.0,2069.156,2113.0,2754200,2134.0,2031.0
825,2018/01/10,2070.0,2063.473,2050.0,924300,2085.0,2033.0
826,2018/01/11,2100.0,2096.398,2088.0,1521300,2115.0,2077.0
827,2018/01/12,2115.0,2104.82,2104.0,939000,2126.0,2078.0
828,2018/01/15,2081.0,2096.212,2136.0,671800,2147.0,2077.0
829,2018/01/16,2076.0,2059.739,2075.0,1111900,2079.0,2039.0
830,2018/01/17,2092.0,2066.175,2048.0,654500,2096.0,2017.0
831,2018/01/18,2054.0,2069.734,2100.0,645900,2119.0,2054.0
832,2018/01/19,2107.0,2082.927,2050.0,774000,2111.0,2037.0
833,2018/01/22,1935.0,1953.817,2037.0,3774300,2041.0,1922.0
834,2018/01/23,2003.0,1988.302,1991.0,1479500,2017.0,1948.0
835,2018/01/24,1961.0,1973.969,1972.0,793400,2001.0,1954.0
836,2018/01/25,1885.0,1877.551,1841.0,1871700,1895.0,1835.0
837,2018/01/26,1902.0,1895.819,1885.0,1068600,1917.0,1876.0
838,2018/01/29,1909.0,1891.531,1901.0,1130300,1916.0,1862.0
839,2018/01/30,1893.0,1899.372,1907.0,943000,1917.0,1889.0
840,2018/01/31,1904.0,1921.124,1973.0,1045500,1973.0,1904.0
841,2018/02/01,1851.0,1842.158,1744.0,3139200,1891.0,1741.0
842,2018/02/02,1879.0,1885.084,1890.0,1217000,1925.0,1857.0
843,2018/02/05,1784.0,1793.995,1830.0,1272900,1838.0,1774.0
844,2018/02/06,1700.0,1685.664,1699.0,1269200,1734.0,1645.0
845,2018/02/07,1738.0,1767.998,1766.0,1456600,1818.0,1738.0
846,2018/02/08,1773.0,1770.287,1750.0,775100,1792.0,1746.0
847,2018/02/09,1704.0,1705.533,1691.0,1202600,1727.0,1681.0
848,2018/02/13,1662.0,1685.182,1729.0,1020200,1729.0,1658.0
849,2018/02/14,1634.0,1641.123,1660.0,1055000,1683.0,1616.0
850,2018/02/15,1690.0,1685.041,1668.0,629400,1705.0,1656.0
851,2018/02/16,1676.0,1682.19,1703.0,561200,1710.0,1670.0
852,2018/02/19,1729.0,1721.288,1697.0,723600,1746.0,1693.0
853,2018/02/20,1699.0,1692.969,1729.0,475800,1729.0,1677.0
854,2018/02/21,1704.0,1702.477,1710.0,426100,1720.0,1682.0
855,2018/02/22,1686.0,1684.257,1685.0,426900,1696.0,1671.0
856,2018/02/23,1732.0,1723.274,1694.0,443000,1738.0,1693.0
857,2018/02/26,1716.0,1718.275,1747.0,435500,1748.0,1700.0
858,2018/02/27,1728.0,1732.503,1746.0,460400,1750.0,1720.0
859,2018/02/28,1692.0,1709.429,1725.0,569600,1734.0,1690.0
860,2018/03/01,1648.0,1648.701,1678.0,569700,1682.0,1633.0
861,2018/03/02,1586.0,1584.499,1600.0,1221100,1619.0,1569.0
862,2018/03/05,1543.0,1540.274,1556.0,1252000,1561.0,1526.0
863,2018/03/06,1553.0,1559.044,1574.0,946300,1579.0,1547.0
864,2018/03/07,1531.0,1534.379,1536.0,552800,1549.0,1525.0
865,2018/03/08,1548.0,1540.003,1541.0,894900,1553.0,1524.0
866,2018/03/09,1553.0,1561.888,1575.0,956100,1584.0,1539.0
867,2018/03/12,1608.0,1601.861,1592.0,564000,1612.0,1575.0
868,2018/03/13,1606.0,1581.891,1583.0,635200,1606.0,1556.0
869,2018/03/14,1617.0,1611.952,1584.0,523900,1624.0,1581.0
870,2018/03/15,1611.0,1604.198,1601.0,589200,1614.0,1585.0
871,2018/03/16,1613.0,1611.247,1613.0,430300,1619.0,1601.0
872,2018/03/19,1571.0,1582.23,1585.0,432900,1613.0,1564.0
873,2018/03/20,1555.0,1553.331,1547.0,612100,1563.0,1537.0
874,2018/03/22,1589.0,1583.534,1564.0,595500,1602.0,1557.0
875,2018/03/23,1504.0,1508.514,1529.0,1119400,1549.0,1493.0
876,2018/03/26,1535.0,1513.783,1491.0,724400,1537.0,1481.0
877,2018/03/27,1598.0,1593.404,1567.0,696700,1609.0,1563.0
878,2018/03/28,1579.0,1573.116,1575.0,372700,1587.0,1559.0
879,2018/03/29,1579.0,1580.341,1600.0,286200,1605.0,1562.0
880,2018/03/30,1595.0,1597.247,1615.0,328100,1618.0,1588.0
881,2018/04/02,1583.0,1591.578,1590.0,378700,1600.0,1583.0
882,2018/04/03,1555.0,1549.167,1550.0,499900,1562.0,1534.0
883,2018/04/04,1553.0,1552.038,1555.0,500000,1564.0,1545.0
884,2018/04/05,1608.0,1596.027,1577.0,909900,1617.0,1569.0
885,2018/04/06,1586.0,1590.699,1610.0,624700,1610.0,1579.0
886,2018/04/09,1576.0,1572.407,1588.0,403600,1590.0,1553.0
887,2018/04/10,1613.0,1582.926,1572.0,1124400,1619.0,1536.0
888,2018/04/11,1661.0,1665.442,1644.0,814400,1691.0,1644.0
889,2018/04/12,1621.0,1631.604,1657.0,475900,1657.0,1618.0
890,2018/04/13,1637.0,1641.089,1634.0,680600,1661.0,1627.0
891,2018/04/16,1645.0,1643.927,1642.0,476400,1659.0,1633.0
892,2018/04/17,1648.0,1646.735,1637.0,390600,1656.0,1631.0
893,2018/04/18,1671.0,1666.327,1650.0,405500,1675.0,1647.0
894,2018/04/19,1692.0,1695.108,1691.0,772000,1711.0,1684.0
895,2018/04/20,1691.0,1690.342,1685.0,373500,1700.0,1668.0
896,2018/04/23,1698.0,1700.009,1697.0,388800,1716.0,1686.0
897,2018/04/24,1720.0,1721.603,1725.0,381600,1735.0,1714.0
898,2018/04/25,1669.0,1670.602,1691.0,878400,1693.0,1662.0
899,2018/04/26,1655.0,1671.079,1690.0,864200,1696.0,1652.0
900,2018/04/27,1690.0,1682.64,1688.0,880200,1696.0,1653.0
901,2018/05/01,1480.0,1493.694,1490.0,3445900,1518.0,1469.0
902,2018/05/02,1495.0,1499.465,1480.0,1319300,1530.0,1466.0
903,2018/05/07,1507.0,1504.011,1508.0,909600,1518.0,1494.0
904,2018/05/08,1516.0,1521.166,1518.0,1159300,1534.0,1504.0
905,2018/05/09,1506.0,1507.541,1516.0,594200,1526.0,1494.0
906,2018/05/10,1497.0,1499.35,1500.0,636100,1512.0,1490.0
907,2018/05/11,1515.0,1508.919,1492.0,731900,1526.0,1492.0
908,2018/05/14,1518.0,1508.606,1500.0,436400,1521.0,1496.0
909,2018/05/15,1545.0,1548.215,1539.0,1232900,1566.0,1532.0
910,2018/05/16,1571.0,1573.648,1570.0,1091500,1593.0,1559.0
911,2018/05/17,1618.0,1609.854,1579.0,822900,1623.0,1565.0
912,2018/05/18,1615.0,1617.278,1626.0,758100,1632.0,1606.0
913,2018/05/21,1636.0,1626.218,1621.0,411300,1638.0,1606.0
914,2018/05/22,1641.0,1644.253,1642.0,469000,1660.0,1634.0
915,2018/05/23,1624.0,1625.936,1636.0,480100,1641.0,1611.0
916,2018/05/24,1593.0,1591.906,1619.0,410800,1619.0,1580.0
917,2018/05/25,1559.0,1566.756,1591.0,509900,1592.0,1555.0
918,2018/05/28,1544.0,1550.822,1565.0,574200,1574.0,1539.0
919,2018/05/29,1538.0,1540.426,1544.0,319700,1556.0,1530.0
920,2018/05/30,1504.0,1504.327,1508.0,402400,1513.0,1495.0
921,2018/05/31,1499.0,1499.208,1516.0,661400,1528.0,1491.0
922,2018/06/01,1481.0,1477.11,1470.0,778800,1489.0,1456.0
923,2018/06/04,1527.0,1524.043,1499.0,923500,1542.0,1499.0
924,2018/06/05,1534.0,1537.837,1530.0,735500,1554.0,1527.0
925,2018/06/06,1515.0,1518.464,1525.0,408300,1528.0,1502.0
926,2018/06/07,1533.0,1536.526,1535.0,477000,1548.0,1531.0
927,2018/06/08,1505.0,1503.871,1511.0,745900,1524.0,1492.0
928,2018/06/11,1511.0,1514.837,1500.0,416500,1528.0,1494.0
929,2018/06/12,1486.0,1484.462,1492.0,603900,1498.0,1476.0
930,2018/06/13,1494.0,1493.492,1483.0,317900,1501.0,1483.0
931,2018/06/14,1480.0,1482.275,1478.0,235200,1491.0,1477.0
932,2018/06/15,1447.0,1457.146,1490.0,514200,1490.0,1442.0
933,2018/06/18,1407.0,1407.578,1437.0,653000,1437.0,1397.0
934,2018/06/19,1395.0,1405.608,1395.0,486200,1428.0,1395.0
935,2018/06/20,1401.0,1390.459,1383.0,562100,1407.0,1368.0
936,2018/06/21,1414.0,1411.897,1402.0,410500,1421.0,1393.0
937,2018/06/22,1392.0,1386.148,1386.0,734800,1397.0,1358.0
938,2018/06/25,1379.0,1386.572,1393.0,478900,1399.0,1378.0
939,2018/06/26,1380.0,1366.81,1350.0,690900,1382.0,1337.0
940,2018/06/27,1365.0,1368.972,1376.0,471900,1399.0,1360.0
941,2018/06/28,1360.0,1357.595,1335.0,394800,1366.0,1335.0
942,2018/06/29,1361.0,1354.996,1360.0,392500,1365.0,1342.0
943,2018/07/02,1330.0,1350.467,1363.0,582500,1381.0,1327.0
944,2018/07/03,1302.0,1301.819,1337.0,1210300,1352.0,1284.0
945,2018/07/04,1292.0,1292.915,1295.0,606800,1307.0,1281.0
946,2018/07/05,1281.0,1281.628,1292.0,846000,1302.0,1272.0
947,2018/07/06,1303.0,1298.407,1278.0,733500,1310.0,1272.0
948,2018/07/09,1302.0,1299.725,1307.0,555300,1307.0,1288.0
949,2018/07/10,1340.0,1345.524,1332.0,873800,1357.0,1329.0
950,2018/07/11,1348.0,1344.309,1310.0,942700,1360.0,1310.0
951,2018/07/12,1350.0,1341.93,1341.0,669700,1359.0,1317.0
952,2018/07/13,1366.0,1365.746,1364.0,519500,1374.0,1353.0
953,2018/07/17,1365.0,1366.81,1363.0,438400,1378.0,1353.0
954,2018/07/18,1375.0,1378.373,1384.0,369300,1392.0,1370.0
955,2018/07/19,1385.0,1389.521,1374.0,298900,1400.0,1374.0
956,2018/07/20,1376.0,1375.356,1380.0,355800,1395.0,1362.0
957,2018/07/23,1355.0,1357.338,1368.0,289900,1374.0,1350.0
958,2018/07/24,1393.0,1390.245,1372.0,410200,1403.0,1372.0
959,2018/07/25,1405.0,1405.522,1410.0,308100,1422.0,1396.0
960,2018/07/26,1427.0,1425.487,1425.0,650700,1448.0,1416.0
961,2018/07/27,1469.0,1472.734,1450.0,1038200,1488.0,1450.0
962,2018/07/30,1467.0,1464.994,1464.0,638500,1471.0,1452.0
963,2018/07/31,1440.0,1443.713,1494.0,930300,1497.0,1427.0
964,2018/08/01,1342.0,1293.39,1261.0,3416500,1345.0,1240.0
965,2018/08/02,1322.0,1326.903,1343.0,1126600,1353.0,1307.0
966,2018/08/03,1306.0,1306.935,1318.0,776300,1321.0,1292.0
967,2018/08/06,1294.0,1299.294,1302.0,568100,1312.0,1290.0
968,2018/08/07,1307.0,1300.332,1298.0,327100,1309.0,1288.0
969,2018/08/08,1318.0,1317.631,1311.0,533300,1325.0,1306.0
970,2018/08/09,1311.0,1303.987,1313.0,362100,1316.0,1287.0
971,2018/08/10,1290.0,1290.635,1300.0,599300,1303.0,1283.0
972,2018/08/13,1240.0,1248.831,1275.0,480000,1275.0,1239.0
973,2018/08/14,1263.0,1254.816,1250.0,337900,1266.0,1245.0
974,2018/08/15,1241.0,1247.511,1266.0,497800,1276.0,1233.0
975,2018/08/16,1228.0,1221.843,1225.0,605400,1233.0,1202.0
976,2018/08/17,1259.0,1254.369,1238.0,398500,1265.0,1236.0
977,2018/08/20,1248.0,1252.558,1255.0,271600,1263.0,1248.0
978,2018/08/21,1233.0,1235.762,1235.0,291100,1248.0,1230.0
979,2018/08/22,1259.0,1256.878,1240.0,333100,1265.0,1240.0
980,2018/08/23,1172.0,1185.702,1210.0,1820500,1217.0,1166.0
981,2018/08/24,1172.0,1172.51,1176.0,680800,1186.0,1165.0
982,2018/08/27,1200.0,1193.805,1181.0,640000,1200.0,1181.0
983,2018/08/28,1218.0,1221.799,1221.0,504900,1233.0,1212.0
984,2018/08/29,1223.0,1226.471,1218.0,544700,1237.0,1218.0
985,2018/08/30,1225.0,1231.021,1236.0,662100,1245.0,1223.0
986,2018/08/31,1221.0,1217.154,1195.0,657400,1233.0,1191.0
987,2018/09/03,1179.0,1184.215,1201.0,933400,1209.0,1171.0
988,2018/09/04,1175.0,1173.397,1180.0,568000,1185.0,1163.0
989,2018/09/05,1164.0,1163.19,1162.0,615000,1174.0,1155.0
990,2018/09/06,1170.0,1170.732,1168.0,566100,1178.0,1158.0
991,2018/09/07,1139.0,1142.356,1155.0,537500,1156.0,1134.0
992,2018/09/10,1147.0,1148.582,1131.0,428500,1161.0,1128.0
993,2018/09/11,1150.0,1150.844,1145.0,393700,1157.0,1143.0
994,2018/09/12,1131.0,1132.812,1156.0,491500,1162.0,1119.0
995,2018/09/13,1149.0,1147.269,1137.0,490700,1156.0,1134.0
996,2018/09/14,1174.0,1168.034,1163.0,572500,1176.0,1158.0
997,2018/09/18,1206.0,1200.275,1170.0,520700,1213.0,1162.0
998,2018/09/19,1265.0,1255.679,1247.0,763900,1270.0,1231.0
999,2018/09/20,1274.0,1273.63,1280.0,904600,1289.0,1257.0
1000,2018/09/21,1322.0,1317.053,1304.0,900500,1324.0,1300.0
1001,2018/09/25,1325.0,1321.585,1336.0,840000,1337.0,1303.0
1002,2018/09/26,1328.0,1326.149,1341.0,750200,1350.0,1311.0
1003,2018/09/27,1320.0,1325.567,1335.0,550900,1340.0,1314.0
1004,2018/09/28,1321.0,1327.144,1338.0,509900,1349.0,1318.0
1005,2018/10/01,1329.0,1330.408,1331.0,523600,1341.0,1322.0
1006,2018/10/02,1348.0,1356.029,1350.0,762600,1381.0,1344.0
1007,2018/10/03,1346.0,1356.023,1378.0,661300,1381.0,1344.0
1008,2018/10/04,1358.0,1365.448,1380.0,419000,1385.0,1346.0
1009,2018/10/05,1347.0,1353.747,1363.0,571700,1372.0,1344.0
1010,2018/10/09,1338.0,1333.819,1347.0,678000,1348.0,1319.0
1011,2018/10/10,1336.0,1339.451,1356.0,481100,1356.0,1331.0
1012,2018/10/11,1269.0,1263.441,1268.0,1167700,1272.0,1251.0
1013,2018/10/12,1277.0,1271.423,1255.0,397500,1283.0,1253.0
1014,2018/10/15,1251.0,1255.374,1251.0,480900,1266.0,1246.0
1015,2018/10/16,1254.0,1254.484,1242.0,571200,1268.0,1240.0
1016,2018/10/17,1265.0,1268.82,1263.0,348500,1285.0,1260.0
1017,2018/10/18,1231.0,1244.637,1263.0,729200,1268.0,1230.0
1018,2018/10/19,1214.0,1206.474,1200.0,605600,1214.0,1189.0
1019,2018/10/22,1183.0,1183.765,1184.0,919600,1193.0,1170.0
1020,2018/10/23,1132.0,1143.274,1170.0,615800,1170.0,1131.0
1021,2018/10/24,1092.0,1095.544,1116.0,846900,1121.0,1086.0
1022,2018/10/25,1063.0,1067.395,1062.0,705100,1079.0,1057.0
1023,2018/10/26,1042.0,1047.804,1073.0,580200,1074.0,1029.0
1024,2018/10/29,1028.0,1040.216,1054.0,915900,1066.0,1026.0
1025,2018/10/30,1069.0,1057.52,1015.0,979500,1076.0,1015.0
1026,2018/10/31,1218.0,1230.544,1219.0,3242100,1266.0,1182.0
1027,2018/11/01,1181.0,1208.068,1218.0,1296600,1238.0,1179.0
1028,2018/11/02,1248.0,1215.21,1181.0,1184000,1260.0,1167.0
1029,2018/11/05,1248.0,1242.49,1221.0,758000,1257.0,1211.0
1030,2018/11/06,1214.0,1225.845,1237.0,609700,1248.0,1214.0
1031,2018/11/07,1269.0,1265.891,1213.0,1089200,1297.0,1213.0
1032,2018/11/08,1321.0,1335.678,1320.0,1320800,1359.0,1310.0
1033,2018/11/09,1326.0,1342.717,1321.0,1181700,1369.0,1307.0
1034,2018/11/12,1365.0,1352.297,1315.0,974800,1370.0,1314.0
1035,2018/11/13,1289.0,1280.796,1308.0,1261100,1320.0,1259.0
1036,2018/11/14,1257.0,1265.298,1280.0,967700,1297.0,1251.0
1037,2018/11/15,1255.0,1253.227,1255.0,470400,1274.0,1240.0
1038,2018/11/16,1271.0,1273.548,1277.0,780000,1299.0,1259.0
1039,2018/11/19,1273.0,1271.624,1270.0,353900,1282.0,1251.0
1040,2018/11/20,1312.0,1298.584,1259.0,822700,1312.0,1257.0
1041,2018/11/21,1292.0,1279.305,1261.0,699700,1297.0,1247.0
1042,2018/11/22,1310.0,1302.403,1325.0,725100,1332.0,1276.0
1043,2018/11/26,1329.0,1322.043,1300.0,552400,1333.0,1293.0
1044,2018/11/27,1342.0,1340.251,1337.0,714200,1351.0,1322.0
1045,2018/11/28,1325.0,1328.746,1345.0,492500,1349.0,1320.0
1046,2018/11/29,1339.0,1339.633,1350.0,464100,1362.0,1322.0
1047,2018/11/30,1361.0,1357.174,1343.0,450200,1372.0,1339.0
1048,2018/12/03,1389.0,1386.448,1382.0,552200,1398.0,1370.0
1049,2018/12/04,1340.0,1354.279,1394.0,475100,1396.0,1333.0
1050,2018/12/05,1297.0,1297.046,1293.0,605200,1317.0,1283.0
1051,2018/12/06,1210.0,1222.644,1277.0,911900,1277.0,1202.0
1052,2018/12/07,1160.0,1157.465,1183.0,1321200,1194.0,1131.0
1053,2018/12/10,1116.0,1107.817,1112.0,1046200,1120.0,1082.0
1054,2018/12/11,1095.0,1098.748,1120.0,716400,1122.0,1088.0
1055,2018/12/12,1150.0,1145.075,1125.0,1069300,1165.0,1123.0
1056,2018/12/13,1157.0,1154.37,1148.0,840000,1171.0,1132.0
1057,2018/12/14,1128.0,1134.178,1151.0,731700,1157.0,1114.0
1058,2018/12/17,1103.0,1112.522,1117.0,550200,1142.0,1100.0
1059,2018/12/18,1067.0,1071.871,1084.0,738400,1090.0,1058.0
1060,2018/12/19,1064.0,1063.883,1065.0,493600,1080.0,1045.0
1061,2018/12/20,1004.0,1015.532,1034.0,868300,1038.0,998.0
1062,2018/12/21,986.0,987.274,999.0,789000,1005.0,975.0
1063,2018/12/25,923.0,924.427,916.0,575800,938.0,907.0
1064,2018/12/26,945.0,939.682,934.0,610800,953.0,929.0
1065,2018/12/27,988.0,987.594,989.0,694500,997.0,979.0
1066,2018/12/28,999.0,1002.729,986.0,708400,1016.0,982.0
1067,2019/01/04,1003.0,993.954,984.0,1051100,1015.0,957.0
1068,2019/01/07,1037.0,1046.626,1050.0,514200,1080.0,1030.0
1069,2019/01/08,1058.0,1064.35,1056.0,536000,1084.0,1052.0
1070,2019/01/09,1114.0,1102.543,1070.0,999200,1118.0,1070.0
1071,2019/01/10,1116.0,1114.09,1105.0,854800,1137.0,1094.0
1072,2019/01/11,1144.0,1131.674,1122.0,729600,1147.0,1108.0
1073,2019/01/15,1159.0,1146.592,1125.0,542900,1161.0,1123.0
1074,2019/01/16,1144.0,1141.897,1159.0,435800,1159.0,1128.0
1075,2019/01/17,1148.0,1144.755,1168.0,493700,1168.0,1130.0
1076,2019/01/18,1176.0,1159.666,1160.0,536200,1177.0,1143.0
1077,2019/01/21,1220.0,1210.866,1209.0,549100,1222.0,1197.0
1078,2019/01/22,1194.0,1199.429,1220.0,536800,1225.0,1182.0
1079,2019/01/23,1179.0,1176.213,1171.0,468400,1188.0,1150.0
1080,2019/01/24,1229.0,1220.521,1198.0,1197400,1239.0,1191.0
1081,2019/01/25,1266.0,1262.599,1250.0,789600,1279.0,1241.0
1082,2019/01/28,1260.0,1264.405,1272.0,492000,1290.0,1255.0
1083,2019/01/29,1238.0,1234.376,1248.0,689700,1249.0,1217.0
1084,2019/01/30,1225.0,1228.79,1251.0,598300,1251.0,1217.0
1085,2019/01/31,1235.0,1241.43,1285.0,695400,1285.0,1226.0
1086,2019/02/01,1134.0,1143.345,1235.0,2404100,1252.0,1082.0
1087,2019/02/04,1180.0,1164.164,1135.0,1255700,1180.0,1133.0
1088,2019/02/05,1204.0,1209.747,1203.0,662600,1226.0,1195.0
1089,2019/02/06,1228.0,1220.318,1204.0,547200,1234.0,1187.0
1090,2019/02/07,1192.0,1195.751,1224.0,344800,1224.0,1186.0
1091,2019/02/08,1148.0,1150.137,1172.0,523900,1176.0,1134.0
1092,2019/02/12,1150.0,1155.201,1158.0,899400,1165.0,1147.0
1093,2019/02/13,1150.0,1145.832,1161.0,1165800,1167.0,1125.0
1094,2019/02/14,1160.0,1157.492,1153.0,586700,1165.0,1149.0
1095,2019/02/15,1157.0,1153.103,1147.0,471700,1166.0,1127.0
1096,2019/02/18,1208.0,1204.275,1187.0,559900,1215.0,1179.0
1097,2019/02/19,1190.0,1193.872,1200.0,602200,1205.0,1173.0
1098,2019/02/20,1185.0,1188.081,1186.0,334800,1196.0,1180.0
1099,2019/02/21,1176.0,1175.608,1178.0,668000,1189.0,1165.0
1100,2019/02/22,1162.0,1153.944,1159.0,568600,1162.0,1132.0
1101,2019/02/25,1181.0,1182.894,1177.0,406800,1195.0,1171.0
1102,2019/02/26,1174.0,1178.849,1188.0,316600,1196.0,1164.0
1103,2019/02/27,1195.0,1184.738,1180.0,640700,1197.0,1166.0
1104,2019/02/28,1161.0,1171.157,1193.0,509700,1198.0,1161.0
1105,2019/03/01,1173.0,1172.33,1168.0,365500,1181.0,1162.0
1106,2019/03/04,1195.0,1198.041,1189.0,367600,1211.0,1188.0
1107,2019/03/05,1177.0,1180.433,1191.0,407500,1196.0,1174.0
1108,2019/03/06,1169.0,1164.303,1164.0,345100,1170.0,1147.0
1109,2019/03/07,1104.0,1112.169,1157.0,840500,1157.0,1097.0
1110,2019/03/08,1059.0,1064.413,1076.0,633900,1083.0,1053.0
1111,2019/03/11,1048.0,1047.221,1056.0,641800,1056.0,1036.0
1112,2019/03/12,1069.0,1069.738,1065.0,616300,1080.0,1056.0
1113,2019/03/13,1038.0,1045.592,1061.0,473700,1068.0,1035.0
1114,2019/03/14,1021.0,1030.044,1035.0,514300,1049.0,1020.0
1115,2019/03/15,1037.0,1035.947,1026.0,508400,1042.0,1026.0
1116,2019/03/18,1042.0,1039.465,1045.0,443600,1048.0,1033.0
1117,2019/03/19,1035.0,1034.564,1044.0,609000,1044.0,1030.0
1118,2019/03/20,1039.0,1038.182,1032.0,415700,1048.0,1030.0
1119,2019/03/22,1039.0,1034.458,1040.0,511400,1046.0,1025.0
1120,2019/03/25,1019.0,1010.035,1011.0,1051000,1030.0,999.0
1121,2019/03/26,1059.0,1053.305,1039.0,682000,1061.0,1033.0
1122,2019/03/27,1048.0,1052.656,1065.0,786400,1071.0,1034.0
1123,2019/03/28,1023.0,1023.601,1030.0,538900,1045.0,1013.0
1124,2019/03/29,1051.0,1044.709,1039.0,625400,1052.0,1030.0
1125,2019/04/01,1096.0,1090.008,1080.0,1132200,1104.0,1075.0
1126,2019/04/02,1131.0,1129.671,1118.0,567900,1141.0,1115.0
1127,2019/04/03,1152.0,1145.446,1135.0,505900,1157.0,1127.0
1128,2019/04/04,1158.0,1165.314,1159.0,506200,1178.0,1155.0
1129,2019/04/05,1180.0,1176.065,1161.0,390100,1184.0,1159.0
1130,2019/04/08,1163.0,1165.44,1192.0,394400,1195.0,1156.0
1131,2019/04/09,1173.0,1165.554,1168.0,478200,1174.0,1155.0
1132,2019/04/10,1186.0,1179.139,1161.0,704400,1188.0,1161.0
1133,2019/04/11,1157.0,1158.538,1186.0,717200,1186.0,1149.0
1134,2019/04/12,1144.0,1142.889,1150.0,410000,1150.0,1135.0
1135,2019/04/15,1169.0,1169.842,1174.0,497800,1185.0,1164.0
1136,2019/04/16,1157.0,1156.961,1169.0,326500,1169.0,1150.0
1137,2019/04/17,1195.0,1191.674,1179.0,718600,1200.0,1176.0
1138,2019/04/18,1170.0,1173.904,1200.0,669500,1202.0,1161.0
1139,2019/04/19,1180.0,1181.012,1191.0,380500,1200.0,1165.0
1140,2019/04/22,1173.0,1170.249,1171.0,435300,1177.0,1154.0
1141,2019/04/23,1165.0,1168.078,1180.0,526200,1189.0,1159.0
1142,2019/04/24,1146.0,1150.287,1173.0,523200,1174.0,1138.0
1143,2019/04/25,1169.0,1169.909,1200.0,805200,1207.0,1153.0
1144,2019/04/26,1168.0,1159.347,1152.0,658900,1170.0,1134.0
1145,2019/05/07,1167.0,1195.901,1250.0,2305100,1262.0,1160.0
1146,2019/05/08,1160.0,1156.935,1166.0,1417900,1177.0,1130.0
1147,2019/05/09,1126.0,1131.488,1153.0,943800,1153.0,1118.0
1148,2019/05/10,1154.0,1157.507,1138.0,988200,1185.0,1132.0
1149,2019/05/13,1127.0,1134.78,1147.0,604100,1154.0,1126.0
1150,2019/05/14,1079.0,1075.749,1073.0,1214000,1087.0,1052.0
1151,2019/05/15,1099.0,1092.877,1089.0,673400,1106.0,1073.0
1152,2019/05/16,1068.0,1066.075,1089.0,955600,1090.0,1052.0
1153,2019/05/17,1088.0,1089.252,1090.0,447800,1099.0,1079.0
1154,2019/05/20,1078.0,1080.013,1086.0,447200,1099.0,1071.0
1155,2019/05/21,1063.0,1064.932,1067.0,411700,1076.0,1055.0
1156,2019/05/22,1056.0,1059.535,1064.0,347500,1074.0,1054.0
1157,2019/05/23,1046.0,1040.558,1050.0,476000,1050.0,1032.0
1158,2019/05/24,1048.0,1042.418,1031.0,948600,1069.0,1021.0
1159,2019/05/27,1048.0,1050.883,1054.0,272700,1060.0,1045.0
1160,2019/05/28,1042.0,1042.604,1048.0,431200,1049.0,1033.0
1161,2019/05/29,1023.0,1022.638,1025.0,485800,1030.0,1008.0
1162,2019/05/30,1060.0,1048.763,1022.0,507400,1062.0,1022.0
1163,2019/05/31,1052.0,1053.34,1044.0,730300,1066.0,1035.0
1164,2019/06/03,1018.0,1017.436,1024.0,433600,1038.0,1009.0
1165,2019/06/04,1042.0,1037.253,1026.0,679700,1047.0,1020.0
1166,2019/06/05,1080.0,1081.576,1085.0,716900,1101.0,1073.0
1167,2019/06/06,1041.0,1041.197,1058.0,890200,1058.0,1028.0
1168,2019/06/07,1064.0,1066.056,1069.0,802100,1078.0,1057.0
1169,2019/06/10,1083.0,1076.449,1070.0,567300,1088.0,1063.0
1170,2019/06/11,1092.0,1090.155,1080.0,417200,1101.0,1070.0
1171,2019/06/12,1075.0,1080.172,1083.0,466700,1089.0,1072.0
1172,2019/06/13,1055.0,1052.915,1067.0,547500,1067.0,1045.0
1173,2019/06/14,1090.0,1082.129,1058.0,856400,1094.0,1049.0
1174,2019/06/17,1056.0,1053.941,1078.0,690200,1078.0,1042.0
1175,2019/06/18,1038.0,1045.44,1049.0,705300,1068.0,1032.0
1176,2019/06/19,1081.0,1078.06,1067.0,800400,1086.0,1056.0
1177,2019/06/20,1098.0,1090.108,1075.0,559400,1099.0,1073.0
1178,2019/06/21,1079.0,1088.57,1100.0,617900,1108.0,1077.0
1179,2019/06/24,1112.0,1101.537,1085.0,611500,1112.0,1075.0
1180,2019/06/25,1108.0,1116.617,1108.0,758000,1130.0,1105.0
1181,2019/06/26,1091.0,1093.786,1105.0,534300,1105.0,1086.0
1182,2019/06/27,1136.0,1128.046,1105.0,477400,1136.0,1102.0
1183,2019/06/28,1123.0,1121.402,1132.0,531500,1134.0,1115.0
1184,2019/07/01,1155.0,1150.816,1150.0,643000,1160.0,1133.0
1185,2019/07/02,1152.0,1143.163,1140.0,392600,1152.0,1129.0
1186,2019/07/03,1130.0,1130.05,1144.0,427700,1144.0,1125.0
1187,2019/07/04,1127.0,1127.485,1137.0,319800,1137.0,1122.0
1188,2019/07/05,1150.0,1146.235,1136.0,384900,1151.0,1133.0
1189,2019/07/08,1141.0,1139.731,1137.0,311300,1145.0,1134.0
1190,2019/07/09,1111.0,1116.88,1133.0,476000,1138.0,1106.0
1191,2019/07/10,1084.0,1088.654,1109.0,505500,1109.0,1082.0
1192,2019/07/11,1083.0,1082.647,1082.0,412400,1091.0,1072.0
1193,2019/07/12,1065.0,1069.457,1088.0,436800,1089.0,1062.0
1194,2019/07/16,1045.0,1049.915,1058.0,603100,1063.0,1040.0
1195,2019/07/17,1040.0,1043.434,1043.0,650100,1061.0,1036.0
1196,2019/07/18,1008.0,1011.603,1034.0,734500,1035.0,1003.0
1197,2019/07/19,1021.0,1023.155,1007.0,702800,1035.0,1003.0
1198,2019/07/22,1038.0,1034.526,1032.0,651400,1042.0,1023.0
1199,2019/07/23,1030.0,1029.183,1033.0,686100,1035.0,1020.0
1200,2019/07/24,1025.0,1028.287,1032.0,754000,1036.0,1024.0
1201,2019/07/25,1025.0,1021.623,1022.0,475700,1027.0,1012.0
1202,2019/07/26,1016.0,1010.024,1016.0,616800,1017.0,1001.0
1203,2019/07/29,1005.0,1007.721,1012.0,526500,1015.0,1003.0
1204,2019/07/30,1005.0,1007.023,1007.0,560600,1016.0,1000.0
1205,2019/07/31,989.0,992.148,1000.0,1003800,1001.0,984.0
1206,2019/08/01,945.0,949.927,944.0,1448100,967.0,922.0
1207,2019/08/02,928.0,923.737,935.0,1192500,945.0,912.0
1208,2019/08/05,905.0,904.95,913.0,1228400,928.0,885.0
1209,2019/08/06,889.0,886.466,868.0,1754500,900.0,861.0
1210,2019/08/07,897.0,894.499,889.0,815700,903.0,881.0
1211,2019/08/08,887.0,886.107,893.0,736000,895.0,876.0
1212,2019/08/09,884.0,885.345,891.0,675400,897.0,878.0
1213,2019/08/13,870.0,868.952,871.0,746700,878.0,862.0
1214,2019/08/14,896.0,894.574,894.0,829800,900.0,884.0
1215,2019/08/15,895.0,887.839,882.0,720200,896.0,871.0
1216,2019/08/16,892.0,891.606,895.0,521500,898.0,886.0
1217,2019/08/19,901.0,901.638,900.0,446900,907.0,898.0
1218,2019/08/20,910.0,905.836,902.0,672200,912.0,901.0
1219,2019/08/21,915.0,913.347,907.0,554800,917.0,904.0
1220,2019/08/22,922.0,922.478,918.0,583000,929.0,915.0
1221,2019/08/23,922.0,924.88,930.0,571800,932.0,918.0
