,Date,Close,VWAP,Open,Volume,High,Low
0,2014/08/25,1330.0,1336.28,1348.5,39000,1349.0,1328.0
1,2014/08/26,1323.5,1325.5,1330.0,39200,1341.5,1318.0
2,2014/08/27,1356.5,1349.494,1335.0,69600,1360.0,1325.5
3,2014/08/28,1366.5,1366.523,1365.0,47400,1375.0,1355.5
4,2014/08/29,1364.5,1363.716,1362.5,34200,1370.0,1352.5
5,2014/09/01,1364.5,1363.983,1364.5,17400,1369.0,1357.5
6,2014/09/02,1360.0,1362.241,1369.0,89800,1374.5,1345.5
7,2014/09/03,1349.0,1351.227,1360.0,76800,1365.0,1342.0
8,2014/09/04,1327.5,1333.437,1350.0,110600,1350.0,1323.0
9,2014/09/05,1297.5,1308.547,1352.5,163400,1352.5,1291.5
10,2014/09/08,1304.0,1305.252,1305.0,22600,1324.5,1299.5
11,2014/09/09,1278.5,1286.137,1317.5,90800,1317.5,1270.5
12,2014/09/10,1298.0,1297.889,1300.0,41600,1304.5,1288.5
13,2014/09/11,1299.5,1313.984,1336.5,42600,1339.5,1297.0
14,2014/09/12,1298.5,1316.008,1324.5,88000,1324.5,1298.0
15,2014/09/16,1290.0,1292.38,1310.0,75600,1316.5,1287.0
16,2014/09/17,1285.0,1286.021,1291.0,61200,1308.5,1280.0
17,2014/09/18,1278.0,1276.236,1280.0,79200,1294.5,1269.0
18,2014/09/19,1277.0,1280.492,1270.0,124000,1296.0,1270.0
19,2014/09/22,1280.5,1282.303,1277.0,43600,1293.5,1277.0
20,2014/09/24,1261.5,1270.465,1281.0,84800,1286.5,1261.0
21,2014/09/25,1260.5,1264.886,1279.0,176600,1280.0,1257.5
22,2014/09/26,1249.0,1259.557,1260.0,101000,1281.0,1243.0
23,2014/09/29,1269.0,1256.766,1271.0,91400,1271.0,1241.0
24,2014/09/30,1323.0,1295.664,1270.0,177200,1329.0,1247.0
25,2014/10/01,1296.0,1304.521,1331.0,54500,1332.0,1292.0
26,2014/10/02,1236.0,1249.602,1277.0,79200,1277.0,1236.0
27,2014/10/03,1273.0,1259.887,1239.0,61200,1278.0,1239.0
28,2014/10/06,1291.0,1284.131,1273.0,39700,1296.0,1267.0
29,2014/10/07,1298.0,1290.082,1283.0,65600,1305.0,1254.0
30,2014/10/08,1256.0,1260.128,1278.0,65900,1278.0,1250.0
31,2014/10/09,1233.0,1242.667,1270.0,50100,1270.0,1230.0
32,2014/10/10,1170.0,1181.707,1200.0,75000,1201.0,1151.0
33,2014/10/14,1194.0,1179.793,1150.0,74200,1202.0,1133.0
34,2014/10/15,1219.0,1208.028,1194.0,39200,1222.0,1194.0
35,2014/10/16,1184.0,1190.801,1199.0,43200,1205.0,1179.0
36,2014/10/17,1153.0,1166.507,1165.0,62100,1184.0,1153.0
37,2014/10/20,1211.0,1204.29,1177.0,52500,1228.0,1177.0
38,2014/10/21,1174.0,1181.409,1195.0,76100,1215.0,1173.0
39,2014/10/22,1153.0,1146.92,1150.0,121700,1165.0,1137.0
40,2014/10/23,1110.0,1129.402,1147.0,102300,1152.0,1102.0
41,2014/10/24,1128.0,1127.279,1122.0,63800,1144.0,1117.0
42,2014/10/27,1140.0,1139.612,1130.0,32200,1148.0,1130.0
43,2014/10/28,1119.0,1122.501,1140.0,41100,1145.0,1112.0
44,2014/10/29,1159.0,1148.557,1140.0,43100,1159.0,1133.0
45,2014/10/30,1179.0,1178.21,1160.0,84800,1193.0,1158.0
46,2014/10/31,1244.0,1217.547,1176.0,124400,1253.0,1166.0
47,2014/11/04,1214.0,1245.971,1300.0,110900,1309.0,1210.0
48,2014/11/05,1256.0,1231.931,1198.0,91300,1269.0,1192.0
49,2014/11/06,1248.0,1254.317,1286.0,70000,1286.0,1231.0
50,2014/11/07,1227.0,1224.529,1248.0,47300,1248.0,1207.0
51,2014/11/10,1275.0,1270.074,1250.0,165800,1286.0,1239.0
52,2014/11/11,1285.0,1277.808,1276.0,40700,1286.0,1268.0
53,2014/11/12,1232.0,1259.681,1289.0,117400,1289.0,1226.0
54,2014/11/13,1229.0,1236.465,1228.0,90400,1257.0,1225.0
55,2014/11/14,1229.0,1229.108,1247.0,75200,1247.0,1216.0
56,2014/11/17,1211.0,1217.115,1229.0,44500,1230.0,1210.0
57,2014/11/18,1206.0,1209.52,1211.0,87200,1224.0,1202.0
58,2014/11/19,1247.0,1241.522,1218.0,67600,1255.0,1210.0
59,2014/11/20,1217.0,1226.732,1249.0,43200,1257.0,1217.0
60,2014/11/21,1214.0,1213.133,1210.0,73800,1228.0,1201.0
61,2014/11/25,1290.0,1269.295,1230.0,167800,1292.0,1226.0
62,2014/11/26,1289.0,1275.853,1260.0,133700,1295.0,1260.0
63,2014/11/27,1298.0,1293.648,1280.0,73600,1309.0,1270.0
64,2014/11/28,1339.0,1329.092,1305.0,128900,1344.0,1305.0
65,2014/12/01,1335.0,1339.621,1348.0,102300,1359.0,1326.0
66,2014/12/02,1320.0,1307.876,1320.0,117900,1329.0,1292.0
67,2014/12/03,1340.0,1338.136,1310.0,105300,1347.0,1310.0
68,2014/12/04,1340.0,1342.942,1350.0,62300,1350.0,1334.0
69,2014/12/05,1392.0,1367.786,1327.0,164600,1393.0,1326.0
70,2014/12/08,1443.0,1431.815,1421.0,256200,1445.0,1400.0
71,2014/12/09,1392.0,1434.963,1444.0,210500,1476.0,1350.0
72,2014/12/10,1422.0,1409.386,1390.0,135200,1430.0,1370.0
73,2014/12/11,1395.0,1388.798,1377.0,88900,1400.0,1372.0
74,2014/12/12,1380.0,1384.475,1377.0,89000,1398.0,1376.0
75,2014/12/15,1368.0,1377.823,1352.0,54300,1396.0,1352.0
76,2014/12/16,1298.0,1316.748,1351.0,141900,1361.0,1286.0
77,2014/12/17,1310.0,1307.467,1285.0,93900,1328.0,1280.0
78,2014/12/18,1302.0,1308.595,1340.0,123800,1340.0,1291.0
79,2014/12/19,1308.0,1307.88,1316.0,85700,1325.0,1298.0
80,2014/12/22,1309.0,1302.983,1315.0,41000,1326.0,1289.0
81,2014/12/24,1326.0,1321.41,1324.0,35100,1333.0,1311.0
82,2014/12/25,1331.0,1328.76,1330.0,58200,1337.0,1321.0
83,2014/12/26,1333.0,1335.02,1335.0,60000,1342.0,1326.0
84,2014/12/29,1342.0,1336.227,1343.0,54700,1347.0,1330.0
85,2014/12/30,1319.0,1323.515,1335.0,22900,1335.0,1313.0
86,2015/01/05,1312.0,1312.053,1318.0,43300,1328.0,1294.0
87,2015/01/06,1289.0,1295.229,1283.0,85700,1306.0,1274.0
88,2015/01/07,1272.0,1268.121,1276.0,48700,1284.0,1262.0
89,2015/01/08,1254.0,1254.922,1270.0,91400,1278.0,1238.0
90,2015/01/09,1222.0,1232.478,1241.0,71400,1252.0,1216.0
91,2015/01/13,1191.0,1185.435,1208.0,111700,1208.0,1171.0
92,2015/01/14,1175.0,1179.377,1185.0,38200,1194.0,1172.0
93,2015/01/15,1207.0,1200.225,1175.0,64600,1213.0,1175.0
94,2015/01/16,1150.0,1156.802,1187.0,103900,1187.0,1143.0
95,2015/01/19,1152.0,1153.466,1164.0,33500,1164.0,1146.0
96,2015/01/20,1235.0,1212.511,1166.0,93200,1235.0,1153.0
97,2015/01/21,1208.0,1212.442,1237.0,77300,1238.0,1200.0
98,2015/01/22,1204.0,1198.608,1201.0,46400,1209.0,1192.0
99,2015/01/23,1222.0,1217.401,1211.0,27200,1248.0,1210.0
100,2015/01/26,1225.0,1218.771,1222.0,14000,1225.0,1205.0
101,2015/01/27,1244.0,1242.856,1236.0,60400,1253.0,1227.0
102,2015/01/28,1225.0,1230.652,1246.0,41900,1248.0,1218.0
103,2015/01/29,1203.0,1209.041,1225.0,31500,1225.0,1202.0
104,2015/01/30,1230.0,1226.019,1217.0,59400,1236.0,1212.0
105,2015/02/02,1220.0,1219.344,1225.0,53800,1227.0,1210.0
106,2015/02/03,1182.0,1193.175,1220.0,51000,1222.0,1179.0
107,2015/02/04,1206.0,1208.54,1211.0,75900,1216.0,1199.0
108,2015/02/05,1187.0,1189.213,1207.0,62400,1214.0,1180.0
109,2015/02/06,1176.0,1183.316,1192.0,79500,1197.0,1176.0
110,2015/02/09,1172.0,1193.139,1200.0,127000,1243.0,1168.0
111,2015/02/10,1172.0,1170.042,1164.0,35900,1179.0,1164.0
112,2015/02/12,1169.0,1181.204,1185.0,71500,1207.0,1168.0
113,2015/02/13,1167.0,1169.645,1175.0,48100,1175.0,1165.0
114,2015/02/16,1179.0,1185.663,1179.0,51700,1200.0,1171.0
115,2015/02/17,1205.0,1203.588,1186.0,68400,1216.0,1186.0
116,2015/02/18,1204.0,1215.643,1217.0,89300,1238.0,1197.0
117,2015/02/19,1238.0,1225.787,1197.0,71500,1246.0,1197.0
118,2015/02/20,1223.0,1227.8,1237.0,62500,1241.0,1210.0
119,2015/02/23,1206.0,1222.419,1223.0,99100,1245.0,1199.0
120,2015/02/24,1193.0,1202.951,1200.0,75400,1217.0,1192.0
121,2015/02/25,1185.0,1196.721,1195.0,111800,1223.0,1179.0
122,2015/02/26,1195.0,1198.007,1205.0,57600,1206.0,1190.0
123,2015/02/27,1169.0,1178.873,1195.0,157500,1197.0,1169.0
124,2015/03/02,1185.0,1184.967,1170.0,78700,1192.0,1170.0
125,2015/03/03,1175.0,1176.38,1185.0,62700,1188.0,1170.0
126,2015/03/04,1170.0,1169.516,1175.0,69000,1179.0,1166.0
127,2015/03/05,1166.0,1167.327,1168.0,44300,1173.0,1165.0
128,2015/03/06,1173.0,1161.758,1162.0,136800,1174.0,1151.0
129,2015/03/09,1183.0,1179.976,1175.0,67400,1185.0,1171.0
130,2015/03/10,1179.0,1178.189,1180.0,125300,1189.0,1171.0
131,2015/03/11,1190.0,1188.741,1193.0,60900,1196.0,1176.0
132,2015/03/12,1183.0,1183.791,1185.0,70300,1191.0,1178.0
133,2015/03/13,1174.0,1177.359,1181.0,131000,1182.0,1171.0
134,2015/03/16,1170.0,1167.97,1171.0,79200,1174.0,1160.0
135,2015/03/17,1169.0,1169.356,1168.0,41000,1175.0,1163.0
136,2015/03/18,1176.0,1172.437,1167.0,54300,1179.0,1167.0
137,2015/03/19,1170.0,1170.543,1176.0,66900,1176.0,1163.0
138,2015/03/20,1186.0,1179.909,1167.0,95200,1189.0,1165.0
139,2015/03/23,1204.0,1197.846,1197.0,92000,1206.0,1188.0
140,2015/03/24,1199.0,1190.907,1200.0,66300,1202.0,1176.0
141,2015/03/25,1196.0,1199.43,1201.0,84600,1217.0,1185.0
142,2015/03/26,1204.0,1197.744,1195.0,189800,1208.0,1190.0
143,2015/03/27,1167.0,1180.989,1200.0,98600,1212.0,1160.0
144,2015/03/30,1145.0,1146.632,1165.0,126000,1166.0,1136.0
145,2015/03/31,1147.0,1148.869,1144.0,70100,1157.0,1141.0
146,2015/04/01,1133.0,1132.853,1147.0,86800,1150.0,1116.0
147,2015/04/02,1113.0,1118.912,1120.0,143600,1135.0,1110.0
148,2015/04/03,1133.0,1126.017,1126.0,58200,1133.0,1111.0
149,2015/04/06,1119.0,1120.646,1133.0,44600,1134.0,1112.0
150,2015/04/07,1126.0,1127.391,1124.0,54800,1136.0,1123.0
151,2015/04/08,1122.0,1129.664,1132.0,76400,1148.0,1121.0
152,2015/04/09,1120.0,1116.967,1122.0,79600,1125.0,1112.0
153,2015/04/10,1116.0,1115.439,1118.0,82700,1120.0,1111.0
154,2015/04/13,1119.0,1116.536,1116.0,54300,1122.0,1112.0
155,2015/04/14,1134.0,1129.489,1116.0,61200,1139.0,1116.0
156,2015/04/15,1124.0,1128.944,1135.0,30600,1137.0,1124.0
157,2015/04/16,1152.0,1145.739,1135.0,95700,1156.0,1135.0
158,2015/04/17,1132.0,1132.354,1142.0,64100,1148.0,1124.0
159,2015/04/20,1117.0,1118.307,1125.0,68800,1132.0,1115.0
160,2015/04/21,1113.0,1112.697,1117.0,69600,1120.0,1110.0
161,2015/04/22,1118.0,1115.941,1116.0,48900,1119.0,1113.0
162,2015/04/23,1112.0,1111.601,1118.0,173500,1120.0,1106.0
163,2015/04/24,1116.0,1115.096,1113.0,89800,1121.0,1110.0
164,2015/04/27,1125.0,1123.103,1117.0,60400,1129.0,1114.0
165,2015/04/28,1136.0,1135.491,1129.0,59500,1144.0,1129.0
166,2015/04/30,1123.0,1125.53,1130.0,43800,1133.0,1121.0
167,2015/05/01,1110.0,1112.305,1115.0,53200,1128.0,1110.0
168,2015/05/07,1102.0,1104.984,1111.0,88200,1114.0,1102.0
169,2015/05/08,1140.0,1131.289,1116.0,120000,1143.0,1116.0
170,2015/05/11,1109.0,1123.171,1156.0,142800,1156.0,1108.0
171,2015/05/12,1102.0,1099.695,1110.0,127700,1113.0,1093.0
172,2015/05/13,1093.0,1096.758,1107.0,55700,1107.0,1093.0
173,2015/05/14,1084.0,1088.273,1094.0,77600,1098.0,1082.0
174,2015/05/15,1081.0,1083.839,1089.0,59100,1097.0,1078.0
175,2015/05/18,1091.0,1091.456,1083.0,32000,1096.0,1083.0
176,2015/05/19,1106.0,1101.226,1096.0,42100,1106.0,1096.0
177,2015/05/20,1105.0,1104.809,1106.0,37200,1111.0,1100.0
178,2015/05/21,1102.0,1103.134,1105.0,32000,1109.0,1100.0
179,2015/05/22,1129.0,1119.596,1106.0,104000,1130.0,1105.0
180,2015/05/25,1124.0,1128.961,1127.0,75100,1138.0,1122.0
181,2015/05/26,1129.0,1131.277,1128.0,60000,1134.0,1126.0
182,2015/05/27,1118.0,1121.128,1129.0,41400,1133.0,1115.0
183,2015/05/28,1117.0,1119.854,1131.0,30900,1131.0,1114.0
184,2015/05/29,1125.0,1120.338,1122.0,45000,1128.0,1112.0
185,2015/06/01,1103.0,1108.106,1117.0,89400,1125.0,1101.0
186,2015/06/02,1097.0,1099.772,1102.0,56900,1104.0,1096.0
187,2015/06/03,1092.0,1092.525,1101.0,79400,1103.0,1087.0
188,2015/06/04,1093.0,1095.056,1099.0,50300,1100.0,1090.0
189,2015/06/05,1083.0,1082.715,1092.0,100000,1092.0,1078.0
190,2015/06/08,1074.0,1079.935,1084.0,91200,1086.0,1073.0
191,2015/06/09,1059.0,1065.306,1070.0,181800,1074.0,1058.0
192,2015/06/10,1062.0,1060.877,1059.0,98500,1065.0,1057.0
193,2015/06/11,1062.0,1061.649,1064.0,81300,1068.0,1058.0
194,2015/06/12,1053.0,1057.375,1058.0,110600,1065.0,1052.0
195,2015/06/15,1047.0,1048.488,1053.0,93500,1057.0,1044.0
196,2015/06/16,1037.0,1037.8,1042.0,120900,1043.0,1031.0
197,2015/06/17,1050.0,1047.274,1042.0,81100,1054.0,1038.0
198,2015/06/18,1031.0,1037.005,1045.0,62900,1048.0,1031.0
199,2015/06/19,1038.0,1035.138,1033.0,44300,1043.0,1031.0
200,2015/06/22,1067.0,1058.898,1047.0,99200,1067.0,1045.0
201,2015/06/23,1066.0,1060.821,1070.0,85300,1070.0,1054.0
202,2015/06/24,1068.0,1067.377,1069.0,89100,1072.0,1063.0
203,2015/06/25,1066.0,1064.964,1065.0,52800,1070.0,1060.0
204,2015/06/26,1055.0,1055.736,1062.0,65200,1063.0,1050.0
205,2015/06/29,1047.0,1051.214,1040.0,128100,1068.0,1032.0
206,2015/06/30,1061.0,1051.637,1047.0,68500,1062.0,1043.0
207,2015/07/01,1046.0,1048.935,1057.0,58000,1061.0,1044.0
208,2015/07/02,1045.0,1050.557,1057.0,32300,1060.0,1043.0
209,2015/07/03,1036.0,1040.326,1051.0,33400,1051.0,1036.0
210,2015/07/06,1021.0,1024.456,1031.0,58400,1032.0,1021.0
211,2015/07/07,1022.0,1025.717,1030.0,41400,1032.0,1021.0
212,2015/07/08,1002.0,1010.802,1022.0,86700,1026.0,1002.0
213,2015/07/09,995.0,983.209,1000.0,143300,1002.0,951.0
214,2015/07/10,980.0,982.144,994.0,65400,994.0,975.0
215,2015/07/13,985.0,987.582,983.0,41100,995.0,981.0
216,2015/07/14,1013.0,1006.255,989.0,53000,1018.0,989.0
217,2015/07/15,1022.0,1017.151,1018.0,51800,1022.0,1013.0
218,2015/07/16,1007.0,1009.004,1024.0,46300,1024.0,1002.0
219,2015/07/17,1000.0,998.825,1005.0,37100,1005.0,995.0
220,2015/07/21,990.0,993.479,1007.0,44300,1007.0,988.0
221,2015/07/22,977.0,977.998,985.0,55800,985.0,973.0
222,2015/07/23,977.0,976.397,977.0,38000,983.0,975.0
223,2015/07/24,966.0,966.884,977.0,67300,977.0,962.0
224,2015/07/27,954.0,954.337,965.0,65000,965.0,950.0
225,2015/07/28,952.0,948.65,950.0,44300,959.0,942.0
226,2015/07/29,949.0,951.026,961.0,42400,962.0,945.0
227,2015/07/30,941.0,943.771,950.0,86400,953.0,939.0
228,2015/07/31,926.0,925.976,940.0,199500,942.0,920.0
229,2015/08/03,914.0,916.335,926.0,118900,926.0,911.0
230,2015/08/04,915.0,913.644,912.0,68500,919.0,910.0
231,2015/08/05,916.0,917.285,912.0,65200,926.0,910.0
232,2015/08/06,935.0,928.686,915.0,73300,937.0,915.0
233,2015/08/07,944.0,941.041,922.0,90700,949.0,922.0
234,2015/08/10,917.0,919.773,910.0,180500,941.0,910.0
235,2015/08/11,921.0,921.835,919.0,54500,929.0,917.0
236,2015/08/12,923.0,923.455,921.0,77000,934.0,916.0
237,2015/08/13,932.0,932.044,923.0,57100,937.0,923.0
238,2015/08/14,930.0,928.932,930.0,36800,936.0,923.0
239,2015/08/17,934.0,932.162,937.0,38400,938.0,926.0
240,2015/08/18,939.0,940.663,940.0,33500,945.0,936.0
241,2015/08/19,923.0,927.662,933.0,52600,939.0,922.0
242,2015/08/20,904.0,909.962,919.0,126400,923.0,901.0
243,2015/08/21,863.0,878.151,893.0,179700,899.0,860.0
244,2015/08/24,827.0,834.37,818.0,197100,859.0,817.0
245,2015/08/25,772.0,805.964,805.0,278400,826.0,772.0
246,2015/08/26,766.0,764.986,777.0,274100,777.0,758.0
247,2015/08/27,760.0,767.227,776.0,256900,785.0,759.0
248,2015/08/28,777.0,778.43,768.0,257700,786.0,768.0
249,2015/08/31,774.0,774.936,783.0,204300,785.0,768.0
250,2015/09/01,744.0,756.067,770.0,218800,781.0,741.0
251,2015/09/02,730.0,735.212,740.0,155900,747.0,725.0
252,2015/09/03,746.0,747.405,741.0,115000,760.0,740.0
253,2015/09/04,724.0,729.595,749.0,120000,751.0,719.0
254,2015/09/07,731.0,724.152,718.0,62400,735.0,711.0
255,2015/09/08,736.0,740.295,727.0,66500,749.0,727.0
256,2015/09/09,762.0,753.389,750.0,93000,767.0,746.0
257,2015/09/10,754.0,745.796,755.0,68000,756.0,733.0
258,2015/09/11,780.0,774.814,769.0,103900,783.0,766.0
259,2015/09/14,777.0,775.755,780.0,52200,787.0,771.0
260,2015/09/15,780.0,780.884,777.0,49200,787.0,776.0
261,2015/09/16,796.0,791.364,783.0,73300,801.0,781.0
262,2015/09/17,794.0,800.084,804.0,91600,816.0,794.0
263,2015/09/18,780.0,777.077,785.0,72400,787.0,770.0
264,2015/09/24,748.0,755.048,770.0,116700,774.0,744.0
265,2015/09/25,766.0,753.256,748.0,63800,766.0,745.0
266,2015/09/28,768.0,761.461,767.0,84000,774.0,745.0
267,2015/09/29,761.0,761.319,767.0,88300,769.0,750.0
268,2015/09/30,790.0,781.278,761.0,77700,794.0,761.0
269,2015/10/01,820.0,802.98,790.0,142900,830.0,780.0
270,2015/10/02,809.0,809.558,810.0,59700,824.0,790.0
271,2015/10/05,813.0,817.381,809.0,49600,823.0,807.0
272,2015/10/06,842.0,840.609,826.0,85200,852.0,825.0
273,2015/10/07,897.0,876.99,842.0,134300,897.0,842.0
274,2015/10/08,865.0,871.68,888.0,92300,891.0,861.0
275,2015/10/09,874.0,870.539,878.0,57200,882.0,862.0
276,2015/10/13,861.0,866.117,874.0,51500,881.0,856.0
277,2015/10/14,846.0,849.821,861.0,42900,861.0,843.0
278,2015/10/15,859.0,856.3,846.0,35000,865.0,845.0
279,2015/10/16,856.0,860.599,864.0,34900,866.0,855.0
280,2015/10/19,844.0,844.161,856.0,64100,856.0,832.0
281,2015/10/20,843.0,845.026,851.0,23000,851.0,840.0
282,2015/10/21,860.0,854.612,843.0,41700,861.0,843.0
283,2015/10/22,861.0,865.666,861.0,33500,873.0,858.0
284,2015/10/23,860.0,865.662,875.0,42300,878.0,858.0
285,2015/10/26,858.0,864.976,875.0,42100,875.0,857.0
286,2015/10/27,845.0,851.977,856.0,34800,864.0,845.0
287,2015/10/28,833.0,840.801,846.0,48800,852.0,832.0
288,2015/10/29,840.0,838.861,832.0,93000,844.0,832.0
289,2015/10/30,834.0,833.705,837.0,78600,846.0,825.0
290,2015/11/02,828.0,830.331,829.0,33200,840.0,827.0
291,2015/11/04,834.0,836.755,831.0,29000,843.0,831.0
292,2015/11/05,834.0,834.344,838.0,23000,843.0,828.0
293,2015/11/06,834.0,830.301,840.0,32900,840.0,826.0
294,2015/11/09,885.0,871.844,835.0,162000,887.0,835.0
295,2015/11/10,884.0,877.95,878.0,53900,889.0,868.0
296,2015/11/11,880.0,878.427,878.0,49400,885.0,871.0
297,2015/11/12,874.0,878.091,890.0,87100,890.0,867.0
298,2015/11/13,868.0,866.529,874.0,39900,875.0,860.0
299,2015/11/16,863.0,857.69,859.0,40300,865.0,847.0
300,2015/11/17,878.0,874.397,874.0,38000,878.0,867.0
301,2015/11/18,870.0,875.675,880.0,48900,888.0,869.0
302,2015/11/19,872.0,872.422,880.0,53800,880.0,870.0
303,2015/11/20,868.0,877.188,876.0,110500,892.0,863.0
304,2015/11/24,866.0,862.894,864.0,144100,870.0,860.0
305,2015/11/25,850.0,851.205,863.0,107100,863.0,846.0
306,2015/11/26,843.0,843.661,850.0,115600,852.0,838.0
307,2015/11/27,810.0,819.744,840.0,153200,843.0,810.0
308,2015/11/30,825.0,822.754,811.0,79500,835.0,811.0
309,2015/12/01,833.0,834.673,830.0,95200,840.0,830.0
310,2015/12/02,854.0,849.626,838.0,101000,856.0,838.0
311,2015/12/03,856.0,854.656,854.0,54600,859.0,852.0
312,2015/12/04,854.0,854.699,851.0,50100,862.0,850.0
313,2015/12/07,858.0,858.27,855.0,47500,863.0,854.0
314,2015/12/08,861.0,858.342,860.0,64700,863.0,852.0
315,2015/12/09,849.0,850.724,851.0,93300,856.0,848.0
316,2015/12/10,850.0,851.025,848.0,67400,858.0,848.0
317,2015/12/11,866.0,860.944,850.0,115900,872.0,850.0
318,2015/12/14,855.0,849.989,851.0,74600,856.0,845.0
319,2015/12/15,862.0,864.385,855.0,104400,879.0,852.0
320,2015/12/16,896.0,889.011,862.0,207200,897.0,862.0
321,2015/12/17,931.0,926.174,901.0,255800,940.0,899.0
322,2015/12/18,906.0,915.899,926.0,114300,930.0,905.0
323,2015/12/21,894.0,897.978,900.0,97200,917.0,886.0
324,2015/12/22,907.0,907.042,898.0,91500,920.0,893.0
325,2015/12/24,907.0,916.032,907.0,141700,930.0,905.0
326,2015/12/25,891.0,897.074,908.0,82100,910.0,886.0
327,2015/12/28,933.0,932.028,920.0,81500,939.0,916.0
328,2015/12/29,955.0,947.508,936.0,81700,955.0,935.0
329,2015/12/30,962.0,957.03,952.0,69000,965.0,947.0
330,2016/01/04,954.0,957.278,962.0,55800,966.0,950.0
331,2016/01/05,951.0,951.264,940.0,80300,961.0,937.0
332,2016/01/06,959.0,961.263,948.0,96200,973.0,948.0
333,2016/01/07,944.0,951.186,956.0,103500,963.0,943.0
334,2016/01/08,930.0,941.155,933.0,105200,953.0,930.0
335,2016/01/12,896.0,910.646,926.0,82000,926.0,896.0
336,2016/01/13,915.0,910.532,893.0,62200,919.0,893.0
337,2016/01/14,912.0,903.051,899.0,75100,913.0,891.0
338,2016/01/15,896.0,903.738,912.0,52600,923.0,894.0
339,2016/01/18,897.0,894.694,889.0,53900,900.0,886.0
340,2016/01/19,901.0,894.726,892.0,52500,907.0,885.0
341,2016/01/20,874.0,879.775,889.0,61700,891.0,873.0
342,2016/01/21,847.0,864.526,851.0,71500,883.0,845.0
343,2016/01/22,909.0,886.806,852.0,57700,909.0,852.0
344,2016/01/25,893.0,897.391,909.0,55700,913.0,888.0
345,2016/01/26,866.0,871.564,892.0,56000,892.0,864.0
346,2016/01/27,880.0,878.462,874.0,30100,887.0,869.0
347,2016/01/28,862.0,868.08,868.0,42300,878.0,859.0
348,2016/01/29,878.0,867.359,872.0,32900,883.0,855.0
349,2016/02/01,883.0,882.821,883.0,47900,889.0,878.0
350,2016/02/02,861.0,867.121,876.0,31500,878.0,859.0
351,2016/02/03,826.0,832.731,850.0,61600,852.0,824.0
352,2016/02/04,815.0,820.253,811.0,41900,835.0,811.0
353,2016/02/05,822.0,823.666,816.0,48200,837.0,815.0
354,2016/02/08,731.0,735.391,748.0,326100,765.0,725.0
355,2016/02/09,689.0,693.929,706.0,264200,712.0,685.0
356,2016/02/10,648.0,662.008,697.0,232000,697.0,641.0
357,2016/02/12,619.0,627.71,643.0,131400,643.0,615.0
358,2016/02/15,662.0,657.382,658.0,106700,672.0,640.0
359,2016/02/16,660.0,667.382,662.0,131300,678.0,660.0
360,2016/02/17,667.0,673.132,656.0,102400,686.0,656.0
361,2016/02/18,685.0,684.113,677.0,92300,694.0,677.0
362,2016/02/19,669.0,670.902,672.0,35800,677.0,666.0
363,2016/02/22,662.0,662.329,668.0,43200,670.0,654.0
364,2016/02/23,657.0,662.972,663.0,31800,674.0,656.0
365,2016/02/24,648.0,651.297,649.0,43400,663.0,642.0
366,2016/02/25,634.0,639.735,648.0,96100,661.0,633.0
367,2016/02/26,640.0,645.274,645.0,58000,651.0,638.0
368,2016/02/29,642.0,651.662,653.0,96100,665.0,641.0
369,2016/03/01,651.0,649.955,643.0,93300,661.0,641.0
370,2016/03/02,673.0,676.757,668.0,64100,684.0,665.0
371,2016/03/03,678.0,674.816,670.0,50000,680.0,670.0
372,2016/03/04,699.0,692.025,673.0,88300,710.0,673.0
373,2016/03/07,707.0,709.227,705.0,77900,718.0,703.0
374,2016/03/08,707.0,706.818,710.0,80000,712.0,701.0
375,2016/03/09,688.0,690.101,700.0,81100,700.0,680.0
376,2016/03/10,688.0,689.379,689.0,56400,699.0,685.0
377,2016/03/11,708.0,694.367,682.0,49900,711.0,682.0
378,2016/03/14,720.0,718.911,715.0,46000,724.0,714.0
379,2016/03/15,702.0,711.197,716.0,97700,720.0,702.0
380,2016/03/16,694.0,699.351,700.0,52200,708.0,691.0
381,2016/03/17,694.0,696.516,697.0,70400,702.0,687.0
382,2016/03/18,696.0,695.826,693.0,32700,704.0,692.0
383,2016/03/22,717.0,716.284,721.0,61300,721.0,709.0
384,2016/03/23,712.0,718.8,720.0,32000,727.0,709.0
385,2016/03/24,717.0,720.534,715.0,59000,727.0,715.0
386,2016/03/25,732.0,729.635,722.0,52800,737.0,720.0
387,2016/03/28,755.0,750.713,750.0,238900,764.0,746.0
388,2016/03/29,783.0,767.802,754.0,92500,788.0,753.0
389,2016/03/30,776.0,774.229,771.0,53800,783.0,762.0
390,2016/03/31,770.0,776.736,775.0,59500,784.0,768.0
391,2016/04/01,750.0,752.426,764.0,92400,768.0,740.0
392,2016/04/04,738.0,743.27,742.0,54500,755.0,730.0
393,2016/04/05,707.0,711.473,736.0,44000,736.0,702.0
394,2016/04/06,693.0,695.11,692.0,47100,704.0,690.0
395,2016/04/07,696.0,694.542,692.0,22500,701.0,690.0
396,2016/04/08,701.0,692.133,675.0,48800,719.0,674.0
397,2016/04/11,705.0,700.665,701.0,17300,707.0,692.0
398,2016/04/12,729.0,726.111,706.0,16200,737.0,706.0
399,2016/04/13,761.0,756.68,730.0,25300,766.0,730.0
400,2016/04/14,792.0,786.729,770.0,36500,796.0,770.0
401,2016/04/15,798.0,799.12,792.0,37400,808.0,792.0
402,2016/04/18,767.0,771.91,776.0,48700,784.0,766.0
403,2016/04/19,795.0,790.644,775.0,30300,800.0,775.0
404,2016/04/20,830.0,820.113,804.0,52900,832.0,804.0
405,2016/04/21,841.0,843.464,837.0,39900,849.0,834.0
406,2016/04/22,843.0,833.872,840.0,40700,843.0,826.0
407,2016/04/25,833.0,834.672,843.0,26500,847.0,820.0
408,2016/04/26,815.0,822.385,833.0,31400,839.0,814.0
409,2016/04/27,833.0,831.214,814.0,22400,838.0,814.0
410,2016/04/28,815.0,821.472,836.0,44700,846.0,801.0
411,2016/05/02,781.0,786.335,785.0,24200,800.0,781.0
412,2016/05/06,771.0,776.312,780.0,30500,788.0,765.0
413,2016/05/09,768.0,773.618,769.0,23300,789.0,766.0
414,2016/05/10,766.0,761.594,764.0,64200,777.0,747.0
415,2016/05/11,778.0,779.192,781.0,37500,794.0,770.0
416,2016/05/12,779.0,776.535,775.0,18700,780.0,772.0
417,2016/05/13,776.0,781.4,780.0,44000,799.0,771.0
418,2016/05/16,779.0,779.626,775.0,38200,793.0,770.0
419,2016/05/17,777.0,778.491,778.0,39300,787.0,773.0
420,2016/05/18,779.0,775.096,774.0,38600,782.0,766.0
421,2016/05/19,784.0,779.884,775.0,57600,790.0,770.0
422,2016/05/20,800.0,803.962,788.0,46800,822.0,788.0
423,2016/05/23,798.0,797.015,799.0,52100,803.0,792.0
424,2016/05/24,797.0,797.754,799.0,42600,801.0,795.0
425,2016/05/25,801.0,798.669,800.0,33500,804.0,792.0
426,2016/05/26,795.0,799.871,805.0,37300,806.0,792.0
427,2016/05/27,794.0,792.571,791.0,29600,797.0,787.0
428,2016/05/30,802.0,798.92,796.0,15000,803.0,793.0
429,2016/05/31,818.0,815.802,800.0,20700,820.0,799.0
430,2016/06/01,819.0,821.951,821.0,18200,828.0,817.0
431,2016/06/02,808.0,810.381,809.0,24700,819.0,805.0
432,2016/06/03,810.0,807.782,808.0,24800,816.0,801.0
433,2016/06/06,811.0,807.746,801.0,20100,814.0,800.0
434,2016/06/07,827.0,823.659,814.0,12900,829.0,814.0
435,2016/06/08,843.0,837.791,827.0,23400,847.0,825.0
436,2016/06/09,838.0,838.986,834.0,14000,843.0,834.0
437,2016/06/10,829.0,836.027,842.0,33000,842.0,828.0
438,2016/06/13,803.0,815.243,815.0,41200,825.0,803.0
439,2016/06/14,800.0,799.39,800.0,38700,807.0,795.0
440,2016/06/15,790.0,794.878,800.0,20400,801.0,789.0
441,2016/06/16,797.0,798.624,790.0,43400,805.0,789.0
442,2016/06/17,816.0,802.086,795.0,42000,816.0,793.0
443,2016/06/20,818.0,821.463,810.0,9500,830.0,810.0
444,2016/06/21,821.0,813.108,809.0,15700,824.0,805.0
445,2016/06/22,811.0,811.245,816.0,13900,825.0,802.0
446,2016/06/23,816.0,816.5,811.0,23600,821.0,810.0
447,2016/06/24,751.0,771.878,816.0,52500,831.0,747.0
448,2016/06/27,760.0,760.211,760.0,25100,773.0,755.0
449,2016/06/28,753.0,750.111,749.0,28800,759.0,733.0
450,2016/06/29,773.0,770.355,772.0,26800,788.0,763.0
451,2016/06/30,776.0,766.197,758.0,69900,780.0,756.0
452,2016/07/01,774.0,778.855,776.0,24100,800.0,772.0
453,2016/07/04,780.0,777.133,769.0,15100,782.0,769.0
454,2016/07/05,773.0,769.558,772.0,17200,780.0,762.0
455,2016/07/06,772.0,772.602,770.0,22100,778.0,769.0
456,2016/07/07,763.0,767.223,763.0,19300,776.0,761.0
457,2016/07/08,760.0,763.489,760.0,22900,768.0,760.0
458,2016/07/11,786.0,781.376,763.0,19400,789.0,763.0
459,2016/07/12,819.0,818.378,789.0,29400,832.0,789.0
460,2016/07/13,832.0,831.937,831.0,26800,837.0,827.0
461,2016/07/14,826.0,824.698,831.0,11900,831.0,821.0
462,2016/07/15,832.0,831.977,827.0,13300,839.0,826.0
463,2016/07/19,829.0,829.733,833.0,17200,838.0,818.0
464,2016/07/20,818.0,817.747,821.0,8300,833.0,815.0
465,2016/07/21,828.0,826.933,831.0,7500,831.0,822.0
466,2016/07/22,809.0,809.64,818.0,13600,824.0,799.0
467,2016/07/25,817.0,819.937,814.0,15900,830.0,811.0
468,2016/07/26,802.0,805.478,817.0,22800,819.0,796.0
469,2016/07/27,820.0,817.337,808.0,10400,823.0,807.0
470,2016/07/28,806.0,807.184,805.0,20100,815.0,804.0
471,2016/07/29,808.0,802.827,801.0,13300,810.0,797.0
472,2016/08/01,811.0,809.9,808.0,12000,814.0,803.0
473,2016/08/02,805.0,803.839,799.0,6200,810.0,799.0
474,2016/08/03,795.0,797.994,797.0,17200,810.0,793.0
475,2016/08/04,796.0,789.965,792.0,25900,802.0,779.0
476,2016/08/05,800.0,786.772,799.0,27200,801.0,767.0
477,2016/08/08,794.0,783.502,775.0,22900,794.0,775.0
478,2016/08/09,806.0,799.025,796.0,20100,806.0,791.0
479,2016/08/10,798.0,793.709,796.0,18200,800.0,788.0
480,2016/08/12,795.0,794.103,799.0,21300,799.0,789.0
481,2016/08/15,794.0,794.578,795.0,10900,799.0,791.0
482,2016/08/16,773.0,779.761,791.0,20100,791.0,773.0
483,2016/08/17,770.0,769.72,768.0,24300,782.0,764.0
484,2016/08/18,757.0,762.655,765.0,14200,771.0,757.0
485,2016/08/19,768.0,765.764,758.0,14400,770.0,757.0
486,2016/08/22,763.0,765.419,768.0,21500,777.0,762.0
487,2016/08/23,752.0,756.058,763.0,18900,763.0,751.0
488,2016/08/24,751.0,752.481,755.0,15600,759.0,751.0
489,2016/08/25,753.0,752.526,750.0,19000,758.0,749.0
490,2016/08/26,755.0,758.089,753.0,23500,763.0,753.0
491,2016/08/29,767.0,766.098,761.0,16300,771.0,761.0
492,2016/08/30,780.0,775.493,776.0,15200,780.0,770.0
493,2016/08/31,800.0,792.056,785.0,40800,803.0,782.0
494,2016/09/01,798.0,799.035,800.0,22900,809.0,786.0
495,2016/09/02,809.0,805.757,794.0,18500,813.0,794.0
496,2016/09/05,816.0,814.028,809.0,10700,817.0,807.0
497,2016/09/06,811.0,813.019,810.0,10700,818.0,809.0
498,2016/09/07,811.0,809.571,810.0,28700,816.0,799.0
499,2016/09/08,805.0,805.753,805.0,16600,814.0,801.0
500,2016/09/09,805.0,803.832,804.0,24400,808.0,799.0
501,2016/09/12,798.0,796.365,801.0,18900,801.0,792.0
502,2016/09/13,785.0,788.207,795.0,14000,800.0,782.0
503,2016/09/14,777.0,781.299,780.0,33800,789.0,776.0
504,2016/09/15,780.0,779.689,778.0,22200,785.0,777.0
505,2016/09/16,797.0,792.882,786.0,17800,797.0,784.0
506,2016/09/20,791.0,789.654,790.0,22800,800.0,780.0
507,2016/09/21,809.0,798.494,791.0,15600,809.0,781.0
508,2016/09/23,816.0,812.439,810.0,14800,816.0,805.0
509,2016/09/26,807.0,810.953,818.0,10600,818.0,806.0
510,2016/09/27,821.0,812.935,807.0,20000,821.0,796.0
511,2016/09/28,820.0,816.095,814.0,14700,822.0,808.0
512,2016/09/29,829.0,827.962,823.0,13100,831.0,823.0
513,2016/09/30,814.0,816.798,823.0,20800,827.0,804.0
514,2016/10/03,810.0,814.815,814.0,13500,824.0,806.0
515,2016/10/04,810.0,810.7,816.0,17000,820.0,807.0
516,2016/10/05,817.0,815.181,807.0,26000,820.0,804.0
517,2016/10/06,811.0,815.378,817.0,15100,822.0,810.0
518,2016/10/07,800.0,802.099,808.0,17200,808.0,799.0
519,2016/10/11,792.0,793.806,793.0,40200,799.0,792.0
520,2016/10/12,785.0,787.203,792.0,20200,792.0,785.0
521,2016/10/13,783.0,783.5,783.0,15600,790.0,780.0
522,2016/10/14,773.0,775.755,785.0,22400,785.0,772.0
523,2016/10/17,783.0,781.042,776.0,19100,784.0,776.0
524,2016/10/18,779.0,780.293,784.0,32800,787.0,775.0
525,2016/10/19,778.0,776.837,778.0,14700,779.0,775.0
526,2016/10/20,792.0,789.056,778.0,39300,799.0,778.0
527,2016/10/21,793.0,793.398,796.0,12300,796.0,790.0
528,2016/10/24,792.0,791.851,793.0,10700,797.0,787.0
529,2016/10/25,786.0,784.924,788.0,19700,791.0,782.0
530,2016/10/26,794.0,791.892,788.0,18500,795.0,788.0
531,2016/10/27,799.0,798.022,797.0,31500,810.0,790.0
532,2016/10/28,805.0,803.48,805.0,32300,813.0,792.0
533,2016/10/31,800.0,801.466,805.0,14800,807.0,799.0
534,2016/11/01,814.0,808.807,805.0,27900,815.0,804.0
535,2016/11/02,799.0,802.244,809.0,12300,809.0,798.0
536,2016/11/04,792.0,789.516,794.0,15700,796.0,784.0
537,2016/11/07,794.0,794.359,794.0,15600,800.0,790.0
538,2016/11/08,760.0,771.84,782.0,98600,794.0,758.0
539,2016/11/09,749.0,760.893,768.0,64400,774.0,743.0
540,2016/11/10,784.0,784.686,782.0,32800,798.0,779.0
541,2016/11/11,789.0,791.092,789.0,22800,800.0,786.0
542,2016/11/14,813.0,808.707,798.0,41600,820.0,795.0
543,2016/11/15,821.0,817.461,813.0,26700,823.0,808.0
544,2016/11/16,823.0,820.703,823.0,23900,827.0,812.0
545,2016/11/17,826.0,821.284,810.0,20400,827.0,810.0
546,2016/11/18,830.0,828.933,827.0,26900,832.0,824.0
547,2016/11/21,838.0,835.674,830.0,18700,839.0,830.0
548,2016/11/22,840.0,836.576,838.0,21200,841.0,830.0
549,2016/11/24,846.0,833.891,843.0,53200,849.0,815.0
550,2016/11/25,874.0,865.122,841.0,59100,876.0,841.0
551,2016/11/28,872.0,869.422,868.0,16600,873.0,865.0
552,2016/11/29,868.0,868.644,868.0,9000,872.0,866.0
553,2016/11/30,869.0,870.818,872.0,14800,875.0,863.0
554,2016/12/01,873.0,878.21,877.0,40100,890.0,871.0
555,2016/12/02,866.0,868.583,873.0,35500,880.0,863.0
556,2016/12/05,879.0,872.177,866.0,30000,881.0,866.0
557,2016/12/06,885.0,884.068,887.0,30700,887.0,879.0
558,2016/12/07,888.0,887.554,886.0,29400,889.0,885.0
559,2016/12/08,904.0,897.356,893.0,37400,904.0,890.0
560,2016/12/09,920.0,913.212,909.0,60000,920.0,907.0
561,2016/12/12,926.0,925.256,927.0,22300,930.0,918.0
562,2016/12/13,958.0,944.579,919.0,61100,959.0,919.0
563,2016/12/14,969.0,969.574,960.0,61900,985.0,956.0
564,2016/12/15,977.0,979.532,969.0,50000,985.0,969.0
565,2016/12/16,976.0,978.861,985.0,41800,985.0,973.0
566,2016/12/19,972.0,972.428,977.0,15900,978.0,968.0
567,2016/12/20,969.0,966.111,967.0,20700,969.0,961.0
568,2016/12/21,958.0,959.031,970.0,31900,970.0,952.0
569,2016/12/22,951.0,952.228,965.0,30300,965.0,945.0
570,2016/12/26,959.0,955.384,951.0,46300,962.0,942.0
571,2016/12/27,1001.0,985.555,955.0,129300,1007.0,948.0
572,2016/12/28,1032.0,1026.084,1007.0,101800,1045.0,1007.0
573,2016/12/29,1026.0,1022.571,1033.0,75500,1034.0,1005.0
574,2016/12/30,1016.0,1011.562,1014.0,34000,1021.0,998.0
575,2017/01/04,1031.0,1028.976,1016.0,33800,1037.0,1015.0
576,2017/01/05,1010.0,1012.386,1017.0,30800,1024.0,1004.0
577,2017/01/06,1001.0,1006.418,1011.0,47100,1014.0,999.0
578,2017/01/10,1026.0,1020.172,1017.0,49900,1028.0,1007.0
579,2017/01/11,1045.0,1041.752,1029.0,52000,1048.0,1028.0
580,2017/01/12,1036.0,1039.656,1045.0,33100,1047.0,1029.0
581,2017/01/13,1022.0,1021.946,1013.0,31200,1028.0,1013.0
582,2017/01/16,1008.0,1014.632,1020.0,36400,1025.0,1005.0
583,2017/01/17,990.0,998.019,1008.0,31700,1008.0,988.0
584,2017/01/18,982.0,971.752,975.0,49900,988.0,953.0
585,2017/01/19,1005.0,999.647,989.0,37400,1007.0,989.0
586,2017/01/20,1007.0,1002.304,1002.0,20700,1009.0,991.0
587,2017/01/23,1009.0,1009.006,1002.0,17700,1018.0,997.0
588,2017/01/24,1019.0,1016.06,1008.0,23300,1021.0,1008.0
589,2017/01/25,1029.0,1028.659,1023.0,34300,1033.0,1023.0
590,2017/01/26,1041.0,1040.067,1035.0,35700,1044.0,1035.0
591,2017/01/27,1040.0,1041.005,1041.0,18400,1043.0,1036.0
592,2017/01/30,1039.0,1039.792,1040.0,25500,1044.0,1027.0
593,2017/01/31,1022.0,1024.203,1027.0,16300,1029.0,1021.0
594,2017/02/01,1022.0,1018.733,1014.0,19100,1028.0,1012.0
595,2017/02/02,1007.0,1013.636,1026.0,25300,1031.0,1005.0
596,2017/02/03,987.0,992.575,1007.0,46400,1007.0,983.0
597,2017/02/06,988.0,990.183,994.0,9300,995.0,987.0
598,2017/02/07,996.0,991.731,987.0,21900,999.0,981.0
599,2017/02/08,1000.0,1000.198,993.0,10600,1004.0,993.0
600,2017/02/09,997.0,1006.808,1005.0,41200,1030.0,992.0
601,2017/02/10,1037.0,1031.339,1011.0,48400,1040.0,1011.0
602,2017/02/13,1050.0,1047.858,1044.0,38100,1050.0,1042.0
603,2017/02/14,1048.0,1050.621,1050.0,55100,1057.0,1043.0
604,2017/02/15,1062.0,1062.925,1055.0,48100,1070.0,1048.0
605,2017/02/16,1068.0,1068.533,1066.0,30200,1075.0,1061.0
606,2017/02/17,1056.0,1057.473,1070.0,13100,1070.0,1054.0
607,2017/02/20,1047.0,1043.353,1050.0,11900,1053.0,1030.0
608,2017/02/21,1053.0,1049.652,1049.0,15500,1056.0,1036.0
609,2017/02/22,1061.0,1055.988,1055.0,17300,1065.0,1045.0
610,2017/02/23,1056.0,1056.619,1066.0,10500,1066.0,1050.0
611,2017/02/24,1012.0,1020.806,1051.0,85200,1057.0,994.0
612,2017/02/27,1016.0,1014.623,1012.0,40000,1019.0,1005.0
613,2017/02/28,1019.0,1022.184,1021.0,19000,1028.0,1017.0
614,2017/03/01,1026.0,1023.165,1019.0,13300,1029.0,1012.0
615,2017/03/02,1042.0,1041.786,1037.0,39700,1047.0,1037.0
616,2017/03/03,1031.0,1035.52,1041.0,9800,1041.0,1030.0
617,2017/03/06,1040.0,1034.745,1024.0,25100,1050.0,1018.0
618,2017/03/07,1046.0,1045.81,1040.0,17900,1055.0,1040.0
619,2017/03/08,1049.0,1047.894,1040.0,46100,1055.0,1035.0
620,2017/03/09,1051.0,1046.3,1038.0,20700,1053.0,1038.0
621,2017/03/10,1061.0,1056.38,1054.0,61600,1061.0,1050.0
622,2017/03/13,1068.0,1068.037,1062.0,24500,1072.0,1062.0
623,2017/03/14,1070.0,1065.691,1066.0,16200,1072.0,1054.0
624,2017/03/15,1069.0,1068.72,1072.0,30400,1075.0,1059.0
625,2017/03/16,1072.0,1070.603,1060.0,23200,1074.0,1059.0
626,2017/03/17,1097.0,1086.101,1071.0,90100,1098.0,1068.0
627,2017/03/21,1124.0,1111.939,1097.0,88500,1124.0,1090.0
628,2017/03/22,1115.0,1113.702,1114.0,55100,1119.0,1104.0
629,2017/03/23,1087.0,1097.171,1109.0,44500,1115.0,1081.0
630,2017/03/24,1100.0,1097.022,1093.0,22400,1105.0,1090.0
631,2017/03/27,1073.0,1083.627,1089.0,39700,1090.0,1071.0
632,2017/03/28,1084.0,1078.549,1076.0,58500,1085.0,1075.0
633,2017/03/29,1073.0,1071.75,1073.0,20000,1080.0,1064.0
634,2017/03/30,1122.0,1112.283,1076.0,64300,1133.0,1076.0
635,2017/03/31,1109.0,1119.675,1124.0,47100,1129.0,1105.0
636,2017/04/03,1121.0,1127.337,1109.0,44200,1145.0,1109.0
637,2017/04/04,1043.0,1057.558,1118.0,62500,1118.0,1018.0
638,2017/04/05,1035.0,1044.979,1052.0,38000,1061.0,1035.0
639,2017/04/06,1004.0,1009.952,1036.0,46200,1039.0,1000.0
640,2017/04/07,1000.0,1003.417,1002.0,31900,1017.0,994.0
641,2017/04/10,998.0,998.935,1000.0,15400,1009.0,991.0
642,2017/04/11,1005.0,1010.887,998.0,29100,1029.0,995.0
643,2017/04/12,998.0,998.109,1004.0,32000,1006.0,989.0
644,2017/04/13,977.0,976.883,991.0,21300,994.0,971.0
645,2017/04/14,973.0,971.742,967.0,13200,981.0,966.0
646,2017/04/17,996.0,997.863,973.0,31300,1014.0,973.0
647,2017/04/18,993.0,997.628,998.0,19900,1014.0,991.0
648,2017/04/19,998.0,1001.199,991.0,15600,1010.0,991.0
649,2017/04/20,1007.0,1006.962,1003.0,10500,1013.0,1000.0
650,2017/04/21,1015.0,1013.358,1008.0,16500,1018.0,1007.0
651,2017/04/24,1021.0,1020.618,1025.0,24100,1027.0,1015.0
652,2017/04/25,1032.0,1032.535,1022.0,20000,1040.0,1020.0
653,2017/04/26,1059.0,1052.056,1040.0,24900,1062.0,1033.0
654,2017/04/27,1075.0,1069.89,1059.0,25400,1078.0,1059.0
655,2017/04/28,1070.0,1074.837,1074.0,20800,1080.0,1067.0
656,2017/05/01,1081.0,1074.145,1071.0,13800,1081.0,1064.0
657,2017/05/02,1090.0,1087.445,1082.0,15500,1092.0,1079.0
658,2017/05/08,1116.0,1108.175,1097.0,38200,1117.0,1085.0
659,2017/05/09,1113.0,1107.735,1115.0,17700,1115.0,1099.0
660,2017/05/10,1103.0,1107.107,1110.0,21600,1113.0,1101.0
661,2017/05/11,1105.0,1104.489,1103.0,18000,1109.0,1097.0
662,2017/05/12,1096.0,1093.077,1100.0,28500,1100.0,1085.0
663,2017/05/15,1052.0,1056.872,1042.0,54000,1082.0,1015.0
664,2017/05/16,1128.0,1124.642,1112.0,117600,1135.0,1110.0
665,2017/05/17,1124.0,1123.432,1130.0,56700,1130.0,1098.0
666,2017/05/18,1105.0,1101.603,1094.0,36000,1119.0,1094.0
667,2017/05/19,1106.0,1105.067,1105.0,35700,1110.0,1097.0
668,2017/05/22,1119.0,1111.882,1109.0,22000,1120.0,1103.0
669,2017/05/23,1113.0,1115.897,1108.0,23300,1124.0,1108.0
670,2017/05/24,1135.0,1132.935,1123.0,41200,1139.0,1123.0
671,2017/05/25,1129.0,1134.632,1135.0,26900,1139.0,1127.0
672,2017/05/26,1114.0,1122.925,1130.0,18600,1130.0,1114.0
673,2017/05/29,1114.0,1115.558,1109.0,28300,1123.0,1106.0
674,2017/05/30,1130.0,1121.811,1115.0,26400,1133.0,1110.0
675,2017/05/31,1140.0,1145.954,1130.0,58100,1162.0,1130.0
676,2017/06/01,1164.0,1162.332,1145.0,47600,1170.0,1145.0
677,2017/06/02,1167.0,1166.717,1168.0,39200,1171.0,1161.0
678,2017/06/05,1165.0,1167.569,1171.0,45500,1172.0,1160.0
679,2017/06/06,1161.0,1160.821,1158.0,24000,1169.0,1156.0
680,2017/06/07,1167.0,1168.361,1149.0,44600,1174.0,1149.0
681,2017/06/08,1159.0,1161.977,1167.0,21900,1169.0,1156.0
682,2017/06/09,1172.0,1173.649,1170.0,61600,1188.0,1165.0
683,2017/06/12,1155.0,1160.65,1171.0,20000,1171.0,1155.0
684,2017/06/13,1137.0,1138.355,1145.0,33800,1145.0,1131.0
685,2017/06/14,1147.0,1149.701,1142.0,20400,1162.0,1141.0
686,2017/06/15,1133.0,1139.917,1150.0,24100,1151.0,1133.0
687,2017/06/16,1148.0,1153.363,1133.0,35000,1163.0,1133.0
688,2017/06/19,1162.0,1158.537,1150.0,19000,1164.0,1143.0
689,2017/06/20,1164.0,1165.808,1162.0,36500,1174.0,1156.0
690,2017/06/21,1155.0,1159.917,1160.0,21600,1168.0,1137.0
691,2017/06/22,1153.0,1158.839,1166.0,13700,1167.0,1151.0
692,2017/06/23,1154.0,1158.116,1159.0,18100,1169.0,1151.0
693,2017/06/26,1158.0,1158.806,1159.0,6700,1165.0,1151.0
694,2017/06/27,1163.0,1147.714,1128.0,45800,1168.0,1128.0
695,2017/06/28,1144.0,1151.95,1155.0,26100,1162.0,1138.0
696,2017/06/29,1155.0,1154.236,1150.0,10600,1162.0,1149.0
697,2017/06/30,1151.0,1146.095,1140.0,15800,1152.0,1140.0
698,2017/07/03,1166.0,1169.079,1151.0,44500,1178.0,1151.0
699,2017/07/04,1148.0,1156.016,1166.0,25300,1168.0,1146.0
700,2017/07/05,1154.0,1150.796,1152.0,17600,1160.0,1142.0
701,2017/07/06,1151.0,1153.932,1151.0,20500,1161.0,1148.0
702,2017/07/07,1130.0,1137.648,1144.0,21600,1152.0,1129.0
703,2017/07/10,1136.0,1140.343,1150.0,18100,1150.0,1129.0
704,2017/07/11,1147.0,1145.134,1140.0,21600,1150.0,1135.0
705,2017/07/12,1151.0,1153.073,1146.0,23200,1159.0,1144.0
706,2017/07/13,1144.0,1146.394,1152.0,16500,1152.0,1140.0
707,2017/07/14,1146.0,1147.9,1144.0,24900,1156.0,1136.0
708,2017/07/18,1132.0,1136.294,1146.0,26900,1146.0,1127.0
709,2017/07/19,1116.0,1118.415,1125.0,25300,1125.0,1113.0
710,2017/07/20,1124.0,1119.552,1114.0,16500,1126.0,1110.0
711,2017/07/21,1127.0,1123.973,1120.0,18500,1128.0,1117.0
712,2017/07/24,1144.0,1130.91,1125.0,27900,1144.0,1120.0
713,2017/07/25,1142.0,1142.312,1141.0,19900,1147.0,1136.0
714,2017/07/26,1140.0,1142.147,1142.0,19100,1154.0,1132.0
715,2017/07/27,1146.0,1147.121,1144.0,17300,1157.0,1134.0
716,2017/07/28,1144.0,1142.228,1144.0,25000,1148.0,1135.0
717,2017/07/31,1146.0,1145.009,1140.0,22400,1155.0,1133.0
718,2017/08/01,1145.0,1143.601,1146.0,16300,1151.0,1138.0
719,2017/08/02,1160.0,1149.975,1148.0,16100,1160.0,1138.0
720,2017/08/03,1160.0,1157.186,1160.0,11800,1160.0,1150.0
721,2017/08/04,1150.0,1147.315,1142.0,23200,1158.0,1142.0
722,2017/08/07,1166.0,1163.966,1156.0,17500,1168.0,1156.0
723,2017/08/08,1169.0,1165.969,1169.0,12900,1169.0,1159.0
724,2017/08/09,1145.0,1149.459,1169.0,14600,1169.0,1142.0
725,2017/08/10,1160.0,1148.447,1135.0,24600,1160.0,1129.0
726,2017/08/14,1137.0,1151.943,1139.0,43500,1178.0,1134.0
727,2017/08/15,1150.0,1153.073,1142.0,19100,1174.0,1142.0
728,2017/08/16,1155.0,1163.63,1151.0,33500,1171.0,1151.0
729,2017/08/17,1162.0,1167.008,1165.0,26000,1173.0,1160.0
730,2017/08/18,1145.0,1147.568,1146.0,22000,1154.0,1139.0
731,2017/08/21,1164.0,1157.89,1145.0,17200,1168.0,1145.0
732,2017/08/22,1169.0,1168.469,1164.0,27100,1174.0,1160.0
733,2017/08/23,1164.0,1168.68,1174.0,35300,1176.0,1157.0
734,2017/08/24,1163.0,1166.609,1162.0,20700,1173.0,1152.0
735,2017/08/25,1165.0,1164.287,1163.0,16700,1169.0,1157.0
736,2017/08/28,1175.0,1171.994,1165.0,32800,1176.0,1165.0
737,2017/08/29,1168.0,1173.089,1170.0,27000,1179.0,1164.0
738,2017/08/30,1173.0,1174.489,1168.0,26000,1181.0,1168.0
739,2017/08/31,1167.0,1167.121,1175.0,27300,1175.0,1157.0
740,2017/09/01,1170.0,1170.829,1167.0,41600,1174.0,1163.0
741,2017/09/04,1160.0,1162.531,1170.0,27900,1170.0,1152.0
742,2017/09/05,1145.0,1152.578,1155.0,18000,1162.0,1145.0
743,2017/09/06,1148.0,1142.885,1138.0,20800,1153.0,1128.0
744,2017/09/07,1169.0,1166.406,1144.0,17500,1174.0,1144.0
745,2017/09/08,1164.0,1155.667,1151.0,20400,1166.0,1151.0
746,2017/09/11,1168.0,1168.776,1163.0,19200,1177.0,1163.0
747,2017/09/12,1170.0,1170.926,1175.0,26900,1179.0,1166.0
748,2017/09/13,1170.0,1169.833,1169.0,18600,1173.0,1162.0
749,2017/09/14,1162.0,1161.247,1167.0,38400,1170.0,1154.0
750,2017/09/15,1177.0,1175.159,1165.0,79700,1180.0,1164.0
751,2017/09/19,1188.0,1187.403,1190.0,72000,1191.0,1182.0
752,2017/09/20,1178.0,1176.813,1188.0,59300,1188.0,1168.0
753,2017/09/21,1169.0,1166.79,1178.0,44800,1178.0,1161.0
754,2017/09/22,1161.0,1159.544,1166.0,23900,1167.0,1155.0
755,2017/09/25,1162.0,1160.82,1158.0,16100,1165.0,1158.0
756,2017/09/26,1168.0,1168.365,1168.0,31500,1173.0,1160.0
757,2017/09/27,1173.0,1171.238,1168.0,21400,1176.0,1156.0
758,2017/09/28,1176.0,1173.599,1165.0,34900,1177.0,1163.0
759,2017/09/29,1171.0,1175.304,1179.0,30300,1182.0,1171.0
760,2017/10/02,1174.0,1170.817,1171.0,39800,1179.0,1163.0
761,2017/10/03,1169.0,1169.847,1171.0,45700,1173.0,1164.0
762,2017/10/04,1168.0,1171.121,1169.0,62600,1178.0,1167.0
763,2017/10/05,1154.0,1157.671,1168.0,34300,1169.0,1152.0
764,2017/10/06,1169.0,1166.189,1154.0,24900,1170.0,1154.0
765,2017/10/10,1168.0,1167.255,1168.0,23900,1170.0,1163.0
766,2017/10/11,1174.0,1170.618,1171.0,48900,1175.0,1163.0
767,2017/10/12,1176.0,1175.333,1174.0,47800,1182.0,1170.0
768,2017/10/13,1175.0,1173.0,1168.0,88900,1179.0,1167.0
769,2017/10/16,1178.0,1181.473,1177.0,44800,1190.0,1175.0
770,2017/10/17,1179.0,1180.384,1178.0,77400,1185.0,1175.0
771,2017/10/18,1174.0,1173.998,1173.0,48300,1177.0,1170.0
772,2017/10/19,1172.0,1173.356,1170.0,36000,1175.0,1170.0
773,2017/10/20,1176.0,1181.948,1171.0,75100,1191.0,1171.0
774,2017/10/23,1177.0,1180.711,1176.0,47400,1189.0,1175.0
775,2017/10/24,1181.0,1178.676,1174.0,48100,1188.0,1168.0
776,2017/10/25,1179.0,1180.274,1182.0,62500,1184.0,1176.0
777,2017/10/26,1172.0,1174.422,1179.0,42700,1179.0,1170.0
778,2017/10/27,1173.0,1171.352,1173.0,31500,1175.0,1167.0
779,2017/10/30,1181.0,1178.407,1170.0,95600,1185.0,1165.0
780,2017/10/31,1200.0,1194.248,1175.0,100300,1201.0,1175.0
781,2017/11/01,1216.0,1214.621,1214.0,80500,1219.0,1207.0
782,2017/11/02,1205.0,1207.937,1220.0,23700,1220.0,1204.0
783,2017/11/06,1203.0,1202.615,1205.0,41000,1211.0,1199.0
784,2017/11/07,1207.0,1207.391,1200.0,56600,1218.0,1190.0
785,2017/11/08,1202.0,1202.165,1200.0,38200,1208.0,1196.0
786,2017/11/09,1214.0,1220.337,1209.0,155700,1231.0,1191.0
787,2017/11/10,1250.0,1233.801,1211.0,108800,1252.0,1202.0
788,2017/11/13,1388.0,1378.45,1340.0,292900,1398.0,1334.0
789,2017/11/14,1381.0,1375.555,1362.0,124000,1385.0,1356.0
790,2017/11/15,1355.0,1358.745,1360.0,172500,1366.0,1348.0
791,2017/11/16,1374.0,1376.656,1349.0,153500,1395.0,1349.0
792,2017/11/17,1345.0,1357.5,1361.0,91200,1374.0,1343.0
793,2017/11/20,1395.0,1394.499,1374.0,151000,1415.0,1372.0
794,2017/11/21,1450.0,1455.578,1409.0,213700,1493.0,1408.0
795,2017/11/22,1484.0,1479.196,1459.0,95800,1496.0,1450.0
796,2017/11/24,1494.0,1482.259,1484.0,88500,1497.0,1455.0
797,2017/11/27,1502.0,1532.691,1500.0,170300,1558.0,1495.0
798,2017/11/28,1457.0,1455.928,1500.0,132100,1510.0,1425.0
799,2017/11/29,1475.0,1490.437,1439.0,124100,1526.0,1439.0
800,2017/11/30,1443.0,1441.045,1455.0,93100,1455.0,1418.0
801,2017/12/01,1459.0,1467.254,1470.0,86700,1487.0,1451.0
802,2017/12/04,1457.0,1461.633,1463.0,59600,1483.0,1451.0
803,2017/12/05,1449.0,1438.345,1415.0,106500,1451.0,1414.0
804,2017/12/06,1453.0,1459.504,1446.0,94700,1477.0,1427.0
805,2017/12/07,1461.0,1464.57,1453.0,80300,1490.0,1426.0
806,2017/12/08,1481.0,1475.859,1461.0,64500,1493.0,1461.0
807,2017/12/11,1513.0,1497.691,1477.0,51500,1513.0,1468.0
808,2017/12/12,1550.0,1544.17,1515.0,113400,1565.0,1513.0
809,2017/12/13,1547.0,1541.766,1550.0,58100,1550.0,1532.0
810,2017/12/14,1580.0,1563.647,1533.0,99100,1586.0,1528.0
811,2017/12/15,1618.0,1606.743,1592.0,150100,1620.0,1580.0
812,2017/12/18,1613.0,1619.464,1635.0,62300,1647.0,1603.0
813,2017/12/19,1596.0,1597.817,1605.0,67100,1615.0,1590.0
814,2017/12/20,1587.0,1588.081,1582.0,58200,1599.0,1578.0
815,2017/12/21,1599.0,1593.705,1577.0,83600,1611.0,1564.0
816,2017/12/22,1596.0,1599.772,1600.0,35100,1609.0,1593.0
817,2017/12/25,1602.0,1601.083,1618.0,25400,1618.0,1592.0
818,2017/12/26,1604.0,1604.985,1605.0,32500,1614.0,1595.0
819,2017/12/27,1588.0,1588.467,1595.0,47800,1609.0,1580.0
820,2017/12/28,1583.0,1581.845,1591.0,30300,1591.0,1573.0
821,2017/12/29,1569.0,1566.478,1584.0,38900,1591.0,1550.0
822,2018/01/04,1620.0,1593.041,1570.0,77500,1622.0,1533.0
823,2018/01/05,1628.0,1624.124,1627.0,72700,1633.0,1612.0
824,2018/01/09,1583.0,1592.873,1622.0,71900,1627.0,1579.0
825,2018/01/10,1571.0,1571.793,1571.0,53100,1585.0,1560.0
826,2018/01/11,1564.0,1558.192,1558.0,47000,1568.0,1548.0
827,2018/01/12,1574.0,1570.319,1556.0,52100,1583.0,1556.0
828,2018/01/15,1578.0,1573.381,1576.0,43000,1582.0,1562.0
829,2018/01/16,1592.0,1582.977,1575.0,56000,1594.0,1573.0
830,2018/01/17,1642.0,1639.437,1597.0,165300,1660.0,1590.0
831,2018/01/18,1638.0,1651.413,1645.0,101800,1673.0,1635.0
832,2018/01/19,1597.0,1593.935,1601.0,88000,1603.0,1577.0
833,2018/01/22,1620.0,1608.64,1577.0,87000,1624.0,1571.0
834,2018/01/23,1590.0,1598.19,1619.0,43700,1622.0,1587.0
835,2018/01/24,1566.0,1573.527,1585.0,83100,1588.0,1552.0
836,2018/01/25,1503.0,1526.431,1577.0,173700,1577.0,1502.0
837,2018/01/26,1500.0,1499.21,1496.0,118100,1509.0,1480.0
838,2018/01/29,1496.0,1506.754,1510.0,61800,1523.0,1491.0
839,2018/01/30,1498.0,1512.537,1526.0,65600,1526.0,1496.0
840,2018/01/31,1495.0,1503.122,1488.0,68800,1515.0,1484.0
841,2018/02/01,1523.0,1517.501,1495.0,46300,1530.0,1495.0
842,2018/02/02,1506.0,1500.941,1500.0,57600,1521.0,1487.0
843,2018/02/05,1448.0,1459.322,1485.0,117900,1496.0,1438.0
844,2018/02/06,1360.0,1365.036,1404.0,80000,1407.0,1329.0
845,2018/02/07,1361.0,1389.893,1390.0,68400,1430.0,1361.0
846,2018/02/08,1395.0,1387.467,1363.0,56100,1408.0,1363.0
847,2018/02/09,1371.0,1375.839,1380.0,93500,1406.0,1348.0
848,2018/02/13,1577.0,1559.63,1431.0,435300,1602.0,1431.0
849,2018/02/14,1526.0,1554.055,1577.0,160800,1589.0,1523.0
850,2018/02/15,1550.0,1547.778,1515.0,66300,1568.0,1506.0
851,2018/02/16,1588.0,1598.864,1565.0,126500,1623.0,1556.0
852,2018/02/19,1609.0,1606.013,1604.0,95900,1617.0,1590.0
853,2018/02/20,1679.0,1654.693,1615.0,149600,1685.0,1610.0
854,2018/02/21,1653.0,1648.559,1678.0,87000,1678.0,1614.0
855,2018/02/22,1648.0,1650.469,1641.0,35800,1662.0,1638.0
856,2018/02/23,1701.0,1703.651,1664.0,136100,1730.0,1664.0
857,2018/02/26,1702.0,1706.511,1701.0,78500,1730.0,1695.0
858,2018/02/27,1742.0,1732.198,1693.0,56100,1748.0,1693.0
859,2018/02/28,1697.0,1711.522,1720.0,73800,1734.0,1694.0
860,2018/03/01,1637.0,1645.779,1685.0,67000,1685.0,1628.0
861,2018/03/02,1646.0,1645.181,1618.0,58500,1665.0,1618.0
862,2018/03/05,1624.0,1625.501,1620.0,80200,1641.0,1613.0
863,2018/03/06,1627.0,1646.805,1661.0,43600,1682.0,1623.0
864,2018/03/07,1575.0,1582.698,1611.0,41700,1611.0,1563.0
865,2018/03/08,1622.0,1628.642,1630.0,108300,1649.0,1610.0
866,2018/03/09,1649.0,1643.321,1650.0,72600,1664.0,1623.0
867,2018/03/12,1695.0,1676.523,1658.0,52600,1699.0,1641.0
868,2018/03/13,1719.0,1697.403,1684.0,94700,1722.0,1662.0
869,2018/03/14,1660.0,1661.326,1700.0,87700,1700.0,1647.0
870,2018/03/15,1656.0,1642.919,1665.0,53000,1665.0,1617.0
871,2018/03/16,1670.0,1664.698,1663.0,77400,1689.0,1648.0
872,2018/03/19,1665.0,1667.356,1651.0,57600,1685.0,1647.0
873,2018/03/20,1621.0,1617.623,1631.0,79500,1641.0,1597.0
874,2018/03/22,1614.0,1608.669,1612.0,52800,1629.0,1591.0
875,2018/03/23,1516.0,1523.62,1555.0,101600,1569.0,1502.0
876,2018/03/26,1560.0,1571.679,1596.0,176400,1632.0,1535.0
877,2018/03/27,1576.0,1552.916,1589.0,241900,1593.0,1501.0
878,2018/03/28,1600.0,1571.361,1522.0,76800,1600.0,1520.0
879,2018/03/29,1598.0,1589.843,1593.0,69300,1602.0,1569.0
880,2018/03/30,1562.0,1587.358,1598.0,87800,1634.0,1557.0
881,2018/04/02,1506.0,1515.834,1548.0,108700,1548.0,1497.0
882,2018/04/03,1537.0,1542.062,1505.0,89100,1570.0,1505.0
883,2018/04/04,1505.0,1509.961,1531.0,71500,1531.0,1497.0
884,2018/04/05,1488.0,1480.093,1452.0,111900,1507.0,1445.0
885,2018/04/06,1478.0,1484.02,1482.0,55000,1508.0,1477.0
886,2018/04/09,1436.0,1441.222,1454.0,50100,1460.0,1433.0
887,2018/04/10,1460.0,1419.597,1379.0,98600,1466.0,1362.0
888,2018/04/11,1554.0,1544.753,1510.0,152200,1575.0,1470.0
889,2018/04/12,1478.0,1501.626,1547.0,86300,1547.0,1477.0
890,2018/04/13,1527.0,1539.136,1480.0,136400,1559.0,1480.0
891,2018/04/16,1553.0,1540.966,1527.0,64200,1558.0,1517.0
892,2018/04/17,1601.0,1582.871,1553.0,101300,1609.0,1535.0
893,2018/04/18,1644.0,1637.867,1603.0,86600,1650.0,1603.0
894,2018/04/19,1648.0,1645.65,1643.0,71900,1657.0,1627.0
895,2018/04/20,1657.0,1656.313,1630.0,103600,1671.0,1622.0
896,2018/04/23,1656.0,1659.604,1660.0,44400,1676.0,1647.0
897,2018/04/24,1659.0,1662.432,1660.0,60700,1680.0,1647.0
898,2018/04/25,1641.0,1642.213,1634.0,80200,1657.0,1611.0
899,2018/04/26,1635.0,1637.45,1650.0,50400,1654.0,1623.0
900,2018/04/27,1632.0,1632.283,1635.0,30000,1645.0,1613.0
901,2018/05/01,1649.0,1652.289,1645.0,48400,1666.0,1632.0
902,2018/05/02,1652.0,1647.98,1653.0,14900,1656.0,1637.0
903,2018/05/07,1671.0,1665.959,1658.0,43800,1677.0,1650.0
904,2018/05/08,1679.0,1684.636,1671.0,46200,1698.0,1671.0
905,2018/05/09,1668.0,1667.743,1672.0,35000,1684.0,1653.0
906,2018/05/10,1643.0,1640.748,1663.0,46800,1669.0,1617.0
907,2018/05/11,1644.0,1647.24,1643.0,40500,1672.0,1636.0
908,2018/05/14,1669.0,1647.69,1676.0,125000,1700.0,1598.0
909,2018/05/15,1563.0,1607.519,1566.0,237400,1656.0,1563.0
910,2018/05/16,1664.0,1660.448,1594.0,160900,1688.0,1594.0
911,2018/05/17,1571.0,1585.684,1621.0,140400,1648.0,1554.0
912,2018/05/18,1589.0,1583.457,1583.0,78400,1599.0,1572.0
913,2018/05/21,1652.0,1680.704,1615.0,169500,1734.0,1615.0
914,2018/05/22,1737.0,1722.396,1653.0,170300,1744.0,1653.0
915,2018/05/23,1583.0,1606.345,1736.0,372000,1736.0,1579.0
916,2018/05/24,1533.0,1536.814,1575.0,167600,1575.0,1507.0
917,2018/05/25,1496.0,1507.587,1510.0,93600,1530.0,1487.0
918,2018/05/28,1474.0,1487.153,1503.0,107500,1517.0,1463.0
919,2018/05/29,1419.0,1430.268,1474.0,103100,1474.0,1415.0
920,2018/05/30,1379.0,1380.635,1404.0,111500,1414.0,1362.0
921,2018/05/31,1369.0,1374.902,1385.0,94200,1394.0,1363.0
922,2018/06/01,1373.0,1364.585,1384.0,130500,1391.0,1338.0
923,2018/06/04,1349.0,1348.83,1383.0,139500,1385.0,1331.0
924,2018/06/05,1367.0,1336.484,1340.0,274000,1373.0,1285.0
925,2018/06/06,1444.0,1437.991,1396.0,238500,1465.0,1395.0
926,2018/06/07,1494.0,1475.267,1437.0,197700,1495.0,1434.0
927,2018/06/08,1490.0,1498.875,1507.0,98400,1520.0,1480.0
928,2018/06/11,1447.0,1453.0,1466.0,56100,1467.0,1440.0
929,2018/06/12,1454.0,1456.758,1457.0,60000,1473.0,1442.0
930,2018/06/13,1471.0,1475.567,1469.0,73700,1498.0,1459.0
931,2018/06/14,1444.0,1448.868,1457.0,78700,1466.0,1434.0
932,2018/06/15,1425.0,1434.039,1444.0,51600,1458.0,1418.0
933,2018/06/18,1377.0,1382.139,1434.0,37300,1434.0,1365.0
934,2018/06/19,1344.0,1353.706,1355.0,43600,1375.0,1336.0
935,2018/06/20,1368.0,1346.525,1340.0,73600,1374.0,1311.0
936,2018/06/21,1387.0,1382.805,1359.0,44700,1399.0,1352.0
937,2018/06/22,1388.0,1381.636,1370.0,50600,1399.0,1355.0
938,2018/06/25,1345.0,1361.228,1384.0,52300,1402.0,1340.0
939,2018/06/26,1351.0,1339.671,1322.0,70600,1351.0,1307.0
940,2018/06/27,1343.0,1347.186,1321.0,54900,1364.0,1321.0
941,2018/06/28,1322.0,1320.157,1322.0,65700,1331.0,1307.0
942,2018/06/29,1354.0,1349.625,1331.0,83900,1368.0,1326.0
943,2018/07/02,1302.0,1330.922,1372.0,42200,1375.0,1301.0
944,2018/07/03,1274.0,1276.644,1299.0,80600,1301.0,1258.0
945,2018/07/04,1302.0,1295.318,1274.0,44100,1314.0,1267.0
946,2018/07/05,1292.0,1311.272,1286.0,59300,1342.0,1286.0
947,2018/07/06,1324.0,1317.076,1283.0,63200,1336.0,1283.0
948,2018/07/09,1317.0,1311.167,1322.0,37100,1331.0,1293.0
949,2018/07/10,1337.0,1341.269,1330.0,60500,1354.0,1315.0
950,2018/07/11,1333.0,1331.326,1338.0,38600,1351.0,1316.0
951,2018/07/12,1310.0,1313.676,1326.0,33600,1326.0,1304.0
952,2018/07/13,1344.0,1343.922,1311.0,28300,1351.0,1311.0
953,2018/07/17,1335.0,1339.687,1344.0,41200,1357.0,1323.0
954,2018/07/18,1345.0,1346.179,1335.0,20700,1360.0,1329.0
955,2018/07/19,1338.0,1336.916,1341.0,21400,1346.0,1320.0
956,2018/07/20,1308.0,1314.214,1340.0,37400,1348.0,1295.0
957,2018/07/23,1379.0,1359.855,1308.0,58600,1385.0,1302.0
958,2018/07/24,1382.0,1393.102,1390.0,56000,1427.0,1370.0
959,2018/07/25,1419.0,1408.176,1397.0,27900,1420.0,1384.0
960,2018/07/26,1475.0,1471.68,1449.0,83800,1512.0,1443.0
961,2018/07/27,1489.0,1489.319,1475.0,90100,1514.0,1465.0
962,2018/07/30,1446.0,1455.919,1494.0,35900,1494.0,1443.0
963,2018/07/31,1446.0,1442.064,1428.0,35700,1468.0,1413.0
964,2018/08/01,1431.0,1437.508,1441.0,13200,1448.0,1430.0
965,2018/08/02,1382.0,1395.763,1424.0,36700,1429.0,1382.0
966,2018/08/03,1347.0,1354.0,1383.0,32800,1389.0,1345.0
967,2018/08/06,1330.0,1341.121,1335.0,28900,1362.0,1326.0
968,2018/08/07,1372.0,1359.326,1337.0,19300,1374.0,1337.0
969,2018/08/08,1367.0,1365.652,1362.0,18100,1382.0,1355.0
970,2018/08/09,1358.0,1355.275,1347.0,15300,1364.0,1346.0
971,2018/08/10,1329.0,1341.936,1349.0,50000,1365.0,1328.0
972,2018/08/13,1590.0,1555.046,1500.0,439800,1595.0,1472.0
973,2018/08/14,1561.0,1561.084,1587.0,149400,1590.0,1534.0
974,2018/08/15,1563.0,1559.41,1562.0,54900,1575.0,1548.0
975,2018/08/16,1565.0,1558.058,1548.0,64200,1585.0,1531.0
976,2018/08/17,1559.0,1562.132,1572.0,40800,1578.0,1543.0
977,2018/08/20,1579.0,1580.189,1559.0,67100,1603.0,1539.0
978,2018/08/21,1578.0,1583.514,1564.0,52000,1598.0,1564.0
979,2018/08/22,1583.0,1587.741,1578.0,71400,1606.0,1564.0
980,2018/08/23,1603.0,1607.199,1599.0,37700,1614.0,1596.0
981,2018/08/24,1613.0,1614.409,1603.0,64300,1628.0,1588.0
982,2018/08/27,1620.0,1629.231,1624.0,53300,1648.0,1613.0
983,2018/08/28,1576.0,1582.435,1611.0,69500,1614.0,1562.0
984,2018/08/29,1609.0,1602.361,1576.0,37400,1613.0,1576.0
985,2018/08/30,1642.0,1646.319,1615.0,90700,1667.0,1610.0
986,2018/08/31,1676.0,1664.548,1627.0,68100,1692.0,1603.0
987,2018/09/03,1644.0,1648.253,1660.0,43500,1670.0,1634.0
988,2018/09/04,1618.0,1622.231,1620.0,32900,1640.0,1614.0
989,2018/09/05,1599.0,1602.944,1602.0,53600,1627.0,1590.0
990,2018/09/06,1552.0,1562.647,1581.0,64800,1587.0,1549.0
991,2018/09/07,1551.0,1536.826,1554.0,63200,1555.0,1516.0
992,2018/09/10,1567.0,1572.966,1555.0,38000,1599.0,1555.0
993,2018/09/11,1603.0,1594.641,1580.0,54600,1607.0,1565.0
994,2018/09/12,1630.0,1610.776,1601.0,75500,1650.0,1565.0
995,2018/09/13,1670.0,1666.349,1640.0,90400,1683.0,1640.0
996,2018/09/14,1664.0,1681.095,1692.0,70400,1718.0,1651.0
997,2018/09/18,1678.0,1659.935,1649.0,46100,1680.0,1626.0
998,2018/09/19,1745.0,1738.884,1699.0,115900,1762.0,1694.0
999,2018/09/20,1714.0,1725.499,1737.0,75700,1762.0,1694.0
1000,2018/09/21,1753.0,1738.623,1729.0,70900,1755.0,1714.0
1001,2018/09/25,1766.0,1763.254,1771.0,42500,1777.0,1737.0
1002,2018/09/26,1747.0,1750.723,1766.0,60200,1777.0,1733.0
1003,2018/09/27,1714.0,1714.497,1747.0,43500,1747.0,1692.0
1004,2018/09/28,1703.0,1716.324,1721.0,50600,1741.0,1697.0
1005,2018/10/01,1671.0,1676.153,1720.0,39300,1720.0,1661.0
1006,2018/10/02,1703.0,1699.788,1671.0,67400,1725.0,1662.0
1007,2018/10/03,1663.0,1673.291,1699.0,82900,1703.0,1649.0
1008,2018/10/04,1686.0,1686.277,1685.0,74700,1713.0,1673.0
1009,2018/10/05,1645.0,1650.371,1665.0,59300,1670.0,1635.0
1010,2018/10/09,1624.0,1612.725,1622.0,60300,1637.0,1580.0
1011,2018/10/10,1644.0,1648.014,1635.0,65400,1670.0,1627.0
1012,2018/10/11,1574.0,1573.087,1574.0,79400,1592.0,1554.0
1013,2018/10/12,1558.0,1560.793,1557.0,51600,1582.0,1554.0
1014,2018/10/15,1547.0,1551.394,1558.0,58200,1567.0,1535.0
1015,2018/10/16,1556.0,1548.894,1538.0,27400,1562.0,1527.0
1016,2018/10/17,1568.0,1563.912,1572.0,40900,1572.0,1554.0
1017,2018/10/18,1567.0,1590.077,1574.0,84800,1618.0,1566.0
1018,2018/10/19,1543.0,1541.159,1567.0,45900,1567.0,1526.0
1019,2018/10/22,1566.0,1545.648,1537.0,47500,1570.0,1504.0
1020,2018/10/23,1551.0,1559.592,1567.0,46300,1577.0,1550.0
1021,2018/10/24,1554.0,1566.454,1554.0,50900,1587.0,1546.0
1022,2018/10/25,1501.0,1496.319,1500.0,50400,1506.0,1480.0
1023,2018/10/26,1500.0,1508.846,1520.0,42900,1534.0,1492.0
1024,2018/10/29,1512.0,1530.029,1512.0,52100,1572.0,1511.0
1025,2018/10/30,1538.0,1542.409,1500.0,59700,1570.0,1480.0
1026,2018/10/31,1618.0,1607.861,1578.0,40400,1624.0,1564.0
1027,2018/11/01,1613.0,1603.279,1599.0,80700,1645.0,1558.0
1028,2018/11/02,1628.0,1618.359,1603.0,73000,1655.0,1586.0
1029,2018/11/05,1584.0,1591.463,1626.0,66500,1626.0,1570.0
1030,2018/11/06,1540.0,1539.127,1584.0,65200,1587.0,1519.0
1031,2018/11/07,1558.0,1561.776,1531.0,52200,1600.0,1531.0
1032,2018/11/08,1573.0,1571.0,1565.0,95300,1597.0,1526.0
1033,2018/11/09,1583.0,1586.908,1577.0,72700,1610.0,1556.0
1034,2018/11/12,1786.0,1709.975,1582.0,230700,1795.0,1582.0
1035,2018/11/13,1704.0,1730.653,1720.0,158100,1773.0,1701.0
1036,2018/11/14,1652.0,1659.618,1670.0,65500,1693.0,1641.0
1037,2018/11/15,1660.0,1658.514,1650.0,33100,1672.0,1648.0
1038,2018/11/16,1647.0,1650.78,1647.0,42700,1669.0,1637.0
1039,2018/11/19,1670.0,1669.838,1650.0,19100,1687.0,1650.0
1040,2018/11/20,1671.0,1679.751,1656.0,44200,1711.0,1650.0
1041,2018/11/21,1655.0,1651.041,1646.0,31500,1663.0,1626.0
1042,2018/11/22,1664.0,1656.427,1650.0,28600,1668.0,1643.0
1043,2018/11/26,1684.0,1683.262,1664.0,20200,1696.0,1653.0
1044,2018/11/27,1665.0,1655.143,1680.0,37800,1680.0,1633.0
1045,2018/11/28,1664.0,1666.946,1645.0,38800,1682.0,1645.0
1046,2018/11/29,1655.0,1662.049,1682.0,42800,1693.0,1646.0
1047,2018/11/30,1656.0,1655.73,1660.0,40300,1669.0,1645.0
1048,2018/12/03,1634.0,1655.14,1658.0,56300,1690.0,1630.0
1049,2018/12/04,1609.0,1635.334,1674.0,69800,1678.0,1606.0
1050,2018/12/05,1567.0,1579.94,1598.0,62900,1626.0,1557.0
1051,2018/12/06,1516.0,1522.555,1550.0,65400,1558.0,1505.0
1052,2018/12/07,1494.0,1493.791,1509.0,55500,1512.0,1478.0
1053,2018/12/10,1450.0,1450.331,1464.0,49500,1468.0,1434.0
1054,2018/12/11,1432.0,1431.52,1450.0,35400,1450.0,1416.0
1055,2018/12/12,1440.0,1445.933,1432.0,44800,1462.0,1432.0
1056,2018/12/13,1475.0,1473.547,1456.0,43900,1481.0,1451.0
1057,2018/12/14,1413.0,1437.841,1458.0,76900,1468.0,1413.0
1058,2018/12/17,1410.0,1410.921,1413.0,59200,1428.0,1388.0
1059,2018/12/18,1354.0,1349.05,1352.0,105300,1363.0,1328.0
1060,2018/12/19,1341.0,1344.557,1354.0,90100,1374.0,1328.0
1061,2018/12/20,1281.0,1310.415,1340.0,83600,1350.0,1277.0
1062,2018/12/21,1284.0,1281.525,1285.0,79300,1298.0,1251.0
1063,2018/12/25,1201.0,1206.323,1254.0,54200,1265.0,1187.0
1064,2018/12/26,1241.0,1246.236,1245.0,62300,1270.0,1227.0
1065,2018/12/27,1305.0,1288.006,1299.0,52700,1309.0,1256.0
1066,2018/12/28,1288.0,1289.588,1313.0,32800,1313.0,1271.0
1067,2019/01/04,1199.0,1196.872,1233.0,59300,1233.0,1178.0
1068,2019/01/07,1241.0,1233.577,1231.0,59400,1246.0,1212.0
1069,2019/01/08,1254.0,1244.849,1247.0,53600,1261.0,1230.0
1070,2019/01/09,1253.0,1241.532,1261.0,46800,1268.0,1215.0
1071,2019/01/10,1230.0,1208.22,1240.0,88300,1241.0,1176.0
1072,2019/01/11,1276.0,1281.684,1254.0,64200,1309.0,1242.0
1073,2019/01/15,1294.0,1291.351,1282.0,23100,1305.0,1262.0
1074,2019/01/16,1265.0,1261.14,1281.0,57000,1281.0,1248.0
1075,2019/01/17,1255.0,1262.28,1266.0,65800,1289.0,1243.0
1076,2019/01/18,1248.0,1256.42,1256.0,68300,1297.0,1235.0
1077,2019/01/21,1209.0,1213.567,1248.0,191000,1256.0,1197.0
1078,2019/01/22,1185.0,1182.63,1209.0,142300,1209.0,1161.0
1079,2019/01/23,1187.0,1187.013,1180.0,76800,1199.0,1176.0
1080,2019/01/24,1192.0,1198.767,1192.0,34700,1215.0,1184.0
1081,2019/01/25,1215.0,1221.161,1198.0,62300,1237.0,1192.0
1082,2019/01/28,1217.0,1206.602,1210.0,47700,1231.0,1193.0
1083,2019/01/29,1217.0,1205.052,1206.0,32600,1217.0,1191.0
1084,2019/01/30,1199.0,1203.745,1209.0,61500,1218.0,1195.0
1085,2019/01/31,1203.0,1196.209,1203.0,58500,1210.0,1186.0
1086,2019/02/01,1215.0,1215.708,1203.0,43200,1224.0,1196.0
1087,2019/02/04,1215.0,1221.006,1228.0,146000,1248.0,1211.0
1088,2019/02/05,1210.0,1206.992,1215.0,62000,1218.0,1194.0
1089,2019/02/06,1196.0,1204.43,1219.0,38100,1226.0,1189.0
1090,2019/02/07,1197.0,1182.139,1187.0,62100,1202.0,1164.0
1091,2019/02/08,1207.0,1200.33,1183.0,61800,1212.0,1178.0
1092,2019/02/12,1214.0,1193.736,1171.0,86300,1214.0,1162.0
1093,2019/02/13,1196.0,1190.729,1201.0,66800,1203.0,1180.0
1094,2019/02/14,1171.0,1169.144,1195.0,145400,1197.0,1147.0
1095,2019/02/15,1186.0,1177.141,1170.0,111600,1192.0,1157.0
1096,2019/02/18,1240.0,1213.378,1205.0,102000,1240.0,1194.0
1097,2019/02/19,1225.0,1215.837,1226.0,112900,1231.0,1183.0
1098,2019/02/20,1205.0,1209.245,1225.0,56800,1238.0,1199.0
1099,2019/02/21,1222.0,1210.012,1205.0,75500,1226.0,1185.0
1100,2019/02/22,1238.0,1232.386,1224.0,55200,1239.0,1222.0
1101,2019/02/25,1275.0,1257.259,1243.0,98700,1279.0,1229.0
1102,2019/02/26,1300.0,1288.867,1275.0,223300,1318.0,1259.0
1103,2019/02/27,1267.0,1255.811,1262.0,133500,1275.0,1228.0
1104,2019/02/28,1226.0,1235.201,1241.0,111400,1246.0,1226.0
1105,2019/03/01,1196.0,1206.012,1221.0,130400,1223.0,1194.0
1106,2019/03/04,1209.0,1201.216,1198.0,94200,1213.0,1187.0
1107,2019/03/05,1199.0,1184.426,1204.0,166100,1204.0,1168.0
1108,2019/03/06,1192.0,1193.488,1193.0,57200,1201.0,1188.0
1109,2019/03/07,1131.0,1133.32,1138.0,238100,1164.0,1114.0
1110,2019/03/08,1106.0,1107.043,1101.0,177700,1128.0,1094.0
1111,2019/03/11,1102.0,1093.855,1094.0,91100,1108.0,1082.0
1112,2019/03/12,1094.0,1096.774,1102.0,198900,1110.0,1084.0
1113,2019/03/13,1110.0,1103.512,1096.0,101300,1119.0,1095.0
1114,2019/03/14,1132.0,1120.706,1110.0,115700,1137.0,1092.0
1115,2019/03/15,1150.0,1134.829,1118.0,213200,1159.0,1106.0
1116,2019/03/18,1114.0,1133.918,1140.0,159600,1161.0,1114.0
1117,2019/03/19,1142.0,1139.109,1125.0,147800,1151.0,1119.0
1118,2019/03/20,1117.0,1119.302,1115.0,198200,1139.0,1106.0
1119,2019/03/22,1158.0,1139.192,1118.0,199300,1161.0,1118.0
1120,2019/03/25,1123.0,1125.523,1129.0,190500,1129.0,1117.0
1121,2019/03/26,1135.0,1129.405,1125.0,263300,1142.0,1123.0
1122,2019/03/27,1151.0,1130.687,1113.0,79200,1155.0,1113.0
1123,2019/03/28,1111.0,1121.967,1132.0,97500,1146.0,1110.0
1124,2019/03/29,1124.0,1120.562,1120.0,74900,1128.0,1106.0
1125,2019/04/01,1150.0,1147.904,1128.0,58300,1159.0,1127.0
1126,2019/04/02,1143.0,1149.332,1155.0,70900,1157.0,1142.0
1127,2019/04/03,1244.0,1209.825,1133.0,267600,1245.0,1123.0
1128,2019/04/04,1260.0,1244.754,1234.0,283300,1271.0,1209.0
1129,2019/04/05,1221.0,1225.185,1258.0,151300,1258.0,1202.0
1130,2019/04/08,1206.0,1206.363,1219.0,105600,1219.0,1191.0
1131,2019/04/09,1209.0,1201.7,1201.0,84000,1213.0,1192.0
1132,2019/04/10,1196.0,1197.075,1200.0,38600,1202.0,1188.0
1133,2019/04/11,1179.0,1178.741,1192.0,71800,1193.0,1161.0
1134,2019/04/12,1169.0,1167.226,1191.0,42400,1191.0,1155.0
1135,2019/04/15,1172.0,1176.011,1175.0,63900,1193.0,1169.0
1136,2019/04/16,1145.0,1152.09,1168.0,140000,1180.0,1133.0
1137,2019/04/17,1156.0,1152.783,1142.0,59400,1160.0,1142.0
1138,2019/04/18,1115.0,1120.932,1147.0,111300,1150.0,1105.0
1139,2019/04/19,1137.0,1133.588,1124.0,66800,1143.0,1113.0
1140,2019/04/22,1129.0,1133.207,1128.0,71200,1143.0,1117.0
1141,2019/04/23,1125.0,1131.797,1121.0,80600,1145.0,1120.0
1142,2019/04/24,1115.0,1129.255,1125.0,82900,1146.0,1115.0
1143,2019/04/25,1118.0,1120.394,1115.0,85200,1129.0,1111.0
1144,2019/04/26,1129.0,1124.371,1116.0,72800,1132.0,1115.0
1145,2019/05/07,1091.0,1102.804,1125.0,91400,1125.0,1091.0
1146,2019/05/08,1073.0,1069.226,1080.0,129500,1082.0,1057.0
1147,2019/05/09,1041.0,1042.258,1065.0,85600,1068.0,1030.0
1148,2019/05/10,1051.0,1048.647,1038.0,96200,1061.0,1033.0
1149,2019/05/13,1050.0,1053.354,1051.0,85100,1065.0,1041.0
1150,2019/05/14,1172.0,1171.256,1170.0,346600,1195.0,1120.0
1151,2019/05/15,1196.0,1198.053,1184.0,183700,1213.0,1182.0
1152,2019/05/16,1194.0,1195.556,1202.0,98800,1208.0,1183.0
1153,2019/05/17,1210.0,1208.609,1205.0,77900,1218.0,1200.0
1154,2019/05/20,1226.0,1218.701,1209.0,71600,1232.0,1200.0
1155,2019/05/21,1180.0,1187.529,1213.0,62900,1218.0,1178.0
1156,2019/05/22,1160.0,1160.751,1186.0,61500,1187.0,1147.0
1157,2019/05/23,1132.0,1132.743,1160.0,60000,1160.0,1125.0
1158,2019/05/24,1179.0,1162.972,1128.0,42100,1179.0,1114.0
1159,2019/05/27,1188.0,1188.773,1192.0,43100,1200.0,1177.0
1160,2019/05/28,1197.0,1198.21,1189.0,52000,1212.0,1177.0
1161,2019/05/29,1207.0,1192.326,1182.0,48800,1211.0,1176.0
1162,2019/05/30,1213.0,1201.139,1208.0,28700,1216.0,1183.0
1163,2019/05/31,1190.0,1188.471,1205.0,101500,1230.0,1174.0
1164,2019/06/03,1176.0,1173.311,1184.0,88000,1184.0,1157.0
1165,2019/06/04,1173.0,1164.011,1182.0,64900,1182.0,1150.0
1166,2019/06/05,1203.0,1201.585,1195.0,89600,1217.0,1181.0
1167,2019/06/06,1207.0,1219.521,1199.0,115300,1240.0,1198.0
1168,2019/06/07,1212.0,1215.794,1215.0,172600,1237.0,1202.0
1169,2019/06/10,1265.0,1254.695,1242.0,156900,1293.0,1235.0
1170,2019/06/11,1248.0,1244.397,1265.0,83800,1265.0,1231.0
1171,2019/06/12,1279.0,1274.069,1237.0,67900,1288.0,1237.0
1172,2019/06/13,1262.0,1260.964,1265.0,78200,1275.0,1240.0
1173,2019/06/14,1254.0,1250.497,1265.0,84300,1269.0,1226.0
1174,2019/06/17,1264.0,1265.764,1261.0,64400,1275.0,1239.0
1175,2019/06/18,1215.0,1221.483,1250.0,109000,1250.0,1202.0
1176,2019/06/19,1235.0,1239.111,1235.0,57700,1250.0,1232.0
1177,2019/06/20,1234.0,1224.661,1231.0,49500,1238.0,1211.0
1178,2019/06/21,1267.0,1256.616,1234.0,63000,1268.0,1225.0
1179,2019/06/24,1271.0,1261.817,1255.0,72500,1281.0,1221.0
1180,2019/06/25,1241.0,1243.784,1250.0,42100,1255.0,1238.0
1181,2019/06/26,1230.0,1237.963,1241.0,51900,1253.0,1230.0
1182,2019/06/27,1268.0,1264.812,1232.0,44200,1272.0,1232.0
1183,2019/06/28,1267.0,1272.154,1261.0,58300,1283.0,1256.0
1184,2019/07/01,1270.0,1270.271,1255.0,108200,1284.0,1255.0
1185,2019/07/02,1278.0,1268.399,1261.0,78400,1287.0,1239.0
1186,2019/07/03,1282.0,1279.41,1280.0,58600,1287.0,1265.0
1187,2019/07/04,1271.0,1270.779,1280.0,41600,1282.0,1263.0
1188,2019/07/05,1272.0,1269.646,1263.0,55300,1277.0,1254.0
1189,2019/07/08,1253.0,1250.754,1270.0,44300,1270.0,1240.0
1190,2019/07/09,1212.0,1223.61,1256.0,76700,1256.0,1206.0
1191,2019/07/10,1201.0,1197.994,1207.0,81400,1213.0,1182.0
1192,2019/07/11,1240.0,1230.822,1216.0,77700,1247.0,1210.0
1193,2019/07/12,1247.0,1242.255,1239.0,42400,1249.0,1231.0
1194,2019/07/16,1221.0,1221.392,1247.0,90300,1265.0,1209.0
1195,2019/07/17,1229.0,1235.374,1230.0,56400,1251.0,1224.0
1196,2019/07/18,1193.0,1195.754,1235.0,50800,1235.0,1187.0
1197,2019/07/19,1194.0,1195.104,1193.0,35500,1207.0,1183.0
1198,2019/07/22,1190.0,1185.917,1188.0,32600,1194.0,1178.0
1199,2019/07/23,1193.0,1196.491,1184.0,23200,1206.0,1181.0
1200,2019/07/24,1208.0,1202.508,1198.0,18100,1209.0,1189.0
1201,2019/07/25,1214.0,1206.431,1203.0,36200,1216.0,1196.0
1202,2019/07/26,1200.0,1202.236,1209.0,17800,1209.0,1195.0
1203,2019/07/29,1216.0,1214.402,1200.0,48800,1231.0,1185.0
1204,2019/07/30,1227.0,1226.762,1220.0,30700,1235.0,1216.0
1205,2019/07/31,1191.0,1197.616,1214.0,26300,1214.0,1189.0
1206,2019/08/01,1192.0,1191.744,1191.0,22300,1208.0,1183.0
1207,2019/08/02,1143.0,1143.862,1171.0,89300,1171.0,1130.0
1208,2019/08/05,1119.0,1112.736,1132.0,41300,1132.0,1093.0
1209,2019/08/06,1109.0,1091.148,1051.0,62900,1109.0,1051.0
1210,2019/08/07,1101.0,1103.443,1101.0,48300,1118.0,1098.0
1211,2019/08/08,1095.0,1091.142,1090.0,56300,1105.0,1075.0
1212,2019/08/09,1090.0,1091.345,1100.0,59700,1115.0,1085.0
1213,2019/08/13,1111.0,1127.517,1120.0,84000,1180.0,1101.0
1214,2019/08/14,1153.0,1141.708,1131.0,40800,1154.0,1121.0
1215,2019/08/15,1120.0,1118.418,1123.0,27300,1140.0,1110.0
1216,2019/08/16,1122.0,1117.981,1114.0,47500,1130.0,1100.0
1217,2019/08/19,1140.0,1134.085,1137.0,21100,1143.0,1111.0
1218,2019/08/20,1159.0,1152.86,1146.0,23600,1160.0,1131.0
1219,2019/08/21,1147.0,1147.38,1145.0,22400,1154.0,1134.0
1220,2019/08/22,1128.0,1134.616,1147.0,27100,1154.0,1128.0
1221,2019/08/23,1127.0,1128.7,1130.0,18300,1136.0,1123.0
