,Date,Close,VWAP,Open,Volume,High,Low
0,2014/08/25,617.0,620.0,623.0,200,623.0,617.0
1,2014/08/26,624.0,624.0,624.0,800,624.0,624.0
2,2014/08/27,635.0,626.652,622.0,4600,635.0,617.0
3,2014/08/28,630.0,629.611,629.0,1800,630.0,629.0
4,2014/08/29,630.0,630.0,630.0,1100,630.0,630.0
5,2014/09/01,630.0,630.056,630.0,1800,631.0,630.0
6,2014/09/02,633.0,633.5,634.0,400,634.0,633.0
7,2014/09/03,626.0,626.0,626.0,100,626.0,626.0
8,2014/09/04,623.0,629.4,623.0,1500,633.0,623.0
9,2014/09/05,624.0,623.333,623.0,300,624.0,623.0
10,2014/09/08,627.0,626.125,624.0,800,627.0,624.0
11,2014/09/09,631.0,622.308,630.0,2600,631.0,617.0
12,2014/09/10,630.0,630.0,630.0,300,630.0,630.0
13,2014/09/11,616.0,617.192,631.0,2600,631.0,611.0
14,2014/09/12,625.0,621.375,615.0,800,625.0,615.0
15,2014/09/16,631.0,631.0,631.0,1200,631.0,631.0
16,2014/09/17,0.0,0.0,0.0,0,0.0,0.0
17,2014/09/18,625.0,625.667,623.0,300,629.0,623.0
18,2014/09/19,627.0,629.231,630.0,1300,631.0,627.0
19,2014/09/22,625.0,618.417,617.0,1200,626.0,617.0
20,2014/09/24,623.0,624.333,625.0,300,625.0,623.0
21,2014/09/25,625.0,625.0,625.0,500,625.0,625.0
22,2014/09/26,635.0,635.107,635.0,16800,637.0,635.0
23,2014/09/29,635.0,635.5,634.0,1200,639.0,634.0
24,2014/09/30,640.0,640.0,640.0,11300,640.0,640.0
25,2014/10/01,645.0,647.345,645.0,2900,650.0,645.0
26,2014/10/02,643.0,644.8,646.0,2500,646.0,640.0
27,2014/10/03,646.0,645.036,644.0,2800,648.0,644.0
28,2014/10/06,645.0,646.941,645.0,1700,648.0,645.0
29,2014/10/07,645.0,642.267,645.0,1500,645.0,635.0
30,2014/10/08,650.0,646.298,643.0,11400,650.0,642.0
31,2014/10/09,650.0,650.0,650.0,800,650.0,650.0
32,2014/10/10,652.0,645.667,633.0,600,652.0,633.0
33,2014/10/14,650.0,650.0,650.0,4200,650.0,650.0
34,2014/10/15,650.0,650.0,650.0,4000,650.0,650.0
35,2014/10/16,650.0,649.823,648.0,6200,650.0,648.0
36,2014/10/17,649.0,649.866,649.0,6700,651.0,649.0
37,2014/10/20,652.0,649.206,639.0,3400,652.0,639.0
38,2014/10/21,650.0,650.125,650.0,800,651.0,650.0
39,2014/10/22,660.0,660.0,660.0,1600,660.0,660.0
40,2014/10/23,655.0,655.0,655.0,100,655.0,655.0
41,2014/10/24,655.0,655.39,655.0,4100,658.0,655.0
42,2014/10/27,655.0,651.059,645.0,10200,655.0,645.0
43,2014/10/28,655.0,655.0,655.0,2300,655.0,655.0
44,2014/10/29,655.0,655.0,655.0,500,655.0,655.0
45,2014/10/30,656.0,655.143,655.0,700,656.0,655.0
46,2014/10/31,655.0,654.6,655.0,3000,655.0,644.0
47,2014/11/04,644.0,654.711,655.0,3800,655.0,644.0
48,2014/11/05,659.0,655.18,655.0,3900,659.0,655.0
49,2014/11/06,660.0,659.93,659.0,4300,660.0,659.0
50,2014/11/07,660.0,660.0,660.0,900,660.0,660.0
51,2014/11/10,673.0,659.927,652.0,4100,673.0,652.0
52,2014/11/11,662.0,669.125,673.0,800,673.0,662.0
53,2014/11/12,660.0,660.0,660.0,600,660.0,660.0
54,2014/11/13,660.0,655.786,654.0,2800,660.0,645.0
55,2014/11/14,660.0,652.8,651.0,2000,660.0,651.0
56,2014/11/17,660.0,660.067,660.0,1500,661.0,660.0
57,2014/11/18,661.0,660.833,664.0,600,664.0,660.0
58,2014/11/19,656.0,661.25,666.0,2400,666.0,656.0
59,2014/11/20,652.0,653.818,656.0,1100,656.0,652.0
60,2014/11/21,646.0,646.0,646.0,200,646.0,646.0
61,2014/11/25,660.0,651.444,641.0,4500,660.0,641.0
62,2014/11/26,660.0,660.0,660.0,1900,660.0,660.0
63,2014/11/27,647.0,648.5,650.0,1400,650.0,644.0
64,2014/11/28,645.0,646.0,647.0,300,647.0,645.0
65,2014/12/01,643.0,643.154,642.0,1300,645.0,642.0
66,2014/12/02,660.0,648.038,641.0,8000,660.0,641.0
67,2014/12/03,660.0,655.143,650.0,1400,660.0,650.0
68,2014/12/04,660.0,660.0,660.0,1100,660.0,660.0
69,2014/12/05,660.0,660.0,660.0,200,660.0,660.0
70,2014/12/08,665.0,665.0,665.0,2500,665.0,665.0
71,2014/12/09,0.0,0.0,0.0,0,0.0,0.0
72,2014/12/10,671.0,671.964,672.0,2800,672.0,671.0
73,2014/12/11,657.0,655.947,671.0,1900,671.0,653.0
74,2014/12/12,668.0,668.0,668.0,100,668.0,668.0
75,2014/12/15,660.0,660.0,660.0,6400,660.0,660.0
76,2014/12/16,660.0,660.0,660.0,3600,660.0,660.0
77,2014/12/17,660.0,660.042,660.0,2400,661.0,660.0
78,2014/12/18,660.0,661.667,665.0,300,665.0,660.0
79,2014/12/19,665.0,660.5,653.0,1600,665.0,652.0
80,2014/12/22,652.0,656.103,657.0,2900,660.0,652.0
81,2014/12/24,650.0,652.407,657.0,2700,657.0,646.0
82,2014/12/25,644.0,645.765,651.0,3400,651.0,642.0
83,2014/12/26,649.0,642.348,641.0,2300,649.0,641.0
84,2014/12/29,648.0,648.357,648.0,5600,652.0,648.0
85,2014/12/30,658.0,656.333,655.0,600,659.0,655.0
86,2015/01/05,662.0,662.5,663.0,400,663.0,662.0
87,2015/01/06,654.0,656.667,662.0,1200,662.0,654.0
88,2015/01/07,0.0,0.0,0.0,0,0.0,0.0
89,2015/01/08,663.0,658.125,658.0,1600,663.0,656.0
90,2015/01/09,655.0,655.0,655.0,100,655.0,655.0
91,2015/01/13,651.0,653.5,654.0,600,654.0,651.0
92,2015/01/14,659.0,651.5,655.0,3200,659.0,637.0
93,2015/01/15,659.0,659.0,659.0,400,659.0,659.0
94,2015/01/16,660.0,656.5,657.0,400,660.0,652.0
95,2015/01/19,0.0,0.0,0.0,0,0.0,0.0
96,2015/01/20,660.0,657.2,658.0,500,660.0,655.0
97,2015/01/21,658.0,657.667,657.0,300,658.0,657.0
98,2015/01/22,0.0,0.0,0.0,0,0.0,0.0
99,2015/01/23,651.0,651.138,648.0,2900,655.0,648.0
100,2015/01/26,662.0,657.708,657.0,2400,662.0,650.0
101,2015/01/27,666.0,664.947,660.0,5700,666.0,660.0
102,2015/01/28,665.0,664.581,656.0,3100,665.0,656.0
103,2015/01/29,0.0,0.0,0.0,0,0.0,0.0
104,2015/01/30,666.0,665.286,665.0,700,666.0,665.0
105,2015/02/02,666.0,666.0,666.0,300,666.0,666.0
106,2015/02/03,666.0,666.5,667.0,200,667.0,666.0
107,2015/02/04,665.0,659.0,656.0,400,665.0,656.0
108,2015/02/05,664.0,664.0,664.0,100,664.0,664.0
109,2015/02/06,655.0,658.25,662.0,400,662.0,655.0
110,2015/02/09,657.0,657.667,658.0,300,658.0,657.0
111,2015/02/10,657.0,657.0,657.0,100,657.0,657.0
112,2015/02/12,665.0,664.071,661.0,1400,665.0,661.0
113,2015/02/13,0.0,0.0,0.0,0,0.0,0.0
114,2015/02/16,666.0,663.318,655.0,2200,666.0,655.0
115,2015/02/17,665.0,665.0,665.0,300,665.0,665.0
116,2015/02/18,668.0,667.69,665.0,2900,668.0,665.0
117,2015/02/19,670.0,669.886,669.0,3500,670.0,669.0
118,2015/02/20,672.0,671.077,672.0,1300,672.0,670.0
119,2015/02/23,676.0,669.941,664.0,1700,676.0,662.0
120,2015/02/24,673.0,668.688,668.0,1600,674.0,668.0
121,2015/02/25,675.0,672.615,672.0,3900,675.0,672.0
122,2015/02/26,681.0,678.35,676.0,4000,681.0,676.0
123,2015/02/27,687.0,684.907,681.0,10800,688.0,681.0
124,2015/03/02,693.0,686.5,687.0,2400,693.0,679.0
125,2015/03/03,693.0,692.25,693.0,400,693.0,690.0
126,2015/03/04,698.0,694.741,693.0,2700,698.0,689.0
127,2015/03/05,682.0,690.615,698.0,1300,698.0,682.0
128,2015/03/06,694.0,691.0,685.0,300,694.0,685.0
129,2015/03/09,0.0,0.0,0.0,0,0.0,0.0
130,2015/03/10,696.0,696.0,696.0,100,696.0,696.0
131,2015/03/11,0.0,0.0,0.0,0,0.0,0.0
132,2015/03/12,685.0,688.333,695.0,300,695.0,685.0
133,2015/03/13,685.0,685.0,685.0,100,685.0,685.0
134,2015/03/16,693.0,683.286,685.0,1400,693.0,665.0
135,2015/03/17,695.0,695.0,695.0,300,695.0,695.0
136,2015/03/18,703.0,698.971,694.0,10300,703.0,694.0
137,2015/03/19,703.0,703.0,703.0,100,703.0,703.0
138,2015/03/20,702.0,702.0,703.0,500,703.0,701.0
139,2015/03/23,703.0,700.259,702.0,2700,703.0,693.0
140,2015/03/24,707.0,705.118,704.0,1700,707.0,704.0
141,2015/03/25,709.0,707.7,705.0,10000,709.0,705.0
142,2015/03/26,709.0,708.8,709.0,1000,709.0,708.0
143,2015/03/27,700.0,698.75,695.0,1200,700.0,695.0
144,2015/03/30,0.0,0.0,0.0,0,0.0,0.0
145,2015/03/31,704.0,695.582,700.0,6700,704.0,690.0
146,2015/04/01,704.0,704.0,704.0,500,704.0,704.0
147,2015/04/02,707.0,707.0,707.0,100,707.0,707.0
148,2015/04/03,691.0,691.5,692.0,200,692.0,691.0
149,2015/04/06,702.0,700.057,700.0,5300,702.0,700.0
150,2015/04/07,702.0,702.0,702.0,100,702.0,702.0
151,2015/04/08,707.0,700.778,708.0,1800,708.0,699.0
152,2015/04/09,0.0,0.0,0.0,0,0.0,0.0
153,2015/04/10,690.0,697.5,705.0,200,705.0,690.0
154,2015/04/13,671.0,686.0,695.0,600,695.0,671.0
155,2015/04/14,705.0,703.262,696.0,6100,705.0,695.0
156,2015/04/15,680.0,691.8,705.0,5500,705.0,680.0
157,2015/04/16,686.0,686.0,686.0,1000,686.0,686.0
158,2015/04/17,686.0,684.25,687.0,400,687.0,679.0
159,2015/04/20,677.0,672.588,677.0,1700,677.0,666.0
160,2015/04/21,680.0,677.636,684.0,1100,684.0,672.0
161,2015/04/22,685.0,683.333,680.0,600,685.0,680.0
162,2015/04/23,689.0,687.0,685.0,200,689.0,685.0
163,2015/04/24,690.0,689.2,690.0,500,690.0,686.0
164,2015/04/27,689.0,694.364,696.0,1100,696.0,689.0
165,2015/04/28,708.0,700.704,696.0,2700,708.0,694.0
166,2015/04/30,691.0,699.0,705.0,700,705.0,691.0
167,2015/05/01,676.0,679.031,690.0,3200,690.0,670.0
168,2015/05/07,690.0,685.467,678.0,3000,690.0,673.0
169,2015/05/08,696.0,692.0,690.0,1300,696.0,690.0
170,2015/05/11,703.0,699.559,696.0,3400,703.0,690.0
171,2015/05/12,706.0,704.125,703.0,1600,706.0,703.0
172,2015/05/13,688.0,695.5,703.0,200,703.0,688.0
173,2015/05/14,698.0,698.0,698.0,200,698.0,698.0
174,2015/05/15,700.0,702.5,705.0,200,705.0,700.0
175,2015/05/18,693.0,687.877,685.0,5700,693.0,669.0
176,2015/05/19,696.0,691.478,693.0,2300,696.0,690.0
177,2015/05/20,683.0,683.2,683.0,1500,685.0,683.0
178,2015/05/21,680.0,677.053,670.0,5700,691.0,669.0
179,2015/05/22,680.0,675.18,675.0,3900,680.0,674.0
180,2015/05/25,680.0,670.833,670.0,3000,680.0,670.0
181,2015/05/26,687.0,686.1,686.0,1000,687.0,686.0
182,2015/05/27,687.0,687.0,687.0,200,687.0,687.0
183,2015/05/28,690.0,690.0,690.0,100,690.0,690.0
184,2015/05/29,676.0,680.8,690.0,500,690.0,671.0
185,2015/06/01,680.0,680.077,680.0,1300,681.0,680.0
186,2015/06/02,680.0,680.0,680.0,1400,680.0,680.0
187,2015/06/03,676.0,675.046,675.0,2200,676.0,675.0
188,2015/06/04,681.0,677.875,682.0,800,682.0,676.0
189,2015/06/05,683.0,680.167,682.0,600,683.0,679.0
190,2015/06/08,686.0,687.697,683.0,6600,690.0,676.0
191,2015/06/09,679.0,681.667,686.0,300,686.0,679.0
192,2015/06/10,690.0,689.73,679.0,6300,691.0,679.0
193,2015/06/11,689.0,692.333,694.0,300,694.0,689.0
194,2015/06/12,694.0,694.0,694.0,100,694.0,694.0
195,2015/06/15,686.0,686.0,686.0,100,686.0,686.0
196,2015/06/16,678.0,676.667,676.0,300,678.0,676.0
197,2015/06/17,690.0,689.455,684.0,1100,690.0,684.0
198,2015/06/18,690.0,687.0,680.0,1000,690.0,679.0
199,2015/06/19,690.0,690.0,690.0,1100,690.0,690.0
200,2015/06/22,685.0,683.61,685.0,10500,685.0,680.0
201,2015/06/23,695.0,692.688,686.0,1600,695.0,686.0
202,2015/06/24,690.0,690.636,697.0,1100,697.0,690.0
203,2015/06/25,700.0,697.0,691.0,300,700.0,691.0
204,2015/06/26,705.0,704.243,701.0,3700,705.0,701.0
205,2015/06/29,705.0,705.0,705.0,2300,705.0,705.0
206,2015/06/30,0.0,0.0,0.0,0,0.0,0.0
207,2015/07/01,703.0,701.556,700.0,900,704.0,700.0
208,2015/07/02,705.0,705.0,705.0,200,705.0,705.0
209,2015/07/03,687.0,689.4,690.0,1000,690.0,687.0
210,2015/07/06,662.0,689.625,700.0,5600,703.0,652.0
211,2015/07/07,661.0,663.568,665.0,4400,668.0,661.0
212,2015/07/08,665.0,663.429,666.0,700,666.0,662.0
213,2015/07/09,671.0,667.143,665.0,2100,671.0,661.0
214,2015/07/10,675.0,673.0,671.0,200,675.0,671.0
215,2015/07/13,685.0,680.0,685.0,400,685.0,675.0
216,2015/07/14,689.0,689.539,692.0,1300,692.0,684.0
217,2015/07/15,689.0,688.857,689.0,700,689.0,688.0
218,2015/07/16,679.0,681.714,689.0,1400,689.0,678.0
219,2015/07/17,678.0,680.0,682.0,200,682.0,678.0
220,2015/07/21,679.0,679.0,679.0,200,679.0,679.0
221,2015/07/22,670.0,664.833,679.0,4800,679.0,660.0
222,2015/07/23,673.0,671.0,673.0,300,673.0,667.0
223,2015/07/24,680.0,679.781,673.0,3200,680.0,673.0
224,2015/07/27,673.0,685.6,687.0,1000,687.0,673.0
225,2015/07/28,683.0,682.2,682.0,500,683.0,682.0
226,2015/07/29,668.0,664.2,684.0,4000,684.0,653.0
227,2015/07/30,665.0,668.471,671.0,1700,681.0,665.0
228,2015/07/31,670.0,669.688,665.0,1600,674.0,665.0
229,2015/08/03,680.0,679.927,675.0,4100,682.0,675.0
230,2015/08/04,675.0,673.16,685.0,2500,685.0,670.0
231,2015/08/05,678.0,669.921,675.0,3800,678.0,663.0
232,2015/08/06,667.0,667.2,668.0,500,668.0,665.0
233,2015/08/07,668.0,672.167,668.0,1200,678.0,668.0
234,2015/08/10,665.0,667.211,670.0,1900,671.0,661.0
235,2015/08/11,655.0,660.4,661.0,2500,668.0,654.0
236,2015/08/12,655.0,655.01,652.0,9800,669.0,651.0
237,2015/08/13,655.0,655.0,655.0,200,655.0,655.0
238,2015/08/14,0.0,0.0,0.0,0,0.0,0.0
239,2015/08/17,663.0,663.857,664.0,700,665.0,663.0
240,2015/08/18,670.0,669.667,669.0,300,670.0,669.0
241,2015/08/19,670.0,670.0,670.0,100,670.0,670.0
242,2015/08/20,660.0,661.0,662.0,200,662.0,660.0
243,2015/08/21,661.0,661.0,661.0,100,661.0,661.0
244,2015/08/24,640.0,640.833,650.0,600,650.0,638.0
245,2015/08/25,625.0,622.4,646.0,5000,646.0,619.0
246,2015/08/26,637.0,637.0,637.0,400,637.0,637.0
247,2015/08/27,649.0,651.143,652.0,700,652.0,649.0
248,2015/08/28,661.0,663.714,670.0,700,671.0,661.0
249,2015/08/31,0.0,0.0,0.0,0,0.0,0.0
250,2015/09/01,0.0,0.0,0.0,0,0.0,0.0
251,2015/09/02,673.0,669.0,661.0,300,673.0,661.0
252,2015/09/03,662.0,669.125,673.0,800,673.0,662.0
253,2015/09/04,645.0,650.0,655.0,200,655.0,645.0
254,2015/09/07,620.0,626.25,645.0,400,645.0,620.0
255,2015/09/08,613.0,608.667,620.0,1800,620.0,600.0
256,2015/09/09,620.0,620.0,620.0,1000,620.0,620.0
257,2015/09/10,638.0,638.0,638.0,100,638.0,638.0
258,2015/09/11,639.0,639.0,639.0,100,639.0,639.0
259,2015/09/14,639.0,639.0,639.0,100,639.0,639.0
260,2015/09/15,639.0,639.0,639.0,100,639.0,639.0
261,2015/09/16,0.0,0.0,0.0,0,0.0,0.0
262,2015/09/17,638.0,638.0,638.0,100,638.0,638.0
263,2015/09/18,615.0,629.333,638.0,300,638.0,615.0
264,2015/09/24,624.0,621.357,615.0,1400,625.0,615.0
265,2015/09/25,640.0,631.286,629.0,700,640.0,629.0
266,2015/09/28,640.0,644.214,652.0,1400,652.0,628.0
267,2015/09/29,631.0,637.5,644.0,200,644.0,631.0
268,2015/09/30,0.0,0.0,0.0,0,0.0,0.0
269,2015/10/01,631.0,631.333,631.0,600,632.0,631.0
270,2015/10/02,638.0,638.0,638.0,100,638.0,638.0
271,2015/10/05,638.0,638.0,638.0,200,638.0,638.0
272,2015/10/06,638.0,638.2,639.0,500,639.0,638.0
273,2015/10/07,660.0,640.136,638.0,2200,660.0,628.0
274,2015/10/08,653.0,653.0,653.0,100,653.0,653.0
275,2015/10/09,643.0,642.2,653.0,500,653.0,633.0
276,2015/10/13,657.0,645.333,636.0,300,657.0,636.0
277,2015/10/14,636.0,637.667,637.0,600,642.0,636.0
278,2015/10/15,655.0,650.0,645.0,200,655.0,645.0
279,2015/10/16,0.0,0.0,0.0,0,0.0,0.0
280,2015/10/19,0.0,0.0,0.0,0,0.0,0.0
281,2015/10/20,0.0,0.0,0.0,0,0.0,0.0
282,2015/10/21,645.0,645.0,645.0,100,645.0,645.0
283,2015/10/22,645.0,644.5,644.0,400,645.0,644.0
284,2015/10/23,651.0,648.667,645.0,300,651.0,645.0
285,2015/10/26,632.0,631.37,631.0,2700,637.0,631.0
286,2015/10/27,650.0,649.662,633.0,6800,654.0,633.0
287,2015/10/28,650.0,650.0,650.0,200,650.0,650.0
288,2015/10/29,656.0,656.0,656.0,100,656.0,656.0
289,2015/10/30,650.0,651.5,656.0,400,656.0,650.0
290,2015/11/02,650.0,650.0,650.0,100,650.0,650.0
291,2015/11/04,660.0,659.111,656.0,900,660.0,656.0
292,2015/11/05,660.0,660.0,660.0,300,660.0,660.0
293,2015/11/06,652.0,652.182,653.0,1100,653.0,652.0
294,2015/11/09,646.0,646.0,646.0,100,646.0,646.0
295,2015/11/10,638.0,638.0,638.0,300,638.0,638.0
296,2015/11/11,640.0,638.064,632.0,4700,645.0,631.0
297,2015/11/12,645.0,641.25,640.0,400,645.0,640.0
298,2015/11/13,642.0,642.0,642.0,100,642.0,642.0
299,2015/11/16,635.0,626.643,626.0,1400,635.0,626.0
300,2015/11/17,650.0,643.8,626.0,2500,650.0,625.0
301,2015/11/18,650.0,639.0,636.0,1100,650.0,635.0
302,2015/11/19,650.0,650.0,650.0,100,650.0,650.0
303,2015/11/20,650.0,649.455,644.0,1100,650.0,644.0
304,2015/11/24,644.0,644.0,644.0,100,644.0,644.0
305,2015/11/25,647.0,645.0,643.0,200,647.0,643.0
306,2015/11/26,658.0,658.0,658.0,800,658.0,658.0
307,2015/11/27,655.0,655.0,655.0,300,655.0,655.0
308,2015/11/30,659.0,659.125,650.0,3200,660.0,650.0
309,2015/12/01,659.0,659.0,659.0,400,659.0,659.0
310,2015/12/02,659.0,659.0,659.0,100,659.0,659.0
311,2015/12/03,653.0,653.0,653.0,200,653.0,653.0
312,2015/12/04,647.0,651.0,653.0,300,653.0,647.0
313,2015/12/07,664.0,660.0,659.0,700,664.0,659.0
314,2015/12/08,665.0,666.292,670.0,13700,670.0,665.0
315,2015/12/09,0.0,0.0,0.0,0,0.0,0.0
316,2015/12/10,650.0,671.971,678.0,3400,678.0,650.0
317,2015/12/11,660.0,658.269,650.0,2600,661.0,650.0
318,2015/12/14,645.0,649.5,654.0,200,654.0,645.0
319,2015/12/15,640.0,639.762,635.0,2100,640.0,635.0
320,2015/12/16,660.0,648.75,645.0,400,660.0,645.0
321,2015/12/17,640.0,645.0,650.0,200,650.0,640.0
322,2015/12/18,659.0,659.0,659.0,100,659.0,659.0
323,2015/12/21,645.0,647.0,649.0,200,649.0,645.0
324,2015/12/22,0.0,0.0,0.0,0,0.0,0.0
325,2015/12/24,640.0,640.625,645.0,800,645.0,640.0
326,2015/12/25,649.0,652.333,658.0,300,658.0,649.0
327,2015/12/28,659.0,659.0,659.0,800,659.0,659.0
328,2015/12/29,650.0,650.0,650.0,400,650.0,650.0
329,2015/12/30,642.0,640.0,640.0,1000,648.0,631.0
330,2016/01/04,631.0,632.161,642.0,3100,642.0,630.0
331,2016/01/05,640.0,639.524,641.0,2100,641.0,628.0
332,2016/01/06,632.0,635.5,630.0,400,640.0,630.0
333,2016/01/07,625.0,625.0,625.0,100,625.0,625.0
334,2016/01/08,0.0,0.0,0.0,0,0.0,0.0
335,2016/01/12,620.0,620.0,620.0,100,620.0,620.0
336,2016/01/13,0.0,0.0,0.0,0,0.0,0.0
337,2016/01/14,638.0,631.0,630.0,700,638.0,629.0
338,2016/01/15,618.0,618.0,618.0,100,618.0,618.0
339,2016/01/18,615.0,615.0,615.0,1500,615.0,615.0
340,2016/01/19,615.0,615.0,615.0,100,615.0,615.0
341,2016/01/20,610.0,610.0,610.0,1500,610.0,610.0
342,2016/01/21,600.0,592.25,600.0,800,600.0,580.0
343,2016/01/22,600.0,589.143,583.0,700,600.0,583.0
344,2016/01/25,605.0,601.0,600.0,500,605.0,600.0
345,2016/01/26,617.0,617.0,617.0,200,617.0,617.0
346,2016/01/27,630.0,629.143,629.0,700,630.0,629.0
347,2016/01/28,620.0,611.667,610.0,600,620.0,610.0
348,2016/01/29,0.0,0.0,0.0,0,0.0,0.0
349,2016/02/01,630.0,623.875,620.0,800,630.0,620.0
350,2016/02/02,638.0,638.0,638.0,100,638.0,638.0
351,2016/02/03,638.0,638.0,638.0,100,638.0,638.0
352,2016/02/04,638.0,638.0,638.0,100,638.0,638.0
353,2016/02/05,618.0,618.0,618.0,100,618.0,618.0
354,2016/02/08,594.0,594.429,603.0,2800,606.0,587.0
355,2016/02/09,585.0,585.359,594.0,5300,594.0,585.0
356,2016/02/10,580.0,580.0,580.0,300,580.0,580.0
357,2016/02/12,576.0,576.0,576.0,300,576.0,576.0
358,2016/02/15,556.0,556.0,556.0,100,556.0,556.0
359,2016/02/16,0.0,0.0,0.0,0,0.0,0.0
360,2016/02/17,556.0,556.0,556.0,800,556.0,556.0
361,2016/02/18,575.0,575.0,575.0,100,575.0,575.0
362,2016/02/19,551.0,551.0,560.0,1200,560.0,550.0
363,2016/02/22,551.0,551.0,551.0,200,551.0,551.0
364,2016/02/23,555.0,555.25,556.0,400,556.0,555.0
365,2016/02/24,556.0,556.0,556.0,100,556.0,556.0
366,2016/02/25,0.0,0.0,0.0,0,0.0,0.0
367,2016/02/26,566.0,565.933,566.0,1500,566.0,565.0
368,2016/02/29,0.0,0.0,0.0,0,0.0,0.0
369,2016/03/01,600.0,586.0,577.0,300,600.0,577.0
370,2016/03/02,600.0,600.0,600.0,600,600.0,600.0
371,2016/03/03,601.0,585.75,570.0,400,601.0,570.0
372,2016/03/04,0.0,0.0,0.0,0,0.0,0.0
373,2016/03/07,0.0,0.0,0.0,0,0.0,0.0
374,2016/03/08,594.0,594.0,594.0,200,594.0,594.0
375,2016/03/09,580.0,583.333,588.0,600,588.0,580.0
376,2016/03/10,575.0,575.0,575.0,300,575.0,575.0
377,2016/03/11,0.0,0.0,0.0,0,0.0,0.0
378,2016/03/14,580.0,580.0,580.0,100,580.0,580.0
379,2016/03/15,574.0,578.143,580.0,700,580.0,574.0
380,2016/03/16,574.0,574.0,574.0,400,574.0,574.0
381,2016/03/17,574.0,574.0,574.0,100,574.0,574.0
382,2016/03/18,574.0,574.0,574.0,100,574.0,574.0
383,2016/03/22,0.0,0.0,0.0,0,0.0,0.0
384,2016/03/23,600.0,594.51,580.0,5100,600.0,580.0
385,2016/03/24,0.0,0.0,0.0,0,0.0,0.0
386,2016/03/25,600.0,599.667,599.0,300,600.0,599.0
387,2016/03/28,612.0,612.0,612.0,900,612.0,612.0
388,2016/03/29,591.0,591.0,591.0,200,591.0,591.0
389,2016/03/30,585.0,585.0,585.0,100,585.0,585.0
390,2016/03/31,620.0,611.625,585.0,800,620.0,585.0
391,2016/04/01,583.0,613.714,620.0,700,620.0,583.0
392,2016/04/04,580.0,583.0,588.0,300,588.0,580.0
393,2016/04/05,574.0,574.0,574.0,100,574.0,574.0
394,2016/04/06,0.0,0.0,0.0,0,0.0,0.0
395,2016/04/07,568.0,568.0,568.0,100,568.0,568.0
396,2016/04/08,560.0,560.0,560.0,500,560.0,560.0
397,2016/04/11,0.0,0.0,0.0,0,0.0,0.0
398,2016/04/12,0.0,0.0,0.0,0,0.0,0.0
399,2016/04/13,558.0,558.0,558.0,500,558.0,558.0
400,2016/04/14,557.0,557.0,557.0,200,557.0,557.0
401,2016/04/15,556.0,556.0,556.0,200,556.0,556.0
402,2016/04/18,0.0,0.0,0.0,0,0.0,0.0
403,2016/04/19,0.0,0.0,0.0,0,0.0,0.0
404,2016/04/20,551.0,550.286,550.0,700,551.0,550.0
405,2016/04/21,553.0,554.684,551.0,3800,560.0,551.0
406,2016/04/22,570.0,568.893,555.0,2800,577.0,555.0
407,2016/04/25,0.0,0.0,0.0,0,0.0,0.0
408,2016/04/26,581.0,581.0,581.0,800,581.0,581.0
409,2016/04/27,581.0,581.0,581.0,100,581.0,581.0
410,2016/04/28,561.0,566.0,575.0,500,575.0,560.0
411,2016/05/02,567.0,582.889,588.0,900,597.0,567.0
412,2016/05/06,567.0,567.0,567.0,400,567.0,567.0
413,2016/05/09,568.0,568.0,568.0,200,568.0,568.0
414,2016/05/10,0.0,0.0,0.0,0,0.0,0.0
415,2016/05/11,571.0,571.0,571.0,100,571.0,571.0
416,2016/05/12,580.0,580.0,580.0,300,580.0,580.0
417,2016/05/13,586.0,586.0,586.0,100,586.0,586.0
418,2016/05/16,590.0,590.0,588.0,400,591.0,588.0
419,2016/05/17,591.0,594.111,597.0,900,597.0,590.0
420,2016/05/18,585.0,585.0,585.0,100,585.0,585.0
421,2016/05/19,564.0,564.6,579.0,2000,579.0,562.0
422,2016/05/20,562.0,569.316,566.0,3800,580.0,562.0
423,2016/05/23,561.0,561.0,561.0,200,561.0,561.0
424,2016/05/24,560.0,560.75,561.0,400,561.0,560.0
425,2016/05/25,561.0,561.273,560.0,1100,564.0,560.0
426,2016/05/26,558.0,559.818,560.0,1100,560.0,558.0
427,2016/05/27,558.0,557.929,557.0,1400,558.0,557.0
428,2016/05/30,559.0,559.0,559.0,100,559.0,559.0
429,2016/05/31,0.0,0.0,0.0,0,0.0,0.0
430,2016/06/01,559.0,559.0,559.0,100,559.0,559.0
431,2016/06/02,555.0,556.0,565.0,1000,565.0,555.0
432,2016/06/03,552.0,552.0,552.0,200,552.0,552.0
433,2016/06/06,567.0,564.0,558.0,300,567.0,558.0
434,2016/06/07,568.0,567.0,566.0,200,568.0,566.0
435,2016/06/08,561.0,560.044,558.0,2300,561.0,557.0
436,2016/06/09,0.0,0.0,0.0,0,0.0,0.0
437,2016/06/10,0.0,0.0,0.0,0,0.0,0.0
438,2016/06/13,565.0,563.667,561.0,300,565.0,561.0
439,2016/06/14,0.0,0.0,0.0,0,0.0,0.0
440,2016/06/15,0.0,0.0,0.0,0,0.0,0.0
441,2016/06/16,551.0,551.0,551.0,1200,551.0,551.0
442,2016/06/17,551.0,551.333,551.0,600,553.0,551.0
443,2016/06/20,551.0,551.098,551.0,5100,555.0,551.0
444,2016/06/21,549.0,549.083,550.0,1200,550.0,549.0
445,2016/06/22,0.0,0.0,0.0,0,0.0,0.0
446,2016/06/23,550.0,550.0,550.0,100,550.0,550.0
447,2016/06/24,0.0,0.0,0.0,0,0.0,0.0
448,2016/06/27,561.0,561.0,561.0,3600,561.0,561.0
449,2016/06/28,550.0,550.0,550.0,300,550.0,550.0
450,2016/06/29,550.0,550.0,550.0,100,550.0,550.0
451,2016/06/30,541.0,547.0,550.0,300,550.0,541.0
452,2016/07/01,547.0,549.25,550.0,400,550.0,547.0
453,2016/07/04,548.0,547.25,547.0,400,548.0,547.0
454,2016/07/05,540.0,531.471,528.0,1700,540.0,528.0
455,2016/07/06,531.0,531.0,531.0,200,531.0,531.0
456,2016/07/07,541.0,541.041,541.0,4900,542.0,541.0
457,2016/07/08,526.0,525.667,524.0,300,527.0,524.0
458,2016/07/11,524.0,524.0,524.0,100,524.0,524.0
459,2016/07/12,526.0,525.714,524.0,700,526.0,524.0
460,2016/07/13,524.0,525.167,524.0,600,530.0,524.0
461,2016/07/14,524.0,523.0,524.0,1600,527.0,521.0
462,2016/07/15,521.0,520.154,520.0,1300,521.0,520.0
463,2016/07/19,524.0,521.167,520.0,600,524.0,520.0
464,2016/07/20,518.0,520.25,524.0,400,524.0,518.0
465,2016/07/21,518.0,518.0,518.0,600,518.0,518.0
466,2016/07/22,516.0,512.857,518.0,2100,518.0,510.0
467,2016/07/25,527.0,532.0,535.0,600,535.0,525.0
468,2016/07/26,520.0,529.091,530.0,1100,530.0,520.0
469,2016/07/27,514.0,515.824,514.0,1700,518.0,514.0
470,2016/07/28,515.0,514.25,513.0,800,515.0,513.0
471,2016/07/29,512.0,512.333,513.0,300,513.0,512.0
472,2016/08/01,516.0,514.2,512.0,500,517.0,512.0
473,2016/08/02,517.0,517.571,516.0,700,520.0,516.0
474,2016/08/03,517.0,517.0,517.0,400,517.0,517.0
475,2016/08/04,517.0,517.0,517.0,100,517.0,517.0
476,2016/08/05,522.0,518.667,517.0,300,522.0,517.0
477,2016/08/08,518.0,518.0,518.0,100,518.0,518.0
478,2016/08/09,521.0,522.75,520.0,400,525.0,520.0
479,2016/08/10,515.0,517.0,518.0,300,518.0,515.0
480,2016/08/12,512.0,512.8,513.0,500,513.0,512.0
481,2016/08/15,510.0,510.0,510.0,400,510.0,510.0
482,2016/08/16,0.0,0.0,0.0,0,0.0,0.0
483,2016/08/17,511.0,510.5,510.0,200,511.0,510.0
484,2016/08/18,0.0,0.0,0.0,0,0.0,0.0
485,2016/08/19,513.0,513.0,513.0,200,513.0,513.0
486,2016/08/22,513.0,514.0,513.0,400,515.0,513.0
487,2016/08/23,502.0,505.0,506.0,1100,506.0,502.0
488,2016/08/24,512.0,511.4,508.0,1000,513.0,508.0
489,2016/08/25,513.0,513.0,513.0,100,513.0,513.0
490,2016/08/26,513.0,513.0,513.0,1200,513.0,513.0
491,2016/08/29,514.0,519.455,520.0,1100,520.0,514.0
492,2016/08/30,504.0,504.0,504.0,700,504.0,504.0
493,2016/08/31,515.0,512.167,504.0,1800,515.0,503.0
494,2016/09/01,515.0,515.0,515.0,300,515.0,515.0
495,2016/09/02,515.0,519.0,520.0,500,520.0,515.0
496,2016/09/05,513.0,512.0,513.0,1500,513.0,507.0
497,2016/09/06,0.0,0.0,0.0,0,0.0,0.0
498,2016/09/07,0.0,0.0,0.0,0,0.0,0.0
499,2016/09/08,513.0,513.0,513.0,200,513.0,513.0
500,2016/09/09,0.0,0.0,0.0,0,0.0,0.0
501,2016/09/12,513.0,513.0,513.0,200,513.0,513.0
502,2016/09/13,0.0,0.0,0.0,0,0.0,0.0
503,2016/09/14,510.0,511.0,512.0,200,512.0,510.0
504,2016/09/15,503.0,503.0,503.0,100,503.0,503.0
505,2016/09/16,501.0,501.0,501.0,500,501.0,501.0
506,2016/09/20,504.0,508.1,509.0,1000,513.0,504.0
507,2016/09/21,505.0,500.296,500.0,2700,505.0,499.0
508,2016/09/23,505.0,507.0,509.0,400,509.0,505.0
509,2016/09/26,513.0,514.818,515.0,2200,515.0,513.0
510,2016/09/27,510.0,511.5,513.0,600,513.0,510.0
511,2016/09/28,505.0,505.0,505.0,200,505.0,505.0
512,2016/09/29,506.0,505.333,505.0,300,506.0,505.0
513,2016/09/30,505.0,505.0,505.0,900,505.0,505.0
514,2016/10/03,505.0,505.0,505.0,1400,505.0,505.0
515,2016/10/04,501.0,503.4,505.0,1000,505.0,501.0
516,2016/10/05,506.0,506.0,506.0,300,506.0,506.0
517,2016/10/06,505.0,505.4,506.0,500,506.0,505.0
518,2016/10/07,505.0,505.333,505.0,900,506.0,505.0
519,2016/10/11,506.0,506.0,506.0,800,506.0,506.0
520,2016/10/12,505.0,505.0,505.0,200,505.0,505.0
521,2016/10/13,504.0,504.0,504.0,100,504.0,504.0
522,2016/10/14,505.0,503.5,503.0,400,505.0,503.0
523,2016/10/17,505.0,506.714,508.0,700,508.0,505.0
524,2016/10/18,503.0,505.571,508.0,700,508.0,503.0
525,2016/10/19,505.0,503.667,505.0,600,505.0,503.0
526,2016/10/20,506.0,503.2,505.0,1000,506.0,502.0
527,2016/10/21,505.0,504.0,503.0,200,505.0,503.0
528,2016/10/24,503.0,501.9,505.0,4000,507.0,497.0
529,2016/10/25,505.0,506.8,505.0,500,508.0,505.0
530,2016/10/26,507.0,509.25,510.0,2400,510.0,507.0
531,2016/10/27,513.0,510.688,505.0,1600,513.0,505.0
532,2016/10/28,513.0,510.769,505.0,1300,513.0,505.0
533,2016/10/31,512.0,509.875,510.0,1600,512.0,508.0
534,2016/11/01,512.0,507.056,505.0,1800,512.0,505.0
535,2016/11/02,513.0,511.378,507.0,3700,513.0,507.0
536,2016/11/04,511.0,510.333,511.0,900,511.0,507.0
537,2016/11/07,514.0,512.533,506.0,3000,515.0,506.0
538,2016/11/08,510.0,508.857,507.0,700,510.0,507.0
539,2016/11/09,502.0,505.714,508.0,2100,510.0,502.0
540,2016/11/10,510.0,508.625,502.0,1600,510.0,502.0
541,2016/11/11,505.0,505.0,505.0,200,505.0,505.0
542,2016/11/14,510.0,508.5,507.0,800,510.0,507.0
543,2016/11/15,506.0,505.5,505.0,400,506.0,505.0
544,2016/11/16,512.0,509.667,507.0,1500,512.0,507.0
545,2016/11/17,512.0,509.857,507.0,1400,512.0,507.0
546,2016/11/18,515.0,513.882,512.0,1700,515.0,512.0
547,2016/11/21,517.0,518.333,515.0,3600,521.0,515.0
548,2016/11/22,517.0,518.4,517.0,1000,522.0,515.0
549,2016/11/24,532.0,526.58,524.0,8100,532.0,521.0
550,2016/11/25,526.0,528.174,528.0,2300,530.0,525.0
551,2016/11/28,523.0,525.714,526.0,2800,531.0,521.0
552,2016/11/29,515.0,517.151,520.0,5300,520.0,515.0
553,2016/11/30,525.0,519.96,520.0,2500,525.0,518.0
554,2016/12/01,525.0,524.938,525.0,1600,526.0,523.0
555,2016/12/02,524.0,527.71,526.0,3100,532.0,524.0
556,2016/12/05,537.0,535.54,534.0,5000,547.0,523.0
557,2016/12/06,530.0,531.4,528.0,2500,535.0,527.0
558,2016/12/07,540.0,543.373,530.0,7500,550.0,530.0
559,2016/12/08,541.0,542.303,540.0,3300,545.0,540.0
560,2016/12/09,540.0,542.136,541.0,2200,544.0,540.0
561,2016/12/12,538.0,539.79,541.0,1900,545.0,537.0
562,2016/12/13,539.0,540.286,538.0,700,546.0,538.0
563,2016/12/14,534.0,534.01,540.0,10200,540.0,527.0
564,2016/12/15,538.0,539.239,538.0,6700,542.0,530.0
565,2016/12/16,555.0,547.987,540.0,15700,555.0,540.0
566,2016/12/19,554.0,561.674,545.0,4600,572.0,545.0
567,2016/12/20,545.0,549.941,553.0,1700,554.0,542.0
568,2016/12/21,543.0,549.359,545.0,5300,555.0,543.0
569,2016/12/22,541.0,540.578,540.0,6400,543.0,540.0
570,2016/12/26,542.0,549.82,551.0,5000,551.0,542.0
571,2016/12/27,545.0,545.429,542.0,7700,549.0,537.0
572,2016/12/28,543.0,543.625,542.0,800,545.0,542.0
573,2016/12/29,555.0,553.3,542.0,11000,556.0,541.0
574,2016/12/30,556.0,554.437,558.0,7100,558.0,542.0
575,2017/01/04,562.0,559.825,556.0,4000,573.0,555.0
576,2017/01/05,563.0,567.714,563.0,700,575.0,563.0
577,2017/01/06,575.0,572.08,556.0,5000,578.0,552.0
578,2017/01/10,565.0,565.083,561.0,1200,571.0,561.0
579,2017/01/11,567.0,567.612,559.0,4900,575.0,558.0
580,2017/01/12,572.0,571.0,570.0,200,572.0,570.0
581,2017/01/13,571.0,571.941,574.0,1700,577.0,570.0
582,2017/01/16,570.0,575.612,571.0,4900,584.0,570.0
583,2017/01/17,570.0,570.0,570.0,300,570.0,570.0
584,2017/01/18,569.0,573.746,571.0,5500,580.0,568.0
585,2017/01/19,566.0,568.267,569.0,1500,569.0,566.0
586,2017/01/20,566.0,566.667,566.0,600,567.0,566.0
587,2017/01/23,565.0,565.667,566.0,300,566.0,565.0
588,2017/01/24,566.0,565.5,565.0,200,566.0,565.0
589,2017/01/25,570.0,570.053,566.0,1900,572.0,566.0
590,2017/01/26,564.0,573.278,576.0,1800,576.0,564.0
591,2017/01/27,562.0,563.765,564.0,1700,565.0,562.0
592,2017/01/30,569.0,567.191,563.0,2100,570.0,562.0
593,2017/01/31,567.0,567.0,567.0,100,567.0,567.0
594,2017/02/01,569.0,568.539,567.0,1300,570.0,567.0
595,2017/02/02,565.0,565.938,570.0,1600,570.0,562.0
596,2017/02/03,566.0,566.0,566.0,200,566.0,566.0
597,2017/02/06,554.0,560.628,566.0,5100,567.0,550.0
598,2017/02/07,560.0,560.0,553.0,1600,565.0,551.0
599,2017/02/08,555.0,558.3,560.0,5000,562.0,551.0
600,2017/02/09,557.0,556.17,555.0,5900,562.0,549.0
601,2017/02/10,559.0,558.125,557.0,800,560.0,557.0
602,2017/02/13,561.0,568.2,572.0,500,572.0,561.0
603,2017/02/14,562.0,565.339,561.0,5600,571.0,558.0
604,2017/02/15,558.0,558.75,562.0,3200,562.0,552.0
605,2017/02/16,563.0,564.0,558.0,400,568.0,558.0
606,2017/02/17,565.0,565.0,564.0,500,566.0,564.0
607,2017/02/20,573.0,574.667,579.0,900,579.0,570.0
608,2017/02/21,573.0,574.048,573.0,4200,578.0,572.0
609,2017/02/22,573.0,575.103,573.0,3900,580.0,573.0
610,2017/02/23,581.0,580.128,580.0,3900,581.0,580.0
611,2017/02/24,585.0,590.143,586.0,4200,600.0,583.0
612,2017/02/27,590.0,595.207,595.0,2900,597.0,590.0
613,2017/02/28,590.0,591.952,592.0,2100,594.0,590.0
614,2017/03/01,584.0,580.116,590.0,4300,595.0,575.0
615,2017/03/02,585.0,583.75,584.0,4800,596.0,579.0
616,2017/03/03,585.0,585.0,585.0,100,585.0,585.0
617,2017/03/06,585.0,585.125,585.0,1600,586.0,585.0
618,2017/03/07,585.0,585.0,585.0,2500,585.0,585.0
619,2017/03/08,581.0,580.353,580.0,1700,581.0,580.0
620,2017/03/09,579.0,579.857,581.0,700,581.0,579.0
621,2017/03/10,563.0,577.0,579.0,5300,583.0,563.0
622,2017/03/13,580.0,578.647,576.0,1700,580.0,576.0
623,2017/03/14,581.0,581.7,582.0,2000,584.0,581.0
624,2017/03/15,579.0,579.375,581.0,800,581.0,578.0
625,2017/03/16,583.0,580.591,578.0,2200,583.0,578.0
626,2017/03/17,578.0,578.392,578.0,5100,582.0,578.0
627,2017/03/21,581.0,585.35,580.0,4000,593.0,578.0
628,2017/03/22,585.0,584.756,582.0,27500,587.0,575.0
629,2017/03/23,593.0,590.74,577.0,25400,594.0,575.0
630,2017/03/24,598.0,595.924,595.0,6600,599.0,589.0
631,2017/03/27,598.0,596.0,595.0,3500,600.0,593.0
632,2017/03/28,595.0,597.032,598.0,6300,598.0,595.0
633,2017/03/29,592.0,592.523,594.0,13000,599.0,589.0
634,2017/03/30,592.0,598.129,592.0,3100,600.0,592.0
635,2017/03/31,594.0,600.857,592.0,2100,615.0,592.0
636,2017/04/03,595.0,592.584,594.0,10100,597.0,576.0
637,2017/04/04,585.0,584.724,595.0,7600,595.0,571.0
638,2017/04/05,587.0,585.94,575.0,63400,587.0,574.0
639,2017/04/06,587.0,586.873,587.0,46600,587.0,577.0
640,2017/04/07,596.0,592.577,587.0,2600,596.0,587.0
641,2017/04/10,590.0,595.0,596.0,1500,597.0,590.0
642,2017/04/11,596.0,592.675,589.0,4000,596.0,589.0
643,2017/04/12,590.0,589.931,586.0,5800,590.0,586.0
644,2017/04/13,589.0,592.84,596.0,2500,596.0,589.0
645,2017/04/14,597.0,593.688,589.0,1600,597.0,589.0
646,2017/04/17,588.0,591.3,597.0,3000,597.0,588.0
647,2017/04/18,594.0,591.0,596.0,1400,596.0,590.0
648,2017/04/19,582.0,589.375,594.0,800,594.0,582.0
649,2017/04/20,0.0,0.0,0.0,0,0.0,0.0
650,2017/04/21,582.0,585.417,584.0,1200,588.0,582.0
651,2017/04/24,584.0,588.833,584.0,600,594.0,584.0
652,2017/04/25,590.0,589.182,584.0,2200,592.0,584.0
653,2017/04/26,615.0,601.727,600.0,2200,622.0,590.0
654,2017/04/27,620.0,621.296,621.0,2700,628.0,620.0
655,2017/04/28,620.0,622.75,629.0,800,629.0,620.0
656,2017/05/01,636.0,632.2,621.0,500,641.0,621.0
657,2017/05/02,616.0,626.969,637.0,3200,637.0,616.0
658,2017/05/08,601.0,597.703,595.0,7400,605.0,595.0
659,2017/05/09,609.0,602.292,600.0,2400,609.0,596.0
660,2017/05/10,600.0,600.0,600.0,1500,600.0,600.0
661,2017/05/11,595.0,595.0,595.0,200,595.0,595.0
662,2017/05/12,591.0,591.0,591.0,500,591.0,591.0
663,2017/05/15,602.0,623.087,629.0,2300,629.0,602.0
664,2017/05/16,602.0,602.667,608.0,900,608.0,602.0
665,2017/05/17,602.0,599.333,598.0,600,602.0,598.0
666,2017/05/18,595.0,599.7,602.0,2000,610.0,595.0
667,2017/05/19,595.0,594.833,594.0,600,595.0,594.0
668,2017/05/22,602.0,608.222,612.0,900,612.0,602.0
669,2017/05/23,622.0,622.267,622.0,3000,623.0,622.0
670,2017/05/24,625.0,624.0,623.0,200,625.0,623.0
671,2017/05/25,623.0,617.667,623.0,900,623.0,610.0
672,2017/05/26,634.0,626.81,624.0,2100,634.0,624.0
673,2017/05/29,630.0,630.615,634.0,1300,634.0,630.0
674,2017/05/30,625.0,625.0,625.0,200,625.0,625.0
675,2017/05/31,627.0,625.0,625.0,300,627.0,623.0
676,2017/06/01,627.0,627.0,627.0,500,627.0,627.0
677,2017/06/02,624.0,623.5,625.0,400,625.0,621.0
678,2017/06/05,0.0,0.0,0.0,0,0.0,0.0
679,2017/06/06,621.0,622.5,624.0,200,624.0,621.0
680,2017/06/07,615.0,615.16,621.0,2500,628.0,609.0
681,2017/06/08,615.0,614.636,615.0,1100,615.0,611.0
682,2017/06/09,615.0,615.0,615.0,100,615.0,615.0
683,2017/06/12,614.0,616.75,615.0,400,624.0,614.0
684,2017/06/13,614.0,614.0,614.0,200,614.0,614.0
685,2017/06/14,614.0,614.0,614.0,200,614.0,614.0
686,2017/06/15,614.0,614.0,614.0,100,614.0,614.0
687,2017/06/16,614.0,614.0,614.0,400,614.0,614.0
688,2017/06/19,620.0,619.4,618.0,1000,620.0,618.0
689,2017/06/20,614.0,618.5,620.0,1200,623.0,614.0
690,2017/06/21,611.0,611.0,611.0,400,611.0,611.0
691,2017/06/22,617.0,616.143,618.0,700,618.0,614.0
692,2017/06/23,619.0,618.5,618.0,800,620.0,618.0
693,2017/06/26,617.0,620.364,627.0,4400,628.0,607.0
694,2017/06/27,619.0,617.5,617.0,400,619.0,617.0
695,2017/06/28,620.0,619.667,620.0,900,620.0,619.0
696,2017/06/29,618.0,619.143,620.0,700,620.0,618.0
697,2017/06/30,613.0,616.333,618.0,300,618.0,613.0
698,2017/07/03,626.0,625.263,625.0,1900,626.0,625.0
699,2017/07/04,638.0,639.063,638.0,1600,640.0,638.0
700,2017/07/05,652.0,650.5,650.0,1400,652.0,650.0
701,2017/07/06,654.0,650.9,652.0,4000,660.0,640.0
702,2017/07/07,639.0,639.313,644.0,1600,644.0,635.0
703,2017/07/10,639.0,639.0,639.0,200,639.0,639.0
704,2017/07/11,639.0,637.25,635.0,800,639.0,635.0
705,2017/07/12,637.0,637.546,643.0,1100,643.0,637.0
706,2017/07/13,640.0,642.286,637.0,700,645.0,637.0
707,2017/07/14,637.0,637.0,637.0,100,637.0,637.0
708,2017/07/18,640.0,640.0,640.0,700,640.0,640.0
709,2017/07/19,625.0,629.069,633.0,2900,633.0,621.0
710,2017/07/20,631.0,628.2,626.0,500,631.0,626.0
711,2017/07/21,634.0,634.571,635.0,700,635.0,634.0
712,2017/07/24,638.0,638.55,639.0,2000,640.0,637.0
713,2017/07/25,654.0,651.72,650.0,2500,655.0,650.0
714,2017/07/26,670.0,668.207,667.0,2900,673.0,667.0
715,2017/07/27,675.0,673.462,677.0,3900,677.0,665.0
716,2017/07/28,664.0,668.0,675.0,800,675.0,664.0
717,2017/07/31,659.0,661.278,663.0,1800,663.0,659.0
718,2017/08/01,656.0,659.75,659.0,2000,667.0,655.0
719,2017/08/02,680.0,680.196,680.0,5100,682.0,680.0
720,2017/08/03,670.0,670.0,670.0,600,670.0,670.0
721,2017/08/04,669.0,669.0,669.0,100,669.0,669.0
722,2017/08/07,666.0,666.75,669.0,400,669.0,666.0
723,2017/08/08,667.0,666.25,666.0,400,667.0,666.0
724,2017/08/09,653.0,653.0,653.0,200,653.0,653.0
725,2017/08/10,653.0,653.0,653.0,100,653.0,653.0
726,2017/08/14,651.0,651.0,651.0,200,651.0,651.0
727,2017/08/15,650.0,650.0,650.0,400,650.0,650.0
728,2017/08/16,641.0,639.813,641.0,1600,642.0,634.0
729,2017/08/17,651.0,648.333,641.0,900,651.0,641.0
730,2017/08/18,644.0,644.0,644.0,500,644.0,644.0
731,2017/08/21,641.0,641.273,642.0,1100,642.0,641.0
732,2017/08/22,642.0,641.375,641.0,800,642.0,640.0
733,2017/08/23,641.0,642.5,643.0,600,648.0,641.0
734,2017/08/24,653.0,642.95,641.0,2000,653.0,641.0
735,2017/08/25,644.0,643.455,645.0,1100,645.0,643.0
736,2017/08/28,650.0,649.909,651.0,1100,651.0,645.0
737,2017/08/29,650.0,650.0,650.0,100,650.0,650.0
738,2017/08/30,644.0,644.0,644.0,100,644.0,644.0
739,2017/08/31,640.0,635.765,645.0,1700,645.0,631.0
740,2017/09/01,655.0,645.889,640.0,1800,655.0,640.0
741,2017/09/04,655.0,655.0,655.0,500,655.0,655.0
742,2017/09/05,647.0,647.571,648.0,700,648.0,647.0
743,2017/09/06,647.0,647.0,647.0,100,647.0,647.0
744,2017/09/07,648.0,648.0,648.0,500,648.0,648.0
745,2017/09/08,645.0,645.667,648.0,900,648.0,645.0
746,2017/09/11,646.0,648.429,645.0,1400,655.0,645.0
747,2017/09/12,0.0,0.0,0.0,0,0.0,0.0
748,2017/09/13,648.0,648.588,649.0,1700,650.0,648.0
749,2017/09/14,648.0,646.0,645.0,600,648.0,645.0
750,2017/09/15,652.0,648.75,648.0,800,652.0,648.0
751,2017/09/19,670.0,666.267,665.0,4500,670.0,660.0
752,2017/09/20,670.0,669.133,669.0,3000,670.0,665.0
753,2017/09/21,665.0,687.37,679.0,18900,730.0,658.0
754,2017/09/22,671.0,667.035,666.0,2900,672.0,665.0
755,2017/09/25,671.0,677.852,680.0,2700,684.0,671.0
756,2017/09/26,671.0,674.25,679.0,2400,679.0,670.0
757,2017/09/27,670.0,670.0,670.0,600,670.0,670.0
758,2017/09/28,679.0,679.0,679.0,1000,679.0,679.0
759,2017/09/29,670.0,673.143,675.0,700,675.0,670.0
760,2017/10/02,664.0,667.08,670.0,2500,670.0,664.0
761,2017/10/03,671.0,668.158,664.0,1900,671.0,664.0
762,2017/10/04,684.0,671.546,670.0,2200,684.0,666.0
763,2017/10/05,685.0,685.0,685.0,500,685.0,685.0
764,2017/10/06,667.0,671.69,673.0,2900,675.0,667.0
765,2017/10/10,670.0,668.333,667.0,900,670.0,667.0
766,2017/10/11,667.0,667.8,667.0,2000,669.0,667.0
767,2017/10/12,671.0,672.5,673.0,600,675.0,671.0
768,2017/10/13,753.0,722.009,685.0,32200,761.0,685.0
769,2017/10/16,737.0,741.242,738.0,12400,761.0,726.0
770,2017/10/17,730.0,726.0,737.0,3600,737.0,709.0
771,2017/10/18,716.0,718.515,729.0,6800,729.0,703.0
772,2017/10/19,866.0,834.867,728.0,84000,866.0,720.0
773,2017/10/20,1016.0,1016.0,1016.0,30700,1016.0,1016.0
774,2017/10/23,1316.0,1316.0,1316.0,115400,1316.0,1316.0
775,2017/10/24,1616.0,1616.0,1616.0,103200,1616.0,1616.0
776,2017/10/25,1580.0,1816.16,1976.0,1379500,2016.0,1532.0
777,2017/10/26,1390.0,1426.337,1460.0,437600,1520.0,1350.0
778,2017/10/27,1396.0,1383.578,1381.0,260700,1472.0,1310.0
779,2017/10/30,1290.0,1326.095,1368.0,170900,1442.0,1259.0
780,2017/10/31,1303.0,1323.841,1344.0,178800,1371.0,1263.0
781,2017/11/01,1467.0,1478.955,1393.0,1174300,1595.0,1361.0
782,2017/11/02,1310.0,1338.148,1409.0,187500,1417.0,1267.0
783,2017/11/06,1235.0,1242.865,1285.0,75400,1285.0,1220.0
784,2017/11/07,1216.0,1214.587,1245.0,50800,1247.0,1190.0
785,2017/11/08,1213.0,1201.467,1198.0,50500,1231.0,1191.0
786,2017/11/09,1214.0,1228.904,1216.0,40500,1273.0,1203.0
787,2017/11/10,1220.0,1233.833,1238.0,39500,1269.0,1220.0
788,2017/11/13,1254.0,1252.492,1220.0,71600,1299.0,1210.0
789,2017/11/14,1254.0,1244.877,1238.0,42200,1264.0,1222.0
790,2017/11/15,1284.0,1273.693,1260.0,61500,1294.0,1258.0
791,2017/11/16,1190.0,1183.013,1232.0,88100,1232.0,1136.0
792,2017/11/17,1151.0,1156.308,1178.0,62300,1180.0,1139.0
793,2017/11/20,1167.0,1132.951,1157.0,61400,1172.0,1110.0
794,2017/11/21,1250.0,1321.196,1197.0,537100,1450.0,1177.0
795,2017/11/22,1340.0,1286.65,1241.0,146200,1344.0,1220.0
796,2017/11/24,1325.0,1330.395,1370.0,82500,1380.0,1293.0
797,2017/11/27,1368.0,1330.442,1340.0,79200,1369.0,1288.0
798,2017/11/28,1313.0,1343.425,1370.0,61700,1390.0,1308.0
799,2017/11/29,1383.0,1392.283,1373.0,138700,1429.0,1350.0
800,2017/11/30,1308.0,1335.884,1386.0,72400,1399.0,1302.0
801,2017/12/01,1265.0,1288.613,1309.0,40800,1316.0,1260.0
802,2017/12/04,1197.0,1209.722,1251.0,65700,1251.0,1172.0
803,2017/12/05,1181.0,1169.342,1191.0,15800,1191.0,1156.0
804,2017/12/06,1161.0,1178.167,1165.0,16200,1201.0,1150.0
805,2017/12/07,1215.0,1204.259,1188.0,30500,1235.0,1166.0
806,2017/12/08,1190.0,1189.776,1213.0,21900,1213.0,1168.0
807,2017/12/11,1199.0,1189.671,1172.0,14600,1211.0,1155.0
808,2017/12/12,1223.0,1240.197,1212.0,43100,1298.0,1205.0
809,2017/12/13,1223.0,1231.134,1245.0,13400,1253.0,1215.0
810,2017/12/14,1215.0,1198.449,1212.0,13800,1216.0,1181.0
811,2017/12/15,1199.0,1188.586,1207.0,11100,1207.0,1171.0
812,2017/12/18,1185.0,1196.604,1213.0,9600,1213.0,1185.0
813,2017/12/19,1212.0,1202.03,1200.0,16800,1214.0,1187.0
814,2017/12/20,1191.0,1199.397,1210.0,11600,1210.0,1185.0
815,2017/12/21,1222.0,1207.683,1195.0,33800,1234.0,1171.0
816,2017/12/22,1224.0,1214.898,1211.0,5900,1224.0,1208.0
817,2017/12/25,1304.0,1272.029,1248.0,82300,1336.0,1225.0
818,2017/12/26,1324.0,1338.167,1328.0,79900,1381.0,1290.0
819,2017/12/27,1308.0,1292.893,1314.0,37300,1322.0,1267.0
820,2017/12/28,1305.0,1301.346,1310.0,13000,1312.0,1284.0
821,2017/12/29,1282.0,1295.835,1319.0,20000,1320.0,1275.0
822,2018/01/04,1308.0,1299.787,1305.0,19200,1313.0,1287.0
823,2018/01/05,1337.0,1321.732,1301.0,20900,1337.0,1301.0
824,2018/01/09,1325.0,1331.073,1330.0,34500,1359.0,1293.0
825,2018/01/10,1329.0,1323.349,1308.0,15200,1342.0,1308.0
826,2018/01/11,1347.0,1338.0,1312.0,23600,1353.0,1312.0
827,2018/01/12,1359.0,1360.149,1347.0,27500,1376.0,1347.0
828,2018/01/15,1452.0,1429.377,1370.0,150100,1463.0,1366.0
829,2018/01/16,1578.0,1488.729,1469.0,162800,1578.0,1400.0
830,2018/01/17,1526.0,1586.33,1640.0,145100,1640.0,1509.0
831,2018/01/18,1461.0,1513.06,1586.0,62900,1598.0,1461.0
832,2018/01/19,1466.0,1457.789,1461.0,54100,1496.0,1425.0
833,2018/01/22,1535.0,1524.456,1511.0,60800,1549.0,1491.0
834,2018/01/23,1492.0,1499.918,1528.0,45100,1528.0,1485.0
835,2018/01/24,1452.0,1448.333,1490.0,45600,1490.0,1412.0
836,2018/01/25,1420.0,1437.35,1445.0,38600,1490.0,1419.0
837,2018/01/26,1482.0,1447.441,1450.0,34900,1482.0,1416.0
838,2018/01/29,1493.0,1498.697,1505.0,31000,1512.0,1482.0
839,2018/01/30,1477.0,1467.426,1493.0,35700,1496.0,1450.0
840,2018/01/31,1460.0,1456.526,1447.0,21300,1485.0,1435.0
841,2018/02/01,1612.0,1576.703,1490.0,158600,1623.0,1486.0
842,2018/02/02,1686.0,1663.587,1630.0,161200,1698.0,1623.0
843,2018/02/05,1499.0,1500.988,1526.0,242300,1571.0,1426.0
844,2018/02/06,1276.0,1324.65,1381.0,89600,1395.0,1204.0
845,2018/02/07,1255.0,1340.197,1418.0,45200,1418.0,1255.0
846,2018/02/08,1306.0,1309.063,1320.0,12700,1325.0,1286.0
847,2018/02/09,1254.0,1236.923,1223.0,31000,1259.0,1212.0
848,2018/02/13,1200.0,1244.987,1284.0,15100,1297.0,1200.0
849,2018/02/14,1191.0,1186.683,1176.0,18000,1219.0,1159.0
850,2018/02/15,1235.0,1215.485,1191.0,6600,1235.0,1182.0
851,2018/02/16,1237.0,1233.293,1210.0,8200,1267.0,1200.0
852,2018/02/19,1315.0,1282.579,1243.0,32800,1350.0,1216.0
853,2018/02/20,1260.0,1268.3,1304.0,32300,1304.0,1250.0
854,2018/02/21,1284.0,1261.653,1260.0,49800,1302.0,1226.0
855,2018/02/22,1265.0,1268.317,1271.0,15800,1285.0,1258.0
856,2018/02/23,1280.0,1270.232,1266.0,9900,1282.0,1264.0
857,2018/02/26,1308.0,1298.942,1297.0,18800,1319.0,1282.0
858,2018/02/27,1288.0,1300.039,1320.0,17900,1330.0,1286.0
859,2018/02/28,1301.0,1298.8,1285.0,10000,1310.0,1285.0
860,2018/03/01,1300.0,1296.99,1301.0,9500,1307.0,1290.0
861,2018/03/02,1275.0,1271.256,1270.0,13700,1295.0,1262.0
862,2018/03/05,1204.0,1228.895,1274.0,33200,1281.0,1202.0
863,2018/03/06,1228.0,1232.689,1250.0,19300,1258.0,1215.0
864,2018/03/07,1226.0,1226.44,1226.0,9100,1239.0,1218.0
865,2018/03/08,1230.0,1231.12,1230.0,7500,1238.0,1226.0
866,2018/03/09,1227.0,1229.288,1230.0,6600,1240.0,1223.0
867,2018/03/12,1242.0,1233.981,1246.0,10700,1247.0,1227.0
868,2018/03/13,1239.0,1236.137,1242.0,5100,1242.0,1229.0
869,2018/03/14,1244.0,1242.713,1231.0,9400,1255.0,1231.0
870,2018/03/15,1233.0,1239.479,1239.0,7100,1247.0,1232.0
871,2018/03/16,1237.0,1232.487,1233.0,7800,1240.0,1226.0
872,2018/03/19,1196.0,1204.108,1234.0,16700,1234.0,1130.0
873,2018/03/20,1194.0,1174.147,1166.0,6800,1194.0,1160.0
874,2018/03/22,1185.0,1178.945,1196.0,7300,1200.0,1152.0
875,2018/03/23,1133.0,1133.489,1144.0,22300,1195.0,1101.0
876,2018/03/26,1102.0,1096.041,1127.0,14600,1127.0,1071.0
877,2018/03/27,1135.0,1126.06,1130.0,6700,1150.0,1106.0
878,2018/03/28,1267.0,1243.08,1145.0,201700,1295.0,1142.0
879,2018/03/29,1224.0,1256.319,1278.0,56400,1295.0,1220.0
880,2018/03/30,1194.0,1208.886,1253.0,19300,1253.0,1191.0
881,2018/04/02,1193.0,1200.5,1205.0,14800,1229.0,1185.0
882,2018/04/03,1180.0,1171.476,1169.0,8400,1187.0,1156.0
883,2018/04/04,1164.0,1170.468,1192.0,7700,1192.0,1162.0
884,2018/04/05,1255.0,1264.525,1193.0,167100,1327.0,1170.0
885,2018/04/06,1195.0,1227.672,1262.0,44200,1275.0,1190.0
886,2018/04/09,1195.0,1185.419,1190.0,26000,1213.0,1156.0
887,2018/04/10,1191.0,1192.354,1182.0,8200,1208.0,1182.0
888,2018/04/11,1181.0,1189.136,1200.0,10300,1200.0,1177.0
889,2018/04/12,1173.0,1173.57,1181.0,10700,1188.0,1160.0
890,2018/04/13,1187.0,1182.758,1180.0,9900,1194.0,1176.0
891,2018/04/16,1169.0,1173.908,1187.0,11900,1187.0,1163.0
892,2018/04/17,1156.0,1161.887,1164.0,15900,1187.0,1154.0
893,2018/04/18,1182.0,1174.418,1160.0,11000,1189.0,1160.0
894,2018/04/19,1163.0,1165.755,1185.0,10200,1185.0,1157.0
895,2018/04/20,1172.0,1164.073,1163.0,9600,1175.0,1155.0
896,2018/04/23,1183.0,1179.667,1165.0,12600,1200.0,1165.0
897,2018/04/24,1175.0,1182.625,1184.0,4000,1190.0,1175.0
898,2018/04/25,1183.0,1179.92,1175.0,2500,1184.0,1174.0
899,2018/04/26,1183.0,1177.398,1182.0,8300,1183.0,1168.0
900,2018/04/27,1181.0,1175.933,1182.0,4500,1183.0,1170.0
901,2018/05/01,1167.0,1171.618,1166.0,5500,1180.0,1165.0
902,2018/05/02,1178.0,1172.046,1170.0,4400,1179.0,1161.0
903,2018/05/07,1213.0,1226.328,1230.0,113300,1264.0,1200.0
904,2018/05/08,1229.0,1197.188,1200.0,28700,1229.0,1176.0
905,2018/05/09,1205.0,1209.025,1216.0,8100,1217.0,1196.0
906,2018/05/10,1199.0,1199.377,1211.0,6900,1211.0,1191.0
907,2018/05/11,1212.0,1206.819,1199.0,8300,1213.0,1199.0
908,2018/05/14,1174.0,1189.159,1201.0,24600,1202.0,1156.0
909,2018/05/15,1121.0,1147.631,1174.0,21700,1174.0,1120.0
910,2018/05/16,1108.0,1106.144,1101.0,10400,1124.0,1100.0
911,2018/05/17,1153.0,1141.269,1103.0,9300,1189.0,1102.0
912,2018/05/18,1138.0,1143.133,1146.0,4500,1151.0,1138.0
913,2018/05/21,1142.0,1141.482,1142.0,5600,1149.0,1135.0
914,2018/05/22,1147.0,1144.282,1142.0,3900,1148.0,1137.0
915,2018/05/23,1145.0,1142.212,1147.0,3300,1147.0,1135.0
916,2018/05/24,1134.0,1130.727,1138.0,2200,1138.0,1125.0
917,2018/05/25,1111.0,1113.27,1120.0,7400,1130.0,1106.0
918,2018/05/28,1093.0,1101.233,1111.0,8600,1114.0,1091.0
919,2018/05/29,1033.0,1053.317,1081.0,16400,1086.0,1033.0
920,2018/05/30,1015.0,1019.563,1028.0,23800,1033.0,1013.0
921,2018/05/31,1023.0,1013.652,1032.0,6600,1032.0,1006.0
922,2018/06/01,1018.0,1019.511,1024.0,9200,1030.0,1012.0
923,2018/06/04,1036.0,1029.471,1018.0,5100,1045.0,1018.0
924,2018/06/05,1045.0,1051.088,1049.0,6800,1066.0,1045.0
925,2018/06/06,1050.0,1041.828,1035.0,19800,1051.0,1028.0
926,2018/06/07,1058.0,1042.353,1044.0,3400,1060.0,1024.0
927,2018/06/08,1046.0,1046.6,1048.0,500,1048.0,1046.0
928,2018/06/11,1040.0,1051.229,1059.0,3500,1060.0,1030.0
929,2018/06/12,1028.0,1036.056,1040.0,1800,1045.0,1028.0
930,2018/06/13,1030.0,1030.778,1028.0,5400,1032.0,1028.0
931,2018/06/14,1031.0,1030.9,1030.0,1000,1033.0,1030.0
932,2018/06/15,1030.0,1030.211,1031.0,1900,1031.0,1030.0
933,2018/06/18,1025.0,1029.543,1025.0,3500,1034.0,1025.0
934,2018/06/19,1008.0,1007.327,1022.0,9800,1034.0,999.0
935,2018/06/20,1006.0,1001.944,997.0,5400,1006.0,997.0
936,2018/06/21,1004.0,1008.156,998.0,3200,1010.0,998.0
937,2018/06/22,1005.0,1000.13,1000.0,5400,1023.0,980.0
938,2018/06/25,1008.0,1008.437,1000.0,7100,1019.0,1000.0
939,2018/06/26,1005.0,1005.387,997.0,3100,1013.0,995.0
940,2018/06/27,1008.0,1009.525,1009.0,4000,1012.0,1008.0
941,2018/06/28,1008.0,1003.174,1005.0,4600,1014.0,988.0
942,2018/06/29,1011.0,1011.926,1012.0,2700,1017.0,1004.0
943,2018/07/02,1025.0,1021.885,1024.0,5200,1025.0,1014.0
944,2018/07/03,1019.0,1013.475,1019.0,5900,1029.0,1006.0
945,2018/07/04,1001.0,1020.182,1009.0,2200,1023.0,1001.0
946,2018/07/05,1001.0,1003.962,1001.0,5200,1016.0,1001.0
947,2018/07/06,1050.0,1034.032,1025.0,34900,1050.0,1018.0
948,2018/07/09,1051.0,1062.779,1077.0,14500,1085.0,1040.0
949,2018/07/10,1041.0,1062.381,1070.0,14700,1076.0,1041.0
950,2018/07/11,1045.0,1050.0,1031.0,7400,1070.0,1031.0
951,2018/07/12,1014.0,1006.993,1045.0,26700,1045.0,999.0
952,2018/07/13,1008.0,1011.065,1015.0,3100,1015.0,1002.0
953,2018/07/17,1001.0,1003.706,1005.0,6800,1020.0,1001.0
954,2018/07/18,1013.0,1005.951,1005.0,4100,1013.0,1003.0
955,2018/07/19,1013.0,1007.455,1013.0,4400,1025.0,1002.0
956,2018/07/20,1004.0,1006.451,1005.0,5100,1025.0,1002.0
957,2018/07/23,1006.0,1004.732,1010.0,4100,1010.0,1001.0
958,2018/07/24,1016.0,1012.302,1011.0,4300,1020.0,1005.0
959,2018/07/25,1014.0,1009.857,1020.0,9100,1020.0,1005.0
960,2018/07/26,1012.0,1015.843,1022.0,8300,1022.0,1008.0
961,2018/07/27,1079.0,1053.048,1019.0,57800,1079.0,1019.0
962,2018/07/30,989.0,987.092,989.0,46600,999.0,962.0
963,2018/07/31,962.0,972.972,988.0,21400,989.0,962.0
964,2018/08/01,953.0,953.74,962.0,11900,963.0,944.0
965,2018/08/02,939.0,938.78,945.0,15900,954.0,919.0
966,2018/08/03,900.0,914.759,924.0,24500,925.0,900.0
967,2018/08/06,924.0,911.247,907.0,8900,925.0,905.0
968,2018/08/07,923.0,918.861,921.0,12200,928.0,910.0
969,2018/08/08,917.0,914.989,916.0,8700,922.0,910.0
970,2018/08/09,916.0,911.174,917.0,6900,917.0,909.0
971,2018/08/10,892.0,900.602,910.0,9800,910.0,891.0
972,2018/08/13,856.0,859.558,890.0,12000,890.0,849.0
973,2018/08/14,868.0,860.1,856.0,5000,868.0,856.0
974,2018/08/15,838.0,841.057,848.0,17500,852.0,830.0
975,2018/08/16,825.0,817.234,823.0,11100,831.0,807.0
976,2018/08/17,827.0,818.959,820.0,9800,830.0,812.0
977,2018/08/20,801.0,806.248,820.0,13700,823.0,800.0
978,2018/08/21,808.0,800.389,800.0,7200,808.0,796.0
979,2018/08/22,807.0,801.835,803.0,8500,820.0,793.0
980,2018/08/23,832.0,807.671,800.0,8500,833.0,800.0
981,2018/08/24,832.0,827.164,823.0,7300,840.0,818.0
982,2018/08/27,830.0,832.569,831.0,16000,848.0,830.0
983,2018/08/28,831.0,833.667,836.0,7200,838.0,830.0
984,2018/08/29,890.0,877.361,830.0,44900,920.0,828.0
985,2018/08/30,936.0,932.699,905.0,60100,974.0,893.0
986,2018/08/31,930.0,943.765,943.0,31500,968.0,925.0
987,2018/09/03,911.0,911.866,927.0,18600,927.0,900.0
988,2018/09/04,908.0,900.208,896.0,14900,908.0,895.0
989,2018/09/05,896.0,894.232,893.0,9500,907.0,888.0
990,2018/09/06,862.0,871.947,881.0,13100,881.0,862.0
991,2018/09/07,839.0,841.614,852.0,10100,853.0,833.0
992,2018/09/10,854.0,839.106,839.0,9400,858.0,831.0
993,2018/09/11,836.0,837.622,850.0,8200,850.0,830.0
994,2018/09/12,828.0,830.532,836.0,4700,836.0,827.0
995,2018/09/13,836.0,836.417,827.0,2400,837.0,827.0
996,2018/09/14,842.0,839.476,837.0,6300,849.0,837.0
997,2018/09/18,836.0,839.882,842.0,11000,843.0,835.0
998,2018/09/19,847.0,848.458,843.0,20300,865.0,836.0
999,2018/09/20,845.0,844.162,845.0,9900,859.0,835.0
1000,2018/09/21,860.0,858.511,858.0,9000,862.0,851.0
1001,2018/09/25,865.0,859.548,863.0,7300,865.0,853.0
1002,2018/09/26,863.0,868.111,866.0,13500,880.0,849.0
1003,2018/09/27,862.0,864.719,858.0,5700,872.0,858.0
1004,2018/09/28,873.0,875.177,862.0,6200,897.0,862.0
1005,2018/10/01,885.0,888.247,879.0,8500,895.0,879.0
1006,2018/10/02,890.0,887.3,892.0,6000,894.0,883.0
1007,2018/10/03,889.0,884.533,894.0,4500,894.0,880.0
1008,2018/10/04,873.0,880.577,889.0,2600,889.0,873.0
1009,2018/10/05,872.0,871.5,871.0,1800,872.0,871.0
1010,2018/10/09,858.0,862.333,865.0,1500,865.0,858.0
1011,2018/10/10,858.0,858.607,858.0,6100,873.0,831.0
1012,2018/10/11,833.0,829.891,814.0,5500,847.0,814.0
1013,2018/10/12,858.0,836.548,822.0,7300,865.0,817.0
1014,2018/10/15,851.0,853.286,855.0,700,855.0,847.0
1015,2018/10/16,851.0,850.379,850.0,2900,857.0,850.0
1016,2018/10/17,855.0,845.974,865.0,7800,865.0,839.0
1017,2018/10/18,845.0,846.737,856.0,1900,856.0,834.0
1018,2018/10/19,843.0,834.476,840.0,2100,843.0,830.0
1019,2018/10/22,837.0,837.133,838.0,3000,838.0,836.0
1020,2018/10/23,826.0,828.75,837.0,1600,837.0,826.0
1021,2018/10/24,826.0,824.563,831.0,1600,831.0,820.0
1022,2018/10/25,797.0,801.91,805.0,8900,811.0,797.0
1023,2018/10/26,788.0,798.438,812.0,3200,813.0,786.0
1024,2018/10/29,787.0,787.206,788.0,3400,796.0,782.0
1025,2018/10/30,782.0,767.146,757.0,9600,782.0,757.0
1026,2018/10/31,851.0,811.231,797.0,9100,852.0,794.0
1027,2018/11/01,750.0,736.992,716.0,37700,799.0,716.0
1028,2018/11/02,777.0,762.729,752.0,13300,777.0,750.0
1029,2018/11/05,788.0,770.386,768.0,4400,789.0,759.0
1030,2018/11/06,787.0,783.25,794.0,6000,794.0,776.0
1031,2018/11/07,799.0,794.265,787.0,6800,810.0,787.0
1032,2018/11/08,799.0,799.636,799.0,1100,800.0,799.0
1033,2018/11/09,804.0,793.73,799.0,3700,804.0,791.0
1034,2018/11/12,793.0,794.4,804.0,2000,804.0,790.0
1035,2018/11/13,790.0,777.0,771.0,2700,795.0,771.0
1036,2018/11/14,774.0,778.115,779.0,2600,784.0,774.0
1037,2018/11/15,795.0,792.088,774.0,5700,805.0,771.0
1038,2018/11/16,812.0,899.629,895.0,370500,945.0,812.0
1039,2018/11/19,829.0,807.216,813.0,58300,852.0,776.0
1040,2018/11/20,811.0,815.545,814.0,12300,847.0,802.0
1041,2018/11/21,819.0,805.595,801.0,8400,825.0,791.0
1042,2018/11/22,809.0,817.696,816.0,11200,830.0,806.0
1043,2018/11/26,823.0,819.79,825.0,3800,826.0,812.0
1044,2018/11/27,823.0,822.465,826.0,4300,826.0,810.0
1045,2018/11/28,820.0,824.029,823.0,3400,838.0,815.0
1046,2018/11/29,840.0,835.267,827.0,6000,845.0,827.0
1047,2018/11/30,834.0,854.466,844.0,21900,875.0,834.0
1048,2018/12/03,878.0,873.669,843.0,15100,897.0,843.0
1049,2018/12/04,866.0,879.915,874.0,15200,894.0,865.0
1050,2018/12/05,877.0,865.798,866.0,11900,877.0,850.0
1051,2018/12/06,871.0,882.656,877.0,18600,896.0,871.0
1052,2018/12/07,869.0,854.374,879.0,13100,879.0,841.0
1053,2018/12/10,847.0,854.821,867.0,11700,870.0,832.0
1054,2018/12/11,830.0,846.988,853.0,8000,862.0,830.0
1055,2018/12/12,860.0,872.845,865.0,27700,903.0,850.0
1056,2018/12/13,856.0,863.987,864.0,7500,877.0,855.0
1057,2018/12/14,853.0,853.962,855.0,2600,861.0,852.0
1058,2018/12/17,853.0,854.671,854.0,7300,869.0,841.0
1059,2018/12/18,817.0,808.742,852.0,16300,852.0,770.0
1060,2018/12/19,790.0,800.516,817.0,6200,817.0,775.0
1061,2018/12/20,735.0,733.724,757.0,26100,768.0,709.0
1062,2018/12/21,688.0,681.164,720.0,22600,720.0,662.0
1063,2018/12/25,660.0,653.068,660.0,19200,660.0,631.0
1064,2018/12/26,699.0,686.743,673.0,3500,709.0,673.0
1065,2018/12/27,732.0,738.403,757.0,6200,757.0,726.0
1066,2018/12/28,798.0,787.459,755.0,22000,825.0,755.0
1067,2019/01/04,783.0,796.836,807.0,6100,807.0,780.0
1068,2019/01/07,807.0,805.357,799.0,1400,809.0,793.0
1069,2019/01/08,792.0,791.839,801.0,3100,801.0,788.0
1070,2019/01/09,780.0,784.515,804.0,3300,804.0,771.0
1071,2019/01/10,752.0,757.19,765.0,5800,765.0,743.0
1072,2019/01/11,763.0,760.679,769.0,2800,769.0,750.0
1073,2019/01/15,764.0,751.167,753.0,1800,764.0,746.0
1074,2019/01/16,770.0,772.955,765.0,4400,788.0,765.0
1075,2019/01/17,790.0,767.25,770.0,800,790.0,761.0
1076,2019/01/18,775.0,772.615,789.0,1300,789.0,764.0
1077,2019/01/21,785.0,781.958,780.0,7200,787.0,775.0
1078,2019/01/22,775.0,772.783,784.0,4600,784.0,764.0
1079,2019/01/23,773.0,773.5,775.0,600,775.0,768.0
1080,2019/01/24,789.0,781.16,773.0,5000,790.0,773.0
1081,2019/01/25,809.0,801.236,785.0,7200,818.0,785.0
1082,2019/01/28,810.0,791.542,817.0,8300,817.0,777.0
1083,2019/01/29,793.0,794.5,800.0,1400,808.0,788.0
1084,2019/01/30,775.0,789.654,785.0,5200,805.0,771.0
1085,2019/01/31,790.0,786.487,772.0,3900,800.0,772.0
1086,2019/02/01,801.0,800.196,799.0,4600,805.0,791.0
1087,2019/02/04,740.0,739.861,751.0,46100,751.0,728.0
1088,2019/02/05,738.0,735.226,732.0,3100,739.0,732.0
1089,2019/02/06,740.0,743.864,744.0,4400,750.0,740.0
1090,2019/02/07,755.0,744.16,740.0,12500,755.0,740.0
1091,2019/02/08,756.0,757.849,748.0,7300,772.0,747.0
1092,2019/02/12,764.0,757.257,756.0,13600,771.0,756.0
1093,2019/02/13,759.0,755.269,764.0,2600,764.0,749.0
1094,2019/02/14,759.0,759.085,759.0,4700,768.0,758.0
1095,2019/02/15,768.0,760.8,759.0,1500,768.0,759.0
1096,2019/02/18,768.0,763.294,753.0,1700,772.0,753.0
1097,2019/02/19,795.0,773.111,770.0,2700,795.0,759.0
1098,2019/02/20,799.0,789.0,795.0,3400,800.0,773.0
1099,2019/02/21,790.0,789.813,794.0,1600,794.0,783.0
1100,2019/02/22,781.0,782.0,783.0,400,783.0,781.0
1101,2019/02/25,780.0,766.727,766.0,1100,780.0,761.0
1102,2019/02/26,794.0,779.818,780.0,1100,794.0,771.0
1103,2019/02/27,773.0,776.429,779.0,700,779.0,773.0
1104,2019/02/28,778.0,774.833,775.0,600,778.0,773.0
1105,2019/03/01,771.0,776.333,778.0,900,778.0,770.0
1106,2019/03/04,774.0,772.692,772.0,1300,774.0,772.0
1107,2019/03/05,776.0,773.333,768.0,900,776.0,768.0
1108,2019/03/06,770.0,768.2,768.0,1000,770.0,768.0
1109,2019/03/07,770.0,774.417,778.0,1200,778.0,769.0
1110,2019/03/08,758.0,765.65,770.0,2000,770.0,758.0
1111,2019/03/11,765.0,763.286,759.0,1400,765.0,758.0
1112,2019/03/12,784.0,779.688,773.0,8000,785.0,771.0
1113,2019/03/13,785.0,785.0,785.0,500,785.0,785.0
1114,2019/03/14,778.0,778.0,778.0,200,778.0,778.0
1115,2019/03/15,784.0,779.643,778.0,2800,785.0,775.0
1116,2019/03/18,768.0,769.781,769.0,4100,774.0,768.0
1117,2019/03/19,766.0,767.25,770.0,400,770.0,765.0
1118,2019/03/20,770.0,769.333,767.0,900,770.0,767.0
1119,2019/03/22,764.0,774.842,780.0,3800,780.0,764.0
1120,2019/03/25,786.0,770.944,760.0,1800,786.0,760.0
1121,2019/03/26,785.0,776.921,783.0,3800,785.0,768.0
1122,2019/03/27,0.0,0.0,0.0,0,0.0,0.0
1123,2019/03/28,786.0,782.529,773.0,1700,786.0,763.0
1124,2019/03/29,776.0,781.318,777.0,2200,784.0,776.0
1125,2019/04/01,799.0,784.148,776.0,8800,800.0,776.0
1126,2019/04/02,775.0,773.357,783.0,1400,783.0,766.0
1127,2019/04/03,769.0,764.841,767.0,6300,770.0,758.0
1128,2019/04/04,769.0,770.731,769.0,2600,780.0,769.0
1129,2019/04/05,776.0,771.125,769.0,800,776.0,765.0
1130,2019/04/08,780.0,775.125,776.0,800,780.0,772.0
1131,2019/04/09,780.0,773.25,770.0,800,780.0,766.0
1132,2019/04/10,779.0,779.0,779.0,100,779.0,779.0
1133,2019/04/11,772.0,768.546,764.0,4400,780.0,764.0
1134,2019/04/12,770.0,770.5,771.0,600,771.0,770.0
1135,2019/04/15,759.0,761.235,769.0,3400,770.0,757.0
1136,2019/04/16,759.0,759.0,759.0,1300,759.0,759.0
1137,2019/04/17,759.0,760.0,760.0,1200,761.0,759.0
1138,2019/04/18,749.0,756.381,759.0,2100,765.0,749.0
1139,2019/04/19,750.0,747.933,749.0,1500,751.0,741.0
1140,2019/04/22,750.0,743.6,750.0,500,750.0,735.0
1141,2019/04/23,745.0,745.0,750.0,400,750.0,735.0
1142,2019/04/24,733.0,727.0,724.0,500,733.0,724.0
1143,2019/04/25,735.0,734.682,737.0,2200,737.0,730.0
1144,2019/04/26,740.0,748.139,749.0,3600,757.0,740.0
1145,2019/05/07,743.0,743.778,740.0,900,750.0,740.0
1146,2019/05/08,744.0,747.421,743.0,1900,750.0,743.0
1147,2019/05/09,712.0,732.2,742.0,2000,742.0,712.0
1148,2019/05/10,721.0,729.444,727.0,900,734.0,721.0
1149,2019/05/13,672.0,685.1,706.0,5000,706.0,672.0
1150,2019/05/14,675.0,658.462,662.0,1300,675.0,650.0
1151,2019/05/15,637.0,644.337,655.0,10100,655.0,635.0
1152,2019/05/16,682.0,679.833,677.0,7800,700.0,670.0
1153,2019/05/17,710.0,701.367,684.0,3000,715.0,684.0
1154,2019/05/20,732.0,732.233,715.0,7300,740.0,715.0
1155,2019/05/21,732.0,732.0,732.0,1000,732.0,732.0
1156,2019/05/22,756.0,750.671,740.0,8500,756.0,736.0
1157,2019/05/23,749.0,743.909,744.0,1100,749.0,740.0
1158,2019/05/24,740.0,744.07,748.0,4300,750.0,740.0
1159,2019/05/27,722.0,741.105,754.0,1900,754.0,722.0
1160,2019/05/28,740.0,736.615,727.0,1300,740.0,722.0
1161,2019/05/29,760.0,755.705,759.0,7800,760.0,750.0
1162,2019/05/30,774.0,764.63,764.0,4600,776.0,760.0
1163,2019/05/31,751.0,761.558,775.0,4300,775.0,751.0
1164,2019/06/03,756.0,756.143,755.0,1400,757.0,755.0
1165,2019/06/04,769.0,764.024,762.0,4100,769.0,762.0
1166,2019/06/05,762.0,765.039,770.0,2600,770.0,761.0
1167,2019/06/06,757.0,800.732,770.0,54900,865.0,750.0
1168,2019/06/07,765.0,757.565,760.0,11500,780.0,733.0
1169,2019/06/10,765.0,761.62,765.0,5000,769.0,748.0
1170,2019/06/11,844.0,841.802,776.0,130900,910.0,758.0
1171,2019/06/12,994.0,945.829,870.0,826600,994.0,840.0
1172,2019/06/13,928.0,965.565,1009.0,274500,1024.0,899.0
1173,2019/06/14,865.0,876.731,909.0,65800,909.0,846.0
1174,2019/06/17,852.0,847.314,847.0,25800,863.0,826.0
1175,2019/06/18,805.0,837.054,860.0,20300,862.0,802.0
1176,2019/06/19,805.0,807.289,806.0,4500,816.0,805.0
1177,2019/06/20,800.0,801.844,806.0,3200,806.0,795.0
1178,2019/06/21,803.0,814.9,808.0,3000,823.0,803.0
1179,2019/06/24,820.0,813.385,809.0,3900,820.0,809.0
1180,2019/06/25,820.0,807.359,807.0,3900,820.0,802.0
1181,2019/06/26,802.0,808.344,810.0,3200,810.0,802.0
1182,2019/06/27,810.0,803.857,803.0,4200,810.0,802.0
1183,2019/06/28,790.0,788.481,810.0,10400,810.0,770.0
1184,2019/07/01,797.0,798.118,802.0,3400,802.0,786.0
1185,2019/07/02,800.0,794.563,797.0,1600,800.0,792.0
1186,2019/07/03,800.0,796.467,799.0,1500,800.0,785.0
1187,2019/07/04,801.0,798.727,800.0,1100,802.0,796.0
1188,2019/07/05,790.0,786.65,803.0,2000,803.0,775.0
1189,2019/07/08,797.0,799.7,790.0,3000,806.0,790.0
1190,2019/07/09,797.0,798.0,800.0,600,800.0,797.0
1191,2019/07/10,783.0,790.515,789.0,3300,796.0,783.0
1192,2019/07/11,803.0,799.429,798.0,700,803.0,798.0
1193,2019/07/12,797.0,800.0,803.0,600,803.0,794.0
1194,2019/07/16,791.0,798.889,801.0,900,801.0,791.0
1195,2019/07/17,785.0,788.696,791.0,2300,794.0,785.0
1196,2019/07/18,785.0,789.222,789.0,900,798.0,785.0
1197,2019/07/19,788.0,781.0,785.0,1800,788.0,780.0
1198,2019/07/22,783.0,787.319,792.0,6900,805.0,771.0
1199,2019/07/23,779.0,782.0,783.0,400,783.0,779.0
1200,2019/07/24,790.0,787.417,780.0,1200,791.0,780.0
1201,2019/07/25,780.0,780.091,790.0,2200,790.0,773.0
1202,2019/07/26,785.0,791.795,793.0,3900,793.0,785.0
1203,2019/07/29,786.0,788.9,784.0,1000,792.0,784.0
1204,2019/07/30,786.0,788.333,790.0,300,790.0,786.0
1205,2019/07/31,805.0,794.543,797.0,10500,805.0,778.0
1206,2019/08/01,791.0,787.0,790.0,5000,793.0,780.0
1207,2019/08/02,783.0,783.8,784.0,1000,790.0,782.0
1208,2019/08/05,778.0,777.0,780.0,1300,780.0,775.0
1209,2019/08/06,773.0,765.069,770.0,2900,775.0,757.0
1210,2019/08/07,765.0,765.0,765.0,200,765.0,765.0
1211,2019/08/08,773.0,769.0,765.0,200,773.0,765.0
1212,2019/08/09,765.0,765.5,767.0,400,767.0,765.0
1213,2019/08/13,757.0,759.333,768.0,600,768.0,754.0
1214,2019/08/14,762.0,763.5,765.0,200,765.0,762.0
1215,2019/08/15,765.0,767.5,770.0,200,770.0,765.0
1216,2019/08/16,770.0,764.0,765.0,300,770.0,757.0
1217,2019/08/19,800.0,791.935,770.0,4600,800.0,770.0
1218,2019/08/20,901.0,901.506,860.0,189000,943.0,858.0
1219,2019/08/21,850.0,885.915,915.0,45800,915.0,850.0
1220,2019/08/22,830.0,833.0,834.0,15700,850.0,815.0
1221,2019/08/23,854.0,865.424,830.0,9200,888.0,825.0
