,Date,Close,VWAP,Open,Volume,High,Low
0,2014/08/25,917.0,917.067,919.0,194000,920.0,912.0
1,2014/08/26,914.0,915.146,920.0,226000,922.0,911.0
2,2014/08/27,925.0,923.47,917.0,402000,927.0,917.0
3,2014/08/28,926.0,925.026,927.0,268000,928.0,920.0
4,2014/08/29,926.0,927.76,930.0,262000,933.0,924.0
5,2014/09/01,936.0,934.735,933.0,272000,938.0,929.0
6,2014/09/02,934.0,936.938,940.0,211000,940.0,933.0
7,2014/09/03,928.0,928.96,940.0,277000,940.0,923.0
8,2014/09/04,930.0,929.408,934.0,152000,934.0,924.0
9,2014/09/05,921.0,924.0,930.0,213000,930.0,921.0
10,2014/09/08,931.0,927.151,928.0,218000,932.0,920.0
11,2014/09/09,928.0,929.031,933.0,163000,933.0,926.0
12,2014/09/10,938.0,933.061,932.0,262000,939.0,927.0
13,2014/09/11,941.0,938.749,940.0,335000,941.0,935.0
14,2014/09/12,940.0,939.893,942.0,328000,942.0,935.0
15,2014/09/16,942.0,938.896,941.0,220000,942.0,935.0
16,2014/09/17,938.0,939.857,943.0,196000,943.0,938.0
17,2014/09/18,940.0,939.66,940.0,279000,942.0,937.0
18,2014/09/19,943.0,942.237,941.0,540000,945.0,938.0
19,2014/09/22,944.0,940.873,937.0,228000,944.0,937.0
20,2014/09/24,945.0,940.889,939.0,288000,945.0,937.0
21,2014/09/25,945.0,942.691,945.0,278000,945.0,939.0
22,2014/09/26,942.0,941.655,941.0,348000,948.0,933.0
23,2014/09/29,938.0,937.848,943.0,178000,943.0,934.0
24,2014/09/30,930.0,930.864,940.0,271000,940.0,924.0
25,2014/10/01,936.0,933.726,930.0,270000,938.0,925.0
26,2014/10/02,922.0,925.539,928.0,475000,934.0,920.0
27,2014/10/03,927.0,925.977,935.0,395000,936.0,917.0
28,2014/10/06,934.0,935.965,935.0,202000,939.0,931.0
29,2014/10/07,928.0,933.947,935.0,247000,939.0,926.0
30,2014/10/08,933.0,931.857,923.0,489000,940.0,916.0
31,2014/10/09,914.0,921.328,930.0,345000,933.0,913.0
32,2014/10/10,893.0,894.59,899.0,322000,904.0,873.0
33,2014/10/14,878.0,883.071,880.0,308000,892.0,871.0
34,2014/10/15,886.0,886.038,888.0,185000,898.0,880.0
35,2014/10/16,871.0,870.694,871.0,359000,880.0,864.0
36,2014/10/17,866.0,874.066,880.0,287000,888.0,864.0
37,2014/10/20,908.0,899.529,874.0,242000,908.0,874.0
38,2014/10/21,892.0,890.65,898.0,260000,898.0,884.0
39,2014/10/22,902.0,900.908,897.0,249000,909.0,892.0
40,2014/10/23,942.0,935.869,921.0,888000,947.0,921.0
41,2014/10/24,942.0,938.641,945.0,465000,945.0,927.0
42,2014/10/27,944.0,944.06,944.0,252000,948.0,938.0
43,2014/10/28,947.0,944.139,944.0,244000,948.0,938.0
44,2014/10/29,949.0,947.644,948.0,362000,949.0,943.0
45,2014/10/30,947.0,947.208,949.0,842000,950.0,943.0
46,2014/10/31,949.0,951.384,947.0,791000,961.0,945.0
47,2014/11/04,944.0,946.978,955.0,642000,959.0,940.0
48,2014/11/05,956.0,950.757,944.0,622000,958.0,942.0
49,2014/11/06,938.0,945.965,954.0,434000,956.0,937.0
50,2014/11/07,953.0,948.983,944.0,362000,955.0,932.0
51,2014/11/10,953.0,951.802,953.0,192000,955.0,946.0
52,2014/11/11,957.0,954.558,950.0,505000,958.0,948.0
53,2014/11/12,977.0,967.824,960.0,1619000,985.0,953.0
54,2014/11/13,979.0,975.208,970.0,505000,981.0,968.0
55,2014/11/14,986.0,982.803,985.0,473000,987.0,976.0
56,2014/11/17,977.0,976.514,981.0,547000,983.0,966.0
57,2014/11/18,1000.0,990.763,982.0,552000,1000.0,980.0
58,2014/11/19,995.0,995.296,997.0,318000,999.0,989.0
59,2014/11/20,995.0,995.348,993.0,319000,1000.0,986.0
60,2014/11/21,1018.0,1005.091,995.0,650000,1019.0,989.0
61,2014/11/25,1059.0,1050.045,1023.0,875000,1064.0,1022.0
62,2014/11/26,1044.0,1048.045,1040.0,356000,1054.0,1040.0
63,2014/11/27,1039.0,1036.609,1044.0,225000,1044.0,1031.0
64,2014/11/28,1048.0,1043.768,1034.0,254000,1048.0,1034.0
65,2014/12/01,1064.0,1056.544,1042.0,397000,1064.0,1042.0
66,2014/12/02,1067.0,1063.864,1058.0,286000,1069.0,1056.0
67,2014/12/03,1050.0,1055.746,1070.0,339000,1071.0,1044.0
68,2014/12/04,1057.0,1055.911,1050.0,303000,1064.0,1049.0
69,2014/12/05,1069.0,1065.767,1053.0,317000,1071.0,1050.0
70,2014/12/08,1078.0,1072.754,1069.0,272000,1079.0,1061.0
71,2014/12/09,1062.0,1068.184,1069.0,201000,1078.0,1061.0
72,2014/12/10,1037.0,1044.619,1053.0,265000,1059.0,1034.0
73,2014/12/11,1028.0,1021.698,1019.0,205000,1032.0,1013.0
74,2014/12/12,1016.0,1025.027,1021.0,336000,1037.0,1016.0
75,2014/12/15,998.0,1007.774,1007.0,310000,1022.0,975.0
76,2014/12/16,979.0,981.3,979.0,210000,988.0,972.0
77,2014/12/17,986.0,985.39,967.0,287000,1008.0,958.0
78,2014/12/18,1012.0,1008.571,1018.0,219000,1018.0,995.0
79,2014/12/19,1023.0,1019.447,1028.0,293000,1034.0,1008.0
80,2014/12/22,1021.0,1014.714,1034.0,217000,1034.0,1000.0
81,2014/12/24,1032.0,1032.138,1035.0,210000,1044.0,1027.0
82,2014/12/25,1024.0,1024.437,1036.0,167000,1036.0,1016.0
83,2014/12/26,1012.0,1013.525,1011.0,204000,1023.0,1007.0
84,2014/12/29,996.0,996.526,1011.0,192000,1012.0,988.0
85,2014/12/30,989.0,991.0,1001.0,120000,1001.0,985.0
86,2015/01/05,981.0,985.229,996.0,131000,996.0,977.0
87,2015/01/06,948.0,956.269,966.0,186000,970.0,946.0
88,2015/01/07,939.0,941.921,934.0,140000,950.0,934.0
89,2015/01/08,940.0,945.942,943.0,189000,953.0,939.0
90,2015/01/09,936.0,935.988,941.0,250000,947.0,930.0
91,2015/01/13,943.0,932.949,933.0,178000,944.0,924.0
92,2015/01/14,932.0,935.495,939.0,109000,944.0,928.0
93,2015/01/15,950.0,944.894,941.0,142000,951.0,935.0
94,2015/01/16,950.0,940.358,936.0,321000,951.0,929.0
95,2015/01/19,945.0,945.481,955.0,187000,955.0,936.0
96,2015/01/20,943.0,944.891,940.0,138000,951.0,939.0
97,2015/01/21,941.0,939.402,941.0,291000,944.0,935.0
98,2015/01/22,980.0,955.436,938.0,642000,982.0,936.0
99,2015/01/23,975.0,976.843,987.0,197000,990.0,965.0
100,2015/01/26,981.0,981.149,992.0,369000,998.0,970.0
101,2015/01/27,992.0,987.893,987.0,150000,992.0,983.0
102,2015/01/28,1003.0,996.5,984.0,228000,1007.0,983.0
103,2015/01/29,994.0,998.247,1003.0,247000,1005.0,990.0
104,2015/01/30,1020.0,1016.449,1006.0,403000,1024.0,1001.0
105,2015/02/02,1011.0,1010.612,1014.0,188000,1017.0,1002.0
106,2015/02/03,1007.0,1010.957,1016.0,235000,1019.0,1003.0
107,2015/02/04,982.0,994.707,1002.0,300000,1014.0,980.0
108,2015/02/05,979.0,980.492,982.0,242000,986.0,973.0
109,2015/02/06,976.0,977.227,986.0,229000,989.0,966.0
110,2015/02/09,992.0,985.841,984.0,163000,992.0,978.0
111,2015/02/10,992.0,990.573,993.0,164000,998.0,982.0
112,2015/02/12,1004.0,1010.491,1019.0,316000,1023.0,1003.0
113,2015/02/13,1014.0,1008.566,999.0,249000,1019.0,991.0
114,2015/02/16,999.0,1009.134,1020.0,283000,1023.0,999.0
115,2015/02/17,1006.0,1003.715,999.0,137000,1010.0,996.0
116,2015/02/18,1011.0,1011.655,1006.0,220000,1018.0,1006.0
117,2015/02/19,1013.0,1011.465,1012.0,187000,1016.0,1004.0
118,2015/02/20,1019.0,1016.978,1018.0,184000,1024.0,1008.0
119,2015/02/23,1010.0,1012.482,1013.0,168000,1019.0,1008.0
120,2015/02/24,1034.0,1026.009,1009.0,326000,1036.0,1006.0
121,2015/02/25,1053.0,1046.567,1036.0,277000,1053.0,1026.0
122,2015/02/26,1062.0,1055.675,1042.0,234000,1063.0,1042.0
123,2015/02/27,1051.0,1054.386,1062.0,210000,1065.0,1047.0
124,2015/03/02,1061.0,1060.442,1054.0,199000,1065.0,1054.0
125,2015/03/03,1065.0,1062.887,1065.0,346000,1069.0,1057.0
126,2015/03/04,1063.0,1057.122,1070.0,320000,1070.0,1048.0
127,2015/03/05,1082.0,1077.768,1065.0,418000,1090.0,1065.0
128,2015/03/06,1077.0,1080.319,1082.0,160000,1088.0,1077.0
129,2015/03/09,1078.0,1071.718,1064.0,170000,1079.0,1052.0
130,2015/03/10,1061.0,1063.742,1072.0,209000,1082.0,1053.0
131,2015/03/11,1058.0,1060.852,1045.0,257000,1072.0,1045.0
132,2015/03/12,1055.0,1061.851,1057.0,436000,1070.0,1053.0
133,2015/03/13,1097.0,1088.717,1085.0,628000,1099.0,1074.0
134,2015/03/16,1086.0,1089.962,1082.0,571000,1103.0,1079.0
135,2015/03/17,1095.0,1088.485,1082.0,536000,1103.0,1076.0
136,2015/03/18,1114.0,1107.46,1104.0,237000,1115.0,1102.0
137,2015/03/19,1106.0,1108.804,1113.0,235000,1117.0,1097.0
138,2015/03/20,1113.0,1110.6,1109.0,250000,1116.0,1100.0
139,2015/03/23,1096.0,1093.857,1105.0,314000,1116.0,1085.0
140,2015/03/24,1102.0,1099.33,1090.0,288000,1107.0,1090.0
141,2015/03/25,1095.0,1095.431,1099.0,202000,1103.0,1085.0
142,2015/03/26,1071.0,1080.273,1097.0,414000,1099.0,1068.0
143,2015/03/27,1052.0,1058.413,1066.0,252000,1077.0,1042.0
144,2015/03/30,1033.0,1032.796,1048.0,401000,1053.0,1024.0
145,2015/03/31,1030.0,1040.224,1052.0,210000,1059.0,1028.0
146,2015/04/01,1017.0,1021.544,1017.0,287000,1030.0,1016.0
147,2015/04/02,1075.0,1061.607,1029.0,351000,1079.0,1023.0
148,2015/04/03,1079.0,1078.099,1090.0,131000,1090.0,1068.0
149,2015/04/06,1083.0,1080.631,1079.0,65000,1087.0,1075.0
150,2015/04/07,1100.0,1096.734,1076.0,203000,1105.0,1073.0
151,2015/04/08,1085.0,1090.515,1100.0,206000,1110.0,1081.0
152,2015/04/09,1085.0,1079.253,1081.0,261000,1089.0,1070.0
153,2015/04/10,1087.0,1086.748,1094.0,135000,1094.0,1079.0
154,2015/04/13,1088.0,1085.698,1082.0,255000,1090.0,1080.0
155,2015/04/14,1117.0,1105.279,1088.0,476000,1119.0,1085.0
156,2015/04/15,1117.0,1119.594,1117.0,394000,1128.0,1109.0
157,2015/04/16,1134.0,1125.099,1115.0,365000,1139.0,1114.0
158,2015/04/17,1149.0,1147.265,1138.0,283000,1154.0,1138.0
159,2015/04/20,1161.0,1155.725,1140.0,305000,1167.0,1138.0
160,2015/04/21,1187.0,1176.217,1146.0,318000,1187.0,1126.0
161,2015/04/22,1258.0,1253.899,1250.0,804000,1290.0,1237.0
162,2015/04/23,1277.0,1269.081,1260.0,458000,1279.0,1253.0
163,2015/04/24,1265.0,1269.415,1277.0,248000,1277.0,1262.0
164,2015/04/27,1276.0,1271.046,1262.0,283000,1279.0,1262.0
165,2015/04/28,1283.0,1281.35,1273.0,186000,1293.0,1270.0
166,2015/04/30,1268.0,1271.666,1288.0,338000,1291.0,1257.0
167,2015/05/01,1249.0,1247.798,1260.0,282000,1260.0,1238.0
168,2015/05/07,1263.0,1255.929,1226.0,394000,1267.0,1226.0
169,2015/05/08,1277.0,1274.898,1260.0,283000,1284.0,1257.0
170,2015/05/11,1292.0,1292.952,1291.0,228000,1298.0,1283.0
171,2015/05/12,1271.0,1263.175,1262.0,378000,1280.0,1238.0
172,2015/05/13,1153.0,1171.521,1233.0,1006000,1259.0,1141.0
173,2015/05/14,1143.0,1137.368,1143.0,435000,1147.0,1124.0
174,2015/05/15,1138.0,1144.894,1154.0,341000,1156.0,1134.0
175,2015/05/18,1155.0,1151.612,1138.0,268000,1165.0,1138.0
176,2015/05/19,1164.0,1166.477,1165.0,361000,1181.0,1157.0
177,2015/05/20,1199.0,1185.468,1171.0,472000,1201.0,1170.0
178,2015/05/21,1249.0,1235.4,1214.0,393000,1249.0,1212.0
179,2015/05/22,1246.0,1253.876,1250.0,386000,1278.0,1240.0
180,2015/05/25,1259.0,1252.756,1246.0,213000,1259.0,1245.0
181,2015/05/26,1297.0,1287.793,1260.0,411000,1303.0,1260.0
182,2015/05/27,1310.0,1300.74,1289.0,327000,1313.0,1284.0
183,2015/05/28,1316.0,1314.845,1330.0,361000,1335.0,1303.0
184,2015/05/29,1295.0,1300.81,1316.0,363000,1321.0,1294.0
185,2015/06/01,1313.0,1301.088,1295.0,272000,1313.0,1288.0
186,2015/06/02,1390.0,1365.278,1319.0,521000,1396.0,1310.0
187,2015/06/03,1458.0,1438.547,1399.0,558000,1464.0,1394.0
188,2015/06/04,1437.0,1438.183,1462.0,262000,1466.0,1427.0
189,2015/06/05,1431.0,1418.614,1416.0,280000,1435.0,1402.0
190,2015/06/08,1433.0,1428.738,1430.0,160000,1439.0,1411.0
191,2015/06/09,1402.0,1420.576,1413.0,311000,1449.0,1401.0
192,2015/06/10,1409.0,1410.218,1402.0,202000,1422.0,1398.0
193,2015/06/11,1410.0,1413.629,1401.0,151000,1435.0,1401.0
194,2015/06/12,1382.0,1400.619,1410.0,325000,1410.0,1380.0
195,2015/06/15,1353.0,1356.498,1360.0,295000,1374.0,1344.0
196,2015/06/16,1299.0,1313.276,1337.0,529000,1345.0,1299.0
197,2015/06/17,1266.0,1278.679,1300.0,476000,1307.0,1261.0
198,2015/06/18,1242.0,1253.347,1265.0,262000,1274.0,1241.0
199,2015/06/19,1284.0,1287.731,1242.0,442000,1309.0,1242.0
200,2015/06/22,1275.0,1276.834,1268.0,193000,1300.0,1261.0
201,2015/06/23,1293.0,1291.198,1280.0,253000,1308.0,1277.0
202,2015/06/24,1273.0,1280.119,1300.0,286000,1301.0,1269.0
203,2015/06/25,1268.0,1265.423,1261.0,222000,1284.0,1251.0
204,2015/06/26,1273.0,1278.663,1288.0,160000,1300.0,1270.0
205,2015/06/29,1224.0,1234.519,1250.0,243000,1251.0,1222.0
206,2015/06/30,1230.0,1231.459,1233.0,255000,1240.0,1224.0
207,2015/07/01,1227.0,1232.119,1242.0,219000,1245.0,1223.0
208,2015/07/02,1220.0,1222.897,1227.0,174000,1233.0,1215.0
209,2015/07/03,1206.0,1210.0,1218.0,123000,1219.0,1203.0
210,2015/07/06,1184.0,1189.723,1209.0,184000,1209.0,1182.0
211,2015/07/07,1183.0,1191.471,1190.0,210000,1208.0,1182.0
212,2015/07/08,1136.0,1150.013,1183.0,237000,1183.0,1136.0
213,2015/07/09,1133.0,1115.144,1088.0,320000,1136.0,1058.0
214,2015/07/10,1131.0,1135.144,1126.0,236000,1150.0,1126.0
215,2015/07/13,1147.0,1150.825,1150.0,177000,1167.0,1140.0
216,2015/07/14,1238.0,1231.252,1250.0,599000,1250.0,1211.0
217,2015/07/15,1275.0,1268.425,1241.0,372000,1280.0,1241.0
218,2015/07/16,1339.0,1333.29,1300.0,655000,1370.0,1300.0
219,2015/07/17,1308.0,1316.269,1339.0,290000,1342.0,1305.0
220,2015/07/21,1337.0,1324.427,1330.0,248000,1340.0,1302.0
221,2015/07/22,1331.0,1330.766,1331.0,124000,1340.0,1311.0
222,2015/07/23,1349.0,1340.653,1337.0,222000,1349.0,1326.0
223,2015/07/24,1333.0,1339.18,1350.0,167000,1354.0,1330.0
224,2015/07/27,1288.0,1301.247,1332.0,275000,1332.0,1285.0
225,2015/07/28,1304.0,1299.887,1303.0,247000,1314.0,1275.0
226,2015/07/29,1344.0,1334.44,1330.0,248000,1351.0,1297.0
227,2015/07/30,1356.0,1355.298,1358.0,258000,1364.0,1339.0
228,2015/07/31,1413.0,1406.182,1386.0,347000,1427.0,1380.0
229,2015/08/03,1435.0,1430.48,1413.0,281000,1450.0,1403.0
230,2015/08/04,1479.0,1461.559,1435.0,320000,1486.0,1429.0
231,2015/08/05,1474.0,1488.096,1487.0,395000,1511.0,1451.0
232,2015/08/06,1444.0,1469.075,1444.0,362000,1503.0,1435.0
233,2015/08/07,1410.0,1406.945,1415.0,310000,1450.0,1389.0
234,2015/08/10,1582.0,1547.927,1498.0,1197000,1617.0,1453.0
235,2015/08/11,1552.0,1545.361,1542.0,396000,1580.0,1523.0
236,2015/08/12,1525.0,1530.521,1516.0,257000,1570.0,1505.0
237,2015/08/13,1536.0,1527.412,1525.0,245000,1546.0,1506.0
238,2015/08/14,1614.0,1604.662,1550.0,444000,1630.0,1550.0
239,2015/08/17,1635.0,1625.495,1626.0,210000,1648.0,1603.0
240,2015/08/18,1679.0,1662.767,1633.0,296000,1680.0,1621.0
241,2015/08/19,1652.0,1662.856,1678.0,243000,1701.0,1646.0
242,2015/08/20,1664.0,1665.562,1638.0,178000,1686.0,1638.0
243,2015/08/21,1625.0,1636.017,1629.0,231000,1655.0,1615.0
244,2015/08/24,1513.0,1544.35,1545.0,354000,1595.0,1510.0
245,2015/08/25,1424.0,1463.109,1455.0,412000,1520.0,1424.0
246,2015/08/26,1439.0,1433.982,1447.0,728000,1476.0,1406.0
247,2015/08/27,1418.0,1437.764,1455.0,618000,1477.0,1414.0
248,2015/08/28,1449.0,1452.875,1467.0,847000,1473.0,1439.0
249,2015/08/31,1517.0,1515.952,1474.0,600000,1548.0,1460.0
250,2015/09/01,1429.0,1467.608,1505.0,383000,1511.0,1428.0
251,2015/09/02,1174.0,1182.058,1220.0,3729000,1222.0,1161.0
252,2015/09/03,1131.0,1154.206,1175.0,1692000,1192.0,1125.0
253,2015/09/04,1080.0,1089.44,1141.0,1856000,1141.0,1068.0
254,2015/09/07,1040.0,1056.745,1090.0,1260000,1090.0,1034.0
255,2015/09/08,1080.0,1078.337,1044.0,903000,1099.0,1040.0
256,2015/09/09,1149.0,1120.808,1100.0,1289000,1151.0,1068.0
257,2015/09/10,1111.0,1111.094,1099.0,843000,1148.0,1081.0
258,2015/09/11,1106.0,1113.488,1111.0,412000,1132.0,1102.0
259,2015/09/14,1061.0,1074.91,1106.0,387000,1107.0,1060.0
260,2015/09/15,1065.0,1083.113,1073.0,434000,1112.0,1064.0
261,2015/09/16,1046.0,1050.103,1077.0,273000,1088.0,1035.0
262,2015/09/17,1052.0,1044.965,1050.0,375000,1058.0,1033.0
263,2015/09/18,1030.0,1034.09,1048.0,345000,1049.0,1021.0
264,2015/09/24,1021.0,1024.91,1011.0,243000,1047.0,1011.0
265,2015/09/25,1027.0,1016.272,1021.0,224000,1035.0,1003.0
266,2015/09/28,983.0,992.111,1003.0,289000,1018.0,970.0
267,2015/09/29,961.0,972.216,980.0,334000,986.0,958.0
268,2015/09/30,982.0,982.424,985.0,446000,996.0,970.0
269,2015/10/01,983.0,981.129,977.0,302100,995.0,963.0
270,2015/10/02,976.0,974.268,983.0,350700,988.0,961.0
271,2015/10/05,988.0,990.526,984.0,241700,1010.0,978.0
272,2015/10/06,998.0,1003.732,1003.0,305200,1020.0,992.0
273,2015/10/07,1007.0,1007.633,994.0,305400,1025.0,994.0
274,2015/10/08,1059.0,1044.345,1010.0,592400,1065.0,1010.0
275,2015/10/09,1053.0,1059.284,1061.0,592400,1080.0,1049.0
276,2015/10/13,1058.0,1055.572,1052.0,365400,1069.0,1033.0
277,2015/10/14,1085.0,1092.515,1088.0,1104200,1126.0,1070.0
278,2015/10/15,1110.0,1111.319,1094.0,387600,1121.0,1094.0
279,2015/10/16,1115.0,1131.53,1111.0,536100,1147.0,1111.0
280,2015/10/19,1118.0,1124.781,1118.0,382500,1143.0,1110.0
281,2015/10/20,1106.0,1107.128,1118.0,212800,1130.0,1095.0
282,2015/10/21,1129.0,1123.047,1106.0,282600,1136.0,1100.0
283,2015/10/22,1146.0,1142.904,1141.0,439900,1152.0,1132.0
284,2015/10/23,1149.0,1161.231,1170.0,527400,1183.0,1143.0
285,2015/10/26,1169.0,1168.932,1156.0,415600,1178.0,1151.0
286,2015/10/27,1153.0,1167.558,1168.0,421400,1188.0,1152.0
287,2015/10/28,1153.0,1154.798,1160.0,259900,1174.0,1145.0
288,2015/10/29,1150.0,1155.328,1159.0,391000,1170.0,1147.0
289,2015/10/30,1199.0,1196.236,1175.0,867500,1223.0,1175.0
290,2015/11/02,1171.0,1185.52,1200.0,637700,1209.0,1169.0
291,2015/11/04,1176.0,1180.485,1188.0,485100,1196.0,1163.0
292,2015/11/05,1174.0,1181.869,1176.0,317700,1199.0,1171.0
293,2015/11/06,1170.0,1169.979,1174.0,275200,1179.0,1161.0
294,2015/11/09,1205.0,1200.93,1169.0,531100,1210.0,1168.0
295,2015/11/10,1183.0,1187.001,1190.0,357200,1210.0,1176.0
296,2015/11/11,1165.0,1174.365,1182.0,534700,1194.0,1163.0
297,2015/11/12,1147.0,1150.273,1154.0,780700,1175.0,1110.0
298,2015/11/13,1129.0,1128.534,1135.0,498700,1142.0,1121.0
299,2015/11/16,1126.0,1134.086,1113.0,339400,1162.0,1113.0
300,2015/11/17,1159.0,1164.637,1137.0,541000,1173.0,1133.0
301,2015/11/18,1180.0,1180.44,1171.0,409900,1196.0,1162.0
302,2015/11/19,1230.0,1218.296,1199.0,936600,1240.0,1190.0
303,2015/11/20,1235.0,1246.583,1258.0,694100,1271.0,1228.0
304,2015/11/24,1232.0,1230.94,1236.0,375000,1241.0,1219.0
305,2015/11/25,1228.0,1242.195,1242.0,497800,1261.0,1224.0
306,2015/11/26,1197.0,1201.202,1222.0,441300,1222.0,1194.0
307,2015/11/27,1161.0,1172.229,1190.0,494500,1204.0,1160.0
308,2015/11/30,1165.0,1172.002,1191.0,463500,1195.0,1163.0
309,2015/12/01,1168.0,1169.084,1170.0,261900,1186.0,1154.0
310,2015/12/02,1168.0,1165.026,1161.0,281700,1171.0,1156.0
311,2015/12/03,1130.0,1137.572,1169.0,587700,1169.0,1125.0
312,2015/12/04,1112.0,1113.421,1115.0,376800,1125.0,1101.0
313,2015/12/07,1108.0,1113.084,1112.0,295900,1128.0,1104.0
314,2015/12/08,1097.0,1097.483,1100.0,284100,1117.0,1090.0
315,2015/12/09,1082.0,1080.817,1083.0,416000,1090.0,1070.0
316,2015/12/10,1055.0,1059.498,1066.0,340500,1079.0,1053.0
317,2015/12/11,1056.0,1042.248,1036.0,365200,1061.0,1031.0
318,2015/12/14,1037.0,1030.548,1032.0,353200,1040.0,1019.0
319,2015/12/15,1023.0,1022.318,1033.0,232100,1037.0,1016.0
320,2015/12/16,1018.0,1021.871,1027.0,459300,1031.0,1010.0
321,2015/12/17,1050.0,1048.081,1030.0,450000,1057.0,1026.0
322,2015/12/18,1011.0,1025.778,1050.0,520500,1054.0,1010.0
323,2015/12/21,1010.0,1009.426,1000.0,453100,1015.0,1000.0
324,2015/12/22,1019.0,1012.447,1007.0,294900,1025.0,1001.0
325,2015/12/24,1003.0,1011.035,1025.0,248200,1034.0,1000.0
326,2015/12/25,996.0,998.539,1011.0,318400,1022.0,990.0
327,2015/12/28,1029.0,1021.498,996.0,309200,1030.0,995.0
328,2015/12/29,1017.0,1010.842,1025.0,316800,1033.0,996.0
329,2015/12/30,1042.0,1037.227,1033.0,303300,1047.0,1022.0
330,2016/01/04,1003.0,1011.588,1044.0,449900,1044.0,998.0
331,2016/01/05,1005.0,1002.039,995.0,281500,1014.0,992.0
332,2016/01/06,987.0,987.723,1002.0,502800,1004.0,981.0
333,2016/01/07,990.0,983.749,980.0,553900,996.0,971.0
334,2016/01/08,980.0,984.876,986.0,309900,999.0,975.0
335,2016/01/12,973.0,971.902,970.0,450900,988.0,955.0
336,2016/01/13,1003.0,997.338,988.0,409200,1008.0,975.0
337,2016/01/14,978.0,970.192,979.0,460300,985.0,961.0
338,2016/01/15,974.0,980.646,993.0,224400,999.0,970.0
339,2016/01/18,956.0,950.773,950.0,383200,960.0,932.0
340,2016/01/19,971.0,969.505,960.0,609000,985.0,959.0
341,2016/01/20,956.0,975.17,977.0,622600,1003.0,952.0
342,2016/01/21,925.0,947.588,950.0,521800,975.0,924.0
343,2016/01/22,968.0,959.419,954.0,317500,970.0,941.0
344,2016/01/25,987.0,980.405,983.0,269500,994.0,969.0
345,2016/01/26,960.0,963.294,977.0,166200,983.0,956.0
346,2016/01/27,1010.0,999.18,975.0,466100,1016.0,975.0
347,2016/01/28,1030.0,1031.66,1020.0,439100,1043.0,1018.0
348,2016/01/29,1063.0,1045.914,1032.0,431800,1065.0,1014.0
349,2016/02/01,1070.0,1074.039,1076.0,406100,1083.0,1066.0
350,2016/02/02,1053.0,1055.562,1057.0,265700,1070.0,1043.0
351,2016/02/03,1011.0,1016.702,1035.0,295600,1035.0,1008.0
352,2016/02/04,1021.0,1023.452,1001.0,193100,1040.0,1001.0
353,2016/02/05,1012.0,1008.936,1006.0,289000,1017.0,1003.0
354,2016/02/08,1037.0,1024.013,1000.0,218900,1043.0,987.0
355,2016/02/09,975.0,980.51,990.0,464400,1000.0,968.0
356,2016/02/10,965.0,967.111,990.0,408800,1001.0,951.0
357,2016/02/12,931.0,955.218,964.0,1273900,983.0,931.0
358,2016/02/15,933.0,928.86,975.0,926600,978.0,898.0
359,2016/02/16,953.0,952.002,936.0,453200,966.0,923.0
360,2016/02/17,919.0,914.226,938.0,771200,946.0,903.0
361,2016/02/18,910.0,925.066,934.0,880800,954.0,900.0
362,2016/02/19,897.0,899.192,910.0,570600,913.0,891.0
363,2016/02/22,872.0,877.186,907.0,924700,907.0,868.0
364,2016/02/23,876.0,880.379,894.0,409300,894.0,873.0
365,2016/02/24,885.0,884.01,880.0,460900,894.0,866.0
366,2016/02/25,916.0,902.957,894.0,592200,926.0,878.0
367,2016/02/26,910.0,912.939,924.0,381400,933.0,901.0
368,2016/02/29,887.0,906.054,924.0,293200,928.0,887.0
369,2016/03/01,876.0,874.57,887.0,438700,890.0,867.0
370,2016/03/02,884.0,884.619,891.0,552600,893.0,872.0
371,2016/03/03,889.0,883.428,882.0,449600,890.0,874.0
372,2016/03/04,916.0,906.166,888.0,366000,917.0,887.0
373,2016/03/07,930.0,927.342,915.0,444100,935.0,914.0
374,2016/03/08,931.0,930.005,939.0,355000,955.0,909.0
375,2016/03/09,926.0,915.036,930.0,418000,934.0,894.0
376,2016/03/10,944.0,942.296,945.0,316800,949.0,928.0
377,2016/03/11,946.0,941.152,941.0,347600,950.0,927.0
378,2016/03/14,955.0,954.965,960.0,307800,962.0,947.0
379,2016/03/15,954.0,952.741,955.0,299800,958.0,941.0
380,2016/03/16,955.0,955.399,953.0,288000,962.0,944.0
381,2016/03/17,941.0,949.755,964.0,295700,967.0,936.0
382,2016/03/18,944.0,939.271,942.0,361300,949.0,926.0
383,2016/03/22,980.0,969.609,961.0,458800,986.0,952.0
384,2016/03/23,976.0,975.899,980.0,472300,987.0,960.0
385,2016/03/24,1002.0,999.516,977.0,897100,1009.0,976.0
386,2016/03/25,980.0,989.702,1010.0,257100,1010.0,978.0
387,2016/03/28,992.0,990.243,992.0,260300,1003.0,978.0
388,2016/03/29,996.0,985.516,987.0,228600,997.0,971.0
389,2016/03/30,960.0,970.997,999.0,374000,999.0,958.0
390,2016/03/31,949.0,955.664,967.0,331300,974.0,946.0
391,2016/04/01,910.0,920.424,948.0,427200,949.0,907.0
392,2016/04/04,918.0,920.655,918.0,216700,937.0,910.0
393,2016/04/05,908.0,908.168,918.0,433300,919.0,899.0
394,2016/04/06,917.0,911.093,908.0,345300,923.0,898.0
395,2016/04/07,907.0,911.43,918.0,268000,925.0,900.0
396,2016/04/08,918.0,908.598,900.0,395300,932.0,885.0
397,2016/04/11,915.0,911.638,925.0,239300,930.0,897.0
398,2016/04/12,938.0,936.102,914.0,464200,951.0,910.0
399,2016/04/13,969.0,961.889,950.0,346400,975.0,938.0
400,2016/04/14,1014.0,995.952,979.0,565700,1014.0,970.0
401,2016/04/15,1006.0,1010.795,1009.0,358300,1024.0,1000.0
402,2016/04/18,983.0,980.983,976.0,228300,991.0,968.0
403,2016/04/19,1005.0,1002.366,1010.0,285200,1010.0,995.0
404,2016/04/20,1007.0,1017.48,1012.0,377700,1030.0,1006.0
405,2016/04/21,1040.0,1033.641,1030.0,188200,1040.0,1024.0
406,2016/04/22,1062.0,1046.245,1040.0,616000,1062.0,1036.0
407,2016/04/25,1053.0,1055.412,1075.0,487300,1075.0,1042.0
408,2016/04/26,1114.0,1087.521,1055.0,1231000,1127.0,1053.0
409,2016/04/27,1110.0,1113.023,1116.0,581700,1125.0,1103.0
410,2016/04/28,1091.0,1110.149,1116.0,410100,1132.0,1089.0
411,2016/05/02,1070.0,1065.514,1065.0,290500,1071.0,1058.0
412,2016/05/06,1077.0,1076.011,1074.0,409400,1092.0,1068.0
413,2016/05/09,1088.0,1090.072,1088.0,180500,1101.0,1082.0
414,2016/05/10,1129.0,1120.54,1097.0,710600,1129.0,1097.0
415,2016/05/11,1140.0,1131.078,1132.0,478600,1140.0,1121.0
416,2016/05/12,1137.0,1129.829,1140.0,310200,1141.0,1118.0
417,2016/05/13,1120.0,1126.637,1141.0,383100,1145.0,1113.0
418,2016/05/16,1122.0,1124.376,1129.0,190800,1136.0,1117.0
419,2016/05/17,1134.0,1126.428,1138.0,181000,1138.0,1117.0
420,2016/05/18,1129.0,1131.217,1140.0,230900,1145.0,1121.0
421,2016/05/19,1112.0,1110.118,1130.0,412900,1134.0,1097.0
422,2016/05/20,1135.0,1125.485,1105.0,242500,1138.0,1100.0
423,2016/05/23,1134.0,1130.124,1135.0,241000,1140.0,1120.0
424,2016/05/24,1144.0,1143.009,1134.0,277300,1155.0,1131.0
425,2016/05/25,1163.0,1159.051,1156.0,225600,1166.0,1153.0
426,2016/05/26,1163.0,1168.036,1175.0,180300,1176.0,1161.0
427,2016/05/27,1146.0,1150.284,1163.0,228800,1163.0,1143.0
428,2016/05/30,1179.0,1172.52,1175.0,227300,1179.0,1158.0
429,2016/05/31,1171.0,1172.969,1184.0,366600,1188.0,1167.0
430,2016/06/01,1166.0,1164.5,1170.0,267700,1170.0,1154.0
431,2016/06/02,1158.0,1160.027,1161.0,292100,1167.0,1151.0
432,2016/06/03,1153.0,1155.717,1165.0,171000,1166.0,1148.0
433,2016/06/06,1160.0,1154.739,1148.0,216400,1161.0,1136.0
434,2016/06/07,1163.0,1162.058,1170.0,154000,1170.0,1158.0
435,2016/06/08,1180.0,1177.805,1175.0,358900,1185.0,1166.0
436,2016/06/09,1162.0,1164.001,1178.0,299000,1180.0,1153.0
437,2016/06/10,1165.0,1161.463,1164.0,376400,1177.0,1150.0
438,2016/06/13,1126.0,1131.755,1156.0,293500,1156.0,1120.0
439,2016/06/14,1111.0,1115.112,1123.0,186800,1136.0,1103.0
440,2016/06/15,1094.0,1095.034,1102.0,169500,1102.0,1085.0
441,2016/06/16,1084.0,1088.679,1113.0,288100,1116.0,1072.0
442,2016/06/17,1089.0,1092.294,1098.0,204200,1103.0,1085.0
443,2016/06/20,1121.0,1120.133,1123.0,187800,1130.0,1111.0
444,2016/06/21,1134.0,1121.659,1118.0,114800,1134.0,1103.0
445,2016/06/22,1124.0,1121.304,1136.0,115300,1136.0,1109.0
446,2016/06/23,1117.0,1117.505,1127.0,112000,1133.0,1107.0
447,2016/06/24,1072.0,1076.102,1129.0,373500,1130.0,1040.0
448,2016/06/27,1108.0,1097.468,1076.0,204100,1112.0,1076.0
449,2016/06/28,1124.0,1116.71,1105.0,238600,1133.0,1091.0
450,2016/06/29,1136.0,1131.06,1145.0,122400,1145.0,1112.0
451,2016/06/30,1111.0,1126.937,1160.0,161800,1160.0,1109.0
452,2016/07/01,1120.0,1122.296,1140.0,125900,1140.0,1112.0
453,2016/07/04,1123.0,1117.827,1111.0,302700,1124.0,1101.0
454,2016/07/05,1119.0,1112.804,1113.0,190400,1121.0,1101.0
455,2016/07/06,1151.0,1129.866,1115.0,227300,1154.0,1102.0
456,2016/07/07,1134.0,1141.58,1154.0,150100,1161.0,1126.0
457,2016/07/08,1120.0,1127.919,1150.0,161200,1150.0,1115.0
458,2016/07/11,1173.0,1167.445,1150.0,297300,1176.0,1143.0
459,2016/07/12,1170.0,1180.917,1181.0,352200,1205.0,1163.0
460,2016/07/13,1181.0,1182.456,1200.0,139700,1200.0,1172.0
461,2016/07/14,1188.0,1189.042,1195.0,167200,1197.0,1178.0
462,2016/07/15,1163.0,1172.082,1200.0,258200,1200.0,1152.0
463,2016/07/19,1173.0,1162.428,1184.0,220900,1185.0,1141.0
464,2016/07/20,1190.0,1173.902,1173.0,164500,1190.0,1149.0
465,2016/07/21,1185.0,1185.751,1199.0,164800,1200.0,1174.0
466,2016/07/22,1176.0,1178.678,1172.0,272600,1191.0,1155.0
467,2016/07/25,1194.0,1193.27,1198.0,369200,1203.0,1185.0
468,2016/07/26,1208.0,1203.541,1195.0,353300,1221.0,1182.0
469,2016/07/27,1199.0,1201.807,1214.0,247200,1219.0,1189.0
470,2016/07/28,1173.0,1177.131,1198.0,254400,1201.0,1167.0
471,2016/07/29,1161.0,1155.064,1176.0,430100,1176.0,1143.0
472,2016/08/01,1160.0,1154.162,1163.0,215300,1164.0,1132.0
473,2016/08/02,1162.0,1171.174,1144.0,415500,1198.0,1142.0
474,2016/08/03,1135.0,1135.385,1146.0,384700,1155.0,1126.0
475,2016/08/04,1123.0,1121.324,1135.0,346400,1139.0,1113.0
476,2016/08/05,1124.0,1123.62,1118.0,266900,1135.0,1117.0
477,2016/08/08,1147.0,1142.925,1135.0,198100,1148.0,1131.0
478,2016/08/09,1159.0,1150.179,1124.0,151600,1159.0,1124.0
479,2016/08/10,1105.0,1113.219,1133.0,351300,1140.0,1097.0
480,2016/08/12,1107.0,1107.163,1108.0,210900,1121.0,1103.0
481,2016/08/15,1083.0,1087.874,1096.0,161200,1099.0,1081.0
482,2016/08/16,1063.0,1070.152,1094.0,175500,1094.0,1063.0
483,2016/08/17,1063.0,1057.352,1055.0,216700,1068.0,1048.0
484,2016/08/18,1065.0,1063.288,1061.0,239000,1074.0,1042.0
485,2016/08/19,1070.0,1067.07,1067.0,182800,1073.0,1056.0
486,2016/08/22,1072.0,1071.752,1081.0,132000,1081.0,1063.0
487,2016/08/23,1074.0,1074.737,1072.0,218600,1085.0,1067.0
488,2016/08/24,1082.0,1085.628,1088.0,218900,1101.0,1078.0
489,2016/08/25,1088.0,1087.924,1099.0,140300,1100.0,1076.0
490,2016/08/26,1078.0,1079.106,1088.0,123600,1088.0,1073.0
491,2016/08/29,1096.0,1096.888,1108.0,92600,1108.0,1092.0
492,2016/08/30,1087.0,1086.104,1089.0,85700,1089.0,1078.0
493,2016/08/31,1099.0,1094.458,1087.0,188200,1102.0,1080.0
494,2016/09/01,1118.0,1115.786,1104.0,155800,1122.0,1104.0
495,2016/09/02,1114.0,1111.697,1107.0,86500,1121.0,1104.0
496,2016/09/05,1136.0,1131.911,1125.0,135300,1136.0,1117.0
497,2016/09/06,1165.0,1156.975,1140.0,151400,1166.0,1136.0
498,2016/09/07,1169.0,1160.405,1158.0,131000,1171.0,1145.0
499,2016/09/08,1156.0,1154.192,1173.0,184000,1173.0,1147.0
500,2016/09/09,1180.0,1167.0,1162.0,174400,1181.0,1149.0
501,2016/09/12,1179.0,1172.767,1170.0,224400,1188.0,1152.0
502,2016/09/13,1187.0,1191.391,1200.0,221900,1205.0,1180.0
503,2016/09/14,1184.0,1183.056,1199.0,372800,1203.0,1171.0
504,2016/09/15,1198.0,1197.151,1197.0,240100,1205.0,1178.0
505,2016/09/16,1185.0,1193.175,1205.0,275700,1219.0,1176.0
506,2016/09/20,1195.0,1192.077,1187.0,157400,1199.0,1171.0
507,2016/09/21,1234.0,1216.003,1200.0,280100,1235.0,1186.0
508,2016/09/23,1240.0,1235.237,1235.0,229300,1246.0,1219.0
509,2016/09/26,1231.0,1228.611,1239.0,134900,1239.0,1220.0
510,2016/09/27,1250.0,1234.558,1229.0,247800,1250.0,1206.0
511,2016/09/28,1256.0,1257.857,1259.0,248300,1279.0,1247.0
512,2016/09/29,1239.0,1248.161,1268.0,258000,1268.0,1238.0
513,2016/09/30,1191.0,1200.614,1209.0,313800,1217.0,1179.0
514,2016/10/03,1199.0,1197.543,1205.0,153200,1210.0,1189.0
515,2016/10/04,1199.0,1194.137,1209.0,260000,1211.0,1185.0
516,2016/10/05,1213.0,1206.862,1205.0,209400,1217.0,1190.0
517,2016/10/06,1216.0,1215.665,1220.0,152400,1222.0,1205.0
518,2016/10/07,1235.0,1234.905,1246.0,240600,1247.0,1219.0
519,2016/10/11,1234.0,1238.739,1249.0,185900,1249.0,1231.0
520,2016/10/12,1206.0,1215.273,1223.0,314500,1229.0,1203.0
521,2016/10/13,1184.0,1189.721,1208.0,314700,1208.0,1178.0
522,2016/10/14,1180.0,1179.089,1179.0,291400,1189.0,1161.0
523,2016/10/17,1178.0,1175.313,1180.0,192400,1182.0,1165.0
524,2016/10/18,1211.0,1200.922,1210.0,505300,1212.0,1177.0
525,2016/10/19,1217.0,1216.644,1218.0,245000,1226.0,1205.0
526,2016/10/20,1220.0,1218.713,1225.0,195700,1225.0,1204.0
527,2016/10/21,1233.0,1233.273,1230.0,226400,1239.0,1222.0
528,2016/10/24,1232.0,1231.478,1233.0,163500,1235.0,1225.0
529,2016/10/25,1243.0,1241.227,1243.0,239600,1245.0,1235.0
530,2016/10/26,1244.0,1244.085,1249.0,205500,1249.0,1233.0
531,2016/10/27,1246.0,1243.883,1244.0,256200,1248.0,1233.0
532,2016/10/28,1267.0,1263.305,1250.0,846000,1272.0,1243.0
533,2016/10/31,1262.0,1263.056,1267.0,237500,1270.0,1257.0
534,2016/11/01,1256.0,1249.233,1253.0,168400,1256.0,1238.0
535,2016/11/02,1245.0,1240.091,1247.0,314600,1250.0,1231.0
536,2016/11/04,1227.0,1228.375,1236.0,232800,1242.0,1222.0
537,2016/11/07,1234.0,1240.994,1250.0,213600,1255.0,1229.0
538,2016/11/08,1221.0,1224.865,1224.0,130800,1234.0,1218.0
539,2016/11/09,1174.0,1191.919,1221.0,381700,1232.0,1163.0
540,2016/11/10,1235.0,1234.68,1247.0,213000,1249.0,1228.0
541,2016/11/11,1226.0,1225.282,1249.0,231700,1251.0,1206.0
542,2016/11/14,1265.0,1266.758,1286.0,502100,1286.0,1248.0
543,2016/11/15,1236.0,1241.751,1264.0,289500,1268.0,1228.0
544,2016/11/16,1248.0,1249.044,1261.0,246000,1261.0,1244.0
545,2016/11/17,1257.0,1258.322,1250.0,227100,1267.0,1245.0
546,2016/11/18,1283.0,1279.572,1270.0,283800,1284.0,1270.0
547,2016/11/21,1269.0,1275.62,1290.0,266800,1293.0,1264.0
548,2016/11/22,1289.0,1285.878,1285.0,362500,1292.0,1273.0
549,2016/11/24,1284.0,1287.97,1300.0,207100,1300.0,1274.0
550,2016/11/25,1295.0,1293.758,1298.0,235800,1300.0,1286.0
551,2016/11/28,1286.0,1276.666,1284.0,217100,1289.0,1261.0
552,2016/11/29,1279.0,1277.362,1263.0,157900,1285.0,1263.0
553,2016/11/30,1258.0,1258.446,1260.0,335400,1266.0,1255.0
554,2016/12/01,1247.0,1248.708,1260.0,267300,1263.0,1237.0
555,2016/12/02,1255.0,1248.396,1239.0,218800,1259.0,1232.0
556,2016/12/05,1234.0,1234.092,1252.0,300500,1258.0,1224.0
557,2016/12/06,1236.0,1234.52,1247.0,234100,1248.0,1225.0
558,2016/12/07,1255.0,1250.369,1236.0,247500,1258.0,1231.0
559,2016/12/08,1259.0,1260.659,1269.0,247500,1270.0,1254.0
560,2016/12/09,1290.0,1277.68,1267.0,357000,1292.0,1259.0
561,2016/12/12,1290.0,1289.951,1300.0,199800,1301.0,1283.0
562,2016/12/13,1307.0,1308.712,1297.0,313100,1314.0,1289.0
563,2016/12/14,1322.0,1320.285,1315.0,200500,1328.0,1308.0
564,2016/12/15,1291.0,1299.046,1318.0,222500,1318.0,1289.0
565,2016/12/16,1297.0,1298.933,1300.0,146100,1311.0,1292.0
566,2016/12/19,1288.0,1290.727,1291.0,130600,1300.0,1286.0
567,2016/12/20,1286.0,1279.984,1274.0,153000,1290.0,1268.0
568,2016/12/21,1280.0,1280.59,1276.0,150100,1288.0,1276.0
569,2016/12/22,1278.0,1278.187,1284.0,206900,1284.0,1265.0
570,2016/12/26,1276.0,1275.578,1274.0,156700,1281.0,1270.0
571,2016/12/27,1266.0,1266.123,1270.0,173900,1276.0,1259.0
572,2016/12/28,1260.0,1260.809,1270.0,166000,1274.0,1255.0
573,2016/12/29,1247.0,1247.534,1255.0,279400,1259.0,1235.0
574,2016/12/30,1237.0,1234.193,1238.0,155000,1242.0,1226.0
575,2017/01/04,1272.0,1264.229,1245.0,241000,1277.0,1238.0
576,2017/01/05,1262.0,1266.661,1272.0,174800,1280.0,1257.0
577,2017/01/06,1276.0,1260.993,1251.0,203900,1277.0,1237.0
578,2017/01/10,1291.0,1286.579,1285.0,268300,1295.0,1272.0
579,2017/01/11,1309.0,1303.188,1293.0,147200,1309.0,1293.0
580,2017/01/12,1274.0,1282.571,1312.0,146500,1312.0,1272.0
581,2017/01/13,1291.0,1282.738,1270.0,105800,1293.0,1265.0
582,2017/01/16,1305.0,1299.07,1283.0,195300,1306.0,1283.0
583,2017/01/17,1280.0,1285.821,1306.0,164600,1306.0,1277.0
584,2017/01/18,1278.0,1272.15,1280.0,91500,1280.0,1264.0
585,2017/01/19,1304.0,1298.854,1297.0,134800,1306.0,1289.0
586,2017/01/20,1316.0,1305.356,1291.0,221700,1316.0,1286.0
587,2017/01/23,1322.0,1315.317,1310.0,143100,1325.0,1297.0
588,2017/01/24,1320.0,1323.876,1326.0,229700,1338.0,1315.0
589,2017/01/25,1289.0,1294.773,1335.0,427100,1337.0,1282.0
590,2017/01/26,1302.0,1293.628,1290.0,309100,1306.0,1279.0
591,2017/01/27,1284.0,1288.872,1303.0,239600,1304.0,1277.0
592,2017/01/30,1293.0,1290.121,1280.0,230800,1297.0,1280.0
593,2017/01/31,1268.0,1272.801,1289.0,178700,1290.0,1264.0
594,2017/02/01,1280.0,1271.31,1253.0,117800,1280.0,1250.0
595,2017/02/02,1266.0,1268.824,1280.0,109500,1283.0,1262.0
596,2017/02/03,1282.0,1279.529,1270.0,173300,1284.0,1269.0
597,2017/02/06,1271.0,1277.187,1290.0,136600,1290.0,1269.0
598,2017/02/07,1276.0,1270.068,1271.0,156500,1281.0,1258.0
599,2017/02/08,1259.0,1260.967,1276.0,216000,1276.0,1257.0
600,2017/02/09,1249.0,1246.401,1255.0,202300,1255.0,1240.0
601,2017/02/10,1218.0,1235.875,1242.0,477300,1280.0,1215.0
602,2017/02/13,1244.0,1237.938,1239.0,228500,1246.0,1225.0
603,2017/02/14,1285.0,1280.822,1250.0,435600,1294.0,1250.0
604,2017/02/15,1324.0,1309.603,1291.0,431900,1325.0,1291.0
605,2017/02/16,1310.0,1307.879,1322.0,178600,1322.0,1298.0
606,2017/02/17,1300.0,1298.138,1299.0,106000,1303.0,1286.0
607,2017/02/20,1295.0,1290.465,1292.0,79500,1296.0,1282.0
608,2017/02/21,1327.0,1315.79,1295.0,230200,1327.0,1291.0
609,2017/02/22,1366.0,1351.493,1331.0,587400,1366.0,1329.0
610,2017/02/23,1357.0,1360.114,1370.0,276000,1378.0,1349.0
611,2017/02/24,1374.0,1365.892,1360.0,369100,1374.0,1348.0
612,2017/02/27,1389.0,1376.658,1368.0,301500,1389.0,1357.0
613,2017/02/28,1392.0,1396.267,1395.0,521700,1417.0,1380.0
614,2017/03/01,1364.0,1374.817,1400.0,330100,1400.0,1363.0
615,2017/03/02,1374.0,1381.211,1404.0,313700,1406.0,1368.0
616,2017/03/03,1390.0,1383.569,1365.0,211300,1391.0,1360.0
617,2017/03/06,1364.0,1366.181,1370.0,251200,1373.0,1361.0
618,2017/03/07,1369.0,1364.445,1357.0,158600,1369.0,1348.0
619,2017/03/08,1385.0,1379.374,1374.0,327100,1387.0,1368.0
620,2017/03/09,1411.0,1403.012,1388.0,504700,1414.0,1383.0
621,2017/03/10,1461.0,1447.797,1441.0,692900,1465.0,1414.0
622,2017/03/13,1454.0,1454.01,1460.0,263700,1464.0,1442.0
623,2017/03/14,1440.0,1447.189,1453.0,330000,1457.0,1440.0
624,2017/03/15,1427.0,1427.509,1440.0,181100,1440.0,1416.0
625,2017/03/16,1443.0,1439.552,1424.0,191300,1446.0,1424.0
626,2017/03/17,1450.0,1449.971,1438.0,199500,1456.0,1438.0
627,2017/03/21,1454.0,1453.436,1450.0,164700,1461.0,1445.0
628,2017/03/22,1426.0,1429.712,1435.0,266400,1440.0,1424.0
629,2017/03/23,1441.0,1433.176,1425.0,134300,1441.0,1422.0
630,2017/03/24,1456.0,1452.927,1450.0,221700,1465.0,1441.0
631,2017/03/27,1436.0,1439.928,1447.0,144500,1448.0,1435.0
632,2017/03/28,1469.0,1462.882,1448.0,268500,1469.0,1446.0
633,2017/03/29,1466.0,1466.69,1469.0,250000,1478.0,1456.0
634,2017/03/30,1435.0,1443.898,1465.0,176500,1465.0,1433.0
635,2017/03/31,1423.0,1437.532,1450.0,295100,1461.0,1423.0
636,2017/04/03,1434.0,1435.671,1437.0,195900,1444.0,1429.0
637,2017/04/04,1456.0,1453.784,1433.0,397700,1467.0,1433.0
638,2017/04/05,1441.0,1450.67,1468.0,196000,1474.0,1438.0
639,2017/04/06,1416.0,1420.02,1437.0,246700,1441.0,1410.0
640,2017/04/07,1425.0,1429.538,1422.0,145500,1441.0,1416.0
641,2017/04/10,1439.0,1429.848,1427.0,138400,1444.0,1415.0
642,2017/04/11,1420.0,1420.468,1417.0,124700,1437.0,1411.0
643,2017/04/12,1415.0,1413.855,1406.0,146100,1422.0,1406.0
644,2017/04/13,1402.0,1399.712,1400.0,210700,1407.0,1387.0
645,2017/04/14,1374.0,1378.049,1398.0,214300,1402.0,1365.0
646,2017/04/17,1376.0,1374.157,1360.0,106600,1381.0,1360.0
647,2017/04/18,1406.0,1403.368,1389.0,248800,1413.0,1387.0
648,2017/04/19,1415.0,1418.543,1405.0,263000,1428.0,1401.0
649,2017/04/20,1418.0,1415.022,1420.0,228700,1428.0,1408.0
650,2017/04/21,1426.0,1428.975,1428.0,264100,1441.0,1413.0
651,2017/04/24,1420.0,1408.968,1397.0,429400,1427.0,1382.0
652,2017/04/25,1387.0,1395.679,1425.0,422000,1425.0,1386.0
653,2017/04/26,1387.0,1389.054,1389.0,248200,1394.0,1385.0
654,2017/04/27,1409.0,1406.388,1397.0,276500,1417.0,1395.0
655,2017/04/28,1413.0,1410.765,1413.0,123700,1418.0,1404.0
656,2017/05/01,1409.0,1407.757,1410.0,96300,1415.0,1402.0
657,2017/05/02,1430.0,1428.558,1410.0,333800,1436.0,1406.0
658,2017/05/08,1469.0,1459.676,1455.0,272300,1469.0,1444.0
659,2017/05/09,1475.0,1474.352,1466.0,163300,1480.0,1464.0
660,2017/05/10,1478.0,1479.964,1472.0,266900,1485.0,1466.0
661,2017/05/11,1427.0,1442.441,1490.0,559300,1493.0,1401.0
662,2017/05/12,1429.0,1426.3,1420.0,257000,1436.0,1413.0
663,2017/05/15,1446.0,1446.557,1439.0,272200,1460.0,1430.0
664,2017/05/16,1426.0,1425.684,1440.0,206800,1440.0,1420.0
665,2017/05/17,1414.0,1411.566,1420.0,164800,1420.0,1407.0
666,2017/05/18,1401.0,1402.647,1400.0,224800,1410.0,1398.0
667,2017/05/19,1419.0,1411.546,1410.0,159400,1422.0,1396.0
668,2017/05/22,1419.0,1416.184,1423.0,128000,1428.0,1408.0
669,2017/05/23,1401.0,1405.424,1410.0,237300,1413.0,1400.0
670,2017/05/24,1387.0,1391.953,1406.0,369100,1409.0,1384.0
671,2017/05/25,1391.0,1390.411,1380.0,125400,1398.0,1378.0
672,2017/05/26,1379.0,1380.306,1385.0,176600,1386.0,1374.0
673,2017/05/29,1381.0,1380.737,1380.0,146900,1384.0,1378.0
674,2017/05/30,1368.0,1370.462,1379.0,180700,1385.0,1363.0
675,2017/05/31,1358.0,1362.536,1372.0,165400,1377.0,1354.0
676,2017/06/01,1364.0,1364.381,1355.0,146400,1371.0,1355.0
677,2017/06/02,1407.0,1399.137,1371.0,234900,1412.0,1370.0
678,2017/06/05,1403.0,1404.744,1405.0,165500,1410.0,1392.0
679,2017/06/06,1398.0,1395.82,1394.0,96600,1404.0,1388.0
680,2017/06/07,1407.0,1406.292,1397.0,186400,1413.0,1395.0
681,2017/06/08,1415.0,1416.112,1414.0,310300,1429.0,1408.0
682,2017/06/09,1442.0,1438.859,1423.0,476300,1454.0,1422.0
683,2017/06/12,1488.0,1481.991,1458.0,577500,1497.0,1458.0
684,2017/06/13,1494.0,1501.098,1488.0,272500,1509.0,1488.0
685,2017/06/14,1500.0,1507.158,1510.0,193900,1516.0,1500.0
686,2017/06/15,1499.0,1503.355,1500.0,195500,1512.0,1496.0
687,2017/06/16,1515.0,1510.262,1503.0,186400,1518.0,1500.0
688,2017/06/19,1518.0,1526.161,1525.0,143100,1539.0,1516.0
689,2017/06/20,1542.0,1539.715,1525.0,203800,1546.0,1525.0
690,2017/06/21,1540.0,1539.906,1542.0,230900,1546.0,1531.0
691,2017/06/22,1537.0,1537.214,1543.0,222800,1550.0,1524.0
692,2017/06/23,1537.0,1537.999,1548.0,177000,1548.0,1524.0
693,2017/06/26,1538.0,1541.287,1542.0,117900,1547.0,1536.0
694,2017/06/27,1546.0,1548.624,1546.0,152100,1559.0,1541.0
695,2017/06/28,1544.0,1550.079,1550.0,196800,1559.0,1544.0
696,2017/06/29,1518.0,1530.475,1559.0,262000,1562.0,1508.0
697,2017/06/30,1515.0,1511.885,1515.0,244500,1521.0,1504.0
698,2017/07/03,1491.0,1496.971,1517.0,178000,1517.0,1489.0
699,2017/07/04,1490.0,1490.111,1508.0,202300,1508.0,1485.0
700,2017/07/05,1509.0,1503.539,1493.0,183600,1513.0,1488.0
701,2017/07/06,1498.0,1496.917,1500.0,186100,1507.0,1487.0
702,2017/07/07,1483.0,1487.578,1488.0,203100,1500.0,1481.0
703,2017/07/10,1475.0,1477.433,1489.0,160900,1490.0,1472.0
704,2017/07/11,1474.0,1477.739,1474.0,199200,1487.0,1472.0
705,2017/07/12,1474.0,1474.903,1475.0,222200,1481.0,1468.0
706,2017/07/13,1470.0,1473.327,1474.0,169300,1484.0,1468.0
707,2017/07/14,1470.0,1472.031,1470.0,211300,1479.0,1467.0
708,2017/07/18,1470.0,1464.968,1465.0,160800,1470.0,1453.0
709,2017/07/19,1461.0,1463.497,1461.0,173700,1476.0,1457.0
710,2017/07/20,1461.0,1462.082,1463.0,98000,1469.0,1456.0
711,2017/07/21,1451.0,1453.908,1457.0,187600,1460.0,1449.0
712,2017/07/24,1445.0,1443.367,1443.0,168800,1450.0,1437.0
713,2017/07/25,1390.0,1387.098,1404.0,1072100,1407.0,1369.0
714,2017/07/26,1400.0,1409.782,1426.0,561300,1434.0,1399.0
715,2017/07/27,1406.0,1406.515,1400.0,300000,1417.0,1399.0
716,2017/07/28,1410.0,1406.282,1407.0,290100,1416.0,1397.0
717,2017/07/31,1433.0,1427.625,1411.0,341200,1438.0,1405.0
718,2017/08/01,1445.0,1441.504,1433.0,238400,1448.0,1427.0
719,2017/08/02,1450.0,1450.476,1450.0,298400,1456.0,1442.0
720,2017/08/03,1457.0,1456.092,1450.0,329900,1466.0,1444.0
721,2017/08/04,1471.0,1456.709,1443.0,266700,1473.0,1431.0
722,2017/08/07,1472.0,1474.5,1481.0,234300,1484.0,1465.0
723,2017/08/08,1457.0,1460.946,1472.0,156000,1473.0,1451.0
724,2017/08/09,1409.0,1406.034,1427.0,685600,1435.0,1360.0
725,2017/08/10,1413.0,1405.546,1394.0,377000,1415.0,1389.0
726,2017/08/14,1382.0,1388.138,1404.0,530400,1405.0,1380.0
727,2017/08/15,1375.0,1380.202,1382.0,279000,1394.0,1375.0
728,2017/08/16,1368.0,1374.889,1372.0,251100,1386.0,1368.0
729,2017/08/17,1363.0,1371.472,1375.0,190500,1387.0,1363.0
730,2017/08/18,1333.0,1337.742,1347.0,287500,1350.0,1331.0
731,2017/08/21,1351.0,1344.672,1336.0,216800,1352.0,1328.0
732,2017/08/22,1356.0,1354.792,1344.0,147900,1362.0,1341.0
733,2017/08/23,1352.0,1347.454,1351.0,349400,1353.0,1337.0
734,2017/08/24,1348.0,1351.544,1350.0,174200,1362.0,1346.0
735,2017/08/25,1346.0,1347.594,1357.0,163400,1357.0,1343.0
736,2017/08/28,1375.0,1372.967,1348.0,321900,1389.0,1348.0
737,2017/08/29,1352.0,1350.683,1359.0,301500,1359.0,1344.0
738,2017/08/30,1351.0,1344.227,1356.0,319800,1358.0,1331.0
739,2017/08/31,1348.0,1339.37,1340.0,394800,1350.0,1324.0
740,2017/09/01,1323.0,1325.714,1348.0,277700,1350.0,1316.0
741,2017/09/04,1314.0,1316.26,1315.0,309500,1324.0,1313.0
742,2017/09/05,1305.0,1311.168,1319.0,223500,1321.0,1300.0
743,2017/09/06,1316.0,1310.143,1300.0,291400,1317.0,1300.0
744,2017/09/07,1323.0,1317.78,1304.0,236000,1328.0,1304.0
745,2017/09/08,1312.0,1311.372,1316.0,338100,1325.0,1300.0
746,2017/09/11,1342.0,1338.525,1323.0,295900,1352.0,1323.0
747,2017/09/12,1363.0,1355.82,1343.0,170400,1364.0,1338.0
748,2017/09/13,1374.0,1369.967,1370.0,174900,1378.0,1357.0
749,2017/09/14,1369.0,1371.397,1375.0,156000,1381.0,1366.0
750,2017/09/15,1343.0,1349.053,1361.0,561400,1367.0,1340.0
751,2017/09/19,1330.0,1327.172,1334.0,571700,1335.0,1315.0
752,2017/09/20,1333.0,1331.08,1338.0,300600,1341.0,1327.0
753,2017/09/21,1331.0,1330.439,1336.0,265100,1343.0,1323.0
754,2017/09/22,1345.0,1342.673,1343.0,186600,1350.0,1336.0
755,2017/09/25,1351.0,1351.306,1356.0,233700,1362.0,1344.0
756,2017/09/26,1361.0,1360.367,1354.0,272200,1367.0,1347.0
757,2017/09/27,1333.0,1340.409,1364.0,215400,1376.0,1331.0
758,2017/09/28,1334.0,1332.042,1333.0,219200,1337.0,1325.0
759,2017/09/29,1328.0,1328.936,1333.0,274200,1340.0,1324.0
760,2017/10/02,1322.0,1323.214,1328.0,322300,1330.0,1316.0
761,2017/10/03,1316.0,1318.245,1331.0,270400,1334.0,1312.0
762,2017/10/04,1330.0,1327.672,1322.0,268800,1333.0,1318.0
763,2017/10/05,1342.0,1341.831,1335.0,220100,1350.0,1335.0
764,2017/10/06,1349.0,1344.141,1346.0,221700,1351.0,1338.0
765,2017/10/10,1366.0,1363.145,1358.0,210700,1368.0,1351.0
766,2017/10/11,1373.0,1370.127,1364.0,174600,1374.0,1363.0
767,2017/10/12,1375.0,1372.493,1379.0,198700,1379.0,1363.0
768,2017/10/13,1375.0,1371.129,1365.0,237700,1377.0,1364.0
769,2017/10/16,1390.0,1386.959,1379.0,236800,1396.0,1375.0
770,2017/10/17,1391.0,1391.762,1390.0,190000,1397.0,1388.0
771,2017/10/18,1393.0,1391.849,1395.0,131000,1398.0,1387.0
772,2017/10/19,1390.0,1393.323,1390.0,151000,1399.0,1385.0
773,2017/10/20,1393.0,1393.01,1390.0,140300,1399.0,1386.0
774,2017/10/23,1388.0,1394.659,1410.0,286800,1415.0,1384.0
775,2017/10/24,1399.0,1394.52,1388.0,175200,1399.0,1388.0
776,2017/10/25,1394.0,1397.696,1407.0,153900,1411.0,1391.0
777,2017/10/26,1403.0,1400.628,1394.0,117700,1405.0,1394.0
778,2017/10/27,1350.0,1345.374,1351.0,1437800,1360.0,1327.0
779,2017/10/30,1357.0,1357.854,1351.0,515300,1368.0,1349.0
780,2017/10/31,1358.0,1359.418,1367.0,266800,1374.0,1351.0
781,2017/11/01,1373.0,1366.332,1358.0,248000,1373.0,1351.0
782,2017/11/02,1391.0,1381.684,1369.0,224800,1391.0,1361.0
783,2017/11/06,1408.0,1401.079,1404.0,324400,1409.0,1386.0
784,2017/11/07,1428.0,1420.736,1407.0,361600,1430.0,1400.0
785,2017/11/08,1427.0,1415.73,1428.0,257300,1428.0,1403.0
786,2017/11/09,1447.0,1456.088,1432.0,543700,1477.0,1432.0
787,2017/11/10,1480.0,1484.581,1444.0,1088100,1517.0,1444.0
788,2017/11/13,1441.0,1440.44,1450.0,398300,1452.0,1421.0
789,2017/11/14,1427.0,1434.524,1434.0,335900,1447.0,1426.0
790,2017/11/15,1384.0,1391.086,1417.0,403200,1417.0,1379.0
791,2017/11/16,1399.0,1391.259,1380.0,185900,1404.0,1378.0
792,2017/11/17,1388.0,1394.905,1400.0,217400,1411.0,1384.0
793,2017/11/20,1384.0,1386.311,1383.0,196000,1393.0,1380.0
794,2017/11/21,1379.0,1383.943,1384.0,205600,1393.0,1379.0
795,2017/11/22,1388.0,1390.93,1388.0,171000,1399.0,1383.0
796,2017/11/24,1409.0,1408.431,1400.0,195700,1414.0,1394.0
797,2017/11/27,1413.0,1415.525,1412.0,182500,1423.0,1409.0
798,2017/11/28,1432.0,1428.888,1420.0,240000,1435.0,1415.0
799,2017/11/29,1483.0,1464.117,1440.0,299100,1483.0,1436.0
800,2017/11/30,1501.0,1499.29,1485.0,600400,1522.0,1472.0
801,2017/12/01,1447.0,1457.197,1490.0,592600,1490.0,1442.0
802,2017/12/04,1426.0,1435.756,1457.0,212700,1457.0,1426.0
803,2017/12/05,1443.0,1434.405,1427.0,152700,1446.0,1415.0
804,2017/12/06,1394.0,1406.235,1430.0,285500,1435.0,1390.0
805,2017/12/07,1417.0,1411.639,1400.0,197200,1418.0,1394.0
806,2017/12/08,1478.0,1456.161,1416.0,728200,1489.0,1415.0
807,2017/12/11,1464.0,1460.436,1478.0,266300,1478.0,1450.0
808,2017/12/12,1458.0,1460.456,1466.0,206800,1471.0,1454.0
809,2017/12/13,1437.0,1437.924,1454.0,261900,1454.0,1429.0
810,2017/12/14,1443.0,1436.104,1451.0,296100,1451.0,1418.0
811,2017/12/15,1431.0,1432.497,1438.0,240300,1449.0,1424.0
812,2017/12/18,1435.0,1436.31,1440.0,195700,1444.0,1431.0
813,2017/12/19,1444.0,1444.58,1437.0,200300,1451.0,1436.0
814,2017/12/20,1460.0,1458.217,1440.0,241900,1464.0,1437.0
815,2017/12/21,1478.0,1472.056,1454.0,156000,1482.0,1452.0
816,2017/12/22,1486.0,1487.153,1479.0,181900,1493.0,1479.0
817,2017/12/25,1499.0,1497.511,1488.0,154100,1510.0,1488.0
818,2017/12/26,1479.0,1483.181,1498.0,185400,1504.0,1475.0
819,2017/12/27,1464.0,1473.719,1479.0,134200,1495.0,1463.0
820,2017/12/28,1452.0,1457.253,1469.0,105500,1475.0,1450.0
821,2017/12/29,1490.0,1477.353,1456.0,190600,1492.0,1450.0
822,2018/01/04,1503.0,1498.578,1496.0,196300,1515.0,1490.0
823,2018/01/05,1495.0,1501.148,1520.0,292100,1528.0,1492.0
824,2018/01/09,1536.0,1524.458,1500.0,263400,1538.0,1500.0
825,2018/01/10,1527.0,1531.667,1533.0,115800,1548.0,1524.0
826,2018/01/11,1534.0,1528.236,1527.0,174800,1534.0,1519.0
827,2018/01/12,1505.0,1509.34,1525.0,205100,1531.0,1501.0
828,2018/01/15,1500.0,1504.571,1505.0,87100,1514.0,1498.0
829,2018/01/16,1493.0,1493.274,1488.0,154800,1501.0,1482.0
830,2018/01/17,1495.0,1495.784,1488.0,165900,1506.0,1488.0
831,2018/01/18,1473.0,1486.853,1500.0,214100,1503.0,1473.0
832,2018/01/19,1500.0,1495.049,1475.0,140200,1502.0,1475.0
833,2018/01/22,1515.0,1512.072,1510.0,159200,1520.0,1503.0
834,2018/01/23,1535.0,1537.34,1535.0,249400,1547.0,1529.0
835,2018/01/24,1550.0,1548.942,1533.0,232400,1561.0,1528.0
836,2018/01/25,1525.0,1524.174,1530.0,183200,1531.0,1517.0
837,2018/01/26,1521.0,1529.151,1515.0,299400,1547.0,1513.0
838,2018/01/29,1506.0,1513.62,1525.0,177500,1526.0,1506.0
839,2018/01/30,1516.0,1515.898,1507.0,237300,1524.0,1506.0
840,2018/01/31,1490.0,1505.157,1520.0,231600,1529.0,1490.0
841,2018/02/01,1492.0,1488.757,1493.0,276800,1500.0,1478.0
842,2018/02/02,1490.0,1491.841,1487.0,207500,1505.0,1483.0
843,2018/02/05,1456.0,1460.875,1468.0,230200,1479.0,1452.0
844,2018/02/06,1424.0,1417.705,1412.0,374800,1426.0,1406.0
845,2018/02/07,1441.0,1446.388,1436.0,253700,1465.0,1434.0
846,2018/02/08,1448.0,1447.276,1441.0,182400,1463.0,1436.0
847,2018/02/09,1435.0,1424.523,1421.0,307500,1442.0,1396.0
848,2018/02/13,1433.0,1447.694,1444.0,306500,1478.0,1428.0
849,2018/02/14,1442.0,1433.539,1431.0,143500,1450.0,1414.0
850,2018/02/15,1465.0,1460.749,1450.0,176900,1469.0,1441.0
851,2018/02/16,1500.0,1492.802,1468.0,247600,1507.0,1462.0
852,2018/02/19,1510.0,1513.84,1510.0,194300,1528.0,1496.0
853,2018/02/20,1526.0,1518.321,1515.0,123200,1530.0,1505.0
854,2018/02/21,1530.0,1532.717,1525.0,208600,1547.0,1520.0
855,2018/02/22,1522.0,1525.236,1515.0,210800,1538.0,1504.0
856,2018/02/23,1531.0,1529.534,1521.0,204800,1542.0,1512.0
857,2018/02/26,1545.0,1545.389,1539.0,238100,1559.0,1531.0
858,2018/02/27,1512.0,1514.237,1545.0,335600,1545.0,1500.0
859,2018/02/28,1476.0,1487.828,1500.0,204000,1517.0,1475.0
860,2018/03/01,1475.0,1476.239,1473.0,207700,1491.0,1463.0
861,2018/03/02,1461.0,1456.847,1452.0,321500,1464.0,1442.0
862,2018/03/05,1470.0,1471.157,1460.0,229600,1479.0,1460.0
863,2018/03/06,1491.0,1482.65,1479.0,247800,1493.0,1461.0
864,2018/03/07,1485.0,1489.226,1476.0,219600,1505.0,1466.0
865,2018/03/08,1518.0,1507.37,1493.0,337600,1518.0,1480.0
866,2018/03/09,1502.0,1516.576,1524.0,284100,1535.0,1501.0
867,2018/03/12,1520.0,1514.792,1513.0,175200,1521.0,1502.0
868,2018/03/13,1538.0,1528.821,1514.0,187300,1538.0,1511.0
869,2018/03/14,1531.0,1521.089,1523.0,318400,1533.0,1502.0
870,2018/03/15,1530.0,1524.124,1523.0,235800,1532.0,1507.0
871,2018/03/16,1518.0,1513.987,1530.0,333300,1530.0,1497.0
872,2018/03/19,1470.0,1479.783,1505.0,239700,1506.0,1466.0
873,2018/03/20,1468.0,1468.172,1462.0,211100,1475.0,1460.0
874,2018/03/22,1484.0,1476.596,1470.0,182600,1488.0,1459.0
875,2018/03/23,1462.0,1462.442,1465.0,283100,1471.0,1459.0
876,2018/03/26,1470.0,1462.293,1446.0,245700,1475.0,1446.0
877,2018/03/27,1489.0,1480.585,1470.0,287300,1489.0,1469.0
878,2018/03/28,1471.0,1464.906,1465.0,161800,1474.0,1456.0
879,2018/03/29,1487.0,1477.695,1483.0,210300,1490.0,1466.0
880,2018/03/30,1500.0,1503.936,1496.0,249300,1516.0,1495.0
881,2018/04/02,1457.0,1473.758,1508.0,186200,1508.0,1456.0
882,2018/04/03,1468.0,1467.138,1450.0,181500,1475.0,1450.0
883,2018/04/04,1482.0,1480.73,1466.0,171600,1490.0,1459.0
884,2018/04/05,1510.0,1510.064,1496.0,293300,1519.0,1494.0
885,2018/04/06,1481.0,1486.734,1507.0,255300,1507.0,1475.0
886,2018/04/09,1497.0,1489.856,1480.0,136500,1500.0,1474.0
887,2018/04/10,1519.0,1518.902,1499.0,295600,1535.0,1495.0
888,2018/04/11,1468.0,1469.658,1488.0,317400,1513.0,1460.0
889,2018/04/12,1459.0,1464.331,1470.0,221700,1483.0,1456.0
890,2018/04/13,1495.0,1491.091,1464.0,322900,1508.0,1463.0
891,2018/04/16,1512.0,1507.617,1497.0,172300,1514.0,1495.0
892,2018/04/17,1522.0,1523.673,1511.0,169900,1531.0,1511.0
893,2018/04/18,1540.0,1537.126,1524.0,213200,1544.0,1520.0
894,2018/04/19,1540.0,1545.813,1547.0,219400,1554.0,1539.0
895,2018/04/20,1540.0,1539.168,1531.0,164300,1545.0,1526.0
896,2018/04/23,1529.0,1527.969,1530.0,133800,1534.0,1518.0
897,2018/04/24,1525.0,1527.649,1542.0,115800,1544.0,1521.0
898,2018/04/25,1531.0,1526.848,1525.0,82900,1536.0,1515.0
899,2018/04/26,1533.0,1534.227,1540.0,131900,1544.0,1523.0
900,2018/04/27,1535.0,1534.182,1537.0,162500,1544.0,1527.0
901,2018/05/01,1542.0,1537.262,1535.0,118500,1544.0,1524.0
902,2018/05/02,1544.0,1539.502,1544.0,95900,1545.0,1531.0
903,2018/05/07,1538.0,1542.832,1546.0,185700,1549.0,1537.0
904,2018/05/08,1527.0,1526.189,1536.0,179000,1537.0,1519.0
905,2018/05/09,1547.0,1544.351,1540.0,255400,1555.0,1531.0
906,2018/05/10,1508.0,1524.961,1551.0,172600,1551.0,1503.0
907,2018/05/11,1570.0,1571.821,1502.0,973300,1624.0,1500.0
908,2018/05/14,1561.0,1579.8,1610.0,676700,1612.0,1549.0
909,2018/05/15,1576.0,1568.057,1545.0,290000,1586.0,1535.0
910,2018/05/16,1591.0,1588.028,1581.0,235800,1597.0,1569.0
911,2018/05/17,1595.0,1594.349,1589.0,380100,1598.0,1576.0
912,2018/05/18,1573.0,1578.521,1586.0,150100,1593.0,1572.0
913,2018/05/21,1552.0,1555.922,1559.0,332500,1572.0,1546.0
914,2018/05/22,1578.0,1579.689,1551.0,337100,1594.0,1539.0
915,2018/05/23,1583.0,1577.973,1571.0,129800,1583.0,1567.0
916,2018/05/24,1580.0,1583.704,1592.0,189300,1599.0,1578.0
917,2018/05/25,1580.0,1583.351,1576.0,236400,1589.0,1572.0
918,2018/05/28,1560.0,1558.428,1565.0,363400,1565.0,1551.0
919,2018/05/29,1558.0,1557.1,1559.0,308400,1563.0,1547.0
920,2018/05/30,1543.0,1546.819,1551.0,403500,1563.0,1535.0
921,2018/05/31,1560.0,1558.966,1561.0,322100,1567.0,1549.0
922,2018/06/01,1517.0,1521.76,1538.0,637700,1557.0,1508.0
923,2018/06/04,1570.0,1564.856,1547.0,369800,1572.0,1534.0
924,2018/06/05,1570.0,1567.02,1571.0,243100,1584.0,1550.0
925,2018/06/06,1570.0,1573.153,1576.0,203800,1585.0,1563.0
926,2018/06/07,1566.0,1564.59,1566.0,140000,1576.0,1555.0
927,2018/06/08,1549.0,1558.792,1562.0,201200,1573.0,1548.0
928,2018/06/11,1552.0,1558.167,1547.0,246200,1566.0,1543.0
929,2018/06/12,1572.0,1566.022,1566.0,170600,1574.0,1553.0
930,2018/06/13,1582.0,1582.32,1579.0,252500,1584.0,1577.0
931,2018/06/14,1569.0,1576.502,1579.0,188400,1585.0,1569.0
932,2018/06/15,1590.0,1592.421,1590.0,303600,1603.0,1578.0
933,2018/06/18,1606.0,1603.627,1595.0,364900,1614.0,1589.0
934,2018/06/19,1566.0,1574.537,1596.0,278800,1596.0,1564.0
935,2018/06/20,1554.0,1551.144,1566.0,226900,1567.0,1537.0
936,2018/06/21,1531.0,1534.851,1534.0,198900,1544.0,1526.0
937,2018/06/22,1534.0,1529.417,1530.0,240000,1536.0,1521.0
938,2018/06/25,1559.0,1551.195,1541.0,161100,1561.0,1538.0
939,2018/06/26,1574.0,1560.615,1554.0,198800,1574.0,1535.0
940,2018/06/27,1592.0,1587.705,1583.0,296100,1598.0,1570.0
941,2018/06/28,1560.0,1560.828,1571.0,204100,1574.0,1550.0
942,2018/06/29,1542.0,1542.76,1550.0,227700,1556.0,1534.0
943,2018/07/02,1515.0,1522.84,1549.0,272700,1549.0,1513.0
944,2018/07/03,1507.0,1508.205,1515.0,191800,1521.0,1502.0
945,2018/07/04,1533.0,1534.313,1504.0,227700,1547.0,1502.0
946,2018/07/05,1517.0,1519.087,1527.0,150500,1528.0,1512.0
947,2018/07/06,1536.0,1534.335,1517.0,164900,1541.0,1511.0
948,2018/07/09,1548.0,1541.298,1537.0,146600,1552.0,1530.0
949,2018/07/10,1537.0,1543.892,1551.0,174700,1555.0,1537.0
950,2018/07/11,1516.0,1525.887,1532.0,247100,1548.0,1510.0
951,2018/07/12,1518.0,1524.461,1525.0,172600,1538.0,1517.0
952,2018/07/13,1525.0,1524.039,1518.0,119600,1531.0,1518.0
953,2018/07/17,1556.0,1553.806,1525.0,188800,1564.0,1524.0
954,2018/07/18,1557.0,1564.306,1575.0,172800,1579.0,1557.0
955,2018/07/19,1519.0,1523.688,1546.0,226700,1546.0,1519.0
956,2018/07/20,1511.0,1510.723,1515.0,116400,1519.0,1504.0
957,2018/07/23,1531.0,1528.562,1511.0,158200,1535.0,1507.0
958,2018/07/24,1549.0,1546.179,1545.0,188300,1551.0,1538.0
959,2018/07/25,1541.0,1551.321,1554.0,217200,1566.0,1539.0
960,2018/07/26,1567.0,1567.926,1561.0,183000,1575.0,1552.0
961,2018/07/27,1574.0,1565.269,1567.0,142600,1575.0,1555.0
962,2018/07/30,1569.0,1567.3,1565.0,143700,1575.0,1555.0
963,2018/07/31,1539.0,1542.912,1567.0,280900,1567.0,1530.0
964,2018/08/01,1538.0,1527.833,1543.0,357500,1546.0,1511.0
965,2018/08/02,1546.0,1551.949,1553.0,355200,1569.0,1539.0
966,2018/08/03,1543.0,1537.741,1546.0,231500,1549.0,1524.0
967,2018/08/06,1548.0,1553.709,1548.0,197700,1570.0,1541.0
968,2018/08/07,1538.0,1540.739,1548.0,184900,1553.0,1530.0
969,2018/08/08,1560.0,1565.785,1574.0,1736900,1618.0,1507.0
970,2018/08/09,1591.0,1584.922,1535.0,859200,1614.0,1534.0
971,2018/08/10,1587.0,1597.747,1605.0,501200,1629.0,1585.0
972,2018/08/13,1550.0,1561.788,1576.0,338200,1586.0,1546.0
973,2018/08/14,1581.0,1577.714,1550.0,321800,1582.0,1545.0
974,2018/08/15,1553.0,1569.489,1590.0,296200,1597.0,1550.0
975,2018/08/16,1533.0,1537.584,1538.0,367400,1551.0,1529.0
976,2018/08/17,1517.0,1523.804,1536.0,255600,1542.0,1516.0
977,2018/08/20,1498.0,1502.905,1518.0,316700,1527.0,1492.0
978,2018/08/21,1487.0,1486.471,1480.0,389900,1500.0,1476.0
979,2018/08/22,1473.0,1475.156,1491.0,382500,1491.0,1462.0
980,2018/08/23,1492.0,1486.75,1477.0,279900,1495.0,1473.0
981,2018/08/24,1518.0,1508.71,1500.0,394500,1521.0,1492.0
982,2018/08/27,1525.0,1523.988,1527.0,274700,1533.0,1518.0
983,2018/08/28,1527.0,1528.944,1535.0,289100,1537.0,1526.0
984,2018/08/29,1535.0,1533.952,1528.0,382000,1538.0,1528.0
985,2018/08/30,1572.0,1570.014,1554.0,1107100,1577.0,1549.0
986,2018/08/31,1574.0,1573.149,1558.0,386200,1582.0,1552.0
987,2018/09/03,1568.0,1564.258,1559.0,248500,1571.0,1558.0
988,2018/09/04,1574.0,1574.951,1574.0,209300,1581.0,1570.0
989,2018/09/05,1594.0,1594.425,1585.0,387200,1605.0,1585.0
990,2018/09/06,1576.0,1580.918,1588.0,294100,1594.0,1573.0
991,2018/09/07,1596.0,1587.242,1569.0,253400,1597.0,1567.0
992,2018/09/10,1574.0,1580.825,1596.0,256000,1603.0,1573.0
993,2018/09/11,1573.0,1568.595,1570.0,242800,1579.0,1560.0
994,2018/09/12,1589.0,1585.115,1573.0,240200,1596.0,1570.0
995,2018/09/13,1640.0,1634.256,1589.0,475300,1644.0,1589.0
996,2018/09/14,1660.0,1657.186,1644.0,619700,1674.0,1644.0
997,2018/09/18,1635.0,1633.541,1660.0,542800,1660.0,1609.0
998,2018/09/19,1650.0,1647.863,1659.0,293800,1667.0,1635.0
999,2018/09/20,1640.0,1643.631,1663.0,390400,1663.0,1626.0
1000,2018/09/21,1636.0,1641.096,1644.0,328100,1662.0,1630.0
1001,2018/09/25,1683.0,1672.178,1659.0,297900,1683.0,1649.0
1002,2018/09/26,1661.0,1662.93,1681.0,320700,1681.0,1650.0
1003,2018/09/27,1626.0,1635.721,1661.0,285600,1669.0,1626.0
1004,2018/09/28,1624.0,1620.601,1618.0,530500,1634.0,1604.0
1005,2018/10/01,1617.0,1619.926,1625.0,185400,1635.0,1609.0
1006,2018/10/02,1615.0,1618.328,1629.0,213900,1631.0,1612.0
1007,2018/10/03,1607.0,1616.828,1618.0,236300,1636.0,1607.0
1008,2018/10/04,1618.0,1618.32,1619.0,305800,1632.0,1608.0
1009,2018/10/05,1613.0,1615.066,1609.0,238300,1623.0,1603.0
1010,2018/10/09,1574.0,1583.356,1600.0,296300,1611.0,1568.0
1011,2018/10/10,1568.0,1573.833,1574.0,354100,1588.0,1556.0
1012,2018/10/11,1532.0,1532.25,1525.0,336600,1547.0,1522.0
1013,2018/10/12,1520.0,1514.413,1518.0,345600,1522.0,1502.0
1014,2018/10/15,1514.0,1517.558,1520.0,308100,1528.0,1511.0
1015,2018/10/16,1522.0,1510.075,1505.0,311700,1524.0,1495.0
1016,2018/10/17,1518.0,1521.495,1532.0,212000,1534.0,1512.0
1017,2018/10/18,1540.0,1534.736,1520.0,225400,1545.0,1517.0
1018,2018/10/19,1557.0,1544.531,1525.0,309000,1558.0,1520.0
1019,2018/10/22,1522.0,1526.232,1544.0,163900,1544.0,1519.0
1020,2018/10/23,1489.0,1493.557,1504.0,276100,1504.0,1484.0
1021,2018/10/24,1466.0,1469.131,1490.0,493600,1500.0,1454.0
1022,2018/10/25,1428.0,1427.026,1425.0,484300,1438.0,1417.0
1023,2018/10/26,1440.0,1440.093,1441.0,399800,1449.0,1430.0
1024,2018/10/29,1441.0,1443.491,1443.0,380900,1460.0,1439.0
1025,2018/10/30,1478.0,1481.362,1451.0,1302000,1499.0,1451.0
1026,2018/10/31,1465.0,1467.391,1485.0,270700,1489.0,1458.0
1027,2018/11/01,1479.0,1470.994,1457.0,356300,1490.0,1444.0
1028,2018/11/02,1449.0,1444.241,1478.0,878500,1478.0,1413.0
1029,2018/11/05,1429.0,1421.995,1440.0,716800,1440.0,1409.0
1030,2018/11/06,1441.0,1438.382,1429.0,311400,1447.0,1419.0
1031,2018/11/07,1465.0,1458.321,1453.0,319200,1470.0,1442.0
1032,2018/11/08,1429.0,1461.094,1495.0,914900,1538.0,1420.0
1033,2018/11/09,1404.0,1403.011,1420.0,573400,1428.0,1392.0
1034,2018/11/12,1385.0,1377.725,1379.0,345600,1386.0,1360.0
1035,2018/11/13,1384.0,1378.646,1372.0,375500,1384.0,1364.0
1036,2018/11/14,1369.0,1369.802,1376.0,198900,1380.0,1363.0
1037,2018/11/15,1370.0,1364.221,1364.0,277400,1372.0,1355.0
1038,2018/11/16,1349.0,1353.518,1366.0,431500,1371.0,1346.0
1039,2018/11/19,1335.0,1333.045,1349.0,385300,1350.0,1327.0
1040,2018/11/20,1333.0,1333.196,1330.0,213300,1341.0,1321.0
1041,2018/11/21,1332.0,1332.344,1320.0,245200,1341.0,1320.0
1042,2018/11/22,1360.0,1345.477,1345.0,235700,1360.0,1329.0
1043,2018/11/26,1364.0,1364.523,1360.0,217100,1375.0,1353.0
1044,2018/11/27,1363.0,1364.631,1362.0,202100,1380.0,1351.0
1045,2018/11/28,1374.0,1371.959,1370.0,181100,1378.0,1356.0
1046,2018/11/29,1379.0,1383.788,1389.0,170700,1390.0,1379.0
1047,2018/11/30,1394.0,1388.821,1382.0,243300,1395.0,1373.0
1048,2018/12/03,1404.0,1400.5,1406.0,237600,1407.0,1388.0
1049,2018/12/04,1373.0,1388.715,1405.0,188000,1414.0,1373.0
1050,2018/12/05,1374.0,1373.594,1360.0,170500,1383.0,1357.0
1051,2018/12/06,1360.0,1366.108,1364.0,199100,1380.0,1358.0
1052,2018/12/07,1333.0,1334.064,1350.0,421700,1356.0,1328.0
1053,2018/12/10,1321.0,1326.981,1324.0,360500,1335.0,1319.0
1054,2018/12/11,1295.0,1303.688,1320.0,298400,1324.0,1295.0
1055,2018/12/12,1311.0,1306.886,1304.0,261800,1315.0,1293.0
1056,2018/12/13,1342.0,1345.907,1322.0,455300,1359.0,1320.0
1057,2018/12/14,1305.0,1329.832,1350.0,320900,1355.0,1302.0
1058,2018/12/17,1292.0,1299.41,1302.0,202800,1313.0,1292.0
1059,2018/12/18,1286.0,1282.896,1280.0,238200,1289.0,1266.0
1060,2018/12/19,1285.0,1285.472,1302.0,203100,1306.0,1281.0
1061,2018/12/20,1269.0,1276.16,1281.0,201800,1289.0,1268.0
1062,2018/12/21,1237.0,1239.899,1268.0,311100,1272.0,1232.0
1063,2018/12/25,1216.0,1212.179,1241.0,254600,1245.0,1189.0
1064,2018/12/26,1213.0,1215.919,1222.0,270800,1242.0,1204.0
1065,2018/12/27,1266.0,1259.025,1239.0,200600,1276.0,1235.0
1066,2018/12/28,1267.0,1270.516,1273.0,150000,1284.0,1265.0
1067,2019/01/04,1268.0,1266.343,1272.0,219300,1281.0,1250.0
1068,2019/01/07,1306.0,1299.32,1298.0,339600,1306.0,1279.0
1069,2019/01/08,1278.0,1288.21,1302.0,226600,1302.0,1278.0
1070,2019/01/09,1285.0,1292.308,1294.0,194000,1309.0,1284.0
1071,2019/01/10,1319.0,1315.73,1290.0,284800,1327.0,1287.0
1072,2019/01/11,1319.0,1317.026,1330.0,132900,1330.0,1300.0
1073,2019/01/15,1326.0,1319.542,1295.0,192100,1326.0,1288.0
1074,2019/01/16,1318.0,1318.145,1326.0,113600,1327.0,1309.0
1075,2019/01/17,1336.0,1333.587,1318.0,198800,1345.0,1317.0
1076,2019/01/18,1339.0,1344.847,1342.0,170500,1360.0,1332.0
1077,2019/01/21,1360.0,1352.774,1358.0,136100,1364.0,1335.0
1078,2019/01/22,1367.0,1365.472,1375.0,113200,1375.0,1357.0
1079,2019/01/23,1352.0,1351.558,1363.0,115300,1364.0,1345.0
1080,2019/01/24,1380.0,1373.867,1358.0,204600,1384.0,1340.0
1081,2019/01/25,1382.0,1383.579,1386.0,182100,1394.0,1379.0
1082,2019/01/28,1370.0,1371.902,1390.0,157600,1390.0,1365.0
1083,2019/01/29,1382.0,1379.741,1378.0,168600,1385.0,1365.0
1084,2019/01/30,1385.0,1384.013,1390.0,191500,1391.0,1375.0
1085,2019/01/31,1398.0,1398.21,1406.0,149700,1408.0,1391.0
1086,2019/02/01,1400.0,1399.874,1394.0,129900,1406.0,1383.0
1087,2019/02/04,1414.0,1412.184,1414.0,179700,1426.0,1401.0
1088,2019/02/05,1416.0,1410.847,1414.0,151100,1419.0,1388.0
1089,2019/02/06,1421.0,1422.289,1426.0,144000,1431.0,1413.0
1090,2019/02/07,1415.0,1412.403,1426.0,153000,1427.0,1402.0
1091,2019/02/08,1310.0,1319.851,1395.0,833000,1429.0,1245.0
1092,2019/02/12,1245.0,1287.273,1310.0,346400,1311.0,1245.0
1093,2019/02/13,1298.0,1296.075,1305.0,437500,1315.0,1283.0
1094,2019/02/14,1297.0,1302.88,1290.0,243500,1320.0,1290.0
1095,2019/02/15,1298.0,1293.504,1287.0,155300,1300.0,1282.0
1096,2019/02/18,1302.0,1300.536,1322.0,234200,1322.0,1291.0
1097,2019/02/19,1297.0,1293.593,1295.0,141600,1299.0,1285.0
1098,2019/02/20,1307.0,1307.394,1304.0,200600,1314.0,1301.0
1099,2019/02/21,1307.0,1308.036,1307.0,175600,1320.0,1301.0
1100,2019/02/22,1296.0,1295.902,1297.0,180200,1302.0,1291.0
1101,2019/02/25,1317.0,1315.014,1306.0,205400,1321.0,1305.0
1102,2019/02/26,1319.0,1316.69,1316.0,153600,1323.0,1310.0
1103,2019/02/27,1314.0,1316.15,1319.0,169300,1332.0,1311.0
1104,2019/02/28,1310.0,1312.08,1324.0,244100,1327.0,1307.0
1105,2019/03/01,1320.0,1320.52,1311.0,130500,1332.0,1311.0
1106,2019/03/04,1316.0,1318.511,1337.0,98500,1337.0,1311.0
1107,2019/03/05,1318.0,1315.458,1305.0,126000,1320.0,1304.0
1108,2019/03/06,1312.0,1313.55,1312.0,122100,1319.0,1311.0
1109,2019/03/07,1284.0,1289.811,1305.0,294600,1313.0,1270.0
1110,2019/03/08,1251.0,1256.315,1257.0,284000,1266.0,1251.0
1111,2019/03/11,1259.0,1259.519,1257.0,119300,1266.0,1252.0
1112,2019/03/12,1277.0,1272.418,1268.0,165800,1277.0,1260.0
1113,2019/03/13,1259.0,1264.145,1270.0,216000,1281.0,1257.0
1114,2019/03/14,1264.0,1266.202,1264.0,183300,1276.0,1260.0
1115,2019/03/15,1295.0,1291.449,1264.0,232400,1299.0,1264.0
1116,2019/03/18,1291.0,1291.846,1295.0,173800,1306.0,1286.0
1117,2019/03/19,1283.0,1282.452,1285.0,115100,1288.0,1273.0
1118,2019/03/20,1303.0,1298.576,1277.0,134500,1306.0,1277.0
1119,2019/03/22,1298.0,1303.256,1303.0,179900,1316.0,1298.0
1120,2019/03/25,1305.0,1308.676,1295.0,394800,1320.0,1290.0
1121,2019/03/26,1344.0,1340.23,1320.0,363700,1351.0,1320.0
1122,2019/03/27,1337.0,1333.89,1331.0,282300,1344.0,1321.0
1123,2019/03/28,1340.0,1341.802,1320.0,306600,1349.0,1320.0
1124,2019/03/29,1357.0,1356.725,1346.0,1135500,1370.0,1340.0
1125,2019/04/01,1339.0,1349.66,1380.0,285600,1382.0,1334.0
1126,2019/04/02,1345.0,1348.931,1355.0,117000,1362.0,1342.0
1127,2019/04/03,1324.0,1323.888,1335.0,140100,1335.0,1317.0
1128,2019/04/04,1294.0,1301.191,1325.0,187600,1325.0,1290.0
1129,2019/04/05,1332.0,1328.282,1302.0,223600,1341.0,1302.0
1130,2019/04/08,1331.0,1331.515,1341.0,98800,1341.0,1324.0
1131,2019/04/09,1333.0,1338.107,1344.0,130700,1352.0,1332.0
1132,2019/04/10,1343.0,1340.604,1318.0,109200,1349.0,1317.0
1133,2019/04/11,1358.0,1356.659,1343.0,132600,1367.0,1338.0
1134,2019/04/12,1337.0,1340.462,1365.0,107800,1365.0,1331.0
1135,2019/04/15,1354.0,1363.57,1390.0,219100,1393.0,1352.0
1136,2019/04/16,1341.0,1341.61,1349.0,63800,1353.0,1334.0
1137,2019/04/17,1340.0,1339.385,1335.0,85100,1344.0,1331.0
1138,2019/04/18,1304.0,1309.029,1340.0,119000,1340.0,1299.0
1139,2019/04/19,1299.0,1300.709,1307.0,72900,1307.0,1297.0
1140,2019/04/22,1298.0,1295.965,1294.0,96500,1302.0,1286.0
1141,2019/04/23,1298.0,1302.825,1312.0,81800,1315.0,1296.0
1142,2019/04/24,1281.0,1286.388,1306.0,140600,1311.0,1280.0
1143,2019/04/25,1277.0,1276.085,1290.0,173100,1290.0,1268.0
1144,2019/04/26,1284.0,1279.647,1265.0,109500,1289.0,1263.0
1145,2019/05/07,1295.0,1289.611,1280.0,197400,1297.0,1277.0
1146,2019/05/08,1286.0,1280.266,1274.0,271800,1288.0,1267.0
1147,2019/05/09,1266.0,1276.274,1275.0,226800,1293.0,1266.0
1148,2019/05/10,1248.0,1254.619,1255.0,252100,1277.0,1246.0
1149,2019/05/13,1246.0,1250.47,1249.0,207000,1266.0,1239.0
1150,2019/05/14,1228.0,1223.284,1204.0,150400,1229.0,1204.0
1151,2019/05/15,1225.0,1225.998,1236.0,179300,1242.0,1216.0
1152,2019/05/16,1236.0,1234.23,1219.0,169900,1245.0,1217.0
1153,2019/05/17,1309.0,1304.217,1258.0,681100,1375.0,1254.0
1154,2019/05/20,1316.0,1322.5,1334.0,308900,1350.0,1307.0
1155,2019/05/21,1311.0,1308.96,1298.0,152600,1319.0,1298.0
1156,2019/05/22,1317.0,1316.2,1320.0,110000,1328.0,1309.0
1157,2019/05/23,1324.0,1320.843,1308.0,133100,1328.0,1302.0
1158,2019/05/24,1342.0,1342.0,1329.0,206800,1357.0,1320.0
1159,2019/05/27,1333.0,1331.963,1338.0,147800,1341.0,1324.0
1160,2019/05/28,1308.0,1312.548,1333.0,156600,1341.0,1305.0
1161,2019/05/29,1304.0,1303.393,1287.0,174000,1315.0,1284.0
1162,2019/05/30,1270.0,1268.475,1289.0,236500,1294.0,1256.0
1163,2019/05/31,1254.0,1248.664,1263.0,167300,1263.0,1232.0
1164,2019/06/03,1235.0,1232.309,1226.0,150200,1239.0,1222.0
1165,2019/06/04,1225.0,1225.119,1237.0,166100,1240.0,1219.0
1166,2019/06/05,1249.0,1238.624,1255.0,177800,1264.0,1224.0
1167,2019/06/06,1247.0,1240.384,1231.0,180500,1250.0,1226.0
1168,2019/06/07,1240.0,1245.809,1242.0,95600,1258.0,1237.0
1169,2019/06/10,1260.0,1257.61,1259.0,135500,1267.0,1246.0
1170,2019/06/11,1257.0,1259.989,1255.0,93800,1271.0,1251.0
1171,2019/06/12,1255.0,1255.634,1250.0,103700,1261.0,1247.0
1172,2019/06/13,1241.0,1239.792,1239.0,177900,1247.0,1231.0
1173,2019/06/14,1241.0,1241.203,1245.0,102200,1248.0,1233.0
1174,2019/06/17,1229.0,1233.577,1233.0,120200,1247.0,1229.0
1175,2019/06/18,1235.0,1243.803,1229.0,184000,1257.0,1227.0
1176,2019/06/19,1277.0,1269.783,1262.0,177000,1278.0,1251.0
1177,2019/06/20,1302.0,1297.988,1291.0,135200,1303.0,1285.0
1178,2019/06/21,1287.0,1293.338,1320.0,269600,1322.0,1279.0
1179,2019/06/24,1270.0,1274.12,1287.0,115500,1291.0,1266.0
1180,2019/06/25,1280.0,1281.346,1270.0,97600,1290.0,1270.0
1181,2019/06/26,1278.0,1281.062,1269.0,84400,1296.0,1269.0
1182,2019/06/27,1285.0,1279.681,1269.0,97100,1286.0,1269.0
1183,2019/06/28,1267.0,1269.943,1270.0,135600,1289.0,1261.0
1184,2019/07/01,1301.0,1299.577,1297.0,152400,1307.0,1290.0
1185,2019/07/02,1336.0,1329.606,1310.0,204300,1340.0,1308.0
1186,2019/07/03,1343.0,1341.25,1341.0,142200,1345.0,1329.0
1187,2019/07/04,1363.0,1361.511,1349.0,201100,1371.0,1345.0
1188,2019/07/05,1347.0,1351.966,1353.0,107300,1362.0,1347.0
1189,2019/07/08,1315.0,1321.891,1329.0,116000,1337.0,1315.0
1190,2019/07/09,1298.0,1305.469,1319.0,88800,1324.0,1296.0
1191,2019/07/10,1290.0,1289.587,1268.0,164800,1297.0,1268.0
1192,2019/07/11,1296.0,1297.757,1291.0,112100,1308.0,1287.0
1193,2019/07/12,1283.0,1286.164,1301.0,82500,1301.0,1280.0
1194,2019/07/16,1276.0,1280.014,1280.0,87400,1293.0,1275.0
1195,2019/07/17,1275.0,1275.245,1278.0,119800,1288.0,1267.0
1196,2019/07/18,1239.0,1248.306,1274.0,190700,1278.0,1239.0
1197,2019/07/19,1275.0,1265.81,1239.0,109900,1275.0,1237.0
1198,2019/07/22,1277.0,1276.733,1276.0,114700,1283.0,1264.0
1199,2019/07/23,1295.0,1293.011,1273.0,80900,1301.0,1270.0
1200,2019/07/24,1300.0,1296.345,1297.0,128700,1302.0,1287.0
1201,2019/07/25,1302.0,1309.017,1315.0,93400,1319.0,1299.0
1202,2019/07/26,1291.0,1288.79,1287.0,42300,1293.0,1284.0
1203,2019/07/29,1311.0,1307.897,1292.0,104300,1313.0,1291.0
1204,2019/07/30,1315.0,1312.507,1316.0,87800,1316.0,1308.0
1205,2019/07/31,1306.0,1314.13,1322.0,116000,1322.0,1306.0
1206,2019/08/01,1295.0,1291.258,1288.0,91800,1298.0,1280.0
1207,2019/08/02,1255.0,1259.93,1271.0,224300,1282.0,1248.0
1208,2019/08/05,1239.0,1230.799,1240.0,442600,1245.0,1221.0
1209,2019/08/06,1254.0,1239.191,1209.0,179000,1257.0,1209.0
1210,2019/08/07,1249.0,1246.01,1238.0,153500,1255.0,1235.0
1211,2019/08/08,1238.0,1235.901,1235.0,91600,1243.0,1226.0
1212,2019/08/09,1270.0,1264.468,1243.0,392800,1292.0,1223.0
1213,2019/08/13,1207.0,1216.888,1240.0,452300,1263.0,1205.0
1214,2019/08/14,1200.0,1200.996,1221.0,158900,1221.0,1193.0
1215,2019/08/15,1183.0,1180.378,1178.0,247900,1187.0,1168.0
1216,2019/08/16,1167.0,1169.327,1176.0,160000,1178.0,1165.0
1217,2019/08/19,1167.0,1169.739,1180.0,183200,1184.0,1165.0
1218,2019/08/20,1171.0,1167.903,1161.0,152100,1174.0,1159.0
1219,2019/08/21,1165.0,1162.139,1155.0,190100,1170.0,1151.0
1220,2019/08/22,1163.0,1158.205,1173.0,176200,1176.0,1148.0
1221,2019/08/23,1194.0,1187.045,1172.0,146000,1197.0,1168.0
