,Date,Close,VWAP,Open,Volume,High,Low
0,2014/08/25,1533.0,1529.661,1516.0,330300,1543.0,1516.0
1,2014/08/26,1520.0,1527.5,1531.0,239300,1545.0,1513.0
2,2014/08/27,1538.0,1527.171,1513.0,292700,1538.0,1513.0
3,2014/08/28,1501.0,1511.91,1534.0,248500,1536.0,1498.0
4,2014/08/29,1518.0,1498.763,1495.0,198400,1522.0,1483.0
5,2014/09/01,1518.0,1517.314,1508.0,174200,1525.0,1507.0
6,2014/09/02,1506.0,1513.296,1518.0,247200,1527.0,1506.0
7,2014/09/03,1513.0,1509.683,1510.0,221600,1517.0,1501.0
8,2014/09/04,1499.0,1518.533,1510.0,426000,1544.0,1496.0
9,2014/09/05,1505.0,1502.11,1497.0,273700,1515.0,1494.0
10,2014/09/08,1539.0,1526.268,1519.0,313600,1539.0,1510.0
11,2014/09/09,1615.0,1591.714,1548.0,1060100,1627.0,1548.0
12,2014/09/10,1588.0,1580.274,1594.0,633300,1618.0,1553.0
13,2014/09/11,1610.0,1612.592,1602.0,528100,1627.0,1600.0
14,2014/09/12,1598.0,1595.187,1591.0,280600,1605.0,1585.0
15,2014/09/16,1602.0,1692.637,1798.0,3738100,1798.0,1601.0
16,2014/09/17,1575.0,1590.391,1605.0,645600,1616.0,1571.0
17,2014/09/18,1565.0,1572.954,1575.0,441300,1595.0,1554.0
18,2014/09/19,1574.0,1572.466,1576.0,304200,1580.0,1567.0
19,2014/09/22,1613.0,1607.573,1580.0,509100,1626.0,1575.0
20,2014/09/24,1587.0,1591.337,1610.0,439600,1611.0,1581.0
21,2014/09/25,1569.0,1574.465,1592.0,402500,1596.0,1566.0
22,2014/09/26,1549.0,1551.714,1545.0,392400,1566.0,1540.0
23,2014/09/29,1573.0,1567.048,1560.0,308800,1575.0,1551.0
24,2014/09/30,1555.0,1558.177,1574.0,322100,1574.0,1550.0
25,2014/10/01,1494.0,1520.233,1545.0,444000,1550.0,1492.0
26,2014/10/02,1439.0,1452.226,1451.0,594800,1475.0,1433.0
27,2014/10/03,1499.0,1468.767,1439.0,426500,1507.0,1439.0
28,2014/10/06,1502.0,1498.312,1505.0,257700,1509.0,1475.0
29,2014/10/07,1467.0,1478.858,1500.0,325900,1501.0,1459.0
30,2014/10/08,1446.0,1436.81,1425.0,300700,1466.0,1422.0
31,2014/10/09,1409.0,1427.084,1450.0,317000,1460.0,1407.0
32,2014/10/10,1368.0,1360.855,1353.0,521700,1385.0,1349.0
33,2014/10/14,1329.0,1324.346,1309.0,391300,1338.0,1307.0
34,2014/10/15,1356.0,1336.532,1330.0,229200,1360.0,1318.0
35,2014/10/16,1344.0,1359.833,1320.0,548500,1421.0,1320.0
36,2014/10/17,1311.0,1336.949,1350.0,348300,1399.0,1297.0
37,2014/10/20,1372.0,1354.644,1348.0,296800,1372.0,1337.0
38,2014/10/21,1345.0,1353.425,1366.0,312800,1373.0,1330.0
39,2014/10/22,1382.0,1368.998,1370.0,288100,1393.0,1348.0
40,2014/10/23,1418.0,1414.8,1370.0,519100,1450.0,1365.0
41,2014/10/24,1462.0,1470.255,1473.0,556400,1485.0,1456.0
42,2014/10/27,1462.0,1471.392,1463.0,284900,1484.0,1460.0
43,2014/10/28,1427.0,1443.844,1460.0,193500,1465.0,1427.0
44,2014/10/29,1433.0,1432.306,1434.0,111300,1443.0,1425.0
45,2014/10/30,1550.0,1514.568,1427.0,1532000,1569.0,1408.0
46,2014/10/31,1540.0,1557.508,1553.0,1549800,1612.0,1513.0
47,2014/11/04,1564.0,1565.047,1569.0,768400,1580.0,1544.0
48,2014/11/05,1610.0,1594.569,1580.0,1036000,1612.0,1570.0
49,2014/11/06,1577.0,1598.217,1629.0,696600,1630.0,1550.0
50,2014/11/07,1555.0,1559.608,1588.0,323300,1588.0,1545.0
51,2014/11/10,1581.0,1573.855,1551.0,335700,1588.0,1546.0
52,2014/11/11,1563.0,1587.073,1612.0,442600,1613.0,1560.0
53,2014/11/12,1553.0,1569.147,1560.0,421600,1594.0,1545.0
54,2014/11/13,1541.0,1548.472,1540.0,252600,1565.0,1534.0
55,2014/11/14,1528.0,1536.101,1559.0,266200,1560.0,1521.0
56,2014/11/17,1476.0,1490.03,1526.0,406100,1526.0,1471.0
57,2014/11/18,1505.0,1496.812,1486.0,371600,1520.0,1482.0
58,2014/11/19,1490.0,1498.097,1504.0,228000,1519.0,1488.0
59,2014/11/20,1514.0,1511.809,1516.0,433900,1543.0,1484.0
60,2014/11/21,1548.0,1539.279,1505.0,589500,1559.0,1504.0
61,2014/11/25,1586.0,1578.6,1574.0,524500,1594.0,1552.0
62,2014/11/26,1580.0,1591.485,1592.0,518800,1605.0,1572.0
63,2014/11/27,1574.0,1595.263,1590.0,695100,1620.0,1556.0
64,2014/11/28,1577.0,1583.127,1576.0,384900,1607.0,1565.0
65,2014/12/01,1580.0,1571.415,1577.0,322500,1583.0,1555.0
66,2014/12/02,1592.0,1588.977,1584.0,417600,1603.0,1572.0
67,2014/12/03,1577.0,1593.687,1600.0,532000,1613.0,1574.0
68,2014/12/04,1556.0,1566.432,1585.0,294600,1586.0,1556.0
69,2014/12/05,1572.0,1557.508,1556.0,286300,1584.0,1539.0
70,2014/12/08,1520.0,1535.829,1570.0,452100,1571.0,1517.0
71,2014/12/09,1485.0,1497.115,1505.0,351300,1518.0,1480.0
72,2014/12/10,1474.0,1479.516,1460.0,273800,1515.0,1455.0
73,2014/12/11,1469.0,1451.741,1450.0,237200,1470.0,1437.0
74,2014/12/12,1459.0,1462.268,1474.0,245200,1478.0,1453.0
75,2014/12/15,1430.0,1437.76,1433.0,208700,1454.0,1430.0
76,2014/12/16,1392.0,1397.657,1415.0,325100,1419.0,1384.0
77,2014/12/17,1390.0,1399.827,1395.0,365100,1416.0,1382.0
78,2014/12/18,1413.0,1413.653,1411.0,218900,1420.0,1408.0
79,2014/12/19,1404.0,1410.909,1420.0,440700,1430.0,1400.0
80,2014/12/22,1390.0,1396.256,1402.0,366700,1412.0,1387.0
81,2014/12/24,1349.0,1368.611,1391.0,736000,1393.0,1348.0
82,2014/12/25,1322.0,1330.123,1330.0,825300,1345.0,1320.0
83,2014/12/26,1418.0,1393.09,1329.0,629300,1419.0,1329.0
84,2014/12/29,1430.0,1433.502,1418.0,419200,1459.0,1411.0
85,2014/12/30,1425.0,1415.736,1414.0,247100,1432.0,1405.0
86,2015/01/05,1450.0,1457.878,1468.0,495600,1477.0,1440.0
87,2015/01/06,1429.0,1439.514,1433.0,413600,1470.0,1425.0
88,2015/01/07,1404.0,1411.269,1428.0,323300,1442.0,1399.0
89,2015/01/08,1443.0,1425.783,1405.0,296700,1445.0,1405.0
90,2015/01/09,1403.0,1411.78,1434.0,320300,1447.0,1393.0
91,2015/01/13,1391.0,1390.301,1398.0,311700,1407.0,1381.0
92,2015/01/14,1353.0,1365.612,1382.0,333300,1391.0,1350.0
93,2015/01/15,1371.0,1361.409,1351.0,158100,1374.0,1350.0
94,2015/01/16,1346.0,1342.562,1357.0,291900,1360.0,1327.0
95,2015/01/19,1377.0,1360.908,1366.0,181700,1380.0,1340.0
96,2015/01/20,1373.0,1373.553,1380.0,156100,1382.0,1364.0
97,2015/01/21,1355.0,1354.9,1374.0,225600,1376.0,1335.0
98,2015/01/22,1360.0,1385.62,1415.0,446100,1420.0,1357.0
99,2015/01/23,1352.0,1360.957,1376.0,192100,1378.0,1350.0
100,2015/01/26,1370.0,1365.919,1367.0,158000,1374.0,1356.0
101,2015/01/27,1372.0,1374.029,1377.0,139700,1380.0,1368.0
102,2015/01/28,1384.0,1374.552,1369.0,185800,1384.0,1366.0
103,2015/01/29,1355.0,1368.939,1378.0,237000,1378.0,1354.0
104,2015/01/30,1352.0,1353.526,1357.0,287300,1368.0,1348.0
105,2015/02/02,1335.0,1343.171,1351.0,218700,1352.0,1333.0
106,2015/02/03,1330.0,1335.248,1348.0,202500,1348.0,1329.0
107,2015/02/04,1321.0,1326.093,1333.0,241200,1336.0,1321.0
108,2015/02/05,1322.0,1318.817,1320.0,182200,1325.0,1314.0
109,2015/02/06,1334.0,1329.601,1328.0,207300,1334.0,1322.0
110,2015/02/09,1372.0,1357.298,1340.0,246700,1372.0,1335.0
111,2015/02/10,1364.0,1365.557,1376.0,151500,1382.0,1351.0
112,2015/02/12,1376.0,1376.997,1392.0,154900,1392.0,1370.0
113,2015/02/13,1363.0,1363.241,1368.0,195600,1375.0,1356.0
114,2015/02/16,1368.0,1361.13,1363.0,188600,1369.0,1355.0
115,2015/02/17,1383.0,1380.844,1368.0,235100,1390.0,1366.0
116,2015/02/18,1380.0,1379.005,1374.0,143800,1384.0,1374.0
117,2015/02/19,1376.0,1376.858,1380.0,133400,1381.0,1374.0
118,2015/02/20,1375.0,1373.221,1372.0,137800,1378.0,1370.0
119,2015/02/23,1378.0,1378.602,1380.0,166900,1382.0,1375.0
120,2015/02/24,1407.0,1398.649,1380.0,345200,1410.0,1376.0
121,2015/02/25,1412.0,1407.627,1410.0,233700,1414.0,1395.0
122,2015/02/26,1391.0,1400.179,1412.0,234200,1415.0,1385.0
123,2015/02/27,1415.0,1406.699,1397.0,276800,1415.0,1393.0
124,2015/03/02,1413.0,1422.979,1425.0,249300,1437.0,1411.0
125,2015/03/03,1386.0,1393.174,1420.0,238900,1422.0,1377.0
126,2015/03/04,1379.0,1379.489,1381.0,214600,1397.0,1366.0
127,2015/03/05,1390.0,1376.648,1376.0,267000,1394.0,1365.0
128,2015/03/06,1394.0,1393.418,1388.0,205000,1400.0,1383.0
129,2015/03/09,1376.0,1379.332,1383.0,196300,1389.0,1375.0
130,2015/03/10,1360.0,1370.984,1376.0,187500,1382.0,1360.0
131,2015/03/11,1377.0,1365.9,1354.0,137200,1380.0,1350.0
132,2015/03/12,1362.0,1367.012,1370.0,185300,1375.0,1360.0
133,2015/03/13,1363.0,1363.997,1370.0,134000,1374.0,1360.0
134,2015/03/16,1346.0,1355.31,1360.0,333500,1378.0,1345.0
135,2015/03/17,1350.0,1355.004,1345.0,292600,1367.0,1345.0
136,2015/03/18,1351.0,1352.345,1355.0,144800,1359.0,1346.0
137,2015/03/19,1346.0,1347.802,1351.0,144600,1359.0,1342.0
138,2015/03/20,1387.0,1375.111,1346.0,334300,1387.0,1343.0
139,2015/03/23,1372.0,1385.035,1395.0,211800,1397.0,1371.0
140,2015/03/24,1373.0,1374.938,1370.0,144500,1383.0,1370.0
141,2015/03/25,1372.0,1370.099,1375.0,134400,1378.0,1364.0
142,2015/03/26,1350.0,1353.899,1360.0,207400,1365.0,1350.0
143,2015/03/27,1343.0,1352.418,1353.0,181400,1367.0,1338.0
144,2015/03/30,1360.0,1350.446,1343.0,109400,1360.0,1342.0
145,2015/03/31,1373.0,1368.532,1360.0,152800,1374.0,1358.0
146,2015/04/01,1375.0,1368.221,1370.0,172400,1378.0,1358.0
147,2015/04/02,1361.0,1365.602,1375.0,135900,1376.0,1360.0
148,2015/04/03,1357.0,1357.709,1360.0,183400,1366.0,1352.0
149,2015/04/06,1378.0,1368.617,1358.0,146000,1378.0,1354.0
150,2015/04/07,1376.0,1375.382,1378.0,122900,1380.0,1370.0
151,2015/04/08,1387.0,1386.15,1380.0,257000,1390.0,1375.0
152,2015/04/09,1446.0,1429.306,1398.0,868700,1447.0,1398.0
153,2015/04/10,1427.0,1433.001,1447.0,336000,1458.0,1410.0
154,2015/04/13,1446.0,1438.088,1430.0,275800,1448.0,1414.0
155,2015/04/14,1434.0,1445.864,1446.0,389100,1470.0,1423.0
156,2015/04/15,1394.0,1399.769,1427.0,505300,1437.0,1378.0
157,2015/04/16,1413.0,1403.537,1398.0,228500,1418.0,1394.0
158,2015/04/17,1395.0,1405.626,1412.0,388100,1434.0,1388.0
159,2015/04/20,1381.0,1393.795,1391.0,191800,1415.0,1380.0
160,2015/04/21,1380.0,1378.632,1381.0,168700,1392.0,1373.0
161,2015/04/22,1373.0,1382.616,1386.0,243400,1400.0,1371.0
162,2015/04/23,1376.0,1380.894,1377.0,205500,1395.0,1373.0
163,2015/04/24,1373.0,1371.717,1376.0,205800,1385.0,1365.0
164,2015/04/27,1367.0,1366.361,1369.0,147600,1372.0,1364.0
165,2015/04/28,1360.0,1362.641,1367.0,200200,1369.0,1358.0
166,2015/04/30,1349.0,1354.924,1356.0,269600,1369.0,1349.0
167,2015/05/01,1341.0,1337.759,1347.0,309000,1354.0,1331.0
168,2015/05/07,1330.0,1335.996,1346.0,238300,1350.0,1330.0
169,2015/05/08,1354.0,1344.865,1334.0,172700,1354.0,1334.0
170,2015/05/11,1340.0,1345.926,1356.0,279200,1360.0,1339.0
171,2015/05/12,1364.0,1359.634,1363.0,244100,1373.0,1345.0
172,2015/05/13,1362.0,1361.914,1366.0,157700,1368.0,1356.0
173,2015/05/14,1353.0,1357.866,1355.0,121200,1365.0,1353.0
174,2015/05/15,1356.0,1349.329,1353.0,115100,1357.0,1345.0
175,2015/05/18,1354.0,1353.159,1357.0,129900,1359.0,1346.0
176,2015/05/19,1396.0,1385.299,1359.0,739200,1415.0,1348.0
177,2015/05/20,1381.0,1390.561,1408.0,362800,1408.0,1380.0
178,2015/05/21,1381.0,1383.042,1386.0,305400,1395.0,1369.0
179,2015/05/22,1392.0,1386.922,1376.0,178900,1398.0,1376.0
180,2015/05/25,1379.0,1391.553,1400.0,305900,1403.0,1378.0
181,2015/05/26,1374.0,1375.126,1380.0,146200,1385.0,1366.0
182,2015/05/27,1371.0,1371.206,1366.0,196600,1385.0,1363.0
183,2015/05/28,1360.0,1367.501,1370.0,149200,1378.0,1360.0
184,2015/05/29,1380.0,1373.613,1361.0,231600,1385.0,1360.0
185,2015/06/01,1374.0,1372.595,1373.0,110100,1378.0,1368.0
186,2015/06/02,1373.0,1385.918,1400.0,288100,1405.0,1368.0
187,2015/06/03,1371.0,1365.799,1365.0,143600,1378.0,1361.0
188,2015/06/04,1365.0,1368.372,1370.0,150700,1375.0,1363.0
189,2015/06/05,1357.0,1359.037,1365.0,155000,1368.0,1354.0
190,2015/06/08,1356.0,1361.08,1360.0,129000,1367.0,1356.0
191,2015/06/09,1343.0,1349.177,1356.0,214900,1357.0,1342.0
192,2015/06/10,1404.0,1396.923,1389.0,1079600,1422.0,1370.0
193,2015/06/11,1402.0,1401.35,1405.0,546900,1420.0,1378.0
194,2015/06/12,1438.0,1429.314,1410.0,739700,1449.0,1395.0
195,2015/06/15,1461.0,1445.78,1433.0,461300,1468.0,1424.0
196,2015/06/16,1414.0,1424.688,1450.0,387000,1458.0,1380.0
197,2015/06/17,1401.0,1399.338,1405.0,203900,1419.0,1386.0
198,2015/06/18,1389.0,1395.629,1415.0,193300,1415.0,1385.0
199,2015/06/19,1390.0,1399.181,1394.0,268300,1412.0,1388.0
200,2015/06/22,1393.0,1394.338,1383.0,148700,1407.0,1383.0
201,2015/06/23,1391.0,1397.176,1409.0,205000,1415.0,1390.0
202,2015/06/24,1425.0,1412.964,1394.0,307800,1435.0,1392.0
203,2015/06/25,1397.0,1401.324,1403.0,199200,1415.0,1394.0
204,2015/06/26,1390.0,1386.891,1395.0,169300,1398.0,1382.0
205,2015/06/29,1341.0,1350.303,1350.0,466500,1363.0,1340.0
206,2015/06/30,1358.0,1353.011,1337.0,226300,1362.0,1337.0
207,2015/07/01,1390.0,1373.207,1360.0,157200,1391.0,1360.0
208,2015/07/02,1390.0,1390.208,1395.0,262500,1408.0,1380.0
209,2015/07/03,1385.0,1376.743,1380.0,152200,1385.0,1369.0
210,2015/07/06,1369.0,1364.368,1370.0,253900,1395.0,1352.0
211,2015/07/07,1368.0,1371.29,1365.0,152900,1387.0,1362.0
212,2015/07/08,1333.0,1342.322,1365.0,439700,1367.0,1328.0
213,2015/07/09,1320.0,1272.282,1314.0,703500,1321.0,1211.0
214,2015/07/10,1296.0,1295.859,1306.0,289300,1314.0,1282.0
215,2015/07/13,1315.0,1314.541,1293.0,167100,1330.0,1293.0
216,2015/07/14,1380.0,1363.759,1336.0,348100,1382.0,1331.0
217,2015/07/15,1411.0,1405.593,1390.0,594300,1417.0,1381.0
218,2015/07/16,1418.0,1411.956,1391.0,276600,1419.0,1391.0
219,2015/07/17,1413.0,1413.907,1401.0,177300,1420.0,1401.0
220,2015/07/21,1420.0,1420.718,1413.0,209300,1434.0,1411.0
221,2015/07/22,1417.0,1409.204,1405.0,171900,1424.0,1396.0
222,2015/07/23,1425.0,1422.267,1417.0,219500,1429.0,1408.0
223,2015/07/24,1418.0,1416.961,1425.0,159900,1426.0,1409.0
224,2015/07/27,1347.0,1359.709,1394.0,464500,1394.0,1336.0
225,2015/07/28,1345.0,1337.355,1336.0,257800,1356.0,1321.0
226,2015/07/29,1335.0,1334.662,1355.0,227000,1356.0,1325.0
227,2015/07/30,1315.0,1326.818,1360.0,448200,1363.0,1307.0
228,2015/07/31,1347.0,1343.535,1338.0,278100,1353.0,1322.0
229,2015/08/03,1323.0,1329.242,1354.0,217400,1354.0,1317.0
230,2015/08/04,1306.0,1312.858,1325.0,193800,1325.0,1305.0
231,2015/08/05,1312.0,1308.476,1305.0,249600,1316.0,1303.0
232,2015/08/06,1309.0,1315.064,1315.0,151300,1323.0,1309.0
233,2015/08/07,1306.0,1304.209,1310.0,265300,1313.0,1300.0
234,2015/08/10,1317.0,1317.926,1315.0,152000,1327.0,1311.0
235,2015/08/11,1320.0,1319.422,1318.0,161400,1327.0,1313.0
236,2015/08/12,1305.0,1305.597,1312.0,223900,1315.0,1301.0
237,2015/08/13,1301.0,1303.634,1305.0,116700,1310.0,1300.0
238,2015/08/14,1297.0,1298.497,1301.0,150800,1304.0,1295.0
239,2015/08/17,1284.0,1288.763,1295.0,154300,1297.0,1283.0
240,2015/08/18,1292.0,1286.83,1283.0,214300,1294.0,1280.0
241,2015/08/19,1276.0,1281.219,1285.0,136800,1291.0,1273.0
242,2015/08/20,1242.0,1253.803,1270.0,250800,1270.0,1241.0
243,2015/08/21,1208.0,1204.829,1200.0,389500,1220.0,1192.0
244,2015/08/24,1102.0,1137.549,1155.0,540000,1184.0,1101.0
245,2015/08/25,1082.0,1056.784,992.0,605900,1149.0,990.0
246,2015/08/26,1137.0,1107.891,1083.0,254000,1137.0,1083.0
247,2015/08/27,1148.0,1152.437,1150.0,241700,1179.0,1140.0
248,2015/08/28,1196.0,1183.703,1169.0,172500,1199.0,1165.0
249,2015/08/31,1220.0,1204.494,1190.0,219300,1222.0,1177.0
250,2015/09/01,1153.0,1181.009,1226.0,280900,1234.0,1144.0
251,2015/09/02,1139.0,1134.575,1121.0,224200,1164.0,1112.0
252,2015/09/03,1139.0,1150.505,1160.0,134200,1176.0,1132.0
253,2015/09/04,1092.0,1107.879,1141.0,227200,1149.0,1085.0
254,2015/09/07,1090.0,1080.51,1062.0,148400,1100.0,1058.0
255,2015/09/08,1066.0,1086.341,1094.0,151200,1115.0,1061.0
256,2015/09/09,1150.0,1129.699,1120.0,236500,1153.0,1099.0
257,2015/09/10,1155.0,1138.703,1120.0,150000,1163.0,1115.0
258,2015/09/11,1177.0,1165.183,1146.0,137500,1185.0,1146.0
259,2015/09/14,1152.0,1163.043,1183.0,106900,1187.0,1146.0
260,2015/09/15,1163.0,1169.269,1152.0,172200,1179.0,1151.0
261,2015/09/16,1145.0,1153.61,1175.0,105000,1175.0,1140.0
262,2015/09/17,1144.0,1143.905,1150.0,71800,1156.0,1131.0
263,2015/09/18,1125.0,1130.798,1133.0,126000,1143.0,1124.0
264,2015/09/24,1122.0,1118.233,1111.0,107900,1135.0,1105.0
265,2015/09/25,1125.0,1116.116,1138.0,108800,1138.0,1102.0
266,2015/09/28,1134.0,1127.04,1120.0,88100,1140.0,1113.0
267,2015/09/29,1089.0,1096.45,1118.0,165300,1125.0,1085.0
268,2015/09/30,1117.0,1100.369,1093.0,153700,1117.0,1086.0
269,2015/10/01,1117.0,1114.384,1110.0,143000,1131.0,1102.0
270,2015/10/02,1115.0,1112.279,1111.0,118400,1122.0,1096.0
271,2015/10/05,1180.0,1165.182,1126.0,199600,1188.0,1126.0
272,2015/10/06,1167.0,1198.167,1210.0,271200,1243.0,1167.0
273,2015/10/07,1189.0,1177.932,1184.0,134700,1195.0,1159.0
274,2015/10/08,1177.0,1188.004,1192.0,176000,1208.0,1174.0
275,2015/10/09,1230.0,1209.631,1185.0,321800,1230.0,1179.0
276,2015/10/13,1300.0,1297.757,1222.0,934900,1380.0,1222.0
277,2015/10/14,1243.0,1250.715,1275.0,390300,1282.0,1222.0
278,2015/10/15,1259.0,1252.799,1230.0,140600,1266.0,1230.0
279,2015/10/16,1263.0,1263.782,1264.0,104300,1272.0,1252.0
280,2015/10/19,1255.0,1259.372,1271.0,89700,1271.0,1251.0
281,2015/10/20,1265.0,1288.545,1320.0,775000,1339.0,1254.0
282,2015/10/21,1244.0,1244.379,1262.0,301800,1265.0,1232.0
283,2015/10/22,1239.0,1239.406,1235.0,86800,1245.0,1232.0
284,2015/10/23,1248.0,1246.916,1248.0,173500,1256.0,1241.0
285,2015/10/26,1261.0,1261.897,1250.0,128700,1272.0,1249.0
286,2015/10/27,1239.0,1250.817,1266.0,90000,1266.0,1238.0
287,2015/10/28,1246.0,1252.445,1266.0,89700,1267.0,1241.0
288,2015/10/29,1247.0,1239.234,1235.0,148100,1249.0,1230.0
289,2015/10/30,1226.0,1226.087,1240.0,273500,1255.0,1210.0
290,2015/11/02,1202.0,1210.227,1226.0,113700,1226.0,1201.0
291,2015/11/04,1208.0,1209.177,1206.0,178100,1228.0,1180.0
292,2015/11/05,1198.0,1208.316,1198.0,238700,1229.0,1196.0
293,2015/11/06,1222.0,1217.959,1196.0,188400,1233.0,1196.0
294,2015/11/09,1226.0,1221.782,1230.0,207500,1235.0,1206.0
295,2015/11/10,1219.0,1208.841,1210.0,234600,1224.0,1202.0
296,2015/11/11,1248.0,1236.097,1210.0,289200,1254.0,1206.0
297,2015/11/12,1219.0,1223.068,1235.0,193500,1241.0,1215.0
298,2015/11/13,1210.0,1205.617,1213.0,164600,1214.0,1199.0
299,2015/11/16,1188.0,1196.613,1200.0,220400,1207.0,1188.0
300,2015/11/17,1181.0,1185.846,1199.0,229300,1199.0,1175.0
301,2015/11/18,1225.0,1228.851,1185.0,595000,1255.0,1185.0
302,2015/11/19,1248.0,1242.54,1230.0,446400,1266.0,1223.0
303,2015/11/20,1279.0,1272.129,1265.0,488000,1283.0,1250.0
304,2015/11/24,1313.0,1304.744,1266.0,647900,1321.0,1265.0
305,2015/11/25,1280.0,1289.844,1313.0,389200,1319.0,1271.0
306,2015/11/26,1332.0,1323.114,1300.0,491100,1333.0,1300.0
307,2015/11/27,1315.0,1322.73,1330.0,230700,1334.0,1313.0
308,2015/11/30,1314.0,1308.283,1312.0,184000,1318.0,1298.0
309,2015/12/01,1328.0,1324.333,1313.0,303800,1336.0,1311.0
310,2015/12/02,1350.0,1343.01,1328.0,406800,1354.0,1320.0
311,2015/12/03,1351.0,1348.78,1349.0,278000,1354.0,1339.0
312,2015/12/04,1330.0,1326.589,1333.0,160700,1349.0,1320.0
313,2015/12/07,1347.0,1342.8,1341.0,169600,1350.0,1335.0
314,2015/12/08,1294.0,1308.938,1342.0,398500,1343.0,1282.0
315,2015/12/09,1278.0,1281.268,1276.0,132000,1294.0,1275.0
316,2015/12/10,1262.0,1271.157,1262.0,257400,1298.0,1257.0
317,2015/12/11,1285.0,1275.851,1260.0,140100,1285.0,1260.0
318,2015/12/14,1260.0,1258.966,1259.0,174900,1269.0,1250.0
319,2015/12/15,1234.0,1250.461,1258.0,169600,1269.0,1226.0
320,2015/12/16,1248.0,1249.073,1261.0,200500,1265.0,1236.0
321,2015/12/17,1249.0,1250.563,1260.0,191100,1263.0,1234.0
322,2015/12/18,1215.0,1233.37,1250.0,349200,1263.0,1215.0
323,2015/12/21,1208.0,1200.445,1203.0,331100,1215.0,1190.0
324,2015/12/22,1201.0,1210.524,1210.0,251500,1226.0,1201.0
325,2015/12/24,1183.0,1188.845,1217.0,479800,1217.0,1167.0
326,2015/12/25,1133.0,1154.977,1178.0,691100,1190.0,1132.0
327,2015/12/28,1193.0,1180.209,1156.0,306700,1204.0,1153.0
328,2015/12/29,1207.0,1196.958,1190.0,189500,1213.0,1170.0
329,2015/12/30,1212.0,1207.634,1207.0,186600,1216.0,1196.0
330,2016/01/04,1195.0,1207.509,1211.0,185100,1235.0,1189.0
331,2016/01/05,1196.0,1187.883,1173.0,209000,1207.0,1170.0
332,2016/01/06,1174.0,1178.714,1210.0,185100,1210.0,1159.0
333,2016/01/07,1165.0,1168.033,1163.0,156400,1189.0,1155.0
334,2016/01/08,1157.0,1150.717,1140.0,162600,1174.0,1137.0
335,2016/01/12,1097.0,1107.652,1150.0,306700,1150.0,1084.0
336,2016/01/13,1138.0,1129.49,1109.0,137000,1148.0,1108.0
337,2016/01/14,1082.0,1071.898,1100.0,351200,1104.0,1050.0
338,2016/01/15,1065.0,1087.608,1114.0,187300,1115.0,1063.0
339,2016/01/18,1052.0,1038.943,1024.0,182700,1059.0,1023.0
340,2016/01/19,1067.0,1053.072,1045.0,166800,1067.0,1040.0
341,2016/01/20,1004.0,1022.684,1061.0,298300,1064.0,1000.0
342,2016/01/21,973.0,997.363,1000.0,380100,1027.0,970.0
343,2016/01/22,1044.0,1023.121,1021.0,300100,1044.0,1002.0
344,2016/01/25,1039.0,1033.763,1040.0,330800,1049.0,1018.0
345,2016/01/26,1015.0,1019.207,1036.0,237400,1036.0,1000.0
346,2016/01/27,1012.0,1016.267,1021.0,356700,1033.0,1003.0
347,2016/01/28,999.0,1004.505,1008.0,297100,1018.0,994.0
348,2016/01/29,1014.0,1002.751,999.0,402800,1021.0,990.0
349,2016/02/01,1058.0,1061.262,1074.0,469400,1079.0,1040.0
350,2016/02/02,1128.0,1136.728,1110.0,935200,1174.0,1097.0
351,2016/02/03,1145.0,1139.123,1137.0,508600,1165.0,1107.0
352,2016/02/04,1122.0,1132.076,1136.0,299700,1152.0,1118.0
353,2016/02/05,1032.0,1053.707,1100.0,379000,1118.0,1024.0
354,2016/02/08,1102.0,1075.765,1021.0,277800,1110.0,1020.0
355,2016/02/09,1014.0,1026.937,1045.0,229100,1067.0,1005.0
356,2016/02/10,984.0,984.8,1018.0,398600,1038.0,960.0
357,2016/02/12,905.0,919.434,924.0,410200,946.0,900.0
358,2016/02/15,956.0,944.99,943.0,219800,964.0,920.0
359,2016/02/16,1011.0,1010.545,971.0,379400,1045.0,968.0
360,2016/02/17,1011.0,1012.651,1003.0,299200,1036.0,991.0
361,2016/02/18,1032.0,1042.777,1027.0,196700,1053.0,1027.0
362,2016/02/19,1037.0,1025.068,1018.0,161100,1048.0,1010.0
363,2016/02/22,1049.0,1046.708,1027.0,122100,1060.0,1025.0
364,2016/02/23,1046.0,1049.725,1060.0,158400,1068.0,1031.0
365,2016/02/24,1041.0,1042.349,1030.0,118200,1060.0,1024.0
366,2016/02/25,1042.0,1047.226,1048.0,96400,1054.0,1036.0
367,2016/02/26,1042.0,1045.525,1046.0,100900,1059.0,1037.0
368,2016/02/29,1044.0,1045.884,1049.0,136100,1056.0,1034.0
369,2016/03/01,1038.0,1039.977,1037.0,114300,1051.0,1029.0
370,2016/03/02,1076.0,1069.728,1051.0,197000,1084.0,1046.0
371,2016/03/03,1106.0,1099.111,1083.0,186500,1118.0,1076.0
372,2016/03/04,1141.0,1142.892,1121.0,388300,1158.0,1119.0
373,2016/03/07,1189.0,1174.216,1143.0,367100,1197.0,1140.0
374,2016/03/08,1159.0,1159.901,1180.0,319000,1190.0,1128.0
375,2016/03/09,1140.0,1137.288,1134.0,159300,1149.0,1126.0
376,2016/03/10,1170.0,1164.07,1163.0,140500,1175.0,1150.0
377,2016/03/11,1209.0,1194.563,1152.0,305100,1210.0,1152.0
378,2016/03/14,1215.0,1223.674,1219.0,262500,1237.0,1215.0
379,2016/03/15,1213.0,1216.426,1212.0,159700,1230.0,1203.0
380,2016/03/16,1184.0,1189.23,1183.0,241000,1220.0,1177.0
381,2016/03/17,1160.0,1174.468,1190.0,207000,1196.0,1144.0
382,2016/03/18,1152.0,1142.118,1153.0,104100,1158.0,1129.0
383,2016/03/22,1170.0,1164.811,1156.0,123700,1177.0,1156.0
384,2016/03/23,1154.0,1173.454,1191.0,94300,1191.0,1152.0
385,2016/03/24,1280.0,1239.483,1188.0,938600,1285.0,1177.0
386,2016/03/25,1366.0,1388.404,1370.0,2391200,1440.0,1354.0
387,2016/03/28,1388.0,1369.975,1364.0,566500,1392.0,1331.0
388,2016/03/29,1427.0,1411.831,1400.0,750500,1427.0,1397.0
389,2016/03/30,1499.0,1487.77,1430.0,2211000,1524.0,1430.0
390,2016/03/31,1486.0,1512.501,1500.0,1461200,1540.0,1485.0
391,2016/04/01,1441.0,1443.581,1489.0,729000,1489.0,1410.0
392,2016/04/04,1500.0,1492.063,1447.0,857600,1516.0,1429.0
393,2016/04/05,1416.0,1426.406,1495.0,960500,1500.0,1357.0
394,2016/04/06,1429.0,1403.782,1401.0,891500,1435.0,1363.0
395,2016/04/07,1490.0,1473.84,1444.0,866700,1494.0,1437.0
396,2016/04/08,1475.0,1488.676,1460.0,1149000,1512.0,1446.0
397,2016/04/11,1550.0,1538.096,1500.0,1729800,1570.0,1481.0
398,2016/04/12,1524.0,1541.104,1565.0,1613600,1587.0,1488.0
399,2016/04/13,1558.0,1554.93,1536.0,959100,1574.0,1516.0
400,2016/04/14,1574.0,1571.295,1576.0,1131700,1594.0,1548.0
401,2016/04/15,1566.0,1567.152,1551.0,740400,1586.0,1551.0
402,2016/04/18,1543.0,1541.681,1548.0,468000,1565.0,1522.0
403,2016/04/19,1615.0,1592.36,1550.0,1165000,1619.0,1550.0
404,2016/04/20,1591.0,1602.977,1615.0,1149300,1638.0,1571.0
405,2016/04/21,1625.0,1615.2,1611.0,726300,1625.0,1597.0
406,2016/04/22,1593.0,1586.856,1615.0,808400,1622.0,1565.0
407,2016/04/25,1531.0,1556.39,1598.0,892900,1612.0,1514.0
408,2016/04/26,1510.0,1517.847,1523.0,1468400,1567.0,1488.0
409,2016/04/27,1560.0,1554.883,1510.0,4744000,1592.0,1493.0
410,2016/04/28,1482.0,1510.964,1548.0,1030900,1579.0,1478.0
411,2016/05/02,1460.0,1448.743,1422.0,765300,1475.0,1414.0
412,2016/05/06,1442.0,1447.763,1457.0,489900,1476.0,1433.0
413,2016/05/09,1464.0,1464.861,1442.0,592300,1490.0,1435.0
414,2016/05/10,1425.0,1399.654,1413.0,876700,1445.0,1326.0
415,2016/05/11,1440.0,1437.593,1455.0,437900,1459.0,1416.0
416,2016/05/12,1395.0,1394.748,1418.0,562800,1426.0,1372.0
417,2016/05/13,1392.0,1385.216,1377.0,417200,1406.0,1356.0
418,2016/05/16,1395.0,1415.869,1416.0,671200,1435.0,1389.0
419,2016/05/17,1416.0,1405.673,1390.0,321800,1418.0,1386.0
420,2016/05/18,1377.0,1390.84,1416.0,494100,1431.0,1366.0
421,2016/05/19,1417.0,1407.169,1400.0,441200,1420.0,1390.0
422,2016/05/20,1416.0,1422.631,1427.0,411100,1437.0,1403.0
423,2016/05/23,1435.0,1428.817,1416.0,460500,1441.0,1409.0
424,2016/05/24,1451.0,1441.677,1431.0,420200,1453.0,1420.0
425,2016/05/25,1440.0,1450.778,1460.0,423700,1466.0,1438.0
426,2016/05/26,1424.0,1415.697,1455.0,487900,1455.0,1385.0
427,2016/05/27,1424.0,1429.396,1426.0,229900,1446.0,1418.0
428,2016/05/30,1440.0,1435.583,1424.0,170800,1444.0,1415.0
429,2016/05/31,1449.0,1439.337,1431.0,284700,1453.0,1418.0
430,2016/06/01,1415.0,1421.221,1427.0,365800,1437.0,1404.0
431,2016/06/02,1392.0,1392.94,1400.0,355800,1419.0,1376.0
432,2016/06/03,1419.0,1407.18,1397.0,334100,1419.0,1390.0
433,2016/06/06,1387.0,1386.788,1398.0,305100,1399.0,1379.0
434,2016/06/07,1413.0,1408.333,1410.0,270200,1419.0,1393.0
435,2016/06/08,1450.0,1431.937,1413.0,413600,1450.0,1408.0
436,2016/06/09,1489.0,1486.062,1446.0,804900,1514.0,1431.0
437,2016/06/10,1556.0,1549.416,1524.0,1259200,1579.0,1515.0
438,2016/06/13,1502.0,1521.624,1570.0,588000,1575.0,1483.0
439,2016/06/14,1395.0,1420.18,1472.0,776000,1488.0,1377.0
440,2016/06/15,1408.0,1396.938,1395.0,405700,1414.0,1367.0
441,2016/06/16,1326.0,1359.108,1422.0,526400,1437.0,1318.0
442,2016/06/17,1306.0,1324.822,1350.0,368600,1364.0,1299.0
443,2016/06/20,1327.0,1328.099,1328.0,327900,1347.0,1307.0
444,2016/06/21,1344.0,1344.299,1327.0,312300,1365.0,1313.0
445,2016/06/22,1316.0,1323.734,1355.0,279200,1358.0,1307.0
446,2016/06/23,1334.0,1333.097,1337.0,204000,1344.0,1317.0
447,2016/06/24,1202.0,1236.196,1345.0,678200,1352.0,1140.0
448,2016/06/27,1261.0,1253.505,1219.0,310100,1276.0,1215.0
449,2016/06/28,1293.0,1283.492,1233.0,295600,1310.0,1232.0
450,2016/06/29,1333.0,1333.233,1323.0,314000,1346.0,1306.0
451,2016/06/30,1356.0,1367.004,1348.0,394900,1394.0,1337.0
452,2016/07/01,1437.0,1421.276,1390.0,512000,1445.0,1375.0
453,2016/07/04,1448.0,1460.421,1466.0,422600,1485.0,1445.0
454,2016/07/05,1424.0,1423.767,1440.0,327700,1445.0,1408.0
455,2016/07/06,1448.0,1434.752,1443.0,481800,1453.0,1407.0
456,2016/07/07,1390.0,1405.761,1435.0,339500,1447.0,1379.0
457,2016/07/08,1351.0,1366.629,1405.0,344700,1415.0,1338.0
458,2016/07/11,1367.0,1358.532,1368.0,536000,1380.0,1336.0
459,2016/07/12,1351.0,1356.118,1395.0,619000,1400.0,1335.0
460,2016/07/13,1350.0,1350.559,1364.0,449100,1364.0,1337.0
461,2016/07/14,1340.0,1338.627,1342.0,376900,1354.0,1329.0
462,2016/07/15,1299.0,1302.117,1327.0,585400,1337.0,1290.0
463,2016/07/19,1361.0,1327.413,1331.0,674900,1361.0,1290.0
464,2016/07/20,1358.0,1362.503,1363.0,425300,1376.0,1342.0
465,2016/07/21,1413.0,1400.392,1379.0,524700,1420.0,1362.0
466,2016/07/22,1401.0,1405.522,1395.0,457300,1437.0,1388.0
467,2016/07/25,1403.0,1407.005,1405.0,404400,1428.0,1384.0
468,2016/07/26,1459.0,1447.245,1403.0,873400,1467.0,1400.0
469,2016/07/27,1449.0,1455.809,1440.0,485000,1474.0,1437.0
470,2016/07/28,1483.0,1504.85,1500.0,1064500,1546.0,1481.0
471,2016/07/29,1504.0,1491.366,1498.0,669500,1509.0,1466.0
472,2016/08/01,1533.0,1534.42,1515.0,747800,1549.0,1508.0
473,2016/08/02,1544.0,1545.115,1530.0,597600,1556.0,1510.0
474,2016/08/03,1503.0,1520.209,1516.0,460400,1546.0,1502.0
475,2016/08/04,1471.0,1480.638,1501.0,394000,1502.0,1465.0
476,2016/08/05,1465.0,1460.868,1466.0,330200,1480.0,1450.0
477,2016/08/08,1505.0,1500.747,1490.0,351800,1512.0,1477.0
478,2016/08/09,1501.0,1497.115,1510.0,230400,1512.0,1484.0
479,2016/08/10,1505.0,1502.909,1488.0,183800,1516.0,1483.0
480,2016/08/12,1520.0,1515.724,1506.0,324800,1526.0,1495.0
481,2016/08/15,1503.0,1505.855,1511.0,135500,1518.0,1499.0
482,2016/08/16,1490.0,1499.223,1510.0,249600,1522.0,1486.0
483,2016/08/17,1482.0,1478.759,1483.0,200400,1492.0,1468.0
484,2016/08/18,1436.0,1454.256,1462.0,259300,1477.0,1436.0
485,2016/08/19,1457.0,1440.291,1434.0,233800,1457.0,1415.0
486,2016/08/22,1461.0,1464.329,1458.0,158900,1476.0,1455.0
487,2016/08/23,1490.0,1492.3,1467.0,251000,1509.0,1464.0
488,2016/08/24,1486.0,1497.511,1525.0,165000,1525.0,1483.0
489,2016/08/25,1479.0,1484.747,1495.0,157400,1495.0,1475.0
490,2016/08/26,1515.0,1504.609,1500.0,385100,1522.0,1486.0
491,2016/08/29,1509.0,1516.028,1528.0,261200,1530.0,1504.0
492,2016/08/30,1524.0,1522.66,1510.0,231700,1530.0,1506.0
493,2016/08/31,1495.0,1496.317,1523.0,353300,1523.0,1484.0
494,2016/09/01,1525.0,1515.849,1500.0,335100,1527.0,1495.0
495,2016/09/02,1545.0,1536.949,1525.0,454300,1545.0,1510.0
496,2016/09/05,1536.0,1539.322,1550.0,332400,1558.0,1527.0
497,2016/09/06,1570.0,1562.694,1536.0,523400,1576.0,1529.0
498,2016/09/07,1595.0,1588.789,1556.0,732000,1605.0,1543.0
499,2016/09/08,1596.0,1594.035,1599.0,429200,1607.0,1574.0
500,2016/09/09,1600.0,1596.613,1600.0,290900,1604.0,1582.0
501,2016/09/12,1555.0,1560.44,1560.0,365100,1579.0,1551.0
502,2016/09/13,1596.0,1590.509,1566.0,373000,1603.0,1561.0
503,2016/09/14,1578.0,1594.091,1568.0,488800,1616.0,1567.0
504,2016/09/15,1590.0,1593.008,1576.0,333600,1607.0,1576.0
505,2016/09/16,1629.0,1622.529,1599.0,1450600,1630.0,1593.0
506,2016/09/20,1644.0,1657.992,1630.0,729700,1681.0,1629.0
507,2016/09/21,1657.0,1652.198,1655.0,469700,1667.0,1622.0
508,2016/09/23,1718.0,1701.158,1665.0,991000,1722.0,1663.0
509,2016/09/26,1718.0,1714.927,1700.0,462100,1733.0,1696.0
510,2016/09/27,1729.0,1713.953,1694.0,465200,1729.0,1682.0
511,2016/09/28,1775.0,1758.306,1725.0,736900,1775.0,1715.0
512,2016/09/29,1719.0,1743.406,1780.0,790200,1789.0,1714.0
513,2016/09/30,1692.0,1701.624,1693.0,587800,1740.0,1680.0
514,2016/10/03,1679.0,1674.934,1670.0,595900,1693.0,1653.0
515,2016/10/04,1711.0,1758.626,1759.0,11228500,1847.0,1691.0
516,2016/10/05,1669.0,1655.86,1671.0,1699800,1691.0,1633.0
517,2016/10/06,1689.0,1671.274,1669.0,828700,1690.0,1648.0
518,2016/10/07,1549.0,1570.31,1631.0,2583200,1637.0,1537.0
519,2016/10/11,1539.0,1532.373,1525.0,912300,1547.0,1523.0
520,2016/10/12,1510.0,1516.92,1525.0,665800,1536.0,1505.0
521,2016/10/13,1466.0,1469.797,1490.0,1375200,1506.0,1453.0
522,2016/10/14,1475.0,1462.125,1457.0,653400,1476.0,1450.0
523,2016/10/17,1481.0,1476.117,1464.0,582000,1487.0,1459.0
524,2016/10/18,1487.0,1489.825,1475.0,449200,1498.0,1472.0
525,2016/10/19,1496.0,1497.106,1502.0,367200,1510.0,1489.0
526,2016/10/20,1499.0,1493.559,1492.0,453000,1500.0,1486.0
527,2016/10/21,1524.0,1555.432,1591.0,2151200,1593.0,1524.0
528,2016/10/24,1535.0,1527.288,1526.0,497200,1538.0,1512.0
529,2016/10/25,1516.0,1521.924,1540.0,468300,1542.0,1510.0
530,2016/10/26,1522.0,1523.816,1511.0,302000,1532.0,1511.0
531,2016/10/27,1523.0,1523.37,1520.0,278800,1529.0,1516.0
532,2016/10/28,1530.0,1527.607,1533.0,368100,1537.0,1519.0
533,2016/10/31,1519.0,1524.581,1530.0,288100,1537.0,1518.0
534,2016/11/01,1493.0,1498.794,1518.0,422000,1518.0,1491.0
535,2016/11/02,1452.0,1454.799,1472.0,589600,1473.0,1443.0
536,2016/11/04,1445.0,1426.374,1429.0,482000,1445.0,1407.0
537,2016/11/07,1458.0,1447.978,1444.0,328000,1461.0,1436.0
538,2016/11/08,1442.0,1450.881,1465.0,277500,1472.0,1438.0
539,2016/11/09,1363.0,1383.427,1450.0,690000,1456.0,1341.0
540,2016/11/10,1493.0,1472.118,1449.0,670600,1497.0,1425.0
541,2016/11/11,1481.0,1473.36,1480.0,413600,1492.0,1451.0
542,2016/11/14,1461.0,1461.233,1478.0,336400,1480.0,1446.0
543,2016/11/15,1445.0,1442.619,1462.0,452900,1462.0,1422.0
544,2016/11/16,1479.0,1469.018,1455.0,248800,1479.0,1446.0
545,2016/11/17,1484.0,1476.064,1458.0,368200,1491.0,1457.0
546,2016/11/18,1463.0,1468.696,1495.0,396500,1499.0,1456.0
547,2016/11/21,1464.0,1466.005,1465.0,174900,1474.0,1455.0
548,2016/11/22,1468.0,1463.191,1459.0,193400,1470.0,1453.0
549,2016/11/24,1464.0,1461.874,1481.0,311300,1482.0,1453.0
550,2016/11/25,1451.0,1455.419,1465.0,385400,1470.0,1439.0
551,2016/11/28,1485.0,1473.79,1465.0,346900,1486.0,1458.0
552,2016/11/29,1464.0,1467.568,1471.0,248400,1479.0,1462.0
553,2016/11/30,1461.0,1466.661,1461.0,223100,1476.0,1460.0
554,2016/12/01,1452.0,1456.702,1461.0,412600,1466.0,1447.0
555,2016/12/02,1422.0,1424.791,1435.0,650800,1444.0,1411.0
556,2016/12/05,1412.0,1412.715,1423.0,267700,1432.0,1407.0
557,2016/12/06,1417.0,1416.99,1415.0,287200,1426.0,1410.0
558,2016/12/07,1410.0,1405.683,1416.0,361600,1419.0,1400.0
559,2016/12/08,1387.0,1387.111,1405.0,558700,1407.0,1372.0
560,2016/12/09,1400.0,1389.142,1372.0,367200,1401.0,1372.0
561,2016/12/12,1425.0,1419.227,1405.0,333100,1433.0,1401.0
562,2016/12/13,1442.0,1434.689,1428.0,375300,1442.0,1421.0
563,2016/12/14,1428.0,1432.625,1445.0,244400,1447.0,1426.0
564,2016/12/15,1430.0,1429.144,1433.0,198500,1437.0,1423.0
565,2016/12/16,1523.0,1503.144,1490.0,1721800,1524.0,1455.0
566,2016/12/19,1460.0,1475.338,1510.0,684500,1515.0,1457.0
567,2016/12/20,1461.0,1464.777,1461.0,299000,1473.0,1457.0
568,2016/12/21,1440.0,1449.268,1470.0,385300,1474.0,1435.0
569,2016/12/22,1422.0,1424.437,1425.0,274300,1433.0,1416.0
570,2016/12/26,1425.0,1428.681,1421.0,334100,1437.0,1420.0
571,2016/12/27,1435.0,1434.637,1430.0,351700,1445.0,1424.0
572,2016/12/28,1547.0,1526.183,1495.0,1688600,1548.0,1491.0
573,2016/12/29,1530.0,1528.581,1521.0,616400,1543.0,1512.0
574,2016/12/30,1570.0,1559.422,1525.0,580400,1580.0,1525.0
575,2017/01/04,1592.0,1593.945,1595.0,594300,1608.0,1582.0
576,2017/01/05,1604.0,1598.818,1600.0,411700,1604.0,1586.0
577,2017/01/06,1601.0,1597.31,1602.0,378200,1605.0,1586.0
578,2017/01/10,1611.0,1615.467,1601.0,520600,1629.0,1596.0
579,2017/01/11,1595.0,1596.863,1611.0,311300,1612.0,1587.0
580,2017/01/12,1569.0,1585.618,1620.0,510100,1623.0,1567.0
581,2017/01/13,1574.0,1569.134,1550.0,330800,1579.0,1545.0
582,2017/01/16,1557.0,1562.498,1583.0,291400,1586.0,1551.0
583,2017/01/17,1646.0,1636.432,1614.0,1654300,1663.0,1592.0
584,2017/01/18,1616.0,1626.878,1620.0,781300,1649.0,1607.0
585,2017/01/19,1611.0,1618.707,1644.0,459500,1644.0,1603.0
586,2017/01/20,1614.0,1612.448,1606.0,456600,1629.0,1587.0
587,2017/01/23,1578.0,1588.565,1593.0,360500,1606.0,1578.0
588,2017/01/24,1588.0,1610.415,1601.0,692900,1638.0,1587.0
589,2017/01/25,1600.0,1608.449,1615.0,343400,1622.0,1598.0
590,2017/01/26,1614.0,1618.302,1630.0,369300,1630.0,1605.0
591,2017/01/27,1591.0,1601.943,1611.0,379900,1624.0,1591.0
592,2017/01/30,1614.0,1601.069,1592.0,611000,1626.0,1578.0
593,2017/01/31,1602.0,1629.607,1641.0,1175000,1664.0,1602.0
594,2017/02/01,1586.0,1590.392,1590.0,587600,1610.0,1577.0
595,2017/02/02,1585.0,1602.968,1595.0,598500,1625.0,1585.0
596,2017/02/03,1579.0,1584.875,1580.0,299900,1602.0,1573.0
597,2017/02/06,1581.0,1575.839,1588.0,236900,1592.0,1565.0
598,2017/02/07,1557.0,1557.069,1555.0,277100,1569.0,1546.0
599,2017/02/08,1551.0,1552.161,1557.0,167300,1565.0,1544.0
600,2017/02/09,1532.0,1536.437,1545.0,267400,1554.0,1528.0
601,2017/02/10,1557.0,1544.207,1540.0,377700,1557.0,1531.0
602,2017/02/13,1557.0,1553.404,1567.0,275300,1568.0,1544.0
603,2017/02/14,1536.0,1543.802,1553.0,330400,1563.0,1536.0
604,2017/02/15,1535.0,1535.583,1547.0,227600,1547.0,1529.0
605,2017/02/16,1524.0,1521.355,1525.0,252300,1530.0,1512.0
606,2017/02/17,1547.0,1540.421,1519.0,294700,1553.0,1512.0
607,2017/02/20,1544.0,1545.568,1547.0,168200,1554.0,1540.0
608,2017/02/21,1566.0,1562.89,1550.0,309500,1570.0,1550.0
609,2017/02/22,1573.0,1567.684,1570.0,280400,1576.0,1560.0
610,2017/02/23,1577.0,1570.082,1576.0,242800,1578.0,1562.0
611,2017/02/24,1578.0,1577.308,1575.0,316200,1590.0,1563.0
612,2017/02/27,1567.0,1567.972,1570.0,297000,1576.0,1558.0
613,2017/02/28,1575.0,1584.987,1577.0,348200,1597.0,1571.0
614,2017/03/01,1586.0,1583.85,1582.0,266300,1595.0,1568.0
615,2017/03/02,1587.0,1587.268,1595.0,238900,1595.0,1579.0
616,2017/03/03,1582.0,1583.829,1585.0,201000,1594.0,1576.0
617,2017/03/06,1580.0,1580.1,1581.0,163300,1589.0,1574.0
618,2017/03/07,1567.0,1572.934,1593.0,224300,1594.0,1561.0
619,2017/03/08,1565.0,1559.674,1562.0,223000,1566.0,1553.0
620,2017/03/09,1574.0,1572.251,1568.0,156500,1577.0,1563.0
621,2017/03/10,1600.0,1593.425,1580.0,371400,1604.0,1577.0
622,2017/03/13,1624.0,1634.297,1609.0,748400,1660.0,1606.0
623,2017/03/14,1620.0,1605.522,1608.0,406300,1621.0,1590.0
624,2017/03/15,1581.0,1587.325,1612.0,454200,1612.0,1576.0
625,2017/03/16,1589.0,1584.676,1575.0,246500,1591.0,1574.0
626,2017/03/17,1562.0,1563.588,1580.0,401500,1580.0,1555.0
627,2017/03/21,1569.0,1564.613,1555.0,254200,1573.0,1552.0
628,2017/03/22,1532.0,1540.498,1545.0,249300,1557.0,1532.0
629,2017/03/23,1523.0,1523.893,1532.0,173200,1535.0,1517.0
630,2017/03/24,1547.0,1540.82,1545.0,228700,1550.0,1532.0
631,2017/03/27,1521.0,1525.919,1530.0,187200,1540.0,1520.0
632,2017/03/28,1556.0,1545.254,1530.0,205100,1556.0,1530.0
633,2017/03/29,1575.0,1574.2,1582.0,223500,1582.0,1560.0
634,2017/03/30,1544.0,1553.602,1574.0,179300,1577.0,1536.0
635,2017/03/31,1528.0,1539.356,1553.0,244000,1557.0,1528.0
636,2017/04/03,1551.0,1539.378,1530.0,439200,1552.0,1520.0
637,2017/04/04,1528.0,1536.436,1539.0,376800,1557.0,1518.0
638,2017/04/05,1533.0,1531.471,1528.0,233900,1549.0,1516.0
639,2017/04/06,1509.0,1512.578,1533.0,319200,1535.0,1498.0
640,2017/04/07,1510.0,1509.44,1510.0,282800,1524.0,1490.0
641,2017/04/10,1511.0,1516.971,1503.0,363300,1533.0,1502.0
642,2017/04/11,1509.0,1515.666,1511.0,351200,1537.0,1501.0
643,2017/04/12,1486.0,1486.26,1496.0,397600,1507.0,1474.0
644,2017/04/13,1499.0,1489.772,1480.0,386500,1505.0,1473.0
645,2017/04/14,1485.0,1490.802,1491.0,221200,1503.0,1480.0
646,2017/04/17,1514.0,1506.898,1478.0,272800,1518.0,1478.0
647,2017/04/18,1520.0,1518.401,1525.0,269200,1529.0,1509.0
648,2017/04/19,1516.0,1527.398,1506.0,278200,1545.0,1505.0
649,2017/04/20,1525.0,1522.05,1515.0,175500,1533.0,1508.0
650,2017/04/21,1568.0,1559.255,1530.0,455200,1572.0,1530.0
651,2017/04/24,1542.0,1555.497,1573.0,321500,1580.0,1542.0
652,2017/04/25,1531.0,1532.445,1537.0,351500,1545.0,1522.0
653,2017/04/26,1547.0,1542.238,1543.0,474100,1558.0,1529.0
654,2017/04/27,1545.0,1550.761,1550.0,1649900,1570.0,1538.0
655,2017/04/28,1533.0,1538.599,1557.0,420600,1567.0,1527.0
656,2017/05/01,1510.0,1512.715,1537.0,358000,1540.0,1500.0
657,2017/05/02,1503.0,1506.851,1515.0,428000,1526.0,1495.0
658,2017/05/08,1542.0,1533.277,1513.0,414000,1542.0,1512.0
659,2017/05/09,1548.0,1553.735,1555.0,493300,1571.0,1538.0
660,2017/05/10,1550.0,1525.041,1515.0,908600,1550.0,1500.0
661,2017/05/11,1566.0,1560.839,1555.0,402600,1569.0,1546.0
662,2017/05/12,1593.0,1581.959,1565.0,607400,1593.0,1560.0
663,2017/05/15,1588.0,1581.463,1592.0,473400,1592.0,1568.0
664,2017/05/16,1600.0,1601.408,1595.0,498900,1615.0,1594.0
665,2017/05/17,1592.0,1587.747,1589.0,264700,1594.0,1580.0
666,2017/05/18,1574.0,1570.363,1565.0,250500,1582.0,1558.0
667,2017/05/19,1545.0,1552.386,1569.0,304300,1569.0,1541.0
668,2017/05/22,1531.0,1534.834,1540.0,301000,1549.0,1528.0
669,2017/05/23,1532.0,1535.585,1528.0,298800,1545.0,1527.0
670,2017/05/24,1520.0,1528.73,1543.0,358100,1547.0,1519.0
671,2017/05/25,1519.0,1522.427,1525.0,229600,1528.0,1518.0
672,2017/05/26,1506.0,1511.436,1522.0,368300,1528.0,1504.0
673,2017/05/29,1488.0,1492.801,1500.0,439800,1504.0,1483.0
674,2017/05/30,1528.0,1517.068,1522.0,617600,1531.0,1502.0
675,2017/05/31,1511.0,1510.247,1528.0,400800,1528.0,1505.0
676,2017/06/01,1515.0,1513.144,1506.0,265700,1524.0,1506.0
677,2017/06/02,1530.0,1524.22,1530.0,493200,1534.0,1515.0
678,2017/06/05,1529.0,1523.013,1530.0,264900,1531.0,1515.0
679,2017/06/06,1497.0,1504.117,1522.0,365200,1522.0,1496.0
680,2017/06/07,1494.0,1491.78,1495.0,293000,1499.0,1486.0
681,2017/06/08,1499.0,1498.263,1497.0,344000,1509.0,1487.0
682,2017/06/09,1491.0,1486.917,1495.0,376000,1499.0,1480.0
683,2017/06/12,1496.0,1496.81,1488.0,277200,1507.0,1485.0
684,2017/06/13,1516.0,1506.414,1490.0,338700,1516.0,1490.0
685,2017/06/14,1523.0,1529.219,1524.0,484500,1540.0,1522.0
686,2017/06/15,1523.0,1519.425,1528.0,292400,1529.0,1508.0
687,2017/06/16,1530.0,1530.029,1525.0,313900,1542.0,1521.0
688,2017/06/19,1562.0,1552.16,1533.0,387900,1564.0,1533.0
689,2017/06/20,1548.0,1559.309,1569.0,453600,1575.0,1546.0
690,2017/06/21,1550.0,1552.012,1540.0,561300,1564.0,1532.0
691,2017/06/22,1558.0,1564.592,1560.0,386600,1571.0,1557.0
692,2017/06/23,1553.0,1561.863,1568.0,360600,1575.0,1547.0
693,2017/06/26,1573.0,1568.511,1553.0,274800,1577.0,1551.0
694,2017/06/27,1581.0,1575.48,1571.0,413500,1586.0,1559.0
695,2017/06/28,1553.0,1562.46,1581.0,363000,1581.0,1549.0
696,2017/06/29,1577.0,1566.539,1562.0,248400,1577.0,1550.0
697,2017/06/30,1568.0,1563.69,1560.0,251900,1572.0,1555.0
698,2017/07/03,1560.0,1566.608,1565.0,253900,1575.0,1555.0
699,2017/07/04,1546.0,1555.882,1570.0,314300,1571.0,1543.0
700,2017/07/05,1565.0,1552.139,1537.0,279500,1565.0,1534.0
701,2017/07/06,1562.0,1561.399,1563.0,238700,1575.0,1551.0
702,2017/07/07,1544.0,1546.66,1549.0,178600,1555.0,1543.0
703,2017/07/10,1549.0,1543.415,1550.0,281300,1555.0,1529.0
704,2017/07/11,1572.0,1568.636,1552.0,267500,1575.0,1550.0
705,2017/07/12,1564.0,1566.656,1571.0,220500,1578.0,1559.0
706,2017/07/13,1578.0,1577.61,1570.0,259500,1585.0,1570.0
707,2017/07/14,1590.0,1592.454,1580.0,549000,1610.0,1574.0
708,2017/07/18,1584.0,1583.409,1588.0,257800,1595.0,1576.0
709,2017/07/19,1622.0,1612.1,1584.0,657300,1624.0,1584.0
710,2017/07/20,1647.0,1643.485,1633.0,642300,1653.0,1629.0
711,2017/07/21,1622.0,1631.398,1641.0,287500,1647.0,1620.0
712,2017/07/24,1609.0,1607.627,1610.0,231700,1616.0,1599.0
713,2017/07/25,1578.0,1588.116,1601.0,344400,1603.0,1578.0
714,2017/07/26,1590.0,1592.63,1589.0,235100,1599.0,1583.0
715,2017/07/27,1580.0,1590.105,1577.0,229600,1604.0,1577.0
716,2017/07/28,1511.0,1530.489,1551.0,658500,1566.0,1507.0
717,2017/07/31,1486.0,1491.832,1509.0,596200,1510.0,1483.0
718,2017/08/01,1448.0,1454.646,1490.0,959300,1490.0,1439.0
719,2017/08/02,1458.0,1453.081,1446.0,545100,1462.0,1441.0
720,2017/08/03,1449.0,1448.971,1465.0,457200,1470.0,1441.0
721,2017/08/04,1457.0,1454.382,1447.0,303600,1461.0,1445.0
722,2017/08/07,1454.0,1455.623,1470.0,309300,1470.0,1450.0
723,2017/08/08,1450.0,1447.757,1454.0,313900,1456.0,1441.0
724,2017/08/09,1440.0,1434.279,1452.0,449600,1452.0,1423.0
725,2017/08/10,1422.0,1425.732,1439.0,345200,1442.0,1417.0
726,2017/08/14,1425.0,1414.362,1407.0,348700,1426.0,1397.0
727,2017/08/15,1434.0,1433.795,1436.0,303300,1441.0,1424.0
728,2017/08/16,1446.0,1437.378,1428.0,259800,1447.0,1421.0
729,2017/08/17,1452.0,1449.355,1449.0,276500,1456.0,1441.0
730,2017/08/18,1422.0,1427.449,1438.0,282900,1438.0,1420.0
731,2017/08/21,1419.0,1421.571,1425.0,220300,1430.0,1417.0
732,2017/08/22,1437.0,1432.816,1425.0,213600,1442.0,1417.0
733,2017/08/23,1441.0,1439.869,1450.0,199800,1452.0,1435.0
734,2017/08/24,1442.0,1443.746,1435.0,219700,1452.0,1430.0
735,2017/08/25,1461.0,1458.276,1450.0,256200,1465.0,1446.0
736,2017/08/28,1472.0,1476.937,1482.0,324800,1485.0,1467.0
737,2017/08/29,1449.0,1444.827,1458.0,348900,1459.0,1433.0
738,2017/08/30,1476.0,1471.354,1448.0,333700,1483.0,1448.0
739,2017/08/31,1492.0,1491.923,1485.0,383000,1496.0,1481.0
740,2017/09/01,1508.0,1513.39,1504.0,571100,1533.0,1503.0
741,2017/09/04,1474.0,1477.953,1494.0,424000,1495.0,1467.0
742,2017/09/05,1445.0,1454.769,1480.0,394200,1482.0,1441.0
743,2017/09/06,1461.0,1450.08,1429.0,307900,1465.0,1420.0
744,2017/09/07,1449.0,1461.158,1480.0,235300,1481.0,1447.0
745,2017/09/08,1431.0,1440.728,1443.0,273900,1453.0,1431.0
746,2017/09/11,1464.0,1467.518,1453.0,294400,1476.0,1453.0
747,2017/09/12,1469.0,1469.204,1475.0,257200,1482.0,1457.0
748,2017/09/13,1474.0,1469.756,1472.0,199900,1476.0,1461.0
749,2017/09/14,1478.0,1478.595,1477.0,236800,1488.0,1469.0
750,2017/09/15,1512.0,1498.002,1482.0,470400,1512.0,1478.0
751,2017/09/19,1527.0,1519.073,1514.0,407900,1528.0,1507.0
752,2017/09/20,1513.0,1519.975,1526.0,278200,1527.0,1512.0
753,2017/09/21,1524.0,1527.483,1516.0,277100,1534.0,1516.0
754,2017/09/22,1529.0,1525.561,1528.0,302500,1533.0,1516.0
755,2017/09/25,1529.0,1535.507,1535.0,288400,1545.0,1528.0
756,2017/09/26,1512.0,1518.619,1528.0,313500,1534.0,1509.0
757,2017/09/27,1503.0,1508.152,1513.0,250200,1520.0,1500.0
758,2017/09/28,1530.0,1525.065,1508.0,388200,1533.0,1506.0
759,2017/09/29,1549.0,1547.249,1532.0,432700,1558.0,1532.0
760,2017/10/02,1570.0,1571.599,1570.0,640800,1581.0,1559.0
761,2017/10/03,1555.0,1551.956,1559.0,503800,1568.0,1540.0
762,2017/10/04,1547.0,1553.427,1559.0,291800,1566.0,1545.0
763,2017/10/05,1523.0,1534.85,1540.0,317200,1552.0,1521.0
764,2017/10/06,1515.0,1517.711,1520.0,220000,1527.0,1513.0
765,2017/10/10,1495.0,1497.925,1504.0,401100,1509.0,1491.0
766,2017/10/11,1506.0,1506.972,1500.0,311400,1519.0,1498.0
767,2017/10/12,1497.0,1502.855,1506.0,276500,1513.0,1496.0
768,2017/10/13,1473.0,1472.31,1490.0,535600,1490.0,1464.0
769,2017/10/16,1470.0,1471.916,1473.0,291000,1481.0,1467.0
770,2017/10/17,1469.0,1465.471,1470.0,387400,1474.0,1457.0
771,2017/10/18,1465.0,1468.505,1481.0,247000,1482.0,1461.0
772,2017/10/19,1462.0,1460.607,1461.0,265200,1467.0,1457.0
773,2017/10/20,1488.0,1496.399,1504.0,796700,1517.0,1482.0
774,2017/10/23,1492.0,1494.161,1505.0,343400,1508.0,1486.0
775,2017/10/24,1528.0,1517.831,1498.0,664000,1531.0,1497.0
776,2017/10/25,1480.0,1491.129,1522.0,1000800,1524.0,1475.0
777,2017/10/26,1485.0,1481.727,1480.0,322800,1488.0,1476.0
778,2017/10/27,1492.0,1487.903,1485.0,266600,1493.0,1477.0
779,2017/10/30,1507.0,1507.51,1490.0,783500,1519.0,1488.0
780,2017/10/31,1508.0,1506.053,1505.0,300600,1511.0,1498.0
781,2017/11/01,1507.0,1504.617,1510.0,308900,1511.0,1495.0
782,2017/11/02,1495.0,1498.835,1506.0,242300,1511.0,1494.0
783,2017/11/06,1519.0,1516.262,1517.0,393700,1524.0,1506.0
784,2017/11/07,1530.0,1519.587,1519.0,346900,1530.0,1506.0
785,2017/11/08,1511.0,1518.184,1548.0,503800,1550.0,1503.0
786,2017/11/09,1495.0,1500.54,1520.0,642900,1521.0,1482.0
787,2017/11/10,1495.0,1490.901,1496.0,291100,1499.0,1482.0
788,2017/11/13,1475.0,1477.696,1490.0,258200,1490.0,1473.0
789,2017/11/14,1491.0,1485.602,1475.0,297500,1498.0,1468.0
790,2017/11/15,1467.0,1473.729,1493.0,395300,1494.0,1460.0
791,2017/11/16,1488.0,1476.623,1461.0,303200,1492.0,1456.0
792,2017/11/17,1509.0,1506.943,1502.0,460000,1519.0,1493.0
793,2017/11/20,1502.0,1511.637,1520.0,464000,1528.0,1499.0
794,2017/11/21,1489.0,1493.651,1503.0,274200,1506.0,1487.0
795,2017/11/22,1469.0,1475.364,1489.0,372900,1490.0,1468.0
796,2017/11/24,1495.0,1492.783,1493.0,353900,1498.0,1483.0
797,2017/11/27,1498.0,1499.797,1504.0,218700,1508.0,1493.0
798,2017/11/28,1483.0,1485.395,1498.0,190900,1500.0,1478.0
799,2017/11/29,1491.0,1485.026,1490.0,221300,1491.0,1478.0
800,2017/11/30,1492.0,1487.058,1490.0,296900,1495.0,1478.0
801,2017/12/01,1485.0,1484.595,1485.0,288700,1495.0,1478.0
802,2017/12/04,1483.0,1493.842,1495.0,292900,1504.0,1483.0
803,2017/12/05,1486.0,1475.649,1480.0,286900,1486.0,1464.0
804,2017/12/06,1466.0,1472.53,1481.0,315300,1489.0,1462.0
805,2017/12/07,1477.0,1475.693,1468.0,235500,1485.0,1467.0
806,2017/12/08,1495.0,1483.846,1468.0,331600,1495.0,1468.0
807,2017/12/11,1501.0,1498.515,1500.0,281200,1507.0,1488.0
808,2017/12/12,1517.0,1511.683,1500.0,420000,1519.0,1499.0
809,2017/12/13,1520.0,1520.633,1508.0,384500,1528.0,1508.0
810,2017/12/14,1553.0,1544.98,1528.0,629200,1557.0,1518.0
811,2017/12/15,1543.0,1555.214,1560.0,643200,1570.0,1539.0
812,2017/12/18,1567.0,1570.252,1562.0,526700,1583.0,1557.0
813,2017/12/19,1533.0,1539.611,1557.0,391900,1561.0,1529.0
814,2017/12/20,1537.0,1543.196,1532.0,258200,1554.0,1520.0
815,2017/12/21,1540.0,1535.051,1537.0,215700,1544.0,1526.0
816,2017/12/22,1571.0,1560.814,1536.0,426400,1573.0,1532.0
817,2017/12/25,1547.0,1556.01,1575.0,282500,1577.0,1545.0
818,2017/12/26,1554.0,1557.444,1550.0,283900,1568.0,1545.0
819,2017/12/27,1568.0,1565.077,1553.0,197900,1570.0,1553.0
820,2017/12/28,1554.0,1559.018,1567.0,252700,1575.0,1550.0
821,2017/12/29,1574.0,1574.505,1553.0,400900,1587.0,1553.0
822,2018/01/04,1588.0,1592.275,1594.0,275000,1596.0,1588.0
823,2018/01/05,1589.0,1583.197,1585.0,342000,1591.0,1575.0
824,2018/01/09,1586.0,1585.108,1583.0,425900,1595.0,1579.0
825,2018/01/10,1693.0,1657.297,1595.0,1517700,1700.0,1595.0
826,2018/01/11,1733.0,1712.539,1689.0,1457300,1735.0,1668.0
827,2018/01/12,1751.0,1739.207,1720.0,1090500,1760.0,1707.0
828,2018/01/15,1802.0,1787.026,1770.0,1401900,1811.0,1740.0
829,2018/01/16,1758.0,1770.501,1784.0,772000,1804.0,1741.0
830,2018/01/17,1722.0,1727.24,1748.0,699600,1748.0,1716.0
831,2018/01/18,1723.0,1736.547,1749.0,558500,1762.0,1718.0
832,2018/01/19,1735.0,1736.541,1723.0,404000,1755.0,1718.0
833,2018/01/22,1779.0,1767.306,1742.0,650600,1789.0,1732.0
834,2018/01/23,1800.0,1813.678,1782.0,1007300,1834.0,1782.0
835,2018/01/24,1851.0,1843.219,1810.0,1295900,1861.0,1801.0
836,2018/01/25,1830.0,1842.246,1849.0,945000,1865.0,1819.0
837,2018/01/26,1828.0,1834.418,1830.0,571100,1845.0,1821.0
838,2018/01/29,1785.0,1809.742,1845.0,664200,1856.0,1779.0
839,2018/01/30,1758.0,1764.986,1780.0,772200,1807.0,1739.0
840,2018/01/31,1770.0,1753.933,1698.0,932500,1789.0,1689.0
841,2018/02/01,1832.0,1805.687,1768.0,901400,1832.0,1762.0
842,2018/02/02,1844.0,1829.703,1811.0,543400,1850.0,1805.0
843,2018/02/05,1805.0,1808.196,1804.0,508500,1822.0,1797.0
844,2018/02/06,1712.0,1687.457,1711.0,1380100,1723.0,1647.0
845,2018/02/07,1730.0,1755.07,1746.0,774900,1786.0,1730.0
846,2018/02/08,1875.0,1846.243,1800.0,1922800,1888.0,1786.0
847,2018/02/09,1878.0,1847.928,1821.0,1167900,1879.0,1806.0
848,2018/02/13,1891.0,1916.383,1890.0,1336100,1954.0,1882.0
849,2018/02/14,1878.0,1877.42,1901.0,955200,1909.0,1845.0
850,2018/02/15,1942.0,1936.296,1882.0,1147300,1965.0,1873.0
851,2018/02/16,1951.0,1957.086,1966.0,813200,1978.0,1926.0
852,2018/02/19,1943.0,1935.095,1970.0,642300,1970.0,1909.0
853,2018/02/20,1998.0,2001.111,1943.0,1735900,2030.0,1943.0
854,2018/02/21,1985.0,1989.632,1998.0,814700,2005.0,1970.0
855,2018/02/22,1952.0,1955.872,1960.0,598600,1977.0,1941.0
856,2018/02/23,1966.0,1959.078,1964.0,462800,1975.0,1944.0
857,2018/02/26,2008.0,2004.003,1988.0,623500,2027.0,1973.0
858,2018/02/27,1978.0,1992.094,2020.0,600400,2023.0,1976.0
859,2018/02/28,1981.0,1984.869,1958.0,404800,1998.0,1957.0
860,2018/03/01,1939.0,1937.2,1970.0,565200,1970.0,1918.0
861,2018/03/02,1933.0,1925.309,1899.0,435300,1945.0,1890.0
862,2018/03/05,1928.0,1931.076,1927.0,462800,1959.0,1916.0
863,2018/03/06,1989.0,1979.912,1959.0,694600,2005.0,1946.0
864,2018/03/07,2010.0,2007.563,1984.0,771500,2032.0,1976.0
865,2018/03/08,2054.0,2036.586,2027.0,1035900,2064.0,1996.0
866,2018/03/09,2037.0,2045.537,2060.0,652100,2066.0,2015.0
867,2018/03/12,2060.0,2046.978,2066.0,623700,2071.0,2022.0
868,2018/03/13,2157.0,2122.099,2050.0,1419700,2160.0,2047.0
869,2018/03/14,2153.0,2146.527,2157.0,705600,2170.0,2128.0
870,2018/03/15,2160.0,2157.704,2161.0,546000,2176.0,2132.0
871,2018/03/16,2132.0,2137.195,2157.0,453800,2163.0,2121.0
872,2018/03/19,2093.0,2083.7,2109.0,707500,2118.0,2042.0
873,2018/03/20,2061.0,2053.54,2050.0,463200,2068.0,2031.0
874,2018/03/22,2113.0,2101.394,2045.0,587700,2125.0,2042.0
875,2018/03/23,2029.0,2053.173,2051.0,762100,2094.0,2024.0
876,2018/03/26,2035.0,2022.205,2024.0,502000,2038.0,1992.0
877,2018/03/27,2076.0,2077.43,2082.0,481600,2100.0,2060.0
878,2018/03/28,2099.0,2091.906,2065.0,558100,2114.0,2047.0
879,2018/03/29,2146.0,2145.77,2121.0,836600,2169.0,2120.0
880,2018/03/30,2032.0,2040.418,2117.0,1301900,2140.0,2005.0
881,2018/04/02,2045.0,2051.696,2037.0,480500,2075.0,2033.0
882,2018/04/03,2109.0,2094.583,2036.0,919500,2125.0,2035.0
883,2018/04/04,2117.0,2106.906,2109.0,452500,2122.0,2083.0
884,2018/04/05,2145.0,2147.317,2130.0,700500,2170.0,2125.0
885,2018/04/06,2179.0,2175.624,2122.0,1016900,2205.0,2121.0
886,2018/04/09,2200.0,2200.666,2178.0,1038500,2228.0,2170.0
887,2018/04/10,2275.0,2294.186,2312.0,2897000,2380.0,2235.0
888,2018/04/11,2140.0,2176.439,2262.0,979800,2262.0,2137.0
889,2018/04/12,2149.0,2151.258,2122.0,607300,2181.0,2110.0
890,2018/04/13,2158.0,2148.376,2156.0,386100,2169.0,2121.0
891,2018/04/16,2185.0,2172.439,2152.0,506500,2187.0,2149.0
892,2018/04/17,2118.0,2116.777,2181.0,849100,2181.0,2079.0
893,2018/04/18,2134.0,2138.189,2115.0,493700,2167.0,2108.0
894,2018/04/19,2027.0,2060.956,2139.0,924100,2147.0,2022.0
895,2018/04/20,2025.0,2030.776,2015.0,613300,2054.0,2006.0
896,2018/04/23,2031.0,2023.978,2017.0,418900,2038.0,2009.0
897,2018/04/24,2046.0,2043.014,2030.0,494100,2057.0,2022.0
898,2018/04/25,2073.0,2075.702,2057.0,449300,2092.0,2051.0
899,2018/04/26,2098.0,2079.411,2080.0,555400,2104.0,2044.0
900,2018/04/27,2131.0,2130.886,2100.0,590300,2152.0,2098.0
901,2018/05/01,2125.0,2114.655,2130.0,478300,2136.0,2085.0
902,2018/05/02,2170.0,2153.366,2139.0,543900,2177.0,2122.0
903,2018/05/07,2179.0,2176.993,2180.0,334600,2187.0,2162.0
904,2018/05/08,2219.0,2219.506,2181.0,659500,2241.0,2179.0
905,2018/05/09,2163.0,2174.396,2182.0,571700,2215.0,2155.0
906,2018/05/10,2133.0,2147.852,2174.0,481500,2196.0,2126.0
907,2018/05/11,2182.0,2174.364,2150.0,480100,2199.0,2141.0
908,2018/05/14,2358.0,2334.755,2260.0,2098000,2371.0,2249.0
909,2018/05/15,2488.0,2477.546,2377.0,2088300,2511.0,2377.0
910,2018/05/16,2520.0,2515.655,2500.0,1193100,2558.0,2478.0
911,2018/05/17,2541.0,2541.007,2555.0,957100,2563.0,2501.0
912,2018/05/18,2567.0,2574.551,2531.0,1322800,2605.0,2530.0
913,2018/05/21,2594.0,2595.239,2606.0,721500,2623.0,2572.0
914,2018/05/22,2574.0,2567.821,2590.0,832200,2608.0,2543.0
915,2018/05/23,2515.0,2536.713,2513.0,1050600,2580.0,2508.0
916,2018/05/24,2598.0,2584.623,2500.0,1199500,2622.0,2499.0
917,2018/05/25,2537.0,2565.451,2592.0,604400,2600.0,2532.0
918,2018/05/28,2526.0,2535.641,2522.0,565800,2565.0,2502.0
919,2018/05/29,2507.0,2520.043,2510.0,653000,2564.0,2490.0
920,2018/05/30,2459.0,2465.766,2456.0,567200,2506.0,2435.0
921,2018/05/31,2539.0,2531.478,2485.0,844400,2556.0,2485.0
922,2018/06/01,2538.0,2519.799,2495.0,607900,2543.0,2482.0
923,2018/06/04,2513.0,2521.096,2558.0,530000,2570.0,2495.0
924,2018/06/05,2505.0,2494.95,2505.0,398500,2507.0,2473.0
925,2018/06/06,2438.0,2445.958,2495.0,587300,2495.0,2424.0
926,2018/06/07,2476.0,2454.962,2438.0,588600,2483.0,2417.0
927,2018/06/08,2502.0,2482.004,2448.0,417800,2510.0,2447.0
928,2018/06/11,2548.0,2538.319,2537.0,489900,2552.0,2515.0
929,2018/06/12,2558.0,2535.975,2550.0,491900,2562.0,2482.0
930,2018/06/13,2525.0,2550.714,2558.0,605400,2579.0,2524.0
931,2018/06/14,2483.0,2495.399,2504.0,402300,2515.0,2479.0
932,2018/06/15,2458.0,2475.194,2486.0,523800,2504.0,2458.0
933,2018/06/18,2422.0,2429.631,2472.0,614800,2483.0,2387.0
934,2018/06/19,2400.0,2424.289,2388.0,593700,2465.0,2388.0
935,2018/06/20,2422.0,2413.97,2429.0,714200,2442.0,2381.0
936,2018/06/21,2427.0,2425.125,2412.0,318900,2445.0,2408.0
937,2018/06/22,2406.0,2415.056,2401.0,325900,2435.0,2396.0
938,2018/06/25,2330.0,2365.504,2420.0,431800,2425.0,2322.0
939,2018/06/26,2308.0,2313.791,2290.0,372000,2339.0,2290.0
940,2018/06/27,2344.0,2341.421,2341.0,339800,2361.0,2325.0
941,2018/06/28,2280.0,2286.139,2320.0,506800,2322.0,2268.0
942,2018/06/29,2315.0,2302.701,2284.0,407500,2323.0,2280.0
943,2018/07/02,2231.0,2259.394,2321.0,462200,2321.0,2230.0
944,2018/07/03,2220.0,2232.325,2235.0,389300,2293.0,2199.0
945,2018/07/04,2243.0,2228.752,2200.0,347100,2253.0,2189.0
946,2018/07/05,2193.0,2201.93,2230.0,345600,2245.0,2180.0
947,2018/07/06,2271.0,2246.392,2211.0,530300,2281.0,2209.0
948,2018/07/09,2316.0,2302.484,2300.0,374700,2323.0,2271.0
949,2018/07/10,2306.0,2324.98,2350.0,537700,2363.0,2301.0
950,2018/07/11,2259.0,2272.606,2285.0,300600,2298.0,2259.0
951,2018/07/12,2279.0,2291.792,2261.0,260400,2320.0,2261.0
952,2018/07/13,2346.0,2334.301,2315.0,388900,2350.0,2309.0
953,2018/07/17,2331.0,2337.97,2360.0,394300,2364.0,2323.0
954,2018/07/18,2351.0,2340.679,2355.0,375200,2356.0,2320.0
955,2018/07/19,2315.0,2320.755,2353.0,242400,2355.0,2307.0
956,2018/07/20,2337.0,2333.771,2320.0,215700,2349.0,2317.0
957,2018/07/23,2418.0,2404.323,2361.0,669200,2421.0,2360.0
958,2018/07/24,2415.0,2409.606,2446.0,589300,2448.0,2373.0
959,2018/07/25,2384.0,2387.691,2440.0,571600,2440.0,2364.0
960,2018/07/26,2504.0,2469.798,2418.0,935700,2512.0,2387.0
961,2018/07/27,2498.0,2498.499,2505.0,770500,2546.0,2462.0
962,2018/07/30,2475.0,2474.078,2501.0,437800,2505.0,2455.0
963,2018/07/31,2480.0,2465.286,2464.0,491100,2487.0,2436.0
964,2018/08/01,2467.0,2479.007,2500.0,791400,2540.0,2454.0
965,2018/08/02,2504.0,2512.427,2497.0,812400,2553.0,2485.0
966,2018/08/03,2520.0,2518.577,2507.0,466700,2539.0,2493.0
967,2018/08/06,2477.0,2485.159,2504.0,284100,2510.0,2468.0
968,2018/08/07,2491.0,2482.31,2456.0,282400,2503.0,2441.0
969,2018/08/08,2514.0,2502.874,2500.0,308100,2520.0,2476.0
970,2018/08/09,2529.0,2523.825,2524.0,350500,2538.0,2506.0
971,2018/08/10,2517.0,2525.092,2529.0,324500,2544.0,2513.0
972,2018/08/13,2491.0,2536.942,2600.0,916700,2613.0,2473.0
973,2018/08/14,2564.0,2554.532,2529.0,731100,2583.0,2511.0
974,2018/08/15,2616.0,2619.797,2583.0,1134400,2657.0,2568.0
975,2018/08/16,2553.0,2571.248,2630.0,794300,2632.0,2533.0
976,2018/08/17,2557.0,2563.351,2590.0,365900,2596.0,2540.0
977,2018/08/20,2544.0,2555.636,2556.0,314400,2587.0,2536.0
978,2018/08/21,2563.0,2549.445,2521.0,250900,2571.0,2515.0
979,2018/08/22,2665.0,2641.2,2590.0,915200,2676.0,2577.0
980,2018/08/23,2692.0,2706.482,2683.0,869700,2731.0,2683.0
981,2018/08/24,2707.0,2688.662,2689.0,440800,2709.0,2652.0
982,2018/08/27,2741.0,2738.416,2734.0,542400,2756.0,2715.0
983,2018/08/28,2742.0,2731.664,2741.0,470500,2749.0,2698.0
984,2018/08/29,2778.0,2771.827,2740.0,622800,2788.0,2738.0
985,2018/08/30,2743.0,2758.577,2795.0,521300,2799.0,2724.0
986,2018/08/31,2764.0,2759.494,2730.0,458800,2773.0,2724.0
987,2018/09/03,2789.0,2767.242,2775.0,462400,2792.0,2736.0
988,2018/09/04,2803.0,2806.391,2795.0,608700,2826.0,2792.0
989,2018/09/05,2748.0,2766.399,2780.0,543200,2797.0,2735.0
990,2018/09/06,2712.0,2709.374,2727.0,536000,2739.0,2692.0
991,2018/09/07,2719.0,2698.875,2686.0,370000,2724.0,2667.0
992,2018/09/10,2730.0,2727.717,2719.0,350400,2751.0,2701.0
993,2018/09/11,2799.0,2780.121,2745.0,401400,2799.0,2737.0
994,2018/09/12,2779.0,2768.658,2784.0,317800,2788.0,2746.0
995,2018/09/13,2780.0,2797.627,2790.0,419400,2830.0,2773.0
996,2018/09/14,2818.0,2814.285,2804.0,481700,2827.0,2798.0
997,2018/09/18,2921.0,2895.635,2802.0,1088500,2947.0,2795.0
998,2018/09/19,2954.0,2936.839,2917.0,721300,2956.0,2893.0
999,2018/09/20,2976.0,2967.735,2950.0,640700,2988.0,2923.0
1000,2018/09/21,2971.0,2984.961,2988.0,1663500,3025.0,2971.0
1001,2018/09/25,3090.0,3065.343,2996.0,823700,3095.0,2996.0
1002,2018/09/26,3175.0,3146.58,3125.0,604600,3175.0,3110.0
1003,2018/09/27,3095.0,3151.258,3195.0,740000,3210.0,3090.0
1004,2018/09/28,3150.0,3147.828,3115.0,647400,3185.0,3115.0
1005,2018/10/01,3130.0,3128.92,3145.0,512800,3160.0,3095.0
1006,2018/10/02,3145.0,3122.672,3170.0,673900,3180.0,3060.0
1007,2018/10/03,3070.0,3095.757,3130.0,545600,3140.0,3065.0
1008,2018/10/04,3040.0,3060.445,3065.0,426800,3110.0,3025.0
1009,2018/10/05,3050.0,3034.635,3000.0,375000,3070.0,2989.0
1010,2018/10/09,3030.0,3047.394,3055.0,414000,3085.0,3020.0
1011,2018/10/10,3065.0,3056.405,3020.0,253100,3090.0,3020.0
1012,2018/10/11,2977.0,2964.759,2931.0,657200,3015.0,2899.0
1013,2018/10/12,3010.0,2992.564,2962.0,356700,3025.0,2952.0
1014,2018/10/15,2980.0,2990.812,3025.0,361600,3030.0,2976.0
1015,2018/10/16,2922.0,2921.013,2960.0,435500,2986.0,2880.0
1016,2018/10/17,3025.0,3002.054,2983.0,393100,3025.0,2973.0
1017,2018/10/18,3025.0,3042.238,3050.0,272400,3080.0,3010.0
1018,2018/10/19,3020.0,3002.28,2985.0,222300,3030.0,2965.0
1019,2018/10/22,2992.0,2974.55,2984.0,331400,3010.0,2931.0
1020,2018/10/23,2884.0,2915.262,2974.0,417100,2974.0,2882.0
1021,2018/10/24,2851.0,2854.87,2891.0,406200,2904.0,2822.0
1022,2018/10/25,2666.0,2699.361,2738.0,618600,2742.0,2662.0
1023,2018/10/26,2627.0,2646.845,2711.0,467100,2716.0,2600.0
1024,2018/10/29,2557.0,2592.924,2642.0,301100,2664.0,2552.0
1025,2018/10/30,2567.0,2551.914,2494.0,609400,2603.0,2490.0
1026,2018/10/31,2663.0,2634.209,2618.0,346200,2671.0,2576.0
1027,2018/11/01,2610.0,2620.086,2654.0,372300,2654.0,2597.0
1028,2018/11/02,2721.0,2690.564,2643.0,390700,2724.0,2640.0
1029,2018/11/05,2714.0,2738.951,2724.0,380800,2779.0,2714.0
1030,2018/11/06,2815.0,2795.528,2750.0,452500,2823.0,2748.0
1031,2018/11/07,2669.0,2672.113,2800.0,1372300,2800.0,2613.0
1032,2018/11/08,2751.0,2720.323,2715.0,596400,2751.0,2686.0
1033,2018/11/09,2679.0,2703.129,2755.0,530400,2765.0,2672.0
1034,2018/11/12,2657.0,2678.034,2671.0,412000,2725.0,2642.0
1035,2018/11/13,2588.0,2587.522,2610.0,411600,2610.0,2567.0
1036,2018/11/14,2519.0,2539.049,2573.0,406800,2594.0,2510.0
1037,2018/11/15,2520.0,2494.164,2452.0,516800,2532.0,2438.0
1038,2018/11/16,2489.0,2505.841,2520.0,251600,2547.0,2484.0
1039,2018/11/19,2555.0,2532.578,2500.0,415000,2567.0,2474.0
1040,2018/11/20,2494.0,2500.281,2513.0,286000,2530.0,2487.0
1041,2018/11/21,2495.0,2495.74,2460.0,358900,2525.0,2441.0
1042,2018/11/22,2548.0,2526.786,2501.0,274100,2555.0,2488.0
1043,2018/11/26,2566.0,2566.357,2550.0,255200,2592.0,2531.0
1044,2018/11/27,2576.0,2583.046,2595.0,372900,2599.0,2564.0
1045,2018/11/28,2672.0,2649.357,2598.0,458200,2679.0,2591.0
1046,2018/11/29,2738.0,2752.104,2705.0,863300,2798.0,2694.0
1047,2018/11/30,2838.0,2801.608,2756.0,759800,2840.0,2741.0
1048,2018/12/03,2887.0,2884.528,2920.0,524600,2924.0,2860.0
1049,2018/12/04,2824.0,2851.212,2899.0,540600,2915.0,2810.0
1050,2018/12/05,2824.0,2805.188,2753.0,374800,2852.0,2737.0
1051,2018/12/06,2719.0,2724.131,2808.0,482200,2812.0,2678.0
1052,2018/12/07,2783.0,2757.952,2750.0,376000,2794.0,2713.0
1053,2018/12/10,2726.0,2737.529,2738.0,356500,2785.0,2710.0
1054,2018/12/11,2701.0,2739.311,2726.0,430200,2796.0,2701.0
1055,2018/12/12,2831.0,2797.934,2751.0,494400,2836.0,2733.0
1056,2018/12/13,2869.0,2872.956,2879.0,549600,2894.0,2823.0
1057,2018/12/14,2837.0,2862.998,2864.0,514400,2903.0,2830.0
1058,2018/12/17,2812.0,2797.155,2805.0,380200,2829.0,2757.0
1059,2018/12/18,2674.0,2700.622,2757.0,596500,2757.0,2666.0
1060,2018/12/19,2780.0,2750.261,2696.0,537600,2791.0,2667.0
1061,2018/12/20,2627.0,2673.992,2749.0,865600,2770.0,2608.0
1062,2018/12/21,2558.0,2555.681,2590.0,635200,2617.0,2520.0
1063,2018/12/25,2283.0,2310.087,2358.0,646500,2388.0,2260.0
1064,2018/12/26,2319.0,2324.268,2317.0,503100,2386.0,2278.0
1065,2018/12/27,2534.0,2488.449,2427.0,566000,2550.0,2406.0
1066,2018/12/28,2557.0,2535.31,2501.0,665800,2565.0,2500.0
1067,2019/01/04,2551.0,2543.277,2502.0,461900,2586.0,2501.0
1068,2019/01/07,2597.0,2612.037,2691.0,537000,2691.0,2569.0
1069,2019/01/08,2597.0,2586.481,2582.0,601400,2620.0,2550.0
1070,2019/01/09,2666.0,2672.223,2643.0,640500,2705.0,2639.0
1071,2019/01/10,2659.0,2675.509,2674.0,470500,2720.0,2646.0
1072,2019/01/11,2692.0,2699.277,2684.0,404200,2724.0,2675.0
1073,2019/01/15,2698.0,2700.152,2680.0,382700,2732.0,2666.0
1074,2019/01/16,2707.0,2705.937,2709.0,405400,2732.0,2682.0
1075,2019/01/17,2676.0,2684.207,2700.0,394400,2730.0,2661.0
1076,2019/01/18,2678.0,2677.907,2671.0,352300,2704.0,2641.0
1077,2019/01/21,2637.0,2664.787,2711.0,306000,2720.0,2635.0
1078,2019/01/22,2551.0,2573.093,2615.0,509800,2629.0,2541.0
1079,2019/01/23,2547.0,2545.453,2501.0,416800,2578.0,2500.0
1080,2019/01/24,2583.0,2561.029,2532.0,354000,2588.0,2519.0
1081,2019/01/25,2548.0,2561.116,2572.0,234100,2586.0,2545.0
1082,2019/01/28,2516.0,2527.155,2537.0,244500,2542.0,2514.0
1083,2019/01/29,2569.0,2536.15,2515.0,292900,2573.0,2503.0
1084,2019/01/30,2501.0,2517.069,2559.0,546900,2561.0,2497.0
1085,2019/01/31,2455.0,2496.664,2550.0,550200,2554.0,2454.0
1086,2019/02/01,2432.0,2445.568,2451.0,398700,2479.0,2427.0
1087,2019/02/04,2450.0,2445.088,2450.0,414000,2466.0,2426.0
1088,2019/02/05,2432.0,2446.5,2466.0,323000,2473.0,2425.0
1089,2019/02/06,2405.0,2414.079,2439.0,310500,2455.0,2393.0
1090,2019/02/07,2335.0,2343.468,2398.0,485200,2401.0,2322.0
1091,2019/02/08,2297.0,2308.483,2313.0,284800,2340.0,2288.0
1092,2019/02/12,2313.0,2316.995,2287.0,258000,2339.0,2287.0
1093,2019/02/13,2316.0,2320.816,2318.0,335800,2335.0,2306.0
1094,2019/02/14,2306.0,2308.716,2315.0,295400,2329.0,2296.0
1095,2019/02/15,2331.0,2319.216,2315.0,273400,2339.0,2295.0
1096,2019/02/18,2366.0,2362.385,2370.0,246500,2379.0,2342.0
1097,2019/02/19,2376.0,2384.776,2393.0,223400,2405.0,2370.0
1098,2019/02/20,2369.0,2367.913,2386.0,217100,2387.0,2354.0
1099,2019/02/21,2454.0,2450.98,2480.0,692200,2493.0,2408.0
1100,2019/02/22,2407.0,2390.115,2449.0,601200,2449.0,2351.0
1101,2019/02/25,2481.0,2456.805,2429.0,521800,2485.0,2405.0
1102,2019/02/26,2466.0,2468.259,2481.0,369800,2500.0,2444.0
1103,2019/02/27,2548.0,2531.702,2475.0,695700,2568.0,2473.0
1104,2019/02/28,2547.0,2549.758,2567.0,536600,2567.0,2525.0
1105,2019/03/01,2582.0,2575.581,2560.0,451800,2592.0,2551.0
1106,2019/03/04,2632.0,2623.261,2599.0,434600,2642.0,2598.0
1107,2019/03/05,2618.0,2607.709,2600.0,376300,2627.0,2590.0
1108,2019/03/06,2676.0,2658.809,2651.0,569800,2678.0,2631.0
1109,2019/03/07,2720.0,2723.143,2674.0,1016100,2764.0,2662.0
1110,2019/03/08,2678.0,2691.966,2690.0,643600,2722.0,2675.0
1111,2019/03/11,2656.0,2671.092,2708.0,417600,2727.0,2639.0
1112,2019/03/12,2717.0,2723.004,2677.0,639300,2765.0,2671.0
1113,2019/03/13,2777.0,2759.171,2730.0,782200,2786.0,2717.0
1114,2019/03/14,2744.0,2766.492,2800.0,572600,2823.0,2733.0
1115,2019/03/15,2727.0,2728.979,2728.0,372300,2750.0,2711.0
1116,2019/03/18,2708.0,2712.203,2734.0,264600,2737.0,2702.0
1117,2019/03/19,2654.0,2655.405,2699.0,357000,2700.0,2639.0
1118,2019/03/20,2692.0,2676.82,2628.0,370800,2705.0,2626.0
1119,2019/03/22,2624.0,2636.463,2678.0,382600,2678.0,2611.0
1120,2019/03/25,2541.0,2545.27,2549.0,376200,2561.0,2532.0
1121,2019/03/26,2600.0,2588.623,2542.0,430200,2609.0,2542.0
1122,2019/03/27,2622.0,2631.864,2633.0,326300,2662.0,2607.0
1123,2019/03/28,2549.0,2549.419,2590.0,393300,2592.0,2529.0
1124,2019/03/29,2567.0,2568.307,2561.0,252500,2593.0,2547.0
1125,2019/04/01,2606.0,2712.527,2817.0,1762900,2826.0,2593.0
1126,2019/04/02,2500.0,2525.457,2600.0,723100,2600.0,2500.0
1127,2019/04/03,2527.0,2538.61,2523.0,458500,2566.0,2501.0
1128,2019/04/04,2473.0,2481.159,2504.0,500100,2520.0,2460.0
1129,2019/04/05,2480.0,2472.007,2472.0,287800,2488.0,2451.0
1130,2019/04/08,2500.0,2497.996,2498.0,263700,2510.0,2472.0
1131,2019/04/09,2478.0,2473.896,2481.0,283400,2490.0,2460.0
1132,2019/04/10,2488.0,2482.259,2460.0,226600,2495.0,2451.0
1133,2019/04/11,2490.0,2491.617,2468.0,260100,2505.0,2468.0
1134,2019/04/12,2408.0,2421.861,2490.0,539700,2498.0,2397.0
1135,2019/04/15,2434.0,2428.827,2434.0,283700,2442.0,2414.0
1136,2019/04/16,2428.0,2440.639,2436.0,221400,2465.0,2423.0
1137,2019/04/17,2426.0,2415.662,2425.0,339500,2434.0,2395.0
1138,2019/04/18,2344.0,2360.089,2400.0,545200,2406.0,2338.0
1139,2019/04/19,2356.0,2359.414,2363.0,415300,2384.0,2341.0
1140,2019/04/22,2367.0,2356.182,2350.0,261400,2376.0,2319.0
1141,2019/04/23,2375.0,2365.49,2356.0,157100,2377.0,2348.0
1142,2019/04/24,2425.0,2413.82,2410.0,356100,2426.0,2396.0
1143,2019/04/25,2434.0,2428.087,2425.0,315100,2440.0,2416.0
1144,2019/04/26,2432.0,2423.297,2435.0,261400,2439.0,2401.0
1145,2019/05/07,2429.0,2450.547,2452.0,453700,2474.0,2422.0
1146,2019/05/08,2398.0,2392.087,2398.0,251200,2407.0,2372.0
1147,2019/05/09,2346.0,2353.329,2380.0,299800,2393.0,2335.0
1148,2019/05/10,2323.0,2332.399,2323.0,375400,2376.0,2295.0
1149,2019/05/13,2308.0,2310.944,2330.0,291300,2340.0,2279.0
1150,2019/05/14,2329.0,2298.231,2270.0,502700,2335.0,2248.0
1151,2019/05/15,2311.0,2315.743,2379.0,439400,2379.0,2284.0
1152,2019/05/16,2329.0,2311.347,2301.0,357500,2333.0,2281.0
1153,2019/05/17,2372.0,2356.465,2353.0,349200,2373.0,2326.0
1154,2019/05/20,2328.0,2346.621,2360.0,345100,2386.0,2325.0
1155,2019/05/21,2265.0,2278.14,2311.0,342300,2316.0,2265.0
1156,2019/05/22,2243.0,2255.359,2264.0,295600,2276.0,2243.0
1157,2019/05/23,2287.0,2268.21,2244.0,292800,2295.0,2235.0
1158,2019/05/24,2274.0,2265.465,2280.0,194800,2282.0,2246.0
1159,2019/05/27,2366.0,2343.98,2292.0,466200,2368.0,2286.0
1160,2019/05/28,2486.0,2464.379,2398.0,916000,2500.0,2389.0
1161,2019/05/29,2462.0,2472.742,2452.0,879300,2507.0,2419.0
1162,2019/05/30,2375.0,2394.844,2437.0,751300,2452.0,2362.0
1163,2019/05/31,2324.0,2334.092,2348.0,638100,2380.0,2310.0
1164,2019/06/03,2183.0,2218.619,2272.0,748100,2272.0,2181.0
1165,2019/06/04,2109.0,2115.699,2190.0,724900,2195.0,2087.0
1166,2019/06/05,2076.0,2084.185,2112.0,1115300,2115.0,2059.0
1167,2019/06/06,2025.0,2024.235,2075.0,1016000,2075.0,1990.0
1168,2019/06/07,1995.0,1989.882,2009.0,975100,2021.0,1967.0
1169,2019/06/10,2012.0,2012.047,1997.0,703200,2034.0,1992.0
1170,2019/06/11,2034.0,2025.574,2029.0,430700,2037.0,2000.0
1171,2019/06/12,2012.0,2021.125,2031.0,344500,2035.0,2009.0
1172,2019/06/13,1980.0,1987.717,2003.0,463300,2007.0,1974.0
1173,2019/06/14,1988.0,1970.902,1975.0,440500,1992.0,1943.0
1174,2019/06/17,2022.0,2015.401,1993.0,536600,2027.0,1985.0
1175,2019/06/18,1992.0,2013.562,2022.0,616100,2049.0,1982.0
1176,2019/06/19,2026.0,2018.226,2009.0,393300,2030.0,1998.0
1177,2019/06/20,2065.0,2062.896,2025.0,548400,2084.0,2021.0
1178,2019/06/21,2010.0,2024.36,2072.0,550100,2072.0,2008.0
1179,2019/06/24,2005.0,2006.368,2012.0,248700,2022.0,1995.0
1180,2019/06/25,1999.0,2004.046,2007.0,301300,2024.0,1990.0
1181,2019/06/26,2020.0,2022.324,2015.0,403100,2037.0,2001.0
1182,2019/06/27,2021.0,2006.027,2020.0,439000,2025.0,1988.0
1183,2019/06/28,2053.0,2041.66,2028.0,418600,2059.0,2007.0
1184,2019/07/01,2107.0,2094.989,2080.0,600000,2111.0,2073.0
1185,2019/07/02,2188.0,2165.476,2116.0,783000,2190.0,2110.0
1186,2019/07/03,2145.0,2147.286,2187.0,485100,2195.0,2125.0
1187,2019/07/04,2178.0,2179.387,2186.0,353400,2200.0,2166.0
1188,2019/07/05,2220.0,2199.685,2185.0,391600,2220.0,2174.0
1189,2019/07/08,2136.0,2154.233,2220.0,482700,2220.0,2131.0
1190,2019/07/09,2123.0,2128.738,2148.0,300400,2148.0,2116.0
1191,2019/07/10,2149.0,2138.581,2111.0,301300,2160.0,2089.0
1192,2019/07/11,2162.0,2165.826,2172.0,247600,2184.0,2156.0
1193,2019/07/12,2142.0,2141.744,2147.0,201200,2158.0,2125.0
1194,2019/07/16,2128.0,2120.135,2115.0,293900,2137.0,2105.0
1195,2019/07/17,2118.0,2113.496,2122.0,264800,2122.0,2099.0
1196,2019/07/18,2054.0,2064.255,2095.0,336200,2095.0,2048.0
1197,2019/07/19,2075.0,2073.772,2050.0,315200,2086.0,2043.0
1198,2019/07/22,2067.0,2065.64,2067.0,189200,2078.0,2038.0
1199,2019/07/23,2075.0,2078.046,2072.0,235100,2094.0,2055.0
1200,2019/07/24,2064.0,2058.648,2075.0,216200,2075.0,2045.0
1201,2019/07/25,2103.0,2095.156,2083.0,292900,2109.0,2080.0
1202,2019/07/26,2101.0,2105.23,2089.0,216600,2124.0,2085.0
1203,2019/07/29,2094.0,2102.005,2105.0,199400,2124.0,2091.0
1204,2019/07/30,2149.0,2135.629,2100.0,273000,2153.0,2100.0
1205,2019/07/31,2156.0,2151.782,2134.0,267400,2173.0,2129.0
1206,2019/08/01,2146.0,2142.948,2142.0,259600,2161.0,2118.0
1207,2019/08/02,2107.0,2115.493,2114.0,340700,2153.0,2085.0
1208,2019/08/05,2041.0,2046.261,2104.0,411700,2114.0,2008.0
1209,2019/08/06,2013.0,1990.313,1978.0,398200,2028.0,1955.0
1210,2019/08/07,2178.0,2177.042,2152.0,1199300,2215.0,2101.0
1211,2019/08/08,2193.0,2152.714,2168.0,616400,2199.0,2093.0
1212,2019/08/09,2217.0,2215.457,2209.0,485200,2239.0,2188.0
1213,2019/08/13,2224.0,2223.556,2193.0,384300,2254.0,2180.0
1214,2019/08/14,2235.0,2230.153,2250.0,284800,2253.0,2204.0
1215,2019/08/15,2215.0,2201.716,2195.0,311000,2223.0,2159.0
1216,2019/08/16,2278.0,2272.987,2230.0,510200,2298.0,2220.0
1217,2019/08/19,2236.0,2247.494,2297.0,442100,2303.0,2228.0
1218,2019/08/20,2281.0,2252.448,2235.0,541600,2284.0,2218.0
1219,2019/08/21,2239.0,2238.033,2264.0,359300,2264.0,2221.0
1220,2019/08/22,2149.0,2165.145,2213.0,608200,2213.0,2138.0
1221,2019/08/23,2152.0,2141.067,2139.0,300400,2159.0,2121.0
