,Date,Close,VWAP,Open,Volume,High,Low
0,2014/08/25,410.0,409.44,410.0,15000,410.0,405.0
1,2014/08/26,410.0,407.585,408.0,27000,410.0,404.0
2,2014/08/27,408.0,408.448,409.0,6700,410.0,407.0
3,2014/08/28,409.0,406.45,405.0,16000,410.0,402.0
4,2014/08/29,410.0,409.017,405.0,5900,410.0,405.0
5,2014/09/01,410.0,409.476,409.0,27100,411.0,407.0
6,2014/09/02,412.0,410.657,409.0,23600,412.0,406.0
7,2014/09/03,412.0,410.463,411.0,27200,412.0,409.0
8,2014/09/04,411.0,410.135,412.0,9600,412.0,408.0
9,2014/09/05,413.0,414.261,412.0,37500,417.0,408.0
10,2014/09/08,413.0,412.146,413.0,13000,416.0,405.0
11,2014/09/09,414.0,412.649,410.0,7700,415.0,410.0
12,2014/09/10,414.0,412.861,410.0,18000,416.0,408.0
13,2014/09/11,414.0,411.336,410.0,13700,414.0,410.0
14,2014/09/12,415.0,415.148,415.0,47200,417.0,415.0
15,2014/09/16,415.0,416.167,416.0,22100,418.0,413.0
16,2014/09/17,415.0,414.894,415.0,8500,416.0,414.0
17,2014/09/18,420.0,416.674,413.0,62900,420.0,413.0
18,2014/09/19,422.0,420.826,422.0,44800,422.0,414.0
19,2014/09/22,422.0,422.416,420.0,7700,425.0,419.0
20,2014/09/24,423.0,422.522,424.0,16100,424.0,419.0
21,2014/09/25,425.0,423.468,420.0,48300,425.0,420.0
22,2014/09/26,420.0,419.225,423.0,24400,423.0,418.0
23,2014/09/29,420.0,419.275,418.0,18900,421.0,418.0
24,2014/09/30,414.0,415.01,416.0,20600,420.0,411.0
25,2014/10/01,416.0,417.621,420.0,11600,420.0,416.0
26,2014/10/02,401.0,405.63,410.0,20800,416.0,401.0
27,2014/10/03,400.0,398.782,399.0,17400,402.0,394.0
28,2014/10/06,410.0,404.093,403.0,12900,413.0,399.0
29,2014/10/07,400.0,404.15,405.0,16000,408.0,400.0
30,2014/10/08,400.0,399.006,400.0,17000,401.0,397.0
31,2014/10/09,396.0,398.565,400.0,13800,402.0,394.0
32,2014/10/10,384.0,381.822,380.0,31500,388.0,380.0
33,2014/10/14,371.0,373.029,371.0,31500,380.0,371.0
34,2014/10/15,378.0,374.828,378.0,16300,379.0,370.0
35,2014/10/16,366.0,369.608,370.0,18600,374.0,366.0
36,2014/10/17,366.0,369.666,365.0,28400,384.0,364.0
37,2014/10/20,381.0,379.04,373.0,20200,383.0,373.0
38,2014/10/21,376.0,382.068,381.0,17600,388.0,376.0
39,2014/10/22,394.0,389.129,381.0,14700,396.0,381.0
40,2014/10/23,389.0,388.614,386.0,4400,391.0,386.0
41,2014/10/24,395.0,395.038,395.0,5300,396.0,394.0
42,2014/10/27,398.0,396.541,393.0,13500,400.0,393.0
43,2014/10/28,409.0,407.379,413.0,50200,413.0,404.0
44,2014/10/29,417.0,413.285,410.0,30200,417.0,406.0
45,2014/10/30,421.0,417.578,415.0,58500,421.0,415.0
46,2014/10/31,428.0,423.245,417.0,76800,429.0,415.0
47,2014/11/04,430.0,432.792,437.0,72000,437.0,418.0
48,2014/11/05,443.0,433.796,429.0,86100,443.0,417.0
49,2014/11/06,436.0,437.881,435.0,32700,445.0,434.0
50,2014/11/07,441.0,434.431,435.0,44100,442.0,420.0
51,2014/11/10,440.0,440.69,440.0,22600,443.0,438.0
52,2014/11/11,443.0,439.44,437.0,27700,443.0,435.0
53,2014/11/12,435.0,440.731,441.0,57200,444.0,424.0
54,2014/11/13,445.0,444.469,433.0,78300,449.0,430.0
55,2014/11/14,448.0,446.915,450.0,69600,452.0,434.0
56,2014/11/17,437.0,443.673,443.0,16200,450.0,437.0
57,2014/11/18,448.0,445.919,441.0,25800,448.0,441.0
58,2014/11/19,450.0,451.192,451.0,16700,453.0,449.0
59,2014/11/20,453.0,452.617,454.0,24300,455.0,447.0
60,2014/11/21,449.0,441.604,452.0,16900,452.0,425.0
61,2014/11/25,455.0,453.187,449.0,17100,457.0,449.0
62,2014/11/26,458.0,455.957,455.0,34500,459.0,452.0
63,2014/11/27,463.0,461.213,460.0,41700,465.0,456.0
64,2014/11/28,470.0,466.343,470.0,37300,470.0,452.0
65,2014/12/01,474.0,476.962,474.0,34000,483.0,470.0
66,2014/12/02,478.0,477.773,479.0,18900,480.0,475.0
67,2014/12/03,477.0,479.019,475.0,15900,480.0,475.0
68,2014/12/04,482.0,478.814,476.0,25300,483.0,475.0
69,2014/12/05,480.0,477.508,474.0,55100,483.0,474.0
70,2014/12/08,484.0,481.838,483.0,13600,484.0,479.0
71,2014/12/09,483.0,483.826,484.0,16100,488.0,480.0
72,2014/12/10,480.0,478.831,475.0,44900,483.0,466.0
73,2014/12/11,477.0,475.12,474.0,25100,480.0,473.0
74,2014/12/12,479.0,486.187,490.0,57900,490.0,470.0
75,2014/12/15,469.0,473.427,471.0,22700,487.0,469.0
76,2014/12/16,467.0,467.352,464.0,17900,477.0,464.0
77,2014/12/17,459.0,463.806,462.0,25800,470.0,459.0
78,2014/12/18,474.0,470.656,467.0,16000,474.0,467.0
79,2014/12/19,476.0,474.074,482.0,27100,482.0,467.0
80,2014/12/22,474.0,472.909,474.0,9900,475.0,469.0
81,2014/12/24,477.0,476.385,474.0,9100,479.0,474.0
82,2014/12/25,470.0,470.371,470.0,29100,476.0,468.0
83,2014/12/26,474.0,468.415,467.0,14700,475.0,458.0
84,2014/12/29,481.0,478.951,479.0,18300,481.0,475.0
85,2014/12/30,472.0,477.421,484.0,10700,484.0,472.0
86,2015/01/05,476.0,476.483,476.0,2900,480.0,476.0
87,2015/01/06,460.0,465.663,472.0,19600,477.0,460.0
88,2015/01/07,455.0,454.765,452.0,11900,458.0,452.0
89,2015/01/08,459.0,456.703,455.0,14800,461.0,450.0
90,2015/01/09,456.0,455.124,456.0,15300,458.0,452.0
91,2015/01/13,450.0,444.351,448.0,26200,452.0,430.0
92,2015/01/14,440.0,442.667,445.0,9600,449.0,435.0
93,2015/01/15,453.0,446.522,436.0,15700,455.0,436.0
94,2015/01/16,431.0,432.139,443.0,57000,455.0,425.0
95,2015/01/19,437.0,433.189,432.0,20100,437.0,430.0
96,2015/01/20,447.0,444.896,442.0,13500,448.0,441.0
97,2015/01/21,440.0,442.447,447.0,8500,450.0,438.0
98,2015/01/22,443.0,437.985,435.0,19300,443.0,435.0
99,2015/01/23,452.0,448.932,451.0,20700,454.0,436.0
100,2015/01/26,452.0,449.327,445.0,10100,453.0,436.0
101,2015/01/27,459.0,459.694,460.0,8500,463.0,457.0
102,2015/01/28,460.0,459.789,452.0,18500,465.0,452.0
103,2015/01/29,466.0,468.348,466.0,15500,472.0,461.0
104,2015/01/30,480.0,474.11,471.0,12700,480.0,470.0
105,2015/02/02,470.0,471.153,470.0,15000,479.0,467.0
106,2015/02/03,467.0,468.638,469.0,18800,477.0,465.0
107,2015/02/04,480.0,475.052,475.0,17400,480.0,460.0
108,2015/02/05,473.0,473.855,475.0,7600,475.0,469.0
109,2015/02/06,473.0,472.5,473.0,8800,473.0,468.0
110,2015/02/09,474.0,471.636,470.0,15100,479.0,466.0
111,2015/02/10,473.0,471.746,468.0,6700,473.0,465.0
112,2015/02/12,482.0,477.852,470.0,28400,483.0,470.0
113,2015/02/13,479.0,484.717,490.0,23700,490.0,473.0
114,2015/02/16,487.0,487.737,483.0,11400,490.0,481.0
115,2015/02/17,487.0,484.915,482.0,18900,488.0,481.0
116,2015/02/18,486.0,485.767,488.0,26600,488.0,472.0
117,2015/02/19,490.0,485.324,485.0,32700,490.0,471.0
118,2015/02/20,482.0,485.455,488.0,19800,488.0,481.0
119,2015/02/23,483.0,483.59,485.0,8300,488.0,478.0
120,2015/02/24,490.0,487.909,485.0,25400,492.0,479.0
121,2015/02/25,490.0,490.059,490.0,10100,491.0,489.0
122,2015/02/26,498.0,494.809,491.0,40200,498.0,490.0
123,2015/02/27,506.0,500.284,500.0,63700,506.0,495.0
124,2015/03/02,498.0,498.439,500.0,22800,500.0,494.0
125,2015/03/03,494.0,490.704,497.0,23300,497.0,485.0
126,2015/03/04,498.0,493.677,490.0,19500,500.0,485.0
127,2015/03/05,497.0,498.533,500.0,9000,500.0,496.0
128,2015/03/06,500.0,499.444,498.0,18000,502.0,496.0
129,2015/03/09,498.0,498.528,500.0,5300,500.0,497.0
130,2015/03/10,498.0,495.391,498.0,13800,499.0,490.0
131,2015/03/11,498.0,497.059,497.0,10100,499.0,492.0
132,2015/03/12,503.0,500.693,500.0,24400,503.0,499.0
133,2015/03/13,502.0,503.566,504.0,38500,504.0,500.0
134,2015/03/16,503.0,502.34,502.0,10000,504.0,500.0
135,2015/03/17,503.0,502.698,503.0,9600,504.0,500.0
136,2015/03/18,503.0,502.5,502.0,9000,504.0,501.0
137,2015/03/19,500.0,496.748,496.0,23800,502.0,482.0
138,2015/03/20,500.0,501.128,503.0,10900,503.0,499.0
139,2015/03/23,505.0,500.701,506.0,12700,506.0,485.0
140,2015/03/24,502.0,500.127,500.0,11000,503.0,495.0
141,2015/03/25,504.0,497.326,500.0,30700,504.0,483.0
142,2015/03/26,498.0,497.378,503.0,11900,503.0,494.0
143,2015/03/27,485.0,489.215,493.0,15800,504.0,484.0
144,2015/03/30,497.0,494.447,490.0,31300,497.0,490.0
145,2015/03/31,506.0,500.949,497.0,36900,507.0,495.0
146,2015/04/01,493.0,494.734,497.0,26300,502.0,491.0
147,2015/04/02,499.0,499.856,495.0,25700,505.0,495.0
148,2015/04/03,503.0,501.476,503.0,10500,503.0,498.0
149,2015/04/06,496.0,497.189,501.0,3700,501.0,496.0
150,2015/04/07,493.0,494.006,492.0,18300,498.0,492.0
151,2015/04/08,495.0,496.614,493.0,12700,499.0,493.0
152,2015/04/09,492.0,490.914,494.0,16200,494.0,485.0
153,2015/04/10,491.0,489.124,486.0,31400,494.0,486.0
154,2015/04/13,487.0,487.653,488.0,14700,493.0,484.0
155,2015/04/14,493.0,492.26,491.0,7300,494.0,486.0
156,2015/04/15,496.0,493.734,493.0,18400,496.0,491.0
157,2015/04/16,495.0,494.972,495.0,7200,496.0,494.0
158,2015/04/17,495.0,494.719,493.0,13900,496.0,492.0
159,2015/04/20,492.0,494.733,495.0,9000,497.0,492.0
160,2015/04/21,496.0,494.863,492.0,10200,497.0,491.0
161,2015/04/22,495.0,494.23,496.0,23900,497.0,486.0
162,2015/04/23,494.0,494.519,497.0,10800,497.0,491.0
163,2015/04/24,492.0,492.177,495.0,13000,495.0,490.0
164,2015/04/27,495.0,495.508,492.0,12000,497.0,492.0
165,2015/04/28,499.0,494.579,497.0,24700,499.0,481.0
166,2015/04/30,497.0,494.798,494.0,22800,498.0,490.0
167,2015/05/01,490.0,490.161,490.0,14900,494.0,488.0
168,2015/05/07,488.0,489.191,488.0,8400,493.0,487.0
169,2015/05/08,494.0,494.068,491.0,14800,497.0,490.0
170,2015/05/11,495.0,492.713,495.0,15700,496.0,487.0
171,2015/05/12,502.0,502.974,507.0,19300,507.0,495.0
172,2015/05/13,500.0,500.213,500.0,17400,501.0,500.0
173,2015/05/14,499.0,499.862,502.0,21800,502.0,495.0
174,2015/05/15,503.0,501.483,500.0,14300,504.0,499.0
175,2015/05/18,506.0,503.449,505.0,18700,507.0,492.0
176,2015/05/19,506.0,503.829,501.0,15800,506.0,500.0
177,2015/05/20,507.0,502.538,506.0,54700,507.0,498.0
178,2015/05/21,509.0,509.448,507.0,44000,515.0,502.0
179,2015/05/22,507.0,507.645,510.0,3100,510.0,506.0
180,2015/05/25,510.0,508.993,511.0,13300,511.0,505.0
181,2015/05/26,505.0,505.367,509.0,12800,509.0,503.0
182,2015/05/27,508.0,508.012,505.0,8100,510.0,505.0
183,2015/05/28,510.0,508.259,506.0,19300,511.0,506.0
184,2015/05/29,510.0,509.135,505.0,25900,512.0,505.0
185,2015/06/01,506.0,505.631,503.0,19500,508.0,503.0
186,2015/06/02,502.0,502.112,505.0,23300,505.0,499.0
187,2015/06/03,500.0,500.455,500.0,13400,502.0,498.0
188,2015/06/04,500.0,500.271,498.0,17000,504.0,498.0
189,2015/06/05,504.0,503.445,505.0,39300,509.0,498.0
190,2015/06/08,501.0,502.76,506.0,17100,508.0,500.0
191,2015/06/09,494.0,497.407,497.0,19900,501.0,494.0
192,2015/06/10,497.0,498.553,498.0,21700,507.0,495.0
193,2015/06/11,502.0,501.881,500.0,19400,505.0,499.0
194,2015/06/12,500.0,500.844,500.0,66800,506.0,498.0
195,2015/06/15,504.0,506.059,504.0,18700,510.0,502.0
196,2015/06/16,501.0,502.269,502.0,11900,504.0,501.0
197,2015/06/17,502.0,501.877,504.0,19500,505.0,499.0
198,2015/06/18,498.0,499.5,500.0,17000,503.0,498.0
199,2015/06/19,500.0,500.706,500.0,12600,505.0,498.0
200,2015/06/22,501.0,500.404,503.0,16600,503.0,498.0
201,2015/06/23,505.0,505.187,505.0,18200,509.0,500.0
202,2015/06/24,504.0,503.539,508.0,26000,509.0,500.0
203,2015/06/25,501.0,501.79,504.0,20000,507.0,495.0
204,2015/06/26,500.0,500.113,501.0,26500,508.0,495.0
205,2015/06/29,489.0,487.923,485.0,27200,493.0,485.0
206,2015/06/30,504.0,495.277,487.0,20200,506.0,487.0
207,2015/07/01,501.0,504.77,504.0,17400,509.0,494.0
208,2015/07/02,502.0,503.466,504.0,7300,508.0,502.0
209,2015/07/03,502.0,502.843,504.0,10200,506.0,501.0
210,2015/07/06,495.0,496.704,498.0,14200,500.0,495.0
211,2015/07/07,493.0,495.607,498.0,12200,500.0,492.0
212,2015/07/08,476.0,483.471,493.0,27600,493.0,476.0
213,2015/07/09,472.0,469.209,466.0,21500,487.0,462.0
214,2015/07/10,477.0,478.769,472.0,21200,487.0,472.0
215,2015/07/13,495.0,484.115,477.0,7800,495.0,477.0
216,2015/07/14,492.0,494.614,500.0,13200,500.0,490.0
217,2015/07/15,498.0,494.114,490.0,28000,498.0,485.0
218,2015/07/16,502.0,499.453,500.0,32200,502.0,496.0
219,2015/07/17,502.0,504.236,505.0,10600,505.0,500.0
220,2015/07/21,500.0,500.458,502.0,13100,504.0,497.0
221,2015/07/22,495.0,498.705,500.0,16600,508.0,490.0
222,2015/07/23,500.0,497.932,495.0,5900,500.0,492.0
223,2015/07/24,493.0,495.793,500.0,2900,500.0,493.0
224,2015/07/27,490.0,492.779,493.0,11300,500.0,486.0
225,2015/07/28,487.0,486.739,482.0,15700,492.0,482.0
226,2015/07/29,489.0,489.923,493.0,11700,500.0,485.0
227,2015/07/30,528.0,535.761,535.0,395400,550.0,525.0
228,2015/07/31,520.0,521.482,528.0,89400,528.0,513.0
229,2015/08/03,521.0,521.905,520.0,34800,526.0,518.0
230,2015/08/04,523.0,522.628,523.0,22300,528.0,519.0
231,2015/08/05,522.0,520.502,525.0,27500,525.0,516.0
232,2015/08/06,520.0,525.259,527.0,50900,533.0,516.0
233,2015/08/07,523.0,524.667,520.0,24300,528.0,520.0
234,2015/08/10,536.0,533.577,530.0,48700,537.0,527.0
235,2015/08/11,526.0,537.968,545.0,71100,545.0,524.0
236,2015/08/12,517.0,523.188,521.0,96800,533.0,511.0
237,2015/08/13,533.0,533.356,518.0,50900,542.0,518.0
238,2015/08/14,537.0,539.34,538.0,37600,544.0,535.0
239,2015/08/17,545.0,543.719,540.0,26300,546.0,538.0
240,2015/08/18,549.0,548.148,549.0,64300,550.0,545.0
241,2015/08/19,541.0,539.705,543.0,60600,548.0,531.0
242,2015/08/20,527.0,531.39,535.0,43900,537.0,527.0
243,2015/08/21,514.0,520.244,515.0,78200,535.0,512.0
244,2015/08/24,478.0,492.476,501.0,132700,510.0,478.0
245,2015/08/25,465.0,464.675,462.0,124100,488.0,452.0
246,2015/08/26,488.0,476.022,466.0,67900,490.0,461.0
247,2015/08/27,490.0,493.794,500.0,42800,501.0,486.0
248,2015/08/28,499.0,497.515,502.0,64700,502.0,492.0
249,2015/08/31,504.0,503.935,501.0,33800,513.0,497.0
250,2015/09/01,484.0,494.451,498.0,38100,505.0,482.0
251,2015/09/02,472.0,475.214,468.0,45300,483.0,468.0
252,2015/09/03,477.0,479.841,478.0,20100,488.0,477.0
253,2015/09/04,461.0,467.641,478.0,32900,482.0,459.0
254,2015/09/07,466.0,461.132,458.0,13600,468.0,455.0
255,2015/09/08,461.0,466.31,463.0,17100,475.0,461.0
256,2015/09/09,481.0,477.654,476.0,21700,481.0,470.0
257,2015/09/10,478.0,474.216,471.0,13400,481.0,468.0
258,2015/09/11,491.0,491.052,492.0,43900,496.0,485.0
259,2015/09/14,475.0,479.284,492.0,17600,492.0,471.0
260,2015/09/15,469.0,472.81,476.0,21100,481.0,463.0
261,2015/09/16,474.0,472.02,476.0,10000,476.0,470.0
262,2015/09/17,478.0,475.409,480.0,29600,480.0,472.0
263,2015/09/18,471.0,469.413,472.0,25400,472.0,464.0
264,2015/09/24,455.0,458.802,463.0,35300,464.0,455.0
265,2015/09/25,464.0,458.569,453.0,24800,464.0,453.0
266,2015/09/28,456.0,456.091,458.0,14300,462.0,451.0
267,2015/09/29,441.0,443.29,450.0,22400,450.0,439.0
268,2015/09/30,447.0,445.269,445.0,26800,450.0,440.0
269,2015/10/01,451.0,452.201,450.0,17400,456.0,449.0
270,2015/10/02,453.0,452.188,450.0,8500,454.0,450.0
271,2015/10/05,460.0,461.106,455.0,16000,468.0,455.0
272,2015/10/06,466.0,465.966,465.0,14900,468.0,463.0
273,2015/10/07,474.0,468.085,467.0,27200,474.0,466.0
274,2015/10/08,471.0,471.425,474.0,15300,475.0,468.0
275,2015/10/09,485.0,478.097,471.0,21600,485.0,470.0
276,2015/10/13,483.0,483.032,485.0,28200,496.0,477.0
277,2015/10/14,477.0,479.367,480.0,24800,484.0,476.0
278,2015/10/15,480.0,481.191,474.0,27300,490.0,474.0
279,2015/10/16,492.0,489.183,481.0,16900,492.0,481.0
280,2015/10/19,488.0,488.578,492.0,18000,492.0,484.0
281,2015/10/20,484.0,487.776,493.0,19600,493.0,484.0
282,2015/10/21,494.0,489.558,485.0,19900,495.0,484.0
283,2015/10/22,492.0,493.096,491.0,10400,497.0,490.0
284,2015/10/23,505.0,500.856,496.0,31900,505.0,496.0
285,2015/10/26,540.0,548.786,512.0,522000,570.0,507.0
286,2015/10/27,540.0,544.938,554.0,172100,554.0,538.0
287,2015/10/28,539.0,534.561,540.0,76700,544.0,525.0
288,2015/10/29,541.0,540.466,538.0,42700,546.0,533.0
289,2015/10/30,543.0,542.565,544.0,42500,546.0,538.0
290,2015/11/02,529.0,531.346,539.0,40500,539.0,526.0
291,2015/11/04,527.0,530.501,529.0,44500,538.0,525.0
292,2015/11/05,527.0,527.492,523.0,29900,533.0,523.0
293,2015/11/06,530.0,530.008,528.0,24600,533.0,527.0
294,2015/11/09,536.0,539.04,530.0,72900,547.0,530.0
295,2015/11/10,529.0,530.421,533.0,25900,533.0,527.0
296,2015/11/11,538.0,537.211,531.0,33700,542.0,530.0
297,2015/11/12,533.0,531.459,529.0,20500,534.0,528.0
298,2015/11/13,532.0,531.264,526.0,23900,536.0,526.0
299,2015/11/16,527.0,525.152,523.0,22400,530.0,518.0
300,2015/11/17,531.0,531.457,530.0,38100,535.0,527.0
301,2015/11/18,536.0,535.387,536.0,28400,540.0,531.0
302,2015/11/19,535.0,531.388,543.0,46700,543.0,524.0
303,2015/11/20,534.0,531.217,536.0,16100,536.0,522.0
304,2015/11/24,537.0,533.632,536.0,26600,537.0,529.0
305,2015/11/25,534.0,535.986,537.0,21300,538.0,533.0
306,2015/11/26,532.0,532.441,531.0,21100,536.0,530.0
307,2015/11/27,538.0,534.591,530.0,25400,539.0,528.0
308,2015/11/30,547.0,545.305,539.0,78600,549.0,539.0
309,2015/12/01,549.0,548.442,548.0,32100,555.0,543.0
310,2015/12/02,540.0,541.248,544.0,24600,546.0,539.0
311,2015/12/03,535.0,532.84,535.0,46100,539.0,527.0
312,2015/12/04,525.0,526.878,528.0,22100,529.0,525.0
313,2015/12/07,526.0,527.611,530.0,14900,530.0,525.0
314,2015/12/08,521.0,521.759,528.0,24500,528.0,519.0
315,2015/12/09,519.0,521.188,522.0,18600,525.0,519.0
316,2015/12/10,511.0,515.055,520.0,29100,520.0,511.0
317,2015/12/11,511.0,507.641,506.0,39000,516.0,506.0
318,2015/12/14,511.0,507.088,498.0,29700,516.0,498.0
319,2015/12/15,502.0,504.504,507.0,11300,510.0,502.0
320,2015/12/16,509.0,507.961,509.0,18000,509.0,505.0
321,2015/12/17,514.0,513.363,512.0,33600,519.0,507.0
322,2015/12/18,513.0,518.09,519.0,54500,523.0,513.0
323,2015/12/21,505.0,505.482,511.0,18900,511.0,501.0
324,2015/12/22,505.0,505.529,504.0,22300,508.0,504.0
325,2015/12/24,498.0,502.912,505.0,19200,509.0,498.0
326,2015/12/25,492.0,493.118,498.0,28000,500.0,490.0
327,2015/12/28,502.0,498.917,492.0,8400,504.0,492.0
328,2015/12/29,500.0,497.157,503.0,24200,503.0,492.0
329,2015/12/30,507.0,505.401,505.0,21700,511.0,500.0
330,2016/01/04,492.0,495.895,502.0,47600,507.0,488.0
331,2016/01/05,491.0,492.303,486.0,23400,498.0,485.0
332,2016/01/06,487.0,488.353,489.0,22400,493.0,486.0
333,2016/01/07,478.0,483.872,487.0,28200,494.0,476.0
334,2016/01/08,475.0,478.547,477.0,17000,486.0,474.0
335,2016/01/12,458.0,462.89,471.0,42900,471.0,455.0
336,2016/01/13,468.0,469.212,461.0,21200,475.0,461.0
337,2016/01/14,464.0,462.104,462.0,26900,470.0,458.0
338,2016/01/15,465.0,465.761,470.0,19700,473.0,461.0
339,2016/01/18,452.0,451.683,447.0,32500,462.0,445.0
340,2016/01/19,457.0,456.774,452.0,19000,460.0,452.0
341,2016/01/20,441.0,450.232,460.0,45200,468.0,439.0
342,2016/01/21,427.0,440.073,441.0,27600,452.0,427.0
343,2016/01/22,452.0,440.993,432.0,28700,453.0,429.0
344,2016/01/25,459.0,459.472,456.0,14400,464.0,456.0
345,2016/01/26,446.0,449.626,451.0,18200,456.0,446.0
346,2016/01/27,463.0,459.753,455.0,17000,464.0,455.0
347,2016/01/28,463.0,461.359,461.0,18400,464.0,458.0
348,2016/01/29,462.0,458.987,460.0,30900,466.0,450.0
349,2016/02/01,457.0,451.003,460.0,59400,460.0,445.0
350,2016/02/02,452.0,452.619,457.0,26500,457.0,450.0
351,2016/02/03,438.0,440.453,448.0,20300,449.0,433.0
352,2016/02/04,431.0,432.698,432.0,18900,437.0,431.0
353,2016/02/05,429.0,428.049,428.0,14200,431.0,426.0
354,2016/02/08,435.0,434.074,429.0,19000,440.0,427.0
355,2016/02/09,415.0,424.375,436.0,28000,436.0,414.0
356,2016/02/10,403.0,410.025,429.0,39600,429.0,398.0
357,2016/02/12,372.0,381.795,391.0,43300,391.0,367.0
358,2016/02/15,391.0,380.035,371.0,46000,396.0,371.0
359,2016/02/16,393.0,390.854,386.0,28100,398.0,382.0
360,2016/02/17,392.0,393.438,393.0,12100,400.0,387.0
361,2016/02/18,403.0,402.005,400.0,20600,410.0,395.0
362,2016/02/19,393.0,393.518,400.0,24700,400.0,388.0
363,2016/02/22,393.0,392.966,388.0,11900,398.0,388.0
364,2016/02/23,388.0,391.069,394.0,14600,398.0,388.0
365,2016/02/24,379.0,381.782,380.0,22000,389.0,372.0
366,2016/02/25,383.0,383.943,378.0,15700,388.0,378.0
367,2016/02/26,390.0,389.756,386.0,12700,396.0,386.0
368,2016/02/29,392.0,405.639,420.0,31300,421.0,392.0
369,2016/03/01,389.0,390.214,392.0,18200,395.0,387.0
370,2016/03/02,402.0,401.059,397.0,22200,410.0,395.0
371,2016/03/03,413.0,414.128,403.0,23500,425.0,403.0
372,2016/03/04,420.0,417.93,412.0,14300,428.0,412.0
373,2016/03/07,418.0,418.987,420.0,23900,427.0,416.0
374,2016/03/08,416.0,417.442,417.0,16300,424.0,413.0
375,2016/03/09,405.0,408.186,412.0,12900,412.0,405.0
376,2016/03/10,417.0,417.578,413.0,21100,425.0,413.0
377,2016/03/11,419.0,412.88,408.0,35000,423.0,406.0
378,2016/03/14,430.0,430.371,427.0,16700,434.0,426.0
379,2016/03/15,427.0,428.884,428.0,14600,436.0,423.0
380,2016/03/16,425.0,428.55,425.0,9100,435.0,424.0
381,2016/03/17,428.0,433.54,430.0,18900,442.0,426.0
382,2016/03/18,421.0,425.009,430.0,21800,436.0,418.0
383,2016/03/22,435.0,434.57,430.0,24400,444.0,427.0
384,2016/03/23,438.0,439.368,443.0,13300,443.0,435.0
385,2016/03/24,428.0,431.995,435.0,21500,436.0,428.0
386,2016/03/25,426.0,427.112,425.0,16100,431.0,425.0
387,2016/03/28,431.0,429.871,430.0,12400,434.0,426.0
388,2016/03/29,428.0,423.219,422.0,14600,428.0,416.0
389,2016/03/30,421.0,421.252,423.0,12700,423.0,418.0
390,2016/03/31,414.0,417.63,420.0,13500,426.0,414.0
391,2016/04/01,394.0,398.069,418.0,26200,418.0,392.0
392,2016/04/04,396.0,395.884,398.0,13800,399.0,393.0
393,2016/04/05,382.0,386.571,395.0,15400,398.0,382.0
394,2016/04/06,380.0,381.302,382.0,22500,388.0,378.0
395,2016/04/07,375.0,377.637,379.0,24500,388.0,373.0
396,2016/04/08,379.0,377.629,370.0,29900,386.0,368.0
397,2016/04/11,375.0,372.702,375.0,23800,375.0,369.0
398,2016/04/12,373.0,372.059,370.0,30700,378.0,367.0
399,2016/04/13,380.0,378.003,378.0,33300,381.0,374.0
400,2016/04/14,389.0,385.079,384.0,28000,389.0,382.0
401,2016/04/15,385.0,385.056,387.0,19600,387.0,383.0
402,2016/04/18,376.0,377.437,381.0,29300,381.0,375.0
403,2016/04/19,384.0,381.421,381.0,25900,384.0,378.0
404,2016/04/20,382.0,384.665,386.0,37000,390.0,380.0
405,2016/04/21,386.0,385.87,387.0,26200,390.0,384.0
406,2016/04/22,388.0,384.983,384.0,23300,390.0,381.0
407,2016/04/25,393.0,390.831,389.0,20700,394.0,387.0
408,2016/04/26,389.0,387.513,390.0,23000,391.0,383.0
409,2016/04/27,383.0,383.39,384.0,23600,387.0,381.0
410,2016/04/28,380.0,382.785,385.0,20000,388.0,378.0
411,2016/05/02,370.0,369.702,374.0,38900,374.0,365.0
412,2016/05/06,368.0,367.96,373.0,27200,373.0,363.0
413,2016/05/09,371.0,368.877,368.0,14600,372.0,366.0
414,2016/05/10,373.0,374.143,372.0,16800,378.0,369.0
415,2016/05/11,383.0,381.183,380.0,22900,385.0,375.0
416,2016/05/12,384.0,381.243,382.0,14400,384.0,378.0
417,2016/05/13,378.0,378.025,380.0,20000,382.0,374.0
418,2016/05/16,369.0,371.694,370.0,48300,378.0,368.0
419,2016/05/17,372.0,372.333,371.0,18000,376.0,370.0
420,2016/05/18,370.0,370.28,372.0,39300,374.0,367.0
421,2016/05/19,374.0,373.754,373.0,13000,377.0,373.0
422,2016/05/20,377.0,377.108,376.0,31500,379.0,375.0
423,2016/05/23,373.0,372.27,377.0,22200,377.0,369.0
424,2016/05/24,373.0,372.719,372.0,3200,374.0,372.0
425,2016/05/25,373.0,373.429,374.0,16300,377.0,372.0
426,2016/05/26,378.0,379.383,376.0,25300,381.0,375.0
427,2016/05/27,378.0,377.198,378.0,12600,380.0,375.0
428,2016/05/30,378.0,378.468,380.0,9400,381.0,376.0
429,2016/05/31,381.0,381.124,379.0,9700,384.0,378.0
430,2016/06/01,381.0,384.193,383.0,24300,389.0,380.0
431,2016/06/02,376.0,380.21,382.0,24300,388.0,376.0
432,2016/06/03,383.0,381.944,382.0,19500,385.0,378.0
433,2016/06/06,373.0,374.806,374.0,26300,378.0,373.0
434,2016/06/07,378.0,377.957,374.0,11500,380.0,374.0
435,2016/06/08,375.0,376.513,380.0,26100,382.0,374.0
436,2016/06/09,374.0,375.718,375.0,14900,378.0,374.0
437,2016/06/10,373.0,373.885,374.0,30500,375.0,372.0
438,2016/06/13,363.0,366.488,371.0,25600,373.0,363.0
439,2016/06/14,358.0,358.641,361.0,11700,366.0,356.0
440,2016/06/15,359.0,357.353,358.0,15300,362.0,354.0
441,2016/06/16,344.0,349.702,359.0,33600,359.0,342.0
442,2016/06/17,352.0,350.109,346.0,12800,356.0,346.0
443,2016/06/20,354.0,353.529,355.0,19300,366.0,342.0
444,2016/06/21,360.0,357.664,355.0,10400,360.0,354.0
445,2016/06/22,354.0,353.089,358.0,12400,358.0,350.0
446,2016/06/23,360.0,357.735,354.0,6800,361.0,352.0
447,2016/06/24,338.0,343.67,357.0,46900,358.0,337.0
448,2016/06/27,341.0,342.772,340.0,18400,349.0,340.0
449,2016/06/28,341.0,340.969,341.0,13000,347.0,339.0
450,2016/06/29,343.0,342.276,341.0,26500,347.0,340.0
451,2016/06/30,344.0,346.022,350.0,23100,351.0,342.0
452,2016/07/01,346.0,346.337,345.0,9500,349.0,344.0
453,2016/07/04,343.0,342.7,343.0,21000,345.0,341.0
454,2016/07/05,343.0,342.343,343.0,9900,343.0,341.0
455,2016/07/06,338.0,339.065,341.0,23100,343.0,337.0
456,2016/07/07,337.0,338.588,338.0,8000,340.0,337.0
457,2016/07/08,333.0,335.043,336.0,32700,339.0,333.0
458,2016/07/11,345.0,343.851,339.0,17400,346.0,339.0
459,2016/07/12,351.0,349.857,347.0,16100,353.0,345.0
460,2016/07/13,351.0,352.592,353.0,29400,355.0,349.0
461,2016/07/14,349.0,349.756,351.0,19700,351.0,347.0
462,2016/07/15,355.0,353.417,351.0,13900,356.0,350.0
463,2016/07/19,354.0,351.879,351.0,17300,354.0,349.0
464,2016/07/20,353.0,354.648,358.0,24400,358.0,350.0
465,2016/07/21,358.0,357.404,357.0,16600,359.0,355.0
466,2016/07/22,358.0,360.048,354.0,8400,365.0,354.0
467,2016/07/25,359.0,359.544,362.0,9200,363.0,356.0
468,2016/07/26,356.0,357.75,360.0,10400,361.0,356.0
469,2016/07/27,359.0,355.103,363.0,15500,363.0,350.0
470,2016/07/28,352.0,354.768,355.0,19000,366.0,351.0
471,2016/07/29,360.0,357.653,350.0,30800,372.0,350.0
472,2016/08/01,352.0,353.815,358.0,8100,358.0,352.0
473,2016/08/02,350.0,356.12,351.0,22500,361.0,350.0
474,2016/08/03,344.0,346.29,347.0,17600,350.0,344.0
475,2016/08/04,344.0,343.802,343.0,16700,349.0,342.0
476,2016/08/05,345.0,346.152,343.0,6600,351.0,343.0
477,2016/08/08,356.0,351.867,349.0,9800,357.0,348.0
478,2016/08/09,352.0,350.917,350.0,8400,354.0,350.0
479,2016/08/10,352.0,350.952,352.0,10400,353.0,350.0
480,2016/08/12,357.0,353.852,355.0,14200,360.0,349.0
481,2016/08/15,357.0,357.728,358.0,8100,359.0,356.0
482,2016/08/16,347.0,351.234,357.0,12800,357.0,347.0
483,2016/08/17,349.0,346.222,344.0,22500,352.0,344.0
484,2016/08/18,345.0,346.511,347.0,13500,350.0,344.0
485,2016/08/19,347.0,347.281,348.0,15300,349.0,345.0
486,2016/08/22,348.0,346.563,347.0,8000,351.0,345.0
487,2016/08/23,342.0,344.076,344.0,15900,348.0,342.0
488,2016/08/24,346.0,345.773,346.0,11000,347.0,343.0
489,2016/08/25,348.0,346.831,345.0,13600,349.0,345.0
490,2016/08/26,349.0,349.376,348.0,14900,352.0,346.0
491,2016/08/29,358.0,354.905,353.0,12600,358.0,352.0
492,2016/08/30,359.0,358.514,356.0,18300,361.0,356.0
493,2016/08/31,362.0,361.69,360.0,8700,363.0,360.0
494,2016/09/01,366.0,364.531,361.0,8100,367.0,361.0
495,2016/09/02,367.0,366.105,364.0,12400,367.0,364.0
496,2016/09/05,368.0,367.115,368.0,5200,368.0,365.0
497,2016/09/06,370.0,370.989,368.0,18800,374.0,366.0
498,2016/09/07,369.0,368.589,369.0,16800,372.0,365.0
499,2016/09/08,372.0,371.103,373.0,11600,373.0,369.0
500,2016/09/09,369.0,366.316,364.0,36700,372.0,364.0
501,2016/09/12,366.0,364.836,363.0,6700,367.0,363.0
502,2016/09/13,368.0,368.642,369.0,17600,371.0,365.0
503,2016/09/14,367.0,365.978,367.0,22300,370.0,360.0
504,2016/09/15,365.0,367.075,364.0,9300,370.0,364.0
505,2016/09/16,370.0,368.638,371.0,24600,372.0,366.0
506,2016/09/20,370.0,371.268,372.0,19000,374.0,368.0
507,2016/09/21,375.0,371.38,369.0,30500,375.0,366.0
508,2016/09/23,378.0,376.723,375.0,21300,378.0,374.0
509,2016/09/26,379.0,377.133,377.0,10500,379.0,373.0
510,2016/09/27,383.0,379.168,375.0,22000,383.0,369.0
511,2016/09/28,379.0,378.635,380.0,9600,380.0,374.0
512,2016/09/29,386.0,383.451,384.0,29700,389.0,375.0
513,2016/09/30,392.0,397.893,386.0,185600,406.0,386.0
514,2016/10/03,392.0,392.046,397.0,47700,398.0,386.0
515,2016/10/04,384.0,381.164,389.0,49300,389.0,375.0
516,2016/10/05,387.0,384.539,389.0,33200,389.0,377.0
517,2016/10/06,391.0,387.379,388.0,29300,393.0,381.0
518,2016/10/07,387.0,386.455,390.0,6600,390.0,386.0
519,2016/10/11,389.0,389.492,393.0,12200,393.0,387.0
520,2016/10/12,387.0,385.575,388.0,25200,388.0,380.0
521,2016/10/13,388.0,388.516,388.0,12800,390.0,387.0
522,2016/10/14,390.0,388.813,389.0,6400,392.0,385.0
523,2016/10/17,391.0,391.345,391.0,8400,393.0,388.0
524,2016/10/18,392.0,389.525,387.0,8000,393.0,385.0
525,2016/10/19,392.0,390.551,392.0,10700,392.0,388.0
526,2016/10/20,394.0,392.765,392.0,15300,394.0,391.0
527,2016/10/21,395.0,393.565,395.0,15400,395.0,391.0
528,2016/10/24,394.0,392.593,392.0,15000,396.0,390.0
529,2016/10/25,395.0,393.25,398.0,26800,398.0,391.0
530,2016/10/26,397.0,396.048,395.0,20900,399.0,391.0
531,2016/10/27,397.0,395.049,398.0,14300,398.0,393.0
532,2016/10/28,398.0,397.39,397.0,33300,399.0,394.0
533,2016/10/31,399.0,397.716,400.0,14800,400.0,396.0
534,2016/11/01,395.0,395.091,397.0,21900,397.0,394.0
535,2016/11/02,395.0,393.695,393.0,20300,397.0,390.0
536,2016/11/04,395.0,386.645,390.0,19700,395.0,374.0
537,2016/11/07,396.0,394.956,395.0,13500,398.0,391.0
538,2016/11/08,396.0,398.233,397.0,15000,402.0,396.0
539,2016/11/09,377.0,384.204,398.0,25500,398.0,377.0
540,2016/11/10,396.0,395.267,396.0,21000,398.0,391.0
541,2016/11/11,395.0,394.449,398.0,12700,398.0,392.0
542,2016/11/14,395.0,395.6,398.0,13500,398.0,395.0
543,2016/11/15,402.0,400.5,395.0,24400,404.0,393.0
544,2016/11/16,471.0,470.708,404.0,971700,482.0,404.0
545,2016/11/17,531.0,511.268,495.0,4140400,537.0,475.0
546,2016/11/18,517.0,507.222,520.0,1922500,525.0,486.0
547,2016/11/21,500.0,500.791,508.0,661700,510.0,492.0
548,2016/11/22,494.0,512.48,528.0,928100,530.0,493.0
549,2016/11/24,492.0,495.701,501.0,269900,501.0,492.0
550,2016/11/25,479.0,483.427,486.0,419500,499.0,475.0
551,2016/11/28,480.0,481.712,479.0,163300,488.0,477.0
552,2016/11/29,492.0,485.558,477.0,228600,499.0,474.0
553,2016/11/30,491.0,490.055,490.0,137700,496.0,484.0
554,2016/12/01,490.0,490.443,491.0,84700,494.0,487.0
555,2016/12/02,484.0,482.72,485.0,148900,489.0,477.0
556,2016/12/05,482.0,480.361,482.0,47600,484.0,475.0
557,2016/12/06,482.0,482.147,480.0,99800,489.0,478.0
558,2016/12/07,490.0,487.469,485.0,100200,492.0,479.0
559,2016/12/08,486.0,488.589,497.0,115800,498.0,482.0
560,2016/12/09,498.0,498.741,490.0,253200,506.0,486.0
561,2016/12/12,491.0,492.683,505.0,124400,506.0,484.0
562,2016/12/13,493.0,492.296,491.0,76300,497.0,487.0
563,2016/12/14,493.0,492.343,493.0,162900,499.0,486.0
564,2016/12/15,494.0,493.034,495.0,49900,497.0,489.0
565,2016/12/16,496.0,495.102,499.0,74700,499.0,489.0
566,2016/12/19,493.0,492.776,495.0,30800,495.0,489.0
567,2016/12/20,485.0,483.381,489.0,68300,491.0,479.0
568,2016/12/21,489.0,482.522,476.0,138200,491.0,471.0
569,2016/12/22,490.0,487.629,485.0,64200,492.0,481.0
570,2016/12/26,485.0,484.453,492.0,60300,495.0,477.0
571,2016/12/27,483.0,480.917,486.0,54000,491.0,471.0
572,2016/12/28,481.0,479.609,479.0,34800,483.0,476.0
573,2016/12/29,478.0,477.792,481.0,59500,482.0,475.0
574,2016/12/30,479.0,477.65,478.0,36000,483.0,472.0
575,2017/01/04,495.0,492.593,484.0,66100,495.0,484.0
576,2017/01/05,493.0,494.081,494.0,27300,496.0,492.0
577,2017/01/06,493.0,492.357,492.0,54400,496.0,481.0
578,2017/01/10,490.0,490.454,492.0,26000,493.0,486.0
579,2017/01/11,493.0,491.924,490.0,30100,494.0,490.0
580,2017/01/12,485.0,483.766,495.0,62000,495.0,473.0
581,2017/01/13,480.0,481.684,484.0,21200,484.0,478.0
582,2017/01/16,474.0,475.562,480.0,23300,481.0,473.0
583,2017/01/17,470.0,472.423,474.0,39000,480.0,469.0
584,2017/01/18,470.0,466.774,467.0,34100,470.0,464.0
585,2017/01/19,472.0,472.457,476.0,14000,476.0,470.0
586,2017/01/20,471.0,471.515,473.0,20600,476.0,468.0
587,2017/01/23,470.0,470.358,468.0,36900,472.0,466.0
588,2017/01/24,468.0,468.274,467.0,14600,471.0,466.0
589,2017/01/25,475.0,473.282,476.0,15600,476.0,470.0
590,2017/01/26,480.0,478.325,480.0,15100,480.0,476.0
591,2017/01/27,479.0,479.284,480.0,22200,484.0,477.0
592,2017/01/30,474.0,474.844,477.0,14700,479.0,472.0
593,2017/01/31,467.0,467.145,467.0,28900,470.0,465.0
594,2017/02/01,464.0,462.29,462.0,26900,465.0,457.0
595,2017/02/02,457.0,458.921,464.0,21400,464.0,456.0
596,2017/02/03,452.0,454.167,457.0,28700,462.0,450.0
597,2017/02/06,456.0,454.577,456.0,31900,457.0,451.0
598,2017/02/07,460.0,459.928,459.0,19400,462.0,459.0
599,2017/02/08,461.0,460.783,460.0,16600,462.0,460.0
600,2017/02/09,460.0,462.03,461.0,16700,465.0,460.0
601,2017/02/10,466.0,465.258,464.0,19800,467.0,464.0
602,2017/02/13,467.0,467.682,467.0,10700,470.0,466.0
603,2017/02/14,466.0,467.692,466.0,15900,470.0,466.0
604,2017/02/15,472.0,470.965,469.0,14400,473.0,469.0
605,2017/02/16,470.0,471.845,473.0,14800,478.0,469.0
606,2017/02/17,471.0,471.846,470.0,12300,475.0,470.0
607,2017/02/20,474.0,473.978,473.0,13400,475.0,472.0
608,2017/02/21,477.0,475.163,473.0,12300,477.0,473.0
609,2017/02/22,478.0,481.483,478.0,33100,488.0,477.0
610,2017/02/23,482.0,481.08,480.0,7500,483.0,479.0
611,2017/02/24,482.0,481.563,480.0,9600,483.0,480.0
612,2017/02/27,477.0,476.518,480.0,22000,481.0,472.0
613,2017/02/28,477.0,478.724,476.0,17000,483.0,476.0
614,2017/03/01,480.0,478.646,477.0,14400,480.0,477.0
615,2017/03/02,482.0,482.704,484.0,20300,484.0,480.0
616,2017/03/03,479.0,481.418,482.0,19400,485.0,479.0
617,2017/03/06,479.0,479.892,479.0,12000,482.0,478.0
618,2017/03/07,478.0,479.557,482.0,16700,483.0,478.0
619,2017/03/08,479.0,478.973,478.0,7500,480.0,478.0
620,2017/03/09,480.0,480.114,480.0,11400,481.0,480.0
621,2017/03/10,482.0,485.215,488.0,44100,488.0,476.0
622,2017/03/13,480.0,481.016,481.0,12400,484.0,480.0
623,2017/03/14,484.0,482.517,482.0,11600,484.0,480.0
624,2017/03/15,480.0,480.791,481.0,12900,482.0,480.0
625,2017/03/16,482.0,479.529,476.0,25500,483.0,476.0
626,2017/03/17,483.0,484.482,483.0,19300,489.0,480.0
627,2017/03/21,480.0,480.707,483.0,15000,483.0,478.0
628,2017/03/22,476.0,477.253,478.0,17000,480.0,476.0
629,2017/03/23,476.0,478.34,480.0,14400,481.0,476.0
630,2017/03/24,483.0,482.62,482.0,15800,485.0,481.0
631,2017/03/27,478.0,480.959,488.0,19300,488.0,478.0
632,2017/03/28,486.0,483.459,485.0,36200,486.0,480.0
633,2017/03/29,478.0,479.095,486.0,12700,486.0,473.0
634,2017/03/30,471.0,473.701,478.0,7700,478.0,470.0
635,2017/03/31,456.0,462.708,472.0,34600,475.0,455.0
636,2017/04/03,461.0,461.06,464.0,21700,465.0,458.0
637,2017/04/04,452.0,452.28,463.0,25700,463.0,447.0
638,2017/04/05,442.0,445.304,456.0,15800,456.0,441.0
639,2017/04/06,422.0,432.084,447.0,36800,447.0,422.0
640,2017/04/07,430.0,429.248,429.0,21000,443.0,420.0
641,2017/04/10,433.0,432.993,431.0,13700,435.0,430.0
642,2017/04/11,430.0,430.952,431.0,20800,437.0,429.0
643,2017/04/12,424.0,423.934,430.0,24300,430.0,420.0
644,2017/04/13,420.0,421.915,420.0,23400,430.0,418.0
645,2017/04/14,419.0,418.593,417.0,17200,423.0,415.0
646,2017/04/17,421.0,419.642,422.0,10600,423.0,416.0
647,2017/04/18,423.0,423.207,421.0,11100,427.0,421.0
648,2017/04/19,428.0,427.248,424.0,13300,429.0,424.0
649,2017/04/20,430.0,431.711,433.0,16600,436.0,429.0
650,2017/04/21,435.0,434.16,432.0,19400,436.0,432.0
651,2017/04/24,434.0,436.701,443.0,15400,443.0,433.0
652,2017/04/25,442.0,442.014,435.0,14400,443.0,435.0
653,2017/04/26,451.0,451.224,451.0,21000,456.0,449.0
654,2017/04/27,452.0,451.151,451.0,16600,454.0,442.0
655,2017/04/28,449.0,449.29,453.0,10000,455.0,446.0
656,2017/05/01,453.0,451.431,450.0,5100,453.0,450.0
657,2017/05/02,458.0,458.386,458.0,17900,460.0,456.0
658,2017/05/08,469.0,463.726,458.0,37900,470.0,458.0
659,2017/05/09,463.0,467.433,471.0,18000,474.0,461.0
660,2017/05/10,468.0,468.323,466.0,18900,471.0,466.0
661,2017/05/11,468.0,466.95,468.0,12000,468.0,465.0
662,2017/05/12,461.0,463.286,469.0,15400,469.0,459.0
663,2017/05/15,468.0,470.334,470.0,35600,473.0,465.0
664,2017/05/16,470.0,468.789,466.0,20400,471.0,466.0
665,2017/05/17,462.0,462.841,465.0,21400,466.0,460.0
666,2017/05/18,453.0,457.529,454.0,49000,468.0,451.0
667,2017/05/19,459.0,456.855,453.0,31000,464.0,453.0
668,2017/05/22,454.0,454.432,455.0,27100,457.0,451.0
669,2017/05/23,457.0,454.575,453.0,39300,458.0,452.0
670,2017/05/24,453.0,454.978,454.0,53900,464.0,451.0
671,2017/05/25,454.0,453.122,452.0,30400,456.0,449.0
672,2017/05/26,447.0,450.582,454.0,25100,455.0,447.0
673,2017/05/29,447.0,444.628,443.0,25800,447.0,443.0
674,2017/05/30,444.0,442.108,441.0,30600,444.0,441.0
675,2017/05/31,440.0,441.258,445.0,25600,445.0,440.0
676,2017/06/01,442.0,443.903,444.0,17600,449.0,440.0
677,2017/06/02,448.0,447.939,443.0,19500,452.0,443.0
678,2017/06/05,444.0,445.197,448.0,18800,448.0,442.0
679,2017/06/06,444.0,447.632,449.0,20100,451.0,443.0
680,2017/06/07,443.0,442.536,444.0,20700,448.0,441.0
681,2017/06/08,441.0,443.207,443.0,9200,447.0,441.0
682,2017/06/09,444.0,445.412,445.0,22600,448.0,444.0
683,2017/06/12,442.0,442.184,444.0,15800,446.0,440.0
684,2017/06/13,442.0,443.409,441.0,15900,447.0,441.0
685,2017/06/14,441.0,442.897,444.0,12600,448.0,441.0
686,2017/06/15,436.0,438.329,441.0,23100,443.0,434.0
687,2017/06/16,438.0,439.508,441.0,18900,443.0,436.0
688,2017/06/19,439.0,443.39,444.0,33100,448.0,438.0
689,2017/06/20,450.0,447.089,445.0,22600,450.0,443.0
690,2017/06/21,443.0,444.482,446.0,19700,447.0,442.0
691,2017/06/22,442.0,442.93,445.0,12900,446.0,441.0
692,2017/06/23,445.0,444.46,443.0,7400,445.0,443.0
693,2017/06/26,444.0,445.598,446.0,12200,449.0,444.0
694,2017/06/27,446.0,446.273,448.0,12800,448.0,444.0
695,2017/06/28,444.0,445.566,445.0,5300,448.0,444.0
696,2017/06/29,443.0,445.286,445.0,14700,450.0,443.0
697,2017/06/30,443.0,444.246,444.0,13800,449.0,442.0
698,2017/07/03,441.0,443.414,450.0,36700,450.0,437.0
699,2017/07/04,441.0,442.771,445.0,15300,448.0,440.0
700,2017/07/05,440.0,441.754,441.0,24400,444.0,440.0
701,2017/07/06,442.0,442.855,444.0,11000,444.0,441.0
702,2017/07/07,440.0,440.926,440.0,18800,445.0,440.0
703,2017/07/10,445.0,445.276,446.0,12300,447.0,444.0
704,2017/07/11,451.0,450.935,447.0,23200,454.0,447.0
705,2017/07/12,450.0,451.605,453.0,22300,453.0,450.0
706,2017/07/13,450.0,450.882,451.0,3400,452.0,450.0
707,2017/07/14,451.0,451.123,451.0,6500,452.0,451.0
708,2017/07/18,448.0,451.77,452.0,22200,456.0,446.0
709,2017/07/19,449.0,449.034,447.0,11900,452.0,447.0
710,2017/07/20,453.0,454.448,457.0,20100,457.0,450.0
711,2017/07/21,456.0,455.226,455.0,9300,456.0,454.0
712,2017/07/24,459.0,457.516,455.0,54900,460.0,453.0
713,2017/07/25,462.0,464.361,467.0,41000,468.0,459.0
714,2017/07/26,461.0,460.729,463.0,24000,463.0,458.0
715,2017/07/27,461.0,461.119,459.0,21000,465.0,459.0
716,2017/07/28,462.0,460.87,462.0,21600,463.0,459.0
717,2017/07/31,459.0,461.104,461.0,18300,463.0,459.0
718,2017/08/01,460.0,460.442,460.0,46600,467.0,456.0
719,2017/08/02,463.0,462.927,462.0,28700,467.0,459.0
720,2017/08/03,463.0,462.3,463.0,19000,468.0,460.0
721,2017/08/04,468.0,466.635,463.0,37800,471.0,463.0
722,2017/08/07,472.0,470.941,466.0,30300,476.0,466.0
723,2017/08/08,473.0,472.552,474.0,15400,474.0,471.0
724,2017/08/09,463.0,464.0,473.0,47300,473.0,458.0
725,2017/08/10,461.0,464.061,463.0,32700,467.0,460.0
726,2017/08/14,454.0,455.652,458.0,20100,458.0,452.0
727,2017/08/15,457.0,458.754,462.0,19500,464.0,453.0
728,2017/08/16,458.0,459.767,458.0,16300,463.0,458.0
729,2017/08/17,462.0,458.327,460.0,26000,462.0,452.0
730,2017/08/18,455.0,456.944,460.0,14300,460.0,454.0
731,2017/08/21,458.0,457.977,456.0,13100,460.0,456.0
732,2017/08/22,461.0,461.881,461.0,8400,463.0,460.0
733,2017/08/23,459.0,461.315,465.0,27000,465.0,459.0
734,2017/08/24,457.0,457.315,458.0,11100,460.0,456.0
735,2017/08/25,460.0,459.323,457.0,9600,461.0,457.0
736,2017/08/28,462.0,459.992,460.0,11900,462.0,459.0
737,2017/08/29,463.0,461.705,462.0,12200,463.0,460.0
738,2017/08/30,465.0,465.007,464.0,27000,467.0,463.0
739,2017/08/31,471.0,469.602,468.0,23100,477.0,467.0
740,2017/09/01,472.0,470.961,468.0,22800,474.0,468.0
741,2017/09/04,469.0,469.849,472.0,29800,474.0,465.0
742,2017/09/05,469.0,472.239,477.0,48600,477.0,468.0
743,2017/09/06,468.0,467.782,467.0,10100,471.0,465.0
744,2017/09/07,474.0,474.399,470.0,35100,478.0,470.0
745,2017/09/08,473.0,469.517,471.0,38500,473.0,461.0
746,2017/09/11,477.0,478.112,479.0,33100,483.0,473.0
747,2017/09/12,480.0,481.903,485.0,37100,485.0,478.0
748,2017/09/13,485.0,483.229,485.0,16600,485.0,481.0
749,2017/09/14,485.0,485.183,483.0,22400,488.0,480.0
750,2017/09/15,488.0,487.712,485.0,28800,490.0,484.0
751,2017/09/19,495.0,495.286,497.0,30800,497.0,493.0
752,2017/09/20,499.0,497.697,497.0,41600,500.0,494.0
753,2017/09/21,497.0,498.803,496.0,53900,502.0,495.0
754,2017/09/22,498.0,496.921,497.0,21600,499.0,494.0
755,2017/09/25,502.0,500.202,499.0,33700,502.0,498.0
756,2017/09/26,501.0,500.741,501.0,49100,502.0,498.0
757,2017/09/27,502.0,500.862,495.0,30500,505.0,493.0
758,2017/09/28,502.0,502.508,505.0,19100,505.0,501.0
759,2017/09/29,496.0,498.23,498.0,44800,502.0,490.0
760,2017/10/02,501.0,500.352,502.0,23600,502.0,497.0
761,2017/10/03,499.0,499.769,500.0,23800,501.0,497.0
762,2017/10/04,497.0,497.681,498.0,63600,502.0,495.0
763,2017/10/05,497.0,496.917,498.0,15700,500.0,495.0
764,2017/10/06,497.0,496.71,496.0,20000,499.0,495.0
765,2017/10/10,501.0,499.842,500.0,26500,501.0,498.0
766,2017/10/11,503.0,502.05,502.0,24100,503.0,501.0
767,2017/10/12,512.0,506.961,500.0,76300,514.0,500.0
768,2017/10/13,512.0,511.012,513.0,57100,513.0,505.0
769,2017/10/16,519.0,517.143,512.0,49700,520.0,512.0
770,2017/10/17,515.0,513.833,515.0,19100,516.0,510.0
771,2017/10/18,511.0,511.43,515.0,32100,516.0,506.0
772,2017/10/19,508.0,508.183,512.0,32300,512.0,506.0
773,2017/10/20,520.0,516.157,521.0,190000,522.0,507.0
774,2017/10/23,526.0,525.021,527.0,53000,527.0,522.0
775,2017/10/24,533.0,529.057,526.0,74400,533.0,523.0
776,2017/10/25,522.0,525.355,532.0,45100,533.0,520.0
777,2017/10/26,530.0,526.925,520.0,45500,533.0,520.0
778,2017/10/27,544.0,542.016,540.0,83000,548.0,537.0
779,2017/10/30,549.0,548.936,550.0,67500,553.0,546.0
780,2017/10/31,535.0,533.241,531.0,79300,539.0,531.0
781,2017/11/01,547.0,542.178,534.0,85800,551.0,533.0
782,2017/11/02,539.0,538.136,550.0,64200,550.0,518.0
783,2017/11/06,538.0,540.549,541.0,49200,544.0,537.0
784,2017/11/07,543.0,541.536,539.0,29500,545.0,538.0
785,2017/11/08,540.0,538.71,538.0,22100,541.0,536.0
786,2017/11/09,540.0,543.267,540.0,66700,549.0,535.0
787,2017/11/10,529.0,531.586,535.0,34300,539.0,528.0
788,2017/11/13,528.0,526.665,526.0,26300,531.0,521.0
789,2017/11/14,522.0,524.79,528.0,28100,529.0,522.0
790,2017/11/15,508.0,514.123,520.0,55300,522.0,506.0
791,2017/11/16,512.0,509.987,506.0,45300,516.0,505.0
792,2017/11/17,512.0,514.945,518.0,30700,522.0,511.0
793,2017/11/20,515.0,514.153,513.0,24800,517.0,511.0
794,2017/11/21,517.0,518.671,518.0,23400,521.0,516.0
795,2017/11/22,526.0,524.899,519.0,16900,528.0,519.0
796,2017/11/24,529.0,526.837,521.0,17800,530.0,521.0
797,2017/11/27,534.0,531.158,526.0,27800,534.0,526.0
798,2017/11/28,529.0,532.856,538.0,32600,541.0,528.0
799,2017/11/29,531.0,532.411,536.0,32600,536.0,525.0
800,2017/11/30,529.0,529.105,526.0,35300,533.0,526.0
801,2017/12/01,532.0,530.403,530.0,19600,532.0,529.0
802,2017/12/04,527.0,530.163,533.0,48000,536.0,526.0
803,2017/12/05,525.0,524.826,526.0,27600,528.0,520.0
804,2017/12/06,518.0,521.504,522.0,33900,525.0,517.0
805,2017/12/07,523.0,522.323,521.0,19500,524.0,520.0
806,2017/12/08,518.0,515.959,513.0,70700,520.0,513.0
807,2017/12/11,522.0,520.72,519.0,36800,523.0,519.0
808,2017/12/12,520.0,520.823,521.0,31600,523.0,518.0
809,2017/12/13,518.0,519.441,522.0,27900,522.0,518.0
810,2017/12/14,522.0,521.474,519.0,28700,524.0,519.0
811,2017/12/15,521.0,519.772,523.0,26300,524.0,517.0
812,2017/12/18,524.0,525.332,525.0,40400,528.0,521.0
813,2017/12/19,525.0,525.097,526.0,21700,527.0,524.0
814,2017/12/20,527.0,525.817,525.0,39900,531.0,523.0
815,2017/12/21,529.0,529.867,528.0,56500,533.0,527.0
816,2017/12/22,532.0,532.694,533.0,41500,536.0,529.0
817,2017/12/25,537.0,535.809,537.0,16200,538.0,534.0
818,2017/12/26,533.0,533.375,537.0,25600,537.0,530.0
819,2017/12/27,543.0,540.422,539.0,28700,543.0,536.0
820,2017/12/28,539.0,544.678,548.0,24200,548.0,539.0
821,2017/12/29,544.0,542.667,545.0,42300,546.0,540.0
822,2018/01/04,556.0,553.134,546.0,58400,559.0,545.0
823,2018/01/05,565.0,561.787,560.0,49800,565.0,560.0
824,2018/01/09,579.0,577.418,571.0,64800,588.0,571.0
825,2018/01/10,577.0,579.267,577.0,34400,585.0,577.0
826,2018/01/11,579.0,577.58,575.0,36700,580.0,572.0
827,2018/01/12,579.0,579.44,579.0,29800,583.0,578.0
828,2018/01/15,589.0,586.173,580.0,50900,595.0,579.0
829,2018/01/16,590.0,590.836,594.0,39100,596.0,585.0
830,2018/01/17,583.0,584.424,587.0,28100,587.0,583.0
831,2018/01/18,579.0,579.843,584.0,29900,586.0,575.0
832,2018/01/19,579.0,578.91,579.0,18800,581.0,576.0
833,2018/01/22,581.0,580.191,580.0,37200,583.0,577.0
834,2018/01/23,587.0,586.872,583.0,29000,590.0,583.0
835,2018/01/24,582.0,584.206,584.0,52400,589.0,580.0
836,2018/01/25,580.0,580.189,582.0,20600,582.0,578.0
837,2018/01/26,574.0,577.539,580.0,29500,583.0,574.0
838,2018/01/29,579.0,579.968,578.0,31500,584.0,577.0
839,2018/01/30,605.0,607.088,605.0,233100,620.0,590.0
840,2018/01/31,593.0,599.291,605.0,99300,608.0,591.0
841,2018/02/01,621.0,616.222,598.0,91600,624.0,598.0
842,2018/02/02,619.0,619.623,623.0,36300,623.0,615.0
843,2018/02/05,596.0,599.333,600.0,89200,606.0,596.0
844,2018/02/06,563.0,565.013,569.0,112000,577.0,556.0
845,2018/02/07,590.0,592.695,592.0,100500,598.0,588.0
846,2018/02/08,589.0,590.52,591.0,24800,595.0,586.0
847,2018/02/09,571.0,570.645,569.0,50100,576.0,566.0
848,2018/02/13,570.0,573.797,580.0,28500,580.0,569.0
849,2018/02/14,557.0,564.476,570.0,42200,575.0,556.0
850,2018/02/15,563.0,563.806,561.0,24700,570.0,558.0
851,2018/02/16,565.0,564.663,572.0,51100,573.0,558.0
852,2018/02/19,580.0,576.156,568.0,25000,580.0,568.0
853,2018/02/20,594.0,588.091,584.0,26500,594.0,580.0
854,2018/02/21,599.0,598.526,597.0,30600,602.0,594.0
855,2018/02/22,593.0,595.043,599.0,18700,600.0,590.0
856,2018/02/23,602.0,598.86,592.0,20700,604.0,592.0
857,2018/02/26,603.0,604.412,606.0,10200,606.0,601.0
858,2018/02/27,616.0,615.349,615.0,46400,618.0,611.0
859,2018/02/28,610.0,611.926,615.0,29800,615.0,610.0
860,2018/03/01,600.0,602.896,611.0,35700,611.0,598.0
861,2018/03/02,587.0,588.442,590.0,34400,592.0,584.0
862,2018/03/05,568.0,571.97,585.0,30200,586.0,565.0
863,2018/03/06,581.0,582.95,580.0,16100,588.0,578.0
864,2018/03/07,573.0,575.562,581.0,14600,583.0,571.0
865,2018/03/08,572.0,571.783,578.0,13800,578.0,568.0
866,2018/03/09,570.0,575.062,579.0,24200,579.0,566.0
867,2018/03/12,580.0,577.57,574.0,12100,581.0,571.0
868,2018/03/13,585.0,582.317,580.0,18300,589.0,576.0
869,2018/03/14,585.0,584.373,584.0,11000,587.0,581.0
870,2018/03/15,580.0,581.697,586.0,17800,589.0,578.0
871,2018/03/16,598.0,593.665,584.0,39100,599.0,584.0
872,2018/03/19,591.0,592.051,601.0,25300,601.0,583.0
873,2018/03/20,591.0,589.862,592.0,23200,592.0,586.0
874,2018/03/22,600.0,596.006,590.0,17500,601.0,588.0
875,2018/03/23,573.0,577.686,588.0,44600,591.0,569.0
876,2018/03/26,575.0,569.459,567.0,24200,582.0,559.0
877,2018/03/27,589.0,586.697,577.0,46200,600.0,577.0
878,2018/03/28,576.0,571.536,570.0,16600,579.0,557.0
879,2018/03/29,574.0,573.087,582.0,18300,582.0,568.0
880,2018/03/30,564.0,567.536,575.0,29100,575.0,564.0
881,2018/04/02,564.0,565.405,564.0,33300,573.0,561.0
882,2018/04/03,550.0,551.435,556.0,38600,557.0,544.0
883,2018/04/04,561.0,559.256,555.0,27400,563.0,553.0
884,2018/04/05,560.0,559.247,563.0,25900,563.0,554.0
885,2018/04/06,551.0,556.016,564.0,18600,564.0,551.0
886,2018/04/09,546.0,544.234,545.0,17500,549.0,540.0
887,2018/04/10,553.0,549.568,548.0,15500,554.0,543.0
888,2018/04/11,551.0,551.128,555.0,16400,555.0,549.0
889,2018/04/12,554.0,553.088,552.0,12500,555.0,551.0
890,2018/04/13,556.0,554.604,554.0,16400,558.0,551.0
891,2018/04/16,554.0,553.556,559.0,19600,559.0,549.0
892,2018/04/17,551.0,550.347,551.0,22200,553.0,546.0
893,2018/04/18,553.0,552.674,554.0,9800,555.0,551.0
894,2018/04/19,560.0,556.273,553.0,24200,561.0,553.0
895,2018/04/20,555.0,558.69,562.0,23900,562.0,552.0
896,2018/04/23,556.0,557.0,555.0,6900,560.0,555.0
897,2018/04/24,560.0,558.277,557.0,10100,561.0,555.0
898,2018/04/25,559.0,557.405,555.0,16800,562.0,553.0
899,2018/04/26,566.0,561.245,559.0,19600,566.0,555.0
900,2018/04/27,560.0,559.329,561.0,23700,564.0,555.0
901,2018/05/01,555.0,557.393,560.0,8400,560.0,555.0
902,2018/05/02,559.0,556.986,555.0,6900,559.0,555.0
903,2018/05/07,556.0,556.77,559.0,10000,559.0,556.0
904,2018/05/08,563.0,560.744,555.0,20700,563.0,555.0
905,2018/05/09,563.0,562.579,563.0,12600,564.0,561.0
906,2018/05/10,563.0,561.882,563.0,13500,564.0,560.0
907,2018/05/11,564.0,563.062,563.0,21100,567.0,560.0
908,2018/05/14,618.0,610.958,600.0,207800,622.0,600.0
909,2018/05/15,611.0,616.53,618.0,63200,623.0,610.0
910,2018/05/16,613.0,608.63,601.0,52100,619.0,600.0
911,2018/05/17,628.0,621.979,615.0,57400,628.0,612.0
912,2018/05/18,634.0,636.374,630.0,71700,643.0,628.0
913,2018/05/21,635.0,636.771,634.0,24900,641.0,633.0
914,2018/05/22,639.0,637.349,640.0,48400,645.0,628.0
915,2018/05/23,629.0,631.522,631.0,20900,638.0,629.0
916,2018/05/24,623.0,624.187,629.0,17100,630.0,621.0
917,2018/05/25,618.0,623.504,620.0,26600,630.0,618.0
918,2018/05/28,620.0,618.037,618.0,19100,623.0,610.0
919,2018/05/29,611.0,606.6,620.0,41000,623.0,600.0
920,2018/05/30,600.0,600.889,601.0,10800,605.0,598.0
921,2018/05/31,605.0,606.72,605.0,20000,612.0,605.0
922,2018/06/01,602.0,601.484,600.0,28300,608.0,596.0
923,2018/06/04,614.0,611.127,602.0,14200,615.0,602.0
924,2018/06/05,615.0,613.675,615.0,12600,618.0,608.0
925,2018/06/06,611.0,609.651,612.0,14600,614.0,604.0
926,2018/06/07,623.0,619.093,617.0,27900,625.0,612.0
927,2018/06/08,622.0,622.99,624.0,31100,624.0,620.0
928,2018/06/11,622.0,623.306,623.0,16000,626.0,621.0
929,2018/06/12,619.0,619.046,620.0,13000,622.0,616.0
930,2018/06/13,619.0,617.343,621.0,14000,621.0,614.0
931,2018/06/14,612.0,611.957,615.0,11700,615.0,610.0
932,2018/06/15,621.0,617.341,612.0,27000,621.0,612.0
933,2018/06/18,619.0,617.037,617.0,21900,621.0,613.0
934,2018/06/19,622.0,622.613,619.0,30000,627.0,618.0
935,2018/06/20,634.0,629.262,631.0,32400,635.0,618.0
936,2018/06/21,631.0,631.912,635.0,22600,636.0,625.0
937,2018/06/22,627.0,624.014,624.0,21000,628.0,618.0
938,2018/06/25,619.0,625.92,630.0,17400,632.0,618.0
939,2018/06/26,613.0,608.419,606.0,21500,615.0,600.0
940,2018/06/27,633.0,628.491,616.0,50700,641.0,614.0
941,2018/06/28,621.0,619.664,631.0,24400,631.0,613.0
942,2018/06/29,616.0,615.057,621.0,19400,621.0,606.0
943,2018/07/02,600.0,607.734,614.0,27400,626.0,600.0
944,2018/07/03,583.0,590.477,601.0,43000,606.0,583.0
945,2018/07/04,586.0,587.997,584.0,32600,593.0,584.0
946,2018/07/05,575.0,578.099,589.0,29300,589.0,570.0
947,2018/07/06,597.0,591.621,580.0,35100,597.0,580.0
948,2018/07/09,609.0,600.878,597.0,24500,609.0,587.0
949,2018/07/10,605.0,609.688,610.0,18600,620.0,605.0
950,2018/07/11,597.0,598.11,607.0,13600,608.0,590.0
951,2018/07/12,604.0,606.724,607.0,16300,612.0,604.0
952,2018/07/13,607.0,609.159,611.0,11300,615.0,606.0
953,2018/07/17,612.0,612.028,610.0,14100,615.0,607.0
954,2018/07/18,613.0,611.813,612.0,19200,615.0,608.0
955,2018/07/19,620.0,624.825,617.0,41700,637.0,617.0
956,2018/07/20,620.0,623.62,629.0,21600,629.0,616.0
957,2018/07/23,618.0,617.648,618.0,12200,620.0,615.0
958,2018/07/24,622.0,623.416,618.0,16600,631.0,613.0
959,2018/07/25,633.0,630.751,631.0,17300,634.0,625.0
960,2018/07/26,633.0,634.162,633.0,29600,637.0,629.0
961,2018/07/27,650.0,645.287,633.0,58600,654.0,632.0
962,2018/07/30,672.0,669.517,660.0,127400,680.0,656.0
963,2018/07/31,710.0,703.991,692.0,533200,729.0,681.0
964,2018/08/01,706.0,708.441,715.0,148200,721.0,696.0
965,2018/08/02,701.0,707.405,702.0,56100,718.0,701.0
966,2018/08/03,689.0,692.415,702.0,88200,708.0,684.0
967,2018/08/06,694.0,698.812,691.0,52000,707.0,691.0
968,2018/08/07,701.0,694.223,690.0,45800,702.0,688.0
969,2018/08/08,713.0,716.829,704.0,96400,725.0,704.0
970,2018/08/09,726.0,719.3,714.0,68700,728.0,705.0
971,2018/08/10,713.0,715.606,726.0,86900,726.0,704.0
972,2018/08/13,695.0,700.028,710.0,53100,711.0,693.0
973,2018/08/14,722.0,714.422,696.0,74400,727.0,696.0
974,2018/08/15,741.0,740.938,723.0,148800,750.0,723.0
975,2018/08/16,725.0,727.604,741.0,80800,742.0,716.0
976,2018/08/17,770.0,760.145,724.0,171300,776.0,724.0
977,2018/08/20,763.0,771.229,780.0,184800,786.0,759.0
978,2018/08/21,762.0,761.596,751.0,144300,780.0,736.0
979,2018/08/22,779.0,778.056,770.0,96500,788.0,763.0
980,2018/08/23,786.0,785.318,782.0,71600,788.0,782.0
981,2018/08/24,769.0,774.24,787.0,97700,792.0,768.0
982,2018/08/27,795.0,787.512,765.0,111700,799.0,761.0
983,2018/08/28,789.0,794.423,800.0,107400,807.0,777.0
984,2018/08/29,789.0,792.194,785.0,55600,798.0,783.0
985,2018/08/30,797.0,802.919,798.0,104000,814.0,795.0
986,2018/08/31,805.0,801.254,789.0,54300,813.0,785.0
987,2018/09/03,789.0,792.329,806.0,72000,808.0,783.0
988,2018/09/04,775.0,779.158,798.0,80600,798.0,766.0
989,2018/09/05,755.0,758.699,772.0,122900,772.0,751.0
990,2018/09/06,752.0,756.8,755.0,65600,767.0,752.0
991,2018/09/07,712.0,708.388,746.0,322700,746.0,688.0
992,2018/09/10,729.0,723.3,712.0,82700,732.0,706.0
993,2018/09/11,717.0,715.869,725.0,92100,728.0,707.0
994,2018/09/12,702.0,704.532,716.0,110300,719.0,698.0
995,2018/09/13,711.0,714.349,698.0,60700,729.0,698.0
996,2018/09/14,728.0,720.61,719.0,84100,729.0,708.0
997,2018/09/18,746.0,740.081,729.0,71500,754.0,726.0
998,2018/09/19,763.0,763.577,758.0,95100,774.0,752.0
999,2018/09/20,775.0,771.398,770.0,70900,781.0,754.0
1000,2018/09/21,802.0,793.046,782.0,140500,805.0,777.0
1001,2018/09/25,796.0,789.781,801.0,91000,801.0,777.0
1002,2018/09/26,810.0,799.968,797.0,49300,810.0,785.0
1003,2018/09/27,811.0,815.621,813.0,96500,824.0,804.0
1004,2018/09/28,819.0,819.14,820.0,64800,824.0,813.0
1005,2018/10/01,811.0,810.859,820.0,61800,820.0,801.0
1006,2018/10/02,816.0,826.284,819.0,82000,844.0,812.0
1007,2018/10/03,775.0,780.55,809.0,198800,818.0,762.0
1008,2018/10/04,774.0,782.936,790.0,117600,797.0,774.0
1009,2018/10/05,777.0,775.918,774.0,57400,784.0,762.0
1010,2018/10/09,788.0,782.143,778.0,69400,793.0,769.0
1011,2018/10/10,779.0,782.058,791.0,82600,806.0,766.0
1012,2018/10/11,731.0,733.021,736.0,154600,746.0,721.0
1013,2018/10/12,729.0,725.832,722.0,94300,735.0,712.0
1014,2018/10/15,722.0,728.247,736.0,67300,744.0,716.0
1015,2018/10/16,742.0,736.965,724.0,73300,746.0,723.0
1016,2018/10/17,782.0,773.789,762.0,119400,785.0,761.0
1017,2018/10/18,772.0,773.37,785.0,87000,789.0,769.0
1018,2018/10/19,774.0,763.548,757.0,106600,778.0,746.0
1019,2018/10/22,782.0,771.245,775.0,81700,785.0,750.0
1020,2018/10/23,757.0,762.883,767.0,88700,773.0,754.0
1021,2018/10/24,751.0,749.784,766.0,101200,769.0,734.0
1022,2018/10/25,705.0,715.83,717.0,156100,730.0,704.0
1023,2018/10/26,599.0,603.668,600.0,636500,625.0,582.0
1024,2018/10/29,618.0,613.903,619.0,206500,627.0,600.0
1025,2018/10/30,635.0,625.075,609.0,169600,640.0,600.0
1026,2018/10/31,621.0,626.613,649.0,160800,655.0,615.0
1027,2018/11/01,607.0,608.476,620.0,121100,620.0,599.0
1028,2018/11/02,628.0,620.036,607.0,97800,628.0,607.0
1029,2018/11/05,630.0,629.683,620.0,65900,639.0,611.0
1030,2018/11/06,629.0,626.984,633.0,63800,635.0,619.0
1031,2018/11/07,619.0,623.337,626.0,62000,636.0,614.0
1032,2018/11/08,624.0,625.503,620.0,80700,634.0,618.0
1033,2018/11/09,616.0,619.851,623.0,38200,628.0,615.0
1034,2018/11/12,618.0,619.338,616.0,56500,629.0,613.0
1035,2018/11/13,607.0,606.439,608.0,80200,616.0,596.0
1036,2018/11/14,605.0,608.647,608.0,56700,619.0,604.0
1037,2018/11/15,596.0,598.729,601.0,54300,607.0,592.0
1038,2018/11/16,578.0,585.502,597.0,91300,601.0,575.0
1039,2018/11/19,588.0,584.749,574.0,88900,594.0,565.0
1040,2018/11/20,587.0,583.912,579.0,36200,592.0,578.0
1041,2018/11/21,580.0,575.265,572.0,68000,583.0,567.0
1042,2018/11/22,575.0,574.412,576.0,32800,583.0,568.0
1043,2018/11/26,589.0,587.319,575.0,33900,595.0,573.0
1044,2018/11/27,594.0,593.169,599.0,37900,604.0,585.0
1045,2018/11/28,599.0,594.867,591.0,26300,600.0,589.0
1046,2018/11/29,596.0,599.146,605.0,37100,606.0,595.0
1047,2018/11/30,595.0,595.515,601.0,22900,601.0,591.0
1048,2018/12/03,606.0,603.444,600.0,31100,609.0,598.0
1049,2018/12/04,591.0,596.375,607.0,42400,608.0,589.0
1050,2018/12/05,579.0,581.289,582.0,33200,589.0,576.0
1051,2018/12/06,567.0,568.094,578.0,51100,579.0,561.0
1052,2018/12/07,557.0,559.085,567.0,55600,571.0,553.0
1053,2018/12/10,541.0,542.172,555.0,59800,555.0,535.0
1054,2018/12/11,521.0,527.321,541.0,51700,541.0,520.0
1055,2018/12/12,529.0,526.505,521.0,44600,533.0,520.0
1056,2018/12/13,546.0,538.884,531.0,64400,549.0,530.0
1057,2018/12/14,524.0,536.551,545.0,39000,546.0,524.0
1058,2018/12/17,522.0,521.415,522.0,43100,527.0,516.0
1059,2018/12/18,512.0,512.135,513.0,63500,519.0,505.0
1060,2018/12/19,514.0,514.689,518.0,44000,522.0,510.0
1061,2018/12/20,497.0,499.07,511.0,83300,511.0,491.0
1062,2018/12/21,476.0,481.424,491.0,87500,495.0,473.0
1063,2018/12/25,446.0,451.622,450.0,79300,463.0,443.0
1064,2018/12/26,461.0,460.454,447.0,63400,470.0,447.0
1065,2018/12/27,500.0,491.087,479.0,45800,501.0,479.0
1066,2018/12/28,494.0,498.963,499.0,24400,505.0,491.0
1067,2019/01/04,488.0,483.235,484.0,32800,489.0,472.0
1068,2019/01/07,516.0,511.983,498.0,40000,518.0,498.0
1069,2019/01/08,522.0,521.249,520.0,31300,527.0,518.0
1070,2019/01/09,521.0,523.263,525.0,30000,528.0,518.0
1071,2019/01/10,503.0,505.876,520.0,28300,520.0,501.0
1072,2019/01/11,506.0,505.984,504.0,19200,508.0,503.0
1073,2019/01/15,517.0,511.668,506.0,37900,518.0,503.0
1074,2019/01/16,515.0,512.889,519.0,47800,519.0,509.0
1075,2019/01/17,519.0,515.951,515.0,32300,519.0,512.0
1076,2019/01/18,522.0,527.442,525.0,54300,536.0,520.0
1077,2019/01/21,516.0,519.116,526.0,42400,526.0,516.0
1078,2019/01/22,517.0,512.9,519.0,46800,519.0,504.0
1079,2019/01/23,522.0,520.071,512.0,29600,526.0,510.0
1080,2019/01/24,522.0,522.111,518.0,20800,528.0,517.0
1081,2019/01/25,548.0,540.135,530.0,78300,549.0,527.0
1082,2019/01/28,571.0,563.362,558.0,120200,572.0,552.0
1083,2019/01/29,537.0,531.443,531.0,195900,541.0,520.0
1084,2019/01/30,525.0,530.662,540.0,80200,540.0,525.0
1085,2019/01/31,523.0,525.029,530.0,68300,531.0,522.0
1086,2019/02/01,517.0,519.117,524.0,48700,525.0,515.0
1087,2019/02/04,526.0,523.194,519.0,39100,527.0,515.0
1088,2019/02/05,524.0,523.511,526.0,22700,528.0,521.0
1089,2019/02/06,527.0,526.035,525.0,39500,531.0,523.0
1090,2019/02/07,533.0,529.269,527.0,70200,537.0,521.0
1091,2019/02/08,524.0,525.919,526.0,39400,535.0,521.0
1092,2019/02/12,529.0,528.598,525.0,55500,536.0,524.0
1093,2019/02/13,533.0,527.401,529.0,42900,533.0,521.0
1094,2019/02/14,530.0,531.308,530.0,29900,536.0,529.0
1095,2019/02/15,530.0,528.594,530.0,31500,531.0,524.0
1096,2019/02/18,542.0,539.551,535.0,31600,543.0,535.0
1097,2019/02/19,547.0,548.264,544.0,46900,552.0,542.0
1098,2019/02/20,546.0,545.007,547.0,56200,552.0,535.0
1099,2019/02/21,549.0,547.986,546.0,36700,553.0,544.0
1100,2019/02/22,547.0,545.311,545.0,30900,551.0,542.0
1101,2019/02/25,550.0,549.914,549.0,19800,553.0,547.0
1102,2019/02/26,551.0,553.534,557.0,41200,558.0,549.0
1103,2019/02/27,550.0,550.22,550.0,39500,555.0,547.0
1104,2019/02/28,549.0,548.766,550.0,35900,551.0,544.0
1105,2019/03/01,550.0,551.56,547.0,31800,559.0,545.0
1106,2019/03/04,554.0,553.64,551.0,33300,558.0,548.0
1107,2019/03/05,549.0,547.398,551.0,24900,551.0,545.0
1108,2019/03/06,540.0,543.267,551.0,30700,551.0,540.0
1109,2019/03/07,533.0,533.74,540.0,52200,541.0,526.0
1110,2019/03/08,521.0,520.456,525.0,62300,525.0,514.0
1111,2019/03/11,518.0,517.029,522.0,27700,522.0,513.0
1112,2019/03/12,531.0,528.189,523.0,30100,533.0,521.0
1113,2019/03/13,527.0,529.241,528.0,36500,537.0,524.0
1114,2019/03/14,528.0,527.71,529.0,33400,533.0,524.0
1115,2019/03/15,517.0,522.603,528.0,134400,536.0,517.0
1116,2019/03/18,520.0,516.052,520.0,46100,520.0,512.0
1117,2019/03/19,512.0,514.797,520.0,39800,520.0,512.0
1118,2019/03/20,518.0,516.269,515.0,23800,519.0,513.0
1119,2019/03/22,520.0,519.052,522.0,48500,522.0,515.0
1120,2019/03/25,512.0,511.664,512.0,36000,518.0,507.0
1121,2019/03/26,522.0,522.656,521.0,103700,534.0,518.0
1122,2019/03/27,519.0,514.802,515.0,34800,519.0,508.0
1123,2019/03/28,505.0,505.795,510.0,28300,511.0,503.0
1124,2019/03/29,506.0,506.863,507.0,13900,509.0,506.0
1125,2019/04/01,516.0,518.379,513.0,31700,523.0,512.0
1126,2019/04/02,522.0,520.263,521.0,19000,522.0,516.0
1127,2019/04/03,522.0,520.509,521.0,37100,524.0,516.0
1128,2019/04/04,520.0,520.739,524.0,19500,524.0,518.0
1129,2019/04/05,522.0,521.114,525.0,17500,525.0,518.0
1130,2019/04/08,520.0,520.623,523.0,18300,525.0,517.0
1131,2019/04/09,519.0,517.645,522.0,12400,522.0,514.0
1132,2019/04/10,518.0,516.0,518.0,7200,518.0,513.0
1133,2019/04/11,518.0,516.312,519.0,6100,519.0,513.0
1134,2019/04/12,518.0,518.241,519.0,14500,520.0,516.0
1135,2019/04/15,525.0,522.851,521.0,26200,525.0,520.0
1136,2019/04/16,520.0,522.291,524.0,17500,527.0,518.0
1137,2019/04/17,522.0,520.121,520.0,17300,522.0,517.0
1138,2019/04/18,516.0,517.086,519.0,13900,521.0,515.0
1139,2019/04/19,514.0,516.429,519.0,9100,519.0,514.0
1140,2019/04/22,514.0,512.772,515.0,10100,515.0,511.0
1141,2019/04/23,517.0,516.919,517.0,17300,519.0,515.0
1142,2019/04/24,513.0,515.528,519.0,17600,520.0,513.0
1143,2019/04/25,514.0,513.295,513.0,16300,515.0,511.0
1144,2019/04/26,511.0,508.12,506.0,39200,513.0,504.0
1145,2019/05/07,506.0,507.352,509.0,17600,510.0,505.0
1146,2019/05/08,500.0,500.824,501.0,31800,504.0,498.0
1147,2019/05/09,487.0,490.82,500.0,36100,500.0,487.0
1148,2019/05/10,490.0,491.925,487.0,33200,496.0,487.0
1149,2019/05/13,487.0,489.12,485.0,34900,497.0,485.0
1150,2019/05/14,465.0,462.545,471.0,108600,471.0,454.0
1151,2019/05/15,473.0,470.008,471.0,49600,475.0,465.0
1152,2019/05/16,465.0,466.904,473.0,40800,477.0,460.0
1153,2019/05/17,471.0,470.141,470.0,25500,472.0,468.0
1154,2019/05/20,471.0,474.55,474.0,27100,480.0,470.0
1155,2019/05/21,471.0,471.222,469.0,20300,475.0,469.0
1156,2019/05/22,467.0,469.287,473.0,28200,475.0,466.0
1157,2019/05/23,457.0,460.248,468.0,31500,468.0,456.0
1158,2019/05/24,456.0,452.658,455.0,30100,457.0,447.0
1159,2019/05/27,465.0,463.014,456.0,14800,466.0,456.0
1160,2019/05/28,470.0,468.763,468.0,15600,470.0,466.0
1161,2019/05/29,462.0,463.009,466.0,23600,466.0,462.0
1162,2019/05/30,458.0,458.231,463.0,26400,463.0,455.0
1163,2019/05/31,454.0,455.865,458.0,18500,458.0,454.0
1164,2019/06/03,445.0,447.348,452.0,36200,452.0,444.0
1165,2019/06/04,454.0,451.07,450.0,18500,454.0,447.0
1166,2019/06/05,470.0,464.509,459.0,34600,470.0,459.0
1167,2019/06/06,463.0,465.023,471.0,13200,471.0,462.0
1168,2019/06/07,465.0,463.263,463.0,30400,466.0,461.0
1169,2019/06/10,468.0,469.031,471.0,28900,472.0,466.0
1170,2019/06/11,472.0,471.35,469.0,34300,474.0,467.0
1171,2019/06/12,472.0,473.441,472.0,15200,476.0,470.0
1172,2019/06/13,470.0,468.442,470.0,33700,470.0,465.0
1173,2019/06/14,471.0,469.154,468.0,16900,471.0,468.0
1174,2019/06/17,470.0,471.231,471.0,22900,475.0,469.0
1175,2019/06/18,472.0,473.77,471.0,45200,479.0,470.0
1176,2019/06/19,488.0,483.593,479.0,32900,488.0,479.0
1177,2019/06/20,490.0,489.972,491.0,17900,491.0,488.0
1178,2019/06/21,485.0,488.511,491.0,22500,492.0,485.0
1179,2019/06/24,487.0,485.953,485.0,8500,488.0,484.0
1180,2019/06/25,484.0,485.535,486.0,18500,489.0,483.0
1181,2019/06/26,480.0,481.415,482.0,9400,485.0,480.0
1182,2019/06/27,494.0,494.931,480.0,67600,509.0,480.0
1183,2019/06/28,497.0,509.218,519.0,103900,522.0,497.0
1184,2019/07/01,514.0,509.992,505.0,36800,514.0,502.0
1185,2019/07/02,519.0,518.004,514.0,23900,523.0,512.0
1186,2019/07/03,519.0,516.866,518.0,9700,519.0,513.0
1187,2019/07/04,520.0,521.059,519.0,18600,524.0,519.0
1188,2019/07/05,522.0,520.393,520.0,24700,522.0,518.0
1189,2019/07/08,519.0,519.534,520.0,19100,522.0,517.0
1190,2019/07/09,516.0,518.392,519.0,15300,522.0,515.0
1191,2019/07/10,506.0,510.032,515.0,21700,517.0,506.0
1192,2019/07/11,515.0,512.344,508.0,12500,515.0,508.0
1193,2019/07/12,520.0,519.843,520.0,29900,523.0,515.0
1194,2019/07/16,516.0,515.915,516.0,16500,520.0,514.0
1195,2019/07/17,510.0,512.852,517.0,14900,517.0,510.0
1196,2019/07/18,495.0,499.075,507.0,37200,509.0,495.0
1197,2019/07/19,499.0,499.084,496.0,40600,506.0,496.0
1198,2019/07/22,502.0,500.133,500.0,15000,503.0,496.0
1199,2019/07/23,504.0,505.113,500.0,14200,508.0,500.0
1200,2019/07/24,502.0,502.867,504.0,25600,507.0,499.0
1201,2019/07/25,504.0,503.434,502.0,7600,506.0,500.0
1202,2019/07/26,503.0,503.684,503.0,13600,508.0,502.0
1203,2019/07/29,505.0,503.644,501.0,10400,505.0,501.0
1204,2019/07/30,510.0,508.219,505.0,10500,510.0,504.0
1205,2019/07/31,499.0,502.658,503.0,22200,509.0,499.0
1206,2019/08/01,512.0,503.363,496.0,48000,513.0,496.0
1207,2019/08/02,496.0,498.913,505.0,40300,505.0,495.0
1208,2019/08/05,480.0,484.009,495.0,44000,495.0,474.0
1209,2019/08/06,481.0,476.266,470.0,38000,484.0,470.0
1210,2019/08/07,483.0,484.964,480.0,25300,492.0,480.0
1211,2019/08/08,483.0,483.885,482.0,16500,488.0,479.0
1212,2019/08/09,486.0,485.767,487.0,9000,488.0,484.0
1213,2019/08/13,482.0,479.991,477.0,21000,484.0,476.0
1214,2019/08/14,487.0,485.404,487.0,11400,487.0,482.0
1215,2019/08/15,481.0,480.192,481.0,18800,484.0,475.0
1216,2019/08/16,483.0,482.932,483.0,11800,486.0,480.0
1217,2019/08/19,488.0,487.708,485.0,10600,490.0,485.0
1218,2019/08/20,491.0,490.138,492.0,12300,492.0,486.0
1219,2019/08/21,487.0,487.0,486.0,5200,488.0,485.0
1220,2019/08/22,480.0,481.68,486.0,15300,487.0,478.0
1221,2019/08/23,472.0,474.498,479.0,23500,479.0,470.0
