ds,yhat
2019-07-16,886.5747297439117
2019-07-17,892.3517771859929
2019-07-18,898.8226725214587
2019-07-19,902.0642894256445
2019-07-22,888.1073093665974
2019-07-23,886.1566915012218
2019-07-24,888.2942573437656
2019-07-25,890.2025416073227
2019-07-26,885.9769332782754
2019-07-29,840.3292344579907
2019-07-30,836.5023450249287
2019-07-31,844.2650870445528
2019-08-01,856.4055566595167
2019-08-02,862.0892740721036
2019-08-05,806.4112761364313
2019-08-06,785.2589776441034
2019-08-07,775.007025654552
2019-08-08,774.5371894733731
2019-08-09,777.6201923590571
