ds,yhat
2019-08-22,2015.0022602732524
2019-08-23,2027.912814284844
2019-08-26,1997.7322746723057
2019-08-27,1986.0544129198706
2019-08-28,1987.7678511888673
2019-08-29,2000.3001862867625
2019-08-30,2014.3566978960494
2019-09-02,2000.3051204290862
2019-09-03,1982.4571177555333
2019-09-04,1967.7567263547182
2019-09-05,1960.0265151863887
2019-09-06,1959.7757821180085
2019-09-09,1967.1648103408827
2019-09-10,1959.7964686353237
2019-09-11,1951.2170817952726
2019-09-12,1950.802850259453
2019-09-13,1966.4683381770194
2019-09-17,2089.743548956991
2019-09-18,2097.8375872653683
2019-09-19,2106.46111557181
2019-09-20,2126.9230732779383
