,Date,Close,VWAP,Open,Volume,High,Low
0,2014/08/25,406.0,406.608,407.0,7400,408.0,403.0
1,2014/08/26,406.0,405.704,408.0,2700,408.0,404.0
2,2014/08/27,407.0,405.744,406.0,3900,408.0,403.0
3,2014/08/28,409.0,405.873,404.0,5500,409.0,404.0
4,2014/08/29,406.0,406.938,407.0,1600,408.0,406.0
5,2014/09/01,408.0,405.587,407.0,4600,408.0,405.0
6,2014/09/02,410.0,407.348,404.0,14100,410.0,404.0
7,2014/09/03,411.0,409.759,410.0,8300,412.0,405.0
8,2014/09/04,409.0,409.417,411.0,1200,411.0,408.0
9,2014/09/05,409.0,410.0,412.0,2000,412.0,409.0
10,2014/09/08,411.0,410.677,411.0,3400,411.0,409.0
11,2014/09/09,411.0,411.0,411.0,300,411.0,411.0
12,2014/09/10,409.0,406.12,408.0,10800,409.0,404.0
13,2014/09/11,406.0,408.172,409.0,2900,410.0,406.0
14,2014/09/12,409.0,410.76,411.0,12100,411.0,409.0
15,2014/09/16,411.0,410.086,410.0,3500,411.0,409.0
16,2014/09/17,407.0,409.2,411.0,7000,411.0,406.0
17,2014/09/18,411.0,410.081,411.0,8600,411.0,406.0
18,2014/09/19,411.0,410.388,411.0,8500,412.0,407.0
19,2014/09/22,410.0,409.798,410.0,7900,410.0,407.0
20,2014/09/24,409.0,409.9,410.0,10000,411.0,409.0
21,2014/09/25,412.0,410.164,411.0,11000,412.0,406.0
22,2014/09/26,407.0,408.188,407.0,3200,411.0,407.0
23,2014/09/29,416.0,411.774,410.0,23900,416.0,410.0
24,2014/09/30,409.0,411.169,416.0,6500,416.0,408.0
25,2014/10/01,415.0,413.682,414.0,8800,416.0,408.0
26,2014/10/02,397.0,402.098,407.0,12200,407.0,397.0
27,2014/10/03,402.0,402.689,400.0,4500,406.0,400.0
28,2014/10/06,408.0,409.463,411.0,4100,411.0,408.0
29,2014/10/07,404.0,406.979,408.0,4800,409.0,404.0
30,2014/10/08,405.0,403.171,402.0,4100,406.0,402.0
31,2014/10/09,401.0,402.313,405.0,3200,405.0,401.0
32,2014/10/10,401.0,400.891,401.0,4600,401.0,400.0
33,2014/10/14,398.0,399.645,401.0,9300,401.0,398.0
34,2014/10/15,396.0,395.758,400.0,6600,400.0,393.0
35,2014/10/16,391.0,393.483,395.0,6000,395.0,391.0
36,2014/10/17,392.0,391.356,391.0,5900,393.0,390.0
37,2014/10/20,399.0,400.696,403.0,10200,407.0,392.0
38,2014/10/21,392.0,396.875,399.0,4000,402.0,392.0
39,2014/10/22,400.0,396.5,394.0,4200,400.0,392.0
40,2014/10/23,400.0,400.187,400.0,7500,403.0,397.0
41,2014/10/24,399.0,401.286,404.0,1400,404.0,399.0
42,2014/10/27,400.0,396.976,396.0,4100,400.0,396.0
43,2014/10/28,400.0,401.941,403.0,1700,403.0,399.0
44,2014/10/29,403.0,401.826,403.0,2300,403.0,400.0
45,2014/10/30,407.0,404.159,403.0,6300,407.0,402.0
46,2014/10/31,410.0,407.39,408.0,10000,410.0,400.0
47,2014/11/04,410.0,408.804,410.0,10700,411.0,405.0
48,2014/11/05,404.0,407.0,410.0,10500,410.0,400.0
49,2014/11/06,399.0,402.351,408.0,7700,408.0,399.0
50,2014/11/07,405.0,403.792,405.0,2400,405.0,401.0
51,2014/11/10,408.0,408.077,409.0,1300,409.0,406.0
52,2014/11/11,407.0,406.534,408.0,10300,409.0,402.0
53,2014/11/12,403.0,404.9,407.0,3000,407.0,403.0
54,2014/11/13,404.0,403.38,403.0,5000,406.0,400.0
55,2014/11/14,408.0,406.985,408.0,6800,408.0,403.0
56,2014/11/17,402.0,403.702,406.0,5700,406.0,401.0
57,2014/11/18,410.0,408.517,406.0,8900,410.0,406.0
58,2014/11/19,408.0,406.966,408.0,8700,408.0,406.0
59,2014/11/20,406.0,408.188,409.0,6900,409.0,406.0
60,2014/11/21,405.0,405.845,406.0,5800,406.0,405.0
61,2014/11/25,408.0,407.504,405.0,13500,410.0,405.0
62,2014/11/26,408.0,408.15,410.0,10000,410.0,406.0
63,2014/11/27,405.0,405.323,409.0,6200,409.0,405.0
64,2014/11/28,406.0,405.56,406.0,2500,407.0,404.0
65,2014/12/01,406.0,405.988,406.0,8300,407.0,405.0
66,2014/12/02,406.0,406.8,407.0,11500,407.0,405.0
67,2014/12/03,403.0,404.316,405.0,9800,406.0,402.0
68,2014/12/04,405.0,405.011,406.0,8900,408.0,401.0
69,2014/12/05,405.0,405.105,406.0,5700,406.0,404.0
70,2014/12/08,404.0,405.385,407.0,10900,407.0,403.0
71,2014/12/09,404.0,405.733,406.0,10500,407.0,404.0
72,2014/12/10,400.0,402.076,402.0,10600,405.0,400.0
73,2014/12/11,397.0,399.049,400.0,14300,404.0,395.0
74,2014/12/12,402.0,401.102,401.0,12700,402.0,398.0
75,2014/12/15,398.0,400.2,403.0,7000,403.0,398.0
76,2014/12/16,398.0,398.346,401.0,5500,401.0,397.0
77,2014/12/17,397.0,398.835,400.0,10300,403.0,397.0
78,2014/12/18,402.0,398.269,399.0,13400,402.0,394.0
79,2014/12/19,400.0,399.939,400.0,8200,401.0,398.0
80,2014/12/22,400.0,397.852,397.0,11500,400.0,397.0
81,2014/12/24,400.0,399.915,400.0,22300,401.0,398.0
82,2014/12/25,400.0,399.416,400.0,7700,400.0,397.0
83,2014/12/26,401.0,400.49,400.0,4900,402.0,400.0
84,2014/12/29,403.0,401.836,403.0,12800,404.0,399.0
85,2014/12/30,402.0,403.076,403.0,6600,404.0,402.0
86,2015/01/05,404.0,403.708,403.0,2400,405.0,403.0
87,2015/01/06,399.0,402.5,404.0,7800,405.0,399.0
88,2015/01/07,397.0,397.375,398.0,16800,400.0,396.0
89,2015/01/08,398.0,397.762,397.0,12200,399.0,397.0
90,2015/01/09,397.0,397.362,398.0,10500,399.0,397.0
91,2015/01/13,399.0,398.039,398.0,5200,399.0,396.0
92,2015/01/14,398.0,398.972,401.0,3600,401.0,397.0
93,2015/01/15,401.0,400.0,400.0,2400,401.0,398.0
94,2015/01/16,399.0,399.432,400.0,4400,401.0,398.0
95,2015/01/19,402.0,400.865,399.0,3700,402.0,399.0
96,2015/01/20,402.0,402.494,403.0,7700,403.0,400.0
97,2015/01/21,403.0,402.098,404.0,4100,404.0,401.0
98,2015/01/22,401.0,400.891,403.0,4600,403.0,400.0
99,2015/01/23,403.0,401.694,401.0,6200,403.0,401.0
100,2015/01/26,407.0,405.18,405.0,15600,407.0,402.0
101,2015/01/27,407.0,407.579,409.0,1900,409.0,406.0
102,2015/01/28,407.0,407.313,407.0,1600,408.0,407.0
103,2015/01/29,405.0,406.636,407.0,3300,409.0,405.0
104,2015/01/30,408.0,407.891,408.0,4600,408.0,405.0
105,2015/02/02,405.0,404.824,401.0,1700,407.0,401.0
106,2015/02/03,405.0,405.02,407.0,5100,407.0,403.0
107,2015/02/04,407.0,404.566,402.0,5300,408.0,402.0
108,2015/02/05,404.0,406.5,407.0,5200,409.0,404.0
109,2015/02/06,406.0,405.152,403.0,3300,407.0,403.0
110,2015/02/09,410.0,409.368,408.0,7600,411.0,407.0
111,2015/02/10,408.0,407.552,407.0,2900,410.0,405.0
112,2015/02/12,408.0,409.152,410.0,3300,410.0,408.0
113,2015/02/13,411.0,410.049,410.0,8200,411.0,409.0
114,2015/02/16,410.0,410.843,408.0,7000,414.0,408.0
115,2015/02/17,410.0,408.989,413.0,9300,413.0,405.0
116,2015/02/18,410.0,411.9,412.0,7000,413.0,409.0
117,2015/02/19,413.0,412.786,412.0,5600,413.0,412.0
118,2015/02/20,413.0,411.562,413.0,18500,413.0,408.0
119,2015/02/23,417.0,417.74,413.0,40700,424.0,410.0
120,2015/02/24,409.0,410.147,411.0,32600,414.0,409.0
121,2015/02/25,410.0,410.901,410.0,7100,414.0,410.0
122,2015/02/26,411.0,411.063,413.0,6400,413.0,411.0
123,2015/02/27,410.0,410.679,412.0,8400,412.0,410.0
124,2015/03/02,410.0,411.619,411.0,4200,414.0,410.0
125,2015/03/03,410.0,410.167,412.0,3000,412.0,409.0
126,2015/03/04,407.0,408.596,412.0,8900,412.0,407.0
127,2015/03/05,409.0,409.0,409.0,400,409.0,409.0
128,2015/03/06,409.0,410.365,412.0,5200,412.0,409.0
129,2015/03/09,410.0,410.286,409.0,2800,412.0,409.0
130,2015/03/10,407.0,408.183,408.0,9300,411.0,407.0
131,2015/03/11,410.0,409.529,407.0,1700,410.0,407.0
132,2015/03/12,411.0,410.185,408.0,5400,411.0,408.0
133,2015/03/13,411.0,411.128,411.0,12500,412.0,411.0
134,2015/03/16,410.0,411.056,411.0,1800,412.0,410.0
135,2015/03/17,411.0,413.194,413.0,10800,415.0,410.0
136,2015/03/18,414.0,412.5,412.0,6000,414.0,411.0
137,2015/03/19,417.0,415.161,414.0,19900,417.0,413.0
138,2015/03/20,416.0,416.891,418.0,13700,418.0,416.0
139,2015/03/23,419.0,417.008,416.0,12100,419.0,416.0
140,2015/03/24,420.0,419.537,421.0,9500,421.0,417.0
141,2015/03/25,419.0,418.485,418.0,3300,419.0,418.0
142,2015/03/26,417.0,418.375,420.0,4800,420.0,416.0
143,2015/03/27,403.0,404.498,404.0,23700,412.0,401.0
144,2015/03/30,405.0,404.333,403.0,4800,412.0,403.0
145,2015/03/31,407.0,406.444,405.0,4500,410.0,405.0
146,2015/04/01,406.0,405.737,405.0,3800,407.0,405.0
147,2015/04/02,408.0,405.297,407.0,9100,408.0,403.0
148,2015/04/03,410.0,408.757,408.0,3700,411.0,408.0
149,2015/04/06,409.0,409.32,411.0,2500,411.0,407.0
150,2015/04/07,407.0,410.17,410.0,10000,413.0,407.0
151,2015/04/08,409.0,405.901,411.0,12100,411.0,400.0
152,2015/04/09,410.0,409.182,407.0,4400,410.0,407.0
153,2015/04/10,407.0,406.459,410.0,13300,410.0,404.0
154,2015/04/13,403.0,404.109,405.0,10100,406.0,403.0
155,2015/04/14,405.0,404.451,404.0,10200,406.0,403.0
156,2015/04/15,404.0,405.563,405.0,9600,410.0,404.0
157,2015/04/16,405.0,404.425,407.0,7300,407.0,403.0
158,2015/04/17,402.0,403.885,405.0,11300,405.0,402.0
159,2015/04/20,406.0,403.738,403.0,10300,406.0,403.0
160,2015/04/21,404.0,404.196,405.0,5100,405.0,403.0
161,2015/04/22,402.0,402.952,404.0,12600,405.0,401.0
162,2015/04/23,403.0,402.785,404.0,7900,404.0,402.0
163,2015/04/24,404.0,404.632,404.0,6800,407.0,403.0
164,2015/04/27,414.0,411.781,412.0,32800,414.0,408.0
165,2015/04/28,412.0,412.576,413.0,10600,414.0,411.0
166,2015/04/30,411.0,409.61,410.0,14100,413.0,408.0
167,2015/05/01,410.0,409.515,411.0,10300,412.0,405.0
168,2015/05/07,413.0,412.402,411.0,8200,414.0,411.0
169,2015/05/08,413.0,412.989,412.0,18800,415.0,411.0
170,2015/05/11,415.0,414.901,415.0,8100,416.0,414.0
171,2015/05/12,415.0,415.033,415.0,3000,416.0,415.0
172,2015/05/13,420.0,414.374,415.0,42300,423.0,401.0
173,2015/05/14,414.0,415.759,420.0,5800,420.0,408.0
174,2015/05/15,420.0,415.435,414.0,9200,421.0,413.0
175,2015/05/18,424.0,421.968,421.0,9500,424.0,419.0
176,2015/05/19,438.0,431.183,424.0,25200,440.0,423.0
177,2015/05/20,431.0,430.018,437.0,27200,437.0,417.0
178,2015/05/21,426.0,426.59,431.0,12200,431.0,424.0
179,2015/05/22,432.0,429.301,426.0,8300,435.0,425.0
180,2015/05/25,426.0,430.804,433.0,15300,433.0,425.0
181,2015/05/26,430.0,429.067,433.0,4500,433.0,427.0
182,2015/05/27,429.0,429.5,431.0,2600,432.0,427.0
183,2015/05/28,431.0,429.589,427.0,12400,435.0,427.0
184,2015/05/29,430.0,429.852,431.0,2700,431.0,425.0
185,2015/06/01,428.0,429.574,431.0,10100,431.0,428.0
186,2015/06/02,425.0,422.588,428.0,8500,428.0,414.0
187,2015/06/03,423.0,426.617,429.0,4700,429.0,423.0
188,2015/06/04,427.0,427.483,430.0,2900,430.0,423.0
189,2015/06/05,428.0,429.2,427.0,9000,435.0,422.0
190,2015/06/08,423.0,422.905,422.0,13700,426.0,422.0
191,2015/06/09,421.0,423.167,428.0,5400,428.0,421.0
192,2015/06/10,420.0,420.92,420.0,11300,424.0,418.0
193,2015/06/11,429.0,424.937,420.0,9500,430.0,420.0
194,2015/06/12,424.0,424.894,425.0,16100,425.0,423.0
195,2015/06/15,423.0,421.451,424.0,7100,424.0,417.0
196,2015/06/16,421.0,422.464,423.0,5600,423.0,421.0
197,2015/06/17,419.0,420.769,420.0,5200,422.0,419.0
198,2015/06/18,427.0,425.11,421.0,36400,433.0,417.0
199,2015/06/19,429.0,426.441,427.0,5900,429.0,423.0
200,2015/06/22,435.0,427.744,425.0,12500,435.0,425.0
201,2015/06/23,440.0,439.678,443.0,17700,443.0,435.0
202,2015/06/24,433.0,431.391,435.0,15600,438.0,424.0
203,2015/06/25,429.0,430.068,427.0,11800,438.0,427.0
204,2015/06/26,432.0,426.566,430.0,8300,436.0,422.0
205,2015/06/29,424.0,421.571,422.0,23800,426.0,410.0
206,2015/06/30,426.0,422.5,419.0,8000,426.0,419.0
207,2015/07/01,435.0,431.14,421.0,10700,437.0,421.0
208,2015/07/02,437.0,437.855,438.0,13100,439.0,435.0
209,2015/07/03,430.0,434.32,437.0,10000,437.0,428.0
210,2015/07/06,419.0,422.361,430.0,10800,430.0,419.0
211,2015/07/07,422.0,423.583,425.0,3600,427.0,422.0
212,2015/07/08,413.0,417.415,425.0,14700,425.0,413.0
213,2015/07/09,424.0,418.061,414.0,23100,430.0,413.0
214,2015/07/10,419.0,419.6,424.0,11500,425.0,413.0
215,2015/07/13,429.0,425.473,420.0,5500,431.0,420.0
216,2015/07/14,429.0,427.544,426.0,9000,430.0,425.0
217,2015/07/15,420.0,422.338,430.0,30200,430.0,420.0
218,2015/07/16,429.0,427.98,422.0,15100,430.0,422.0
219,2015/07/17,427.0,427.635,430.0,6300,430.0,427.0
220,2015/07/21,427.0,426.72,427.0,7500,428.0,425.0
221,2015/07/22,434.0,432.932,429.0,7400,440.0,427.0
222,2015/07/23,426.0,428.505,434.0,28900,435.0,420.0
223,2015/07/24,424.0,427.207,429.0,5800,429.0,424.0
224,2015/07/27,422.0,425.281,428.0,6400,428.0,422.0
225,2015/07/28,423.0,423.568,422.0,4400,426.0,422.0
226,2015/07/29,425.0,425.214,425.0,2800,427.0,424.0
227,2015/07/30,431.0,430.116,427.0,17200,434.0,427.0
228,2015/07/31,434.0,432.326,431.0,8600,435.0,428.0
229,2015/08/03,436.0,433.359,435.0,16700,439.0,427.0
230,2015/08/04,448.0,450.313,450.0,41200,460.0,445.0
231,2015/08/05,441.0,443.555,441.0,36600,450.0,440.0
232,2015/08/06,435.0,438.008,440.0,24100,442.0,434.0
233,2015/08/07,434.0,433.973,434.0,11100,436.0,433.0
234,2015/08/10,431.0,430.408,434.0,18400,434.0,427.0
235,2015/08/11,429.0,430.069,431.0,13000,433.0,427.0
236,2015/08/12,429.0,427.098,429.0,8200,432.0,425.0
237,2015/08/13,425.0,425.124,426.0,19400,427.0,423.0
238,2015/08/14,423.0,424.37,427.0,5400,427.0,423.0
239,2015/08/17,424.0,424.921,427.0,6300,427.0,424.0
240,2015/08/18,426.0,426.069,427.0,5800,427.0,425.0
241,2015/08/19,424.0,424.55,426.0,6000,426.0,424.0
242,2015/08/20,421.0,422.593,423.0,8100,426.0,420.0
243,2015/08/21,404.0,408.075,415.0,21400,417.0,400.0
244,2015/08/24,384.0,393.577,400.0,38100,409.0,383.0
245,2015/08/25,382.0,381.648,384.0,29000,392.0,369.0
246,2015/08/26,394.0,396.197,383.0,13200,407.0,383.0
247,2015/08/27,396.0,398.765,398.0,8100,406.0,395.0
248,2015/08/28,407.0,403.416,402.0,11300,407.0,400.0
249,2015/08/31,404.0,403.781,404.0,4100,405.0,402.0
250,2015/09/01,397.0,400.662,405.0,13300,405.0,396.0
251,2015/09/02,393.0,392.875,393.0,4000,396.0,386.0
252,2015/09/03,398.0,397.314,396.0,3500,398.0,396.0
253,2015/09/04,392.0,393.388,398.0,6700,398.0,390.0
254,2015/09/07,384.0,386.2,390.0,10500,394.0,380.0
255,2015/09/08,383.0,384.974,387.0,3800,387.0,383.0
256,2015/09/09,398.0,394.6,390.0,4500,399.0,386.0
257,2015/09/10,394.0,395.0,395.0,1400,396.0,394.0
258,2015/09/11,400.0,401.802,402.0,11100,402.0,397.0
259,2015/09/14,398.0,400.5,404.0,2600,404.0,398.0
260,2015/09/15,400.0,399.684,400.0,1900,400.0,399.0
261,2015/09/16,400.0,401.577,403.0,2600,405.0,400.0
262,2015/09/17,402.0,398.583,400.0,7200,402.0,397.0
263,2015/09/18,396.0,396.579,400.0,5700,400.0,395.0
264,2015/09/24,388.0,394.486,396.0,14600,397.0,387.0
265,2015/09/25,394.0,390.625,388.0,4800,395.0,386.0
266,2015/09/28,394.0,393.71,390.0,3100,396.0,390.0
267,2015/09/29,382.0,385.521,386.0,7100,391.0,382.0
268,2015/09/30,386.0,385.778,382.0,900,390.0,382.0
269,2015/10/01,394.0,393.192,390.0,2600,395.0,390.0
270,2015/10/02,392.0,391.143,388.0,700,392.0,388.0
271,2015/10/05,393.0,393.231,393.0,1300,394.0,393.0
272,2015/10/06,396.0,394.636,395.0,6600,396.0,391.0
273,2015/10/07,398.0,398.469,398.0,3200,399.0,396.0
274,2015/10/08,399.0,398.0,398.0,1600,399.0,395.0
275,2015/10/09,403.0,401.172,399.0,15700,410.0,397.0
276,2015/10/13,403.0,401.367,405.0,12000,405.0,400.0
277,2015/10/14,401.0,401.821,402.0,3900,403.0,401.0
278,2015/10/15,405.0,403.571,401.0,1400,405.0,401.0
279,2015/10/16,405.0,403.322,405.0,5900,406.0,400.0
280,2015/10/19,407.0,405.143,404.0,3500,407.0,403.0
281,2015/10/20,401.0,402.739,403.0,6500,404.0,401.0
282,2015/10/21,404.0,403.233,401.0,3000,404.0,401.0
283,2015/10/22,397.0,398.934,401.0,6100,403.0,397.0
284,2015/10/23,402.0,399.546,397.0,13200,402.0,397.0
285,2015/10/26,406.0,405.192,405.0,9400,407.0,403.0
286,2015/10/27,403.0,404.0,406.0,1900,406.0,403.0
287,2015/10/28,402.0,399.391,404.0,6900,404.0,394.0
288,2015/10/29,399.0,400.121,403.0,3300,403.0,399.0
289,2015/10/30,406.0,404.96,403.0,10000,408.0,401.0
290,2015/11/02,410.0,408.133,407.0,18800,410.0,404.0
291,2015/11/04,402.0,406.903,408.0,18500,410.0,401.0
292,2015/11/05,403.0,404.362,406.0,5800,406.0,402.0
293,2015/11/06,407.0,408.985,407.0,13400,412.0,406.0
294,2015/11/09,405.0,408.989,411.0,17900,415.0,401.0
295,2015/11/10,405.0,404.894,404.0,6600,406.0,404.0
296,2015/11/11,403.0,405.341,407.0,8800,409.0,403.0
297,2015/11/12,409.0,407.932,407.0,4400,409.0,405.0
298,2015/11/13,407.0,409.12,410.0,18300,418.0,400.0
299,2015/11/16,404.0,404.419,406.0,3100,407.0,403.0
300,2015/11/17,407.0,406.854,409.0,4800,409.0,405.0
301,2015/11/18,410.0,407.355,409.0,6200,411.0,402.0
302,2015/11/19,413.0,411.303,411.0,11900,414.0,409.0
303,2015/11/20,413.0,412.073,413.0,8200,413.0,407.0
304,2015/11/24,415.0,413.563,413.0,14200,415.0,410.0
305,2015/11/25,418.0,416.206,418.0,6300,419.0,414.0
306,2015/11/26,415.0,415.539,418.0,5200,418.0,412.0
307,2015/11/27,415.0,418.056,418.0,3600,420.0,415.0
308,2015/11/30,417.0,417.444,417.0,12400,423.0,412.0
309,2015/12/01,423.0,418.348,416.0,9200,423.0,416.0
310,2015/12/02,423.0,425.684,425.0,19300,430.0,423.0
311,2015/12/03,428.0,423.838,421.0,8000,430.0,418.0
312,2015/12/04,427.0,427.351,427.0,9400,430.0,426.0
313,2015/12/07,424.0,423.313,426.0,8000,427.0,419.0
314,2015/12/08,425.0,428.073,429.0,9600,429.0,425.0
315,2015/12/09,423.0,420.88,420.0,8300,424.0,418.0
316,2015/12/10,416.0,418.333,420.0,12300,428.0,406.0
317,2015/12/11,419.0,419.993,420.0,14300,422.0,418.0
318,2015/12/14,417.0,416.667,415.0,3600,418.0,415.0
319,2015/12/15,417.0,419.29,417.0,3800,421.0,417.0
320,2015/12/16,420.0,418.649,418.0,3700,421.0,417.0
321,2015/12/17,422.0,423.966,422.0,17400,433.0,418.0
322,2015/12/18,419.0,420.291,423.0,8600,424.0,417.0
323,2015/12/21,413.0,414.817,417.0,11500,417.0,409.0
324,2015/12/22,412.0,413.194,413.0,3100,414.0,412.0
325,2015/12/24,408.0,411.622,412.0,20900,414.0,407.0
326,2015/12/25,399.0,400.085,404.0,18800,405.0,396.0
327,2015/12/28,404.0,401.8,400.0,3000,404.0,400.0
328,2015/12/29,404.0,405.388,404.0,4900,408.0,404.0
329,2015/12/30,407.0,406.385,404.0,1300,409.0,404.0
330,2016/01/04,403.0,405.455,405.0,2200,410.0,403.0
331,2016/01/05,403.0,403.235,403.0,1700,404.0,403.0
332,2016/01/06,402.0,402.2,407.0,3000,407.0,401.0
333,2016/01/07,395.0,399.72,405.0,5000,405.0,394.0
334,2016/01/08,390.0,391.143,391.0,7700,394.0,389.0
335,2016/01/12,387.0,390.44,391.0,30700,395.0,387.0
336,2016/01/13,382.0,383.022,385.0,18000,386.0,380.0
337,2016/01/14,381.0,380.212,381.0,15600,388.0,376.0
338,2016/01/15,381.0,387.579,389.0,10700,389.0,380.0
339,2016/01/18,378.0,379.064,378.0,6300,385.0,374.0
340,2016/01/19,388.0,384.894,378.0,16100,388.0,378.0
341,2016/01/20,376.0,382.057,386.0,12300,388.0,376.0
342,2016/01/21,367.0,375.611,375.0,9000,385.0,367.0
343,2016/01/22,380.0,372.349,367.0,6300,382.0,367.0
344,2016/01/25,385.0,383.296,385.0,4400,385.0,381.0
345,2016/01/26,389.0,390.089,393.0,10100,393.0,385.0
346,2016/01/27,389.0,389.177,390.0,1700,390.0,389.0
347,2016/01/28,393.0,391.065,389.0,4600,396.0,387.0
348,2016/01/29,398.0,392.875,391.0,4800,398.0,389.0
349,2016/02/01,408.0,406.648,400.0,19300,417.0,398.0
350,2016/02/02,403.0,406.625,410.0,4800,410.0,401.0
351,2016/02/03,394.0,394.927,400.0,4100,400.0,390.0
352,2016/02/04,381.0,381.711,387.0,12100,389.0,372.0
353,2016/02/05,381.0,385.302,381.0,5300,390.0,379.0
354,2016/02/08,389.0,387.039,381.0,2600,393.0,381.0
355,2016/02/09,378.0,379.677,382.0,6500,384.0,375.0
356,2016/02/10,375.0,374.91,374.0,10000,378.0,373.0
357,2016/02/12,361.0,365.102,370.0,11800,375.0,359.0
358,2016/02/15,370.0,364.766,374.0,11100,374.0,351.0
359,2016/02/16,366.0,369.16,369.0,12500,376.0,365.0
360,2016/02/17,364.0,365.458,365.0,2400,369.0,363.0
361,2016/02/18,367.0,368.0,370.0,4000,374.0,365.0
362,2016/02/19,367.0,366.065,363.0,4600,368.0,363.0
363,2016/02/22,373.0,371.637,368.0,11300,380.0,368.0
364,2016/02/23,372.0,372.913,374.0,8000,375.0,370.0
365,2016/02/24,369.0,372.2,370.0,4000,374.0,369.0
366,2016/02/25,373.0,369.204,370.0,5400,375.0,360.0
367,2016/02/26,373.0,374.316,373.0,1900,375.0,373.0
368,2016/02/29,368.0,370.957,373.0,6900,374.0,368.0
369,2016/03/01,360.0,363.327,368.0,5200,369.0,359.0
370,2016/03/02,361.0,362.915,371.0,11800,371.0,360.0
371,2016/03/03,367.0,366.355,362.0,3100,370.0,362.0
372,2016/03/04,374.0,371.802,367.0,9600,375.0,367.0
373,2016/03/07,377.0,376.944,377.0,3600,379.0,374.0
374,2016/03/08,374.0,376.324,377.0,3400,380.0,374.0
375,2016/03/09,373.0,373.167,376.0,3000,376.0,371.0
376,2016/03/10,377.0,375.972,373.0,3600,378.0,373.0
377,2016/03/11,384.0,378.529,377.0,10400,384.0,375.0
378,2016/03/14,385.0,385.02,384.0,5100,387.0,380.0
379,2016/03/15,387.0,384.651,384.0,4300,387.0,383.0
380,2016/03/16,383.0,385.238,387.0,2100,387.0,383.0
381,2016/03/17,384.0,386.313,387.0,6700,390.0,382.0
382,2016/03/18,386.0,384.254,384.0,5900,386.0,381.0
383,2016/03/22,395.0,391.5,390.0,17600,395.0,388.0
384,2016/03/23,394.0,394.528,395.0,7200,396.0,391.0
385,2016/03/24,387.0,387.723,390.0,4700,390.0,386.0
386,2016/03/25,387.0,388.349,387.0,4300,391.0,386.0
387,2016/03/28,388.0,385.403,387.0,6200,388.0,382.0
388,2016/03/29,390.0,388.833,389.0,3000,390.0,385.0
389,2016/03/30,382.0,382.264,382.0,5300,384.0,382.0
390,2016/03/31,377.0,377.975,378.0,4000,382.0,376.0
391,2016/04/01,367.0,370.435,381.0,6900,381.0,367.0
392,2016/04/04,367.0,366.073,371.0,5500,371.0,363.0
393,2016/04/05,361.0,363.714,367.0,3500,367.0,360.0
394,2016/04/06,362.0,360.324,363.0,3700,364.0,358.0
395,2016/04/07,360.0,362.3,362.0,4000,368.0,360.0
396,2016/04/08,359.0,357.436,357.0,11000,364.0,351.0
397,2016/04/11,355.0,356.205,360.0,11200,362.0,350.0
398,2016/04/12,357.0,357.976,355.0,4100,362.0,355.0
399,2016/04/13,361.0,361.0,357.0,2300,364.0,357.0
400,2016/04/14,373.0,372.611,363.0,5400,377.0,363.0
401,2016/04/15,367.0,367.0,366.0,3000,370.0,366.0
402,2016/04/18,366.0,366.444,367.0,2700,368.0,365.0
403,2016/04/19,381.0,379.9,382.0,6000,382.0,375.0
404,2016/04/20,378.0,382.991,383.0,10700,389.0,377.0
405,2016/04/21,385.0,382.259,386.0,8100,386.0,377.0
406,2016/04/22,388.0,385.7,385.0,3000,388.0,379.0
407,2016/04/25,378.0,385.355,391.0,12100,391.0,375.0
408,2016/04/26,377.0,375.735,375.0,3400,378.0,375.0
409,2016/04/27,369.0,370.7,377.0,4000,377.0,369.0
410,2016/04/28,372.0,371.757,371.0,7000,379.0,368.0
411,2016/05/02,370.0,371.347,372.0,7500,374.0,370.0
412,2016/05/06,368.0,369.139,371.0,7900,372.0,365.0
413,2016/05/09,369.0,373.839,377.0,6200,378.0,369.0
414,2016/05/10,373.0,372.721,374.0,8600,380.0,370.0
415,2016/05/11,379.0,378.466,375.0,11800,384.0,370.0
416,2016/05/12,376.0,377.343,374.0,3500,383.0,374.0
417,2016/05/13,372.0,373.838,378.0,3700,378.0,372.0
418,2016/05/16,372.0,372.773,371.0,2200,374.0,371.0
419,2016/05/17,376.0,375.426,372.0,5400,380.0,372.0
420,2016/05/18,372.0,372.7,375.0,6000,379.0,371.0
421,2016/05/19,374.0,372.189,372.0,7400,376.0,370.0
422,2016/05/20,378.0,375.859,375.0,6400,381.0,374.0
423,2016/05/23,377.0,377.893,378.0,7500,379.0,376.0
424,2016/05/24,372.0,373.85,377.0,2000,377.0,371.0
425,2016/05/25,375.0,374.6,374.0,2000,377.0,373.0
426,2016/05/26,374.0,373.818,375.0,2200,375.0,372.0
427,2016/05/27,371.0,372.903,378.0,3100,378.0,370.0
428,2016/05/30,375.0,372.386,372.0,7000,375.0,370.0
429,2016/05/31,374.0,374.076,375.0,5300,377.0,372.0
430,2016/06/01,373.0,374.288,374.0,5900,377.0,371.0
431,2016/06/02,363.0,366.677,371.0,3100,373.0,363.0
432,2016/06/03,363.0,363.12,365.0,2500,365.0,362.0
433,2016/06/06,368.0,363.0,361.0,5100,368.0,360.0
434,2016/06/07,362.0,362.185,360.0,6500,364.0,360.0
435,2016/06/08,363.0,364.038,363.0,5300,366.0,363.0
436,2016/06/09,357.0,358.902,362.0,5100,362.0,357.0
437,2016/06/10,355.0,356.702,357.0,10400,357.0,355.0
438,2016/06/13,350.0,351.638,352.0,5800,354.0,350.0
439,2016/06/14,344.0,349.207,356.0,13500,358.0,343.0
440,2016/06/15,346.0,346.0,345.0,5100,347.0,345.0
441,2016/06/16,340.0,343.656,348.0,6100,350.0,340.0
442,2016/06/17,342.0,339.648,342.0,10500,345.0,335.0
443,2016/06/20,341.0,340.911,339.0,11200,345.0,339.0
444,2016/06/21,360.0,359.816,355.0,37400,373.0,350.0
445,2016/06/22,362.0,355.564,354.0,9400,362.0,352.0
446,2016/06/23,363.0,362.591,362.0,6600,364.0,362.0
447,2016/06/24,339.0,349.754,371.0,24400,371.0,330.0
448,2016/06/27,343.0,342.731,342.0,5200,345.0,342.0
449,2016/06/28,351.0,348.333,341.0,4800,356.0,341.0
450,2016/06/29,361.0,359.954,352.0,4300,362.0,352.0
451,2016/06/30,363.0,362.839,362.0,3100,364.0,362.0
452,2016/07/01,368.0,366.409,365.0,6600,369.0,363.0
453,2016/07/04,377.0,371.649,372.0,15100,380.0,355.0
454,2016/07/05,374.0,376.438,377.0,6400,377.0,373.0
455,2016/07/06,366.0,367.565,374.0,2300,374.0,366.0
456,2016/07/07,365.0,364.7,366.0,7000,367.0,362.0
457,2016/07/08,355.0,361.447,372.0,4700,372.0,355.0
458,2016/07/11,368.0,365.21,355.0,6200,373.0,355.0
459,2016/07/12,371.0,369.861,367.0,4300,372.0,367.0
460,2016/07/13,372.0,376.696,370.0,6900,381.0,370.0
461,2016/07/14,372.0,373.125,372.0,3200,374.0,372.0
462,2016/07/15,374.0,374.036,371.0,5500,375.0,371.0
463,2016/07/19,389.0,380.536,372.0,13800,389.0,372.0
464,2016/07/20,381.0,381.132,381.0,5300,383.0,380.0
465,2016/07/21,382.0,380.72,386.0,5000,386.0,379.0
466,2016/07/22,380.0,380.556,380.0,5400,382.0,380.0
467,2016/07/25,398.0,395.335,396.0,29000,400.0,390.0
468,2016/07/26,388.0,392.106,395.0,6600,399.0,388.0
469,2016/07/27,391.0,394.05,396.0,4000,397.0,389.0
470,2016/07/28,379.0,383.421,386.0,8800,387.0,378.0
471,2016/07/29,382.0,379.015,377.0,6500,386.0,377.0
472,2016/08/01,378.0,382.368,385.0,3800,387.0,378.0
473,2016/08/02,359.0,361.284,363.0,20100,368.0,359.0
474,2016/08/03,351.0,355.157,359.0,5100,359.0,351.0
475,2016/08/04,355.0,356.776,360.0,6700,360.0,354.0
476,2016/08/05,357.0,358.286,363.0,4200,363.0,355.0
477,2016/08/08,357.0,358.865,362.0,5200,362.0,356.0
478,2016/08/09,359.0,358.409,358.0,4400,360.0,358.0
479,2016/08/10,359.0,356.061,356.0,6600,359.0,354.0
480,2016/08/12,359.0,356.983,358.0,5700,359.0,356.0
481,2016/08/15,359.0,360.708,360.0,2400,362.0,358.0
482,2016/08/16,356.0,359.613,355.0,19100,367.0,355.0
483,2016/08/17,353.0,351.869,350.0,8400,355.0,350.0
484,2016/08/18,352.0,351.019,353.0,10500,353.0,350.0
485,2016/08/19,357.0,354.515,351.0,3300,357.0,350.0
486,2016/08/22,368.0,364.564,360.0,11000,369.0,360.0
487,2016/08/23,363.0,367.0,369.0,8900,369.0,362.0
488,2016/08/24,363.0,362.636,366.0,1100,366.0,361.0
489,2016/08/25,361.0,360.611,362.0,1800,362.0,359.0
490,2016/08/26,356.0,358.7,361.0,6000,363.0,355.0
491,2016/08/29,363.0,362.188,363.0,1600,363.0,360.0
492,2016/08/30,356.0,357.125,361.0,2400,361.0,356.0
493,2016/08/31,361.0,359.982,356.0,5400,361.0,356.0
494,2016/09/01,362.0,358.442,354.0,4300,362.0,354.0
495,2016/09/02,363.0,364.75,365.0,1600,366.0,363.0
496,2016/09/05,367.0,367.192,368.0,2600,368.0,364.0
497,2016/09/06,370.0,368.69,367.0,2900,370.0,367.0
498,2016/09/07,372.0,372.315,362.0,10800,379.0,362.0
499,2016/09/08,377.0,378.105,379.0,1900,379.0,376.0
500,2016/09/09,376.0,376.536,377.0,5600,377.0,374.0
501,2016/09/12,373.0,372.316,371.0,1900,373.0,371.0
502,2016/09/13,368.0,369.333,374.0,1500,374.0,368.0
503,2016/09/14,368.0,369.24,368.0,2500,372.0,368.0
504,2016/09/15,366.0,366.114,365.0,3500,369.0,365.0
505,2016/09/16,376.0,371.821,366.0,2800,376.0,366.0
506,2016/09/20,381.0,379.525,378.0,12200,384.0,377.0
507,2016/09/21,381.0,380.314,380.0,3500,381.0,377.0
508,2016/09/23,390.0,391.286,393.0,13300,393.0,388.0
509,2016/09/26,391.0,387.756,385.0,4500,391.0,385.0
510,2016/09/27,395.0,390.741,384.0,8500,395.0,382.0
511,2016/09/28,389.0,389.513,390.0,7800,395.0,386.0
512,2016/09/29,394.0,391.974,389.0,3800,394.0,389.0
513,2016/09/30,387.0,388.691,388.0,4200,392.0,387.0
514,2016/10/03,386.0,387.353,387.0,1700,390.0,386.0
515,2016/10/04,377.0,378.326,382.0,9500,382.0,375.0
516,2016/10/05,382.0,381.102,381.0,4900,383.0,378.0
517,2016/10/06,380.0,382.913,384.0,4600,386.0,380.0
518,2016/10/07,375.0,374.478,380.0,6900,380.0,369.0
519,2016/10/11,374.0,374.383,379.0,4700,379.0,371.0
520,2016/10/12,369.0,369.836,371.0,5500,373.0,368.0
521,2016/10/13,372.0,370.194,372.0,3100,372.0,368.0
522,2016/10/14,368.0,368.889,368.0,4500,372.0,367.0
523,2016/10/17,371.0,369.186,370.0,8600,373.0,367.0
524,2016/10/18,373.0,374.0,373.0,2900,375.0,373.0
525,2016/10/19,379.0,375.539,375.0,6500,379.0,372.0
526,2016/10/20,381.0,379.856,380.0,11800,381.0,378.0
527,2016/10/21,382.0,381.111,381.0,1800,382.0,380.0
528,2016/10/24,386.0,393.073,398.0,9600,398.0,385.0
529,2016/10/25,385.0,384.863,386.0,7300,386.0,384.0
530,2016/10/26,387.0,386.548,384.0,4200,387.0,384.0
531,2016/10/27,389.0,384.962,387.0,15800,389.0,380.0
532,2016/10/28,386.0,387.303,388.0,39000,391.0,380.0
533,2016/10/31,386.0,386.838,388.0,3700,388.0,386.0
534,2016/11/01,387.0,386.79,389.0,3800,389.0,386.0
535,2016/11/02,383.0,383.967,384.0,9000,387.0,381.0
536,2016/11/04,385.0,386.724,385.0,13400,391.0,383.0
537,2016/11/07,387.0,386.477,385.0,6500,389.0,385.0
538,2016/11/08,390.0,385.737,379.0,3800,390.0,379.0
539,2016/11/09,377.0,383.986,390.0,14600,392.0,373.0
540,2016/11/10,387.0,386.508,384.0,6100,389.0,384.0
541,2016/11/11,388.0,388.302,388.0,5300,392.0,386.0
542,2016/11/14,390.0,390.553,392.0,4700,393.0,388.0
543,2016/11/15,390.0,390.247,390.0,8100,392.0,390.0
544,2016/11/16,393.0,392.508,390.0,6100,393.0,390.0
545,2016/11/17,396.0,394.175,391.0,5700,396.0,391.0
546,2016/11/18,400.0,397.827,396.0,34000,401.0,395.0
547,2016/11/21,405.0,404.167,402.0,22700,410.0,402.0
548,2016/11/22,408.0,407.014,406.0,7300,409.0,404.0
549,2016/11/24,409.0,409.0,410.0,14800,412.0,407.0
550,2016/11/25,410.0,407.197,403.0,14700,411.0,403.0
551,2016/11/28,414.0,411.608,411.0,7900,414.0,409.0
552,2016/11/29,417.0,417.249,416.0,33800,421.0,414.0
553,2016/11/30,419.0,418.904,420.0,19700,420.0,417.0
554,2016/12/01,418.0,417.9,417.0,30000,424.0,415.0
555,2016/12/02,415.0,416.325,420.0,24600,420.0,412.0
556,2016/12/05,412.0,415.052,422.0,17200,422.0,400.0
557,2016/12/06,420.0,419.066,423.0,25900,423.0,413.0
558,2016/12/07,418.0,419.419,422.0,13600,422.0,417.0
559,2016/12/08,420.0,420.109,419.0,12900,422.0,418.0
560,2016/12/09,420.0,414.682,414.0,15700,420.0,411.0
561,2016/12/12,419.0,418.698,418.0,5300,421.0,415.0
562,2016/12/13,418.0,416.759,414.0,5400,419.0,414.0
563,2016/12/14,416.0,409.567,418.0,21000,418.0,402.0
564,2016/12/15,410.0,410.658,411.0,15500,415.0,408.0
565,2016/12/16,411.0,411.226,410.0,9300,413.0,408.0
566,2016/12/19,412.0,411.26,412.0,13100,415.0,408.0
567,2016/12/20,415.0,413.402,413.0,11200,415.0,411.0
568,2016/12/21,411.0,413.0,415.0,8400,415.0,410.0
569,2016/12/22,409.0,407.431,408.0,13000,410.0,405.0
570,2016/12/26,411.0,414.612,418.0,33000,418.0,410.0
571,2016/12/27,409.0,407.881,408.0,12600,409.0,405.0
572,2016/12/28,408.0,408.455,408.0,4400,409.0,408.0
573,2016/12/29,405.0,404.156,405.0,10900,406.0,403.0
574,2016/12/30,407.0,404.139,405.0,7900,408.0,396.0
575,2017/01/04,410.0,409.183,407.0,7100,412.0,407.0
576,2017/01/05,411.0,411.128,412.0,10200,414.0,408.0
577,2017/01/06,411.0,409.654,411.0,12700,413.0,400.0
578,2017/01/10,417.0,418.105,411.0,19100,430.0,411.0
579,2017/01/11,418.0,417.974,416.0,7600,420.0,414.0
580,2017/01/12,419.0,419.392,424.0,7900,424.0,417.0
581,2017/01/13,419.0,417.524,415.0,6300,420.0,415.0
582,2017/01/16,413.0,414.476,419.0,8200,420.0,406.0
583,2017/01/17,410.0,408.845,410.0,10300,413.0,404.0
584,2017/01/18,407.0,408.429,415.0,3500,415.0,407.0
585,2017/01/19,415.0,414.093,415.0,4300,415.0,412.0
586,2017/01/20,418.0,416.298,416.0,8400,418.0,413.0
587,2017/01/23,411.0,415.432,419.0,8800,419.0,405.0
588,2017/01/24,414.0,412.227,413.0,4400,414.0,410.0
589,2017/01/25,418.0,416.455,414.0,2200,418.0,414.0
590,2017/01/26,418.0,417.179,418.0,5600,418.0,416.0
591,2017/01/27,418.0,417.069,418.0,7200,419.0,413.0
592,2017/01/30,418.0,412.864,418.0,17600,420.0,411.0
593,2017/01/31,415.0,415.205,414.0,3900,418.0,414.0
594,2017/02/01,416.0,419.588,415.0,19400,430.0,415.0
595,2017/02/02,417.0,415.9,414.0,4000,418.0,414.0
596,2017/02/03,412.0,415.475,420.0,6100,420.0,410.0
597,2017/02/06,420.0,417.487,415.0,11500,422.0,414.0
598,2017/02/07,419.0,417.426,417.0,10800,419.0,417.0
599,2017/02/08,417.0,418.654,419.0,7800,421.0,417.0
600,2017/02/09,419.0,418.783,421.0,4600,421.0,418.0
601,2017/02/10,422.0,422.086,421.0,14000,424.0,420.0
602,2017/02/13,424.0,423.824,424.0,5100,424.0,423.0
603,2017/02/14,425.0,424.744,424.0,28100,425.0,423.0
604,2017/02/15,423.0,422.648,422.0,24400,425.0,422.0
605,2017/02/16,420.0,422.315,424.0,8900,425.0,420.0
606,2017/02/17,423.0,423.571,418.0,18200,426.0,418.0
607,2017/02/20,425.0,424.829,427.0,14000,427.0,422.0
608,2017/02/21,425.0,423.484,425.0,9100,425.0,420.0
609,2017/02/22,425.0,424.644,425.0,4500,425.0,424.0
610,2017/02/23,426.0,425.962,427.0,10400,427.0,423.0
611,2017/02/24,424.0,424.292,425.0,6500,426.0,423.0
612,2017/02/27,424.0,425.048,424.0,12500,426.0,424.0
613,2017/02/28,424.0,424.0,424.0,2700,425.0,423.0
614,2017/03/01,426.0,425.286,423.0,5600,427.0,423.0
615,2017/03/02,428.0,426.228,426.0,5700,428.0,425.0
616,2017/03/03,427.0,428.644,430.0,20500,430.0,427.0
617,2017/03/06,431.0,430.286,427.0,9800,432.0,427.0
618,2017/03/07,428.0,428.482,432.0,18900,432.0,425.0
619,2017/03/08,430.0,430.182,429.0,6600,432.0,429.0
620,2017/03/09,432.0,433.731,432.0,16000,436.0,432.0
621,2017/03/10,438.0,434.88,432.0,20800,441.0,432.0
622,2017/03/13,442.0,440.956,439.0,11400,444.0,438.0
623,2017/03/14,443.0,442.923,444.0,12900,444.0,440.0
624,2017/03/15,435.0,434.947,442.0,13300,442.0,432.0
625,2017/03/16,439.0,434.729,433.0,9600,439.0,430.0
626,2017/03/17,434.0,435.692,439.0,7800,439.0,433.0
627,2017/03/21,447.0,444.559,437.0,32000,452.0,437.0
628,2017/03/22,446.0,446.281,453.0,40600,453.0,433.0
629,2017/03/23,443.0,445.111,446.0,16200,449.0,442.0
630,2017/03/24,447.0,446.944,445.0,8900,449.0,445.0
631,2017/03/27,445.0,446.308,447.0,17200,450.0,444.0
632,2017/03/28,450.0,449.528,447.0,17800,450.0,447.0
633,2017/03/29,448.0,445.846,450.0,6500,450.0,441.0
634,2017/03/30,440.0,435.651,447.0,25800,448.0,427.0
635,2017/03/31,435.0,438.735,440.0,15100,444.0,435.0
636,2017/04/03,432.0,433.969,436.0,16300,437.0,431.0
637,2017/04/04,428.0,429.516,434.0,16100,434.0,425.0
638,2017/04/05,428.0,428.698,430.0,8600,431.0,428.0
639,2017/04/06,421.0,425.188,428.0,18600,428.0,421.0
640,2017/04/07,422.0,422.965,424.0,8600,426.0,421.0
641,2017/04/10,424.0,424.25,426.0,4400,426.0,422.0
642,2017/04/11,422.0,423.294,420.0,5100,425.0,420.0
643,2017/04/12,413.0,415.661,422.0,10900,422.0,411.0
644,2017/04/13,414.0,413.122,413.0,4900,415.0,412.0
645,2017/04/14,413.0,412.941,413.0,3400,414.0,412.0
646,2017/04/17,413.0,413.256,413.0,4300,415.0,412.0
647,2017/04/18,415.0,415.55,418.0,4000,418.0,411.0
648,2017/04/19,415.0,416.11,415.0,8200,419.0,415.0
649,2017/04/20,414.0,411.301,410.0,14300,414.0,410.0
650,2017/04/21,420.0,417.206,414.0,7300,421.0,414.0
651,2017/04/24,426.0,427.207,430.0,16900,432.0,421.0
652,2017/04/25,426.0,423.384,428.0,15900,428.0,413.0
653,2017/04/26,423.0,424.614,428.0,11400,428.0,423.0
654,2017/04/27,428.0,425.101,421.0,8900,428.0,421.0
655,2017/04/28,422.0,423.612,423.0,6700,426.0,422.0
656,2017/05/01,427.0,425.118,424.0,6800,427.0,424.0
657,2017/05/02,431.0,431.585,430.0,17100,434.0,428.0
658,2017/05/08,440.0,438.529,435.0,21000,443.0,435.0
659,2017/05/09,501.0,501.374,470.0,485700,519.0,470.0
660,2017/05/10,488.0,500.446,506.0,162400,508.0,488.0
661,2017/05/11,482.0,484.253,485.0,42300,488.0,481.0
662,2017/05/12,481.0,481.03,482.0,63500,486.0,476.0
663,2017/05/15,487.0,485.093,485.0,33500,490.0,479.0
664,2017/05/16,494.0,496.376,490.0,23700,505.0,490.0
665,2017/05/17,486.0,484.564,492.0,22000,492.0,479.0
666,2017/05/18,486.0,478.431,478.0,22500,486.0,472.0
667,2017/05/19,499.0,495.891,496.0,31100,500.0,490.0
668,2017/05/22,502.0,503.441,503.0,55600,509.0,495.0
669,2017/05/23,514.0,510.531,510.0,57800,514.0,507.0
670,2017/05/24,514.0,513.634,517.0,20500,517.0,511.0
671,2017/05/25,510.0,511.797,512.0,17700,514.0,510.0
672,2017/05/26,508.0,509.068,509.0,11700,514.0,507.0
673,2017/05/29,511.0,509.671,510.0,22500,515.0,505.0
674,2017/05/30,515.0,515.478,514.0,24700,517.0,513.0
675,2017/05/31,516.0,514.975,515.0,20100,518.0,511.0
676,2017/06/01,505.0,508.253,513.0,38700,517.0,499.0
677,2017/06/02,506.0,506.944,510.0,25100,510.0,502.0
678,2017/06/05,512.0,509.445,507.0,25400,514.0,506.0
679,2017/06/06,509.0,509.503,515.0,16900,515.0,506.0
680,2017/06/07,509.0,510.991,515.0,10800,515.0,509.0
681,2017/06/08,509.0,510.842,513.0,7600,514.0,509.0
682,2017/06/09,509.0,507.588,507.0,8500,510.0,506.0
683,2017/06/12,509.0,510.775,514.0,8000,514.0,508.0
684,2017/06/13,511.0,508.975,510.0,11800,511.0,505.0
685,2017/06/14,506.0,509.684,512.0,7900,512.0,506.0
686,2017/06/15,506.0,507.861,509.0,7200,512.0,506.0
687,2017/06/16,508.0,508.824,511.0,7400,511.0,506.0
688,2017/06/19,513.0,511.294,509.0,14300,514.0,509.0
689,2017/06/20,528.0,522.673,512.0,71000,530.0,512.0
690,2017/06/21,543.0,538.279,534.0,68500,548.0,530.0
691,2017/06/22,545.0,545.681,545.0,39500,548.0,542.0
692,2017/06/23,561.0,562.552,548.0,71600,582.0,547.0
693,2017/06/26,597.0,589.616,561.0,123800,619.0,558.0
694,2017/06/27,598.0,598.209,603.0,99900,610.0,587.0
695,2017/06/28,601.0,604.677,605.0,58900,612.0,599.0
696,2017/06/29,613.0,610.73,609.0,130500,618.0,603.0
697,2017/06/30,602.0,605.165,611.0,64900,611.0,599.0
698,2017/07/03,580.0,582.284,602.0,96200,602.0,565.0
699,2017/07/04,568.0,571.829,580.0,69700,580.0,565.0
700,2017/07/05,575.0,571.307,570.0,28700,578.0,564.0
701,2017/07/06,590.0,590.13,571.0,42200,599.0,571.0
702,2017/07/07,590.0,591.826,591.0,18400,596.0,588.0
703,2017/07/10,603.0,600.4,598.0,21000,605.0,594.0
704,2017/07/11,600.0,601.282,600.0,30100,607.0,594.0
705,2017/07/12,599.0,600.16,604.0,28800,606.0,591.0
706,2017/07/13,601.0,599.772,600.0,26300,605.0,595.0
707,2017/07/14,602.0,601.952,599.0,20600,607.0,596.0
708,2017/07/18,617.0,608.965,600.0,45100,617.0,600.0
709,2017/07/19,623.0,622.048,611.0,49900,629.0,609.0
710,2017/07/20,630.0,626.821,626.0,26300,630.0,624.0
711,2017/07/21,642.0,641.402,633.0,48000,649.0,633.0
712,2017/07/24,650.0,646.408,645.0,48100,650.0,642.0
713,2017/07/25,648.0,654.104,657.0,50800,667.0,645.0
714,2017/07/26,642.0,647.269,646.0,27900,657.0,641.0
715,2017/07/27,638.0,639.891,639.0,28400,645.0,637.0
716,2017/07/28,653.0,646.492,639.0,42900,653.0,639.0
717,2017/07/31,640.0,647.91,658.0,26600,662.0,640.0
718,2017/08/01,637.0,638.24,641.0,30400,646.0,630.0
719,2017/08/02,624.0,624.302,637.0,37100,638.0,615.0
720,2017/08/03,626.0,624.113,619.0,17700,628.0,618.0
721,2017/08/04,630.0,627.517,620.0,26900,633.0,616.0
722,2017/08/07,655.0,648.149,631.0,45700,665.0,631.0
723,2017/08/08,659.0,642.588,645.0,91200,660.0,622.0
724,2017/08/09,621.0,627.232,661.0,45200,661.0,611.0
725,2017/08/10,603.0,609.327,612.0,22000,617.0,603.0
726,2017/08/14,614.0,608.054,594.0,33100,619.0,589.0
727,2017/08/15,612.0,614.903,614.0,19600,620.0,610.0
728,2017/08/16,610.0,613.947,616.0,11400,618.0,608.0
729,2017/08/17,609.0,611.316,613.0,19000,616.0,607.0
730,2017/08/18,612.0,608.796,609.0,24500,613.0,604.0
731,2017/08/21,609.0,611.012,613.0,8300,613.0,605.0
732,2017/08/22,601.0,601.328,607.0,17100,607.0,595.0
733,2017/08/23,609.0,604.233,611.0,34400,611.0,590.0
734,2017/08/24,630.0,629.932,612.0,60500,644.0,612.0
735,2017/08/25,631.0,630.888,630.0,22400,637.0,623.0
736,2017/08/28,632.0,633.644,637.0,18000,639.0,629.0
737,2017/08/29,621.0,623.809,631.0,27200,631.0,619.0
738,2017/08/30,630.0,619.98,620.0,60800,633.0,606.0
739,2017/08/31,632.0,633.304,627.0,29900,636.0,626.0
740,2017/09/01,630.0,632.008,632.0,26200,637.0,626.0
741,2017/09/04,623.0,623.699,631.0,25900,634.0,619.0
742,2017/09/05,607.0,613.04,620.0,15100,626.0,605.0
743,2017/09/06,609.0,604.545,602.0,18900,611.0,599.0
744,2017/09/07,615.0,615.744,614.0,12500,619.0,611.0
745,2017/09/08,623.0,618.254,613.0,23600,624.0,610.0
746,2017/09/11,622.0,622.852,626.0,13500,627.0,616.0
747,2017/09/12,619.0,618.593,621.0,16200,625.0,613.0
748,2017/09/13,616.0,619.101,621.0,15800,625.0,613.0
749,2017/09/14,612.0,615.033,620.0,27400,620.0,610.0
750,2017/09/15,614.0,613.993,611.0,14400,619.0,610.0
751,2017/09/19,616.0,615.173,614.0,16800,617.0,612.0
752,2017/09/20,614.0,614.376,616.0,18100,620.0,611.0
753,2017/09/21,613.0,610.143,617.0,18900,617.0,604.0
754,2017/09/22,614.0,612.844,613.0,19900,618.0,606.0
755,2017/09/25,617.0,617.072,619.0,8300,619.0,612.0
756,2017/09/26,612.0,613.624,615.0,13300,618.0,611.0
757,2017/09/27,615.0,610.914,607.0,8100,615.0,607.0
758,2017/09/28,617.0,615.692,611.0,12000,619.0,611.0
759,2017/09/29,611.0,612.008,615.0,13400,615.0,609.0
760,2017/10/02,647.0,639.195,620.0,89200,660.0,619.0
761,2017/10/03,646.0,649.74,657.0,42700,659.0,640.0
762,2017/10/04,637.0,638.606,645.0,28200,650.0,629.0
763,2017/10/05,620.0,627.598,642.0,34800,645.0,620.0
764,2017/10/06,622.0,621.991,622.0,10900,626.0,618.0
765,2017/10/10,618.0,616.581,617.0,26500,623.0,612.0
766,2017/10/11,622.0,622.205,623.0,8300,625.0,620.0
767,2017/10/12,618.0,618.996,620.0,24800,626.0,615.0
768,2017/10/13,619.0,616.585,618.0,28700,624.0,608.0
769,2017/10/16,628.0,625.758,620.0,33900,630.0,619.0
770,2017/10/17,626.0,628.317,630.0,26200,634.0,624.0
771,2017/10/18,619.0,622.973,630.0,22400,630.0,619.0
772,2017/10/19,615.0,614.712,613.0,34000,630.0,611.0
773,2017/10/20,610.0,611.488,613.0,29100,619.0,607.0
774,2017/10/23,610.0,609.898,609.0,47100,614.0,604.0
775,2017/10/24,614.0,612.78,606.0,19500,615.0,606.0
776,2017/10/25,610.0,610.722,612.0,18000,616.0,609.0
777,2017/10/26,612.0,609.519,606.0,18300,614.0,606.0
778,2017/10/27,606.0,603.098,609.0,64200,610.0,598.0
779,2017/10/30,624.0,616.977,607.0,63700,624.0,606.0
780,2017/10/31,617.0,618.241,621.0,13300,622.0,616.0
781,2017/11/01,621.0,619.988,620.0,40900,623.0,615.0
782,2017/11/02,623.0,618.814,625.0,27400,625.0,614.0
783,2017/11/06,623.0,625.095,626.0,78000,630.0,617.0
784,2017/11/07,677.0,662.287,651.0,325400,689.0,645.0
785,2017/11/08,687.0,681.21,679.0,159400,693.0,667.0
786,2017/11/09,685.0,694.018,691.0,202900,717.0,660.0
787,2017/11/10,711.0,705.76,681.0,86800,714.0,681.0
788,2017/11/13,712.0,712.679,710.0,70300,719.0,702.0
789,2017/11/14,688.0,697.565,712.0,54300,713.0,685.0
790,2017/11/15,644.0,654.029,680.0,176100,680.0,636.0
791,2017/11/16,654.0,656.704,650.0,31800,662.0,650.0
792,2017/11/17,661.0,665.251,670.0,45800,680.0,657.0
793,2017/11/20,669.0,667.064,660.0,21900,676.0,659.0
794,2017/11/21,667.0,674.11,670.0,27400,684.0,665.0
795,2017/11/22,739.0,723.1,673.0,390800,753.0,673.0
796,2017/11/24,889.0,869.089,770.0,2219000,889.0,762.0
797,2017/11/27,1039.0,1011.08,995.0,869000,1039.0,991.0
798,2017/11/28,1015.0,1062.478,1067.0,9440900,1214.0,975.0
799,2017/11/29,981.0,1003.767,995.0,2422000,1047.0,960.0
800,2017/11/30,947.0,949.862,971.0,722400,976.0,930.0
801,2017/12/01,975.0,1022.515,974.0,3759500,1087.0,963.0
802,2017/12/04,904.0,928.276,967.0,1062900,972.0,895.0
803,2017/12/05,916.0,912.97,905.0,421500,936.0,901.0
804,2017/12/06,885.0,889.295,903.0,427000,912.0,876.0
805,2017/12/07,880.0,885.847,888.0,303000,907.0,871.0
806,2017/12/08,872.0,880.26,873.0,337900,905.0,869.0
807,2017/12/11,906.0,896.425,891.0,421700,920.0,873.0
808,2017/12/12,908.0,899.961,903.0,284700,915.0,882.0
809,2017/12/13,963.0,956.592,910.0,930400,986.0,904.0
810,2017/12/14,1003.0,1010.075,1038.0,1310500,1040.0,986.0
811,2017/12/15,999.0,1024.318,1017.0,1166500,1059.0,990.0
812,2017/12/18,1124.0,1107.334,1058.0,2472300,1149.0,1035.0
813,2017/12/19,1102.0,1089.699,1094.0,1247400,1141.0,1045.0
814,2017/12/20,1083.0,1099.174,1132.0,833000,1160.0,1056.0
815,2017/12/21,1080.0,1055.331,1070.0,529800,1083.0,1025.0
816,2017/12/22,1062.0,1083.745,1091.0,485800,1128.0,1047.0
817,2017/12/25,1037.0,1036.806,1062.0,281300,1071.0,1020.0
818,2017/12/26,1039.0,1042.014,1047.0,265500,1059.0,1026.0
819,2017/12/27,1071.0,1061.253,1035.0,283300,1083.0,1029.0
820,2017/12/28,1050.0,1062.485,1081.0,185100,1085.0,1050.0
821,2017/12/29,1066.0,1064.835,1050.0,185600,1077.0,1044.0
822,2018/01/04,1096.0,1092.693,1095.0,308400,1110.0,1071.0
823,2018/01/05,1076.0,1081.24,1092.0,188900,1095.0,1072.0
824,2018/01/09,1086.0,1106.829,1093.0,327200,1135.0,1079.0
825,2018/01/10,1092.0,1076.834,1071.0,158700,1095.0,1061.0
826,2018/01/11,1134.0,1126.188,1081.0,564900,1156.0,1065.0
827,2018/01/12,1117.0,1148.355,1150.0,547600,1187.0,1108.0
828,2018/01/15,1098.0,1093.809,1107.0,220400,1115.0,1075.0
829,2018/01/16,1111.0,1113.435,1104.0,225300,1135.0,1087.0
830,2018/01/17,1075.0,1079.813,1105.0,248600,1111.0,1070.0
831,2018/01/18,1023.0,1045.981,1079.0,319900,1082.0,1022.0
832,2018/01/19,1029.0,1026.464,1024.0,130100,1035.0,1013.0
833,2018/01/22,1025.0,1015.711,1009.0,100200,1029.0,1003.0
834,2018/01/23,1026.0,1030.106,1034.0,77200,1037.0,1024.0
835,2018/01/24,1024.0,1028.032,1033.0,111600,1050.0,1017.0
836,2018/01/25,1016.0,1014.846,1010.0,73200,1021.0,1009.0
837,2018/01/26,1023.0,1026.008,1021.0,74700,1034.0,1021.0
838,2018/01/29,1017.0,1021.872,1021.0,85600,1030.0,1017.0
839,2018/01/30,991.0,1000.735,1013.0,189000,1019.0,984.0
840,2018/01/31,994.0,993.521,981.0,81000,1005.0,981.0
841,2018/02/01,1019.0,1012.641,998.0,75400,1021.0,998.0
842,2018/02/02,1009.0,1003.358,1019.0,75100,1019.0,989.0
843,2018/02/05,977.0,972.662,964.0,153200,989.0,964.0
844,2018/02/06,965.0,950.61,950.0,482400,1019.0,891.0
845,2018/02/07,921.0,980.696,1040.0,226800,1040.0,916.0
846,2018/02/08,996.0,973.106,930.0,181900,1009.0,930.0
847,2018/02/09,994.0,966.024,924.0,103600,995.0,924.0
848,2018/02/13,1022.0,1037.411,1019.0,232000,1065.0,1001.0
849,2018/02/14,996.0,1011.214,1008.0,147900,1047.0,982.0
850,2018/02/15,1046.0,1043.16,1021.0,172200,1060.0,1012.0
851,2018/02/16,1043.0,1056.586,1046.0,171100,1075.0,1039.0
852,2018/02/19,1089.0,1089.573,1065.0,182300,1106.0,1054.0
853,2018/02/20,1122.0,1127.655,1100.0,297600,1145.0,1094.0
854,2018/02/21,1109.0,1118.5,1117.0,101700,1140.0,1103.0
855,2018/02/22,1091.0,1092.315,1100.0,85700,1115.0,1074.0
856,2018/02/23,1110.0,1105.227,1086.0,87100,1120.0,1086.0
857,2018/02/26,1103.0,1109.623,1127.0,76900,1132.0,1094.0
858,2018/02/27,1086.0,1091.664,1103.0,68700,1109.0,1083.0
859,2018/02/28,1110.0,1107.474,1081.0,116600,1127.0,1081.0
860,2018/03/01,1073.0,1074.705,1104.0,91800,1106.0,1062.0
861,2018/03/02,1054.0,1060.256,1043.0,89200,1083.0,1043.0
862,2018/03/05,1011.0,1023.001,1054.0,82300,1054.0,1007.0
863,2018/03/06,1029.0,1035.071,1028.0,33900,1054.0,1023.0
864,2018/03/07,1000.0,1005.286,1020.0,55000,1022.0,998.0
865,2018/03/08,1011.0,1004.593,999.0,30200,1013.0,992.0
866,2018/03/09,1030.0,1025.081,1018.0,60600,1035.0,1012.0
867,2018/03/12,1041.0,1036.005,1040.0,56800,1050.0,1021.0
868,2018/03/13,1068.0,1058.255,1034.0,51400,1072.0,1034.0
869,2018/03/14,1095.0,1075.361,1061.0,89600,1102.0,1052.0
870,2018/03/15,1084.0,1082.451,1095.0,89100,1110.0,1059.0
871,2018/03/16,1061.0,1064.147,1086.0,63900,1090.0,1050.0
872,2018/03/19,1034.0,1033.066,1062.0,53100,1063.0,1016.0
873,2018/03/20,1042.0,1027.653,1014.0,45300,1044.0,1009.0
874,2018/03/22,1017.0,1021.527,1035.0,32800,1037.0,1011.0
875,2018/03/23,952.0,963.235,979.0,91700,983.0,947.0
876,2018/03/26,959.0,934.851,937.0,63900,959.0,912.0
877,2018/03/27,978.0,972.811,979.0,58600,981.0,962.0
878,2018/03/28,969.0,959.942,951.0,41200,970.0,936.0
879,2018/03/29,977.0,968.602,981.0,44700,988.0,954.0
880,2018/03/30,994.0,989.719,992.0,25600,1002.0,975.0
881,2018/04/02,978.0,982.398,984.0,29400,994.0,976.0
882,2018/04/03,967.0,963.058,961.0,30900,973.0,950.0
883,2018/04/04,959.0,951.633,967.0,69000,970.0,941.0
884,2018/04/05,961.0,955.058,960.0,48500,965.0,942.0
885,2018/04/06,945.0,947.462,955.0,52200,958.0,941.0
886,2018/04/09,947.0,935.478,932.0,51700,948.0,919.0
887,2018/04/10,945.0,943.257,940.0,30300,954.0,927.0
888,2018/04/11,950.0,943.148,941.0,42000,954.0,924.0
889,2018/04/12,941.0,955.874,953.0,41300,976.0,937.0
890,2018/04/13,963.0,962.671,953.0,41300,974.0,952.0
891,2018/04/16,960.0,965.598,972.0,38600,976.0,957.0
892,2018/04/17,967.0,965.896,962.0,42300,981.0,952.0
893,2018/04/18,1016.0,1005.426,978.0,55200,1022.0,976.0
894,2018/04/19,1033.0,1028.877,1005.0,57700,1040.0,1005.0
895,2018/04/20,1091.0,1079.969,1041.0,159900,1096.0,1036.0
896,2018/04/23,1106.0,1096.82,1103.0,100400,1111.0,1069.0
897,2018/04/24,1115.0,1109.319,1108.0,100200,1122.0,1084.0
898,2018/04/25,1101.0,1106.108,1110.0,61000,1119.0,1097.0
899,2018/04/26,1058.0,1061.06,1101.0,178500,1101.0,1042.0
900,2018/04/27,1048.0,1039.234,1040.0,69600,1050.0,1029.0
901,2018/05/01,1042.0,1040.413,1038.0,37800,1050.0,1027.0
902,2018/05/02,1074.0,1069.869,1050.0,51300,1081.0,1047.0
903,2018/05/07,1062.0,1076.687,1088.0,95100,1095.0,1062.0
904,2018/05/08,1174.0,1152.785,1099.0,490600,1177.0,1080.0
905,2018/05/09,1147.0,1159.497,1173.0,142800,1180.0,1138.0
906,2018/05/10,1115.0,1123.954,1149.0,85600,1149.0,1101.0
907,2018/05/11,1124.0,1118.949,1109.0,66200,1131.0,1101.0
908,2018/05/14,1096.0,1110.248,1134.0,68500,1134.0,1091.0
909,2018/05/15,1056.0,1065.753,1091.0,116100,1093.0,1046.0
910,2018/05/16,1076.0,1067.726,1052.0,44900,1078.0,1049.0
911,2018/05/17,1127.0,1114.965,1071.0,97500,1131.0,1071.0
912,2018/05/18,1131.0,1140.149,1133.0,113800,1158.0,1124.0
913,2018/05/21,1159.0,1143.008,1129.0,93400,1161.0,1116.0
914,2018/05/22,1150.0,1147.77,1158.0,36500,1158.0,1139.0
915,2018/05/23,1124.0,1128.937,1138.0,38200,1149.0,1118.0
916,2018/05/24,1092.0,1099.613,1120.0,53500,1120.0,1085.0
917,2018/05/25,1077.0,1089.668,1097.0,43100,1109.0,1072.0
918,2018/05/28,1060.0,1071.58,1077.0,29500,1090.0,1059.0
919,2018/05/29,1058.0,1058.418,1058.0,23200,1068.0,1048.0
920,2018/05/30,1036.0,1033.943,1038.0,38700,1042.0,1021.0
921,2018/05/31,1053.0,1044.901,1036.0,16100,1053.0,1031.0
922,2018/06/01,1048.0,1051.431,1050.0,26200,1065.0,1042.0
923,2018/06/04,1074.0,1066.485,1050.0,27400,1077.0,1047.0
924,2018/06/05,1049.0,1048.774,1081.0,30500,1081.0,1037.0
925,2018/06/06,1063.0,1059.704,1049.0,34400,1070.0,1045.0
926,2018/06/07,1100.0,1090.726,1063.0,54700,1100.0,1063.0
927,2018/06/08,1111.0,1105.904,1100.0,48900,1113.0,1097.0
928,2018/06/11,1132.0,1122.24,1111.0,44100,1132.0,1109.0
929,2018/06/12,1128.0,1124.259,1120.0,34800,1134.0,1118.0
930,2018/06/13,1113.0,1116.338,1119.0,27800,1124.0,1111.0
931,2018/06/14,1095.0,1101.835,1107.0,13900,1109.0,1095.0
932,2018/06/15,1151.0,1135.477,1094.0,65400,1155.0,1090.0
933,2018/06/18,1174.0,1182.707,1160.0,251300,1235.0,1143.0
934,2018/06/19,1192.0,1208.449,1174.0,224900,1250.0,1149.0
935,2018/06/20,1285.0,1270.101,1252.0,381100,1300.0,1241.0
936,2018/06/21,1332.0,1333.506,1300.0,437800,1375.0,1293.0
937,2018/06/22,1305.0,1322.698,1329.0,204300,1356.0,1289.0
938,2018/06/25,1299.0,1313.829,1328.0,83200,1329.0,1295.0
939,2018/06/26,1242.0,1250.6,1280.0,129400,1292.0,1222.0
940,2018/06/27,1308.0,1290.135,1227.0,165700,1314.0,1227.0
941,2018/06/28,1341.0,1320.468,1300.0,98600,1341.0,1270.0
942,2018/06/29,1365.0,1355.164,1350.0,136500,1373.0,1334.0
943,2018/07/02,1359.0,1381.565,1395.0,161600,1415.0,1351.0
944,2018/07/03,1363.0,1367.233,1363.0,120500,1405.0,1335.0
945,2018/07/04,1373.0,1382.455,1360.0,157700,1413.0,1351.0
946,2018/07/05,1311.0,1344.824,1373.0,164600,1400.0,1303.0
947,2018/07/06,1375.0,1356.984,1311.0,248300,1410.0,1287.0
948,2018/07/09,1400.0,1408.606,1380.0,223100,1440.0,1376.0
949,2018/07/10,1397.0,1407.35,1421.0,121400,1430.0,1385.0
950,2018/07/11,1465.0,1436.563,1398.0,192700,1468.0,1376.0
951,2018/07/12,1468.0,1469.41,1474.0,118200,1491.0,1446.0
952,2018/07/13,1472.0,1461.74,1489.0,82300,1489.0,1448.0
953,2018/07/17,1510.0,1494.558,1480.0,99100,1510.0,1465.0
954,2018/07/18,1537.0,1522.234,1511.0,145600,1545.0,1485.0
955,2018/07/19,1550.0,1553.767,1537.0,116600,1570.0,1537.0
956,2018/07/20,1575.0,1585.789,1552.0,182800,1611.0,1547.0
957,2018/07/23,1510.0,1528.866,1557.0,177000,1575.0,1504.0
958,2018/07/24,1525.0,1520.684,1512.0,116000,1551.0,1507.0
959,2018/07/25,1511.0,1512.456,1525.0,70600,1525.0,1500.0
960,2018/07/26,1481.0,1495.63,1500.0,85100,1521.0,1481.0
961,2018/07/27,1472.0,1474.887,1475.0,67100,1497.0,1460.0
962,2018/07/30,1372.0,1394.634,1471.0,209800,1471.0,1360.0
963,2018/07/31,1393.0,1387.322,1362.0,85600,1401.0,1362.0
964,2018/08/01,1374.0,1381.441,1415.0,57800,1420.0,1364.0
965,2018/08/02,1366.0,1371.016,1364.0,32000,1384.0,1363.0
966,2018/08/03,1314.0,1330.482,1366.0,99100,1374.0,1310.0
967,2018/08/06,1421.0,1404.545,1344.0,234800,1449.0,1334.0
968,2018/08/07,1560.0,1460.24,1391.0,430000,1564.0,1315.0
969,2018/08/08,1496.0,1554.741,1560.0,242500,1640.0,1485.0
970,2018/08/09,1567.0,1535.813,1496.0,138700,1583.0,1472.0
971,2018/08/10,1550.0,1562.628,1563.0,98400,1604.0,1529.0
972,2018/08/13,1529.0,1555.682,1569.0,115300,1615.0,1505.0
973,2018/08/14,1616.0,1611.974,1562.0,188300,1640.0,1539.0
974,2018/08/15,1607.0,1615.503,1640.0,136000,1670.0,1571.0
975,2018/08/16,1533.0,1546.237,1585.0,99100,1602.0,1521.0
976,2018/08/17,1548.0,1552.184,1550.0,35300,1580.0,1540.0
977,2018/08/20,1495.0,1508.184,1535.0,50100,1535.0,1492.0
978,2018/08/21,1425.0,1441.12,1475.0,99700,1497.0,1403.0
979,2018/08/22,1450.0,1434.216,1411.0,81100,1461.0,1410.0
980,2018/08/23,1548.0,1523.559,1476.0,98500,1569.0,1476.0
981,2018/08/24,1500.0,1514.207,1568.0,57000,1570.0,1493.0
982,2018/08/27,1448.0,1466.907,1506.0,64200,1506.0,1441.0
983,2018/08/28,1419.0,1433.137,1449.0,51000,1473.0,1410.0
984,2018/08/29,1420.0,1435.943,1414.0,47500,1470.0,1412.0
985,2018/08/30,1423.0,1420.262,1435.0,55700,1443.0,1403.0
986,2018/08/31,1435.0,1418.399,1422.0,48100,1444.0,1387.0
987,2018/09/03,1369.0,1385.096,1424.0,78500,1432.0,1362.0
988,2018/09/04,1403.0,1395.919,1369.0,34400,1412.0,1365.0
989,2018/09/05,1347.0,1360.063,1391.0,63900,1394.0,1346.0
990,2018/09/06,1334.0,1334.132,1333.0,47700,1362.0,1319.0
991,2018/09/07,1317.0,1309.286,1327.0,42000,1327.0,1289.0
992,2018/09/10,1312.0,1302.773,1301.0,38300,1322.0,1277.0
993,2018/09/11,1266.0,1274.124,1301.0,41000,1301.0,1260.0
994,2018/09/12,1262.0,1267.831,1289.0,59000,1309.0,1242.0
995,2018/09/13,1235.0,1240.288,1249.0,48000,1269.0,1229.0
996,2018/09/14,1284.0,1261.684,1240.0,55100,1293.0,1231.0
997,2018/09/18,1258.0,1249.792,1266.0,65900,1279.0,1219.0
998,2018/09/19,1265.0,1265.95,1264.0,27800,1285.0,1258.0
999,2018/09/20,1234.0,1233.693,1266.0,65700,1275.0,1214.0
1000,2018/09/21,1240.0,1230.276,1221.0,52900,1249.0,1205.0
1001,2018/09/25,1287.0,1259.503,1240.0,77000,1287.0,1215.0
1002,2018/09/26,1353.0,1329.535,1290.0,113400,1359.0,1288.0
1003,2018/09/27,1282.0,1308.35,1350.0,72500,1359.0,1281.0
1004,2018/09/28,1275.0,1297.761,1312.0,63100,1328.0,1262.0
1005,2018/10/01,1323.0,1309.218,1284.0,45400,1327.0,1279.0
1006,2018/10/02,1250.0,1271.322,1324.0,76400,1324.0,1250.0
1007,2018/10/03,1250.0,1242.643,1245.0,44500,1258.0,1230.0
1008,2018/10/04,1237.0,1239.491,1251.0,32200,1267.0,1223.0
1009,2018/10/05,1182.0,1194.852,1231.0,62900,1231.0,1181.0
1010,2018/10/09,1130.0,1140.042,1171.0,47900,1173.0,1127.0
1011,2018/10/10,1123.0,1119.467,1152.0,50300,1180.0,1100.0
1012,2018/10/11,1077.0,1058.021,1033.0,57200,1088.0,1025.0
1013,2018/10/12,1113.0,1092.878,1053.0,34500,1119.0,1053.0
1014,2018/10/15,1056.0,1074.994,1114.0,50000,1120.0,1051.0
1015,2018/10/16,1077.0,1068.234,1059.0,21800,1082.0,1052.0
1016,2018/10/17,1129.0,1117.389,1095.0,33700,1134.0,1092.0
1017,2018/10/18,1091.0,1107.466,1140.0,26400,1140.0,1089.0
1018,2018/10/19,1091.0,1075.949,1062.0,17800,1093.0,1055.0
1019,2018/10/22,1107.0,1115.316,1137.0,28200,1149.0,1099.0
1020,2018/10/23,1100.0,1101.34,1104.0,38000,1115.0,1096.0
1021,2018/10/24,1102.0,1099.611,1103.0,32900,1116.0,1080.0
1022,2018/10/25,1055.0,1059.217,1065.0,62600,1080.0,1041.0
1023,2018/10/26,1042.0,1036.034,1060.0,76000,1067.0,1002.0
1024,2018/10/29,1016.0,1024.859,1061.0,38200,1071.0,1003.0
1025,2018/10/30,1050.0,1034.357,999.0,46200,1065.0,987.0
1026,2018/10/31,1142.0,1130.484,1080.0,55600,1160.0,1065.0
1027,2018/11/01,1255.0,1219.658,1160.0,137900,1266.0,1139.0
1028,2018/11/02,1207.0,1208.893,1233.0,75400,1235.0,1177.0
1029,2018/11/05,1207.0,1184.741,1183.0,93900,1230.0,1151.0
1030,2018/11/06,1080.0,1101.538,1151.0,191400,1157.0,1079.0
1031,2018/11/07,1034.0,1055.434,1088.0,87400,1090.0,1032.0
1032,2018/11/08,1044.0,1036.258,1045.0,111200,1070.0,1013.0
1033,2018/11/09,1050.0,1042.035,1034.0,72400,1057.0,1024.0
1034,2018/11/12,1023.0,1035.808,1045.0,49900,1068.0,1021.0
1035,2018/11/13,1004.0,995.339,988.0,37800,1013.0,972.0
1036,2018/11/14,990.0,992.593,1005.0,37300,1012.0,985.0
1037,2018/11/15,975.0,980.194,985.0,34500,1005.0,965.0
1038,2018/11/16,992.0,995.725,977.0,29800,1009.0,972.0
1039,2018/11/19,1000.0,992.388,980.0,35100,1014.0,970.0
1040,2018/11/20,961.0,967.927,989.0,46300,990.0,951.0
1041,2018/11/21,957.0,949.788,933.0,85300,968.0,921.0
1042,2018/11/22,960.0,968.777,966.0,89100,997.0,949.0
1043,2018/11/26,973.0,964.233,960.0,32200,978.0,934.0
1044,2018/11/27,965.0,966.225,973.0,38700,979.0,946.0
1045,2018/11/28,1024.0,1009.7,968.0,68100,1042.0,968.0
1046,2018/11/29,1028.0,1020.802,1033.0,24200,1035.0,1007.0
1047,2018/11/30,1079.0,1055.319,1010.0,61100,1092.0,1010.0
1048,2018/12/03,1076.0,1079.77,1090.0,38300,1097.0,1066.0
1049,2018/12/04,1041.0,1056.607,1079.0,27200,1080.0,1028.0
1050,2018/12/05,1028.0,1027.072,1020.0,29100,1049.0,1004.0
1051,2018/12/06,1005.0,1008.128,1025.0,33600,1025.0,998.0
1052,2018/12/07,983.0,986.047,1003.0,38700,1012.0,972.0
1053,2018/12/10,930.0,941.385,968.0,31400,970.0,928.0
1054,2018/12/11,945.0,938.344,930.0,33700,955.0,910.0
1055,2018/12/12,957.0,955.152,945.0,15800,966.0,940.0
1056,2018/12/13,975.0,963.66,957.0,26800,978.0,953.0
1057,2018/12/14,941.0,954.824,963.0,27300,970.0,938.0
1058,2018/12/17,919.0,924.787,926.0,21600,945.0,911.0
1059,2018/12/18,868.0,868.645,891.0,94200,894.0,840.0
1060,2018/12/19,892.0,871.829,857.0,33900,897.0,844.0
1061,2018/12/20,833.0,846.551,873.0,39200,879.0,821.0
1062,2018/12/21,835.0,828.23,818.0,76400,840.0,812.0
1063,2018/12/25,778.0,783.278,799.0,70400,799.0,762.0
1064,2018/12/26,810.0,802.275,789.0,53800,829.0,781.0
1065,2018/12/27,885.0,867.579,855.0,38500,892.0,841.0
1066,2018/12/28,877.0,884.761,900.0,24300,918.0,871.0
1067,2019/01/04,836.0,828.589,852.0,39400,852.0,809.0
1068,2019/01/07,871.0,868.678,868.0,27600,880.0,845.0
1069,2019/01/08,898.0,896.111,883.0,17200,906.0,880.0
1070,2019/01/09,892.0,894.524,909.0,14500,909.0,883.0
1071,2019/01/10,870.0,865.323,896.0,23500,896.0,846.0
1072,2019/01/11,883.0,880.313,875.0,13100,892.0,873.0
1073,2019/01/15,900.0,895.233,886.0,18000,910.0,861.0
1074,2019/01/16,917.0,922.94,904.0,34800,950.0,903.0
1075,2019/01/17,920.0,921.075,926.0,18700,934.0,900.0
1076,2019/01/18,920.0,923.047,931.0,21300,937.0,909.0
1077,2019/01/21,909.0,915.036,935.0,36000,940.0,901.0
1078,2019/01/22,911.0,906.777,919.0,16600,919.0,887.0
1079,2019/01/23,901.0,896.193,910.0,18100,910.0,888.0
1080,2019/01/24,900.0,897.433,901.0,23100,916.0,881.0
1081,2019/01/25,931.0,934.704,915.0,35800,955.0,915.0
1082,2019/01/28,920.0,930.7,940.0,23000,949.0,920.0
1083,2019/01/29,936.0,924.261,920.0,18800,940.0,910.0
1084,2019/01/30,916.0,926.439,924.0,24600,948.0,916.0
1085,2019/01/31,969.0,960.643,928.0,30800,977.0,928.0
1086,2019/02/01,1051.0,1020.731,973.0,72900,1058.0,972.0
1087,2019/02/04,1087.0,1084.774,1058.0,72200,1112.0,1055.0
1088,2019/02/05,1035.0,1035.319,986.0,220000,1080.0,978.0
1089,2019/02/06,986.0,1015.896,1060.0,71300,1060.0,985.0
1090,2019/02/07,948.0,963.305,996.0,53700,1002.0,944.0
1091,2019/02/08,967.0,943.075,938.0,50500,972.0,926.0
1092,2019/02/12,990.0,976.119,967.0,39600,992.0,947.0
1093,2019/02/13,997.0,997.72,1002.0,19300,1004.0,992.0
1094,2019/02/14,965.0,975.521,1000.0,16500,1000.0,961.0
1095,2019/02/15,986.0,970.42,957.0,22600,990.0,938.0
1096,2019/02/18,1015.0,1036.662,1003.0,71500,1072.0,1002.0
1097,2019/02/19,1079.0,1057.726,1016.0,49200,1080.0,1015.0
1098,2019/02/20,1039.0,1042.889,1083.0,46900,1083.0,1020.0
1099,2019/02/21,1019.0,1021.727,1045.0,23800,1045.0,1015.0
1100,2019/02/22,1048.0,1035.957,1019.0,23200,1052.0,1009.0
1101,2019/02/25,1057.0,1053.269,1059.0,25300,1061.0,1040.0
1102,2019/02/26,1019.0,1020.863,1052.0,38700,1052.0,1005.0
1103,2019/02/27,1025.0,1018.076,1014.0,23600,1031.0,1004.0
1104,2019/02/28,981.0,993.502,1025.0,43000,1025.0,981.0
1105,2019/03/01,963.0,970.235,982.0,38300,996.0,958.0
1106,2019/03/04,984.0,976.224,972.0,25000,986.0,959.0
1107,2019/03/05,981.0,970.65,974.0,22600,982.0,960.0
1108,2019/03/06,969.0,967.908,976.0,15200,976.0,961.0
1109,2019/03/07,922.0,932.843,960.0,47800,960.0,918.0
1110,2019/03/08,856.0,879.887,900.0,71500,908.0,851.0
1111,2019/03/11,895.0,882.687,859.0,30700,897.0,859.0
1112,2019/03/12,891.0,898.927,911.0,37000,918.0,880.0
1113,2019/03/13,874.0,878.664,891.0,25900,902.0,866.0
1114,2019/03/14,857.0,863.073,880.0,30300,885.0,852.0
1115,2019/03/15,852.0,860.38,858.0,30000,874.0,850.0
1116,2019/03/18,870.0,865.304,855.0,28600,875.0,853.0
1117,2019/03/19,873.0,878.495,880.0,28700,905.0,870.0
1118,2019/03/20,911.0,897.644,878.0,37400,915.0,877.0
1119,2019/03/22,947.0,930.872,920.0,44400,947.0,915.0
1120,2019/03/25,907.0,899.346,917.0,54400,917.0,887.0
1121,2019/03/26,933.0,930.688,904.0,47700,947.0,904.0
1122,2019/03/27,936.0,929.444,938.0,28800,940.0,914.0
1123,2019/03/28,925.0,920.166,928.0,24700,928.0,911.0
1124,2019/03/29,908.0,905.946,925.0,25900,925.0,892.0
1125,2019/04/01,927.0,931.081,919.0,25900,940.0,918.0
1126,2019/04/02,930.0,930.653,936.0,21600,939.0,923.0
1127,2019/04/03,952.0,943.75,930.0,26800,956.0,923.0
1128,2019/04/04,966.0,969.645,959.0,33200,985.0,951.0
1129,2019/04/05,985.0,978.386,976.0,26400,986.0,966.0
1130,2019/04/08,968.0,969.126,985.0,15900,985.0,961.0
1131,2019/04/09,928.0,934.747,968.0,44300,968.0,922.0
1132,2019/04/10,922.0,917.358,918.0,21800,928.0,903.0
1133,2019/04/11,908.0,908.815,922.0,26500,922.0,901.0
1134,2019/04/12,914.0,907.749,909.0,23900,917.0,901.0
1135,2019/04/15,934.0,929.062,928.0,30500,942.0,916.0
1136,2019/04/16,913.0,917.121,919.0,28100,928.0,910.0
1137,2019/04/17,921.0,912.773,913.0,31700,929.0,906.0
1138,2019/04/18,909.0,908.845,921.0,23200,922.0,904.0
1139,2019/04/19,918.0,909.881,912.0,19300,920.0,902.0
1140,2019/04/22,904.0,901.724,914.0,26800,914.0,892.0
1141,2019/04/23,911.0,902.722,899.0,36000,911.0,890.0
1142,2019/04/24,897.0,906.249,914.0,16900,918.0,897.0
1143,2019/04/25,905.0,900.265,895.0,29100,910.0,882.0
1144,2019/04/26,902.0,898.874,901.0,31000,909.0,888.0
1145,2019/05/07,915.0,909.653,902.0,49300,923.0,894.0
1146,2019/05/08,800.0,804.527,824.0,161100,825.0,790.0
1147,2019/05/09,750.0,764.864,791.0,125400,794.0,741.0
1148,2019/05/10,727.0,736.339,740.0,71400,753.0,721.0
1149,2019/05/13,701.0,711.516,725.0,51400,725.0,700.0
1150,2019/05/14,706.0,702.1,686.0,62100,732.0,680.0
1151,2019/05/15,719.0,710.51,721.0,35300,723.0,700.0
1152,2019/05/16,706.0,709.724,721.0,22500,722.0,702.0
1153,2019/05/17,730.0,724.514,710.0,32300,732.0,710.0
1154,2019/05/20,707.0,716.816,735.0,38500,740.0,703.0
1155,2019/05/21,701.0,694.765,703.0,37800,703.0,688.0
1156,2019/05/22,685.0,691.407,705.0,59200,710.0,681.0
1157,2019/05/23,682.0,678.202,680.0,40700,685.0,668.0
1158,2019/05/24,687.0,682.622,672.0,57100,698.0,671.0
1159,2019/05/27,683.0,681.546,683.0,25300,688.0,676.0
1160,2019/05/28,688.0,686.545,683.0,20000,698.0,677.0
1161,2019/05/29,680.0,676.846,682.0,29300,687.0,669.0
1162,2019/05/30,685.0,679.761,678.0,17600,687.0,672.0
1163,2019/05/31,663.0,669.409,682.0,44300,682.0,663.0
1164,2019/06/03,647.0,650.693,658.0,35200,660.0,643.0
1165,2019/06/04,655.0,641.771,642.0,56700,656.0,631.0
1166,2019/06/05,674.0,674.021,672.0,37800,679.0,665.0
1167,2019/06/06,665.0,663.588,678.0,33000,678.0,656.0
1168,2019/06/07,664.0,657.917,662.0,33800,666.0,647.0
1169,2019/06/10,673.0,673.073,678.0,27600,684.0,665.0
1170,2019/06/11,675.0,672.014,673.0,28400,676.0,662.0
1171,2019/06/12,668.0,670.88,675.0,25900,679.0,667.0
1172,2019/06/13,661.0,659.091,665.0,25300,668.0,651.0
1173,2019/06/14,661.0,663.788,661.0,22200,671.0,657.0
1174,2019/06/17,655.0,652.494,658.0,25900,660.0,648.0
1175,2019/06/18,641.0,647.816,653.0,29900,661.0,641.0
1176,2019/06/19,661.0,656.314,651.0,34100,663.0,647.0
1177,2019/06/20,660.0,656.439,663.0,25300,665.0,649.0
1178,2019/06/21,665.0,669.615,664.0,43900,680.0,654.0
1179,2019/06/24,655.0,659.079,665.0,13900,666.0,653.0
1180,2019/06/25,656.0,657.807,666.0,29600,667.0,648.0
1181,2019/06/26,641.0,646.038,656.0,21300,656.0,641.0
1182,2019/06/27,650.0,647.387,642.0,15000,654.0,640.0
1183,2019/06/28,643.0,644.286,650.0,25200,651.0,641.0
1184,2019/07/01,665.0,664.265,660.0,41500,669.0,656.0
1185,2019/07/02,676.0,673.892,675.0,23200,676.0,667.0
1186,2019/07/03,675.0,673.431,676.0,13000,681.0,668.0
1187,2019/07/04,686.0,682.436,671.0,23600,686.0,671.0
1188,2019/07/05,690.0,689.098,688.0,43000,694.0,683.0
1189,2019/07/08,683.0,688.197,692.0,22300,695.0,681.0
1190,2019/07/09,677.0,679.03,678.0,30300,694.0,669.0
1191,2019/07/10,674.0,673.721,675.0,13600,677.0,670.0
1192,2019/07/11,676.0,674.765,672.0,6800,678.0,669.0
1193,2019/07/12,674.0,668.733,672.0,24700,674.0,661.0
1194,2019/07/16,656.0,662.151,672.0,19900,672.0,656.0
1195,2019/07/17,659.0,654.913,658.0,12600,659.0,646.0
1196,2019/07/18,640.0,643.92,659.0,24900,659.0,640.0
1197,2019/07/19,658.0,652.914,643.0,19700,660.0,643.0
1198,2019/07/22,671.0,664.803,656.0,19300,671.0,656.0
1199,2019/07/23,689.0,679.972,677.0,35900,689.0,675.0
1200,2019/07/24,688.0,687.54,689.0,11300,689.0,683.0
1201,2019/07/25,691.0,690.493,688.0,27200,695.0,683.0
1202,2019/07/26,690.0,688.876,692.0,20100,695.0,684.0
1203,2019/07/29,681.0,682.563,691.0,13500,691.0,679.0
1204,2019/07/30,677.0,677.333,681.0,21600,684.0,667.0
1205,2019/07/31,676.0,676.186,675.0,8600,680.0,673.0
1206,2019/08/01,678.0,669.359,669.0,10300,678.0,663.0
1207,2019/08/02,651.0,654.24,668.0,41200,670.0,647.0
1208,2019/08/05,621.0,625.325,651.0,49500,651.0,607.0
1209,2019/08/06,643.0,628.433,620.0,52200,650.0,606.0
1210,2019/08/07,649.0,647.098,645.0,33600,652.0,641.0
1211,2019/08/08,645.0,644.738,646.0,16800,652.0,638.0
1212,2019/08/09,644.0,644.152,652.0,7900,652.0,638.0
1213,2019/08/13,629.0,628.526,640.0,19000,640.0,621.0
1214,2019/08/14,633.0,631.83,625.0,27000,642.0,625.0
1215,2019/08/15,621.0,616.145,617.0,20700,625.0,604.0
1216,2019/08/16,617.0,619.189,618.0,10600,627.0,613.0
1217,2019/08/19,626.0,626.032,622.0,12500,630.0,621.0
1218,2019/08/20,634.0,632.646,633.0,8200,634.0,629.0
1219,2019/08/21,633.0,633.274,631.0,7300,636.0,628.0
1220,2019/08/22,628.0,633.374,637.0,13900,643.0,627.0
1221,2019/08/23,625.0,629.301,634.0,11300,634.0,624.0
