,Date,Close,VWAP,Open,Volume,High,Low
0,2014/08/25,535.0,534.247,534.0,18600,538.0,531.0
1,2014/08/26,535.0,535.618,537.0,10200,538.0,534.0
2,2014/08/27,537.0,535.125,534.0,7200,537.0,532.0
3,2014/08/28,537.0,534.803,535.0,7600,537.0,531.0
4,2014/08/29,537.0,530.303,527.0,21800,538.0,527.0
5,2014/09/01,537.0,535.816,536.0,15200,538.0,533.0
6,2014/09/02,532.0,533.842,531.0,31700,538.0,528.0
7,2014/09/03,531.0,530.033,538.0,30200,538.0,521.0
8,2014/09/04,526.0,525.901,530.0,14100,530.0,522.0
9,2014/09/05,524.0,526.428,532.0,18000,532.0,524.0
10,2014/09/08,532.0,531.36,525.0,18600,535.0,525.0
11,2014/09/09,537.0,537.537,532.0,31100,540.0,527.0
12,2014/09/10,537.0,537.065,531.0,10700,539.0,531.0
13,2014/09/11,536.0,536.985,539.0,6800,539.0,534.0
14,2014/09/12,540.0,539.957,540.0,35000,541.0,537.0
15,2014/09/16,547.0,547.1,546.0,22100,553.0,544.0
16,2014/09/17,541.0,542.822,547.0,13500,549.0,535.0
17,2014/09/18,560.0,550.344,539.0,36900,560.0,539.0
18,2014/09/19,589.0,583.891,588.0,205400,594.0,570.0
19,2014/09/22,630.0,652.82,609.0,1406500,689.0,601.0
20,2014/09/24,635.0,628.825,619.0,374000,644.0,614.0
21,2014/09/25,621.0,625.418,638.0,140900,645.0,610.0
22,2014/09/26,615.0,612.92,617.0,62500,620.0,607.0
23,2014/09/29,612.0,615.578,624.0,32200,630.0,610.0
24,2014/09/30,613.0,611.649,606.0,56700,621.0,605.0
25,2014/10/01,610.0,614.95,615.0,48400,621.0,607.0
26,2014/10/02,575.0,580.835,595.0,90800,596.0,570.0
27,2014/10/03,586.0,582.301,575.0,49500,588.0,575.0
28,2014/10/06,601.0,597.523,588.0,37100,605.0,587.0
29,2014/10/07,587.0,593.984,598.0,36800,602.0,581.0
30,2014/10/08,578.0,574.467,568.0,33400,585.0,568.0
31,2014/10/09,564.0,569.287,575.0,30000,582.0,562.0
32,2014/10/10,550.0,550.208,552.0,32700,555.0,544.0
33,2014/10/14,538.0,540.612,539.0,36300,550.0,536.0
34,2014/10/15,542.0,540.973,544.0,29800,551.0,532.0
35,2014/10/16,527.0,531.338,536.0,26900,536.0,526.0
36,2014/10/17,526.0,530.953,535.0,44400,542.0,526.0
37,2014/10/20,541.0,540.76,543.0,27500,545.0,536.0
38,2014/10/21,526.0,532.396,547.0,35400,547.0,525.0
39,2014/10/22,543.0,537.595,530.0,29600,543.0,530.0
40,2014/10/23,546.0,545.565,533.0,31500,550.0,533.0
41,2014/10/24,546.0,548.176,546.0,22700,551.0,545.0
42,2014/10/27,556.0,554.376,546.0,18600,560.0,546.0
43,2014/10/28,556.0,551.811,548.0,14300,558.0,545.0
44,2014/10/29,560.0,559.825,558.0,32600,564.0,556.0
45,2014/10/30,552.0,557.591,563.0,63100,572.0,548.0
46,2014/10/31,572.0,563.772,551.0,62800,578.0,543.0
47,2014/11/04,576.0,575.577,580.0,54400,582.0,563.0
48,2014/11/05,579.0,574.414,574.0,35300,585.0,564.0
49,2014/11/06,576.0,577.661,578.0,22100,581.0,573.0
50,2014/11/07,575.0,574.791,577.0,18700,579.0,572.0
51,2014/11/10,579.0,578.283,572.0,15200,583.0,572.0
52,2014/11/11,579.0,575.715,580.0,26700,580.0,568.0
53,2014/11/12,573.0,575.829,579.0,21100,582.0,570.0
54,2014/11/13,572.0,570.18,573.0,19500,574.0,566.0
55,2014/11/14,594.0,585.035,582.0,85700,595.0,574.0
56,2014/11/17,592.0,595.323,600.0,59700,603.0,590.0
57,2014/11/18,626.0,615.601,597.0,66700,627.0,597.0
58,2014/11/19,620.0,621.086,626.0,57300,627.0,615.0
59,2014/11/20,615.0,617.671,620.0,31600,623.0,613.0
60,2014/11/21,619.0,612.895,609.0,45900,621.0,601.0
61,2014/11/25,636.0,632.905,618.0,64000,637.0,618.0
62,2014/11/26,640.0,639.572,631.0,42100,645.0,631.0
63,2014/11/27,641.0,641.395,635.0,67400,649.0,634.0
64,2014/11/28,651.0,648.979,647.0,89200,656.0,630.0
65,2014/12/01,661.0,658.732,646.0,48800,665.0,646.0
66,2014/12/02,668.0,665.09,652.0,53400,670.0,652.0
67,2014/12/03,682.0,686.382,670.0,129900,700.0,670.0
68,2014/12/04,699.0,699.302,686.0,89500,707.0,686.0
69,2014/12/05,705.0,707.374,700.0,83700,712.0,690.0
70,2014/12/08,709.0,711.471,714.0,43100,716.0,695.0
71,2014/12/09,701.0,707.044,714.0,47900,714.0,691.0
72,2014/12/10,697.0,682.92,686.0,57300,697.0,670.0
73,2014/12/11,682.0,679.726,680.0,33900,684.0,671.0
74,2014/12/12,679.0,682.486,684.0,55800,693.0,670.0
75,2014/12/15,663.0,672.425,680.0,32700,680.0,661.0
76,2014/12/16,651.0,654.484,661.0,31600,661.0,648.0
77,2014/12/17,656.0,649.348,640.0,40800,665.0,637.0
78,2014/12/18,666.0,666.554,668.0,26700,676.0,653.0
79,2014/12/19,682.0,680.249,680.0,51400,694.0,669.0
80,2014/12/22,681.0,680.288,688.0,32000,688.0,666.0
81,2014/12/24,677.0,670.098,681.0,44700,681.0,659.0
82,2014/12/25,671.0,672.087,673.0,12700,677.0,668.0
83,2014/12/26,680.0,675.793,668.0,27000,690.0,667.0
84,2014/12/29,682.0,680.708,688.0,15400,688.0,674.0
85,2014/12/30,681.0,680.521,685.0,14600,685.0,677.0
86,2015/01/05,682.0,683.097,684.0,18600,689.0,677.0
87,2015/01/06,651.0,656.823,662.0,38400,667.0,651.0
88,2015/01/07,653.0,655.152,641.0,23100,666.0,641.0
89,2015/01/08,654.0,652.34,653.0,25600,661.0,646.0
90,2015/01/09,641.0,645.873,651.0,34700,663.0,638.0
91,2015/01/13,633.0,630.533,639.0,21200,639.0,626.0
92,2015/01/14,630.0,630.889,632.0,25300,639.0,625.0
93,2015/01/15,638.0,632.273,630.0,34100,644.0,625.0
94,2015/01/16,629.0,625.129,635.0,20200,636.0,617.0
95,2015/01/19,632.0,632.258,639.0,15500,643.0,626.0
96,2015/01/20,637.0,632.339,632.0,22100,640.0,625.0
97,2015/01/21,625.0,619.933,631.0,40400,633.0,613.0
98,2015/01/22,628.0,625.173,625.0,15000,633.0,615.0
99,2015/01/23,629.0,631.67,637.0,9700,639.0,624.0
100,2015/01/26,634.0,627.922,619.0,12800,639.0,619.0
101,2015/01/27,622.0,627.663,634.0,19900,636.0,621.0
102,2015/01/28,641.0,636.312,623.0,33000,645.0,623.0
103,2015/01/29,629.0,632.245,629.0,24500,640.0,628.0
104,2015/01/30,641.0,634.714,631.0,21700,641.0,621.0
105,2015/02/02,627.0,631.781,636.0,18700,636.0,623.0
106,2015/02/03,615.0,621.5,633.0,27000,633.0,613.0
107,2015/02/04,633.0,631.376,625.0,23700,637.0,621.0
108,2015/02/05,642.0,636.859,634.0,26300,648.0,622.0
109,2015/02/06,647.0,647.977,647.0,39800,658.0,642.0
110,2015/02/09,648.0,653.472,657.0,22900,661.0,645.0
111,2015/02/10,638.0,641.188,648.0,35600,658.0,636.0
112,2015/02/12,636.0,639.255,645.0,34500,647.0,634.0
113,2015/02/13,600.0,619.087,656.0,173200,673.0,594.0
114,2015/02/16,613.0,613.846,620.0,104900,620.0,606.0
115,2015/02/17,619.0,616.872,613.0,28900,625.0,606.0
116,2015/02/18,640.0,641.019,626.0,96700,665.0,613.0
117,2015/02/19,650.0,648.728,648.0,53700,655.0,643.0
118,2015/02/20,655.0,652.58,650.0,45500,660.0,644.0
119,2015/02/23,651.0,653.256,654.0,16800,657.0,650.0
120,2015/02/24,658.0,655.321,651.0,29300,659.0,650.0
121,2015/02/25,664.0,664.339,655.0,53400,672.0,655.0
122,2015/02/26,664.0,662.963,659.0,19100,667.0,659.0
123,2015/02/27,674.0,670.552,667.0,41100,674.0,667.0
124,2015/03/02,683.0,685.419,683.0,53200,689.0,683.0
125,2015/03/03,687.0,685.942,686.0,37900,689.0,681.0
126,2015/03/04,681.0,684.875,685.0,43100,689.0,680.0
127,2015/03/05,670.0,670.21,676.0,21900,676.0,662.0
128,2015/03/06,678.0,674.764,673.0,17800,680.0,666.0
129,2015/03/09,675.0,674.216,678.0,17100,683.0,663.0
130,2015/03/10,670.0,672.807,680.0,26900,681.0,662.0
131,2015/03/11,671.0,670.404,666.0,26000,675.0,666.0
132,2015/03/12,693.0,688.963,677.0,58700,697.0,673.0
133,2015/03/13,695.0,695.767,697.0,49000,698.0,689.0
134,2015/03/16,701.0,698.423,695.0,45900,707.0,691.0
135,2015/03/17,696.0,702.915,699.0,28100,710.0,696.0
136,2015/03/18,694.0,695.353,696.0,25200,702.0,690.0
137,2015/03/19,685.0,690.342,690.0,42100,703.0,682.0
138,2015/03/20,683.0,682.758,677.0,71600,692.0,674.0
139,2015/03/23,693.0,691.85,690.0,41900,700.0,681.0
140,2015/03/24,695.0,695.41,685.0,25100,699.0,685.0
141,2015/03/25,693.0,692.266,689.0,10900,698.0,689.0
142,2015/03/26,689.0,689.263,689.0,30000,696.0,683.0
143,2015/03/27,671.0,679.527,674.0,33000,689.0,671.0
144,2015/03/30,697.0,698.496,698.0,65900,710.0,684.0
145,2015/03/31,705.0,705.99,700.0,69200,715.0,698.0
146,2015/04/01,704.0,707.104,711.0,50000,715.0,694.0
147,2015/04/02,712.0,711.459,704.0,50800,719.0,697.0
148,2015/04/03,729.0,723.246,718.0,50400,730.0,713.0
149,2015/04/06,718.0,725.895,736.0,35300,736.0,715.0
150,2015/04/07,711.0,712.764,722.0,44400,726.0,703.0
151,2015/04/08,713.0,717.936,716.0,28000,725.0,710.0
152,2015/04/09,702.0,706.469,715.0,19200,716.0,702.0
153,2015/04/10,777.0,766.763,706.0,665800,802.0,700.0
154,2015/04/13,766.0,792.478,822.0,418000,822.0,751.0
155,2015/04/14,781.0,777.566,757.0,212800,795.0,754.0
156,2015/04/15,747.0,758.862,787.0,154000,787.0,745.0
157,2015/04/16,751.0,747.426,757.0,70700,757.0,740.0
158,2015/04/17,742.0,744.063,751.0,51200,753.0,738.0
159,2015/04/20,740.0,740.323,732.0,51400,749.0,732.0
160,2015/04/21,743.0,741.837,748.0,42200,749.0,736.0
161,2015/04/22,743.0,747.215,748.0,54900,759.0,740.0
162,2015/04/23,741.0,744.542,743.0,23600,750.0,741.0
163,2015/04/24,743.0,742.829,745.0,31500,750.0,737.0
164,2015/04/27,739.0,738.229,740.0,16600,746.0,733.0
165,2015/04/28,722.0,731.681,741.0,63600,752.0,721.0
166,2015/04/30,716.0,715.757,711.0,39100,725.0,710.0
167,2015/05/01,711.0,708.949,714.0,33500,715.0,700.0
168,2015/05/07,707.0,716.316,725.0,22500,726.0,705.0
169,2015/05/08,718.0,719.491,715.0,34400,725.0,710.0
170,2015/05/11,739.0,735.813,724.0,38000,744.0,724.0
171,2015/05/12,735.0,730.67,743.0,19100,743.0,724.0
172,2015/05/13,726.0,740.547,735.0,81800,760.0,723.0
173,2015/05/14,723.0,729.488,739.0,63900,739.0,721.0
174,2015/05/15,709.0,716.121,723.0,66700,727.0,706.0
175,2015/05/18,718.0,717.992,718.0,23900,722.0,712.0
176,2015/05/19,716.0,713.858,714.0,33800,723.0,710.0
177,2015/05/20,713.0,714.348,714.0,45100,719.0,707.0
178,2015/05/21,710.0,713.575,713.0,57600,720.0,706.0
179,2015/05/22,714.0,710.785,709.0,27000,717.0,705.0
180,2015/05/25,709.0,710.033,711.0,39800,717.0,705.0
181,2015/05/26,707.0,708.387,713.0,23000,713.0,705.0
182,2015/05/27,711.0,708.097,705.0,22800,712.0,704.0
183,2015/05/28,712.0,713.617,719.0,34700,719.0,709.0
184,2015/05/29,724.0,718.309,716.0,27500,725.0,713.0
185,2015/06/01,721.0,718.874,722.0,23000,729.0,714.0
186,2015/06/02,721.0,721.514,721.0,22000,728.0,716.0
187,2015/06/03,711.0,713.027,721.0,37500,722.0,709.0
188,2015/06/04,713.0,714.804,711.0,20900,718.0,711.0
189,2015/06/05,716.0,715.486,712.0,14400,720.0,712.0
190,2015/06/08,719.0,722.194,716.0,26800,728.0,716.0
191,2015/06/09,713.0,717.05,727.0,48000,727.0,711.0
192,2015/06/10,712.0,715.969,719.0,25800,719.0,712.0
193,2015/06/11,709.0,710.95,714.0,30100,716.0,708.0
194,2015/06/12,725.0,719.823,715.0,65400,732.0,711.0
195,2015/06/15,718.0,716.707,721.0,27300,724.0,712.0
196,2015/06/16,704.0,707.588,713.0,33700,717.0,703.0
197,2015/06/17,702.0,703.67,710.0,22700,710.0,701.0
198,2015/06/18,717.0,714.715,702.0,44600,727.0,697.0
199,2015/06/19,739.0,736.961,724.0,81600,753.0,719.0
200,2015/06/22,737.0,734.894,739.0,21600,739.0,726.0
201,2015/06/23,747.0,742.773,739.0,33500,748.0,735.0
202,2015/06/24,740.0,742.608,745.0,23200,748.0,739.0
203,2015/06/25,721.0,722.925,739.0,33200,739.0,700.0
204,2015/06/26,713.0,714.634,721.0,21600,724.0,710.0
205,2015/06/29,696.0,699.486,705.0,32900,705.0,695.0
206,2015/06/30,727.0,724.349,721.0,70800,744.0,718.0
207,2015/07/01,713.0,718.72,723.0,24300,727.0,713.0
208,2015/07/02,720.0,722.631,724.0,13000,727.0,718.0
209,2015/07/03,710.0,711.202,720.0,9400,720.0,704.0
210,2015/07/06,730.0,734.093,720.0,112300,744.0,715.0
211,2015/07/07,758.0,757.401,743.0,111600,773.0,743.0
212,2015/07/08,755.0,754.822,767.0,95300,780.0,735.0
213,2015/07/09,766.0,740.071,730.0,87700,772.0,712.0
214,2015/07/10,776.0,765.691,765.0,75100,780.0,730.0
215,2015/07/13,776.0,785.261,785.0,68200,795.0,773.0
216,2015/07/14,798.0,795.401,790.0,125800,800.0,782.0
217,2015/07/15,783.0,790.823,798.0,42900,805.0,779.0
218,2015/07/16,788.0,789.727,790.0,34400,799.0,783.0
219,2015/07/17,782.0,779.016,791.0,18400,791.0,772.0
220,2015/07/21,767.0,771.139,778.0,49100,783.0,764.0
221,2015/07/22,744.0,749.138,761.0,40600,761.0,741.0
222,2015/07/23,741.0,739.917,739.0,29000,746.0,733.0
223,2015/07/24,719.0,724.26,735.0,50400,738.0,717.0
224,2015/07/27,707.0,708.283,721.0,44900,721.0,702.0
225,2015/07/28,710.0,701.972,698.0,60600,714.0,691.0
226,2015/07/29,713.0,712.46,710.0,25900,717.0,707.0
227,2015/07/30,709.0,716.16,723.0,46300,730.0,703.0
228,2015/07/31,718.0,714.232,703.0,43200,728.0,703.0
229,2015/08/03,707.0,715.258,718.0,39900,726.0,703.0
230,2015/08/04,712.0,706.221,705.0,38000,714.0,695.0
231,2015/08/05,710.0,708.147,706.0,36000,717.0,702.0
232,2015/08/06,711.0,720.898,706.0,42300,734.0,706.0
233,2015/08/07,710.0,708.841,706.0,18200,714.0,706.0
234,2015/08/10,710.0,704.553,707.0,26600,712.0,693.0
235,2015/08/11,703.0,704.582,709.0,31100,710.0,700.0
236,2015/08/12,694.0,694.794,696.0,52000,698.0,691.0
237,2015/08/13,679.0,680.983,690.0,48100,695.0,674.0
238,2015/08/14,684.0,677.397,679.0,31200,686.0,673.0
239,2015/08/17,672.0,672.983,690.0,65200,691.0,664.0
240,2015/08/18,669.0,671.026,675.0,35100,678.0,665.0
241,2015/08/19,651.0,654.3,663.0,38000,665.0,648.0
242,2015/08/20,652.0,657.145,652.0,62900,673.0,646.0
243,2015/08/21,631.0,638.624,648.0,42600,648.0,628.0
244,2015/08/24,579.0,598.03,610.0,77700,621.0,574.0
245,2015/08/25,544.0,549.191,529.0,88200,579.0,521.0
246,2015/08/26,574.0,562.355,548.0,25100,575.0,548.0
247,2015/08/27,575.0,580.5,585.0,21800,589.0,572.0
248,2015/08/28,602.0,597.701,590.0,29800,609.0,582.0
249,2015/08/31,606.0,602.259,610.0,19700,610.0,593.0
250,2015/09/01,576.0,590.103,607.0,33000,607.0,575.0
251,2015/09/02,565.0,558.52,560.0,69200,575.0,530.0
252,2015/09/03,556.0,562.601,569.0,33600,574.0,555.0
253,2015/09/04,538.0,542.634,558.0,38500,558.0,530.0
254,2015/09/07,531.0,531.63,530.0,41100,550.0,525.0
255,2015/09/08,528.0,533.432,531.0,25900,539.0,527.0
256,2015/09/09,561.0,549.282,545.0,33700,561.0,541.0
257,2015/09/10,556.0,551.42,551.0,13800,558.0,545.0
258,2015/09/11,561.0,554.269,551.0,36800,569.0,551.0
259,2015/09/14,565.0,570.527,565.0,38500,587.0,558.0
260,2015/09/15,571.0,576.354,574.0,28000,586.0,562.0
261,2015/09/16,577.0,576.85,579.0,12000,581.0,574.0
262,2015/09/17,578.0,573.965,573.0,19900,579.0,565.0
263,2015/09/18,584.0,576.208,576.0,26400,585.0,563.0
264,2015/09/24,562.0,572.985,584.0,33500,584.0,560.0
265,2015/09/25,574.0,569.659,560.0,22600,580.0,555.0
266,2015/09/28,568.0,576.52,580.0,27700,586.0,563.0
267,2015/09/29,560.0,564.511,570.0,26600,578.0,556.0
268,2015/09/30,590.0,589.493,567.0,43800,610.0,567.0
269,2015/10/01,638.0,619.564,602.0,65400,644.0,594.0
270,2015/10/02,649.0,639.481,632.0,67000,654.0,616.0
271,2015/10/05,648.0,652.411,649.0,36000,660.0,637.0
272,2015/10/06,664.0,658.655,650.0,30700,667.0,646.0
273,2015/10/07,669.0,662.81,664.0,23100,670.0,651.0
274,2015/10/08,670.0,669.501,669.0,36700,678.0,655.0
275,2015/10/09,674.0,672.515,670.0,23900,679.0,670.0
276,2015/10/13,671.0,659.744,667.0,43400,674.0,645.0
277,2015/10/14,644.0,649.081,659.0,19800,659.0,642.0
278,2015/10/15,661.0,654.306,640.0,23200,671.0,637.0
279,2015/10/16,669.0,653.82,670.0,27700,670.0,645.0
280,2015/10/19,656.0,650.437,662.0,27700,662.0,643.0
281,2015/10/20,649.0,649.878,656.0,33500,656.0,640.0
282,2015/10/21,658.0,650.907,645.0,27800,658.0,637.0
283,2015/10/22,658.0,658.227,649.0,18100,665.0,649.0
284,2015/10/23,663.0,663.506,668.0,15800,668.0,659.0
285,2015/10/26,659.0,656.491,664.0,21000,664.0,648.0
286,2015/10/27,656.0,659.14,663.0,10700,666.0,654.0
287,2015/10/28,661.0,657.179,656.0,14500,661.0,654.0
288,2015/10/29,666.0,664.013,661.0,67800,670.0,658.0
289,2015/10/30,665.0,662.653,662.0,47900,673.0,655.0
290,2015/11/02,660.0,663.126,669.0,20600,669.0,654.0
291,2015/11/04,669.0,666.914,665.0,25700,673.0,651.0
292,2015/11/05,679.0,680.16,677.0,32500,686.0,671.0
293,2015/11/06,688.0,684.952,685.0,14700,689.0,679.0
294,2015/11/09,702.0,698.64,699.0,26400,702.0,692.0
295,2015/11/10,702.0,700.062,691.0,27400,705.0,691.0
296,2015/11/11,676.0,690.8,698.0,56000,706.0,673.0
297,2015/11/12,626.0,630.995,666.0,84700,675.0,618.0
298,2015/11/13,641.0,626.544,622.0,45600,642.0,615.0
299,2015/11/16,638.0,636.959,641.0,22000,641.0,624.0
300,2015/11/17,647.0,647.27,645.0,16300,650.0,644.0
301,2015/11/18,645.0,644.271,650.0,13300,650.0,635.0
302,2015/11/19,648.0,648.374,653.0,18200,653.0,642.0
303,2015/11/20,635.0,634.162,635.0,48900,642.0,627.0
304,2015/11/24,643.0,639.764,629.0,18200,645.0,629.0
305,2015/11/25,633.0,634.235,643.0,8500,643.0,632.0
306,2015/11/26,632.0,633.054,635.0,14900,640.0,629.0
307,2015/11/27,612.0,608.233,631.0,52300,631.0,597.0
308,2015/11/30,617.0,615.761,619.0,19700,619.0,611.0
309,2015/12/01,618.0,615.687,612.0,19800,619.0,610.0
310,2015/12/02,611.0,611.74,616.0,30000,616.0,608.0
311,2015/12/03,607.0,607.045,608.0,37700,612.0,600.0
312,2015/12/04,602.0,599.581,595.0,24800,606.0,595.0
313,2015/12/07,603.0,603.3,603.0,27700,607.0,600.0
314,2015/12/08,595.0,594.47,595.0,28300,600.0,591.0
315,2015/12/09,584.0,587.846,588.0,29900,592.0,584.0
316,2015/12/10,578.0,577.243,576.0,27200,580.0,573.0
317,2015/12/11,588.0,594.88,598.0,65700,598.0,584.0
318,2015/12/14,584.0,578.22,578.0,39100,588.0,570.0
319,2015/12/15,571.0,578.033,583.0,12200,584.0,571.0
320,2015/12/16,580.0,578.703,573.0,11800,583.0,573.0
321,2015/12/17,586.0,584.398,584.0,25600,589.0,581.0
322,2015/12/18,591.0,588.984,581.0,36700,595.0,581.0
323,2015/12/21,577.0,581.174,589.0,29900,589.0,568.0
324,2015/12/22,571.0,571.031,570.0,19500,575.0,568.0
325,2015/12/24,561.0,567.236,568.0,28000,580.0,554.0
326,2015/12/25,544.0,550.114,552.0,42100,565.0,541.0
327,2015/12/28,576.0,572.55,553.0,21100,587.0,553.0
328,2015/12/29,587.0,587.701,581.0,27800,593.0,576.0
329,2015/12/30,592.0,592.061,595.0,9800,595.0,587.0
330,2016/01/04,581.0,585.934,592.0,16700,595.0,576.0
331,2016/01/05,573.0,576.177,578.0,11300,580.0,572.0
332,2016/01/06,565.0,565.585,573.0,11800,581.0,558.0
333,2016/01/07,552.0,556.318,565.0,13200,565.0,552.0
334,2016/01/08,559.0,557.734,550.0,24100,567.0,545.0
335,2016/01/12,534.0,541.095,549.0,20000,559.0,534.0
336,2016/01/13,551.0,549.558,535.0,19900,556.0,535.0
337,2016/01/14,539.0,538.76,543.0,21700,545.0,532.0
338,2016/01/15,537.0,541.881,553.0,18500,553.0,534.0
339,2016/01/18,521.0,521.0,526.0,12200,526.0,516.0
340,2016/01/19,524.0,521.446,521.0,17500,528.0,513.0
341,2016/01/20,503.0,514.573,528.0,21800,528.0,502.0
342,2016/01/21,492.0,499.11,493.0,27300,510.0,492.0
343,2016/01/22,504.0,500.114,496.0,31500,506.0,494.0
344,2016/01/25,506.0,505.887,504.0,26500,512.0,498.0
345,2016/01/26,491.0,495.981,500.0,26600,500.0,491.0
346,2016/01/27,517.0,509.36,496.0,18900,517.0,496.0
347,2016/01/28,617.0,590.542,519.0,113000,617.0,517.0
348,2016/01/29,649.0,659.765,700.0,669600,700.0,579.0
349,2016/02/01,594.0,603.398,613.0,146700,620.0,588.0
350,2016/02/02,584.0,586.989,584.0,53600,608.0,576.0
351,2016/02/03,564.0,572.211,594.0,51100,596.0,553.0
352,2016/02/04,539.0,548.413,571.0,50800,571.0,538.0
353,2016/02/05,529.0,527.532,524.0,28200,536.0,520.0
354,2016/02/08,546.0,543.508,529.0,18100,553.0,529.0
355,2016/02/09,509.0,516.453,520.0,23400,531.0,509.0
356,2016/02/10,482.0,492.84,522.0,43200,522.0,480.0
357,2016/02/12,473.0,470.335,460.0,55300,481.0,457.0
358,2016/02/15,499.0,506.384,515.0,28100,516.0,493.0
359,2016/02/16,519.0,518.343,492.0,35900,530.0,492.0
360,2016/02/17,513.0,517.707,520.0,37900,531.0,506.0
361,2016/02/18,530.0,530.419,527.0,16000,536.0,522.0
362,2016/02/19,521.0,517.375,528.0,21600,528.0,509.0
363,2016/02/22,541.0,537.727,513.0,76500,569.0,512.0
364,2016/02/23,528.0,531.296,544.0,32100,544.0,520.0
365,2016/02/24,520.0,521.681,521.0,16600,530.0,516.0
366,2016/02/25,508.0,509.666,514.0,34100,523.0,505.0
367,2016/02/26,502.0,504.826,511.0,20700,516.0,501.0
368,2016/02/29,510.0,514.254,510.0,65400,536.0,500.0
369,2016/03/01,500.0,502.866,511.0,31300,512.0,498.0
370,2016/03/02,511.0,506.606,510.0,33000,513.0,490.0
371,2016/03/03,516.0,513.17,511.0,21200,519.0,505.0
372,2016/03/04,525.0,520.33,516.0,48800,530.0,510.0
373,2016/03/07,523.0,527.036,527.0,27700,534.0,522.0
374,2016/03/08,531.0,527.219,514.0,50800,539.0,514.0
375,2016/03/09,513.0,512.767,529.0,31800,529.0,503.0
376,2016/03/10,526.0,520.409,513.0,29600,527.0,513.0
377,2016/03/11,532.0,524.682,522.0,34600,532.0,517.0
378,2016/03/14,548.0,549.125,539.0,63400,560.0,537.0
379,2016/03/15,553.0,555.626,545.0,61200,567.0,541.0
380,2016/03/16,541.0,546.838,553.0,18500,553.0,540.0
381,2016/03/17,535.0,538.17,547.0,22300,547.0,525.0
382,2016/03/18,539.0,527.154,531.0,42100,543.0,516.0
383,2016/03/22,551.0,544.425,548.0,37900,551.0,534.0
384,2016/03/23,539.0,542.797,553.0,19700,555.0,533.0
385,2016/03/24,528.0,532.946,534.0,26100,542.0,526.0
386,2016/03/25,529.0,530.26,528.0,24600,537.0,525.0
387,2016/03/28,537.0,532.522,530.0,25300,537.0,528.0
388,2016/03/29,530.0,529.2,529.0,15000,532.0,525.0
389,2016/03/30,525.0,524.203,530.0,16300,530.0,521.0
390,2016/03/31,517.0,522.681,522.0,18500,531.0,517.0
391,2016/04/01,499.0,507.179,521.0,27400,521.0,499.0
392,2016/04/04,500.0,499.351,499.0,15400,506.0,495.0
393,2016/04/05,481.0,486.906,500.0,19100,501.0,481.0
394,2016/04/06,475.0,476.712,481.0,12500,485.0,471.0
395,2016/04/07,472.0,472.5,474.0,15400,477.0,470.0
396,2016/04/08,483.0,476.873,464.0,26700,487.0,459.0
397,2016/04/11,474.0,472.628,479.0,23900,481.0,463.0
398,2016/04/12,490.0,486.52,475.0,39800,501.0,475.0
399,2016/04/13,509.0,510.758,494.0,52400,521.0,494.0
400,2016/04/14,527.0,519.139,521.0,42400,527.0,510.0
401,2016/04/15,513.0,514.321,509.0,44300,522.0,509.0
402,2016/04/18,499.0,503.192,505.0,15600,510.0,498.0
403,2016/04/19,515.0,511.081,512.0,25800,520.0,497.0
404,2016/04/20,510.0,512.564,516.0,21800,516.0,496.0
405,2016/04/21,516.0,514.66,515.0,20900,520.0,509.0
406,2016/04/22,518.0,516.676,516.0,14500,520.0,512.0
407,2016/04/25,520.0,519.308,520.0,13300,525.0,514.0
408,2016/04/26,513.0,514.22,520.0,8200,521.0,502.0
409,2016/04/27,511.0,511.267,509.0,12000,515.0,508.0
410,2016/04/28,503.0,508.341,516.0,17000,524.0,500.0
411,2016/05/02,485.0,489.737,496.0,17500,496.0,480.0
412,2016/05/06,489.0,483.087,485.0,11500,501.0,476.0
413,2016/05/09,489.0,489.17,497.0,10600,497.0,487.0
414,2016/05/10,500.0,496.892,489.0,16600,507.0,483.0
415,2016/05/11,506.0,509.583,510.0,18000,517.0,503.0
416,2016/05/12,506.0,506.147,504.0,16300,509.0,503.0
417,2016/05/13,486.0,492.895,504.0,15200,504.0,486.0
418,2016/05/16,482.0,491.752,502.0,37500,502.0,481.0
419,2016/05/17,486.0,484.185,492.0,26500,494.0,473.0
420,2016/05/18,491.0,491.33,490.0,37900,498.0,483.0
421,2016/05/19,493.0,490.739,491.0,15300,493.0,488.0
422,2016/05/20,492.0,490.823,493.0,20900,493.0,486.0
423,2016/05/23,490.0,490.354,489.0,9900,494.0,484.0
424,2016/05/24,483.0,485.007,490.0,14900,493.0,480.0
425,2016/05/25,487.0,489.078,491.0,19200,495.0,483.0
426,2016/05/26,485.0,488.793,491.0,14000,494.0,484.0
427,2016/05/27,485.0,484.0,484.0,16500,487.0,481.0
428,2016/05/30,490.0,485.667,485.0,12300,492.0,482.0
429,2016/05/31,490.0,488.766,490.0,17500,493.0,487.0
430,2016/06/01,491.0,488.368,485.0,14400,493.0,485.0
431,2016/06/02,491.0,496.13,490.0,23800,502.0,490.0
432,2016/06/03,490.0,492.704,494.0,5400,499.0,489.0
433,2016/06/06,483.0,484.388,488.0,11600,488.0,482.0
434,2016/06/07,488.0,485.163,486.0,8000,488.0,482.0
435,2016/06/08,487.0,484.25,490.0,6000,490.0,481.0
436,2016/06/09,483.0,485.893,489.0,8400,489.0,482.0
437,2016/06/10,482.0,477.003,480.0,32600,484.0,466.0
438,2016/06/13,513.0,512.473,498.0,157900,522.0,494.0
439,2016/06/14,512.0,515.942,519.0,124900,527.0,505.0
440,2016/06/15,527.0,523.772,520.0,96100,533.0,512.0
441,2016/06/16,509.0,519.621,528.0,61400,535.0,505.0
442,2016/06/17,506.0,508.083,505.0,46000,522.0,504.0
443,2016/06/20,520.0,519.007,520.0,61500,524.0,512.0
444,2016/06/21,508.0,502.625,517.0,45100,517.0,490.0
445,2016/06/22,488.0,489.263,500.0,48600,500.0,479.0
446,2016/06/23,491.0,483.303,479.0,31700,492.0,475.0
447,2016/06/24,444.0,454.86,505.0,79400,505.0,429.0
448,2016/06/27,448.0,449.006,448.0,35600,457.0,446.0
449,2016/06/28,453.0,446.619,447.0,24900,457.0,436.0
450,2016/06/29,462.0,462.528,455.0,18000,471.0,455.0
451,2016/06/30,477.0,475.562,470.0,32900,480.0,466.0
452,2016/07/01,491.0,492.34,493.0,83300,499.0,487.0
453,2016/07/04,490.0,491.571,486.0,28900,495.0,481.0
454,2016/07/05,495.0,488.169,487.0,26600,496.0,479.0
455,2016/07/06,489.0,485.158,493.0,34800,493.0,478.0
456,2016/07/07,497.0,496.336,485.0,43500,505.0,485.0
457,2016/07/08,499.0,498.755,504.0,23300,504.0,491.0
458,2016/07/11,528.0,520.467,509.0,70700,529.0,507.0
459,2016/07/12,558.0,551.219,535.0,98300,564.0,535.0
460,2016/07/13,566.0,563.786,561.0,39300,569.0,556.0
461,2016/07/14,572.0,565.371,560.0,49600,573.0,557.0
462,2016/07/15,588.0,585.532,580.0,77500,604.0,564.0
463,2016/07/19,604.0,591.692,584.0,50700,607.0,582.0
464,2016/07/20,598.0,597.761,600.0,53200,603.0,582.0
465,2016/07/21,600.0,603.221,601.0,31200,610.0,595.0
466,2016/07/22,609.0,602.717,592.0,12000,609.0,591.0
467,2016/07/25,599.0,593.856,601.0,29800,601.0,581.0
468,2016/07/26,594.0,591.391,593.0,21000,596.0,584.0
469,2016/07/27,612.0,605.62,597.0,20500,614.0,590.0
470,2016/07/28,598.0,599.73,610.0,14800,613.0,594.0
471,2016/07/29,605.0,590.335,591.0,19700,606.0,580.0
472,2016/08/01,600.0,598.015,602.0,13600,602.0,586.0
473,2016/08/02,589.0,589.371,588.0,14300,595.0,575.0
474,2016/08/03,561.0,565.669,574.0,12700,576.0,561.0
475,2016/08/04,583.0,572.201,562.0,14900,583.0,558.0
476,2016/08/05,584.0,585.662,588.0,21000,600.0,561.0
477,2016/08/08,589.0,580.972,564.0,24900,596.0,564.0
478,2016/08/09,592.0,591.441,590.0,6800,595.0,588.0
479,2016/08/10,588.0,581.515,572.0,6800,588.0,572.0
480,2016/08/12,577.0,576.869,594.0,26000,594.0,565.0
481,2016/08/15,583.0,580.022,577.0,13400,588.0,577.0
482,2016/08/16,575.0,578.664,583.0,11900,589.0,575.0
483,2016/08/17,583.0,576.974,573.0,19500,584.0,567.0
484,2016/08/18,579.0,582.373,582.0,14200,589.0,577.0
485,2016/08/19,589.0,588.404,580.0,17100,592.0,580.0
486,2016/08/22,589.0,585.314,585.0,17500,591.0,578.0
487,2016/08/23,593.0,592.444,590.0,17100,600.0,588.0
488,2016/08/24,578.0,580.953,596.0,17100,596.0,577.0
489,2016/08/25,595.0,590.426,579.0,14100,597.0,579.0
490,2016/08/26,585.0,589.545,595.0,11200,595.0,581.0
491,2016/08/29,608.0,602.904,599.0,23900,609.0,594.0
492,2016/08/30,605.0,609.103,610.0,17400,620.0,604.0
493,2016/08/31,640.0,629.822,613.0,49000,641.0,612.0
494,2016/09/01,630.0,637.82,634.0,34400,649.0,626.0
495,2016/09/02,617.0,619.713,629.0,20200,629.0,614.0
496,2016/09/05,622.0,624.063,623.0,14400,630.0,620.0
497,2016/09/06,616.0,616.339,618.0,22400,620.0,611.0
498,2016/09/07,617.0,604.953,597.0,38500,621.0,592.0
499,2016/09/08,622.0,617.841,617.0,70600,628.0,607.0
500,2016/09/09,611.0,608.383,613.0,40500,616.0,595.0
501,2016/09/12,602.0,600.667,602.0,9900,604.0,597.0
502,2016/09/13,596.0,597.626,601.0,9900,605.0,595.0
503,2016/09/14,594.0,594.18,596.0,10000,599.0,592.0
504,2016/09/15,587.0,586.018,586.0,16700,589.0,581.0
505,2016/09/16,620.0,607.291,590.0,25400,620.0,586.0
506,2016/09/20,605.0,606.622,611.0,20900,611.0,601.0
507,2016/09/21,622.0,615.437,606.0,13500,623.0,601.0
508,2016/09/23,628.0,622.026,617.0,42700,629.0,613.0
509,2016/09/26,620.0,621.393,632.0,13500,632.0,616.0
510,2016/09/27,635.0,618.932,615.0,32400,636.0,592.0
511,2016/09/28,635.0,625.624,628.0,17300,639.0,612.0
512,2016/09/29,649.0,640.052,635.0,24800,650.0,629.0
513,2016/09/30,635.0,633.528,646.0,14400,646.0,624.0
514,2016/10/03,625.0,633.845,641.0,15500,642.0,621.0
515,2016/10/04,624.0,622.61,630.0,11800,630.0,620.0
516,2016/10/05,631.0,630.509,624.0,16100,637.0,624.0
517,2016/10/06,635.0,635.141,631.0,14200,640.0,631.0
518,2016/10/07,636.0,634.702,637.0,5700,637.0,632.0
519,2016/10/11,631.0,631.874,635.0,13500,642.0,608.0
520,2016/10/12,635.0,635.13,621.0,18500,640.0,621.0
521,2016/10/13,637.0,637.076,639.0,15900,645.0,630.0
522,2016/10/14,654.0,647.5,635.0,40200,655.0,634.0
523,2016/10/17,708.0,694.901,655.0,138800,718.0,655.0
524,2016/10/18,698.0,700.779,708.0,43000,708.0,694.0
525,2016/10/19,700.0,697.45,698.0,36900,705.0,687.0
526,2016/10/20,702.0,701.951,703.0,18500,705.0,698.0
527,2016/10/21,701.0,698.652,697.0,11200,702.0,696.0
528,2016/10/24,701.0,697.163,691.0,9800,703.0,691.0
529,2016/10/25,698.0,699.444,703.0,12400,706.0,695.0
530,2016/10/26,703.0,699.971,698.0,13600,703.0,693.0
531,2016/10/27,707.0,709.134,708.0,21700,716.0,702.0
532,2016/10/28,707.0,706.766,704.0,23500,713.0,701.0
533,2016/10/31,714.0,705.088,702.0,31900,717.0,690.0
534,2016/11/01,710.0,712.587,714.0,25900,726.0,685.0
535,2016/11/02,687.0,690.384,695.0,15100,703.0,683.0
536,2016/11/04,673.0,671.897,673.0,11600,675.0,666.0
537,2016/11/07,678.0,679.507,682.0,6900,690.0,669.0
538,2016/11/08,681.0,681.547,685.0,6400,689.0,678.0
539,2016/11/09,652.0,665.216,691.0,21300,691.0,652.0
540,2016/11/10,736.0,724.152,692.0,94600,746.0,690.0
541,2016/11/11,730.0,736.405,743.0,59000,749.0,721.0
542,2016/11/14,725.0,727.579,727.0,48900,738.0,723.0
543,2016/11/15,737.0,733.399,727.0,40600,744.0,726.0
544,2016/11/16,728.0,729.542,736.0,46700,739.0,720.0
545,2016/11/17,735.0,730.352,727.0,28700,736.0,708.0
546,2016/11/18,733.0,733.384,740.0,20300,740.0,728.0
547,2016/11/21,746.0,741.531,735.0,35000,749.0,735.0
548,2016/11/22,749.0,750.162,750.0,38900,755.0,744.0
549,2016/11/24,739.0,744.447,754.0,15200,754.0,738.0
550,2016/11/25,752.0,749.429,745.0,31000,754.0,744.0
551,2016/11/28,768.0,761.474,752.0,50900,769.0,752.0
552,2016/11/29,765.0,764.377,768.0,27300,768.0,755.0
553,2016/11/30,798.0,785.05,770.0,116600,798.0,769.0
554,2016/12/01,793.0,793.191,798.0,69500,800.0,776.0
555,2016/12/02,803.0,807.968,789.0,96800,824.0,789.0
556,2016/12/05,799.0,799.466,800.0,13300,804.0,796.0
557,2016/12/06,832.0,828.913,817.0,77000,840.0,817.0
558,2016/12/07,833.0,831.893,836.0,44700,839.0,824.0
559,2016/12/08,824.0,828.313,839.0,31600,839.0,823.0
560,2016/12/09,830.0,823.314,822.0,48800,833.0,812.0
561,2016/12/12,817.0,825.455,835.0,56300,841.0,808.0
562,2016/12/13,840.0,832.658,817.0,82800,840.0,814.0
563,2016/12/14,837.0,840.403,840.0,55600,850.0,823.0
564,2016/12/15,819.0,834.774,845.0,43000,848.0,819.0
565,2016/12/16,882.0,859.882,830.0,159600,882.0,830.0
566,2016/12/19,928.0,899.611,882.0,274500,930.0,865.0
567,2016/12/20,903.0,937.953,930.0,294500,970.0,870.0
568,2016/12/21,892.0,903.388,897.0,102500,925.0,889.0
569,2016/12/22,882.0,880.191,881.0,98300,894.0,872.0
570,2016/12/26,877.0,875.356,882.0,104000,892.0,863.0
571,2016/12/27,898.0,903.691,875.0,85100,921.0,875.0
572,2016/12/28,953.0,942.644,919.0,185900,965.0,913.0
573,2016/12/29,943.0,938.824,945.0,104200,960.0,921.0
574,2016/12/30,963.0,953.65,943.0,81600,969.0,933.0
575,2017/01/04,997.0,992.978,965.0,208800,1010.0,965.0
576,2017/01/05,984.0,988.953,1000.0,82600,1004.0,975.0
577,2017/01/06,995.0,1003.334,985.0,258900,1026.0,983.0
578,2017/01/10,1002.0,998.215,1000.0,161900,1020.0,976.0
579,2017/01/11,1019.0,1002.576,1007.0,115200,1022.0,982.0
580,2017/01/12,1006.0,1004.219,1013.0,98700,1016.0,992.0
581,2017/01/13,1005.0,1003.958,995.0,113300,1014.0,994.0
582,2017/01/16,984.0,981.96,995.0,112800,995.0,959.0
583,2017/01/17,998.0,989.812,980.0,73900,1008.0,965.0
584,2017/01/18,1000.0,991.601,995.0,129400,1005.0,972.0
585,2017/01/19,1003.0,997.163,1010.0,59400,1010.0,983.0
586,2017/01/20,1013.0,1008.584,989.0,90900,1027.0,980.0
587,2017/01/23,1081.0,1065.296,1018.0,309400,1095.0,1014.0
588,2017/01/24,1086.0,1079.707,1085.0,225300,1100.0,1041.0
589,2017/01/25,1148.0,1126.312,1087.0,256000,1162.0,1085.0
590,2017/01/26,1144.0,1144.224,1170.0,201200,1183.0,1111.0
591,2017/01/27,1140.0,1145.658,1162.0,140900,1163.0,1131.0
592,2017/01/30,1135.0,1122.74,1140.0,115500,1140.0,1107.0
593,2017/01/31,1092.0,1103.871,1116.0,137200,1125.0,1092.0
594,2017/02/01,1105.0,1090.83,1075.0,82900,1109.0,1070.0
595,2017/02/02,1067.0,1084.293,1100.0,69700,1106.0,1067.0
596,2017/02/03,1066.0,1065.802,1060.0,50000,1078.0,1054.0
597,2017/02/06,1070.0,1069.339,1082.0,49500,1090.0,1057.0
598,2017/02/07,1071.0,1066.619,1070.0,42200,1073.0,1055.0
599,2017/02/08,1213.0,1169.092,1075.0,656500,1228.0,1051.0
600,2017/02/09,1213.0,1222.394,1201.0,484600,1264.0,1188.0
601,2017/02/10,1293.0,1263.213,1213.0,349800,1297.0,1213.0
602,2017/02/13,1337.0,1325.786,1302.0,299300,1349.0,1302.0
603,2017/02/14,1354.0,1365.119,1338.0,327700,1396.0,1338.0
604,2017/02/15,1333.0,1345.518,1374.0,293100,1384.0,1315.0
605,2017/02/16,1351.0,1346.517,1337.0,204400,1370.0,1318.0
606,2017/02/17,1390.0,1370.659,1344.0,265300,1400.0,1330.0
607,2017/02/20,1320.0,1343.212,1371.0,281100,1396.0,1318.0
608,2017/02/21,1301.0,1307.109,1320.0,190700,1341.0,1288.0
609,2017/02/22,1298.0,1308.735,1317.0,97000,1333.0,1295.0
610,2017/02/23,1304.0,1299.312,1316.0,95200,1316.0,1289.0
611,2017/02/24,1305.0,1300.416,1292.0,75000,1311.0,1291.0
612,2017/02/27,1346.0,1349.2,1305.0,310100,1378.0,1305.0
613,2017/02/28,1341.0,1347.538,1351.0,176600,1372.0,1333.0
614,2017/03/01,1361.0,1357.273,1360.0,263600,1373.0,1327.0
615,2017/03/02,1435.0,1413.532,1385.0,407400,1442.0,1372.0
616,2017/03/03,1468.0,1461.231,1458.0,328200,1483.0,1437.0
617,2017/03/06,1430.0,1445.875,1468.0,189400,1479.0,1428.0
618,2017/03/07,1442.0,1436.812,1421.0,158900,1455.0,1411.0
619,2017/03/08,1443.0,1434.288,1442.0,106100,1448.0,1415.0
620,2017/03/09,1509.0,1489.515,1449.0,244000,1511.0,1443.0
621,2017/03/10,1507.0,1512.394,1509.0,298600,1540.0,1487.0
622,2017/03/13,1543.0,1551.208,1540.0,328800,1585.0,1522.0
623,2017/03/14,1633.0,1600.39,1532.0,380400,1634.0,1531.0
624,2017/03/15,1534.0,1580.569,1650.0,553100,1660.0,1514.0
625,2017/03/16,1575.0,1555.699,1521.0,255800,1577.0,1505.0
626,2017/03/17,1552.0,1558.235,1565.0,245800,1578.0,1546.0
627,2017/03/21,1536.0,1538.867,1557.0,130000,1560.0,1530.0
628,2017/03/22,1505.0,1497.304,1503.0,218100,1516.0,1464.0
629,2017/03/23,1494.0,1497.854,1505.0,124300,1529.0,1484.0
630,2017/03/24,1477.0,1479.069,1485.0,140700,1507.0,1455.0
631,2017/03/27,1460.0,1463.851,1470.0,145300,1480.0,1445.0
632,2017/03/28,1433.0,1437.932,1447.0,250400,1473.0,1420.0
633,2017/03/29,1399.0,1397.235,1431.0,349200,1440.0,1372.0
634,2017/03/30,1454.0,1457.857,1383.0,420800,1494.0,1380.0
635,2017/03/31,1378.0,1413.233,1475.0,382500,1481.0,1373.0
636,2017/04/03,1381.0,1375.314,1370.0,222900,1393.0,1344.0
637,2017/04/04,1339.0,1339.434,1369.0,238200,1380.0,1313.0
638,2017/04/05,1310.0,1313.022,1334.0,260500,1348.0,1292.0
639,2017/04/06,1262.0,1271.481,1293.0,235800,1299.0,1258.0
640,2017/04/07,1289.0,1285.488,1283.0,229200,1318.0,1257.0
641,2017/04/10,1290.0,1294.984,1286.0,105300,1316.0,1285.0
642,2017/04/11,1259.0,1262.481,1280.0,95200,1281.0,1253.0
643,2017/04/12,1213.0,1213.575,1233.0,154900,1236.0,1186.0
644,2017/04/13,1218.0,1197.609,1200.0,159100,1223.0,1167.0
645,2017/04/14,1197.0,1206.734,1209.0,100900,1232.0,1192.0
646,2017/04/17,1205.0,1195.497,1184.0,115300,1210.0,1176.0
647,2017/04/18,1221.0,1228.618,1230.0,103500,1252.0,1211.0
648,2017/04/19,1237.0,1234.317,1211.0,154500,1244.0,1211.0
649,2017/04/20,1236.0,1242.182,1250.0,133800,1258.0,1233.0
650,2017/04/21,1267.0,1257.084,1250.0,131900,1276.0,1231.0
651,2017/04/24,1262.0,1271.319,1297.0,163800,1306.0,1255.0
652,2017/04/25,1319.0,1309.905,1292.0,208000,1325.0,1278.0
653,2017/04/26,1369.0,1360.218,1339.0,206400,1375.0,1333.0
654,2017/04/27,1362.0,1356.301,1359.0,186100,1368.0,1343.0
655,2017/04/28,1341.0,1338.004,1351.0,163700,1361.0,1321.0
656,2017/05/01,1361.0,1357.032,1342.0,105000,1368.0,1341.0
657,2017/05/02,1429.0,1413.758,1380.0,342200,1439.0,1377.0
658,2017/05/08,1438.0,1440.175,1449.0,265100,1457.0,1426.0
659,2017/05/09,1424.0,1429.015,1440.0,133900,1448.0,1413.0
660,2017/05/10,1428.0,1427.771,1426.0,116200,1436.0,1417.0
661,2017/05/11,1459.0,1450.851,1446.0,201600,1465.0,1435.0
662,2017/05/12,1280.0,1332.464,1464.0,577700,1468.0,1233.0
663,2017/05/15,1297.0,1313.038,1280.0,311300,1348.0,1280.0
664,2017/05/16,1311.0,1314.938,1295.0,264700,1339.0,1282.0
665,2017/05/17,1459.0,1415.827,1335.0,637500,1462.0,1323.0
666,2017/05/18,1442.0,1422.042,1410.0,316200,1454.0,1376.0
667,2017/05/19,1418.0,1407.557,1427.0,225400,1434.0,1378.0
668,2017/05/22,1421.0,1422.056,1435.0,114500,1440.0,1410.0
669,2017/05/23,1374.0,1393.254,1402.0,109200,1423.0,1373.0
670,2017/05/24,1406.0,1406.928,1400.0,126800,1424.0,1394.0
671,2017/05/25,1426.0,1423.011,1403.0,208000,1433.0,1403.0
672,2017/05/26,1390.0,1394.388,1413.0,140800,1416.0,1381.0
673,2017/05/29,1391.0,1389.772,1390.0,115200,1409.0,1357.0
674,2017/05/30,1403.0,1400.427,1390.0,99300,1413.0,1383.0
675,2017/05/31,1433.0,1437.872,1401.0,217000,1461.0,1396.0
676,2017/06/01,1437.0,1445.443,1440.0,148700,1456.0,1430.0
677,2017/06/02,1443.0,1447.439,1452.0,160400,1460.0,1432.0
678,2017/06/05,1432.0,1443.593,1438.0,144100,1466.0,1423.0
679,2017/06/06,1404.0,1416.308,1422.0,148200,1448.0,1400.0
680,2017/06/07,1461.0,1456.292,1406.0,389300,1497.0,1396.0
681,2017/06/08,1543.0,1525.08,1474.0,536000,1560.0,1468.0
682,2017/06/09,1513.0,1495.901,1518.0,355300,1519.0,1476.0
683,2017/06/12,1487.0,1492.488,1496.0,175700,1518.0,1462.0
684,2017/06/13,1450.0,1460.66,1472.0,220800,1480.0,1447.0
685,2017/06/14,1424.0,1437.284,1455.0,173800,1460.0,1421.0
686,2017/06/15,1442.0,1450.665,1437.0,197800,1468.0,1431.0
687,2017/06/16,1422.0,1421.076,1425.0,175000,1434.0,1401.0
688,2017/06/19,1408.0,1401.192,1403.0,213800,1421.0,1383.0
689,2017/06/20,1453.0,1442.954,1420.0,139100,1455.0,1420.0
690,2017/06/21,1438.0,1439.619,1443.0,171500,1451.0,1423.0
691,2017/06/22,1452.0,1452.209,1446.0,103600,1465.0,1440.0
692,2017/06/23,1439.0,1441.664,1457.0,141500,1457.0,1426.0
693,2017/06/26,1505.0,1487.384,1443.0,259500,1511.0,1439.0
694,2017/06/27,1515.0,1515.913,1504.0,227300,1527.0,1495.0
695,2017/06/28,1442.0,1462.315,1490.0,251800,1498.0,1437.0
696,2017/06/29,1450.0,1454.699,1455.0,160500,1477.0,1444.0
697,2017/06/30,1422.0,1413.381,1425.0,270900,1430.0,1392.0
698,2017/07/03,1439.0,1429.481,1420.0,107500,1444.0,1418.0
699,2017/07/04,1409.0,1420.149,1450.0,136400,1450.0,1401.0
700,2017/07/05,1429.0,1421.305,1409.0,78000,1433.0,1402.0
701,2017/07/06,1411.0,1412.832,1430.0,177700,1439.0,1400.0
702,2017/07/07,1419.0,1417.669,1404.0,111000,1431.0,1401.0
703,2017/07/10,1427.0,1428.392,1421.0,96100,1438.0,1417.0
704,2017/07/11,1418.0,1417.812,1416.0,79700,1429.0,1406.0
705,2017/07/12,1422.0,1420.54,1424.0,92900,1437.0,1411.0
706,2017/07/13,1412.0,1418.093,1433.0,89500,1442.0,1405.0
707,2017/07/14,1428.0,1414.4,1405.0,76000,1430.0,1401.0
708,2017/07/18,1420.0,1414.128,1411.0,88200,1423.0,1402.0
709,2017/07/19,1430.0,1433.615,1419.0,133600,1459.0,1408.0
710,2017/07/20,1457.0,1456.83,1432.0,136700,1471.0,1432.0
711,2017/07/21,1473.0,1480.818,1460.0,165700,1505.0,1458.0
712,2017/07/24,1485.0,1474.482,1450.0,99700,1486.0,1450.0
713,2017/07/25,1500.0,1502.655,1498.0,133400,1524.0,1483.0
714,2017/07/26,1491.0,1489.882,1494.0,109700,1506.0,1468.0
715,2017/07/27,1485.0,1496.645,1493.0,89800,1506.0,1483.0
716,2017/07/28,1452.0,1464.26,1495.0,89300,1495.0,1450.0
717,2017/07/31,1458.0,1459.411,1452.0,61100,1471.0,1448.0
718,2017/08/01,1389.0,1404.397,1450.0,155500,1453.0,1386.0
719,2017/08/02,1431.0,1426.288,1392.0,86700,1444.0,1392.0
720,2017/08/03,1415.0,1423.039,1440.0,96700,1444.0,1411.0
721,2017/08/04,1397.0,1422.694,1429.0,202800,1475.0,1397.0
722,2017/08/07,1364.0,1376.053,1398.0,251200,1405.0,1357.0
723,2017/08/08,1446.0,1437.537,1388.0,290200,1467.0,1382.0
724,2017/08/09,1405.0,1411.91,1436.0,152800,1455.0,1394.0
725,2017/08/10,1362.0,1376.871,1395.0,122600,1423.0,1353.0
726,2017/08/14,1332.0,1332.684,1337.0,114500,1350.0,1313.0
727,2017/08/15,1393.0,1401.995,1353.0,188800,1434.0,1353.0
728,2017/08/16,1431.0,1433.93,1405.0,148900,1448.0,1402.0
729,2017/08/17,1456.0,1446.356,1431.0,111600,1458.0,1412.0
730,2017/08/18,1428.0,1432.084,1428.0,60700,1444.0,1422.0
731,2017/08/21,1435.0,1446.432,1428.0,88800,1464.0,1428.0
732,2017/08/22,1464.0,1455.403,1423.0,97400,1466.0,1423.0
733,2017/08/23,1461.0,1471.29,1475.0,90700,1488.0,1456.0
734,2017/08/24,1444.0,1452.579,1457.0,46600,1465.0,1444.0
735,2017/08/25,1457.0,1461.133,1455.0,52800,1469.0,1440.0
736,2017/08/28,1467.0,1463.761,1453.0,59300,1471.0,1448.0
737,2017/08/29,1480.0,1486.406,1468.0,160200,1530.0,1451.0
738,2017/08/30,1469.0,1468.48,1475.0,45600,1482.0,1453.0
739,2017/08/31,1494.0,1490.699,1485.0,115200,1512.0,1465.0
740,2017/09/01,1495.0,1493.239,1494.0,121400,1502.0,1477.0
741,2017/09/04,1475.0,1476.67,1498.0,71000,1507.0,1462.0
742,2017/09/05,1425.0,1434.647,1470.0,96000,1470.0,1406.0
743,2017/09/06,1407.0,1399.756,1401.0,153500,1419.0,1380.0
744,2017/09/07,1420.0,1418.978,1419.0,59600,1434.0,1404.0
745,2017/09/08,1411.0,1411.787,1409.0,55300,1424.0,1402.0
746,2017/09/11,1441.0,1437.937,1411.0,44500,1450.0,1411.0
747,2017/09/12,1461.0,1461.456,1450.0,44300,1469.0,1450.0
748,2017/09/13,1452.0,1461.409,1457.0,49700,1474.0,1452.0
749,2017/09/14,1421.0,1429.518,1442.0,93700,1445.0,1418.0
750,2017/09/15,1423.0,1420.629,1417.0,82700,1438.0,1376.0
751,2017/09/19,1449.0,1450.187,1450.0,55600,1465.0,1441.0
752,2017/09/20,1461.0,1458.643,1442.0,63900,1470.0,1439.0
753,2017/09/21,1444.0,1452.785,1467.0,54800,1472.0,1436.0
754,2017/09/22,1425.0,1436.461,1432.0,72000,1462.0,1420.0
755,2017/09/25,1428.0,1434.363,1432.0,66900,1463.0,1405.0
756,2017/09/26,1427.0,1422.323,1428.0,55100,1430.0,1409.0
757,2017/09/27,1461.0,1454.122,1424.0,94000,1470.0,1410.0
758,2017/09/28,1463.0,1466.578,1449.0,90000,1484.0,1447.0
759,2017/09/29,1440.0,1440.624,1453.0,59900,1460.0,1427.0
760,2017/10/02,1463.0,1458.263,1446.0,62000,1466.0,1438.0
761,2017/10/03,1448.0,1457.401,1470.0,44400,1483.0,1446.0
762,2017/10/04,1470.0,1484.855,1455.0,117100,1510.0,1455.0
763,2017/10/05,1426.0,1437.406,1458.0,82600,1465.0,1422.0
764,2017/10/06,1424.0,1427.551,1427.0,79300,1447.0,1418.0
765,2017/10/10,1452.0,1452.533,1425.0,123400,1474.0,1425.0
766,2017/10/11,1425.0,1437.004,1466.0,93400,1466.0,1422.0
767,2017/10/12,1405.0,1406.883,1425.0,191300,1427.0,1394.0
768,2017/10/13,1424.0,1413.717,1410.0,157100,1427.0,1394.0
769,2017/10/16,1415.0,1422.379,1436.0,97300,1436.0,1413.0
770,2017/10/17,1411.0,1415.628,1415.0,72900,1430.0,1408.0
771,2017/10/18,1397.0,1401.929,1408.0,109400,1414.0,1396.0
772,2017/10/19,1391.0,1397.58,1399.0,149500,1427.0,1380.0
773,2017/10/20,1381.0,1379.221,1388.0,112600,1394.0,1369.0
774,2017/10/23,1379.0,1375.718,1383.0,149700,1388.0,1357.0
775,2017/10/24,1414.0,1403.399,1393.0,149500,1419.0,1381.0
776,2017/10/25,1426.0,1437.244,1414.0,186300,1464.0,1410.0
777,2017/10/26,1453.0,1460.618,1430.0,157500,1486.0,1425.0
778,2017/10/27,1443.0,1438.391,1449.0,81600,1449.0,1427.0
779,2017/10/30,1447.0,1443.906,1450.0,117500,1453.0,1426.0
780,2017/10/31,1477.0,1466.781,1450.0,121200,1479.0,1449.0
781,2017/11/01,1527.0,1513.688,1482.0,238800,1532.0,1482.0
782,2017/11/02,1538.0,1542.838,1540.0,150800,1566.0,1532.0
783,2017/11/06,1527.0,1543.23,1540.0,124300,1579.0,1524.0
784,2017/11/07,1518.0,1515.46,1522.0,100500,1528.0,1506.0
785,2017/11/08,1532.0,1522.501,1510.0,102900,1535.0,1507.0
786,2017/11/09,1474.0,1513.366,1550.0,299300,1559.0,1454.0
787,2017/11/10,1431.0,1425.536,1450.0,202700,1468.0,1396.0
788,2017/11/13,1337.0,1372.212,1439.0,314900,1446.0,1335.0
789,2017/11/14,1315.0,1328.352,1345.0,251200,1354.0,1310.0
790,2017/11/15,1281.0,1289.436,1316.0,293300,1327.0,1267.0
791,2017/11/16,1280.0,1275.81,1288.0,159800,1301.0,1262.0
792,2017/11/17,1376.0,1347.646,1310.0,309000,1378.0,1310.0
793,2017/11/20,1434.0,1422.897,1380.0,498900,1455.0,1367.0
794,2017/11/21,1472.0,1460.456,1441.0,272800,1475.0,1427.0
795,2017/11/22,1491.0,1482.703,1472.0,207900,1494.0,1459.0
796,2017/11/24,1483.0,1492.568,1498.0,166600,1510.0,1476.0
797,2017/11/27,1480.0,1486.871,1494.0,113200,1504.0,1470.0
798,2017/11/28,1473.0,1479.977,1492.0,106300,1507.0,1466.0
799,2017/11/29,1477.0,1485.21,1487.0,157500,1506.0,1470.0
800,2017/11/30,1434.0,1453.956,1464.0,177900,1505.0,1432.0
801,2017/12/01,1429.0,1427.072,1435.0,91400,1442.0,1415.0
802,2017/12/04,1409.0,1409.722,1417.0,92400,1425.0,1401.0
803,2017/12/05,1427.0,1410.414,1400.0,148100,1434.0,1384.0
804,2017/12/06,1377.0,1386.234,1408.0,122800,1408.0,1368.0
805,2017/12/07,1437.0,1427.838,1402.0,101500,1440.0,1402.0
806,2017/12/08,1452.0,1444.527,1436.0,84100,1458.0,1431.0
807,2017/12/11,1491.0,1479.482,1458.0,133200,1495.0,1447.0
808,2017/12/12,1504.0,1504.461,1490.0,203700,1515.0,1489.0
809,2017/12/13,1496.0,1495.587,1502.0,90600,1503.0,1485.0
810,2017/12/14,1503.0,1501.256,1481.0,120400,1519.0,1477.0
811,2017/12/15,1496.0,1484.961,1495.0,87900,1503.0,1460.0
812,2017/12/18,1530.0,1520.963,1506.0,134200,1535.0,1491.0
813,2017/12/19,1510.0,1513.981,1537.0,68500,1537.0,1503.0
814,2017/12/20,1528.0,1525.341,1507.0,93900,1534.0,1506.0
815,2017/12/21,1547.0,1546.93,1520.0,158400,1560.0,1520.0
816,2017/12/22,1608.0,1590.624,1550.0,223000,1615.0,1530.0
817,2017/12/25,1632.0,1625.324,1619.0,128900,1640.0,1600.0
818,2017/12/26,1608.0,1623.736,1633.0,85600,1645.0,1606.0
819,2017/12/27,1624.0,1626.094,1611.0,53300,1641.0,1600.0
820,2017/12/28,1609.0,1620.306,1624.0,55300,1635.0,1607.0
821,2017/12/29,1603.0,1607.629,1600.0,46100,1626.0,1576.0
822,2018/01/04,1629.0,1626.49,1604.0,64300,1645.0,1604.0
823,2018/01/05,1622.0,1621.273,1629.0,71400,1635.0,1610.0
824,2018/01/09,1668.0,1652.284,1628.0,103400,1675.0,1618.0
825,2018/01/10,1682.0,1681.856,1670.0,102300,1700.0,1656.0
826,2018/01/11,1678.0,1672.658,1677.0,49100,1681.0,1654.0
827,2018/01/12,1698.0,1693.992,1671.0,82100,1704.0,1671.0
828,2018/01/15,1699.0,1694.971,1702.0,54500,1708.0,1682.0
829,2018/01/16,1706.0,1696.315,1692.0,79700,1719.0,1670.0
830,2018/01/17,1687.0,1693.365,1686.0,130300,1714.0,1676.0
831,2018/01/18,2087.0,2052.501,2079.0,622900,2087.0,1990.0
832,2018/01/19,2102.0,2131.611,2170.0,1641500,2200.0,2068.0
833,2018/01/22,2241.0,2195.778,2180.0,786800,2242.0,2139.0
834,2018/01/23,2156.0,2184.513,2242.0,610700,2250.0,2133.0
835,2018/01/24,2170.0,2164.843,2156.0,238500,2198.0,2120.0
836,2018/01/25,2135.0,2127.344,2139.0,194300,2159.0,2107.0
837,2018/01/26,2127.0,2117.045,2146.0,174600,2146.0,2080.0
838,2018/01/29,2175.0,2168.545,2130.0,227000,2215.0,2094.0
839,2018/01/30,2122.0,2135.706,2125.0,216200,2191.0,2105.0
840,2018/01/31,2158.0,2157.133,2110.0,245100,2222.0,2059.0
841,2018/02/01,2128.0,2133.706,2158.0,200500,2169.0,2100.0
842,2018/02/02,2093.0,2114.902,2144.0,133000,2153.0,2091.0
843,2018/02/05,2034.0,2043.669,2043.0,215200,2081.0,2010.0
844,2018/02/06,1866.0,1853.694,1856.0,224100,1925.0,1786.0
845,2018/02/07,1914.0,1983.707,2076.0,213000,2076.0,1911.0
846,2018/02/08,2039.0,1993.74,1994.0,322600,2045.0,1930.0
847,2018/02/09,1937.0,1917.832,1836.0,220000,1948.0,1836.0
848,2018/02/13,1932.0,1950.274,1971.0,171100,1989.0,1920.0
849,2018/02/14,1865.0,1900.36,1940.0,185500,1965.0,1851.0
850,2018/02/15,1919.0,1915.885,1884.0,115600,1950.0,1866.0
851,2018/02/16,1908.0,1920.566,1925.0,91200,1960.0,1898.0
852,2018/02/19,2119.0,2053.943,1948.0,226000,2121.0,1942.0
853,2018/02/20,2222.0,2180.097,2122.0,335500,2228.0,2120.0
854,2018/02/21,2255.0,2216.518,2198.0,218200,2260.0,2146.0
855,2018/02/22,2265.0,2249.042,2250.0,188500,2277.0,2199.0
856,2018/02/23,2265.0,2280.033,2280.0,193900,2334.0,2252.0
857,2018/02/26,2139.0,2178.035,2298.0,238600,2299.0,2130.0
858,2018/02/27,2175.0,2186.446,2178.0,212300,2239.0,2148.0
859,2018/02/28,2217.0,2202.4,2160.0,162700,2244.0,2133.0
860,2018/03/01,2152.0,2159.708,2204.0,108300,2204.0,2138.0
861,2018/03/02,2135.0,2136.97,2101.0,128300,2166.0,2101.0
862,2018/03/05,2056.0,2065.178,2127.0,105600,2139.0,2038.0
863,2018/03/06,2107.0,2107.919,2099.0,82700,2140.0,2078.0
864,2018/03/07,2054.0,2055.02,2090.0,163600,2099.0,2038.0
865,2018/03/08,2064.0,2080.105,2085.0,57300,2116.0,2049.0
866,2018/03/09,2061.0,2067.479,2100.0,111000,2111.0,2042.0
867,2018/03/12,2110.0,2104.449,2084.0,80700,2131.0,2080.0
868,2018/03/13,2104.0,2089.762,2100.0,63500,2109.0,2073.0
869,2018/03/14,2165.0,2152.091,2104.0,161300,2175.0,2093.0
870,2018/03/15,2119.0,2119.396,2141.0,98100,2144.0,2094.0
871,2018/03/16,2088.0,2111.313,2153.0,108200,2162.0,2087.0
872,2018/03/19,1990.0,2006.373,2048.0,150500,2067.0,1977.0
873,2018/03/20,2028.0,1996.944,1958.0,156500,2032.0,1929.0
874,2018/03/22,2020.0,2007.254,2005.0,88200,2024.0,1980.0
875,2018/03/23,1943.0,1933.125,1933.0,151600,1952.0,1911.0
876,2018/03/26,1980.0,1947.734,1928.0,126900,1984.0,1908.0
877,2018/03/27,2035.0,2027.77,2046.0,151900,2065.0,2008.0
878,2018/03/28,2038.0,2024.735,2000.0,83900,2041.0,1997.0
879,2018/03/29,1949.0,1965.483,2063.0,128200,2067.0,1920.0
880,2018/03/30,1954.0,1953.693,1968.0,112700,1984.0,1934.0
881,2018/04/02,1996.0,1978.327,1952.0,100700,2004.0,1933.0
882,2018/04/03,2001.0,1974.203,1956.0,178500,2018.0,1924.0
883,2018/04/04,1951.0,1957.195,2001.0,158900,2003.0,1936.0
884,2018/04/05,1892.0,1898.023,1938.0,183000,1938.0,1868.0
885,2018/04/06,1881.0,1885.988,1870.0,68100,1909.0,1870.0
886,2018/04/09,1837.0,1846.282,1870.0,110600,1880.0,1832.0
887,2018/04/10,1847.0,1827.515,1824.0,108800,1860.0,1793.0
888,2018/04/11,1838.0,1836.291,1860.0,81900,1878.0,1809.0
889,2018/04/12,1843.0,1834.981,1835.0,52000,1846.0,1810.0
890,2018/04/13,1901.0,1892.316,1851.0,65600,1910.0,1851.0
891,2018/04/16,2107.0,2062.502,2051.0,502700,2122.0,1993.0
892,2018/04/17,2062.0,2112.092,2128.0,288600,2180.0,2056.0
893,2018/04/18,2099.0,2096.004,2079.0,138100,2117.0,2054.0
894,2018/04/19,2129.0,2113.664,2109.0,132000,2136.0,2088.0
895,2018/04/20,2115.0,2097.449,2120.0,148200,2125.0,2062.0
896,2018/04/23,2124.0,2119.843,2082.0,91700,2144.0,2075.0
897,2018/04/24,2159.0,2169.036,2132.0,216900,2202.0,2132.0
898,2018/04/25,2180.0,2176.701,2148.0,88900,2199.0,2143.0
899,2018/04/26,2250.0,2226.174,2189.0,322600,2261.0,2185.0
900,2018/04/27,2305.0,2299.574,2256.0,342600,2323.0,2256.0
901,2018/05/01,2270.0,2306.193,2330.0,188200,2380.0,2262.0
902,2018/05/02,2249.0,2236.122,2260.0,132000,2265.0,2202.0
903,2018/05/07,2218.0,2223.227,2251.0,124100,2252.0,2193.0
904,2018/05/08,2232.0,2225.274,2233.0,161900,2260.0,2197.0
905,2018/05/09,2236.0,2236.315,2245.0,165000,2278.0,2191.0
906,2018/05/10,2067.0,2093.548,2273.0,524900,2273.0,1961.0
907,2018/05/11,2125.0,2123.731,2129.0,201000,2156.0,2086.0
908,2018/05/14,2125.0,2101.943,2125.0,121900,2133.0,2050.0
909,2018/05/15,2086.0,2109.217,2140.0,122500,2156.0,2075.0
910,2018/05/16,2138.0,2126.055,2110.0,133800,2141.0,2102.0
911,2018/05/17,2157.0,2129.554,2155.0,197900,2176.0,2097.0
912,2018/05/18,2130.0,2124.507,2155.0,145800,2155.0,2097.0
913,2018/05/21,2191.0,2180.75,2145.0,184900,2208.0,2139.0
914,2018/05/22,2176.0,2169.91,2199.0,110200,2199.0,2150.0
915,2018/05/23,2150.0,2149.615,2171.0,91100,2186.0,2124.0
916,2018/05/24,2072.0,2086.125,2138.0,98700,2138.0,2059.0
917,2018/05/25,2016.0,2030.558,2059.0,84100,2079.0,2004.0
918,2018/05/28,2045.0,2045.839,2021.0,90200,2065.0,2018.0
919,2018/05/29,2053.0,2055.263,2046.0,100900,2086.0,2020.0
920,2018/05/30,2065.0,2059.422,2018.0,124600,2096.0,2008.0
921,2018/05/31,2057.0,2058.162,2081.0,112600,2088.0,2031.0
922,2018/06/01,2056.0,2053.048,2049.0,87100,2082.0,2015.0
923,2018/06/04,2112.0,2107.861,2072.0,88900,2127.0,2072.0
924,2018/06/05,2106.0,2120.133,2141.0,98900,2148.0,2097.0
925,2018/06/06,2105.0,2122.292,2105.0,77000,2147.0,2101.0
926,2018/06/07,2144.0,2132.215,2120.0,70100,2147.0,2101.0
927,2018/06/08,2172.0,2165.107,2126.0,148400,2196.0,2117.0
928,2018/06/11,2146.0,2147.037,2172.0,49300,2181.0,2133.0
929,2018/06/12,2212.0,2202.059,2186.0,127500,2217.0,2179.0
930,2018/06/13,2227.0,2220.335,2229.0,140100,2236.0,2185.0
931,2018/06/14,2224.0,2230.396,2210.0,71400,2249.0,2210.0
932,2018/06/15,2175.0,2201.307,2250.0,96800,2250.0,2156.0
933,2018/06/18,2105.0,2112.825,2175.0,75400,2175.0,2091.0
934,2018/06/19,2003.0,2034.153,2080.0,138000,2112.0,2001.0
935,2018/06/20,2007.0,1978.004,1985.0,115600,2015.0,1938.0
936,2018/06/21,1972.0,1977.358,1990.0,81300,1999.0,1965.0
937,2018/06/22,1937.0,1943.441,1957.0,92800,1969.0,1926.0
938,2018/06/25,1857.0,1881.607,1940.0,131700,1955.0,1853.0
939,2018/06/26,1846.0,1816.123,1831.0,208900,1852.0,1774.0
940,2018/06/27,1893.0,1876.302,1852.0,163200,1916.0,1830.0
941,2018/06/28,1892.0,1879.658,1885.0,103100,1906.0,1855.0
942,2018/06/29,1871.0,1873.84,1910.0,91900,1910.0,1859.0
943,2018/07/02,1804.0,1839.379,1865.0,118100,1878.0,1797.0
944,2018/07/03,1824.0,1820.117,1801.0,115900,1839.0,1797.0
945,2018/07/04,1780.0,1781.737,1817.0,107700,1817.0,1753.0
946,2018/07/05,1748.0,1756.142,1769.0,92900,1798.0,1740.0
947,2018/07/06,1797.0,1780.733,1764.0,66600,1802.0,1757.0
948,2018/07/09,1861.0,1831.533,1857.0,130100,1862.0,1790.0
949,2018/07/10,1881.0,1866.825,1860.0,141300,1898.0,1825.0
950,2018/07/11,1823.0,1817.211,1849.0,111200,1855.0,1791.0
951,2018/07/12,1840.0,1823.712,1821.0,73500,1846.0,1793.0
952,2018/07/13,1875.0,1877.829,1866.0,91400,1892.0,1860.0
953,2018/07/17,1848.0,1857.841,1883.0,73600,1896.0,1842.0
954,2018/07/18,1859.0,1850.346,1859.0,85000,1863.0,1831.0
955,2018/07/19,1887.0,1883.604,1871.0,120600,1897.0,1859.0
956,2018/07/20,1822.0,1843.865,1887.0,104200,1888.0,1815.0
957,2018/07/23,1810.0,1807.543,1800.0,88800,1823.0,1785.0
958,2018/07/24,1856.0,1838.846,1812.0,78400,1864.0,1795.0
959,2018/07/25,1898.0,1885.698,1859.0,97900,1908.0,1836.0
960,2018/07/26,1931.0,1922.168,1902.0,89700,1934.0,1898.0
961,2018/07/27,1974.0,1998.205,1963.0,238500,2028.0,1963.0
962,2018/07/30,1948.0,1945.456,1965.0,104200,1976.0,1914.0
963,2018/07/31,1972.0,1957.008,1949.0,108500,1988.0,1912.0
964,2018/08/01,1985.0,1972.564,1990.0,64000,1991.0,1954.0
965,2018/08/02,1954.0,1976.448,1980.0,58900,2009.0,1948.0
966,2018/08/03,1937.0,1958.684,1976.0,44000,1980.0,1933.0
967,2018/08/06,1888.0,1909.652,1922.0,79700,1956.0,1883.0
968,2018/08/07,1894.0,1886.594,1878.0,81100,1906.0,1873.0
969,2018/08/08,1957.0,1939.599,1900.0,97500,1966.0,1881.0
970,2018/08/09,1944.0,1940.386,1955.0,132500,1961.0,1903.0
971,2018/08/10,1545.0,1547.322,1550.0,1188300,1585.0,1544.0
972,2018/08/13,1454.0,1481.94,1514.0,314800,1518.0,1450.0
973,2018/08/14,1507.0,1511.992,1506.0,201200,1539.0,1493.0
974,2018/08/15,1484.0,1500.937,1516.0,135900,1536.0,1471.0
975,2018/08/16,1465.0,1464.513,1484.0,143400,1484.0,1444.0
976,2018/08/17,1504.0,1494.653,1495.0,64300,1507.0,1474.0
977,2018/08/20,1475.0,1484.921,1490.0,93800,1498.0,1474.0
978,2018/08/21,1453.0,1444.835,1457.0,109200,1459.0,1428.0
979,2018/08/22,1486.0,1450.372,1444.0,243600,1486.0,1414.0
980,2018/08/23,1452.0,1454.408,1479.0,158500,1479.0,1441.0
981,2018/08/24,1494.0,1484.529,1459.0,107000,1495.0,1453.0
982,2018/08/27,1484.0,1471.921,1476.0,170000,1485.0,1453.0
983,2018/08/28,1523.0,1525.562,1507.0,220100,1550.0,1495.0
984,2018/08/29,1548.0,1541.197,1515.0,141700,1554.0,1515.0
985,2018/08/30,1540.0,1541.799,1554.0,139100,1573.0,1514.0
986,2018/08/31,1534.0,1543.931,1530.0,102400,1561.0,1524.0
987,2018/09/03,1509.0,1510.673,1534.0,101200,1542.0,1496.0
988,2018/09/04,1500.0,1508.938,1520.0,48300,1525.0,1498.0
989,2018/09/05,1484.0,1498.342,1500.0,69400,1521.0,1484.0
990,2018/09/06,1436.0,1440.962,1467.0,181200,1469.0,1422.0
991,2018/09/07,1410.0,1410.724,1418.0,151800,1424.0,1396.0
992,2018/09/10,1420.0,1410.743,1396.0,64700,1427.0,1386.0
993,2018/09/11,1398.0,1398.214,1419.0,92100,1426.0,1384.0
994,2018/09/12,1340.0,1356.361,1406.0,196500,1412.0,1330.0
995,2018/09/13,1354.0,1360.659,1335.0,163200,1388.0,1335.0
996,2018/09/14,1418.0,1404.25,1365.0,118400,1428.0,1361.0
997,2018/09/18,1393.0,1404.18,1405.0,122200,1429.0,1382.0
998,2018/09/19,1427.0,1425.138,1418.0,117900,1440.0,1400.0
999,2018/09/20,1420.0,1428.136,1444.0,97200,1446.0,1410.0
1000,2018/09/21,1442.0,1445.777,1430.0,169600,1466.0,1425.0
1001,2018/09/25,1449.0,1444.285,1460.0,131100,1464.0,1420.0
1002,2018/09/26,1466.0,1462.061,1456.0,80200,1473.0,1444.0
1003,2018/09/27,1422.0,1433.257,1467.0,127800,1467.0,1417.0
1004,2018/09/28,1453.0,1455.261,1432.0,95300,1468.0,1431.0
1005,2018/10/01,1468.0,1467.271,1466.0,112800,1487.0,1441.0
1006,2018/10/02,1432.0,1449.414,1488.0,145100,1488.0,1426.0
1007,2018/10/03,1398.0,1415.607,1441.0,112200,1454.0,1385.0
1008,2018/10/04,1391.0,1384.13,1398.0,204500,1431.0,1353.0
1009,2018/10/05,1347.0,1353.556,1374.0,119800,1379.0,1336.0
1010,2018/10/09,1368.0,1374.587,1331.0,413700,1415.0,1323.0
1011,2018/10/10,1376.0,1385.21,1395.0,200800,1410.0,1359.0
1012,2018/10/11,1324.0,1315.384,1296.0,189500,1337.0,1288.0
1013,2018/10/12,1356.0,1352.129,1328.0,111600,1367.0,1325.0
1014,2018/10/15,1311.0,1318.452,1360.0,143000,1361.0,1306.0
1015,2018/10/16,1350.0,1358.198,1337.0,125500,1377.0,1306.0
1016,2018/10/17,1432.0,1423.263,1390.0,256900,1436.0,1390.0
1017,2018/10/18,1370.0,1383.965,1425.0,118800,1425.0,1362.0
1018,2018/10/19,1412.0,1398.787,1364.0,206200,1420.0,1351.0
1019,2018/10/22,1417.0,1414.776,1396.0,165600,1435.0,1386.0
1020,2018/10/23,1393.0,1396.165,1401.0,125200,1413.0,1384.0
1021,2018/10/24,1392.0,1398.742,1409.0,141200,1418.0,1380.0
1022,2018/10/25,1251.0,1283.807,1340.0,182100,1340.0,1249.0
1023,2018/10/26,1218.0,1230.555,1277.0,122400,1282.0,1204.0
1024,2018/10/29,1181.0,1197.623,1226.0,137100,1235.0,1178.0
1025,2018/10/30,1195.0,1195.577,1153.0,331600,1213.0,1137.0
1026,2018/10/31,1253.0,1239.654,1227.0,220900,1254.0,1213.0
1027,2018/11/01,1265.0,1261.806,1249.0,112600,1278.0,1233.0
1028,2018/11/02,1308.0,1287.835,1265.0,120400,1308.0,1265.0
1029,2018/11/05,1301.0,1300.506,1305.0,73700,1320.0,1280.0
1030,2018/11/06,1276.0,1275.842,1307.0,96300,1307.0,1258.0
1031,2018/11/07,1284.0,1288.681,1282.0,112800,1306.0,1256.0
1032,2018/11/08,1547.0,1521.38,1360.0,885500,1573.0,1358.0
1033,2018/11/09,1551.0,1560.257,1556.0,365400,1599.0,1530.0
1034,2018/11/12,1522.0,1533.321,1540.0,175600,1562.0,1516.0
1035,2018/11/13,1484.0,1483.046,1485.0,158400,1505.0,1460.0
1036,2018/11/14,1433.0,1449.012,1475.0,163300,1494.0,1424.0
1037,2018/11/15,1552.0,1544.193,1437.0,372300,1572.0,1437.0
1038,2018/11/16,1507.0,1531.458,1545.0,152700,1567.0,1500.0
1039,2018/11/19,1565.0,1545.683,1499.0,141200,1567.0,1484.0
1040,2018/11/20,1535.0,1536.958,1529.0,137200,1561.0,1512.0
1041,2018/11/21,1591.0,1583.737,1505.0,298400,1609.0,1497.0
1042,2018/11/22,1559.0,1561.993,1600.0,122300,1616.0,1532.0
1043,2018/11/26,1575.0,1568.811,1557.0,53400,1584.0,1536.0
1044,2018/11/27,1565.0,1577.637,1590.0,51200,1610.0,1560.0
1045,2018/11/28,1656.0,1632.848,1573.0,197200,1657.0,1558.0
1046,2018/11/29,1725.0,1717.067,1690.0,226800,1742.0,1667.0
1047,2018/11/30,1729.0,1712.944,1717.0,165400,1739.0,1675.0
1048,2018/12/03,1713.0,1720.883,1739.0,97700,1751.0,1704.0
1049,2018/12/04,1688.0,1684.609,1717.0,83300,1721.0,1666.0
1050,2018/12/05,1653.0,1648.749,1630.0,142600,1677.0,1584.0
1051,2018/12/06,1539.0,1565.991,1640.0,153300,1650.0,1524.0
1052,2018/12/07,1548.0,1536.565,1587.0,154300,1598.0,1488.0
1053,2018/12/10,1452.0,1461.287,1495.0,134400,1516.0,1421.0
1054,2018/12/11,1416.0,1429.372,1480.0,115700,1481.0,1404.0
1055,2018/12/12,1458.0,1461.76,1442.0,78300,1484.0,1431.0
1056,2018/12/13,1491.0,1486.596,1473.0,98000,1507.0,1451.0
1057,2018/12/14,1440.0,1447.88,1476.0,117100,1479.0,1416.0
1058,2018/12/17,1413.0,1413.325,1422.0,79900,1445.0,1396.0
1059,2018/12/18,1361.0,1367.637,1377.0,93400,1400.0,1341.0
1060,2018/12/19,1375.0,1367.555,1363.0,89400,1395.0,1323.0
1061,2018/12/20,1371.0,1379.98,1366.0,156600,1419.0,1343.0
1062,2018/12/21,1347.0,1345.856,1369.0,125300,1381.0,1312.0
1063,2018/12/25,1222.0,1248.286,1240.0,144900,1298.0,1220.0
1064,2018/12/26,1270.0,1263.101,1261.0,126600,1292.0,1230.0
1065,2018/12/27,1320.0,1358.206,1369.0,97300,1382.0,1320.0
1066,2018/12/28,1407.0,1393.383,1350.0,108500,1411.0,1341.0
1067,2019/01/04,1315.0,1301.79,1347.0,213300,1347.0,1250.0
1068,2019/01/07,1380.0,1382.228,1350.0,82800,1406.0,1350.0
1069,2019/01/08,1381.0,1376.51,1391.0,131200,1400.0,1352.0
1070,2019/01/09,1380.0,1389.0,1411.0,75100,1415.0,1373.0
1071,2019/01/10,1333.0,1343.076,1371.0,71000,1376.0,1330.0
1072,2019/01/11,1331.0,1340.67,1349.0,62400,1367.0,1321.0
1073,2019/01/15,1393.0,1369.678,1320.0,75800,1397.0,1310.0
1074,2019/01/16,1361.0,1365.986,1398.0,43100,1398.0,1350.0
1075,2019/01/17,1405.0,1401.82,1378.0,73900,1426.0,1370.0
1076,2019/01/18,1383.0,1381.386,1402.0,112000,1408.0,1354.0
1077,2019/01/21,1387.0,1385.477,1385.0,83700,1406.0,1361.0
1078,2019/01/22,1348.0,1355.532,1390.0,77800,1397.0,1344.0
1079,2019/01/23,1355.0,1353.32,1333.0,68500,1374.0,1321.0
1080,2019/01/24,1403.0,1387.264,1357.0,57100,1404.0,1350.0
1081,2019/01/25,1431.0,1426.412,1396.0,77500,1449.0,1396.0
1082,2019/01/28,1431.0,1436.848,1431.0,43300,1455.0,1426.0
1083,2019/01/29,1402.0,1392.353,1413.0,57000,1414.0,1376.0
1084,2019/01/30,1368.0,1375.977,1385.0,69300,1394.0,1367.0
1085,2019/01/31,1437.0,1429.909,1395.0,86400,1453.0,1395.0
1086,2019/02/01,1525.0,1524.723,1492.0,243300,1575.0,1490.0
1087,2019/02/04,1592.0,1566.591,1592.0,250600,1606.0,1510.0
1088,2019/02/05,1579.0,1601.787,1615.0,198600,1654.0,1558.0
1089,2019/02/06,1585.0,1569.429,1590.0,93000,1590.0,1536.0
1090,2019/02/07,1506.0,1520.737,1580.0,184100,1597.0,1465.0
1091,2019/02/08,1541.0,1545.227,1490.0,155300,1580.0,1478.0
1092,2019/02/12,1602.0,1611.941,1581.0,247700,1644.0,1580.0
1093,2019/02/13,1609.0,1618.118,1602.0,136800,1637.0,1593.0
1094,2019/02/14,1598.0,1615.653,1613.0,100400,1646.0,1598.0
1095,2019/02/15,1600.0,1605.943,1591.0,83500,1620.0,1578.0
1096,2019/02/18,1632.0,1645.266,1649.0,95200,1680.0,1627.0
1097,2019/02/19,1663.0,1662.395,1639.0,124800,1680.0,1631.0
1098,2019/02/20,1650.0,1654.814,1660.0,99100,1673.0,1641.0
1099,2019/02/21,1627.0,1635.212,1660.0,106900,1662.0,1619.0
1100,2019/02/22,1610.0,1602.369,1626.0,79200,1626.0,1588.0
1101,2019/02/25,1616.0,1619.926,1623.0,68700,1644.0,1601.0
1102,2019/02/26,1615.0,1613.992,1611.0,65600,1632.0,1598.0
1103,2019/02/27,1609.0,1606.548,1600.0,71200,1623.0,1591.0
1104,2019/02/28,1577.0,1585.342,1597.0,92400,1607.0,1573.0
1105,2019/03/01,1589.0,1587.98,1572.0,64500,1600.0,1565.0
1106,2019/03/04,1633.0,1622.538,1620.0,72100,1636.0,1604.0
1107,2019/03/05,1618.0,1619.142,1633.0,84600,1636.0,1603.0
1108,2019/03/06,1695.0,1681.057,1632.0,341200,1717.0,1610.0
1109,2019/03/07,1607.0,1623.853,1685.0,218500,1686.0,1588.0
1110,2019/03/08,1518.0,1535.765,1568.0,192200,1577.0,1508.0
1111,2019/03/11,1471.0,1477.889,1510.0,131100,1512.0,1459.0
1112,2019/03/12,1537.0,1530.803,1507.0,77700,1544.0,1507.0
1113,2019/03/13,1543.0,1539.662,1532.0,78900,1551.0,1527.0
1114,2019/03/14,1499.0,1525.767,1561.0,57500,1569.0,1499.0
1115,2019/03/15,1513.0,1514.451,1501.0,49900,1531.0,1494.0
1116,2019/03/18,1558.0,1543.81,1530.0,51500,1558.0,1516.0
1117,2019/03/19,1566.0,1559.65,1560.0,58800,1580.0,1527.0
1118,2019/03/20,1609.0,1598.087,1573.0,91900,1614.0,1573.0
1119,2019/03/22,1602.0,1605.909,1619.0,56200,1626.0,1592.0
1120,2019/03/25,1559.0,1551.486,1568.0,52300,1570.0,1536.0
1121,2019/03/26,1602.0,1589.756,1561.0,62700,1602.0,1559.0
1122,2019/03/27,1620.0,1608.777,1593.0,66500,1624.0,1583.0
1123,2019/03/28,1610.0,1591.777,1600.0,133000,1622.0,1549.0
1124,2019/03/29,1614.0,1610.139,1629.0,55500,1629.0,1582.0
1125,2019/04/01,1657.0,1658.348,1646.0,147000,1685.0,1631.0
1126,2019/04/02,1693.0,1704.24,1681.0,217900,1735.0,1681.0
1127,2019/04/03,1746.0,1726.895,1692.0,177200,1749.0,1688.0
1128,2019/04/04,1735.0,1744.697,1746.0,168800,1762.0,1726.0
1129,2019/04/05,1766.0,1758.751,1744.0,142800,1782.0,1721.0
1130,2019/04/08,1760.0,1766.097,1788.0,104000,1808.0,1736.0
1131,2019/04/09,1762.0,1757.781,1755.0,58800,1784.0,1738.0
1132,2019/04/10,1748.0,1745.493,1738.0,76100,1760.0,1719.0
1133,2019/04/11,1718.0,1726.734,1735.0,54400,1750.0,1712.0
1134,2019/04/12,1753.0,1736.469,1721.0,77400,1754.0,1709.0
1135,2019/04/15,1773.0,1778.726,1798.0,82500,1798.0,1765.0
1136,2019/04/16,1746.0,1743.752,1752.0,76100,1769.0,1726.0
1137,2019/04/17,1790.0,1772.75,1743.0,68000,1791.0,1742.0
1138,2019/04/18,1786.0,1818.067,1809.0,154400,1846.0,1782.0
1139,2019/04/19,1838.0,1844.239,1815.0,148400,1873.0,1807.0
1140,2019/04/22,1783.0,1793.701,1833.0,155900,1833.0,1761.0
1141,2019/04/23,1777.0,1774.85,1784.0,73400,1803.0,1750.0
1142,2019/04/24,1751.0,1768.237,1773.0,44800,1798.0,1751.0
1143,2019/04/25,1781.0,1776.117,1752.0,44300,1790.0,1742.0
1144,2019/04/26,1767.0,1751.447,1752.0,58200,1777.0,1728.0
1145,2019/05/07,1698.0,1719.899,1777.0,103400,1777.0,1695.0
1146,2019/05/08,1696.0,1694.256,1675.0,81800,1719.0,1658.0
1147,2019/05/09,1686.0,1702.998,1696.0,98300,1745.0,1679.0
1148,2019/05/10,1659.0,1680.491,1682.0,124000,1735.0,1651.0
1149,2019/05/13,1647.0,1652.168,1646.0,111600,1679.0,1621.0
1150,2019/05/14,1856.0,1799.876,1687.0,533000,1873.0,1679.0
1151,2019/05/15,1852.0,1853.558,1872.0,202700,1879.0,1813.0
1152,2019/05/16,1771.0,1784.438,1848.0,112300,1848.0,1757.0
1153,2019/05/17,1815.0,1809.312,1804.0,55800,1821.0,1794.0
1154,2019/05/20,1756.0,1762.318,1830.0,106400,1841.0,1724.0
1155,2019/05/21,1713.0,1725.336,1745.0,99600,1747.0,1708.0
1156,2019/05/22,1786.0,1790.71,1745.0,108800,1814.0,1735.0
1157,2019/05/23,1803.0,1790.054,1784.0,85000,1813.0,1755.0
1158,2019/05/24,1793.0,1808.634,1771.0,95900,1834.0,1771.0
1159,2019/05/27,1955.0,1935.318,1873.0,446200,1960.0,1870.0
1160,2019/05/28,2027.0,2005.763,1989.0,414700,2039.0,1945.0
1161,2019/05/29,1993.0,2004.294,2000.0,184100,2030.0,1977.0
1162,2019/05/30,2030.0,2014.943,1977.0,214900,2042.0,1946.0
1163,2019/05/31,2058.0,2063.366,2011.0,275800,2089.0,2010.0
1164,2019/06/03,1998.0,2006.158,2021.0,253000,2073.0,1965.0
1165,2019/06/04,2076.0,2072.4,2045.0,237400,2100.0,2041.0
1166,2019/06/05,2077.0,2099.918,2133.0,198200,2160.0,2067.0
1167,2019/06/06,2042.0,2069.284,2080.0,126500,2100.0,2042.0
1168,2019/06/07,2095.0,2077.921,2067.0,90700,2095.0,2050.0
1169,2019/06/10,2136.0,2132.181,2106.0,133400,2148.0,2106.0
1170,2019/06/11,2160.0,2141.825,2133.0,131400,2160.0,2107.0
1171,2019/06/12,2141.0,2148.15,2149.0,106800,2175.0,2132.0
1172,2019/06/13,2078.0,2079.848,2110.0,138300,2118.0,2052.0
1173,2019/06/14,2101.0,2100.471,2078.0,91100,2127.0,2065.0
1174,2019/06/17,2082.0,2082.724,2100.0,79600,2102.0,2065.0
1175,2019/06/18,2023.0,2048.103,2082.0,129400,2107.0,2015.0
1176,2019/06/19,2128.0,2128.347,2093.0,180400,2157.0,2093.0
1177,2019/06/20,2109.0,2120.13,2128.0,108000,2143.0,2100.0
1178,2019/06/21,2103.0,2106.487,2112.0,75600,2128.0,2089.0
1179,2019/06/24,2119.0,2109.423,2091.0,73500,2132.0,2075.0
1180,2019/06/25,2096.0,2102.963,2099.0,59800,2138.0,2084.0
1181,2019/06/26,2137.0,2167.816,2129.0,247500,2207.0,2122.0
1182,2019/06/27,2184.0,2166.9,2171.0,143700,2184.0,2141.0
1183,2019/06/28,2212.0,2206.808,2175.0,185300,2224.0,2169.0
1184,2019/07/01,2264.0,2255.381,2250.0,159900,2273.0,2227.0
1185,2019/07/02,2256.0,2257.528,2269.0,109300,2270.0,2246.0
1186,2019/07/03,2221.0,2206.09,2226.0,161900,2230.0,2184.0
1187,2019/07/04,2211.0,2222.541,2252.0,89100,2258.0,2205.0
1188,2019/07/05,2184.0,2169.862,2189.0,161800,2193.0,2123.0
1189,2019/07/08,2191.0,2195.568,2189.0,106100,2222.0,2175.0
1190,2019/07/09,2160.0,2162.001,2191.0,187300,2191.0,2138.0
1191,2019/07/10,2193.0,2180.565,2153.0,113900,2207.0,2140.0
1192,2019/07/11,2198.0,2193.076,2199.0,65900,2209.0,2165.0
1193,2019/07/12,2149.0,2162.84,2186.0,88100,2188.0,2143.0
1194,2019/07/16,2151.0,2155.638,2150.0,57200,2174.0,2130.0
1195,2019/07/17,2152.0,2143.617,2155.0,39700,2157.0,2127.0
1196,2019/07/18,2084.0,2100.807,2127.0,86400,2138.0,2078.0
1197,2019/07/19,2157.0,2143.508,2088.0,107900,2165.0,2082.0
1198,2019/07/22,2219.0,2210.573,2157.0,161800,2236.0,2157.0
1199,2019/07/23,2221.0,2235.019,2220.0,109100,2263.0,2215.0
1200,2019/07/24,2297.0,2273.493,2249.0,181200,2303.0,2232.0
1201,2019/07/25,2379.0,2366.331,2299.0,306000,2408.0,2290.0
1202,2019/07/26,2338.0,2328.194,2370.0,140400,2370.0,2295.0
1203,2019/07/29,2303.0,2317.389,2348.0,76900,2355.0,2298.0
1204,2019/07/30,2306.0,2308.029,2299.0,108900,2339.0,2296.0
1205,2019/07/31,2306.0,2298.814,2280.0,76700,2319.0,2268.0
1206,2019/08/01,2337.0,2320.549,2286.0,89400,2338.0,2274.0
1207,2019/08/02,2249.0,2254.647,2279.0,194400,2283.0,2238.0
1208,2019/08/05,2149.0,2137.952,2209.0,248500,2209.0,2093.0
1209,2019/08/06,2119.0,2069.532,1999.0,251100,2121.0,1988.0
1210,2019/08/07,2395.0,2348.879,2119.0,705100,2434.0,2060.0
1211,2019/08/08,2606.0,2540.46,2393.0,832200,2607.0,2380.0
1212,2019/08/09,2742.0,2736.621,2600.0,699400,2805.0,2599.0
1213,2019/08/13,2761.0,2750.518,2719.0,302600,2783.0,2683.0
1214,2019/08/14,2628.0,2656.718,2726.0,404400,2780.0,2604.0
1215,2019/08/15,2669.0,2624.228,2569.0,280600,2680.0,2550.0
1216,2019/08/16,2559.0,2600.834,2686.0,199600,2692.0,2550.0
1217,2019/08/19,2566.0,2583.357,2599.0,190000,2640.0,2552.0
1218,2019/08/20,2620.0,2583.515,2554.0,173100,2629.0,2514.0
1219,2019/08/21,2624.0,2615.684,2670.0,186500,2671.0,2578.0
1220,2019/08/22,2579.0,2601.418,2625.0,161700,2646.0,2564.0
1221,2019/08/23,2554.0,2550.265,2579.0,182500,2583.0,2527.0
