ds,yhat
2019-07-16,751.3974794185702
2019-07-17,745.6696106279559
2019-07-18,738.7495229650859
2019-07-19,735.5716131705933
2019-07-22,745.310216624428
2019-07-23,746.6487604106102
2019-07-24,748.3500407305758
2019-07-25,753.0318556084843
2019-07-26,760.6759768297595
2019-07-29,781.436340812182
2019-07-30,789.9270759077322
2019-07-31,802.141591870341
2019-08-01,815.1032740311272
2019-08-02,823.2306367986589
2019-08-05,814.9273585655767
2019-08-06,820.3341855550406
2019-08-07,834.1300123284974
2019-08-08,849.7357878528851
2019-08-09,859.5609035922927
