,Date,Close,VWAP,Open,Volume,High,Low
0,2014/08/25,130.0,129.199,130.0,33200,130.0,128.0
1,2014/08/26,129.0,128.996,130.0,22100,130.0,128.0
2,2014/08/27,130.0,129.756,130.0,36400,130.0,128.0
3,2014/08/28,130.0,129.455,130.0,27900,130.0,129.0
4,2014/08/29,130.0,129.99,130.0,20600,130.0,129.0
5,2014/09/01,131.0,129.942,130.0,63900,131.0,129.0
6,2014/09/02,131.0,132.406,133.0,66800,134.0,130.0
7,2014/09/03,131.0,131.692,132.0,31500,132.0,131.0
8,2014/09/04,131.0,130.473,130.0,27700,132.0,130.0
9,2014/09/05,129.0,130.208,131.0,34600,131.0,129.0
10,2014/09/08,130.0,128.744,128.0,38300,130.0,128.0
11,2014/09/09,129.0,129.73,131.0,28500,131.0,129.0
12,2014/09/10,130.0,129.466,130.0,13100,130.0,129.0
13,2014/09/11,129.0,129.325,130.0,41200,131.0,128.0
14,2014/09/12,129.0,129.555,130.0,37300,130.0,129.0
15,2014/09/16,127.0,127.82,128.0,92700,129.0,126.0
16,2014/09/17,126.0,126.921,127.0,25400,128.0,126.0
17,2014/09/18,128.0,126.885,126.0,47000,128.0,126.0
18,2014/09/19,129.0,128.38,129.0,23400,129.0,128.0
19,2014/09/22,129.0,129.936,129.0,75100,131.0,129.0
20,2014/09/24,129.0,129.25,129.0,6000,130.0,129.0
21,2014/09/25,130.0,129.864,131.0,45500,131.0,128.0
22,2014/09/26,128.0,128.384,128.0,13800,130.0,128.0
23,2014/09/29,130.0,129.836,130.0,61400,131.0,128.0
24,2014/09/30,127.0,127.875,129.0,52700,130.0,127.0
25,2014/10/01,126.0,127.225,128.0,22200,128.0,126.0
26,2014/10/02,123.0,123.948,124.0,61300,125.0,123.0
27,2014/10/03,125.0,124.366,123.0,28400,125.0,123.0
28,2014/10/06,126.0,125.867,127.0,20300,127.0,125.0
29,2014/10/07,125.0,126.654,126.0,50600,129.0,125.0
30,2014/10/08,125.0,126.119,124.0,89900,129.0,123.0
31,2014/10/09,122.0,123.684,125.0,96700,126.0,122.0
32,2014/10/10,121.0,120.651,120.0,60700,122.0,120.0
33,2014/10/14,120.0,118.747,119.0,81100,120.0,117.0
34,2014/10/15,127.0,127.196,130.0,474900,133.0,122.0
35,2014/10/16,122.0,122.598,125.0,86500,125.0,120.0
36,2014/10/17,121.0,122.832,123.0,48800,125.0,121.0
37,2014/10/20,125.0,124.478,123.0,27200,125.0,123.0
38,2014/10/21,123.0,124.236,126.0,15700,126.0,123.0
39,2014/10/22,124.0,124.578,125.0,30600,125.0,123.0
40,2014/10/23,122.0,122.585,123.0,27000,124.0,122.0
41,2014/10/24,123.0,122.891,123.0,13800,124.0,122.0
42,2014/10/27,124.0,123.787,124.0,8900,124.0,123.0
43,2014/10/28,123.0,123.368,123.0,5700,124.0,123.0
44,2014/10/29,124.0,123.293,124.0,14700,124.0,123.0
45,2014/10/30,122.0,122.538,124.0,52600,124.0,122.0
46,2014/10/31,124.0,123.82,123.0,44500,125.0,122.0
47,2014/11/04,124.0,124.669,125.0,49900,126.0,124.0
48,2014/11/05,124.0,124.281,124.0,24900,125.0,124.0
49,2014/11/06,126.0,128.175,129.0,279000,130.0,125.0
50,2014/11/07,127.0,127.204,127.0,90100,128.0,126.0
51,2014/11/10,128.0,127.989,128.0,102900,129.0,127.0
52,2014/11/11,129.0,129.077,129.0,38800,130.0,128.0
53,2014/11/12,127.0,127.609,129.0,36300,130.0,127.0
54,2014/11/13,126.0,125.506,126.0,48600,126.0,124.0
55,2014/11/14,125.0,125.666,127.0,61000,127.0,125.0
56,2014/11/17,124.0,124.37,125.0,40500,125.0,124.0
57,2014/11/18,128.0,125.897,124.0,73700,128.0,124.0
58,2014/11/19,128.0,127.769,127.0,60500,129.0,127.0
59,2014/11/20,128.0,128.138,128.0,49900,129.0,128.0
60,2014/11/21,128.0,128.088,129.0,31900,129.0,127.0
61,2014/11/25,127.0,127.264,128.0,34800,128.0,126.0
62,2014/11/26,127.0,127.647,128.0,30900,128.0,127.0
63,2014/11/27,127.0,127.627,128.0,44000,128.0,127.0
64,2014/11/28,132.0,130.147,127.0,177600,133.0,127.0
65,2014/12/01,129.0,129.709,131.0,105500,132.0,128.0
66,2014/12/02,131.0,129.882,129.0,69700,132.0,128.0
67,2014/12/03,130.0,131.079,132.0,60600,133.0,130.0
68,2014/12/04,129.0,130.161,131.0,41000,131.0,129.0
69,2014/12/05,129.0,129.503,129.0,103400,132.0,128.0
70,2014/12/08,129.0,129.139,128.0,54700,131.0,128.0
71,2014/12/09,128.0,128.388,129.0,44800,129.0,127.0
72,2014/12/10,126.0,125.982,126.0,79500,127.0,125.0
73,2014/12/11,125.0,124.588,125.0,44700,126.0,123.0
74,2014/12/12,126.0,125.084,124.0,43100,128.0,124.0
75,2014/12/15,126.0,125.861,126.0,34600,127.0,125.0
76,2014/12/16,124.0,124.388,125.0,47900,125.0,123.0
77,2014/12/17,123.0,123.347,124.0,56700,124.0,122.0
78,2014/12/18,127.0,125.902,125.0,37700,127.0,125.0
79,2014/12/19,126.0,125.74,127.0,51200,127.0,124.0
80,2014/12/22,126.0,125.437,126.0,82800,127.0,124.0
81,2014/12/24,124.0,125.902,125.0,95000,127.0,124.0
82,2014/12/25,121.0,122.585,124.0,137900,124.0,121.0
83,2014/12/26,124.0,123.074,123.0,25700,124.0,122.0
84,2014/12/29,122.0,123.912,124.0,129900,126.0,122.0
85,2014/12/30,126.0,125.83,122.0,492600,128.0,122.0
86,2015/01/05,128.0,127.118,127.0,62100,129.0,126.0
87,2015/01/06,125.0,126.002,126.0,43200,127.0,125.0
88,2015/01/07,124.0,124.221,123.0,46200,126.0,123.0
89,2015/01/08,125.0,125.385,126.0,16100,126.0,125.0
90,2015/01/09,123.0,124.399,125.0,64200,126.0,123.0
91,2015/01/13,123.0,123.227,123.0,22500,124.0,123.0
92,2015/01/14,122.0,121.975,122.0,84700,123.0,121.0
93,2015/01/15,123.0,122.21,121.0,16200,123.0,121.0
94,2015/01/16,122.0,122.56,122.0,12500,123.0,122.0
95,2015/01/19,123.0,122.54,123.0,17400,123.0,122.0
96,2015/01/20,124.0,123.481,123.0,31600,124.0,123.0
97,2015/01/21,123.0,124.163,125.0,27600,125.0,123.0
98,2015/01/22,124.0,123.857,124.0,25200,124.0,123.0
99,2015/01/23,127.0,125.539,125.0,79400,128.0,124.0
100,2015/01/26,126.0,125.828,126.0,18000,126.0,125.0
101,2015/01/27,127.0,127.032,127.0,74400,129.0,126.0
102,2015/01/28,128.0,127.222,128.0,49600,128.0,126.0
103,2015/01/29,126.0,125.977,126.0,26600,127.0,125.0
104,2015/01/30,127.0,126.442,126.0,16300,127.0,126.0
105,2015/02/02,124.0,125.527,127.0,43300,127.0,124.0
106,2015/02/03,123.0,123.494,124.0,66000,125.0,122.0
107,2015/02/04,125.0,123.516,124.0,70000,125.0,122.0
108,2015/02/05,124.0,123.768,125.0,46500,125.0,123.0
109,2015/02/06,125.0,124.979,124.0,42800,126.0,124.0
110,2015/02/09,127.0,127.578,127.0,232500,129.0,126.0
111,2015/02/10,125.0,126.143,127.0,45600,128.0,125.0
112,2015/02/12,126.0,126.838,126.0,81600,128.0,126.0
113,2015/02/13,125.0,125.779,128.0,54200,128.0,125.0
114,2015/02/16,126.0,126.85,127.0,53900,128.0,126.0
115,2015/02/17,126.0,126.085,126.0,25900,127.0,125.0
116,2015/02/18,127.0,126.294,127.0,87300,127.0,125.0
117,2015/02/19,129.0,129.146,127.0,233400,133.0,126.0
118,2015/02/20,129.0,129.206,130.0,28600,130.0,128.0
119,2015/02/23,131.0,130.111,130.0,161900,132.0,128.0
120,2015/02/24,131.0,130.157,131.0,93100,132.0,129.0
121,2015/02/25,128.0,129.532,131.0,85100,131.0,128.0
122,2015/02/26,129.0,128.715,130.0,95800,131.0,127.0
123,2015/02/27,130.0,132.799,133.0,570200,138.0,130.0
124,2015/03/02,130.0,129.734,132.0,188500,132.0,128.0
125,2015/03/03,128.0,128.524,131.0,127600,131.0,127.0
126,2015/03/04,130.0,129.47,128.0,57500,131.0,128.0
127,2015/03/05,131.0,131.009,130.0,54700,132.0,130.0
128,2015/03/06,133.0,132.88,133.0,66500,134.0,132.0
129,2015/03/09,131.0,132.377,133.0,56700,133.0,131.0
130,2015/03/10,131.0,131.536,131.0,83200,134.0,130.0
131,2015/03/11,131.0,130.083,129.0,32600,132.0,129.0
132,2015/03/12,132.0,131.538,131.0,59700,132.0,130.0
133,2015/03/13,131.0,132.288,131.0,72200,134.0,131.0
134,2015/03/16,131.0,129.523,130.0,113600,131.0,128.0
135,2015/03/17,129.0,129.999,130.0,73100,131.0,129.0
136,2015/03/18,127.0,127.75,131.0,208700,131.0,126.0
137,2015/03/19,127.0,126.682,127.0,64400,128.0,126.0
138,2015/03/20,127.0,127.484,127.0,21500,128.0,127.0
139,2015/03/23,128.0,127.065,127.0,18600,128.0,126.0
140,2015/03/24,128.0,127.509,128.0,11600,128.0,127.0
141,2015/03/25,178.0,158.075,127.0,11246300,178.0,127.0
142,2015/03/26,204.0,221.016,219.0,17228200,228.0,195.0
143,2015/03/27,284.0,260.885,196.0,24029800,284.0,189.0
144,2015/03/30,364.0,348.727,324.0,14581900,364.0,317.0
145,2015/03/31,325.0,387.786,396.0,17585400,440.0,315.0
146,2015/04/01,362.0,374.427,332.0,14897400,405.0,330.0
147,2015/04/02,312.0,332.2,338.0,7457500,374.0,305.0
148,2015/04/03,301.0,323.974,346.0,5560200,356.0,297.0
149,2015/04/06,291.0,298.922,301.0,3167600,325.0,286.0
150,2015/04/07,298.0,305.345,314.0,3805100,317.0,291.0
151,2015/04/08,298.0,295.04,299.0,1711400,304.0,287.0
152,2015/04/09,289.0,289.234,293.0,781400,296.0,285.0
153,2015/04/10,275.0,279.559,289.0,975200,289.0,274.0
154,2015/04/13,272.0,284.848,271.0,4280400,307.0,264.0
155,2015/04/14,276.0,277.313,265.0,1410300,292.0,264.0
156,2015/04/15,274.0,277.155,270.0,808400,287.0,270.0
157,2015/04/16,273.0,274.825,275.0,508500,285.0,270.0
158,2015/04/17,263.0,265.399,272.0,550800,272.0,261.0
159,2015/04/20,259.0,258.734,256.0,299100,263.0,256.0
160,2015/04/21,267.0,268.032,261.0,1042600,278.0,260.0
161,2015/04/22,297.0,285.677,279.0,3081800,297.0,271.0
162,2015/04/23,305.0,300.786,299.0,2906100,307.0,290.0
163,2015/04/24,285.0,294.07,313.0,2672700,314.0,282.0
164,2015/04/27,282.0,284.801,286.0,931500,297.0,280.0
165,2015/04/28,266.0,268.435,283.0,960400,285.0,262.0
166,2015/04/30,253.0,257.818,263.0,684100,263.0,253.0
167,2015/05/01,231.0,235.181,245.0,1108800,245.0,229.0
168,2015/05/07,235.0,233.351,235.0,593200,237.0,228.0
169,2015/05/08,233.0,231.148,235.0,488200,235.0,225.0
170,2015/05/11,235.0,238.095,233.0,714100,247.0,230.0
171,2015/05/12,231.0,232.503,232.0,290300,237.0,230.0
172,2015/05/13,217.0,220.615,231.0,842800,233.0,214.0
173,2015/05/14,218.0,218.182,219.0,313100,221.0,215.0
174,2015/05/15,219.0,221.951,220.0,266900,230.0,218.0
175,2015/05/18,217.0,216.767,219.0,222600,220.0,213.0
176,2015/05/19,228.0,222.57,215.0,599700,230.0,212.0
177,2015/05/20,224.0,222.047,220.0,365900,227.0,219.0
178,2015/05/21,223.0,226.342,224.0,418600,233.0,223.0
179,2015/05/22,219.0,220.786,223.0,264900,226.0,217.0
180,2015/05/25,224.0,221.599,224.0,202300,225.0,217.0
181,2015/05/26,224.0,230.261,225.0,965400,241.0,221.0
182,2015/05/27,224.0,228.861,221.0,688000,236.0,221.0
183,2015/05/28,222.0,222.88,225.0,302500,227.0,218.0
184,2015/05/29,219.0,220.356,223.0,141400,223.0,219.0
185,2015/06/01,277.0,262.4,231.0,28575900,284.0,228.0
186,2015/06/02,263.0,263.316,271.0,8771600,272.0,256.0
187,2015/06/03,251.0,254.212,260.0,1787300,261.0,250.0
188,2015/06/04,241.0,243.827,247.0,1292300,249.0,239.0
189,2015/06/05,242.0,245.105,240.0,991700,253.0,239.0
190,2015/06/08,241.0,240.805,243.0,281100,243.0,239.0
191,2015/06/09,235.0,236.874,240.0,392600,240.0,235.0
192,2015/06/10,227.0,229.177,232.0,352800,233.0,227.0
193,2015/06/11,230.0,228.466,227.0,198500,232.0,226.0
194,2015/06/12,228.0,227.022,228.0,157700,228.0,226.0
195,2015/06/15,225.0,225.268,228.0,176300,228.0,223.0
196,2015/06/16,222.0,224.245,225.0,145000,227.0,222.0
197,2015/06/17,223.0,223.03,222.0,97000,225.0,222.0
198,2015/06/18,223.0,223.065,222.0,110800,227.0,221.0
199,2015/06/19,221.0,219.503,221.0,167500,224.0,217.0
200,2015/06/22,223.0,223.305,225.0,172400,226.0,220.0
201,2015/06/23,222.0,220.565,223.0,204300,223.0,218.0
202,2015/06/24,221.0,221.043,221.0,86400,222.0,220.0
203,2015/06/25,224.0,224.818,224.0,231300,228.0,222.0
204,2015/06/26,245.0,251.527,229.0,9024200,270.0,228.0
205,2015/06/29,237.0,237.566,238.0,1156200,242.0,231.0
206,2015/06/30,229.0,230.797,233.0,406200,234.0,227.0
207,2015/07/01,225.0,224.549,225.0,298300,227.0,223.0
208,2015/07/02,226.0,225.483,226.0,203500,229.0,223.0
209,2015/07/03,222.0,222.935,228.0,196800,228.0,222.0
210,2015/07/06,216.0,217.321,220.0,241700,220.0,214.0
211,2015/07/07,216.0,216.732,215.0,146600,219.0,215.0
212,2015/07/08,197.0,202.221,215.0,747400,218.0,193.0
213,2015/07/09,193.0,187.908,192.0,498900,195.0,178.0
214,2015/07/10,191.0,191.121,190.0,233100,194.0,190.0
215,2015/07/13,198.0,195.868,192.0,149400,199.0,192.0
216,2015/07/14,214.0,218.603,197.0,3178000,228.0,197.0
217,2015/07/15,218.0,217.879,213.0,1275500,226.0,213.0
218,2015/07/16,216.0,215.731,216.0,217300,220.0,214.0
219,2015/07/17,216.0,215.46,216.0,120800,217.0,214.0
220,2015/07/21,216.0,218.378,214.0,426700,225.0,214.0
221,2015/07/22,221.0,219.799,217.0,315900,223.0,216.0
222,2015/07/23,218.0,220.647,221.0,170300,224.0,217.0
223,2015/07/24,216.0,216.997,219.0,115500,220.0,215.0
224,2015/07/27,212.0,213.792,215.0,75400,216.0,212.0
225,2015/07/28,206.0,204.74,206.0,239100,209.0,202.0
226,2015/07/29,206.0,205.768,206.0,71600,208.0,204.0
227,2015/07/30,205.0,202.751,203.0,116500,205.0,201.0
228,2015/07/31,201.0,202.121,204.0,115300,205.0,200.0
229,2015/08/03,200.0,201.324,203.0,68900,204.0,200.0
230,2015/08/04,198.0,199.912,202.0,60300,202.0,198.0
231,2015/08/05,202.0,200.155,198.0,156600,206.0,196.0
232,2015/08/06,202.0,205.091,205.0,93400,210.0,202.0
233,2015/08/07,200.0,201.94,202.0,58600,205.0,200.0
234,2015/08/10,197.0,197.262,200.0,89300,200.0,196.0
235,2015/08/11,199.0,196.969,197.0,68400,199.0,195.0
236,2015/08/12,196.0,197.604,200.0,69200,201.0,195.0
237,2015/08/13,194.0,195.245,198.0,63600,198.0,194.0
238,2015/08/14,192.0,191.297,191.0,48100,193.0,190.0
239,2015/08/17,190.0,189.514,190.0,50000,191.0,188.0
240,2015/08/18,193.0,190.605,188.0,54400,193.0,188.0
241,2015/08/19,204.0,210.454,196.0,2198000,220.0,195.0
242,2015/08/20,195.0,198.424,198.0,354200,203.0,195.0
243,2015/08/21,189.0,190.493,190.0,182300,192.0,189.0
244,2015/08/24,170.0,177.433,186.0,320300,186.0,169.0
245,2015/08/25,163.0,162.336,158.0,388600,179.0,145.0
246,2015/08/26,169.0,165.397,165.0,200100,175.0,158.0
247,2015/08/27,169.0,171.273,171.0,199100,176.0,169.0
248,2015/08/28,174.0,172.474,170.0,157700,175.0,170.0
249,2015/08/31,173.0,174.765,176.0,163500,179.0,170.0
250,2015/09/01,165.0,168.348,175.0,111600,176.0,165.0
251,2015/09/02,161.0,161.825,159.0,95900,166.0,158.0
252,2015/09/03,164.0,162.223,162.0,122000,166.0,159.0
253,2015/09/04,160.0,157.724,160.0,161800,162.0,152.0
254,2015/09/07,150.0,153.641,158.0,99500,158.0,149.0
255,2015/09/08,152.0,153.617,154.0,71300,156.0,152.0
256,2015/09/09,159.0,156.977,155.0,74100,159.0,155.0
257,2015/09/10,157.0,156.725,157.0,45400,158.0,155.0
258,2015/09/11,162.0,158.642,156.0,86400,162.0,156.0
259,2015/09/14,161.0,159.574,160.0,71100,161.0,158.0
260,2015/09/15,155.0,156.74,159.0,87900,160.0,154.0
261,2015/09/16,155.0,154.09,155.0,63500,156.0,152.0
262,2015/09/17,158.0,155.392,154.0,83900,158.0,153.0
263,2015/09/18,157.0,156.962,158.0,71300,161.0,154.0
264,2015/09/24,158.0,156.183,156.0,83700,159.0,154.0
265,2015/09/25,158.0,157.847,160.0,51500,160.0,155.0
266,2015/09/28,159.0,155.813,155.0,53600,159.0,153.0
267,2015/09/29,153.0,153.857,155.0,90900,155.0,153.0
268,2015/09/30,155.0,153.119,152.0,91400,155.0,151.0
269,2015/10/01,157.0,154.055,155.0,109700,157.0,150.0
270,2015/10/02,157.0,155.595,155.0,59000,157.0,155.0
271,2015/10/05,158.0,157.96,158.0,35300,159.0,157.0
272,2015/10/06,158.0,159.213,160.0,54500,160.0,158.0
273,2015/10/07,163.0,161.403,158.0,222700,165.0,156.0
274,2015/10/08,181.0,181.629,162.0,7051900,189.0,161.0
275,2015/10/09,182.0,177.261,175.0,1523600,185.0,173.0
276,2015/10/13,195.0,187.863,183.0,1761400,195.0,181.0
277,2015/10/14,187.0,188.773,191.0,1305000,192.0,186.0
278,2015/10/15,177.0,182.329,182.0,943900,189.0,175.0
279,2015/10/16,180.0,182.56,185.0,1009500,189.0,179.0
280,2015/10/19,183.0,182.086,181.0,311700,186.0,178.0
281,2015/10/20,178.0,179.922,182.0,225800,184.0,178.0
282,2015/10/21,179.0,178.545,179.0,169500,180.0,177.0
283,2015/10/22,173.0,175.357,177.0,293200,180.0,172.0
284,2015/10/23,174.0,174.414,176.0,152600,177.0,173.0
285,2015/10/26,175.0,175.982,177.0,119700,178.0,174.0
286,2015/10/27,170.0,171.677,173.0,197400,174.0,170.0
287,2015/10/28,164.0,166.295,170.0,205800,170.0,164.0
288,2015/10/29,163.0,161.92,164.0,321800,166.0,158.0
289,2015/10/30,159.0,159.059,162.0,111700,162.0,158.0
290,2015/11/02,159.0,160.085,161.0,78700,161.0,159.0
291,2015/11/04,156.0,156.708,159.0,153500,160.0,155.0
292,2015/11/05,153.0,153.626,154.0,98300,155.0,153.0
293,2015/11/06,156.0,154.137,155.0,163800,156.0,153.0
294,2015/11/09,164.0,170.732,171.0,2300800,179.0,162.0
295,2015/11/10,162.0,161.312,162.0,335100,164.0,160.0
296,2015/11/11,163.0,163.36,167.0,361600,167.0,161.0
297,2015/11/12,162.0,161.618,162.0,130100,163.0,161.0
298,2015/11/13,160.0,159.393,160.0,128700,161.0,158.0
299,2015/11/16,156.0,156.692,156.0,126800,159.0,155.0
300,2015/11/17,157.0,156.93,158.0,144800,158.0,156.0
301,2015/11/18,160.0,158.997,158.0,127500,161.0,157.0
302,2015/11/19,163.0,163.233,160.0,200200,166.0,160.0
303,2015/11/20,162.0,162.123,162.0,90100,164.0,161.0
304,2015/11/24,169.0,165.515,162.0,499400,169.0,160.0
305,2015/11/25,166.0,166.345,167.0,88400,167.0,165.0
306,2015/11/26,166.0,165.951,166.0,164800,168.0,164.0
307,2015/11/27,166.0,166.353,167.0,91300,168.0,165.0
308,2015/11/30,164.0,165.596,165.0,152100,169.0,164.0
309,2015/12/01,165.0,163.471,162.0,137300,165.0,162.0
310,2015/12/02,166.0,164.687,165.0,100700,166.0,163.0
311,2015/12/03,171.0,168.188,164.0,257600,172.0,164.0
312,2015/12/04,167.0,166.83,168.0,265200,169.0,165.0
313,2015/12/07,169.0,169.265,169.0,309900,172.0,167.0
314,2015/12/08,165.0,166.663,169.0,216100,169.0,165.0
315,2015/12/09,165.0,162.865,164.0,199600,165.0,161.0
316,2015/12/10,160.0,161.833,161.0,118300,163.0,160.0
317,2015/12/11,161.0,161.283,161.0,71100,162.0,161.0
318,2015/12/14,159.0,158.796,160.0,176100,161.0,157.0
319,2015/12/15,156.0,157.647,159.0,134500,159.0,156.0
320,2015/12/16,158.0,157.025,157.0,126500,159.0,156.0
321,2015/12/17,159.0,159.054,158.0,204200,162.0,157.0
322,2015/12/18,155.0,157.626,159.0,156500,159.0,155.0
323,2015/12/21,152.0,152.62,155.0,132200,155.0,151.0
324,2015/12/22,148.0,149.896,150.0,191700,152.0,148.0
325,2015/12/24,142.0,145.85,147.0,214700,149.0,142.0
326,2015/12/25,139.0,138.738,138.0,413800,142.0,136.0
327,2015/12/28,146.0,144.595,142.0,121100,146.0,142.0
328,2015/12/29,150.0,147.695,146.0,67600,150.0,145.0
329,2015/12/30,150.0,149.448,149.0,83300,151.0,148.0
330,2016/01/04,149.0,150.975,150.0,211900,156.0,148.0
331,2016/01/05,148.0,146.831,148.0,92100,150.0,145.0
332,2016/01/06,146.0,147.103,149.0,65100,150.0,145.0
333,2016/01/07,149.0,144.297,144.0,119400,149.0,142.0
334,2016/01/08,145.0,148.72,152.0,136600,152.0,145.0
335,2016/01/12,137.0,140.649,146.0,227900,147.0,137.0
336,2016/01/13,143.0,141.582,142.0,95200,144.0,139.0
337,2016/01/14,139.0,138.35,138.0,111300,140.0,137.0
338,2016/01/15,136.0,138.892,141.0,66600,141.0,136.0
339,2016/01/18,130.0,129.687,131.0,139700,132.0,127.0
340,2016/01/19,131.0,131.01,130.0,69800,133.0,130.0
341,2016/01/20,123.0,128.65,133.0,138900,134.0,123.0
342,2016/01/21,125.0,128.813,133.0,233900,133.0,124.0
343,2016/01/22,134.0,132.157,128.0,135000,136.0,127.0
344,2016/01/25,139.0,137.908,135.0,113800,141.0,133.0
345,2016/01/26,136.0,136.189,136.0,37000,138.0,135.0
346,2016/01/27,141.0,139.469,140.0,81600,142.0,137.0
347,2016/01/28,139.0,139.515,141.0,57900,141.0,139.0
348,2016/01/29,145.0,141.285,141.0,103700,145.0,138.0
349,2016/02/01,151.0,147.958,148.0,168900,151.0,145.0
350,2016/02/02,150.0,150.468,151.0,72500,152.0,149.0
351,2016/02/03,146.0,146.043,146.0,80700,148.0,145.0
352,2016/02/04,144.0,144.518,144.0,34200,146.0,143.0
353,2016/02/05,136.0,137.804,142.0,72100,142.0,136.0
354,2016/02/08,137.0,137.19,135.0,49400,140.0,135.0
355,2016/02/09,132.0,132.33,132.0,119100,135.0,130.0
356,2016/02/10,125.0,126.833,133.0,130200,134.0,124.0
357,2016/02/12,112.0,120.05,122.0,326900,125.0,112.0
358,2016/02/15,120.0,122.093,125.0,136000,125.0,119.0
359,2016/02/16,122.0,122.361,118.0,156000,125.0,118.0
360,2016/02/17,120.0,121.648,121.0,105700,124.0,120.0
361,2016/02/18,126.0,124.543,122.0,108400,128.0,122.0
362,2016/02/19,124.0,124.714,125.0,24800,126.0,124.0
363,2016/02/22,125.0,125.881,125.0,38700,127.0,125.0
364,2016/02/23,123.0,124.087,127.0,94400,127.0,121.0
365,2016/02/24,121.0,121.676,121.0,56700,123.0,121.0
366,2016/02/25,123.0,123.263,122.0,29700,125.0,122.0
367,2016/02/26,124.0,125.195,126.0,40500,126.0,124.0
368,2016/02/29,123.0,126.796,126.0,102100,131.0,123.0
369,2016/03/01,122.0,122.849,124.0,86300,124.0,122.0
370,2016/03/02,124.0,125.383,126.0,113600,127.0,124.0
371,2016/03/03,143.0,144.289,125.0,8208000,151.0,125.0
372,2016/03/04,147.0,145.811,143.0,3113800,150.0,142.0
373,2016/03/07,148.0,145.272,147.0,563800,148.0,142.0
374,2016/03/08,146.0,151.128,150.0,986000,158.0,144.0
375,2016/03/09,151.0,148.181,143.0,1120300,155.0,140.0
376,2016/03/10,157.0,155.553,158.0,816800,158.0,152.0
377,2016/03/11,154.0,154.389,155.0,321000,156.0,153.0
378,2016/03/14,153.0,153.921,154.0,281900,156.0,152.0
379,2016/03/15,151.0,153.13,155.0,216200,155.0,151.0
380,2016/03/16,149.0,150.091,152.0,155400,152.0,148.0
381,2016/03/17,147.0,148.701,151.0,185600,152.0,146.0
382,2016/03/18,145.0,143.876,145.0,168800,146.0,143.0
383,2016/03/22,146.0,144.659,143.0,79700,146.0,143.0
384,2016/03/23,146.0,146.968,146.0,46500,148.0,145.0
385,2016/03/24,148.0,147.104,146.0,159400,150.0,144.0
386,2016/03/25,148.0,148.794,148.0,38800,150.0,148.0
387,2016/03/28,145.0,146.343,148.0,103600,148.0,144.0
388,2016/03/29,146.0,144.993,145.0,88700,146.0,143.0
389,2016/03/30,146.0,145.564,146.0,51800,148.0,144.0
390,2016/03/31,151.0,149.526,146.0,206800,153.0,144.0
391,2016/04/01,135.0,140.798,152.0,517800,153.0,133.0
392,2016/04/04,139.0,138.763,139.0,291900,141.0,136.0
393,2016/04/05,131.0,131.873,138.0,215200,138.0,130.0
394,2016/04/06,131.0,130.28,129.0,94500,133.0,129.0
395,2016/04/07,132.0,131.9,133.0,47800,133.0,131.0
396,2016/04/08,136.0,133.532,128.0,139600,138.0,128.0
397,2016/04/11,137.0,135.311,137.0,53300,137.0,133.0
398,2016/04/12,136.0,136.749,137.0,69400,138.0,136.0
399,2016/04/13,137.0,137.547,138.0,102200,138.0,136.0
400,2016/04/14,137.0,136.902,137.0,93100,138.0,136.0
401,2016/04/15,138.0,137.773,137.0,60000,139.0,136.0
402,2016/04/18,135.0,135.605,137.0,27100,138.0,135.0
403,2016/04/19,136.0,136.091,136.0,76900,138.0,134.0
404,2016/04/20,134.0,135.119,137.0,64700,137.0,133.0
405,2016/04/21,135.0,136.328,136.0,73700,138.0,135.0
406,2016/04/22,139.0,137.663,137.0,185200,140.0,135.0
407,2016/04/25,139.0,140.24,140.0,154100,142.0,138.0
408,2016/04/26,136.0,137.138,140.0,116300,140.0,135.0
409,2016/04/27,135.0,135.801,136.0,67400,137.0,135.0
410,2016/04/28,136.0,135.444,136.0,83600,137.0,133.0
411,2016/05/02,130.0,130.828,132.0,85600,132.0,129.0
412,2016/05/06,130.0,130.063,132.0,28700,132.0,129.0
413,2016/05/09,144.0,144.271,131.0,1620300,151.0,130.0
414,2016/05/10,148.0,151.248,152.0,2281200,158.0,146.0
415,2016/05/11,160.0,167.277,158.0,9377200,176.0,158.0
416,2016/05/12,155.0,155.109,155.0,820600,157.0,152.0
417,2016/05/13,144.0,145.317,149.0,591900,150.0,142.0
418,2016/05/16,143.0,145.943,143.0,386000,153.0,142.0
419,2016/05/17,140.0,140.416,142.0,314500,143.0,139.0
420,2016/05/18,136.0,138.9,140.0,457800,145.0,135.0
421,2016/05/19,135.0,135.871,136.0,108200,137.0,135.0
422,2016/05/20,136.0,135.856,135.0,189400,138.0,135.0
423,2016/05/23,138.0,136.777,138.0,51100,138.0,135.0
424,2016/05/24,145.0,141.232,138.0,314000,145.0,137.0
425,2016/05/25,148.0,147.569,145.0,307800,151.0,144.0
426,2016/05/26,146.0,145.799,149.0,176600,149.0,143.0
427,2016/05/27,146.0,146.318,146.0,109600,148.0,144.0
428,2016/05/30,150.0,148.763,146.0,94300,151.0,146.0
429,2016/05/31,149.0,148.285,149.0,86000,150.0,147.0
430,2016/06/01,158.0,158.075,149.0,1341000,163.0,149.0
431,2016/06/02,154.0,154.441,157.0,509700,159.0,150.0
432,2016/06/03,157.0,157.874,158.0,542400,161.0,154.0
433,2016/06/06,154.0,152.684,153.0,223400,156.0,150.0
434,2016/06/07,151.0,151.111,154.0,167300,155.0,149.0
435,2016/06/08,151.0,149.97,154.0,190300,154.0,147.0
436,2016/06/09,151.0,151.743,152.0,122500,154.0,150.0
437,2016/06/10,151.0,150.147,151.0,110300,152.0,149.0
438,2016/06/13,142.0,144.566,150.0,178800,150.0,141.0
439,2016/06/14,134.0,136.501,140.0,228900,141.0,133.0
440,2016/06/15,135.0,134.402,132.0,200200,138.0,132.0
441,2016/06/16,129.0,131.857,135.0,239300,137.0,128.0
442,2016/06/17,130.0,131.297,131.0,76000,133.0,130.0
443,2016/06/20,137.0,135.544,132.0,125600,139.0,132.0
444,2016/06/21,138.0,138.667,138.0,72700,140.0,137.0
445,2016/06/22,135.0,135.278,137.0,85900,138.0,133.0
446,2016/06/23,138.0,135.34,134.0,84700,138.0,132.0
447,2016/06/24,123.0,126.855,139.0,405800,142.0,120.0
448,2016/06/27,127.0,127.727,126.0,105100,130.0,126.0
449,2016/06/28,128.0,126.982,125.0,119500,129.0,125.0
450,2016/06/29,133.0,133.968,129.0,134400,138.0,129.0
451,2016/06/30,132.0,133.897,134.0,123100,137.0,132.0
452,2016/07/01,136.0,135.742,135.0,95100,137.0,134.0
453,2016/07/04,135.0,136.156,136.0,70000,138.0,134.0
454,2016/07/05,136.0,135.718,136.0,66900,138.0,134.0
455,2016/07/06,135.0,135.139,134.0,78000,140.0,133.0
456,2016/07/07,133.0,135.526,135.0,67900,139.0,133.0
457,2016/07/08,131.0,132.697,136.0,74600,136.0,131.0
458,2016/07/11,141.0,142.113,133.0,809400,149.0,133.0
459,2016/07/12,146.0,144.22,146.0,276400,147.0,141.0
460,2016/07/13,141.0,146.61,147.0,512800,151.0,141.0
461,2016/07/14,142.0,140.987,143.0,197700,144.0,138.0
462,2016/07/15,140.0,139.927,142.0,115900,143.0,138.0
463,2016/07/19,141.0,141.173,141.0,97700,143.0,140.0
464,2016/07/20,140.0,138.67,142.0,163400,143.0,135.0
465,2016/07/21,142.0,140.211,141.0,136800,142.0,138.0
466,2016/07/22,140.0,139.543,140.0,212400,142.0,137.0
467,2016/07/25,141.0,141.507,140.0,111700,143.0,140.0
468,2016/07/26,139.0,141.354,141.0,185800,146.0,138.0
469,2016/07/27,140.0,139.848,140.0,49300,141.0,139.0
470,2016/07/28,138.0,137.19,141.0,171200,141.0,135.0
471,2016/07/29,139.0,136.052,136.0,105700,139.0,135.0
472,2016/08/01,139.0,138.268,138.0,60800,139.0,137.0
473,2016/08/02,145.0,143.869,138.0,361700,147.0,137.0
474,2016/08/03,145.0,155.666,143.0,5161500,168.0,142.0
475,2016/08/04,142.0,141.44,142.0,298600,145.0,140.0
476,2016/08/05,141.0,140.062,141.0,189100,141.0,139.0
477,2016/08/08,138.0,139.184,143.0,306000,143.0,137.0
478,2016/08/09,141.0,139.92,139.0,118100,142.0,137.0
479,2016/08/10,135.0,136.12,137.0,172300,138.0,135.0
480,2016/08/12,136.0,133.698,134.0,170000,136.0,132.0
481,2016/08/15,135.0,135.765,136.0,72000,138.0,134.0
482,2016/08/16,134.0,134.132,135.0,66900,136.0,133.0
483,2016/08/17,133.0,134.081,133.0,54200,136.0,132.0
484,2016/08/18,131.0,132.288,133.0,64000,134.0,131.0
485,2016/08/19,131.0,131.82,132.0,45500,133.0,131.0
486,2016/08/22,133.0,132.706,132.0,34400,134.0,132.0
487,2016/08/23,135.0,135.858,133.0,166900,138.0,133.0
488,2016/08/24,136.0,136.532,137.0,45500,138.0,136.0
489,2016/08/25,134.0,134.974,136.0,49300,137.0,134.0
490,2016/08/26,132.0,133.057,134.0,56400,134.0,132.0
491,2016/08/29,134.0,133.788,134.0,39100,135.0,133.0
492,2016/08/30,133.0,133.436,134.0,11700,134.0,133.0
493,2016/08/31,135.0,134.257,134.0,41200,135.0,133.0
494,2016/09/01,136.0,135.981,136.0,36900,137.0,135.0
495,2016/09/02,135.0,136.22,137.0,27700,137.0,135.0
496,2016/09/05,135.0,135.558,135.0,38200,137.0,135.0
497,2016/09/06,137.0,137.263,135.0,114700,138.0,135.0
498,2016/09/07,136.0,133.886,137.0,181000,138.0,130.0
499,2016/09/08,135.0,134.58,135.0,78100,136.0,133.0
500,2016/09/09,136.0,134.758,134.0,46200,136.0,134.0
501,2016/09/12,135.0,134.443,134.0,32300,135.0,133.0
502,2016/09/13,138.0,136.209,135.0,57500,138.0,134.0
503,2016/09/14,134.0,135.788,136.0,46600,138.0,134.0
504,2016/09/15,133.0,134.46,135.0,39800,136.0,133.0
505,2016/09/16,136.0,135.509,136.0,31800,136.0,134.0
506,2016/09/20,133.0,135.061,136.0,57000,137.0,133.0
507,2016/09/21,141.0,137.304,133.0,243600,141.0,132.0
508,2016/09/23,140.0,140.073,137.0,230200,143.0,137.0
509,2016/09/26,138.0,138.465,138.0,128900,140.0,137.0
510,2016/09/27,140.0,138.785,138.0,90600,140.0,137.0
511,2016/09/28,140.0,141.322,139.0,180800,145.0,138.0
512,2016/09/29,140.0,141.237,141.0,137600,144.0,140.0
513,2016/09/30,139.0,139.268,139.0,79900,141.0,138.0
514,2016/10/03,141.0,142.017,140.0,240200,145.0,139.0
515,2016/10/04,144.0,143.494,144.0,191300,145.0,141.0
516,2016/10/05,142.0,143.255,145.0,146800,145.0,142.0
517,2016/10/06,143.0,143.401,143.0,124300,144.0,142.0
518,2016/10/07,141.0,141.735,144.0,131200,144.0,141.0
519,2016/10/11,141.0,141.773,143.0,70800,144.0,140.0
520,2016/10/12,139.0,139.941,141.0,38800,141.0,139.0
521,2016/10/13,141.0,139.408,140.0,89300,141.0,138.0
522,2016/10/14,138.0,137.889,138.0,76700,139.0,137.0
523,2016/10/17,139.0,138.814,139.0,29500,139.0,138.0
524,2016/10/18,140.0,138.902,140.0,55200,140.0,138.0
525,2016/10/19,140.0,140.509,141.0,91700,141.0,139.0
526,2016/10/20,141.0,140.24,141.0,24200,141.0,140.0
527,2016/10/21,140.0,140.308,141.0,102200,142.0,139.0
528,2016/10/24,140.0,140.009,139.0,57200,141.0,139.0
529,2016/10/25,140.0,139.924,141.0,73300,141.0,139.0
530,2016/10/26,139.0,139.049,139.0,34600,140.0,138.0
531,2016/10/27,139.0,140.096,139.0,67900,142.0,138.0
532,2016/10/28,139.0,139.18,140.0,69500,140.0,139.0
533,2016/10/31,139.0,139.295,139.0,17300,140.0,139.0
534,2016/11/01,143.0,141.927,140.0,231000,144.0,139.0
535,2016/11/02,139.0,140.71,143.0,116100,143.0,139.0
536,2016/11/04,136.0,136.827,138.0,68700,139.0,135.0
537,2016/11/07,136.0,137.023,136.0,69300,139.0,136.0
538,2016/11/08,136.0,136.411,137.0,45700,137.0,136.0
539,2016/11/09,134.0,137.161,143.0,498000,144.0,127.0
540,2016/11/10,136.0,137.301,139.0,151700,139.0,135.0
541,2016/11/11,139.0,138.103,139.0,216200,140.0,136.0
542,2016/11/14,138.0,137.422,138.0,87700,139.0,136.0
543,2016/11/15,137.0,137.821,139.0,32900,139.0,137.0
544,2016/11/16,140.0,139.122,137.0,101200,141.0,137.0
545,2016/11/17,138.0,138.394,139.0,110700,140.0,137.0
546,2016/11/18,138.0,138.7,139.0,121800,140.0,138.0
547,2016/11/21,140.0,139.819,139.0,83000,141.0,139.0
548,2016/11/22,142.0,141.557,140.0,117000,143.0,140.0
549,2016/11/24,144.0,143.048,143.0,135600,144.0,142.0
550,2016/11/25,141.0,142.042,144.0,208700,144.0,141.0
551,2016/11/28,141.0,140.558,140.0,121000,142.0,139.0
552,2016/11/29,142.0,143.451,141.0,270800,145.0,141.0
553,2016/11/30,143.0,143.506,142.0,149500,144.0,142.0
554,2016/12/01,143.0,144.285,144.0,170400,146.0,143.0
555,2016/12/02,143.0,143.304,143.0,91800,144.0,142.0
556,2016/12/05,143.0,144.068,144.0,91100,145.0,143.0
557,2016/12/06,143.0,142.931,143.0,157300,145.0,142.0
558,2016/12/07,147.0,146.327,144.0,426000,149.0,143.0
559,2016/12/08,149.0,148.484,147.0,427900,152.0,146.0
560,2016/12/09,144.0,147.552,151.0,492900,152.0,143.0
561,2016/12/12,145.0,145.348,145.0,188600,147.0,144.0
562,2016/12/13,146.0,145.889,146.0,86600,147.0,145.0
563,2016/12/14,146.0,146.363,147.0,47900,147.0,146.0
564,2016/12/15,144.0,144.797,147.0,123400,148.0,144.0
565,2016/12/16,144.0,144.226,145.0,83500,145.0,143.0
566,2016/12/19,143.0,143.831,144.0,51000,145.0,143.0
567,2016/12/20,143.0,142.691,142.0,102700,145.0,142.0
568,2016/12/21,141.0,142.841,144.0,279500,144.0,141.0
569,2016/12/22,142.0,142.053,142.0,56400,143.0,141.0
570,2016/12/26,142.0,141.465,142.0,117800,142.0,140.0
571,2016/12/27,141.0,141.643,142.0,100600,143.0,140.0
572,2016/12/28,142.0,141.997,141.0,33100,143.0,141.0
573,2016/12/29,142.0,141.846,142.0,45400,142.0,141.0
574,2016/12/30,142.0,141.698,141.0,41700,143.0,141.0
575,2017/01/04,145.0,144.056,142.0,68200,146.0,142.0
576,2017/01/05,143.0,144.47,146.0,69000,146.0,143.0
577,2017/01/06,144.0,144.441,144.0,81100,146.0,143.0
578,2017/01/10,143.0,144.376,144.0,209000,146.0,142.0
579,2017/01/11,144.0,143.997,144.0,73700,145.0,143.0
580,2017/01/12,143.0,143.737,144.0,39600,144.0,143.0
581,2017/01/13,144.0,142.883,142.0,34200,144.0,142.0
582,2017/01/16,143.0,143.74,144.0,36200,144.0,143.0
583,2017/01/17,148.0,146.208,145.0,295400,148.0,144.0
584,2017/01/18,144.0,148.69,147.0,522200,153.0,144.0
585,2017/01/19,144.0,145.653,147.0,131400,148.0,144.0
586,2017/01/20,145.0,144.517,145.0,88400,146.0,144.0
587,2017/01/23,146.0,145.032,146.0,82300,146.0,144.0
588,2017/01/24,145.0,144.267,146.0,63200,146.0,143.0
589,2017/01/25,147.0,145.903,145.0,44200,147.0,145.0
590,2017/01/26,147.0,146.579,147.0,45100,147.0,146.0
591,2017/01/27,147.0,146.852,148.0,39200,148.0,146.0
592,2017/01/30,146.0,146.582,147.0,78400,148.0,145.0
593,2017/01/31,147.0,146.066,146.0,39200,147.0,145.0
594,2017/02/01,152.0,149.935,147.0,422500,152.0,146.0
595,2017/02/02,147.0,149.698,152.0,153200,152.0,147.0
596,2017/02/03,147.0,148.27,147.0,110900,150.0,147.0
597,2017/02/06,151.0,150.424,147.0,150100,152.0,147.0
598,2017/02/07,149.0,150.088,151.0,130400,151.0,149.0
599,2017/02/08,152.0,151.31,149.0,122700,153.0,149.0
600,2017/02/09,149.0,149.452,150.0,139500,151.0,147.0
601,2017/02/10,149.0,149.469,149.0,87400,151.0,149.0
602,2017/02/13,147.0,146.227,149.0,319400,149.0,144.0
603,2017/02/14,145.0,145.166,145.0,91100,147.0,144.0
604,2017/02/15,146.0,145.888,146.0,77900,147.0,145.0
605,2017/02/16,145.0,145.667,146.0,36600,146.0,145.0
606,2017/02/17,146.0,145.954,145.0,69700,147.0,145.0
607,2017/02/20,147.0,147.495,146.0,83300,149.0,146.0
608,2017/02/21,147.0,147.16,148.0,34400,148.0,146.0
609,2017/02/22,146.0,146.265,146.0,108600,148.0,145.0
610,2017/02/23,146.0,146.027,146.0,48400,147.0,146.0
611,2017/02/24,147.0,146.4,146.0,74200,147.0,145.0
612,2017/02/27,146.0,145.794,147.0,81600,147.0,145.0
613,2017/02/28,144.0,145.505,146.0,93100,146.0,144.0
614,2017/03/01,144.0,144.356,145.0,59900,145.0,144.0
615,2017/03/02,145.0,145.102,145.0,86600,146.0,144.0
616,2017/03/03,144.0,145.263,145.0,30100,146.0,144.0
617,2017/03/06,145.0,144.256,144.0,69200,145.0,144.0
618,2017/03/07,143.0,143.596,145.0,225700,145.0,142.0
619,2017/03/08,143.0,141.771,143.0,127700,143.0,140.0
620,2017/03/09,142.0,141.475,143.0,92000,143.0,140.0
621,2017/03/10,143.0,142.611,143.0,113000,144.0,141.0
622,2017/03/13,143.0,143.616,143.0,51500,145.0,143.0
623,2017/03/14,144.0,143.575,144.0,27300,144.0,143.0
624,2017/03/15,141.0,143.076,144.0,76000,144.0,141.0
625,2017/03/16,142.0,141.746,141.0,68800,143.0,141.0
626,2017/03/17,141.0,141.312,142.0,39100,142.0,141.0
627,2017/03/21,142.0,140.79,140.0,58200,142.0,140.0
628,2017/03/22,140.0,140.503,140.0,39400,142.0,140.0
629,2017/03/23,138.0,139.244,140.0,50500,140.0,138.0
630,2017/03/24,138.0,139.121,138.0,71100,141.0,138.0
631,2017/03/27,138.0,138.868,138.0,62300,140.0,138.0
632,2017/03/28,140.0,139.253,138.0,59300,140.0,138.0
633,2017/03/29,141.0,139.864,140.0,68300,141.0,139.0
634,2017/03/30,141.0,139.818,140.0,55500,141.0,139.0
635,2017/03/31,139.0,140.054,139.0,46600,141.0,139.0
636,2017/04/03,139.0,139.579,139.0,30900,140.0,139.0
637,2017/04/04,138.0,138.438,139.0,106300,140.0,136.0
638,2017/04/05,138.0,137.639,136.0,50400,138.0,136.0
639,2017/04/06,136.0,136.047,139.0,92200,139.0,134.0
640,2017/04/07,133.0,133.754,136.0,213700,136.0,131.0
641,2017/04/10,131.0,133.041,135.0,164600,136.0,131.0
642,2017/04/11,132.0,132.418,133.0,102000,135.0,131.0
643,2017/04/12,130.0,130.278,131.0,49000,132.0,130.0
644,2017/04/13,130.0,130.688,129.0,99600,132.0,129.0
645,2017/04/14,131.0,131.171,130.0,63000,132.0,130.0
646,2017/04/17,132.0,131.373,131.0,81300,132.0,131.0
647,2017/04/18,132.0,131.869,131.0,83700,134.0,131.0
648,2017/04/19,133.0,133.389,132.0,47100,135.0,132.0
649,2017/04/20,134.0,133.892,134.0,51100,135.0,133.0
650,2017/04/21,134.0,134.351,134.0,63200,136.0,133.0
651,2017/04/24,135.0,136.14,138.0,52700,138.0,133.0
652,2017/04/25,136.0,134.901,135.0,52500,136.0,133.0
653,2017/04/26,137.0,135.83,136.0,62200,137.0,135.0
654,2017/04/27,137.0,136.811,136.0,56200,138.0,136.0
655,2017/04/28,135.0,135.339,137.0,65800,137.0,134.0
656,2017/05/01,134.0,134.483,135.0,37500,135.0,134.0
657,2017/05/02,136.0,135.433,135.0,42500,137.0,134.0
658,2017/05/08,137.0,136.623,135.0,85300,138.0,135.0
659,2017/05/09,138.0,137.324,138.0,59900,138.0,136.0
660,2017/05/10,138.0,137.614,137.0,19700,138.0,136.0
661,2017/05/11,139.0,137.593,138.0,60900,139.0,137.0
662,2017/05/12,137.0,136.468,137.0,90900,138.0,136.0
663,2017/05/15,135.0,135.059,138.0,106000,139.0,134.0
664,2017/05/16,134.0,133.654,133.0,91800,135.0,133.0
665,2017/05/17,132.0,132.88,135.0,106800,135.0,132.0
666,2017/05/18,130.0,130.68,131.0,219000,132.0,129.0
667,2017/05/19,142.0,149.543,132.0,7247500,180.0,131.0
668,2017/05/22,138.0,138.685,139.0,970600,140.0,137.0
669,2017/05/23,141.0,140.783,139.0,565400,143.0,138.0
670,2017/05/24,139.0,139.699,141.0,267300,141.0,139.0
671,2017/05/25,138.0,138.581,140.0,273800,140.0,138.0
672,2017/05/26,138.0,138.614,140.0,225500,140.0,137.0
673,2017/05/29,137.0,137.516,138.0,128000,139.0,137.0
674,2017/05/30,138.0,137.467,138.0,103300,138.0,137.0
675,2017/05/31,136.0,137.163,138.0,156900,138.0,136.0
676,2017/06/01,137.0,137.059,137.0,110200,138.0,137.0
677,2017/06/02,138.0,137.552,138.0,135000,138.0,137.0
678,2017/06/05,139.0,139.062,138.0,271600,141.0,138.0
679,2017/06/06,137.0,137.538,140.0,124800,140.0,136.0
680,2017/06/07,137.0,137.229,137.0,99400,138.0,136.0
681,2017/06/08,136.0,136.523,138.0,166900,138.0,135.0
682,2017/06/09,137.0,136.137,136.0,127500,137.0,135.0
683,2017/06/12,138.0,136.738,136.0,76600,138.0,135.0
684,2017/06/13,138.0,137.128,137.0,52200,138.0,137.0
685,2017/06/14,137.0,137.208,138.0,81600,138.0,136.0
686,2017/06/15,136.0,136.428,137.0,84100,138.0,136.0
687,2017/06/16,135.0,135.423,136.0,219900,136.0,134.0
688,2017/06/19,137.0,136.215,135.0,169900,138.0,135.0
689,2017/06/20,139.0,137.37,137.0,124800,139.0,136.0
690,2017/06/21,138.0,137.819,138.0,71700,138.0,137.0
691,2017/06/22,141.0,138.898,137.0,106300,141.0,137.0
692,2017/06/23,139.0,138.929,140.0,88600,140.0,138.0
693,2017/06/26,141.0,139.684,139.0,75700,141.0,139.0
694,2017/06/27,139.0,139.444,141.0,257700,142.0,137.0
695,2017/06/28,139.0,138.783,138.0,150400,140.0,138.0
696,2017/06/29,141.0,139.869,140.0,88500,141.0,139.0
697,2017/06/30,140.0,139.029,139.0,73000,140.0,138.0
698,2017/07/03,141.0,138.817,139.0,198500,141.0,138.0
699,2017/07/04,141.0,142.172,142.0,529800,144.0,140.0
700,2017/07/05,144.0,143.087,142.0,238200,145.0,142.0
701,2017/07/06,142.0,142.554,144.0,173000,144.0,142.0
702,2017/07/07,141.0,140.6,141.0,246400,142.0,139.0
703,2017/07/10,142.0,141.401,141.0,109400,143.0,140.0
704,2017/07/11,141.0,141.302,141.0,110000,142.0,140.0
705,2017/07/12,143.0,142.702,142.0,208700,144.0,142.0
706,2017/07/13,142.0,143.005,144.0,218600,145.0,141.0
707,2017/07/14,141.0,142.159,143.0,141800,143.0,141.0
708,2017/07/18,141.0,141.104,141.0,118800,142.0,140.0
709,2017/07/19,143.0,143.597,142.0,257100,146.0,142.0
710,2017/07/20,146.0,144.309,144.0,180500,146.0,143.0
711,2017/07/21,146.0,147.436,148.0,476000,149.0,145.0
712,2017/07/24,149.0,147.609,146.0,453400,150.0,145.0
713,2017/07/25,148.0,149.022,150.0,301300,150.0,147.0
714,2017/07/26,152.0,158.447,149.0,4463600,167.0,148.0
715,2017/07/27,152.0,153.592,154.0,747500,157.0,151.0
716,2017/07/28,145.0,148.349,154.0,912000,155.0,145.0
717,2017/07/31,144.0,144.982,146.0,258200,148.0,144.0
718,2017/08/01,140.0,141.636,144.0,323900,144.0,140.0
719,2017/08/02,144.0,142.289,141.0,185900,144.0,140.0
720,2017/08/03,141.0,142.353,144.0,107600,144.0,141.0
721,2017/08/04,144.0,142.713,141.0,79700,144.0,141.0
722,2017/08/07,144.0,143.611,142.0,89200,144.0,142.0
723,2017/08/08,145.0,144.258,144.0,101400,146.0,143.0
724,2017/08/09,143.0,142.045,145.0,265700,145.0,140.0
725,2017/08/10,142.0,142.534,142.0,123500,144.0,141.0
726,2017/08/14,139.0,138.851,139.0,222000,140.0,137.0
727,2017/08/15,141.0,141.515,140.0,99000,143.0,140.0
728,2017/08/16,141.0,142.208,143.0,113200,143.0,141.0
729,2017/08/17,142.0,142.7,143.0,76400,144.0,142.0
730,2017/08/18,141.0,142.024,142.0,91300,143.0,141.0
731,2017/08/21,142.0,142.95,143.0,63800,144.0,142.0
732,2017/08/22,143.0,143.47,144.0,53400,144.0,142.0
733,2017/08/23,142.0,143.049,144.0,88500,145.0,142.0
734,2017/08/24,143.0,142.735,143.0,42300,144.0,142.0
735,2017/08/25,145.0,143.573,144.0,78700,145.0,142.0
736,2017/08/28,145.0,144.18,145.0,105600,145.0,143.0
737,2017/08/29,142.0,143.164,144.0,87300,144.0,142.0
738,2017/08/30,143.0,143.375,144.0,72500,144.0,142.0
739,2017/08/31,144.0,143.996,143.0,111300,145.0,143.0
740,2017/09/01,149.0,147.475,145.0,462300,150.0,145.0
741,2017/09/04,145.0,149.514,151.0,556400,154.0,145.0
742,2017/09/05,142.0,143.895,145.0,312100,148.0,142.0
743,2017/09/06,144.0,143.028,141.0,185400,146.0,140.0
744,2017/09/07,144.0,144.611,145.0,193300,146.0,143.0
745,2017/09/08,142.0,142.771,144.0,99600,144.0,142.0
746,2017/09/11,146.0,144.467,143.0,148500,146.0,143.0
747,2017/09/12,147.0,145.916,146.0,190200,148.0,145.0
748,2017/09/13,152.0,148.536,146.0,375700,152.0,145.0
749,2017/09/14,151.0,149.847,152.0,252700,152.0,148.0
750,2017/09/15,151.0,150.62,149.0,172200,152.0,149.0
751,2017/09/19,155.0,152.259,152.0,291300,155.0,150.0
752,2017/09/20,154.0,154.276,155.0,232000,156.0,153.0
753,2017/09/21,155.0,154.632,154.0,271000,157.0,153.0
754,2017/09/22,152.0,150.841,154.0,376100,155.0,148.0
755,2017/09/25,153.0,152.259,152.0,202600,154.0,151.0
756,2017/09/26,154.0,153.418,153.0,165500,155.0,152.0
757,2017/09/27,156.0,154.307,154.0,226700,156.0,153.0
758,2017/09/28,155.0,154.726,156.0,115100,156.0,152.0
759,2017/09/29,152.0,152.716,155.0,268600,155.0,150.0
760,2017/10/02,156.0,154.447,152.0,166500,156.0,152.0
761,2017/10/03,158.0,157.412,156.0,181300,159.0,156.0
762,2017/10/04,156.0,156.347,158.0,162600,158.0,154.0
763,2017/10/05,157.0,156.981,156.0,161700,159.0,154.0
764,2017/10/06,154.0,155.759,157.0,323000,159.0,154.0
765,2017/10/10,156.0,155.916,155.0,110900,157.0,154.0
766,2017/10/11,157.0,157.266,157.0,113200,158.0,156.0
767,2017/10/12,158.0,157.825,158.0,58400,159.0,157.0
768,2017/10/13,157.0,156.03,158.0,152000,158.0,155.0
769,2017/10/16,157.0,156.901,156.0,92900,158.0,156.0
770,2017/10/17,156.0,156.399,158.0,106600,158.0,155.0
771,2017/10/18,157.0,156.915,156.0,138500,158.0,156.0
772,2017/10/19,156.0,156.666,158.0,98700,158.0,155.0
773,2017/10/20,153.0,153.701,156.0,170200,156.0,152.0
774,2017/10/23,155.0,153.417,154.0,133600,155.0,152.0
775,2017/10/24,157.0,156.191,156.0,144600,158.0,155.0
776,2017/10/25,154.0,155.718,157.0,136800,158.0,154.0
777,2017/10/26,155.0,154.42,154.0,59700,156.0,153.0
778,2017/10/27,154.0,154.495,155.0,18800,155.0,154.0
779,2017/10/30,154.0,155.013,155.0,119800,157.0,154.0
780,2017/10/31,155.0,155.306,155.0,92100,156.0,154.0
781,2017/11/01,155.0,155.471,155.0,89200,157.0,154.0
782,2017/11/02,153.0,152.843,155.0,195400,155.0,152.0
783,2017/11/06,152.0,152.325,152.0,70500,154.0,151.0
784,2017/11/07,154.0,153.404,152.0,63400,155.0,152.0
785,2017/11/08,158.0,162.636,168.0,1439600,168.0,157.0
786,2017/11/09,157.0,158.143,160.0,425900,161.0,154.0
787,2017/11/10,157.0,155.588,155.0,147000,157.0,154.0
788,2017/11/13,159.0,159.831,158.0,504300,163.0,156.0
789,2017/11/14,158.0,159.062,161.0,185600,161.0,158.0
790,2017/11/15,154.0,155.402,158.0,316300,158.0,153.0
791,2017/11/16,155.0,154.656,154.0,93100,156.0,154.0
792,2017/11/17,160.0,157.818,156.0,236800,160.0,155.0
793,2017/11/20,162.0,161.317,160.0,215300,163.0,159.0
794,2017/11/21,163.0,161.955,162.0,84500,163.0,161.0
795,2017/11/22,165.0,164.611,165.0,307300,166.0,162.0
796,2017/11/24,169.0,166.956,166.0,516100,169.0,163.0
797,2017/11/27,174.0,171.167,169.0,673200,174.0,168.0
798,2017/11/28,176.0,175.857,178.0,626400,179.0,173.0
799,2017/11/29,175.0,175.52,172.0,323200,179.0,172.0
800,2017/11/30,170.0,171.039,175.0,262200,175.0,169.0
801,2017/12/01,174.0,172.38,171.0,265300,175.0,170.0
802,2017/12/04,172.0,173.443,175.0,154500,176.0,171.0
803,2017/12/05,164.0,167.405,171.0,394000,172.0,164.0
804,2017/12/06,165.0,166.879,164.0,251600,170.0,164.0
805,2017/12/07,169.0,168.84,165.0,122000,171.0,165.0
806,2017/12/08,168.0,169.491,170.0,86900,171.0,168.0
807,2017/12/11,169.0,167.553,167.0,151100,169.0,165.0
808,2017/12/12,169.0,168.926,169.0,112200,170.0,168.0
809,2017/12/13,169.0,169.627,169.0,175000,171.0,167.0
810,2017/12/14,173.0,172.029,169.0,273900,174.0,169.0
811,2017/12/15,169.0,170.361,172.0,107900,172.0,169.0
812,2017/12/18,169.0,169.994,171.0,67200,171.0,169.0
813,2017/12/19,167.0,167.766,170.0,126600,170.0,167.0
814,2017/12/20,166.0,167.455,168.0,186000,169.0,166.0
815,2017/12/21,166.0,164.975,166.0,159100,167.0,163.0
816,2017/12/22,165.0,165.115,167.0,76500,167.0,164.0
817,2017/12/25,163.0,164.169,165.0,94700,165.0,163.0
818,2017/12/26,159.0,161.466,163.0,281900,164.0,159.0
819,2017/12/27,159.0,160.278,159.0,191200,163.0,158.0
820,2017/12/28,158.0,159.215,160.0,55900,160.0,158.0
821,2017/12/29,154.0,155.087,160.0,654200,160.0,153.0
822,2018/01/04,158.0,156.691,156.0,223600,158.0,156.0
823,2018/01/05,160.0,158.654,158.0,164200,160.0,158.0
824,2018/01/09,161.0,162.379,161.0,234400,164.0,161.0
825,2018/01/10,162.0,163.238,163.0,170100,165.0,162.0
826,2018/01/11,161.0,162.007,163.0,123800,163.0,161.0
827,2018/01/12,163.0,162.499,162.0,173400,164.0,161.0
828,2018/01/15,169.0,168.244,164.0,746100,171.0,164.0
829,2018/01/16,168.0,168.607,170.0,271800,170.0,167.0
830,2018/01/17,164.0,165.029,167.0,253500,167.0,163.0
831,2018/01/18,176.0,180.376,165.0,3558100,194.0,164.0
832,2018/01/19,176.0,175.88,179.0,1316600,184.0,171.0
833,2018/01/22,179.0,177.804,179.0,267700,179.0,176.0
834,2018/01/23,180.0,181.441,180.0,727200,185.0,179.0
835,2018/01/24,220.0,212.603,181.0,12765600,230.0,179.0
836,2018/01/25,206.0,213.615,214.0,10096600,227.0,203.0
837,2018/01/26,205.0,208.692,209.0,4486700,218.0,201.0
838,2018/01/29,205.0,203.733,205.0,1359100,210.0,200.0
839,2018/01/30,198.0,199.922,207.0,1217300,207.0,195.0
840,2018/01/31,205.0,209.921,210.0,6004600,217.0,202.0
841,2018/02/01,199.0,201.526,207.0,1217300,209.0,197.0
842,2018/02/02,203.0,197.252,197.0,980700,203.0,193.0
843,2018/02/05,201.0,197.832,196.0,630500,203.0,194.0
844,2018/02/06,189.0,185.777,189.0,1169900,192.0,177.0
845,2018/02/07,186.0,190.768,195.0,505500,196.0,185.0
846,2018/02/08,196.0,192.645,186.0,482900,198.0,186.0
847,2018/02/09,193.0,190.211,186.0,503100,194.0,186.0
848,2018/02/13,195.0,200.497,199.0,1026500,205.0,194.0
849,2018/02/14,199.0,196.486,195.0,468800,200.0,192.0
850,2018/02/15,203.0,202.013,200.0,375600,204.0,200.0
851,2018/02/16,219.0,212.991,204.0,1892700,221.0,203.0
852,2018/02/19,236.0,232.242,224.0,2884500,240.0,223.0
853,2018/02/20,244.0,240.757,235.0,1754000,246.0,232.0
854,2018/02/21,232.0,235.036,243.0,1592000,245.0,228.0
855,2018/02/22,240.0,238.721,229.0,1370800,246.0,229.0
856,2018/02/23,234.0,236.297,240.0,882100,242.0,233.0
857,2018/02/26,238.0,236.338,234.0,610700,240.0,233.0
858,2018/02/27,233.0,236.64,242.0,582700,242.0,233.0
859,2018/02/28,238.0,235.696,229.0,856700,241.0,226.0
860,2018/03/01,237.0,236.176,237.0,494800,239.0,234.0
861,2018/03/02,253.0,248.052,233.0,2286300,255.0,233.0
862,2018/03/05,237.0,244.335,252.0,1178200,252.0,236.0
863,2018/03/06,250.0,247.985,243.0,1138700,254.0,241.0
864,2018/03/07,251.0,252.312,246.0,1098900,258.0,244.0
865,2018/03/08,267.0,267.691,262.0,3417600,277.0,257.0
866,2018/03/09,269.0,268.775,272.0,1163300,274.0,265.0
867,2018/03/12,261.0,263.542,269.0,835300,271.0,259.0
868,2018/03/13,269.0,272.112,263.0,1190200,279.0,261.0
869,2018/03/14,260.0,263.879,269.0,848600,270.0,260.0
870,2018/03/15,251.0,253.234,259.0,789500,259.0,249.0
871,2018/03/16,248.0,246.597,255.0,1030800,255.0,241.0
872,2018/03/19,236.0,240.269,247.0,743900,250.0,235.0
873,2018/03/20,232.0,233.556,233.0,509200,237.0,231.0
874,2018/03/22,252.0,259.091,264.0,6578800,269.0,249.0
875,2018/03/23,243.0,245.483,242.0,1736100,250.0,241.0
876,2018/03/26,229.0,230.949,236.0,1223700,239.0,226.0
877,2018/03/27,225.0,228.908,231.0,770400,234.0,224.0
878,2018/03/28,227.0,225.65,222.0,822400,230.0,220.0
879,2018/03/29,235.0,230.778,226.0,1227300,239.0,221.0
880,2018/03/30,225.0,228.086,236.0,823200,236.0,224.0
881,2018/04/02,222.0,224.479,225.0,573600,230.0,221.0
882,2018/04/03,218.0,217.366,219.0,547100,222.0,214.0
883,2018/04/04,215.0,213.502,217.0,550600,217.0,211.0
884,2018/04/05,213.0,214.87,215.0,323400,218.0,213.0
885,2018/04/06,212.0,211.528,215.0,512700,215.0,209.0
886,2018/04/09,210.0,210.212,210.0,369000,212.0,208.0
887,2018/04/10,207.0,208.157,210.0,490600,212.0,206.0
888,2018/04/11,205.0,205.724,208.0,261700,209.0,203.0
889,2018/04/12,209.0,210.413,206.0,503100,214.0,206.0
890,2018/04/13,209.0,208.926,210.0,278300,211.0,207.0
891,2018/04/16,202.0,204.233,208.0,693800,210.0,200.0
892,2018/04/17,202.0,200.124,201.0,583700,205.0,197.0
893,2018/04/18,208.0,205.966,200.0,343800,209.0,200.0
894,2018/04/19,206.0,206.036,208.0,207800,208.0,203.0
895,2018/04/20,211.0,210.166,206.0,295100,212.0,206.0
896,2018/04/23,214.0,211.685,210.0,196800,214.0,208.0
897,2018/04/24,211.0,214.891,216.0,408800,219.0,211.0
898,2018/04/25,207.0,209.023,212.0,227300,212.0,207.0
899,2018/04/26,203.0,204.474,207.0,244400,208.0,203.0
900,2018/04/27,203.0,204.056,204.0,227100,206.0,203.0
901,2018/05/01,201.0,201.118,204.0,205400,205.0,199.0
902,2018/05/02,205.0,203.581,200.0,251200,207.0,200.0
903,2018/05/07,207.0,206.681,206.0,121500,209.0,204.0
904,2018/05/08,210.0,209.131,207.0,177300,211.0,206.0
905,2018/05/09,208.0,208.688,211.0,159900,211.0,207.0
906,2018/05/10,202.0,204.997,210.0,338000,211.0,202.0
907,2018/05/11,207.0,200.88,203.0,600900,207.0,195.0
908,2018/05/14,208.0,208.159,206.0,373400,211.0,203.0
909,2018/05/15,202.0,204.692,207.0,191700,207.0,202.0
910,2018/05/16,196.0,199.005,200.0,264200,201.0,196.0
911,2018/05/17,199.0,198.796,197.0,188100,201.0,197.0
912,2018/05/18,203.0,200.998,200.0,129700,203.0,199.0
913,2018/05/21,204.0,204.4,203.0,137900,206.0,202.0
914,2018/05/22,200.0,201.974,206.0,169700,206.0,200.0
915,2018/05/23,197.0,198.535,200.0,237800,201.0,197.0
916,2018/05/24,198.0,198.636,197.0,157700,201.0,196.0
917,2018/05/25,193.0,195.094,197.0,210100,199.0,192.0
918,2018/05/28,190.0,190.569,190.0,195300,192.0,189.0
919,2018/05/29,187.0,186.115,190.0,359700,190.0,182.0
920,2018/05/30,185.0,184.841,184.0,127400,187.0,183.0
921,2018/05/31,188.0,187.345,186.0,134900,190.0,186.0
922,2018/06/01,185.0,185.939,189.0,125400,190.0,184.0
923,2018/06/04,181.0,181.663,186.0,368800,186.0,176.0
924,2018/06/05,179.0,179.046,180.0,176100,181.0,177.0
925,2018/06/06,178.0,179.454,179.0,205100,182.0,177.0
926,2018/06/07,184.0,181.707,180.0,171900,185.0,178.0
927,2018/06/08,183.0,182.683,184.0,106900,184.0,181.0
928,2018/06/11,187.0,185.731,184.0,177400,187.0,184.0
929,2018/06/12,184.0,185.702,188.0,249700,188.0,184.0
930,2018/06/13,184.0,184.265,183.0,107200,186.0,183.0
931,2018/06/14,185.0,184.254,184.0,102200,185.0,183.0
932,2018/06/15,180.0,182.245,185.0,145800,187.0,180.0
933,2018/06/18,178.0,177.896,177.0,170800,180.0,176.0
934,2018/06/19,174.0,175.505,176.0,343500,181.0,171.0
935,2018/06/20,174.0,171.864,173.0,172300,175.0,168.0
936,2018/06/21,174.0,174.587,174.0,68100,176.0,174.0
937,2018/06/22,173.0,173.513,174.0,54600,175.0,172.0
938,2018/06/25,167.0,169.423,173.0,125200,173.0,166.0
939,2018/06/26,168.0,166.275,165.0,115600,168.0,164.0
940,2018/06/27,168.0,167.242,168.0,51300,169.0,166.0
941,2018/06/28,166.0,165.582,167.0,101400,168.0,164.0
942,2018/06/29,170.0,166.754,166.0,115300,171.0,163.0
943,2018/07/02,164.0,166.558,171.0,90800,171.0,163.0
944,2018/07/03,163.0,162.792,164.0,109300,167.0,160.0
945,2018/07/04,162.0,160.832,163.0,113900,163.0,159.0
946,2018/07/05,160.0,159.321,160.0,175500,162.0,158.0
947,2018/07/06,164.0,160.719,159.0,168700,164.0,159.0
948,2018/07/09,164.0,163.267,163.0,123700,165.0,162.0
949,2018/07/10,164.0,165.41,165.0,134000,168.0,164.0
950,2018/07/11,160.0,161.126,165.0,178500,165.0,160.0
951,2018/07/12,163.0,161.997,161.0,103600,164.0,160.0
952,2018/07/13,163.0,162.448,163.0,113900,164.0,161.0
953,2018/07/17,162.0,162.296,163.0,46600,163.0,161.0
954,2018/07/18,165.0,164.213,162.0,80300,166.0,162.0
955,2018/07/19,166.0,166.112,166.0,114100,169.0,164.0
956,2018/07/20,167.0,166.008,166.0,89200,168.0,165.0
957,2018/07/23,167.0,167.138,167.0,71600,168.0,165.0
958,2018/07/24,172.0,170.684,168.0,107700,172.0,168.0
959,2018/07/25,170.0,171.1,171.0,83400,172.0,170.0
960,2018/07/26,170.0,169.619,172.0,101100,172.0,168.0
961,2018/07/27,168.0,168.491,171.0,85700,171.0,167.0
962,2018/07/30,168.0,168.145,169.0,89100,169.0,167.0
963,2018/07/31,166.0,166.143,167.0,87700,167.0,165.0
964,2018/08/01,167.0,166.348,168.0,53700,168.0,165.0
965,2018/08/02,168.0,167.145,167.0,97200,168.0,166.0
966,2018/08/03,165.0,165.585,168.0,75900,168.0,164.0
967,2018/08/06,165.0,165.446,166.0,54700,167.0,164.0
968,2018/08/07,164.0,163.293,165.0,62400,165.0,162.0
969,2018/08/08,166.0,165.573,164.0,96900,167.0,164.0
970,2018/08/09,192.0,192.762,191.0,6621000,205.0,185.0
971,2018/08/10,188.0,188.052,188.0,823300,191.0,186.0
972,2018/08/13,184.0,186.366,187.0,558400,193.0,182.0
973,2018/08/14,190.0,187.039,183.0,360400,190.0,182.0
974,2018/08/15,185.0,185.809,189.0,251500,189.0,183.0
975,2018/08/16,182.0,182.295,181.0,310800,185.0,181.0
976,2018/08/17,175.0,178.021,181.0,435200,182.0,175.0
977,2018/08/20,175.0,174.35,177.0,273000,177.0,173.0
978,2018/08/21,179.0,177.808,174.0,340200,181.0,173.0
979,2018/08/22,179.0,179.619,179.0,160700,181.0,178.0
980,2018/08/23,180.0,181.434,179.0,115900,183.0,179.0
981,2018/08/24,184.0,184.384,181.0,175100,186.0,181.0
982,2018/08/27,187.0,186.785,189.0,179700,189.0,185.0
983,2018/08/28,181.0,183.914,188.0,299500,189.0,181.0
984,2018/08/29,182.0,182.823,181.0,167200,185.0,180.0
985,2018/08/30,180.0,182.332,184.0,241300,186.0,180.0
986,2018/08/31,179.0,180.544,180.0,236200,185.0,177.0
987,2018/09/03,173.0,174.892,179.0,247100,179.0,173.0
988,2018/09/04,173.0,173.655,173.0,160900,176.0,172.0
989,2018/09/05,170.0,171.645,173.0,131300,175.0,170.0
990,2018/09/06,166.0,167.823,170.0,211600,171.0,166.0
991,2018/09/07,170.0,167.868,166.0,206800,171.0,166.0
992,2018/09/10,170.0,169.554,170.0,161600,173.0,167.0
993,2018/09/11,169.0,169.077,170.0,85700,171.0,168.0
994,2018/09/12,168.0,168.381,170.0,85100,170.0,167.0
995,2018/09/13,168.0,167.843,168.0,142100,169.0,166.0
996,2018/09/14,168.0,166.96,167.0,163800,168.0,166.0
997,2018/09/18,169.0,168.796,167.0,153200,171.0,167.0
998,2018/09/19,171.0,170.254,170.0,148700,172.0,169.0
999,2018/09/20,170.0,170.173,171.0,79000,171.0,169.0
1000,2018/09/21,171.0,170.287,169.0,69100,172.0,169.0
1001,2018/09/25,179.0,193.959,180.0,9731100,214.0,174.0
1002,2018/09/26,185.0,181.112,178.0,906900,185.0,177.0
1003,2018/09/27,181.0,182.0,182.0,422700,185.0,180.0
1004,2018/09/28,178.0,179.258,181.0,320200,183.0,178.0
1005,2018/10/01,177.0,177.668,179.0,202400,179.0,177.0
1006,2018/10/02,175.0,175.951,176.0,337200,178.0,175.0
1007,2018/10/03,173.0,174.046,175.0,243000,176.0,173.0
1008,2018/10/04,172.0,173.512,174.0,232800,176.0,172.0
1009,2018/10/05,175.0,174.132,171.0,229300,177.0,171.0
1010,2018/10/09,176.0,178.089,180.0,627300,182.0,175.0
1011,2018/10/10,181.0,180.107,179.0,335000,182.0,178.0
1012,2018/10/11,175.0,173.638,171.0,335900,177.0,171.0
1013,2018/10/12,182.0,180.48,175.0,308000,184.0,175.0
1014,2018/10/15,179.0,180.127,183.0,177100,183.0,177.0
1015,2018/10/16,175.0,177.003,179.0,185300,181.0,175.0
1016,2018/10/17,178.0,178.376,177.0,203000,181.0,177.0
1017,2018/10/18,179.0,179.57,180.0,108700,180.0,178.0
1018,2018/10/19,179.0,178.363,178.0,120800,181.0,176.0
1019,2018/10/22,178.0,177.444,177.0,158300,180.0,176.0
1020,2018/10/23,173.0,175.244,178.0,242500,178.0,173.0
1021,2018/10/24,174.0,174.37,175.0,178100,176.0,173.0
1022,2018/10/25,168.0,170.499,171.0,329200,173.0,167.0
1023,2018/10/26,161.0,164.739,169.0,457400,171.0,160.0
1024,2018/10/29,156.0,157.874,160.0,348800,163.0,155.0
1025,2018/10/30,160.0,157.747,152.0,435300,163.0,152.0
1026,2018/10/31,170.0,166.293,160.0,353800,170.0,160.0
1027,2018/11/01,168.0,169.073,168.0,224100,172.0,166.0
1028,2018/11/02,172.0,170.717,169.0,215900,173.0,169.0
1029,2018/11/05,176.0,173.662,171.0,212700,177.0,171.0
1030,2018/11/06,168.0,169.897,178.0,1027600,179.0,164.0
1031,2018/11/07,172.0,170.084,169.0,331500,172.0,167.0
1032,2018/11/08,169.0,170.291,170.0,281600,172.0,169.0
1033,2018/11/09,168.0,168.709,169.0,156100,171.0,167.0
1034,2018/11/12,166.0,167.141,168.0,136600,169.0,166.0
1035,2018/11/13,165.0,163.506,163.0,231300,166.0,161.0
1036,2018/11/14,162.0,163.709,166.0,206800,166.0,162.0
1037,2018/11/15,160.0,159.881,160.0,197900,162.0,158.0
1038,2018/11/16,157.0,158.209,159.0,232900,161.0,156.0
1039,2018/11/19,157.0,158.873,157.0,175300,161.0,157.0
1040,2018/11/20,157.0,157.131,157.0,92300,158.0,156.0
1041,2018/11/21,157.0,156.717,157.0,223600,159.0,155.0
1042,2018/11/22,165.0,165.465,167.0,738900,169.0,162.0
1043,2018/11/26,167.0,167.876,167.0,353600,170.0,166.0
1044,2018/11/27,165.0,165.848,168.0,201600,168.0,163.0
1045,2018/11/28,166.0,165.834,166.0,148800,167.0,165.0
1046,2018/11/29,167.0,166.874,167.0,133000,168.0,166.0
1047,2018/11/30,165.0,165.406,166.0,159600,166.0,164.0
1048,2018/12/03,167.0,166.607,166.0,196800,168.0,165.0
1049,2018/12/04,165.0,166.303,167.0,108400,168.0,165.0
1050,2018/12/05,165.0,165.434,165.0,132300,167.0,164.0
1051,2018/12/06,161.0,162.348,165.0,299600,165.0,160.0
1052,2018/12/07,164.0,161.93,162.0,190100,164.0,161.0
1053,2018/12/10,159.0,160.455,162.0,157200,162.0,159.0
1054,2018/12/11,157.0,157.542,159.0,287100,160.0,156.0
1055,2018/12/12,158.0,158.261,158.0,114000,159.0,157.0
1056,2018/12/13,156.0,157.693,159.0,140300,160.0,156.0
1057,2018/12/14,153.0,154.715,156.0,147900,157.0,153.0
1058,2018/12/17,148.0,149.671,153.0,308600,153.0,148.0
1059,2018/12/18,142.0,144.766,148.0,250800,148.0,141.0
1060,2018/12/19,140.0,140.74,141.0,206600,143.0,139.0
1061,2018/12/20,134.0,135.963,138.0,339700,140.0,132.0
1062,2018/12/21,128.0,128.133,131.0,623100,132.0,124.0
1063,2018/12/25,121.0,119.431,119.0,622300,122.0,116.0
1064,2018/12/26,126.0,125.912,122.0,353600,128.0,122.0
1065,2018/12/27,131.0,131.18,131.0,353400,134.0,129.0
1066,2018/12/28,132.0,130.313,127.0,182100,133.0,127.0
1067,2019/01/04,133.0,129.793,129.0,151300,133.0,128.0
1068,2019/01/07,136.0,137.455,135.0,258500,139.0,135.0
1069,2019/01/08,141.0,140.356,137.0,171200,142.0,137.0
1070,2019/01/09,139.0,140.269,141.0,119900,142.0,139.0
1071,2019/01/10,134.0,136.708,139.0,164400,139.0,134.0
1072,2019/01/11,138.0,135.806,135.0,152500,138.0,134.0
1073,2019/01/15,140.0,139.094,137.0,202800,141.0,137.0
1074,2019/01/16,138.0,139.923,141.0,90900,142.0,138.0
1075,2019/01/17,141.0,139.333,139.0,154800,142.0,138.0
1076,2019/01/18,142.0,142.007,141.0,134300,143.0,140.0
1077,2019/01/21,144.0,143.762,143.0,160100,145.0,143.0
1078,2019/01/22,144.0,143.914,144.0,136000,145.0,143.0
1079,2019/01/23,142.0,143.177,144.0,99100,144.0,142.0
1080,2019/01/24,143.0,141.947,142.0,89100,144.0,141.0
1081,2019/01/25,147.0,145.051,144.0,98800,147.0,143.0
1082,2019/01/28,145.0,145.185,148.0,133500,148.0,143.0
1083,2019/01/29,147.0,145.44,145.0,75900,147.0,144.0
1084,2019/01/30,142.0,144.386,147.0,124100,147.0,142.0
1085,2019/01/31,144.0,142.717,142.0,95500,144.0,142.0
1086,2019/02/01,146.0,144.275,144.0,118000,146.0,142.0
1087,2019/02/04,147.0,146.688,147.0,70400,147.0,145.0
1088,2019/02/05,148.0,148.359,147.0,129100,151.0,146.0
1089,2019/02/06,147.0,147.549,147.0,66900,149.0,147.0
1090,2019/02/07,150.0,150.097,147.0,200700,153.0,147.0
1091,2019/02/08,150.0,146.232,148.0,163700,150.0,141.0
1092,2019/02/12,147.0,149.007,150.0,277600,151.0,146.0
1093,2019/02/13,150.0,148.383,145.0,366700,153.0,145.0
1094,2019/02/14,160.0,157.753,150.0,670800,163.0,149.0
1095,2019/02/15,158.0,158.638,160.0,145300,161.0,157.0
1096,2019/02/18,155.0,156.935,160.0,379200,161.0,153.0
1097,2019/02/19,155.0,156.278,156.0,207600,158.0,155.0
1098,2019/02/20,156.0,155.16,155.0,153300,157.0,153.0
1099,2019/02/21,156.0,155.553,156.0,69100,157.0,154.0
1100,2019/02/22,155.0,155.098,156.0,87600,156.0,154.0
1101,2019/02/25,156.0,155.488,155.0,109000,157.0,155.0
1102,2019/02/26,152.0,153.814,156.0,198800,156.0,152.0
1103,2019/02/27,156.0,153.758,152.0,107200,156.0,152.0
1104,2019/02/28,154.0,154.308,155.0,102600,156.0,153.0
1105,2019/03/01,154.0,154.381,154.0,45100,155.0,154.0
1106,2019/03/04,154.0,153.964,154.0,67500,155.0,153.0
1107,2019/03/05,154.0,152.94,154.0,104100,154.0,151.0
1108,2019/03/06,154.0,153.551,154.0,98800,155.0,152.0
1109,2019/03/07,149.0,150.828,154.0,116500,154.0,149.0
1110,2019/03/08,143.0,144.915,147.0,169800,148.0,143.0
1111,2019/03/11,143.0,141.484,143.0,161600,143.0,140.0
1112,2019/03/12,147.0,147.077,147.0,83400,148.0,146.0
1113,2019/03/13,144.0,146.419,148.0,71200,148.0,144.0
1114,2019/03/14,146.0,145.558,147.0,69300,147.0,144.0
1115,2019/03/15,146.0,146.166,146.0,71200,147.0,145.0
1116,2019/03/18,144.0,144.291,146.0,126300,146.0,143.0
1117,2019/03/19,144.0,143.005,145.0,199500,145.0,141.0
1118,2019/03/20,144.0,144.205,145.0,95800,145.0,143.0
1119,2019/03/22,145.0,143.417,144.0,128500,145.0,142.0
1120,2019/03/25,142.0,140.968,141.0,160700,143.0,140.0
1121,2019/03/26,146.0,145.212,144.0,162600,147.0,143.0
1122,2019/03/27,146.0,145.205,145.0,109900,148.0,143.0
1123,2019/03/28,147.0,146.1,146.0,130600,148.0,143.0
1124,2019/03/29,153.0,149.586,148.0,221500,153.0,146.0
1125,2019/04/01,147.0,148.821,153.0,300200,153.0,146.0
1126,2019/04/02,144.0,145.583,147.0,105600,147.0,144.0
1127,2019/04/03,147.0,145.934,144.0,161600,151.0,143.0
1128,2019/04/04,145.0,148.228,151.0,103500,151.0,145.0
1129,2019/04/05,148.0,148.038,147.0,117300,150.0,147.0
1130,2019/04/08,150.0,148.114,148.0,78300,150.0,147.0
1131,2019/04/09,148.0,149.945,152.0,103600,152.0,148.0
1132,2019/04/10,147.0,147.061,148.0,65100,148.0,146.0
1133,2019/04/11,145.0,147.2,150.0,73000,150.0,145.0
1134,2019/04/12,145.0,145.139,146.0,62500,146.0,144.0
1135,2019/04/15,147.0,146.25,146.0,108200,148.0,145.0
1136,2019/04/16,149.0,147.874,148.0,64200,149.0,147.0
1137,2019/04/17,156.0,152.749,149.0,329800,156.0,147.0
1138,2019/04/18,148.0,151.874,157.0,414100,157.0,147.0
1139,2019/04/19,149.0,148.874,148.0,97900,151.0,148.0
1140,2019/04/22,148.0,147.951,149.0,119200,149.0,146.0
1141,2019/04/23,151.0,148.854,149.0,105600,151.0,147.0
1142,2019/04/24,151.0,151.03,151.0,110500,152.0,150.0
1143,2019/04/25,149.0,149.869,151.0,78600,151.0,148.0
1144,2019/04/26,148.0,147.613,148.0,126900,149.0,146.0
1145,2019/05/07,150.0,148.715,148.0,96500,151.0,147.0
1146,2019/05/08,150.0,148.844,148.0,84400,151.0,147.0
1147,2019/05/09,148.0,150.961,154.0,601000,155.0,146.0
1148,2019/05/10,145.0,145.86,147.0,194000,148.0,144.0
1149,2019/05/13,144.0,145.384,145.0,299000,147.0,144.0
1150,2019/05/14,140.0,136.738,140.0,434900,141.0,131.0
1151,2019/05/15,140.0,138.009,139.0,136000,140.0,136.0
1152,2019/05/16,143.0,141.704,141.0,170800,145.0,140.0
1153,2019/05/17,140.0,140.788,142.0,89100,143.0,140.0
1154,2019/05/20,139.0,139.785,140.0,93600,141.0,138.0
1155,2019/05/21,135.0,136.704,138.0,128200,138.0,135.0
1156,2019/05/22,136.0,135.989,136.0,80000,137.0,135.0
1157,2019/05/23,134.0,134.494,136.0,181200,136.0,133.0
1158,2019/05/24,134.0,133.551,133.0,124600,135.0,132.0
1159,2019/05/27,136.0,135.498,134.0,92800,137.0,134.0
1160,2019/05/28,136.0,135.94,136.0,116500,137.0,135.0
1161,2019/05/29,133.0,133.639,134.0,111000,135.0,133.0
1162,2019/05/30,132.0,132.651,133.0,83300,134.0,131.0
1163,2019/05/31,130.0,130.753,132.0,123700,132.0,129.0
1164,2019/06/03,125.0,127.222,129.0,163400,130.0,125.0
1165,2019/06/04,129.0,126.501,125.0,144400,129.0,125.0
1166,2019/06/05,133.0,131.082,130.0,98100,133.0,129.0
1167,2019/06/06,133.0,133.056,134.0,78600,134.0,131.0
1168,2019/06/07,134.0,133.926,133.0,623500,135.0,131.0
1169,2019/06/10,135.0,134.032,134.0,617600,136.0,132.0
1170,2019/06/11,137.0,136.149,135.0,142700,137.0,134.0
1171,2019/06/12,137.0,136.2,136.0,88600,138.0,135.0
1172,2019/06/13,140.0,141.218,143.0,668500,144.0,138.0
1173,2019/06/14,139.0,139.215,140.0,104100,140.0,138.0
1174,2019/06/17,139.0,137.306,139.0,174600,139.0,135.0
1175,2019/06/18,134.0,135.386,139.0,138000,140.0,132.0
1176,2019/06/19,137.0,136.293,136.0,69300,138.0,136.0
1177,2019/06/20,135.0,135.895,138.0,113200,138.0,135.0
1178,2019/06/21,135.0,135.117,136.0,100700,136.0,134.0
1179,2019/06/24,135.0,134.072,134.0,87500,135.0,133.0
1180,2019/06/25,136.0,135.106,135.0,41600,136.0,134.0
1181,2019/06/26,136.0,134.595,134.0,32600,136.0,134.0
1182,2019/06/27,136.0,135.737,136.0,80900,137.0,135.0
1183,2019/06/28,136.0,136.255,136.0,38100,137.0,136.0
1184,2019/07/01,137.0,137.672,138.0,47600,138.0,137.0
1185,2019/07/02,140.0,138.261,137.0,60100,140.0,137.0
1186,2019/07/03,138.0,138.152,140.0,80400,140.0,136.0
1187,2019/07/04,141.0,140.033,138.0,164100,143.0,137.0
1188,2019/07/05,143.0,142.028,142.0,54000,143.0,141.0
1189,2019/07/08,141.0,140.273,142.0,114900,142.0,137.0
1190,2019/07/09,140.0,140.745,141.0,159400,143.0,139.0
1191,2019/07/10,141.0,140.412,140.0,61700,142.0,140.0
1192,2019/07/11,143.0,142.733,144.0,106600,144.0,142.0
1193,2019/07/12,141.0,144.679,145.0,582300,145.0,141.0
1194,2019/07/16,142.0,140.884,140.0,35300,142.0,140.0
1195,2019/07/17,139.0,140.018,141.0,60900,141.0,139.0
1196,2019/07/18,136.0,136.195,138.0,162900,138.0,134.0
1197,2019/07/19,140.0,137.998,137.0,39800,140.0,136.0
1198,2019/07/22,139.0,139.177,140.0,57800,140.0,138.0
1199,2019/07/23,139.0,138.895,139.0,27600,139.0,138.0
1200,2019/07/24,138.0,138.803,139.0,46600,139.0,138.0
1201,2019/07/25,139.0,138.44,138.0,23400,139.0,138.0
1202,2019/07/26,141.0,139.047,139.0,72000,141.0,138.0
1203,2019/07/29,142.0,142.168,142.0,110000,144.0,141.0
1204,2019/07/30,141.0,141.244,142.0,47500,142.0,140.0
1205,2019/07/31,141.0,141.127,140.0,75800,143.0,139.0
1206,2019/08/01,142.0,141.189,140.0,48600,143.0,139.0
1207,2019/08/02,139.0,139.643,140.0,62400,140.0,139.0
1208,2019/08/05,133.0,134.362,138.0,225900,138.0,132.0
1209,2019/08/06,134.0,131.231,131.0,117400,134.0,128.0
1210,2019/08/07,135.0,134.302,134.0,57600,135.0,134.0
1211,2019/08/08,136.0,135.007,135.0,44800,137.0,134.0
1212,2019/08/09,137.0,138.187,139.0,240800,142.0,136.0
1213,2019/08/13,136.0,134.985,135.0,122600,137.0,132.0
1214,2019/08/14,138.0,138.169,138.0,73000,140.0,136.0
1215,2019/08/15,133.0,133.665,135.0,210600,136.0,132.0
1216,2019/08/16,136.0,134.921,133.0,120600,137.0,133.0
1217,2019/08/19,141.0,140.176,140.0,470500,143.0,138.0
1218,2019/08/20,149.0,147.681,142.0,616500,152.0,142.0
1219,2019/08/21,144.0,147.935,147.0,541700,153.0,144.0
1220,2019/08/22,140.0,143.181,145.0,301000,146.0,139.0
1221,2019/08/23,138.0,139.237,139.0,218600,142.0,137.0
