,Date,Close,VWAP,Open,Volume,High,Low
0,2014/08/25,353.0,355.0,355.0,1700,357.0,353.0
1,2014/08/26,351.0,350.717,350.0,4600,358.0,350.0
2,2014/08/27,350.0,350.0,350.0,2500,350.0,350.0
3,2014/08/28,355.0,356.475,355.0,4000,359.0,353.0
4,2014/08/29,355.0,355.639,358.0,6100,358.0,351.0
5,2014/09/01,354.0,354.023,358.0,8700,359.0,353.0
6,2014/09/02,350.0,353.089,354.0,4500,355.0,350.0
7,2014/09/03,356.0,353.84,350.0,7500,358.0,348.0
8,2014/09/04,357.0,358.336,359.0,13400,360.0,355.0
9,2014/09/05,352.0,354.143,360.0,4900,360.0,352.0
10,2014/09/08,347.0,350.013,352.0,7500,352.0,347.0
11,2014/09/09,337.0,339.983,347.0,5800,347.0,337.0
12,2014/09/10,342.0,400.815,340.0,675400,417.0,340.0
13,2014/09/11,388.0,377.908,355.0,291300,410.0,345.0
14,2014/09/12,359.0,370.674,395.0,114200,400.0,351.0
15,2014/09/16,439.0,420.522,375.0,301000,439.0,360.0
16,2014/09/17,429.0,442.893,442.0,462600,499.0,405.0
17,2014/09/18,407.0,430.275,461.0,183900,475.0,402.0
18,2014/09/19,392.0,400.997,410.0,67200,415.0,392.0
19,2014/09/22,384.0,403.044,399.0,125700,436.0,382.0
20,2014/09/24,375.0,382.542,386.0,44800,398.0,371.0
21,2014/09/25,375.0,376.456,383.0,14900,383.0,374.0
22,2014/09/26,377.0,378.185,373.0,13000,385.0,371.0
23,2014/09/29,378.0,383.451,385.0,25300,394.0,376.0
24,2014/09/30,365.0,367.313,375.0,33500,376.0,360.0
25,2014/10/01,369.0,370.521,365.0,17100,379.0,365.0
26,2014/10/02,360.0,361.48,364.0,10200,368.0,355.0
27,2014/10/03,375.0,369.779,358.0,37100,390.0,358.0
28,2014/10/06,386.0,396.668,390.0,93000,420.0,379.0
29,2014/10/07,394.0,401.596,394.0,43300,414.0,388.0
30,2014/10/08,399.0,387.494,386.0,25300,403.0,376.0
31,2014/10/09,373.0,393.812,414.0,28200,414.0,373.0
32,2014/10/10,369.0,361.249,357.0,34200,372.0,349.0
33,2014/10/14,361.0,358.577,369.0,13000,369.0,354.0
34,2014/10/15,346.0,354.161,366.0,11800,366.0,346.0
35,2014/10/16,331.0,335.933,343.0,19500,343.0,331.0
36,2014/10/17,332.0,335.137,334.0,12400,340.0,331.0
37,2014/10/20,341.0,342.527,350.0,5500,350.0,338.0
38,2014/10/21,338.0,340.795,349.0,3900,349.0,338.0
39,2014/10/22,348.0,341.354,345.0,9900,348.0,336.0
40,2014/10/23,340.0,342.027,348.0,7500,348.0,337.0
41,2014/10/24,343.0,349.265,341.0,3400,355.0,341.0
42,2014/10/27,348.0,347.0,344.0,4300,353.0,344.0
43,2014/10/28,343.0,347.286,352.0,2800,352.0,343.0
44,2014/10/29,346.0,345.849,346.0,3300,349.0,345.0
45,2014/10/30,379.0,371.353,348.0,74600,396.0,348.0
46,2014/10/31,390.0,398.649,403.0,130000,422.0,376.0
47,2014/11/04,387.0,386.264,392.0,26900,393.0,380.0
48,2014/11/05,362.0,366.267,381.0,31900,381.0,359.0
49,2014/11/06,373.0,366.931,362.0,27600,376.0,361.0
50,2014/11/07,376.0,375.371,380.0,14300,381.0,368.0
51,2014/11/10,370.0,374.375,376.0,21600,395.0,368.0
52,2014/11/11,378.0,377.129,374.0,7000,382.0,372.0
53,2014/11/12,371.0,374.122,381.0,4100,381.0,369.0
54,2014/11/13,365.0,365.833,369.0,2400,370.0,365.0
55,2014/11/14,356.0,361.533,365.0,10700,365.0,356.0
56,2014/11/17,340.0,346.776,359.0,19600,359.0,338.0
57,2014/11/18,353.0,343.25,338.0,7600,356.0,338.0
58,2014/11/19,349.0,351.533,348.0,3000,353.0,348.0
59,2014/11/20,350.0,348.621,355.0,6600,355.0,344.0
60,2014/11/21,343.0,343.057,345.0,7000,347.0,339.0
61,2014/11/25,342.0,348.422,348.0,9000,352.0,342.0
62,2014/11/26,370.0,354.887,343.0,10600,371.0,343.0
63,2014/11/27,368.0,371.434,371.0,12900,381.0,364.0
64,2014/11/28,371.0,370.424,376.0,3300,376.0,361.0
65,2014/12/01,369.0,370.667,371.0,2700,377.0,368.0
66,2014/12/02,372.0,364.076,369.0,11800,372.0,360.0
67,2014/12/03,364.0,367.155,370.0,5800,371.0,364.0
68,2014/12/04,361.0,364.433,366.0,12700,370.0,360.0
69,2014/12/05,359.0,362.475,362.0,5900,365.0,358.0
70,2014/12/08,362.0,357.555,359.0,12800,362.0,352.0
71,2014/12/09,352.0,354.738,361.0,6100,361.0,352.0
72,2014/12/10,351.0,349.321,351.0,10900,352.0,341.0
73,2014/12/11,349.0,343.05,344.0,6000,349.0,342.0
74,2014/12/12,344.0,348.99,354.0,9700,355.0,342.0
75,2014/12/15,344.0,349.248,352.0,12100,357.0,337.0
76,2014/12/16,348.0,343.464,344.0,11200,348.0,340.0
77,2014/12/17,343.0,344.509,345.0,5300,349.0,341.0
78,2014/12/18,343.0,344.329,345.0,7000,345.0,340.0
79,2014/12/19,344.0,343.644,343.0,4500,349.0,343.0
80,2014/12/22,340.0,343.57,348.0,25600,348.0,338.0
81,2014/12/24,334.0,342.422,345.0,15400,345.0,334.0
82,2014/12/25,338.0,333.258,331.0,37600,340.0,331.0
83,2014/12/26,342.0,343.214,343.0,5600,350.0,340.0
84,2014/12/29,422.0,422.0,422.0,21000,422.0,422.0
85,2014/12/30,482.0,497.772,502.0,871400,502.0,464.0
86,2015/01/05,468.0,514.87,536.0,528200,557.0,467.0
87,2015/01/06,428.0,441.024,444.0,178100,454.0,428.0
88,2015/01/07,435.0,449.312,437.0,164300,477.0,428.0
89,2015/01/08,425.0,413.799,430.0,101100,430.0,400.0
90,2015/01/09,412.0,414.776,426.0,45000,427.0,408.0
91,2015/01/13,418.0,428.204,416.0,116900,460.0,401.0
92,2015/01/14,415.0,412.088,416.0,37400,418.0,405.0
93,2015/01/15,407.0,406.807,411.0,20700,415.0,390.0
94,2015/01/16,393.0,396.014,401.0,43900,407.0,387.0
95,2015/01/19,393.0,391.303,390.0,19800,396.0,385.0
96,2015/01/20,397.0,400.126,401.0,37200,408.0,392.0
97,2015/01/21,397.0,398.209,398.0,15800,404.0,395.0
98,2015/01/22,396.0,395.68,392.0,15600,400.0,392.0
99,2015/01/23,402.0,401.128,400.0,14800,403.0,399.0
100,2015/01/26,412.0,410.418,410.0,12200,417.0,402.0
101,2015/01/27,397.0,408.714,420.0,32900,421.0,393.0
102,2015/01/28,412.0,422.394,401.0,125300,448.0,401.0
103,2015/01/29,407.0,411.587,412.0,23700,420.0,407.0
104,2015/01/30,402.0,402.013,407.0,15800,407.0,400.0
105,2015/02/02,413.0,410.002,405.0,44800,420.0,395.0
106,2015/02/03,397.0,406.748,412.0,21000,417.0,397.0
107,2015/02/04,402.0,403.924,405.0,10500,405.0,400.0
108,2015/02/05,414.0,411.113,413.0,21200,417.0,403.0
109,2015/02/06,382.0,384.052,384.0,56100,391.0,379.0
110,2015/02/09,384.0,379.323,384.0,15800,387.0,373.0
111,2015/02/10,383.0,384.633,384.0,16900,387.0,381.0
112,2015/02/12,385.0,385.519,385.0,5200,389.0,385.0
113,2015/02/13,388.0,385.155,389.0,5800,390.0,383.0
114,2015/02/16,382.0,384.75,386.0,8800,390.0,382.0
115,2015/02/17,378.0,380.05,382.0,12000,384.0,378.0
116,2015/02/18,378.0,377.725,379.0,9100,380.0,375.0
117,2015/02/19,379.0,382.072,384.0,19500,388.0,374.0
118,2015/02/20,381.0,384.571,380.0,12600,388.0,379.0
119,2015/02/23,383.0,383.963,382.0,10800,388.0,382.0
120,2015/02/24,385.0,384.492,383.0,6300,386.0,383.0
121,2015/02/25,387.0,387.575,389.0,8700,389.0,386.0
122,2015/02/26,392.0,389.0,387.0,4400,392.0,387.0
123,2015/02/27,390.0,396.724,392.0,12700,401.0,390.0
124,2015/03/02,387.0,385.936,391.0,11000,392.0,381.0
125,2015/03/03,382.0,383.813,387.0,9600,388.0,382.0
126,2015/03/04,380.0,380.481,383.0,16000,385.0,378.0
127,2015/03/05,385.0,384.114,380.0,4400,387.0,380.0
128,2015/03/06,383.0,384.273,385.0,2200,386.0,382.0
129,2015/03/09,382.0,382.099,383.0,8100,383.0,381.0
130,2015/03/10,388.0,385.396,384.0,4800,388.0,384.0
131,2015/03/11,386.0,384.357,385.0,5600,391.0,381.0
132,2015/03/12,387.0,385.667,383.0,2400,389.0,383.0
133,2015/03/13,382.0,389.0,389.0,37700,410.0,379.0
134,2015/03/16,381.0,382.014,384.0,14800,384.0,381.0
135,2015/03/17,391.0,391.007,394.0,13900,394.0,385.0
136,2015/03/18,402.0,398.116,399.0,24100,408.0,394.0
137,2015/03/19,395.0,399.337,408.0,10400,408.0,392.0
138,2015/03/20,396.0,392.771,396.0,3500,396.0,390.0
139,2015/03/23,391.0,393.0,404.0,6200,404.0,387.0
140,2015/03/24,387.0,392.883,397.0,9400,397.0,387.0
141,2015/03/25,394.0,392.5,390.0,3400,394.0,390.0
142,2015/03/26,397.0,399.32,394.0,19400,408.0,394.0
143,2015/03/27,370.0,389.059,397.0,18600,400.0,361.0
144,2015/03/30,382.0,376.299,373.0,8700,383.0,372.0
145,2015/03/31,390.0,383.974,382.0,3900,390.0,380.0
146,2015/04/01,380.0,388.125,393.0,1600,393.0,380.0
147,2015/04/02,380.0,380.9,381.0,3000,384.0,380.0
148,2015/04/03,375.0,377.265,380.0,3400,380.0,375.0
149,2015/04/06,374.0,368.568,372.0,8800,374.0,362.0
150,2015/04/07,378.0,376.52,368.0,5000,383.0,368.0
151,2015/04/08,377.0,378.124,379.0,8100,382.0,377.0
152,2015/04/09,375.0,373.75,377.0,7200,384.0,365.0
153,2015/04/10,380.0,378.652,375.0,6900,383.0,375.0
154,2015/04/13,377.0,378.169,378.0,8300,381.0,377.0
155,2015/04/14,380.0,377.0,377.0,2000,380.0,376.0
156,2015/04/15,378.0,379.087,382.0,10400,382.0,377.0
157,2015/04/16,381.0,379.791,380.0,4300,381.0,378.0
158,2015/04/17,379.0,379.423,382.0,7100,382.0,376.0
159,2015/04/20,385.0,382.689,383.0,4500,385.0,380.0
160,2015/04/21,386.0,385.733,381.0,10500,392.0,381.0
161,2015/04/22,386.0,385.79,386.0,5700,390.0,385.0
162,2015/04/23,388.0,387.082,388.0,8500,389.0,386.0
163,2015/04/24,390.0,389.8,392.0,5500,393.0,388.0
164,2015/04/27,395.0,393.167,394.0,6600,399.0,390.0
165,2015/04/28,392.0,395.558,397.0,8600,397.0,392.0
166,2015/04/30,390.0,387.235,388.0,11500,390.0,386.0
167,2015/05/01,390.0,386.844,389.0,16000,390.0,384.0
168,2015/05/07,390.0,394.279,388.0,4300,399.0,387.0
169,2015/05/08,405.0,406.87,395.0,47700,420.0,392.0
170,2015/05/11,365.0,366.087,374.0,77400,377.0,355.0
171,2015/05/12,375.0,368.278,365.0,18000,376.0,362.0
172,2015/05/13,389.0,381.002,374.0,64200,389.0,367.0
173,2015/05/14,379.0,387.417,389.0,11500,389.0,378.0
174,2015/05/15,378.0,378.8,379.0,1000,379.0,378.0
175,2015/05/18,367.0,369.125,377.0,12800,377.0,365.0
176,2015/05/19,385.0,399.535,367.0,99200,419.0,366.0
177,2015/05/20,388.0,429.041,392.0,311900,464.0,384.0
178,2015/05/21,378.0,381.941,391.0,69300,400.0,367.0
179,2015/05/22,380.0,381.014,374.0,36600,395.0,368.0
180,2015/05/25,389.0,387.0,385.0,11800,391.0,383.0
181,2015/05/26,390.0,390.678,392.0,11500,395.0,385.0
182,2015/05/27,384.0,386.433,389.0,3000,390.0,382.0
183,2015/05/28,381.0,383.796,384.0,9300,385.0,380.0
184,2015/05/29,382.0,381.042,380.0,2400,382.0,380.0
185,2015/06/01,382.0,380.636,382.0,1100,382.0,379.0
186,2015/06/02,377.0,378.051,381.0,3900,381.0,375.0
187,2015/06/03,374.0,374.742,376.0,6600,376.0,373.0
188,2015/06/04,375.0,375.942,375.0,5200,379.0,374.0
189,2015/06/05,374.0,374.75,375.0,2000,375.0,374.0
190,2015/06/08,375.0,374.45,375.0,12000,375.0,372.0
191,2015/06/09,373.0,376.25,377.0,3200,378.0,373.0
192,2015/06/10,372.0,372.0,372.0,2900,373.0,371.0
193,2015/06/11,374.0,373.4,371.0,1500,375.0,371.0
194,2015/06/12,381.0,378.283,377.0,13800,383.0,373.0
195,2015/06/15,379.0,377.785,381.0,6500,381.0,375.0
196,2015/06/16,375.0,378.171,379.0,12300,380.0,375.0
197,2015/06/17,375.0,375.286,375.0,700,376.0,375.0
198,2015/06/18,369.0,371.027,376.0,3700,376.0,369.0
199,2015/06/19,370.0,369.81,369.0,4200,375.0,369.0
200,2015/06/22,372.0,371.39,371.0,4100,373.0,369.0
201,2015/06/23,366.0,367.34,373.0,4700,373.0,364.0
202,2015/06/24,369.0,367.741,367.0,5400,369.0,367.0
203,2015/06/25,367.0,367.76,368.0,2500,369.0,367.0
204,2015/06/26,369.0,366.541,367.0,7400,369.0,364.0
205,2015/06/29,356.0,361.355,368.0,12400,368.0,356.0
206,2015/06/30,350.0,348.464,356.0,16600,362.0,340.0
207,2015/07/01,353.0,351.19,352.0,5800,356.0,347.0
208,2015/07/02,350.0,349.672,353.0,25900,356.0,346.0
209,2015/07/03,348.0,345.255,343.0,5500,349.0,343.0
210,2015/07/06,344.0,343.823,345.0,6200,347.0,341.0
211,2015/07/07,342.0,342.066,344.0,7600,345.0,340.0
212,2015/07/08,336.0,343.14,345.0,15000,348.0,336.0
213,2015/07/09,344.0,330.318,333.0,14800,344.0,318.0
214,2015/07/10,340.0,343.0,342.0,800,345.0,340.0
215,2015/07/13,345.0,346.0,346.0,1300,347.0,345.0
216,2015/07/14,349.0,348.569,350.0,5100,350.0,345.0
217,2015/07/15,358.0,355.234,355.0,38100,358.0,353.0
218,2015/07/16,364.0,360.923,359.0,45700,365.0,358.0
219,2015/07/17,352.0,357.293,357.0,24600,363.0,352.0
220,2015/07/21,353.0,354.859,358.0,14200,358.0,350.0
221,2015/07/22,353.0,351.322,350.0,5900,356.0,350.0
222,2015/07/23,344.0,344.809,345.0,22500,351.0,341.0
223,2015/07/24,343.0,344.683,345.0,14500,345.0,342.0
224,2015/07/27,352.0,342.95,343.0,30100,352.0,338.0
225,2015/07/28,348.0,346.375,350.0,1600,350.0,343.0
226,2015/07/29,359.0,359.32,350.0,55700,389.0,346.0
227,2015/07/30,352.0,353.935,356.0,9200,358.0,348.0
228,2015/07/31,352.0,349.941,352.0,1700,353.0,345.0
229,2015/08/03,358.0,356.927,364.0,4100,364.0,356.0
230,2015/08/04,364.0,357.021,353.0,4700,364.0,349.0
231,2015/08/05,363.0,361.559,363.0,3400,363.0,356.0
232,2015/08/06,363.0,363.091,359.0,2200,366.0,359.0
233,2015/08/07,352.0,356.526,363.0,3800,365.0,350.0
234,2015/08/10,356.0,353.028,352.0,3600,360.0,350.0
235,2015/08/11,371.0,365.496,358.0,11300,371.0,356.0
236,2015/08/12,353.0,348.221,350.0,10400,353.0,341.0
237,2015/08/13,348.0,348.0,348.0,200,348.0,348.0
238,2015/08/14,353.0,357.556,359.0,900,359.0,352.0
239,2015/08/17,353.0,353.0,353.0,200,353.0,353.0
240,2015/08/18,341.0,341.513,345.0,8000,346.0,339.0
241,2015/08/19,330.0,331.91,334.0,19900,339.0,323.0
242,2015/08/20,331.0,327.792,327.0,2400,331.0,327.0
243,2015/08/21,312.0,316.018,330.0,16300,330.0,307.0
244,2015/08/24,310.0,294.303,290.0,24400,310.0,280.0
245,2015/08/25,288.0,274.036,280.0,11100,300.0,260.0
246,2015/08/26,282.0,275.246,270.0,17500,286.0,270.0
247,2015/08/27,285.0,285.885,290.0,17400,291.0,280.0
248,2015/08/28,307.0,299.17,290.0,14100,308.0,289.0
249,2015/08/31,305.0,301.265,300.0,4900,305.0,300.0
250,2015/09/01,306.0,306.2,305.0,2000,309.0,304.0
251,2015/09/02,306.0,292.813,289.0,3200,306.0,289.0
252,2015/09/03,305.0,305.0,305.0,600,305.0,305.0
253,2015/09/04,306.0,298.471,300.0,1700,306.0,290.0
254,2015/09/07,284.0,281.638,282.0,6900,289.0,277.0
255,2015/09/08,274.0,279.419,284.0,4300,288.0,274.0
256,2015/09/09,292.0,291.583,288.0,1200,296.0,288.0
257,2015/09/10,293.0,292.556,295.0,1800,295.0,286.0
258,2015/09/11,290.0,292.125,293.0,800,293.0,290.0
259,2015/09/14,290.0,291.867,294.0,1500,294.0,290.0
260,2015/09/15,288.0,289.444,287.0,900,290.0,287.0
261,2015/09/16,292.0,299.324,300.0,7100,300.0,292.0
262,2015/09/17,302.0,294.571,289.0,700,302.0,289.0
263,2015/09/18,291.0,295.75,300.0,400,300.0,291.0
264,2015/09/24,291.0,292.5,295.0,400,295.0,291.0
265,2015/09/25,288.0,283.115,283.0,2600,288.0,282.0
266,2015/09/28,289.0,288.636,288.0,1100,290.0,288.0
267,2015/09/29,285.0,286.667,289.0,300,289.0,285.0
268,2015/09/30,287.0,286.333,283.0,300,289.0,283.0
269,2015/10/01,287.0,287.286,289.0,700,289.0,287.0
270,2015/10/02,289.0,293.25,295.0,400,295.0,289.0
271,2015/10/05,298.0,291.0,290.0,800,298.0,290.0
272,2015/10/06,294.0,295.077,292.0,1300,299.0,292.0
273,2015/10/07,298.0,298.625,300.0,800,300.0,298.0
274,2015/10/08,303.0,299.273,293.0,2200,303.0,293.0
275,2015/10/09,310.0,302.107,300.0,2800,310.0,298.0
276,2015/10/13,309.0,306.643,309.0,2800,310.0,300.0
277,2015/10/14,315.0,315.241,301.0,7900,325.0,300.0
278,2015/10/15,321.0,321.667,323.0,3000,323.0,321.0
279,2015/10/16,332.0,323.51,313.0,10000,332.0,313.0
280,2015/10/19,307.0,334.066,333.0,24100,353.0,307.0
281,2015/10/20,312.0,317.354,312.0,7900,335.0,312.0
282,2015/10/21,312.0,308.25,311.0,3600,317.0,295.0
283,2015/10/22,318.0,312.0,310.0,400,318.0,310.0
284,2015/10/23,328.0,331.136,322.0,5900,339.0,322.0
285,2015/10/26,335.0,338.035,329.0,8700,345.0,328.0
286,2015/10/27,344.0,341.65,347.0,2000,347.0,336.0
287,2015/10/28,334.0,332.328,347.0,6700,347.0,325.0
288,2015/10/29,332.0,328.061,335.0,9800,337.0,322.0
289,2015/10/30,335.0,331.387,332.0,3100,335.0,320.0
290,2015/11/02,335.0,330.99,335.0,10100,335.0,310.0
291,2015/11/04,332.0,332.174,335.0,10900,338.0,331.0
292,2015/11/05,318.0,320.238,331.0,4200,331.0,317.0
293,2015/11/06,321.0,313.071,313.0,1400,321.0,311.0
294,2015/11/09,314.0,314.364,313.0,4400,321.0,313.0
295,2015/11/10,313.0,316.182,317.0,1100,320.0,313.0
296,2015/11/11,317.0,314.792,310.0,4800,322.0,310.0
297,2015/11/12,318.0,318.0,318.0,1800,320.0,315.0
298,2015/11/13,307.0,305.8,320.0,6000,320.0,304.0
299,2015/11/16,306.0,303.7,305.0,2000,306.0,303.0
300,2015/11/17,302.0,304.697,306.0,3300,306.0,301.0
301,2015/11/18,304.0,303.778,302.0,900,304.0,302.0
302,2015/11/19,305.0,303.591,301.0,2200,307.0,301.0
303,2015/11/20,307.0,305.0,304.0,500,307.0,304.0
304,2015/11/24,308.0,309.139,307.0,7900,316.0,306.0
305,2015/11/25,311.0,310.846,310.0,1300,314.0,310.0
306,2015/11/26,321.0,319.901,314.0,9100,335.0,309.0
307,2015/11/27,312.0,309.721,313.0,6100,315.0,303.0
308,2015/11/30,308.0,310.286,314.0,2100,314.0,308.0
309,2015/12/01,310.0,308.303,308.0,3300,313.0,306.0
310,2015/12/02,312.0,314.396,312.0,4800,328.0,308.0
311,2015/12/03,312.0,312.056,311.0,3600,319.0,309.0
312,2015/12/04,308.0,309.0,309.0,1000,313.0,308.0
313,2015/12/07,319.0,321.731,315.0,9300,332.0,311.0
314,2015/12/08,318.0,315.629,318.0,3500,319.0,311.0
315,2015/12/09,312.0,312.717,311.0,9900,317.0,310.0
316,2015/12/10,313.0,308.421,308.0,1900,314.0,306.0
317,2015/12/11,313.0,306.0,305.0,4700,313.0,305.0
318,2015/12/14,305.0,307.047,307.0,4300,310.0,305.0
319,2015/12/15,294.0,297.305,306.0,19000,310.0,283.0
320,2015/12/16,301.0,297.915,293.0,11700,305.0,292.0
321,2015/12/17,311.0,308.0,305.0,6000,311.0,302.0
322,2015/12/18,296.0,302.086,318.0,5800,318.0,296.0
323,2015/12/21,304.0,309.557,313.0,9700,313.0,300.0
324,2015/12/22,297.0,300.25,304.0,4000,304.0,295.0
325,2015/12/24,293.0,293.969,296.0,9800,297.0,289.0
326,2015/12/25,282.0,285.231,288.0,12100,292.0,282.0
327,2015/12/28,297.0,291.708,282.0,2400,297.0,282.0
328,2015/12/29,298.0,296.2,298.0,2000,298.0,290.0
329,2015/12/30,297.0,297.412,298.0,3400,298.0,297.0
330,2016/01/04,292.0,293.188,297.0,6400,300.0,291.0
331,2016/01/05,302.0,302.107,304.0,5600,304.0,291.0
332,2016/01/06,287.0,287.9,303.0,22900,303.0,280.0
333,2016/01/07,282.0,282.885,281.0,12200,286.0,281.0
334,2016/01/08,285.0,282.79,281.0,1900,287.0,281.0
335,2016/01/12,281.0,278.442,280.0,4300,281.0,275.0
336,2016/01/13,287.0,282.342,281.0,3800,287.0,281.0
337,2016/01/14,286.0,286.6,287.0,500,287.0,286.0
338,2016/01/15,286.0,286.0,286.0,3000,286.0,286.0
339,2016/01/18,289.0,275.724,278.0,7600,289.0,270.0
340,2016/01/19,288.0,288.0,288.0,200,288.0,288.0
341,2016/01/20,282.0,271.376,288.0,11700,289.0,261.0
342,2016/01/21,265.0,267.308,266.0,9100,275.0,265.0
343,2016/01/22,267.0,267.5,265.0,2200,273.0,265.0
344,2016/01/25,270.0,268.966,267.0,8700,278.0,267.0
345,2016/01/26,272.0,267.441,267.0,9300,274.0,267.0
346,2016/01/27,273.0,271.376,271.0,9300,275.0,271.0
347,2016/01/28,304.0,306.702,271.0,95800,318.0,271.0
348,2016/01/29,306.0,323.961,320.0,103300,353.0,281.0
349,2016/02/01,309.0,308.092,320.0,15200,320.0,294.0
350,2016/02/02,300.0,305.107,308.0,8400,312.0,300.0
351,2016/02/03,323.0,328.429,299.0,70900,353.0,299.0
352,2016/02/04,319.0,309.893,323.0,17700,323.0,302.0
353,2016/02/05,300.0,290.77,306.0,23000,309.0,280.0
354,2016/02/08,291.0,284.52,307.0,9800,307.0,280.0
355,2016/02/09,297.0,283.021,282.0,4700,297.0,275.0
356,2016/02/10,286.0,284.589,289.0,5600,304.0,279.0
357,2016/02/12,268.0,247.346,262.0,30600,268.0,229.0
358,2016/02/15,306.0,299.314,268.0,45200,312.0,268.0
359,2016/02/16,355.0,338.994,314.0,130900,366.0,306.0
360,2016/02/17,363.0,366.779,358.0,292700,433.0,315.0
361,2016/02/18,384.0,374.219,387.0,65900,391.0,352.0
362,2016/02/19,374.0,400.682,393.0,185200,425.0,373.0
363,2016/02/22,301.0,336.272,392.0,363200,403.0,299.0
364,2016/02/23,277.0,291.076,309.0,160100,309.0,277.0
365,2016/02/24,262.0,266.714,274.0,77500,274.0,262.0
366,2016/02/25,261.0,260.208,260.0,47200,268.0,255.0
367,2016/02/26,265.0,269.706,265.0,35400,278.0,263.0
368,2016/02/29,260.0,273.009,276.0,46800,277.0,260.0
369,2016/03/01,253.0,254.412,257.0,26000,260.0,251.0
370,2016/03/02,254.0,253.137,257.0,26300,258.0,245.0
371,2016/03/03,255.0,255.475,255.0,12000,258.0,253.0
372,2016/03/04,259.0,257.258,260.0,18200,263.0,253.0
373,2016/03/07,267.0,266.411,264.0,30200,274.0,262.0
374,2016/03/08,267.0,267.238,271.0,10100,273.0,264.0
375,2016/03/09,263.0,263.589,264.0,5600,264.0,262.0
376,2016/03/10,265.0,266.067,265.0,4500,269.0,265.0
377,2016/03/11,267.0,266.196,265.0,4600,267.0,265.0
378,2016/03/14,268.0,265.268,267.0,41800,270.0,263.0
379,2016/03/15,264.0,264.182,268.0,15900,268.0,262.0
380,2016/03/16,261.0,260.646,262.0,13000,262.0,259.0
381,2016/03/17,263.0,264.157,262.0,10800,265.0,262.0
382,2016/03/18,256.0,255.236,262.0,24200,262.0,250.0
383,2016/03/22,263.0,257.215,256.0,6500,263.0,255.0
384,2016/03/23,259.0,260.42,263.0,8100,263.0,257.0
385,2016/03/24,261.0,263.813,259.0,3200,266.0,259.0
386,2016/03/25,260.0,258.674,257.0,4600,263.0,256.0
387,2016/03/28,258.0,259.308,264.0,3900,264.0,258.0
388,2016/03/29,260.0,258.636,258.0,1100,260.0,257.0
389,2016/03/30,261.0,262.333,261.0,1200,264.0,261.0
390,2016/03/31,262.0,261.478,260.0,4600,263.0,259.0
391,2016/04/01,255.0,258.47,262.0,13200,267.0,255.0
392,2016/04/04,244.0,247.19,252.0,15800,252.0,243.0
393,2016/04/05,235.0,232.317,240.0,19900,241.0,225.0
394,2016/04/06,233.0,232.7,233.0,4000,235.0,228.0
395,2016/04/07,230.0,230.2,230.0,1000,232.0,230.0
396,2016/04/08,234.0,247.573,234.0,100000,272.0,225.0
397,2016/04/11,235.0,234.857,234.0,4900,237.0,232.0
398,2016/04/12,239.0,238.348,235.0,4600,239.0,235.0
399,2016/04/13,246.0,242.469,240.0,4900,247.0,239.0
400,2016/04/14,247.0,249.321,250.0,8400,254.0,241.0
401,2016/04/15,242.0,242.968,243.0,3100,245.0,242.0
402,2016/04/18,238.0,238.22,242.0,5000,242.0,236.0
403,2016/04/19,241.0,241.895,240.0,5700,244.0,239.0
404,2016/04/20,242.0,244.36,241.0,5000,250.0,241.0
405,2016/04/21,246.0,246.273,246.0,2200,248.0,244.0
406,2016/04/22,250.0,248.99,248.0,10100,250.0,246.0
407,2016/04/25,246.0,250.963,252.0,10900,254.0,246.0
408,2016/04/26,248.0,247.782,246.0,14700,251.0,242.0
409,2016/04/27,244.0,244.984,244.0,6200,249.0,242.0
410,2016/04/28,243.0,243.727,245.0,2200,248.0,241.0
411,2016/05/02,243.0,242.75,243.0,1200,243.0,241.0
412,2016/05/06,244.0,243.5,244.0,1000,245.0,243.0
413,2016/05/09,258.0,262.136,250.0,34500,270.0,250.0
414,2016/05/10,248.0,247.525,259.0,19800,259.0,242.0
415,2016/05/11,247.0,247.253,245.0,7500,249.0,245.0
416,2016/05/12,264.0,265.365,270.0,49000,271.0,255.0
417,2016/05/13,256.0,257.048,263.0,6300,263.0,255.0
418,2016/05/16,255.0,256.733,256.0,7500,260.0,252.0
419,2016/05/17,259.0,258.4,260.0,500,260.0,255.0
420,2016/05/18,249.0,251.091,255.0,17600,261.0,244.0
421,2016/05/19,258.0,258.064,251.0,6300,264.0,250.0
422,2016/05/20,263.0,258.955,254.0,2200,263.0,254.0
423,2016/05/23,265.0,264.674,266.0,14400,268.0,258.0
424,2016/05/24,0.0,0.0,0.0,0,0.0,0.0
425,2016/05/25,260.0,264.565,265.0,2300,265.0,260.0
426,2016/05/26,260.0,261.902,264.0,5100,264.0,260.0
427,2016/05/27,259.0,261.026,261.0,15700,263.0,258.0
428,2016/05/30,262.0,258.826,258.0,6900,262.0,254.0
429,2016/05/31,263.0,262.086,262.0,3500,263.0,262.0
430,2016/06/01,260.0,261.8,263.0,1500,263.0,260.0
431,2016/06/02,258.0,258.0,258.0,2400,258.0,258.0
432,2016/06/03,257.0,260.585,259.0,4100,265.0,257.0
433,2016/06/06,256.0,256.347,257.0,4900,258.0,255.0
434,2016/06/07,260.0,271.977,274.0,12900,274.0,260.0
435,2016/06/08,259.0,261.263,261.0,3800,263.0,259.0
436,2016/06/09,264.0,262.593,261.0,9100,265.0,260.0
437,2016/06/10,259.0,261.039,262.0,5200,262.0,259.0
438,2016/06/13,270.0,263.693,259.0,29600,274.0,259.0
439,2016/06/14,256.0,259.482,265.0,8500,265.0,256.0
440,2016/06/15,259.0,256.059,257.0,3400,260.0,252.0
441,2016/06/16,243.0,250.275,260.0,10900,261.0,240.0
442,2016/06/17,240.0,239.145,237.0,6900,243.0,235.0
443,2016/06/20,250.0,245.85,244.0,2000,251.0,243.0
444,2016/06/21,250.0,253.5,257.0,200,257.0,250.0
445,2016/06/22,250.0,255.0,257.0,1400,258.0,250.0
446,2016/06/23,258.0,256.833,256.0,1200,258.0,256.0
447,2016/06/24,227.0,233.906,258.0,16000,258.0,223.0
448,2016/06/27,230.0,231.846,231.0,5200,239.0,230.0
449,2016/06/28,243.0,231.462,227.0,14500,250.0,227.0
450,2016/06/29,247.0,249.444,249.0,4500,255.0,243.0
451,2016/06/30,253.0,255.448,252.0,6700,264.0,250.0
452,2016/07/01,253.0,254.828,255.0,2900,256.0,253.0
453,2016/07/04,257.0,255.5,253.0,3400,257.0,251.0
454,2016/07/05,255.0,254.857,255.0,1400,255.0,254.0
455,2016/07/06,253.0,254.077,255.0,1300,255.0,253.0
456,2016/07/07,246.0,250.706,254.0,1700,254.0,245.0
457,2016/07/08,0.0,0.0,0.0,0,0.0,0.0
458,2016/07/11,255.0,250.95,250.0,2000,255.0,249.0
459,2016/07/12,256.0,254.885,255.0,2600,256.0,252.0
460,2016/07/13,256.0,256.769,258.0,1300,258.0,256.0
461,2016/07/14,256.0,255.067,254.0,1500,256.0,254.0
462,2016/07/15,256.0,255.955,255.0,2200,258.0,255.0
463,2016/07/19,255.0,255.286,256.0,2800,256.0,255.0
464,2016/07/20,255.0,253.143,253.0,2800,255.0,250.0
465,2016/07/21,255.0,255.353,256.0,1700,256.0,251.0
466,2016/07/22,254.0,254.182,256.0,1100,256.0,254.0
467,2016/07/25,255.0,255.0,255.0,1000,255.0,255.0
468,2016/07/26,250.0,252.021,255.0,4800,255.0,250.0
469,2016/07/27,254.0,250.875,249.0,800,254.0,249.0
470,2016/07/28,248.0,248.544,250.0,6800,251.0,248.0
471,2016/07/29,246.0,239.293,237.0,20800,253.0,237.0
472,2016/08/01,243.0,245.1,248.0,3000,248.0,243.0
473,2016/08/02,243.0,245.1,245.0,1000,248.0,243.0
474,2016/08/03,244.0,242.851,243.0,18100,244.0,241.0
475,2016/08/04,249.0,248.075,247.0,18600,254.0,244.0
476,2016/08/05,241.0,240.224,246.0,6700,246.0,236.0
477,2016/08/08,243.0,240.571,247.0,2100,247.0,237.0
478,2016/08/09,0.0,0.0,0.0,0,0.0,0.0
479,2016/08/10,244.0,244.833,242.0,1200,246.0,242.0
480,2016/08/12,244.0,240.721,239.0,6100,245.0,239.0
481,2016/08/15,242.0,241.937,240.0,17400,246.0,238.0
482,2016/08/16,242.0,242.053,240.0,9400,246.0,239.0
483,2016/08/17,243.0,240.467,245.0,9000,245.0,240.0
484,2016/08/18,242.0,239.583,240.0,1200,242.0,239.0
485,2016/08/19,240.0,239.697,242.0,10900,244.0,239.0
486,2016/08/22,237.0,235.47,235.0,8300,239.0,235.0
487,2016/08/23,237.0,236.25,236.0,400,237.0,236.0
488,2016/08/24,237.0,237.12,237.0,2500,238.0,237.0
489,2016/08/25,239.0,238.222,235.0,5400,242.0,235.0
490,2016/08/26,240.0,239.464,239.0,2800,241.0,237.0
491,2016/08/29,238.0,239.407,240.0,9100,244.0,234.0
492,2016/08/30,244.0,244.0,244.0,200,244.0,244.0
493,2016/08/31,245.0,245.0,245.0,100,245.0,245.0
494,2016/09/01,245.0,243.105,245.0,1900,245.0,239.0
495,2016/09/02,241.0,240.875,239.0,3200,241.0,239.0
496,2016/09/05,240.0,241.0,242.0,200,242.0,240.0
497,2016/09/06,236.0,236.143,244.0,8400,244.0,233.0
498,2016/09/07,242.0,241.727,240.0,1100,242.0,240.0
499,2016/09/08,240.0,240.7,244.0,2000,244.0,239.0
500,2016/09/09,238.0,237.934,236.0,7600,241.0,236.0
501,2016/09/12,241.0,241.618,237.0,5500,245.0,237.0
502,2016/09/13,241.0,241.0,241.0,4300,241.0,241.0
503,2016/09/14,239.0,240.0,238.0,8200,243.0,238.0
504,2016/09/15,238.0,237.595,238.0,4200,238.0,237.0
505,2016/09/16,242.0,242.041,238.0,9800,243.0,238.0
506,2016/09/20,242.0,242.375,243.0,800,243.0,242.0
507,2016/09/21,242.0,240.976,240.0,4100,242.0,240.0
508,2016/09/23,242.0,241.929,241.0,4200,242.0,240.0
509,2016/09/26,243.0,242.393,242.0,17300,245.0,241.0
510,2016/09/27,246.0,245.64,243.0,2500,246.0,243.0
511,2016/09/28,247.0,245.764,244.0,7200,254.0,237.0
512,2016/09/29,252.0,249.45,242.0,6000,254.0,242.0
513,2016/09/30,247.0,249.829,250.0,4100,251.0,247.0
514,2016/10/03,253.0,250.737,250.0,3800,253.0,247.0
515,2016/10/04,251.0,253.645,254.0,3100,255.0,251.0
516,2016/10/05,253.0,251.889,251.0,3600,255.0,248.0
517,2016/10/06,252.0,250.636,250.0,1100,252.0,250.0
518,2016/10/07,249.0,247.879,250.0,6600,250.0,246.0
519,2016/10/11,250.0,247.932,246.0,7300,251.0,246.0
520,2016/10/12,249.0,249.0,250.0,4200,250.0,248.0
521,2016/10/13,251.0,252.488,251.0,4300,258.0,250.0
522,2016/10/14,272.0,277.967,251.0,207500,307.0,251.0
523,2016/10/17,276.0,287.223,280.0,88700,307.0,273.0
524,2016/10/18,266.0,269.904,273.0,13600,276.0,265.0
525,2016/10/19,266.0,265.078,264.0,28300,269.0,260.0
526,2016/10/20,269.0,268.407,267.0,8100,272.0,266.0
527,2016/10/21,270.0,269.709,267.0,8600,274.0,267.0
528,2016/10/24,287.0,276.707,270.0,20500,290.0,270.0
529,2016/10/25,282.0,282.126,284.0,15100,286.0,277.0
530,2016/10/26,279.0,278.203,282.0,7400,282.0,277.0
531,2016/10/27,277.0,279.182,282.0,3300,282.0,277.0
532,2016/10/28,278.0,274.961,275.0,7600,281.0,272.0
533,2016/10/31,280.0,279.769,281.0,1300,282.0,277.0
534,2016/11/01,281.0,280.696,281.0,11500,285.0,274.0
535,2016/11/02,276.0,273.615,277.0,9600,282.0,270.0
536,2016/11/04,269.0,269.843,278.0,5100,278.0,267.0
537,2016/11/07,270.0,266.214,264.0,2800,270.0,264.0
538,2016/11/08,259.0,267.599,270.0,29700,282.0,259.0
539,2016/11/09,249.0,252.136,262.0,8800,263.0,248.0
540,2016/11/10,262.0,274.911,254.0,10100,284.0,254.0
541,2016/11/11,272.0,270.05,270.0,4000,276.0,264.0
542,2016/11/14,273.0,265.942,264.0,13900,278.0,264.0
543,2016/11/15,272.0,270.41,274.0,8300,275.0,265.0
544,2016/11/16,274.0,271.974,278.0,3800,278.0,269.0
545,2016/11/17,276.0,274.306,272.0,3600,277.0,269.0
546,2016/11/18,277.0,276.077,276.0,1300,277.0,276.0
547,2016/11/21,271.0,271.508,272.0,19500,277.0,265.0
548,2016/11/22,273.0,271.431,269.0,5100,274.0,268.0
549,2016/11/24,276.0,272.802,274.0,25300,276.0,270.0
550,2016/11/25,280.0,280.644,276.0,11800,285.0,276.0
551,2016/11/28,288.0,283.249,284.0,28100,290.0,276.0
552,2016/11/29,303.0,302.531,288.0,55800,314.0,284.0
553,2016/11/30,304.0,298.85,303.0,6000,305.0,294.0
554,2016/12/01,292.0,295.355,305.0,21700,305.0,290.0
555,2016/12/02,293.0,294.286,295.0,2800,299.0,293.0
556,2016/12/05,285.0,291.479,285.0,7100,298.0,285.0
557,2016/12/06,290.0,288.429,286.0,700,291.0,286.0
558,2016/12/07,294.0,292.267,291.0,6000,297.0,289.0
559,2016/12/08,294.0,295.519,299.0,2700,299.0,294.0
560,2016/12/09,297.0,293.721,295.0,6800,297.0,292.0
561,2016/12/12,295.0,296.032,298.0,9400,298.0,291.0
562,2016/12/13,299.0,297.851,295.0,8700,299.0,295.0
563,2016/12/14,302.0,298.092,293.0,11900,302.0,293.0
564,2016/12/15,292.0,295.628,301.0,12100,302.0,290.0
565,2016/12/16,306.0,299.23,295.0,27000,306.0,291.0
566,2016/12/19,327.0,320.786,322.0,79800,327.0,313.0
567,2016/12/20,349.0,340.378,330.0,52400,358.0,330.0
568,2016/12/21,359.0,354.556,355.0,30600,359.0,349.0
569,2016/12/22,361.0,382.87,351.0,143200,407.0,351.0
570,2016/12/26,439.0,418.349,369.0,630200,441.0,369.0
571,2016/12/27,375.0,398.631,422.0,320100,437.0,361.0
572,2016/12/28,378.0,374.561,370.0,66700,384.0,365.0
573,2016/12/29,360.0,363.531,375.0,36000,376.0,356.0
574,2016/12/30,368.0,357.446,356.0,32300,368.0,347.0
575,2017/01/04,409.0,399.512,387.0,147900,414.0,384.0
576,2017/01/05,404.0,408.288,410.0,34700,415.0,402.0
577,2017/01/06,387.0,393.804,402.0,18400,406.0,385.0
578,2017/01/10,381.0,381.358,382.0,13400,386.0,378.0
579,2017/01/11,386.0,383.899,380.0,23800,395.0,373.0
580,2017/01/12,376.0,383.885,384.0,23500,393.0,376.0
581,2017/01/13,382.0,378.605,379.0,7600,382.0,373.0
582,2017/01/16,384.0,383.24,381.0,9600,388.0,379.0
583,2017/01/17,386.0,380.806,377.0,19100,392.0,374.0
584,2017/01/18,408.0,396.056,386.0,19700,408.0,385.0
585,2017/01/19,401.0,405.651,414.0,23800,414.0,398.0
586,2017/01/20,407.0,411.432,402.0,31700,420.0,402.0
587,2017/01/23,486.0,458.114,415.0,275900,486.0,415.0
588,2017/01/24,460.0,468.02,490.0,165800,491.0,447.0
589,2017/01/25,469.0,466.783,465.0,30000,475.0,461.0
590,2017/01/26,455.0,458.149,470.0,31600,470.0,453.0
591,2017/01/27,473.0,463.578,457.0,33900,475.0,457.0
592,2017/01/30,472.0,478.742,482.0,35700,489.0,471.0
593,2017/01/31,467.0,467.526,468.0,17300,474.0,464.0
594,2017/02/01,483.0,475.727,471.0,37300,483.0,469.0
595,2017/02/02,460.0,475.598,484.0,57000,488.0,452.0
596,2017/02/03,430.0,492.093,492.0,689100,540.0,430.0
597,2017/02/06,473.0,451.386,445.0,118400,476.0,431.0
598,2017/02/07,466.0,460.039,468.0,38900,468.0,447.0
599,2017/02/08,458.0,459.718,465.0,17000,465.0,455.0
600,2017/02/09,461.0,449.641,457.0,40400,463.0,434.0
601,2017/02/10,459.0,460.209,460.0,31600,465.0,454.0
602,2017/02/13,476.0,476.679,468.0,50700,487.0,463.0
603,2017/02/14,490.0,495.05,486.0,59900,506.0,486.0
604,2017/02/15,503.0,499.702,502.0,36600,505.0,491.0
605,2017/02/16,490.0,492.096,493.0,43600,503.0,485.0
606,2017/02/17,487.0,487.947,490.0,11400,494.0,483.0
607,2017/02/20,501.0,496.023,487.0,17200,501.0,487.0
608,2017/02/21,501.0,501.971,503.0,35000,508.0,498.0
609,2017/02/22,492.0,495.33,503.0,18800,503.0,489.0
610,2017/02/23,481.0,482.442,490.0,24900,490.0,477.0
611,2017/02/24,478.0,480.381,481.0,12600,489.0,474.0
612,2017/02/27,459.0,450.117,483.0,140700,483.0,425.0
613,2017/02/28,453.0,458.234,454.0,14100,466.0,453.0
614,2017/03/01,457.0,445.885,455.0,28800,460.0,437.0
615,2017/03/02,475.0,474.323,464.0,29400,485.0,464.0
616,2017/03/03,499.0,505.639,486.0,130700,530.0,486.0
617,2017/03/06,497.0,500.056,505.0,33700,514.0,494.0
618,2017/03/07,483.0,497.404,509.0,40100,510.0,483.0
619,2017/03/08,487.0,482.447,488.0,11400,489.0,479.0
620,2017/03/09,485.0,486.851,490.0,10700,494.0,484.0
621,2017/03/10,474.0,472.208,491.0,29400,491.0,464.0
622,2017/03/13,462.0,461.88,465.0,29200,477.0,455.0
623,2017/03/14,458.0,457.958,462.0,14200,463.0,453.0
624,2017/03/15,448.0,449.06,456.0,26600,459.0,438.0
625,2017/03/16,468.0,460.325,448.0,15400,468.0,448.0
626,2017/03/17,465.0,469.683,468.0,22700,480.0,458.0
627,2017/03/21,479.0,466.062,457.0,30900,479.0,456.0
628,2017/03/22,458.0,466.981,463.0,20800,478.0,458.0
629,2017/03/23,472.0,462.161,456.0,21100,472.0,456.0
630,2017/03/24,496.0,492.649,477.0,84200,519.0,472.0
631,2017/03/27,489.0,491.473,490.0,43800,500.0,484.0
632,2017/03/28,491.0,493.583,493.0,12000,497.0,490.0
633,2017/03/29,498.0,494.183,496.0,13100,498.0,489.0
634,2017/03/30,497.0,496.95,501.0,14100,501.0,494.0
635,2017/03/31,484.0,491.382,500.0,8900,500.0,482.0
636,2017/04/03,470.0,478.429,492.0,21200,492.0,470.0
637,2017/04/04,450.0,460.514,471.0,49800,478.0,443.0
638,2017/04/05,459.0,456.494,454.0,25300,469.0,452.0
639,2017/04/06,453.0,449.638,459.0,66600,467.0,438.0
640,2017/04/07,455.0,451.399,451.0,24800,460.0,441.0
641,2017/04/10,453.0,454.301,453.0,19600,459.0,448.0
642,2017/04/11,428.0,431.849,442.0,74100,446.0,419.0
643,2017/04/12,413.0,409.222,412.0,59000,422.0,395.0
644,2017/04/13,427.0,417.352,402.0,20200,429.0,401.0
645,2017/04/14,439.0,438.392,430.0,25500,446.0,429.0
646,2017/04/17,485.0,464.687,440.0,37700,485.0,435.0
647,2017/04/18,489.0,490.309,491.0,27500,499.0,481.0
648,2017/04/19,569.0,553.447,492.0,368200,569.0,488.0
649,2017/04/20,669.0,649.494,628.0,475100,669.0,620.0
650,2017/04/21,650.0,660.174,689.0,576600,730.0,601.0
651,2017/04/24,695.0,724.08,680.0,486600,750.0,650.0
652,2017/04/25,595.0,613.924,645.0,671000,657.0,595.0
653,2017/04/26,590.0,613.789,635.0,309000,638.0,577.0
654,2017/04/27,595.0,579.975,587.0,143600,595.0,571.0
655,2017/04/28,588.0,590.012,600.0,85900,606.0,578.0
656,2017/05/01,561.0,573.266,588.0,87300,588.0,555.0
657,2017/05/02,595.0,600.264,571.0,317600,624.0,568.0
658,2017/05/08,588.0,591.828,592.0,76000,608.0,581.0
659,2017/05/09,590.0,608.18,602.0,136200,628.0,589.0
660,2017/05/10,530.0,530.728,532.0,225800,550.0,515.0
661,2017/05/11,513.0,510.129,520.0,123400,524.0,492.0
662,2017/05/12,504.0,509.877,506.0,51000,516.0,504.0
663,2017/05/15,503.0,500.102,499.0,30500,508.0,495.0
664,2017/05/16,504.0,504.277,501.0,17700,510.0,501.0
665,2017/05/17,504.0,502.693,500.0,20200,506.0,500.0
666,2017/05/18,496.0,496.886,498.0,49100,501.0,493.0
667,2017/05/19,500.0,499.021,496.0,18900,504.0,496.0
668,2017/05/22,510.0,506.626,502.0,38200,516.0,498.0
669,2017/05/23,520.0,519.898,511.0,38400,526.0,510.0
670,2017/05/24,525.0,528.942,526.0,46400,538.0,521.0
671,2017/05/25,510.0,514.567,532.0,54000,532.0,501.0
672,2017/05/26,501.0,505.735,507.0,44900,510.0,500.0
673,2017/05/29,496.0,498.656,498.0,28200,503.0,496.0
674,2017/05/30,491.0,492.44,498.0,32500,499.0,490.0
675,2017/05/31,498.0,492.399,489.0,23300,498.0,487.0
676,2017/06/01,496.0,499.097,506.0,24700,507.0,495.0
677,2017/06/02,499.0,499.044,496.0,13700,501.0,496.0
678,2017/06/05,522.0,511.892,500.0,59300,522.0,499.0
679,2017/06/06,501.0,509.672,520.0,37500,520.0,500.0
680,2017/06/07,506.0,505.27,501.0,3700,509.0,501.0
681,2017/06/08,512.0,526.876,522.0,86400,539.0,505.0
682,2017/06/09,509.0,510.968,516.0,15400,516.0,505.0
683,2017/06/12,529.0,526.505,513.0,29300,535.0,512.0
684,2017/06/13,546.0,541.85,535.0,82900,549.0,530.0
685,2017/06/14,526.0,535.544,545.0,61800,547.0,520.0
686,2017/06/15,504.0,512.462,532.0,55900,533.0,502.0
687,2017/06/16,510.0,509.715,503.0,16500,522.0,503.0
688,2017/06/19,508.0,507.974,513.0,31200,514.0,505.0
689,2017/06/20,503.0,503.38,507.0,22400,509.0,500.0
690,2017/06/21,509.0,509.635,503.0,15900,518.0,500.0
691,2017/06/22,506.0,509.611,511.0,16700,518.0,502.0
692,2017/06/23,504.0,505.363,506.0,14600,514.0,501.0
693,2017/06/26,503.0,501.465,498.0,12900,505.0,498.0
694,2017/06/27,509.0,510.154,511.0,16200,512.0,507.0
695,2017/06/28,503.0,499.816,511.0,19000,511.0,496.0
696,2017/06/29,504.0,503.256,504.0,8200,506.0,500.0
697,2017/06/30,501.0,501.304,497.0,5600,508.0,497.0
698,2017/07/03,508.0,507.234,502.0,7700,509.0,502.0
699,2017/07/04,503.0,509.027,507.0,15000,516.0,503.0
700,2017/07/05,499.0,500.928,505.0,18000,508.0,498.0
701,2017/07/06,507.0,502.148,501.0,27700,507.0,499.0
702,2017/07/07,504.0,506.683,512.0,10100,512.0,501.0
703,2017/07/10,511.0,508.5,502.0,19800,511.0,502.0
704,2017/07/11,535.0,527.033,511.0,49200,537.0,511.0
705,2017/07/12,555.0,549.084,534.0,110300,572.0,530.0
706,2017/07/13,516.0,541.668,565.0,96900,573.0,514.0
707,2017/07/14,507.0,512.944,520.0,23400,520.0,507.0
708,2017/07/18,518.0,513.099,511.0,13200,521.0,506.0
709,2017/07/19,531.0,525.456,521.0,16900,533.0,513.0
710,2017/07/20,529.0,524.093,533.0,12900,533.0,518.0
711,2017/07/21,530.0,526.274,529.0,7300,531.0,523.0
712,2017/07/24,515.0,523.389,520.0,3600,529.0,515.0
713,2017/07/25,540.0,536.894,525.0,37700,544.0,525.0
714,2017/07/26,541.0,542.766,540.0,21800,549.0,535.0
715,2017/07/27,538.0,531.93,540.0,15600,546.0,520.0
716,2017/07/28,539.0,544.269,541.0,64600,563.0,532.0
717,2017/07/31,534.0,526.518,534.0,22800,545.0,520.0
718,2017/08/01,515.0,513.853,540.0,40100,540.0,500.0
719,2017/08/02,522.0,521.027,516.0,18500,527.0,516.0
720,2017/08/03,522.0,520.094,516.0,5300,525.0,516.0
721,2017/08/04,520.0,518.279,522.0,7900,522.0,514.0
722,2017/08/07,519.0,524.563,520.0,19000,530.0,519.0
723,2017/08/08,541.0,534.403,532.0,48700,541.0,525.0
724,2017/08/09,485.0,485.717,489.0,97400,493.0,475.0
725,2017/08/10,464.0,471.142,486.0,55100,486.0,456.0
726,2017/08/14,454.0,449.922,453.0,23000,464.0,443.0
727,2017/08/15,451.0,455.543,456.0,9400,459.0,451.0
728,2017/08/16,457.0,455.648,452.0,12800,462.0,452.0
729,2017/08/17,469.0,468.958,465.0,11900,471.0,465.0
730,2017/08/18,464.0,463.289,465.0,9000,468.0,458.0
731,2017/08/21,459.0,460.842,464.0,8200,465.0,458.0
732,2017/08/22,464.0,463.583,466.0,7200,468.0,460.0
733,2017/08/23,470.0,470.241,468.0,5800,475.0,468.0
734,2017/08/24,464.0,465.321,463.0,7800,471.0,463.0
735,2017/08/25,460.0,465.447,463.0,7600,471.0,460.0
736,2017/08/28,462.0,458.686,461.0,15600,465.0,452.0
737,2017/08/29,467.0,462.871,459.0,9300,469.0,458.0
738,2017/08/30,476.0,472.723,471.0,11900,480.0,466.0
739,2017/08/31,485.0,481.904,473.0,8300,488.0,473.0
740,2017/09/01,486.0,486.025,485.0,24400,492.0,481.0
741,2017/09/04,479.0,481.023,489.0,17200,489.0,475.0
742,2017/09/05,465.0,466.758,485.0,16500,485.0,454.0
743,2017/09/06,450.0,446.928,450.0,27800,454.0,441.0
744,2017/09/07,458.0,456.846,451.0,6500,462.0,451.0
745,2017/09/08,449.0,449.877,454.0,13800,459.0,442.0
746,2017/09/11,462.0,457.059,457.0,3400,462.0,453.0
747,2017/09/12,474.0,468.833,465.0,3600,474.0,465.0
748,2017/09/13,477.0,476.88,475.0,8300,481.0,474.0
749,2017/09/14,468.0,470.034,476.0,5900,476.0,467.0
750,2017/09/15,473.0,469.525,462.0,5900,481.0,462.0
751,2017/09/19,467.0,464.828,468.0,8700,470.0,461.0
752,2017/09/20,460.0,462.934,463.0,10600,472.0,460.0
753,2017/09/21,459.0,459.171,463.0,7600,465.0,455.0
754,2017/09/22,457.0,459.546,459.0,4400,462.0,455.0
755,2017/09/25,461.0,461.548,462.0,4200,464.0,459.0
756,2017/09/26,470.0,463.081,461.0,8700,470.0,461.0
757,2017/09/27,467.0,467.282,470.0,3900,470.0,462.0
758,2017/09/28,456.0,460.194,466.0,7200,469.0,455.0
759,2017/09/29,460.0,458.718,456.0,3900,461.0,455.0
760,2017/10/02,467.0,466.174,467.0,4600,469.0,460.0
761,2017/10/03,466.0,469.03,472.0,27100,472.0,453.0
762,2017/10/04,459.0,456.868,465.0,6800,465.0,455.0
763,2017/10/05,455.0,455.0,456.0,6700,456.0,454.0
764,2017/10/06,441.0,447.101,456.0,19900,457.0,441.0
765,2017/10/10,445.0,444.4,442.0,19000,449.0,442.0
766,2017/10/11,453.0,447.349,446.0,6300,453.0,443.0
767,2017/10/12,456.0,454.682,452.0,4400,458.0,452.0
768,2017/10/13,449.0,451.333,458.0,11400,458.0,448.0
769,2017/10/16,450.0,453.252,454.0,11500,454.0,450.0
770,2017/10/17,451.0,449.71,450.0,10700,452.0,448.0
771,2017/10/18,451.0,451.239,450.0,4600,455.0,450.0
772,2017/10/19,443.0,445.587,448.0,12600,451.0,442.0
773,2017/10/20,443.0,439.962,440.0,10500,444.0,438.0
774,2017/10/23,440.0,439.483,442.0,6000,442.0,438.0
775,2017/10/24,441.0,441.592,443.0,4900,443.0,439.0
776,2017/10/25,442.0,444.009,440.0,11300,449.0,440.0
777,2017/10/26,440.0,440.22,440.0,4100,443.0,440.0
778,2017/10/27,445.0,442.583,440.0,6000,447.0,440.0
779,2017/10/30,458.0,452.797,447.0,11800,458.0,447.0
780,2017/10/31,459.0,459.429,460.0,2100,460.0,457.0
781,2017/11/01,479.0,469.202,459.0,25300,480.0,459.0
782,2017/11/02,477.0,475.777,480.0,33700,487.0,460.0
783,2017/11/06,557.0,557.0,557.0,56200,557.0,557.0
784,2017/11/07,657.0,648.155,638.0,610300,657.0,633.0
785,2017/11/08,630.0,641.168,662.0,567900,683.0,611.0
786,2017/11/09,660.0,682.397,670.0,695000,730.0,618.0
787,2017/11/10,625.0,624.315,630.0,96700,632.0,614.0
788,2017/11/13,571.0,585.326,612.0,180200,618.0,570.0
789,2017/11/14,580.0,603.257,619.0,108000,619.0,575.0
790,2017/11/15,557.0,567.215,579.0,93400,592.0,557.0
791,2017/11/16,589.0,578.249,568.0,50300,589.0,563.0
792,2017/11/17,578.0,593.891,601.0,34800,602.0,578.0
793,2017/11/20,592.0,584.12,588.0,26700,592.0,578.0
794,2017/11/21,603.0,598.391,599.0,31500,606.0,591.0
795,2017/11/22,636.0,635.041,604.0,145300,678.0,604.0
796,2017/11/24,635.0,634.04,646.0,47500,646.0,622.0
797,2017/11/27,613.0,615.432,627.0,57000,636.0,602.0
798,2017/11/28,619.0,612.13,613.0,20700,622.0,606.0
799,2017/11/29,719.0,699.182,642.0,442500,719.0,634.0
800,2017/11/30,708.0,692.043,719.0,468600,740.0,645.0
801,2017/12/01,729.0,772.572,737.0,400700,835.0,689.0
802,2017/12/04,683.0,702.474,716.0,100200,724.0,683.0
803,2017/12/05,697.0,713.421,676.0,253800,766.0,664.0
804,2017/12/06,718.0,704.061,690.0,132100,737.0,677.0
805,2017/12/07,732.0,723.319,722.0,95700,744.0,707.0
806,2017/12/08,810.0,764.286,744.0,266100,810.0,711.0
807,2017/12/11,840.0,804.629,795.0,248400,845.0,758.0
808,2017/12/12,849.0,850.13,837.0,240700,895.0,801.0
809,2017/12/13,803.0,819.053,834.0,89000,847.0,803.0
810,2017/12/14,770.0,785.343,817.0,96300,817.0,765.0
811,2017/12/15,791.0,815.042,778.0,207400,875.0,762.0
812,2017/12/18,758.0,768.871,776.0,80300,804.0,754.0
813,2017/12/19,784.0,769.234,760.0,30800,785.0,753.0
814,2017/12/20,802.0,805.654,789.0,74500,825.0,784.0
815,2017/12/21,870.0,906.124,805.0,823200,952.0,791.0
816,2017/12/22,841.0,845.243,870.0,254100,885.0,820.0
817,2017/12/25,836.0,849.027,871.0,92400,876.0,826.0
818,2017/12/26,918.0,888.436,845.0,326500,922.0,817.0
819,2017/12/27,890.0,906.089,915.0,178600,936.0,885.0
820,2017/12/28,884.0,887.65,890.0,60300,904.0,875.0
821,2017/12/29,877.0,897.63,882.0,136600,923.0,877.0
822,2018/01/04,908.0,919.001,880.0,157000,966.0,880.0
823,2018/01/05,901.0,902.451,903.0,71600,913.0,891.0
824,2018/01/09,967.0,951.573,911.0,161800,989.0,900.0
825,2018/01/10,1023.0,1032.184,1006.0,270800,1069.0,993.0
826,2018/01/11,1101.0,1066.776,1001.0,245000,1117.0,995.0
827,2018/01/12,1000.0,1037.677,1080.0,267100,1099.0,1000.0
828,2018/01/15,1005.0,1016.513,1030.0,108100,1041.0,988.0
829,2018/01/16,1103.0,1074.478,1010.0,202200,1145.0,1010.0
830,2018/01/17,1024.0,1048.719,1070.0,122400,1084.0,1021.0
831,2018/01/18,1036.0,1045.511,1031.0,100500,1088.0,1014.0
832,2018/01/19,1055.0,1049.827,1049.0,44500,1072.0,1030.0
833,2018/01/22,1033.0,1031.201,1055.0,128200,1080.0,1005.0
834,2018/01/23,1013.0,1002.561,1035.0,153900,1037.0,983.0
835,2018/01/24,999.0,1002.664,1003.0,88400,1028.0,988.0
836,2018/01/25,987.0,1007.099,990.0,86200,1027.0,981.0
837,2018/01/26,1010.0,988.722,992.0,98800,1017.0,965.0
838,2018/01/29,989.0,990.13,1018.0,92000,1024.0,966.0
839,2018/01/30,920.0,935.15,980.0,142400,985.0,895.0
840,2018/01/31,927.0,927.701,900.0,82300,955.0,896.0
841,2018/02/01,956.0,942.352,928.0,32100,958.0,928.0
842,2018/02/02,911.0,930.19,950.0,106200,961.0,905.0
843,2018/02/05,792.0,790.972,800.0,350800,812.0,771.0
844,2018/02/06,723.0,731.62,762.0,226600,766.0,672.0
845,2018/02/07,723.0,758.821,808.0,179100,808.0,714.0
846,2018/02/08,743.0,736.654,731.0,59500,757.0,723.0
847,2018/02/09,721.0,703.579,688.0,67700,739.0,687.0
848,2018/02/13,697.0,713.887,742.0,51300,743.0,685.0
849,2018/02/14,680.0,682.526,697.0,58200,711.0,656.0
850,2018/02/15,720.0,713.23,710.0,53000,726.0,700.0
851,2018/02/16,716.0,711.381,705.0,58000,719.0,705.0
852,2018/02/19,768.0,744.059,718.0,71400,768.0,718.0
853,2018/02/20,742.0,742.334,740.0,76300,752.0,732.0
854,2018/02/21,774.0,760.029,737.0,62100,779.0,737.0
855,2018/02/22,745.0,751.813,770.0,51900,770.0,737.0
856,2018/02/23,747.0,740.235,742.0,30700,752.0,728.0
857,2018/02/26,773.0,762.451,758.0,64100,778.0,741.0
858,2018/02/27,764.0,772.393,772.0,36400,782.0,763.0
859,2018/02/28,770.0,766.384,760.0,24200,779.0,756.0
860,2018/03/01,769.0,763.786,766.0,22000,771.0,758.0
861,2018/03/02,756.0,749.507,753.0,36700,758.0,737.0
862,2018/03/05,714.0,726.095,746.0,42100,751.0,714.0
863,2018/03/06,742.0,740.111,725.0,20800,751.0,725.0
864,2018/03/07,731.0,727.822,734.0,30300,740.0,719.0
865,2018/03/08,733.0,737.083,734.0,9600,744.0,730.0
866,2018/03/09,722.0,728.076,733.0,11800,739.0,721.0
867,2018/03/12,745.0,745.088,733.0,31900,759.0,733.0
868,2018/03/13,782.0,765.12,740.0,36700,786.0,733.0
869,2018/03/14,769.0,770.259,767.0,18900,789.0,763.0
870,2018/03/15,775.0,760.216,759.0,31900,775.0,750.0
871,2018/03/16,773.0,772.122,775.0,24500,785.0,764.0
872,2018/03/19,750.0,757.108,767.0,22200,772.0,746.0
873,2018/03/20,734.0,733.747,735.0,28400,752.0,721.0
874,2018/03/22,735.0,731.556,734.0,16200,743.0,727.0
875,2018/03/23,695.0,701.325,705.0,49000,722.0,687.0
876,2018/03/26,695.0,680.912,685.0,38500,704.0,668.0
877,2018/03/27,719.0,714.287,720.0,10800,720.0,707.0
878,2018/03/28,709.0,705.458,699.0,12000,714.0,696.0
879,2018/03/29,701.0,702.5,709.0,14400,709.0,696.0
880,2018/03/30,743.0,722.073,710.0,47800,744.0,707.0
881,2018/04/02,733.0,742.672,747.0,24700,748.0,730.0
882,2018/04/03,722.0,722.908,720.0,11900,730.0,713.0
883,2018/04/04,702.0,710.512,733.0,24400,733.0,691.0
884,2018/04/05,700.0,700.674,700.0,14100,708.0,696.0
885,2018/04/06,681.0,691.591,700.0,27900,704.0,681.0
886,2018/04/09,692.0,680.017,671.0,23900,695.0,670.0
887,2018/04/10,686.0,681.207,678.0,25600,690.0,676.0
888,2018/04/11,680.0,682.272,693.0,16900,693.0,678.0
889,2018/04/12,735.0,734.404,676.0,162700,763.0,675.0
890,2018/04/13,728.0,729.553,735.0,20800,735.0,723.0
891,2018/04/16,699.0,698.226,713.0,84400,730.0,675.0
892,2018/04/17,700.0,693.475,689.0,39200,714.0,677.0
893,2018/04/18,722.0,727.821,702.0,59800,743.0,702.0
894,2018/04/19,768.0,753.177,729.0,42300,776.0,726.0
895,2018/04/20,771.0,769.991,773.0,67300,792.0,741.0
896,2018/04/23,810.0,796.779,775.0,109400,828.0,768.0
897,2018/04/24,828.0,817.17,795.0,110200,845.0,781.0
898,2018/04/25,820.0,811.064,801.0,60800,824.0,797.0
899,2018/04/26,816.0,817.45,822.0,44700,836.0,804.0
900,2018/04/27,822.0,808.964,820.0,56000,824.0,794.0
901,2018/05/01,742.0,759.194,800.0,109500,807.0,730.0
902,2018/05/02,724.0,720.962,719.0,44800,729.0,712.0
903,2018/05/07,734.0,729.652,735.0,45700,739.0,720.0
904,2018/05/08,716.0,723.514,737.0,54900,737.0,710.0
905,2018/05/09,709.0,712.865,701.0,152400,738.0,680.0
906,2018/05/10,699.0,706.957,716.0,70000,723.0,697.0
907,2018/05/11,698.0,695.749,703.0,59400,705.0,687.0
908,2018/05/14,686.0,692.417,697.0,60200,698.0,684.0
909,2018/05/15,681.0,686.203,690.0,39500,694.0,681.0
910,2018/05/16,676.0,677.122,682.0,27900,682.0,673.0
911,2018/05/17,668.0,669.323,673.0,55200,676.0,664.0
912,2018/05/18,664.0,661.858,668.0,30300,668.0,657.0
913,2018/05/21,682.0,674.143,664.0,52500,690.0,664.0
914,2018/05/22,671.0,672.981,680.0,21000,680.0,666.0
915,2018/05/23,662.0,663.851,672.0,29500,674.0,658.0
916,2018/05/24,653.0,652.728,664.0,48600,664.0,647.0
917,2018/05/25,638.0,642.906,648.0,32900,652.0,637.0
918,2018/05/28,631.0,633.534,636.0,17800,641.0,628.0
919,2018/05/29,610.0,615.09,632.0,48700,633.0,606.0
920,2018/05/30,630.0,614.586,595.0,40300,635.0,594.0
921,2018/05/31,620.0,626.645,635.0,34600,638.0,616.0
922,2018/06/01,609.0,614.365,617.0,11500,626.0,609.0
923,2018/06/04,613.0,603.81,613.0,48900,621.0,590.0
924,2018/06/05,610.0,609.181,609.0,28800,621.0,596.0
925,2018/06/06,603.0,603.877,607.0,14600,608.0,601.0
926,2018/06/07,604.0,606.126,602.0,11100,613.0,602.0
927,2018/06/08,606.0,606.178,607.0,11800,611.0,602.0
928,2018/06/11,625.0,625.188,611.0,48400,635.0,607.0
929,2018/06/12,637.0,629.633,622.0,49300,639.0,614.0
930,2018/06/13,642.0,638.938,634.0,64000,646.0,633.0
931,2018/06/14,613.0,623.886,638.0,55000,643.0,610.0
932,2018/06/15,609.0,610.667,617.0,18900,618.0,606.0
933,2018/06/18,580.0,587.137,604.0,66300,606.0,576.0
934,2018/06/19,555.0,568.059,575.0,51300,581.0,555.0
935,2018/06/20,542.0,546.542,556.0,53900,564.0,538.0
936,2018/06/21,559.0,554.223,552.0,30500,564.0,550.0
937,2018/06/22,552.0,550.836,557.0,23100,557.0,543.0
938,2018/06/25,549.0,552.925,552.0,29500,561.0,547.0
939,2018/06/26,528.0,529.856,536.0,39700,542.0,525.0
940,2018/06/27,531.0,526.228,523.0,24600,538.0,517.0
941,2018/06/28,526.0,521.421,527.0,35200,530.0,514.0
942,2018/06/29,547.0,540.025,526.0,32000,548.0,526.0
943,2018/07/02,540.0,545.863,547.0,40900,555.0,536.0
944,2018/07/03,526.0,525.242,530.0,23600,538.0,518.0
945,2018/07/04,508.0,514.206,526.0,23800,531.0,507.0
946,2018/07/05,489.0,496.564,506.0,30500,522.0,487.0
947,2018/07/06,506.0,506.792,494.0,27900,515.0,494.0
948,2018/07/09,518.0,510.426,506.0,19700,518.0,504.0
949,2018/07/10,522.0,523.104,527.0,13500,528.0,519.0
950,2018/07/11,521.0,514.381,512.0,8400,522.0,511.0
951,2018/07/12,513.0,513.12,512.0,20000,518.0,511.0
952,2018/07/13,513.0,515.507,513.0,14600,520.0,511.0
953,2018/07/17,503.0,506.523,510.0,11100,512.0,503.0
954,2018/07/18,508.0,506.253,507.0,7900,510.0,503.0
955,2018/07/19,506.0,504.759,505.0,11200,509.0,502.0
956,2018/07/20,505.0,508.345,504.0,17100,515.0,504.0
957,2018/07/23,501.0,503.042,505.0,9600,508.0,501.0
958,2018/07/24,503.0,502.698,501.0,4300,505.0,501.0
959,2018/07/25,503.0,500.93,502.0,27100,506.0,495.0
960,2018/07/26,552.0,536.911,503.0,103100,563.0,503.0
961,2018/07/27,544.0,542.425,560.0,61900,564.0,521.0
962,2018/07/30,551.0,545.216,545.0,24500,555.0,537.0
963,2018/07/31,527.0,529.324,546.0,28700,546.0,521.0
964,2018/08/01,515.0,517.008,530.0,25100,531.0,510.0
965,2018/08/02,551.0,584.784,525.0,806500,615.0,525.0
966,2018/08/03,571.0,551.294,543.0,181400,575.0,538.0
967,2018/08/06,543.0,549.763,567.0,59400,567.0,542.0
968,2018/08/07,532.0,539.681,542.0,37600,561.0,528.0
969,2018/08/08,537.0,535.095,532.0,16900,546.0,528.0
970,2018/08/09,555.0,540.671,538.0,22800,555.0,526.0
971,2018/08/10,655.0,655.0,655.0,21900,655.0,655.0
972,2018/08/13,755.0,725.162,720.0,1006300,755.0,689.0
973,2018/08/14,742.0,805.398,752.0,1899000,902.0,732.0
974,2018/08/15,810.0,795.162,787.0,750700,834.0,759.0
975,2018/08/16,756.0,759.5,780.0,390600,791.0,730.0
976,2018/08/17,759.0,761.73,771.0,274800,790.0,744.0
977,2018/08/20,769.0,781.421,774.0,311800,807.0,763.0
978,2018/08/21,737.0,720.318,739.0,249900,746.0,703.0
979,2018/08/22,762.0,733.036,713.0,135300,764.0,712.0
980,2018/08/23,788.0,775.691,750.0,116000,793.0,744.0
981,2018/08/24,770.0,776.943,787.0,67100,798.0,760.0
982,2018/08/27,776.0,766.485,767.0,74000,780.0,744.0
983,2018/08/28,804.0,791.039,785.0,130400,809.0,770.0
984,2018/08/29,831.0,824.964,789.0,148200,844.0,789.0
985,2018/08/30,820.0,828.665,844.0,98900,852.0,808.0
986,2018/08/31,813.0,808.468,808.0,51300,817.0,801.0
987,2018/09/03,787.0,796.127,815.0,48200,818.0,781.0
988,2018/09/04,788.0,781.747,791.0,50100,799.0,760.0
989,2018/09/05,805.0,786.997,790.0,36200,805.0,772.0
990,2018/09/06,743.0,754.893,775.0,192900,778.0,731.0
991,2018/09/07,708.0,713.239,735.0,141900,735.0,695.0
992,2018/09/10,684.0,694.999,700.0,165600,734.0,673.0
993,2018/09/11,711.0,699.18,694.0,105700,722.0,678.0
994,2018/09/12,695.0,706.157,721.0,64200,732.0,688.0
995,2018/09/13,718.0,707.351,689.0,33100,722.0,687.0
996,2018/09/14,700.0,704.926,718.0,35300,719.0,695.0
997,2018/09/18,686.0,677.7,692.0,74900,692.0,660.0
998,2018/09/19,698.0,700.619,700.0,26000,706.0,691.0
999,2018/09/20,720.0,717.254,703.0,49700,728.0,699.0
1000,2018/09/21,693.0,704.462,713.0,38300,723.0,692.0
1001,2018/09/25,708.0,711.33,700.0,45400,726.0,693.0
1002,2018/09/26,715.0,722.79,723.0,36600,740.0,714.0
1003,2018/09/27,705.0,712.811,719.0,31700,730.0,699.0
1004,2018/09/28,721.0,718.651,717.0,25500,725.0,710.0
1005,2018/10/01,765.0,755.428,730.0,75500,772.0,725.0
1006,2018/10/02,742.0,756.142,778.0,83900,796.0,729.0
1007,2018/10/03,790.0,768.596,745.0,84900,790.0,737.0
1008,2018/10/04,781.0,776.458,779.0,67900,789.0,767.0
1009,2018/10/05,729.0,743.152,760.0,118200,768.0,727.0
1010,2018/10/09,706.0,720.035,730.0,106300,749.0,693.0
1011,2018/10/10,739.0,723.543,715.0,48600,744.0,700.0
1012,2018/10/11,660.0,673.217,675.0,155100,700.0,657.0
1013,2018/10/12,691.0,677.499,670.0,67300,693.0,658.0
1014,2018/10/15,694.0,687.3,689.0,52000,705.0,673.0
1015,2018/10/16,698.0,693.444,700.0,23400,701.0,684.0
1016,2018/10/17,726.0,728.006,712.0,64100,744.0,705.0
1017,2018/10/18,749.0,748.108,730.0,52700,757.0,730.0
1018,2018/10/19,721.0,724.706,726.0,52800,740.0,710.0
1019,2018/10/22,733.0,723.359,728.0,46000,745.0,700.0
1020,2018/10/23,702.0,713.751,730.0,65100,743.0,696.0
1021,2018/10/24,781.0,768.758,720.0,259300,812.0,713.0
1022,2018/10/25,756.0,768.511,766.0,114400,786.0,756.0
1023,2018/10/26,713.0,740.227,769.0,134000,791.0,701.0
1024,2018/10/29,622.0,660.882,702.0,225300,718.0,621.0
1025,2018/10/30,631.0,623.266,602.0,94400,646.0,591.0
1026,2018/10/31,677.0,663.927,637.0,80300,682.0,637.0
1027,2018/11/01,695.0,687.033,677.0,54300,705.0,666.0
1028,2018/11/02,694.0,693.234,692.0,39300,714.0,680.0
1029,2018/11/05,697.0,692.867,679.0,38200,707.0,671.0
1030,2018/11/06,670.0,683.2,691.0,30000,697.0,670.0
1031,2018/11/07,688.0,684.148,676.0,30400,699.0,670.0
1032,2018/11/08,711.0,705.646,700.0,39500,712.0,696.0
1033,2018/11/09,729.0,718.791,706.0,55600,734.0,701.0
1034,2018/11/12,728.0,733.038,728.0,63000,748.0,726.0
1035,2018/11/13,718.0,714.691,706.0,126000,731.0,691.0
1036,2018/11/14,618.0,664.136,703.0,418300,732.0,611.0
1037,2018/11/15,599.0,601.239,598.0,101600,620.0,590.0
1038,2018/11/16,591.0,594.252,606.0,102600,613.0,583.0
1039,2018/11/19,594.0,587.686,589.0,42300,595.0,575.0
1040,2018/11/20,580.0,598.012,591.0,82600,615.0,580.0
1041,2018/11/21,590.0,583.34,570.0,48600,595.0,564.0
1042,2018/11/22,615.0,621.977,610.0,166100,641.0,606.0
1043,2018/11/26,620.0,615.268,618.0,41500,622.0,601.0
1044,2018/11/27,606.0,607.96,615.0,47500,617.0,599.0
1045,2018/11/28,618.0,616.63,603.0,41100,629.0,601.0
1046,2018/11/29,627.0,628.132,628.0,41800,637.0,621.0
1047,2018/11/30,634.0,637.661,631.0,46000,648.0,629.0
1048,2018/12/03,613.0,620.526,637.0,64100,643.0,605.0
1049,2018/12/04,585.0,594.726,610.0,69700,620.0,582.0
1050,2018/12/05,594.0,584.707,573.0,47500,597.0,573.0
1051,2018/12/06,569.0,568.673,584.0,71600,589.0,555.0
1052,2018/12/07,556.0,559.673,579.0,34900,579.0,553.0
1053,2018/12/10,543.0,545.474,555.0,34600,555.0,537.0
1054,2018/12/11,517.0,531.218,550.0,72500,555.0,511.0
1055,2018/12/12,532.0,518.37,510.0,53800,535.0,507.0
1056,2018/12/13,556.0,539.083,530.0,36100,559.0,530.0
1057,2018/12/14,535.0,543.603,560.0,37800,560.0,534.0
1058,2018/12/17,512.0,517.423,533.0,38500,535.0,508.0
1059,2018/12/18,488.0,492.828,496.0,71100,505.0,482.0
1060,2018/12/19,509.0,499.908,490.0,40100,517.0,481.0
1061,2018/12/20,478.0,487.805,500.0,57500,506.0,471.0
1062,2018/12/21,452.0,449.553,472.0,93000,478.0,431.0
1063,2018/12/25,439.0,430.41,420.0,98300,443.0,417.0
1064,2018/12/26,443.0,440.247,439.0,72900,450.0,433.0
1065,2018/12/27,480.0,471.662,461.0,47600,488.0,458.0
1066,2018/12/28,479.0,480.193,480.0,19200,484.0,475.0
1067,2019/01/04,476.0,468.105,471.0,37200,478.0,457.0
1068,2019/01/07,502.0,497.572,492.0,62900,512.0,483.0
1069,2019/01/08,507.0,508.519,499.0,24100,516.0,499.0
1070,2019/01/09,494.0,502.805,510.0,19000,511.0,493.0
1071,2019/01/10,489.0,490.021,502.0,9400,502.0,480.0
1072,2019/01/11,491.0,495.6,492.0,13500,505.0,486.0
1073,2019/01/15,505.0,501.974,496.0,11700,510.0,490.0
1074,2019/01/16,509.0,503.13,503.0,13800,511.0,497.0
1075,2019/01/17,536.0,526.94,513.0,41600,541.0,509.0
1076,2019/01/18,527.0,529.752,536.0,25400,541.0,521.0
1077,2019/01/21,507.0,516.008,526.0,37900,529.0,502.0
1078,2019/01/22,505.0,504.715,508.0,25300,518.0,500.0
1079,2019/01/23,504.0,500.908,499.0,13100,506.0,497.0
1080,2019/01/24,507.0,506.039,505.0,5200,511.0,499.0
1081,2019/01/25,515.0,511.687,511.0,19500,519.0,502.0
1082,2019/01/28,527.0,527.698,535.0,12600,535.0,521.0
1083,2019/01/29,522.0,521.2,531.0,14000,531.0,514.0
1084,2019/01/30,509.0,509.502,519.0,28900,519.0,503.0
1085,2019/01/31,511.0,509.048,510.0,25200,516.0,503.0
1086,2019/02/01,514.0,512.994,515.0,16000,519.0,509.0
1087,2019/02/04,578.0,560.943,535.0,156600,594.0,530.0
1088,2019/02/05,568.0,576.506,580.0,51800,586.0,568.0
1089,2019/02/06,628.0,627.087,583.0,207300,652.0,583.0
1090,2019/02/07,647.0,632.581,622.0,70600,659.0,611.0
1091,2019/02/08,640.0,639.106,630.0,54600,651.0,630.0
1092,2019/02/12,640.0,638.437,650.0,62200,653.0,617.0
1093,2019/02/13,641.0,646.261,644.0,120100,662.0,635.0
1094,2019/02/14,567.0,569.166,581.0,184900,590.0,558.0
1095,2019/02/15,539.0,540.652,540.0,93200,555.0,535.0
1096,2019/02/18,539.0,539.969,539.0,38700,549.0,534.0
1097,2019/02/19,554.0,547.597,539.0,30000,557.0,537.0
1098,2019/02/20,545.0,548.249,558.0,51000,564.0,542.0
1099,2019/02/21,551.0,555.582,549.0,54500,564.0,548.0
1100,2019/02/22,542.0,543.204,548.0,39300,549.0,535.0
1101,2019/02/25,548.0,541.416,544.0,30500,552.0,535.0
1102,2019/02/26,541.0,540.451,548.0,24400,550.0,534.0
1103,2019/02/27,551.0,545.635,541.0,14800,551.0,540.0
1104,2019/02/28,550.0,549.778,546.0,23400,556.0,545.0
1105,2019/03/01,552.0,552.212,551.0,23100,558.0,547.0
1106,2019/03/04,559.0,560.331,553.0,38400,567.0,551.0
1107,2019/03/05,559.0,554.653,554.0,14400,559.0,552.0
1108,2019/03/06,564.0,557.157,559.0,60700,565.0,547.0
1109,2019/03/07,571.0,579.738,568.0,104300,598.0,562.0
1110,2019/03/08,544.0,549.589,556.0,68200,563.0,538.0
1111,2019/03/11,527.0,532.541,543.0,22000,544.0,523.0
1112,2019/03/12,546.0,541.0,528.0,35300,549.0,527.0
1113,2019/03/13,540.0,540.313,546.0,20100,546.0,536.0
1114,2019/03/14,542.0,541.487,545.0,7800,545.0,538.0
1115,2019/03/15,546.0,545.077,544.0,22100,553.0,539.0
1116,2019/03/18,560.0,563.448,555.0,51400,572.0,550.0
1117,2019/03/19,551.0,553.341,560.0,27900,568.0,549.0
1118,2019/03/20,555.0,556.437,551.0,28400,565.0,549.0
1119,2019/03/22,539.0,540.477,553.0,59100,553.0,535.0
1120,2019/03/25,522.0,521.182,525.0,40200,526.0,515.0
1121,2019/03/26,527.0,527.593,522.0,11800,531.0,522.0
1122,2019/03/27,534.0,532.409,534.0,8800,537.0,526.0
1123,2019/03/28,526.0,529.441,530.0,11100,533.0,525.0
1124,2019/03/29,525.0,519.551,524.0,37000,529.0,513.0
1125,2019/04/01,530.0,533.438,526.0,24000,541.0,525.0
1126,2019/04/02,521.0,522.006,527.0,16900,533.0,517.0
1127,2019/04/03,523.0,524.109,522.0,5500,530.0,521.0
1128,2019/04/04,524.0,524.574,523.0,6100,529.0,523.0
1129,2019/04/05,529.0,523.023,524.0,13200,529.0,518.0
1130,2019/04/08,529.0,531.05,530.0,4000,535.0,528.0
1131,2019/04/09,525.0,524.42,528.0,11200,528.0,522.0
1132,2019/04/10,525.0,523.589,525.0,5600,525.0,522.0
1133,2019/04/11,533.0,530.889,533.0,9900,535.0,527.0
1134,2019/04/12,526.0,530.478,536.0,11300,539.0,526.0
1135,2019/04/15,533.0,530.1,528.0,10000,538.0,523.0
1136,2019/04/16,526.0,529.457,530.0,30000,535.0,524.0
1137,2019/04/17,528.0,525.657,527.0,9900,530.0,521.0
1138,2019/04/18,532.0,529.871,528.0,17000,535.0,526.0
1139,2019/04/19,530.0,527.438,533.0,11200,533.0,526.0
1140,2019/04/22,526.0,527.747,530.0,7900,532.0,526.0
1141,2019/04/23,525.0,524.175,524.0,8000,530.0,523.0
1142,2019/04/24,521.0,522.677,523.0,9300,526.0,520.0
1143,2019/04/25,521.0,521.171,520.0,12300,524.0,518.0
1144,2019/04/26,522.0,520.566,520.0,10600,524.0,518.0
1145,2019/05/07,529.0,528.613,522.0,10600,532.0,522.0
1146,2019/05/08,537.0,532.555,524.0,18200,538.0,524.0
1147,2019/05/09,533.0,534.165,537.0,7900,537.0,532.0
1148,2019/05/10,531.0,535.526,534.0,28900,547.0,530.0
1149,2019/05/13,510.0,522.03,531.0,39500,534.0,510.0
1150,2019/05/14,514.0,497.378,484.0,51600,516.0,480.0
1151,2019/05/15,614.0,614.0,614.0,21000,614.0,614.0
1152,2019/05/16,714.0,714.0,714.0,35900,714.0,714.0
1153,2019/05/17,864.0,861.166,860.0,304000,864.0,855.0
1154,2019/05/20,1014.0,1004.282,1014.0,1298500,1014.0,973.0
1155,2019/05/21,1077.0,1054.126,1005.0,2991500,1180.0,968.0
1156,2019/05/22,1081.0,1193.551,1206.0,2928100,1305.0,1065.0
1157,2019/05/23,1129.0,1080.346,1051.0,1197400,1129.0,1032.0
1158,2019/05/24,1195.0,1212.564,1189.0,1734000,1328.0,1116.0
1159,2019/05/27,1158.0,1174.943,1195.0,340500,1246.0,1130.0
1160,2019/05/28,1107.0,1073.775,1118.0,277100,1128.0,1030.0
1161,2019/05/29,1076.0,1095.075,1128.0,142200,1141.0,1058.0
1162,2019/05/30,1018.0,1043.474,1076.0,135500,1085.0,1015.0
1163,2019/05/31,1014.0,1050.318,1018.0,229600,1115.0,1013.0
1164,2019/06/03,1036.0,1050.192,1040.0,173400,1100.0,1019.0
1165,2019/06/04,1264.0,1175.67,1066.0,829000,1270.0,1066.0
1166,2019/06/05,1199.0,1303.035,1310.0,1145200,1420.0,1195.0
1167,2019/06/06,1182.0,1256.222,1212.0,857700,1386.0,1150.0
1168,2019/06/07,1110.0,1152.739,1182.0,295300,1212.0,1103.0
1169,2019/06/10,1245.0,1195.079,1146.0,373600,1245.0,1130.0
1170,2019/06/11,1230.0,1226.777,1242.0,205300,1278.0,1182.0
1171,2019/06/12,1201.0,1281.986,1218.0,346700,1347.0,1201.0
1172,2019/06/13,1242.0,1253.003,1198.0,368200,1309.0,1172.0
1173,2019/06/14,1494.0,1365.778,1232.0,624800,1494.0,1232.0
1174,2019/06/17,1365.0,1404.608,1464.0,504200,1494.0,1333.0
1175,2019/06/18,1370.0,1393.048,1375.0,335100,1443.0,1335.0
1176,2019/06/19,1349.0,1321.604,1384.0,287300,1387.0,1288.0
1177,2019/06/20,1420.0,1382.903,1336.0,307200,1459.0,1297.0
1178,2019/06/21,1120.0,1120.0,1120.0,12200,1120.0,1120.0
1179,2019/06/24,854.0,882.907,940.0,3708900,944.0,822.0
1180,2019/06/25,832.0,846.39,866.0,1077500,879.0,805.0
1181,2019/06/26,815.0,828.015,819.0,499000,860.0,800.0
1182,2019/06/27,817.0,814.236,808.0,447900,838.0,786.0
1183,2019/06/28,832.0,843.216,832.0,741400,871.0,820.0
1184,2019/07/01,833.0,842.131,850.0,231400,861.0,832.0
1185,2019/07/02,825.0,823.193,819.0,217700,840.0,811.0
1186,2019/07/03,846.0,833.486,826.0,217100,854.0,816.0
1187,2019/07/04,835.0,845.994,854.0,253700,860.0,831.0
1188,2019/07/05,839.0,842.686,845.0,156500,856.0,836.0
1189,2019/07/08,832.0,849.175,854.0,260300,871.0,828.0
1190,2019/07/09,806.0,816.379,835.0,198100,840.0,802.0
1191,2019/07/10,812.0,807.768,819.0,97400,819.0,800.0
1192,2019/07/11,777.0,785.768,804.0,220200,805.0,774.0
1193,2019/07/12,781.0,783.433,790.0,103200,795.0,777.0
1194,2019/07/16,744.0,759.644,780.0,180400,784.0,738.0
1195,2019/07/17,748.0,751.518,759.0,95200,762.0,739.0
1196,2019/07/18,729.0,736.884,751.0,79800,751.0,726.0
1197,2019/07/19,753.0,745.767,736.0,99200,762.0,729.0
1198,2019/07/22,736.0,753.777,746.0,101000,771.0,736.0
1199,2019/07/23,777.0,766.627,738.0,133700,794.0,737.0
1200,2019/07/24,765.0,769.358,762.0,136700,788.0,754.0
1201,2019/07/25,748.0,751.806,762.0,72800,764.0,743.0
1202,2019/07/26,776.0,761.83,741.0,75300,784.0,741.0
1203,2019/07/29,768.0,779.271,779.0,117600,790.0,764.0
1204,2019/07/30,798.0,794.764,773.0,160600,812.0,767.0
1205,2019/07/31,801.0,788.757,791.0,81100,804.0,776.0
1206,2019/08/01,798.0,804.374,795.0,73300,811.0,793.0
1207,2019/08/02,796.0,796.415,789.0,99800,811.0,781.0
1208,2019/08/05,768.0,771.193,796.0,102200,799.0,756.0
1209,2019/08/06,741.0,732.205,727.0,156500,756.0,714.0
1210,2019/08/07,762.0,753.522,747.0,62700,768.0,739.0
1211,2019/08/08,706.0,729.41,760.0,384500,785.0,690.0
1212,2019/08/09,747.0,737.317,720.0,258000,753.0,718.0
1213,2019/08/13,755.0,751.872,735.0,112000,767.0,724.0
1214,2019/08/14,757.0,769.494,765.0,70400,787.0,751.0
1215,2019/08/15,739.0,738.42,727.0,59000,751.0,727.0
1216,2019/08/16,750.0,763.399,739.0,86000,780.0,736.0
1217,2019/08/19,740.0,741.068,752.0,64900,757.0,735.0
1218,2019/08/20,741.0,739.372,736.0,19900,747.0,733.0
1219,2019/08/21,727.0,728.758,734.0,40500,738.0,721.0
1220,2019/08/22,708.0,718.968,727.0,34300,730.0,708.0
1221,2019/08/23,724.0,719.485,707.0,26400,727.0,704.0
