,Date,Close,VWAP,Open,Volume,High,Low
0,2014/08/25,504.0,512.306,519.0,141700,521.0,503.0
1,2014/08/26,490.0,498.255,510.0,109700,510.0,489.0
2,2014/08/27,488.0,485.419,488.0,119000,493.0,482.0
3,2014/08/28,497.0,492.764,496.0,45400,498.0,488.0
4,2014/08/29,500.0,499.703,502.0,79000,505.0,494.0
5,2014/09/01,514.0,509.963,504.0,122300,520.0,504.0
6,2014/09/02,500.0,502.695,519.0,130100,519.0,493.0
7,2014/09/03,495.0,496.846,504.0,63500,504.0,493.0
8,2014/09/04,481.0,484.038,493.0,130600,495.0,478.0
9,2014/09/05,479.0,478.607,481.0,40700,485.0,474.0
10,2014/09/08,489.0,481.888,478.0,39200,489.0,473.0
11,2014/09/09,489.0,483.782,481.0,58700,490.0,479.0
12,2014/09/10,482.0,487.9,487.0,50100,496.0,481.0
13,2014/09/11,474.0,475.815,481.0,85500,483.0,467.0
14,2014/09/12,470.0,473.017,471.0,65100,479.0,468.0
15,2014/09/16,475.0,474.574,472.0,38500,482.0,468.0
16,2014/09/17,472.0,473.581,478.0,32900,479.0,471.0
17,2014/09/18,470.0,471.425,473.0,23300,478.0,469.0
18,2014/09/19,471.0,469.412,469.0,18200,471.0,468.0
19,2014/09/22,470.0,470.732,472.0,20500,475.0,468.0
20,2014/09/24,475.0,471.244,470.0,32800,476.0,468.0
21,2014/09/25,476.0,476.495,482.0,28100,482.0,472.0
22,2014/09/26,481.0,476.88,476.0,18300,481.0,469.0
23,2014/09/29,485.0,489.553,490.0,63100,495.0,482.0
24,2014/09/30,474.0,479.34,480.0,62000,488.0,474.0
25,2014/10/01,457.0,464.261,471.0,60200,471.0,456.0
26,2014/10/02,434.0,437.08,436.0,62900,445.0,433.0
27,2014/10/03,442.0,438.866,433.0,35800,443.0,433.0
28,2014/10/06,463.0,452.858,442.0,28900,465.0,442.0
29,2014/10/07,439.0,447.882,458.0,36400,464.0,437.0
30,2014/10/08,433.0,432.317,434.0,24600,439.0,426.0
31,2014/10/09,427.0,433.271,435.0,19900,445.0,427.0
32,2014/10/10,405.0,408.044,414.0,55100,420.0,400.0
33,2014/10/14,396.0,393.513,395.0,31200,401.0,386.0
34,2014/10/15,393.0,394.023,389.0,22000,405.0,389.0
35,2014/10/16,384.0,383.357,384.0,23500,390.0,378.0
36,2014/10/17,384.0,386.426,392.0,31900,397.0,375.0
37,2014/10/20,400.0,394.726,397.0,37200,409.0,389.0
38,2014/10/21,400.0,407.43,407.0,29100,415.0,399.0
39,2014/10/22,402.0,407.281,406.0,31300,417.0,402.0
40,2014/10/23,402.0,399.122,402.0,15600,407.0,396.0
41,2014/10/24,469.0,461.209,429.0,205800,482.0,413.0
42,2014/10/27,474.0,467.423,470.0,74500,478.0,453.0
43,2014/10/28,493.0,488.662,482.0,137100,498.0,477.0
44,2014/10/29,507.0,502.651,486.0,183000,517.0,486.0
45,2014/10/30,536.0,521.727,512.0,226200,539.0,510.0
46,2014/10/31,494.0,505.974,536.0,197900,539.0,490.0
47,2014/11/04,500.0,504.988,510.0,48600,510.0,498.0
48,2014/11/05,494.0,483.629,495.0,56300,496.0,471.0
49,2014/11/06,473.0,480.271,490.0,74900,498.0,473.0
50,2014/11/07,477.0,474.027,473.0,29800,481.0,468.0
51,2014/11/10,486.0,486.428,488.0,15200,491.0,480.0
52,2014/11/11,480.0,474.774,483.0,54000,483.0,465.0
53,2014/11/12,468.0,472.23,472.0,75200,480.0,467.0
54,2014/11/13,450.0,448.416,452.0,74200,456.0,442.0
55,2014/11/14,439.0,448.737,452.0,66800,461.0,435.0
56,2014/11/17,407.0,412.373,431.0,160100,432.0,400.0
57,2014/11/18,431.0,414.591,406.0,48600,431.0,403.0
58,2014/11/19,431.0,430.673,431.0,33000,435.0,425.0
59,2014/11/20,442.0,448.864,446.0,80800,460.0,441.0
60,2014/11/21,435.0,436.295,442.0,25800,442.0,429.0
61,2014/11/25,452.0,450.056,450.0,32000,456.0,440.0
62,2014/11/26,455.0,454.622,455.0,44200,460.0,451.0
63,2014/11/27,460.0,459.692,453.0,20800,464.0,453.0
64,2014/11/28,468.0,468.687,465.0,53400,474.0,465.0
65,2014/12/01,465.0,467.49,469.0,24100,469.0,464.0
66,2014/12/02,463.0,463.643,465.0,69200,475.0,459.0
67,2014/12/03,460.0,466.004,464.0,70100,490.0,455.0
68,2014/12/04,445.0,451.76,465.0,55500,465.0,444.0
69,2014/12/05,442.0,445.979,444.0,28100,450.0,442.0
70,2014/12/08,436.0,446.078,452.0,58000,452.0,436.0
71,2014/12/09,438.0,437.929,437.0,8400,444.0,436.0
72,2014/12/10,428.0,431.598,432.0,18900,437.0,428.0
73,2014/12/11,433.0,427.775,426.0,11100,433.0,423.0
74,2014/12/12,437.0,444.264,435.0,35200,450.0,435.0
75,2014/12/15,442.0,442.028,439.0,28600,455.0,436.0
76,2014/12/16,434.0,442.798,446.0,41000,459.0,430.0
77,2014/12/17,419.0,424.24,436.0,28700,436.0,418.0
78,2014/12/18,415.0,417.99,420.0,30100,425.0,413.0
79,2014/12/19,402.0,408.739,418.0,43700,418.0,402.0
80,2014/12/22,407.0,409.322,410.0,54000,417.0,406.0
81,2014/12/24,411.0,412.578,414.0,35800,417.0,407.0
82,2014/12/25,418.0,415.552,411.0,24800,421.0,411.0
83,2014/12/26,429.0,421.733,412.0,15000,430.0,412.0
84,2014/12/29,430.0,430.926,433.0,40500,439.0,420.0
85,2014/12/30,430.0,428.645,430.0,9300,438.0,425.0
86,2015/01/05,422.0,425.438,426.0,25600,433.0,420.0
87,2015/01/06,421.0,421.196,418.0,5600,425.0,417.0
88,2015/01/07,416.0,417.458,421.0,22700,425.0,415.0
89,2015/01/08,423.0,421.058,417.0,13700,424.0,417.0
90,2015/01/09,424.0,425.394,428.0,6600,428.0,423.0
91,2015/01/13,426.0,426.404,421.0,17100,430.0,421.0
92,2015/01/14,425.0,426.701,426.0,7700,429.0,424.0
93,2015/01/15,426.0,424.436,423.0,3900,426.0,423.0
94,2015/01/16,430.0,429.584,422.0,17800,435.0,422.0
95,2015/01/19,452.0,444.588,441.0,41300,454.0,431.0
96,2015/01/20,458.0,457.66,455.0,19400,468.0,453.0
97,2015/01/21,454.0,453.089,459.0,17900,459.0,450.0
98,2015/01/22,453.0,451.225,454.0,8000,454.0,449.0
99,2015/01/23,457.0,456.0,457.0,12500,461.0,450.0
100,2015/01/26,458.0,456.338,455.0,29300,459.0,450.0
101,2015/01/27,454.0,455.368,459.0,8700,460.0,452.0
102,2015/01/28,445.0,446.606,453.0,19800,454.0,441.0
103,2015/01/29,454.0,449.732,443.0,21600,455.0,443.0
104,2015/01/30,471.0,466.04,449.0,57000,477.0,449.0
105,2015/02/02,458.0,462.018,472.0,44600,473.0,455.0
106,2015/02/03,456.0,454.757,457.0,14800,462.0,451.0
107,2015/02/04,451.0,453.045,455.0,11200,458.0,450.0
108,2015/02/05,472.0,466.331,455.0,38100,472.0,455.0
109,2015/02/06,480.0,479.82,472.0,79900,487.0,472.0
110,2015/02/09,488.0,484.971,480.0,41700,488.0,480.0
111,2015/02/10,483.0,486.917,486.0,30100,496.0,468.0
112,2015/02/12,483.0,482.431,483.0,21800,489.0,476.0
113,2015/02/13,475.0,476.37,483.0,10800,483.0,471.0
114,2015/02/16,453.0,452.329,475.0,71700,475.0,445.0
115,2015/02/17,467.0,460.227,453.0,26900,468.0,450.0
116,2015/02/18,474.0,471.857,470.0,26600,477.0,465.0
117,2015/02/19,482.0,477.68,472.0,38400,482.0,472.0
118,2015/02/20,471.0,485.464,492.0,163200,497.0,456.0
119,2015/02/23,444.0,449.2,471.0,96800,471.0,441.0
120,2015/02/24,430.0,428.64,443.0,122900,444.0,422.0
121,2015/02/25,427.0,424.111,426.0,147800,430.0,420.0
122,2015/02/26,423.0,423.612,423.0,78500,427.0,422.0
123,2015/02/27,430.0,426.702,423.0,26500,430.0,423.0
124,2015/03/02,425.0,426.38,432.0,34700,432.0,425.0
125,2015/03/03,423.0,424.539,425.0,13000,428.0,422.0
126,2015/03/04,419.0,419.456,422.0,15800,422.0,418.0
127,2015/03/05,420.0,419.636,419.0,12100,423.0,417.0
128,2015/03/06,419.0,419.319,421.0,4700,422.0,417.0
129,2015/03/09,411.0,415.199,420.0,18100,420.0,411.0
130,2015/03/10,413.0,415.681,419.0,9100,419.0,413.0
131,2015/03/11,414.0,411.093,411.0,18300,415.0,409.0
132,2015/03/12,416.0,416.029,417.0,17300,419.0,414.0
133,2015/03/13,423.0,426.208,422.0,33700,431.0,422.0
134,2015/03/16,425.0,433.571,428.0,101900,455.0,422.0
135,2015/03/17,418.0,421.44,425.0,35200,425.0,418.0
136,2015/03/18,416.0,416.577,420.0,13000,420.0,415.0
137,2015/03/19,422.0,419.597,416.0,13400,422.0,416.0
138,2015/03/20,425.0,423.471,422.0,8700,426.0,420.0
139,2015/03/23,425.0,426.324,429.0,14200,429.0,424.0
140,2015/03/24,423.0,425.5,428.0,13800,428.0,423.0
141,2015/03/25,422.0,420.861,427.0,28000,427.0,416.0
142,2015/03/26,416.0,419.789,422.0,12300,424.0,416.0
143,2015/03/27,413.0,418.302,418.0,9600,425.0,413.0
144,2015/03/30,413.0,415.394,415.0,10400,421.0,413.0
145,2015/03/31,424.0,422.252,416.0,25000,429.0,416.0
146,2015/04/01,419.0,423.247,428.0,14200,428.0,418.0
147,2015/04/02,421.0,420.814,418.0,8600,424.0,418.0
148,2015/04/03,426.0,425.577,425.0,11100,428.0,421.0
149,2015/04/06,425.0,426.709,427.0,14100,430.0,419.0
150,2015/04/07,423.0,425.605,425.0,4300,427.0,423.0
151,2015/04/08,428.0,427.647,425.0,15600,431.0,425.0
152,2015/04/09,427.0,427.62,428.0,7100,428.0,426.0
153,2015/04/10,425.0,422.753,427.0,16600,427.0,420.0
154,2015/04/13,423.0,423.94,424.0,8300,425.0,423.0
155,2015/04/14,426.0,424.864,421.0,17600,431.0,421.0
156,2015/04/15,429.0,428.57,427.0,21400,433.0,425.0
157,2015/04/16,442.0,435.715,432.0,25600,442.0,432.0
158,2015/04/17,432.0,448.849,443.0,76700,459.0,432.0
159,2015/04/20,425.0,427.037,430.0,16300,433.0,423.0
160,2015/04/21,424.0,423.648,426.0,13900,431.0,420.0
161,2015/04/22,425.0,426.632,427.0,11400,430.0,425.0
162,2015/04/23,423.0,423.37,425.0,21100,425.0,421.0
163,2015/04/24,423.0,423.103,430.0,22400,430.0,420.0
164,2015/04/27,420.0,421.173,423.0,5200,423.0,420.0
165,2015/04/28,419.0,420.5,420.0,12800,424.0,418.0
166,2015/04/30,417.0,417.376,418.0,20500,419.0,416.0
167,2015/05/01,411.0,413.335,417.0,31900,417.0,411.0
168,2015/05/07,413.0,411.109,409.0,5500,415.0,409.0
169,2015/05/08,420.0,418.975,414.0,12100,423.0,414.0
170,2015/05/11,421.0,419.169,422.0,8900,422.0,415.0
171,2015/05/12,425.0,420.116,418.0,21600,425.0,416.0
172,2015/05/13,426.0,422.843,425.0,10200,426.0,419.0
173,2015/05/14,419.0,420.416,426.0,23100,426.0,417.0
174,2015/05/15,499.0,492.269,467.0,1632600,499.0,463.0
175,2015/05/18,566.0,553.076,545.0,3664900,578.0,502.0
176,2015/05/19,515.0,525.189,550.0,661600,550.0,511.0
177,2015/05/20,615.0,603.631,540.0,2615700,615.0,535.0
178,2015/05/21,589.0,599.328,605.0,1673900,627.0,575.0
179,2015/05/22,565.0,562.172,586.0,815300,598.0,530.0
180,2015/05/25,548.0,581.185,585.0,689100,630.0,548.0
181,2015/05/26,507.0,522.55,536.0,612800,541.0,500.0
182,2015/05/27,504.0,509.96,509.0,279300,526.0,501.0
183,2015/05/28,518.0,517.828,521.0,187400,525.0,509.0
184,2015/05/29,524.0,519.582,517.0,138700,529.0,510.0
185,2015/06/01,536.0,532.269,524.0,171600,545.0,524.0
186,2015/06/02,576.0,583.77,564.0,1142600,614.0,546.0
187,2015/06/03,533.0,541.022,551.0,421000,559.0,527.0
188,2015/06/04,547.0,533.085,537.0,155600,551.0,522.0
189,2015/06/05,530.0,531.933,536.0,106300,538.0,527.0
190,2015/06/08,523.0,522.905,532.0,133100,536.0,513.0
191,2015/06/09,518.0,520.19,533.0,80600,533.0,511.0
192,2015/06/10,525.0,550.487,514.0,454900,594.0,513.0
193,2015/06/11,536.0,539.378,535.0,127600,553.0,528.0
194,2015/06/12,533.0,535.45,540.0,90800,544.0,528.0
195,2015/06/15,524.0,527.196,533.0,66000,535.0,521.0
196,2015/06/16,533.0,536.676,541.0,92100,543.0,530.0
197,2015/06/17,527.0,535.043,536.0,88500,545.0,527.0
198,2015/06/18,508.0,513.734,522.0,121000,524.0,507.0
199,2015/06/19,511.0,511.94,513.0,36500,518.0,508.0
200,2015/06/22,508.0,508.444,506.0,71400,518.0,499.0
201,2015/06/23,509.0,507.692,509.0,63600,515.0,501.0
202,2015/06/24,515.0,513.84,511.0,48600,519.0,510.0
203,2015/06/25,504.0,506.89,517.0,37400,517.0,503.0
204,2015/06/26,500.0,501.92,504.0,26300,506.0,500.0
205,2015/06/29,479.0,475.169,469.0,112100,488.0,466.0
206,2015/06/30,481.0,482.015,480.0,33000,489.0,479.0
207,2015/07/01,506.0,496.469,482.0,39000,506.0,481.0
208,2015/07/02,506.0,511.158,513.0,36800,518.0,506.0
209,2015/07/03,499.0,497.14,496.0,24300,503.0,493.0
210,2015/07/06,493.0,497.188,484.0,44600,510.0,484.0
211,2015/07/07,508.0,503.062,497.0,27600,510.0,497.0
212,2015/07/08,480.0,486.29,508.0,71000,508.0,478.0
213,2015/07/09,469.0,453.81,463.0,135400,479.0,427.0
214,2015/07/10,481.0,477.133,461.0,52800,496.0,461.0
215,2015/07/13,490.0,489.247,483.0,28400,496.0,481.0
216,2015/07/14,509.0,510.746,499.0,90500,523.0,491.0
217,2015/07/15,510.0,508.996,503.0,45100,517.0,500.0
218,2015/07/16,508.0,505.793,516.0,17900,516.0,501.0
219,2015/07/17,503.0,503.687,505.0,53100,512.0,500.0
220,2015/07/21,519.0,516.652,505.0,44200,524.0,505.0
221,2015/07/22,506.0,513.333,519.0,28200,524.0,505.0
222,2015/07/23,522.0,517.656,506.0,41800,526.0,506.0
223,2015/07/24,532.0,527.189,526.0,51300,535.0,522.0
224,2015/07/27,518.0,526.862,534.0,91000,536.0,516.0
225,2015/07/28,519.0,507.634,505.0,45100,520.0,500.0
226,2015/07/29,521.0,523.634,535.0,29800,535.0,513.0
227,2015/07/30,504.0,507.615,523.0,41800,523.0,504.0
228,2015/07/31,505.0,504.202,512.0,53900,512.0,497.0
229,2015/08/03,506.0,506.28,506.0,34300,514.0,500.0
230,2015/08/04,495.0,499.757,501.0,41900,504.0,495.0
231,2015/08/05,495.0,491.176,492.0,44400,498.0,486.0
232,2015/08/06,503.0,495.561,492.0,14800,503.0,492.0
233,2015/08/07,494.0,493.895,498.0,24800,500.0,491.0
234,2015/08/10,527.0,515.973,495.0,81800,528.0,495.0
235,2015/08/11,521.0,517.819,523.0,37600,526.0,510.0
236,2015/08/12,491.0,498.908,521.0,141400,521.0,484.0
237,2015/08/13,534.0,517.064,500.0,203800,534.0,490.0
238,2015/08/14,490.0,487.427,490.0,248000,500.0,476.0
239,2015/08/17,475.0,475.119,482.0,92300,482.0,470.0
240,2015/08/18,475.0,476.669,477.0,40200,482.0,472.0
241,2015/08/19,452.0,459.062,472.0,93000,474.0,450.0
242,2015/08/20,442.0,447.655,451.0,58600,455.0,441.0
243,2015/08/21,420.0,422.719,427.0,121800,433.0,414.0
244,2015/08/24,388.0,411.845,420.0,151500,430.0,385.0
245,2015/08/25,359.0,369.601,356.0,155500,410.0,341.0
246,2015/08/26,394.0,386.472,391.0,71900,399.0,372.0
247,2015/08/27,415.0,411.157,410.0,48400,416.0,402.0
248,2015/08/28,427.0,427.536,427.0,42900,431.0,425.0
249,2015/08/31,420.0,419.667,425.0,46600,430.0,410.0
250,2015/09/01,411.0,410.985,415.0,26800,415.0,406.0
251,2015/09/02,403.0,402.642,395.0,42700,417.0,395.0
252,2015/09/03,406.0,406.711,403.0,14200,414.0,403.0
253,2015/09/04,385.0,389.494,413.0,64400,413.0,373.0
254,2015/09/07,390.0,380.008,375.0,24200,390.0,371.0
255,2015/09/08,375.0,379.832,390.0,23800,390.0,375.0
256,2015/09/09,394.0,390.533,390.0,18400,397.0,385.0
257,2015/09/10,395.0,389.492,390.0,6300,397.0,384.0
258,2015/09/11,410.0,405.108,399.0,9300,411.0,399.0
259,2015/09/14,412.0,409.817,415.0,12000,415.0,405.0
260,2015/09/15,406.0,408.863,406.0,5100,412.0,406.0
261,2015/09/16,402.0,411.256,401.0,16400,415.0,401.0
262,2015/09/17,402.0,403.691,402.0,16200,408.0,402.0
263,2015/09/18,405.0,404.285,409.0,13700,409.0,401.0
264,2015/09/24,399.0,401.423,408.0,5200,408.0,399.0
265,2015/09/25,408.0,410.468,412.0,7900,416.0,400.0
266,2015/09/28,417.0,408.642,406.0,13400,417.0,402.0
267,2015/09/29,406.0,408.153,410.0,11100,412.0,404.0
268,2015/09/30,409.0,409.294,405.0,3400,411.0,405.0
269,2015/10/01,411.0,411.719,412.0,6400,416.0,408.0
270,2015/10/02,417.0,417.754,411.0,11400,420.0,411.0
271,2015/10/05,429.0,428.214,427.0,20600,435.0,425.0
272,2015/10/06,434.0,438.058,440.0,15400,440.0,434.0
273,2015/10/07,436.0,429.445,430.0,17300,436.0,420.0
274,2015/10/08,431.0,431.685,436.0,12700,438.0,421.0
275,2015/10/09,431.0,429.66,431.0,4700,431.0,428.0
276,2015/10/13,428.0,429.736,432.0,12500,432.0,426.0
277,2015/10/14,422.0,424.704,425.0,14200,426.0,422.0
278,2015/10/15,426.0,421.813,416.0,3200,429.0,416.0
279,2015/10/16,416.0,423.121,432.0,32200,433.0,415.0
280,2015/10/19,417.0,414.024,416.0,33800,420.0,410.0
281,2015/10/20,416.0,412.5,420.0,10800,420.0,402.0
282,2015/10/21,410.0,411.756,408.0,21300,420.0,407.0
283,2015/10/22,423.0,418.215,412.0,7900,423.0,412.0
284,2015/10/23,430.0,431.892,430.0,16700,437.0,427.0
285,2015/10/26,432.0,435.621,430.0,21100,439.0,430.0
286,2015/10/27,436.0,436.526,437.0,17300,439.0,430.0
287,2015/10/28,450.0,443.388,439.0,60900,451.0,436.0
288,2015/10/29,457.0,462.397,465.0,37000,465.0,455.0
289,2015/10/30,450.0,457.786,457.0,44900,462.0,450.0
290,2015/11/02,461.0,481.353,457.0,190300,512.0,456.0
291,2015/11/04,435.0,447.458,464.0,50400,464.0,435.0
292,2015/11/05,456.0,449.497,442.0,15500,460.0,435.0
293,2015/11/06,454.0,455.754,459.0,6100,459.0,451.0
294,2015/11/09,475.0,469.373,462.0,66700,475.0,460.0
295,2015/11/10,460.0,463.055,475.0,34700,475.0,455.0
296,2015/11/11,461.0,464.992,465.0,24700,468.0,461.0
297,2015/11/12,464.0,465.028,461.0,31700,467.0,460.0
298,2015/11/13,448.0,454.151,451.0,63400,472.0,444.0
299,2015/11/16,420.0,438.003,440.0,60200,453.0,420.0
300,2015/11/17,452.0,443.947,434.0,41200,452.0,434.0
301,2015/11/18,443.0,451.288,458.0,32600,461.0,442.0
302,2015/11/19,473.0,463.356,447.0,86800,473.0,447.0
303,2015/11/20,437.0,436.787,441.0,138700,444.0,431.0
304,2015/11/24,432.0,433.165,432.0,66100,440.0,429.0
305,2015/11/25,434.0,434.492,433.0,30900,438.0,433.0
306,2015/11/26,439.0,438.036,437.0,22100,440.0,434.0
307,2015/11/27,432.0,434.2,438.0,21000,438.0,431.0
308,2015/11/30,428.0,425.595,428.0,19500,430.0,420.0
309,2015/12/01,424.0,424.905,421.0,49200,434.0,421.0
310,2015/12/02,424.0,423.67,423.0,30900,429.0,421.0
311,2015/12/03,426.0,425.841,422.0,17600,436.0,420.0
312,2015/12/04,417.0,420.425,425.0,24700,425.0,416.0
313,2015/12/07,424.0,421.675,422.0,23100,425.0,418.0
314,2015/12/08,399.0,401.483,398.0,563500,408.0,397.0
315,2015/12/09,400.0,400.668,399.0,80800,405.0,396.0
316,2015/12/10,400.0,400.203,400.0,44300,403.0,398.0
317,2015/12/11,404.0,403.68,404.0,54400,406.0,402.0
318,2015/12/14,397.0,397.137,396.0,34300,401.0,396.0
319,2015/12/15,392.0,393.94,397.0,58500,398.0,389.0
320,2015/12/16,391.0,392.512,393.0,37700,397.0,388.0
321,2015/12/17,396.0,393.761,391.0,33500,398.0,391.0
322,2015/12/18,400.0,401.088,396.0,55400,406.0,395.0
323,2015/12/21,395.0,396.507,397.0,42400,401.0,393.0
324,2015/12/22,395.0,393.659,393.0,42800,396.0,391.0
325,2015/12/24,386.0,389.111,398.0,62900,398.0,382.0
326,2015/12/25,383.0,381.222,382.0,60900,385.0,378.0
327,2015/12/28,390.0,386.094,380.0,31900,393.0,379.0
328,2015/12/29,394.0,394.471,396.0,25700,397.0,390.0
329,2015/12/30,402.0,398.348,396.0,25300,402.0,391.0
330,2016/01/04,396.0,397.567,403.0,31900,403.0,394.0
331,2016/01/05,395.0,388.697,396.0,49900,398.0,380.0
332,2016/01/06,389.0,392.482,395.0,16200,398.0,389.0
333,2016/01/07,386.0,385.264,389.0,28800,390.0,381.0
334,2016/01/08,387.0,383.664,381.0,27100,389.0,381.0
335,2016/01/12,367.0,375.939,387.0,60900,387.0,360.0
336,2016/01/13,373.0,373.08,371.0,20000,381.0,369.0
337,2016/01/14,367.0,366.567,370.0,25400,376.0,361.0
338,2016/01/15,370.0,376.707,383.0,35100,386.0,368.0
339,2016/01/18,359.0,348.509,344.0,60900,365.0,343.0
340,2016/01/19,357.0,353.6,348.0,21000,360.0,347.0
341,2016/01/20,340.0,344.033,350.0,36500,362.0,338.0
342,2016/01/21,317.0,332.845,336.0,44600,342.0,315.0
343,2016/01/22,334.0,330.78,328.0,52300,336.0,325.0
344,2016/01/25,343.0,344.234,345.0,24400,347.0,340.0
345,2016/01/26,343.0,338.788,336.0,8000,343.0,336.0
346,2016/01/27,349.0,346.891,343.0,12800,349.0,343.0
347,2016/01/28,346.0,347.682,344.0,8500,351.0,344.0
348,2016/01/29,352.0,347.761,342.0,15500,352.0,342.0
349,2016/02/01,370.0,360.365,355.0,41600,370.0,355.0
350,2016/02/02,362.0,365.772,370.0,14900,370.0,360.0
351,2016/02/03,356.0,355.401,356.0,14200,362.0,351.0
352,2016/02/04,351.0,352.833,353.0,13200,357.0,347.0
353,2016/02/05,347.0,345.253,348.0,29300,350.0,335.0
354,2016/02/08,365.0,349.794,347.0,16500,365.0,335.0
355,2016/02/09,336.0,336.277,357.0,33600,357.0,330.0
356,2016/02/10,316.0,316.172,330.0,70400,334.0,301.0
357,2016/02/12,281.0,281.915,276.0,49300,296.0,275.0
358,2016/02/15,318.0,305.536,301.0,45300,318.0,296.0
359,2016/02/16,303.0,303.339,300.0,81800,323.0,293.0
360,2016/02/17,297.0,299.814,297.0,16100,306.0,297.0
361,2016/02/18,311.0,304.057,302.0,21200,313.0,296.0
362,2016/02/19,305.0,304.414,309.0,28000,309.0,298.0
363,2016/02/22,316.0,308.075,306.0,18700,316.0,301.0
364,2016/02/23,316.0,317.57,320.0,30000,326.0,310.0
365,2016/02/24,311.0,311.266,310.0,13900,313.0,310.0
366,2016/02/25,309.0,317.988,323.0,8100,323.0,309.0
367,2016/02/26,310.0,315.885,317.0,24300,318.0,310.0
368,2016/02/29,307.0,305.028,313.0,31800,318.0,293.0
369,2016/03/01,307.0,307.188,304.0,9600,314.0,302.0
370,2016/03/02,312.0,313.584,310.0,17800,320.0,310.0
371,2016/03/03,324.0,323.595,315.0,30600,332.0,315.0
372,2016/03/04,325.0,325.856,325.0,13200,328.0,323.0
373,2016/03/07,340.0,333.902,330.0,62100,345.0,325.0
374,2016/03/08,360.0,345.967,346.0,128000,362.0,329.0
375,2016/03/09,387.0,367.894,363.0,169500,387.0,336.0
376,2016/03/10,385.0,389.746,394.0,97200,395.0,383.0
377,2016/03/11,380.0,376.909,375.0,36200,387.0,366.0
378,2016/03/14,384.0,386.242,388.0,42100,390.0,382.0
379,2016/03/15,384.0,391.405,387.0,76600,399.0,378.0
380,2016/03/16,382.0,385.173,386.0,32400,395.0,381.0
381,2016/03/17,380.0,379.028,380.0,28900,386.0,370.0
382,2016/03/18,373.0,370.579,379.0,19700,379.0,366.0
383,2016/03/22,374.0,371.058,371.0,27700,374.0,365.0
384,2016/03/23,370.0,373.494,375.0,18000,377.0,368.0
385,2016/03/24,369.0,370.567,375.0,17300,375.0,368.0
386,2016/03/25,369.0,369.604,370.0,14400,375.0,366.0
387,2016/03/28,365.0,369.949,375.0,25500,380.0,363.0
388,2016/03/29,364.0,367.078,365.0,28300,373.0,363.0
389,2016/03/30,358.0,361.702,367.0,27200,368.0,357.0
390,2016/03/31,368.0,367.661,362.0,38600,376.0,359.0
391,2016/04/01,350.0,357.939,370.0,45900,372.0,349.0
392,2016/04/04,353.0,352.686,357.0,10200,358.0,348.0
393,2016/04/05,329.0,331.609,353.0,52400,353.0,322.0
394,2016/04/06,320.0,320.143,321.0,34300,326.0,312.0
395,2016/04/07,325.0,328.401,325.0,17700,335.0,323.0
396,2016/04/08,327.0,321.417,319.0,17500,331.0,317.0
397,2016/04/11,340.0,339.751,337.0,18100,348.0,330.0
398,2016/04/12,335.0,334.808,340.0,18200,341.0,332.0
399,2016/04/13,344.0,340.711,335.0,22800,348.0,335.0
400,2016/04/14,355.0,352.325,346.0,32300,358.0,345.0
401,2016/04/15,350.0,347.036,352.0,8300,352.0,344.0
402,2016/04/18,345.0,338.629,337.0,17000,346.0,334.0
403,2016/04/19,337.0,339.755,353.0,40000,353.0,335.0
404,2016/04/20,345.0,338.764,345.0,90700,355.0,330.0
405,2016/04/21,362.0,381.539,353.0,771900,424.0,331.0
406,2016/04/22,367.0,362.723,363.0,105500,375.0,350.0
407,2016/04/25,382.0,384.77,380.0,190100,394.0,363.0
408,2016/04/26,353.0,365.353,385.0,149200,392.0,348.0
409,2016/04/27,347.0,349.253,356.0,66000,362.0,340.0
410,2016/04/28,328.0,334.291,349.0,181400,353.0,328.0
411,2016/05/02,338.0,334.172,325.0,55900,344.0,320.0
412,2016/05/06,344.0,345.002,346.0,44700,352.0,340.0
413,2016/05/09,366.0,355.446,350.0,127400,366.0,343.0
414,2016/05/10,355.0,359.664,364.0,37500,369.0,353.0
415,2016/05/11,367.0,366.509,368.0,85200,374.0,359.0
416,2016/05/12,350.0,352.484,363.0,84600,368.0,343.0
417,2016/05/13,357.0,351.332,348.0,44300,359.0,347.0
418,2016/05/16,369.0,368.391,357.0,121600,380.0,355.0
419,2016/05/17,334.0,333.426,341.0,283800,343.0,325.0
420,2016/05/18,347.0,330.236,333.0,214000,351.0,319.0
421,2016/05/19,355.0,352.595,363.0,252000,365.0,341.0
422,2016/05/20,348.0,346.821,350.0,108400,356.0,340.0
423,2016/05/23,363.0,358.667,355.0,178200,367.0,350.0
424,2016/05/24,377.0,382.992,364.0,544400,401.0,364.0
425,2016/05/25,388.0,386.633,386.0,128100,393.0,380.0
426,2016/05/26,379.0,385.061,395.0,119100,397.0,377.0
427,2016/05/27,393.0,388.52,380.0,125900,398.0,374.0
428,2016/05/30,410.0,406.893,400.0,358600,416.0,399.0
429,2016/05/31,400.0,403.156,410.0,94700,410.0,400.0
430,2016/06/01,397.0,398.389,392.0,157600,409.0,392.0
431,2016/06/02,380.0,381.272,395.0,158400,396.0,368.0
432,2016/06/03,387.0,386.901,382.0,57700,392.0,382.0
433,2016/06/06,381.0,376.808,375.0,69900,387.0,372.0
434,2016/06/07,393.0,390.986,380.0,110100,402.0,377.0
435,2016/06/08,390.0,392.715,393.0,78300,401.0,388.0
436,2016/06/09,377.0,382.843,393.0,95700,393.0,377.0
437,2016/06/10,409.0,398.814,383.0,417700,415.0,382.0
438,2016/06/13,397.0,428.045,432.0,950500,467.0,387.0
439,2016/06/14,364.0,368.419,385.0,338600,385.0,349.0
440,2016/06/15,364.0,363.674,356.0,147900,375.0,356.0
441,2016/06/16,332.0,344.197,371.0,241000,371.0,325.0
442,2016/06/17,342.0,341.511,340.0,77900,350.0,337.0
443,2016/06/20,357.0,359.514,356.0,94600,368.0,352.0
444,2016/06/21,356.0,355.294,357.0,105900,367.0,346.0
445,2016/06/22,356.0,354.287,360.0,54100,360.0,350.0
446,2016/06/23,348.0,344.743,350.0,83800,350.0,339.0
447,2016/06/24,314.0,325.304,356.0,255500,360.0,291.0
448,2016/06/27,340.0,339.562,330.0,115700,346.0,330.0
449,2016/06/28,355.0,349.331,332.0,143100,365.0,328.0
450,2016/06/29,378.0,374.274,362.0,239800,384.0,358.0
451,2016/06/30,375.0,384.808,386.0,173400,395.0,371.0
452,2016/07/01,384.0,379.73,375.0,84900,387.0,374.0
453,2016/07/04,390.0,389.599,390.0,76000,396.0,386.0
454,2016/07/05,387.0,385.237,385.0,50200,389.0,383.0
455,2016/07/06,382.0,376.785,375.0,66600,382.0,365.0
456,2016/07/07,372.0,375.579,380.0,37500,380.0,370.0
457,2016/07/08,361.0,397.477,377.0,801600,432.0,360.0
458,2016/07/11,405.0,394.54,381.0,409500,409.0,376.0
459,2016/07/12,409.0,415.815,420.0,338500,432.0,402.0
460,2016/07/13,406.0,411.928,419.0,164200,426.0,402.0
461,2016/07/14,413.0,405.627,407.0,120600,418.0,398.0
462,2016/07/15,392.0,401.744,413.0,111700,413.0,392.0
463,2016/07/19,369.0,374.878,383.0,124200,384.0,367.0
464,2016/07/20,375.0,372.963,370.0,49000,380.0,368.0
465,2016/07/21,369.0,371.244,378.0,54000,378.0,366.0
466,2016/07/22,363.0,362.247,370.0,36100,370.0,359.0
467,2016/07/25,366.0,365.116,371.0,34500,371.0,359.0
468,2016/07/26,359.0,361.03,362.0,26900,366.0,358.0
469,2016/07/27,363.0,367.615,367.0,57100,375.0,359.0
470,2016/07/28,356.0,356.796,370.0,52800,370.0,351.0
471,2016/07/29,356.0,350.762,362.0,88400,363.0,341.0
472,2016/08/01,360.0,361.247,363.0,21500,364.0,356.0
473,2016/08/02,370.0,363.828,366.0,34300,370.0,358.0
474,2016/08/03,367.0,369.073,370.0,48200,374.0,364.0
475,2016/08/04,371.0,369.543,372.0,24500,373.0,366.0
476,2016/08/05,378.0,380.867,371.0,178000,388.0,367.0
477,2016/08/08,382.0,383.852,381.0,49900,390.0,380.0
478,2016/08/09,398.0,391.945,388.0,85800,399.0,383.0
479,2016/08/10,409.0,411.293,399.0,758700,422.0,393.0
480,2016/08/12,390.0,389.602,393.0,198100,401.0,376.0
481,2016/08/15,389.0,391.652,390.0,141400,401.0,382.0
482,2016/08/16,346.0,346.421,341.0,471100,359.0,337.0
483,2016/08/17,341.0,342.432,345.0,111700,349.0,339.0
484,2016/08/18,325.0,331.207,340.0,101700,341.0,325.0
485,2016/08/19,330.0,330.48,330.0,36500,333.0,329.0
486,2016/08/22,334.0,331.749,332.0,19100,334.0,330.0
487,2016/08/23,334.0,333.575,333.0,22800,336.0,331.0
488,2016/08/24,331.0,332.048,332.0,35500,334.0,331.0
489,2016/08/25,332.0,329.833,333.0,28100,333.0,327.0
490,2016/08/26,328.0,326.194,332.0,31500,332.0,324.0
491,2016/08/29,322.0,323.481,328.0,31800,329.0,321.0
492,2016/08/30,325.0,324.011,322.0,35000,326.0,322.0
493,2016/08/31,328.0,328.218,328.0,22000,335.0,325.0
494,2016/09/01,332.0,327.77,328.0,16100,332.0,325.0
495,2016/09/02,332.0,331.342,332.0,32200,334.0,329.0
496,2016/09/05,330.0,330.431,335.0,28800,335.0,328.0
497,2016/09/06,334.0,334.522,330.0,61700,345.0,329.0
498,2016/09/07,330.0,332.751,338.0,89900,342.0,328.0
499,2016/09/08,328.0,328.457,330.0,38300,330.0,326.0
500,2016/09/09,331.0,329.21,330.0,57700,331.0,327.0
501,2016/09/12,326.0,326.423,325.0,45600,329.0,325.0
502,2016/09/13,329.0,327.821,328.0,47600,329.0,326.0
503,2016/09/14,325.0,326.734,326.0,30800,329.0,324.0
504,2016/09/15,319.0,321.038,324.0,44600,327.0,318.0
505,2016/09/16,315.0,315.131,320.0,56400,320.0,311.0
506,2016/09/20,313.0,315.329,315.0,38900,318.0,313.0
507,2016/09/21,319.0,316.707,315.0,29700,320.0,313.0
508,2016/09/23,322.0,321.347,321.0,27700,324.0,318.0
509,2016/09/26,320.0,321.319,323.0,25400,324.0,316.0
510,2016/09/27,327.0,324.448,322.0,29500,330.0,319.0
511,2016/09/28,328.0,327.3,327.0,31000,331.0,324.0
512,2016/09/29,332.0,331.455,331.0,26600,333.0,328.0
513,2016/09/30,330.0,326.773,330.0,43200,332.0,323.0
514,2016/10/03,327.0,326.473,330.0,20300,330.0,323.0
515,2016/10/04,328.0,327.699,328.0,36900,331.0,324.0
516,2016/10/05,327.0,326.852,326.0,27100,330.0,323.0
517,2016/10/06,331.0,331.673,329.0,40300,334.0,329.0
518,2016/10/07,327.0,327.981,331.0,43100,332.0,325.0
519,2016/10/11,328.0,326.154,326.0,24100,328.0,324.0
520,2016/10/12,325.0,325.034,328.0,32300,328.0,322.0
521,2016/10/13,323.0,324.05,324.0,38200,326.0,322.0
522,2016/10/14,321.0,321.144,324.0,38100,324.0,319.0
523,2016/10/17,324.0,322.702,323.0,20800,324.0,321.0
524,2016/10/18,330.0,326.261,322.0,44900,332.0,322.0
525,2016/10/19,329.0,328.98,331.0,40000,331.0,327.0
526,2016/10/20,332.0,329.41,330.0,49300,332.0,325.0
527,2016/10/21,329.0,330.918,333.0,50200,334.0,328.0
528,2016/10/24,334.0,331.622,329.0,35700,334.0,329.0
529,2016/10/25,330.0,332.383,335.0,32900,335.0,330.0
530,2016/10/26,333.0,328.852,329.0,23700,333.0,325.0
531,2016/10/27,332.0,330.895,329.0,19100,333.0,329.0
532,2016/10/28,333.0,331.352,332.0,17600,333.0,329.0
533,2016/10/31,331.0,331.018,332.0,44900,333.0,329.0
534,2016/11/01,327.0,327.58,330.0,26400,330.0,325.0
535,2016/11/02,318.0,321.085,324.0,66000,328.0,317.0
536,2016/11/04,311.0,313.343,316.0,45200,317.0,310.0
537,2016/11/07,316.0,315.243,316.0,41600,318.0,312.0
538,2016/11/08,314.0,316.218,319.0,20600,319.0,314.0
539,2016/11/09,303.0,304.628,315.0,86700,317.0,298.0
540,2016/11/10,316.0,315.71,312.0,31400,320.0,312.0
541,2016/11/11,317.0,316.57,320.0,17200,320.0,314.0
542,2016/11/14,317.0,317.617,317.0,18000,321.0,315.0
543,2016/11/15,323.0,321.801,320.0,77700,327.0,320.0
544,2016/11/16,326.0,325.697,325.0,21100,328.0,323.0
545,2016/11/17,324.0,324.749,324.0,31500,327.0,323.0
546,2016/11/18,327.0,327.933,330.0,35600,330.0,324.0
547,2016/11/21,330.0,331.452,331.0,128100,332.0,328.0
548,2016/11/22,334.0,332.686,333.0,62700,335.0,330.0
549,2016/11/24,345.0,341.596,335.0,390900,351.0,333.0
550,2016/11/25,341.0,345.2,345.0,168100,351.0,341.0
551,2016/11/28,358.0,352.686,348.0,103100,359.0,344.0
552,2016/11/29,351.0,351.981,356.0,62100,356.0,350.0
553,2016/11/30,355.0,352.566,351.0,46100,356.0,350.0
554,2016/12/01,344.0,349.576,355.0,44600,357.0,344.0
555,2016/12/02,344.0,345.644,348.0,37600,349.0,344.0
556,2016/12/05,350.0,347.551,344.0,38300,354.0,342.0
557,2016/12/06,358.0,352.829,353.0,35600,358.0,348.0
558,2016/12/07,352.0,352.151,355.0,32500,357.0,348.0
559,2016/12/08,351.0,348.237,350.0,43400,352.0,345.0
560,2016/12/09,351.0,349.321,349.0,60800,351.0,345.0
561,2016/12/12,365.0,359.15,350.0,177800,365.0,348.0
562,2016/12/13,367.0,367.147,365.0,95000,370.0,362.0
563,2016/12/14,373.0,375.237,378.0,300200,380.0,364.0
564,2016/12/15,368.0,371.774,373.0,59400,380.0,366.0
565,2016/12/16,364.0,364.77,368.0,86500,371.0,361.0
566,2016/12/19,369.0,369.431,370.0,72600,373.0,365.0
567,2016/12/20,368.0,367.42,367.0,21900,369.0,365.0
568,2016/12/21,374.0,372.032,368.0,107800,377.0,368.0
569,2016/12/22,374.0,373.136,377.0,40500,377.0,370.0
570,2016/12/26,380.0,377.14,377.0,86500,380.0,372.0
571,2016/12/27,376.0,377.282,381.0,130600,381.0,373.0
572,2016/12/28,374.0,373.47,371.0,50600,379.0,369.0
573,2016/12/29,367.0,368.75,374.0,84300,374.0,365.0
574,2016/12/30,359.0,357.54,363.0,75000,363.0,351.0
575,2017/01/04,367.0,365.494,361.0,44900,370.0,361.0
576,2017/01/05,368.0,369.292,369.0,33200,371.0,366.0
577,2017/01/06,371.0,370.935,375.0,33800,375.0,367.0
578,2017/01/10,366.0,368.932,373.0,50200,373.0,366.0
579,2017/01/11,367.0,366.902,366.0,38600,369.0,366.0
580,2017/01/12,364.0,364.133,365.0,29300,365.0,362.0
581,2017/01/13,370.0,365.025,361.0,60100,371.0,358.0
582,2017/01/16,367.0,368.818,370.0,34100,372.0,366.0
583,2017/01/17,361.0,363.326,371.0,45400,371.0,359.0
584,2017/01/18,359.0,358.163,360.0,25100,360.0,357.0
585,2017/01/19,356.0,358.214,360.0,26700,363.0,356.0
586,2017/01/20,355.0,354.927,355.0,23200,357.0,353.0
587,2017/01/23,356.0,355.981,359.0,26200,359.0,355.0
588,2017/01/24,362.0,359.168,359.0,18500,362.0,357.0
589,2017/01/25,363.0,361.711,365.0,43600,365.0,357.0
590,2017/01/26,373.0,368.382,365.0,103300,373.0,364.0
591,2017/01/27,368.0,371.964,374.0,101200,375.0,367.0
592,2017/01/30,366.0,365.707,371.0,33400,373.0,363.0
593,2017/01/31,366.0,364.382,364.0,32500,367.0,360.0
594,2017/02/01,361.0,364.559,366.0,35400,368.0,361.0
595,2017/02/02,366.0,366.726,365.0,48900,372.0,363.0
596,2017/02/03,364.0,365.341,367.0,29300,368.0,361.0
597,2017/02/06,369.0,368.631,366.0,36600,371.0,366.0
598,2017/02/07,372.0,370.043,371.0,14000,372.0,368.0
599,2017/02/08,371.0,370.071,371.0,21200,371.0,368.0
600,2017/02/09,366.0,364.416,371.0,62200,371.0,355.0
601,2017/02/10,367.0,365.602,363.0,24600,368.0,363.0
602,2017/02/13,373.0,370.221,367.0,66500,373.0,366.0
603,2017/02/14,368.0,371.086,370.0,55800,373.0,368.0
604,2017/02/15,419.0,424.079,391.0,2641600,445.0,386.0
605,2017/02/16,439.0,430.601,425.0,782700,441.0,419.0
606,2017/02/17,437.0,440.115,431.0,629300,453.0,426.0
607,2017/02/20,467.0,455.543,450.0,723400,473.0,431.0
608,2017/02/21,477.0,465.693,469.0,402600,478.0,453.0
609,2017/02/22,485.0,478.926,480.0,326000,492.0,469.0
610,2017/02/23,481.0,480.997,488.0,170800,489.0,474.0
611,2017/02/24,488.0,479.881,477.0,198700,495.0,466.0
612,2017/02/27,514.0,499.676,491.0,408700,515.0,483.0
613,2017/02/28,505.0,513.235,510.0,261400,523.0,505.0
614,2017/03/01,489.0,487.005,497.0,206300,498.0,477.0
615,2017/03/02,497.0,496.087,487.0,308800,510.0,478.0
616,2017/03/03,523.0,514.329,497.0,236900,525.0,496.0
617,2017/03/06,540.0,536.766,528.0,371300,547.0,525.0
618,2017/03/07,527.0,529.155,539.0,155600,539.0,523.0
619,2017/03/08,515.0,520.514,530.0,75500,530.0,513.0
620,2017/03/09,545.0,529.515,508.0,230300,547.0,504.0
621,2017/03/10,542.0,542.528,545.0,197400,549.0,529.0
622,2017/03/13,521.0,527.876,542.0,162300,542.0,514.0
623,2017/03/14,527.0,517.829,512.0,151800,533.0,507.0
624,2017/03/15,502.0,506.758,521.0,165800,522.0,485.0
625,2017/03/16,527.0,525.526,502.0,234600,539.0,500.0
626,2017/03/17,523.0,522.414,525.0,122600,530.0,514.0
627,2017/03/21,531.0,531.346,523.0,108000,537.0,519.0
628,2017/03/22,517.0,522.076,525.0,126300,529.0,513.0
629,2017/03/23,518.0,512.207,511.0,109900,525.0,505.0
630,2017/03/24,536.0,524.488,510.0,94400,538.0,510.0
631,2017/03/27,524.0,527.771,534.0,86800,534.0,520.0
632,2017/03/28,563.0,549.325,523.0,466100,567.0,523.0
633,2017/03/29,593.0,576.355,566.0,473200,596.0,547.0
634,2017/03/30,595.0,597.302,600.0,354500,607.0,586.0
635,2017/03/31,620.0,610.169,599.0,304900,625.0,587.0
636,2017/04/03,616.0,618.186,622.0,253600,629.0,608.0
637,2017/04/04,594.0,609.253,620.0,587200,645.0,565.0
638,2017/04/05,620.0,599.822,593.0,274200,621.0,580.0
639,2017/04/06,601.0,597.373,615.0,234600,620.0,585.0
640,2017/04/07,597.0,600.316,600.0,169500,619.0,585.0
641,2017/04/10,602.0,602.869,597.0,100500,609.0,594.0
642,2017/04/11,585.0,589.043,595.0,113000,600.0,582.0
643,2017/04/12,556.0,556.536,573.0,220200,576.0,537.0
644,2017/04/13,563.0,561.818,546.0,113300,578.0,541.0
645,2017/04/14,552.0,562.427,570.0,95700,578.0,544.0
646,2017/04/17,563.0,561.184,552.0,54800,571.0,550.0
647,2017/04/18,572.0,578.272,578.0,92200,591.0,564.0
648,2017/04/19,578.0,577.75,572.0,139000,587.0,566.0
649,2017/04/20,581.0,582.761,586.0,66000,590.0,577.0
650,2017/04/21,572.0,570.029,588.0,103100,588.0,556.0
651,2017/04/24,565.0,572.374,572.0,86700,587.0,564.0
652,2017/04/25,571.0,567.251,570.0,70100,573.0,559.0
653,2017/04/26,588.0,585.969,575.0,122300,595.0,575.0
654,2017/04/27,592.0,582.82,583.0,78500,592.0,575.0
655,2017/04/28,598.0,611.426,592.0,339100,623.0,591.0
656,2017/05/01,586.0,588.684,588.0,168700,602.0,583.0
657,2017/05/02,590.0,586.888,595.0,78500,595.0,582.0
658,2017/05/08,597.0,600.518,614.0,119300,614.0,592.0
659,2017/05/09,591.0,593.582,600.0,94800,610.0,585.0
660,2017/05/10,595.0,595.925,590.0,79000,603.0,588.0
661,2017/05/11,601.0,603.475,596.0,79200,612.0,594.0
662,2017/05/12,607.0,610.51,599.0,165800,623.0,592.0
663,2017/05/15,617.0,617.487,617.0,220200,628.0,609.0
664,2017/05/16,666.0,679.417,660.0,960500,709.0,660.0
665,2017/05/17,715.0,693.372,662.0,502000,717.0,662.0
666,2017/05/18,720.0,712.261,699.0,366000,728.0,691.0
667,2017/05/19,729.0,724.728,735.0,309400,749.0,705.0
668,2017/05/22,761.0,747.249,749.0,351900,767.0,718.0
669,2017/05/23,766.0,771.622,761.0,368300,781.0,755.0
670,2017/05/24,748.0,756.449,770.0,251900,780.0,734.0
671,2017/05/25,748.0,749.197,752.0,112200,762.0,736.0
672,2017/05/26,721.0,729.044,744.0,170300,744.0,718.0
673,2017/05/29,707.0,711.669,706.0,138900,727.0,700.0
674,2017/05/30,725.0,714.424,703.0,130000,735.0,699.0
675,2017/05/31,716.0,718.333,725.0,118500,738.0,702.0
676,2017/06/01,758.0,752.413,741.0,182600,765.0,741.0
677,2017/06/02,880.0,847.107,784.0,1054100,883.0,782.0
678,2017/06/05,869.0,887.243,920.0,709600,928.0,848.0
679,2017/06/06,880.0,872.749,884.0,320400,898.0,835.0
680,2017/06/07,919.0,920.149,881.0,508300,946.0,881.0
681,2017/06/08,903.0,918.997,932.0,316100,944.0,896.0
682,2017/06/09,1018.0,980.488,920.0,977500,1025.0,913.0
683,2017/06/12,940.0,954.959,982.0,675200,982.0,936.0
684,2017/06/13,916.0,910.008,928.0,451800,931.0,884.0
685,2017/06/14,905.0,920.896,931.0,291300,957.0,893.0
686,2017/06/15,915.0,917.51,912.0,254700,941.0,899.0
687,2017/06/16,920.0,926.811,929.0,230700,948.0,910.0
688,2017/06/19,892.0,909.413,920.0,267100,941.0,892.0
689,2017/06/20,875.0,879.91,896.0,320600,904.0,865.0
690,2017/06/21,867.0,881.7,869.0,222200,900.0,865.0
691,2017/06/22,863.0,872.978,872.0,159800,890.0,863.0
692,2017/06/23,856.0,854.873,870.0,269900,877.0,830.0
693,2017/06/26,886.0,873.869,852.0,200000,902.0,849.0
694,2017/06/27,873.0,876.524,894.0,153700,897.0,863.0
695,2017/06/28,838.0,850.131,877.0,231400,877.0,835.0
696,2017/06/29,820.0,819.404,834.0,235400,843.0,805.0
697,2017/06/30,825.0,816.914,802.0,174500,831.0,802.0
698,2017/07/03,808.0,816.657,833.0,122300,840.0,806.0
699,2017/07/04,773.0,785.013,810.0,299500,812.0,769.0
700,2017/07/05,787.0,775.457,770.0,208300,791.0,765.0
701,2017/07/06,777.0,787.888,802.0,97700,808.0,775.0
702,2017/07/07,775.0,770.301,769.0,88700,779.0,765.0
703,2017/07/10,799.0,791.342,781.0,138800,803.0,776.0
704,2017/07/11,848.0,836.836,818.0,347700,854.0,808.0
705,2017/07/12,814.0,829.413,857.0,344500,861.0,804.0
706,2017/07/13,810.0,822.406,844.0,269900,846.0,804.0
707,2017/07/14,804.0,801.305,815.0,182800,817.0,791.0
708,2017/07/18,808.0,804.978,800.0,93600,811.0,796.0
709,2017/07/19,843.0,827.95,813.0,174600,843.0,810.0
710,2017/07/20,836.0,831.598,844.0,166600,844.0,822.0
711,2017/07/21,873.0,858.383,845.0,291600,873.0,842.0
712,2017/07/24,861.0,865.463,877.0,232200,880.0,848.0
713,2017/07/25,855.0,851.182,856.0,167900,867.0,838.0
714,2017/07/26,844.0,847.866,859.0,106500,859.0,840.0
715,2017/07/27,827.0,832.147,843.0,140700,850.0,823.0
716,2017/07/28,810.0,813.236,826.0,199400,830.0,800.0
717,2017/07/31,777.0,785.887,810.0,240500,810.0,772.0
718,2017/08/01,750.0,760.704,771.0,257100,788.0,736.0
719,2017/08/02,772.0,769.261,751.0,83200,778.0,751.0
720,2017/08/03,751.0,757.903,770.0,88400,770.0,745.0
721,2017/08/04,770.0,760.765,749.0,89000,775.0,740.0
722,2017/08/07,764.0,766.252,784.0,88100,785.0,752.0
723,2017/08/08,762.0,767.466,769.0,71400,777.0,760.0
724,2017/08/09,740.0,744.364,764.0,150400,764.0,733.0
725,2017/08/10,726.0,730.173,740.0,158600,745.0,705.0
726,2017/08/14,745.0,710.096,676.0,336300,747.0,673.0
727,2017/08/15,634.0,613.674,595.0,1999900,670.0,595.0
728,2017/08/16,609.0,616.688,634.0,817500,655.0,593.0
729,2017/08/17,608.0,600.572,611.0,491200,611.0,584.0
730,2017/08/18,591.0,595.726,600.0,355900,607.0,588.0
731,2017/08/21,580.0,583.64,585.0,263000,590.0,578.0
732,2017/08/22,593.0,589.745,578.0,243200,598.0,576.0
733,2017/08/23,599.0,600.339,610.0,294600,611.0,589.0
734,2017/08/24,602.0,598.1,589.0,230100,607.0,587.0
735,2017/08/25,591.0,595.486,600.0,185500,604.0,589.0
736,2017/08/28,605.0,604.555,589.0,273700,625.0,585.0
737,2017/08/29,593.0,596.657,598.0,173400,604.0,589.0
738,2017/08/30,594.0,595.382,598.0,184600,602.0,585.0
739,2017/08/31,601.0,596.955,596.0,124400,601.0,592.0
740,2017/09/01,599.0,597.33,596.0,159900,604.0,593.0
741,2017/09/04,585.0,582.773,590.0,312400,590.0,573.0
742,2017/09/05,562.0,570.431,585.0,377300,594.0,560.0
743,2017/09/06,559.0,558.571,551.0,210800,570.0,545.0
744,2017/09/07,561.0,561.374,563.0,183000,576.0,551.0
745,2017/09/08,551.0,552.348,558.0,125700,568.0,545.0
746,2017/09/11,563.0,558.223,549.0,142400,568.0,549.0
747,2017/09/12,576.0,573.523,567.0,131300,583.0,562.0
748,2017/09/13,599.0,593.573,585.0,277700,603.0,579.0
749,2017/09/14,558.0,572.898,606.0,658700,606.0,558.0
750,2017/09/15,582.0,577.05,559.0,317300,590.0,559.0
751,2017/09/19,604.0,609.855,598.0,601900,624.0,597.0
752,2017/09/20,586.0,594.165,604.0,316500,607.0,583.0
753,2017/09/21,597.0,597.228,596.0,123100,602.0,593.0
754,2017/09/22,582.0,585.69,602.0,251400,602.0,576.0
755,2017/09/25,639.0,614.794,590.0,603300,639.0,590.0
756,2017/09/26,596.0,610.386,630.0,652300,638.0,592.0
757,2017/09/27,609.0,604.097,598.0,284700,613.0,594.0
758,2017/09/28,612.0,609.514,613.0,281900,618.0,602.0
759,2017/09/29,621.0,621.334,608.0,321300,634.0,605.0
760,2017/10/02,626.0,634.12,624.0,293900,648.0,624.0
761,2017/10/03,633.0,628.594,634.0,174000,638.0,619.0
762,2017/10/04,627.0,631.539,630.0,141300,644.0,625.0
763,2017/10/05,610.0,619.809,632.0,317800,638.0,607.0
764,2017/10/06,612.0,610.927,612.0,162700,622.0,604.0
765,2017/10/10,609.0,605.778,615.0,253600,616.0,598.0
766,2017/10/11,598.0,602.1,609.0,157900,609.0,598.0
767,2017/10/12,620.0,618.238,606.0,299000,628.0,603.0
768,2017/10/13,613.0,614.304,615.0,144100,619.0,608.0
769,2017/10/16,605.0,605.46,611.0,217400,614.0,601.0
770,2017/10/17,602.0,606.397,603.0,160900,614.0,602.0
771,2017/10/18,612.0,609.036,604.0,110100,612.0,602.0
772,2017/10/19,620.0,623.118,612.0,231900,633.0,612.0
773,2017/10/20,627.0,621.525,620.0,148600,629.0,614.0
774,2017/10/23,659.0,649.184,635.0,408900,662.0,631.0
775,2017/10/24,643.0,646.688,656.0,234500,659.0,636.0
776,2017/10/25,625.0,629.505,646.0,276700,646.0,622.0
777,2017/10/26,636.0,635.009,622.0,141300,643.0,622.0
778,2017/10/27,644.0,640.582,638.0,96000,645.0,632.0
779,2017/10/30,654.0,655.977,645.0,211100,667.0,645.0
780,2017/10/31,653.0,650.21,650.0,104200,658.0,643.0
781,2017/11/01,660.0,656.529,657.0,147900,663.0,650.0
782,2017/11/02,682.0,672.551,662.0,320100,686.0,653.0
783,2017/11/06,672.0,672.846,687.0,244000,688.0,659.0
784,2017/11/07,673.0,669.099,665.0,117000,677.0,660.0
785,2017/11/08,689.0,677.13,669.0,132700,690.0,665.0
786,2017/11/09,655.0,666.35,689.0,407200,689.0,633.0
787,2017/11/10,665.0,655.327,645.0,104600,665.0,643.0
788,2017/11/13,669.0,669.36,660.0,152700,677.0,659.0
789,2017/11/14,669.0,667.18,666.0,162300,672.0,663.0
790,2017/11/15,569.0,569.0,569.0,23900,569.0,569.0
791,2017/11/16,506.0,495.768,499.0,2003400,507.0,475.0
792,2017/11/17,519.0,517.766,524.0,428500,526.0,510.0
793,2017/11/20,519.0,522.75,520.0,246500,536.0,515.0
794,2017/11/21,511.0,513.005,519.0,264800,522.0,505.0
795,2017/11/22,510.0,511.413,517.0,160000,517.0,506.0
796,2017/11/24,514.0,514.69,507.0,185400,526.0,507.0
797,2017/11/27,510.0,510.53,512.0,160900,515.0,507.0
798,2017/11/28,509.0,508.62,513.0,138000,517.0,505.0
799,2017/11/29,511.0,510.078,514.0,176100,514.0,505.0
800,2017/11/30,513.0,510.157,514.0,137300,514.0,507.0
801,2017/12/01,531.0,523.267,512.0,374400,539.0,508.0
802,2017/12/04,507.0,513.699,525.0,306300,529.0,507.0
803,2017/12/05,506.0,505.955,507.0,204100,511.0,501.0
804,2017/12/06,505.0,505.715,505.0,146900,510.0,502.0
805,2017/12/07,513.0,511.32,504.0,175300,515.0,504.0
806,2017/12/08,511.0,511.78,513.0,105200,517.0,508.0
807,2017/12/11,512.0,513.279,511.0,166900,520.0,509.0
808,2017/12/12,511.0,513.605,510.0,226900,524.0,510.0
809,2017/12/13,514.0,513.644,512.0,156900,517.0,510.0
810,2017/12/14,520.0,522.017,517.0,162900,534.0,517.0
811,2017/12/15,513.0,516.975,518.0,146500,525.0,513.0
812,2017/12/18,520.0,518.109,516.0,130300,524.0,514.0
813,2017/12/19,534.0,532.413,520.0,277100,548.0,520.0
814,2017/12/20,525.0,528.133,530.0,158200,537.0,520.0
815,2017/12/21,533.0,533.672,525.0,94900,541.0,525.0
816,2017/12/22,527.0,532.946,536.0,99000,541.0,527.0
817,2017/12/25,543.0,541.532,536.0,181400,550.0,532.0
818,2017/12/26,559.0,546.623,537.0,267900,559.0,537.0
819,2017/12/27,558.0,555.308,555.0,117700,562.0,550.0
820,2017/12/28,568.0,578.954,563.0,366500,595.0,561.0
821,2017/12/29,560.0,564.312,568.0,172200,572.0,558.0
822,2018/01/04,557.0,555.114,564.0,146100,564.0,551.0
823,2018/01/05,555.0,556.375,563.0,101000,564.0,551.0
824,2018/01/09,549.0,549.267,556.0,153100,557.0,543.0
825,2018/01/10,555.0,555.359,548.0,108100,561.0,547.0
826,2018/01/11,552.0,555.292,550.0,79900,561.0,550.0
827,2018/01/12,551.0,554.311,554.0,75200,559.0,551.0
828,2018/01/15,574.0,564.258,559.0,143000,579.0,551.0
829,2018/01/16,564.0,567.895,570.0,70600,574.0,563.0
830,2018/01/17,557.0,560.477,559.0,69400,568.0,556.0
831,2018/01/18,559.0,561.34,562.0,77700,571.0,554.0
832,2018/01/19,572.0,563.159,566.0,110700,572.0,557.0
833,2018/01/22,620.0,612.525,598.0,456700,625.0,596.0
834,2018/01/23,621.0,619.886,621.0,176600,630.0,609.0
835,2018/01/24,618.0,614.5,624.0,131900,624.0,609.0
836,2018/01/25,612.0,614.104,620.0,115000,620.0,610.0
837,2018/01/26,608.0,608.408,615.0,80900,615.0,604.0
838,2018/01/29,593.0,599.069,610.0,152700,610.0,592.0
839,2018/01/30,587.0,588.679,588.0,169100,603.0,580.0
840,2018/01/31,584.0,585.041,580.0,96800,594.0,576.0
841,2018/02/01,604.0,599.239,587.0,165200,607.0,584.0
842,2018/02/02,605.0,606.713,608.0,160400,624.0,594.0
843,2018/02/05,582.0,582.376,590.0,190600,594.0,573.0
844,2018/02/06,522.0,523.911,540.0,448400,557.0,497.0
845,2018/02/07,524.0,539.577,555.0,235300,556.0,522.0
846,2018/02/08,540.0,537.827,529.0,114200,548.0,526.0
847,2018/02/09,532.0,516.335,507.0,117500,533.0,506.0
848,2018/02/13,530.0,533.487,541.0,84800,542.0,524.0
849,2018/02/14,522.0,513.531,535.0,196200,542.0,500.0
850,2018/02/15,535.0,517.661,521.0,266400,540.0,494.0
851,2018/02/16,543.0,539.966,545.0,150100,550.0,531.0
852,2018/02/19,593.0,572.633,541.0,277800,593.0,538.0
853,2018/02/20,594.0,593.583,592.0,256500,610.0,579.0
854,2018/02/21,604.0,600.288,592.0,152500,609.0,585.0
855,2018/02/22,595.0,595.729,597.0,103300,607.0,589.0
856,2018/02/23,595.0,592.854,599.0,91200,599.0,586.0
857,2018/02/26,619.0,617.929,592.0,340100,638.0,592.0
858,2018/02/27,584.0,593.744,616.0,316600,619.0,583.0
859,2018/02/28,596.0,594.467,584.0,152200,606.0,584.0
860,2018/03/01,598.0,603.395,590.0,153300,616.0,590.0
861,2018/03/02,597.0,589.351,585.0,118200,600.0,582.0
862,2018/03/05,568.0,577.202,591.0,142700,599.0,563.0
863,2018/03/06,584.0,581.063,575.0,60100,586.0,575.0
864,2018/03/07,574.0,576.714,574.0,92400,588.0,565.0
865,2018/03/08,571.0,576.432,582.0,69500,587.0,569.0
866,2018/03/09,571.0,574.272,585.0,71300,585.0,567.0
867,2018/03/12,566.0,569.493,578.0,56600,579.0,563.0
868,2018/03/13,577.0,575.014,565.0,44100,579.0,565.0
869,2018/03/14,582.0,580.61,572.0,45600,584.0,572.0
870,2018/03/15,599.0,589.294,587.0,87100,600.0,578.0
871,2018/03/16,582.0,580.997,595.0,148800,595.0,573.0
872,2018/03/19,559.0,567.958,576.0,132200,584.0,555.0
873,2018/03/20,545.0,540.349,539.0,96600,547.0,527.0
874,2018/03/22,596.0,593.142,595.0,1032500,605.0,581.0
875,2018/03/23,602.0,588.332,576.0,400300,605.0,566.0
876,2018/03/26,592.0,573.577,592.0,395800,600.0,548.0
877,2018/03/27,610.0,605.93,601.0,508900,618.0,590.0
878,2018/03/28,596.0,602.869,605.0,259300,622.0,591.0
879,2018/03/29,638.0,626.534,602.0,504400,641.0,597.0
880,2018/03/30,648.0,649.388,645.0,403000,664.0,638.0
881,2018/04/02,690.0,684.397,659.0,732100,710.0,649.0
882,2018/04/03,711.0,701.492,680.0,588700,724.0,678.0
883,2018/04/04,698.0,703.839,720.0,339100,722.0,688.0
884,2018/04/05,703.0,701.702,708.0,187500,714.0,690.0
885,2018/04/06,712.0,727.957,706.0,546500,752.0,705.0
886,2018/04/09,684.0,699.839,702.0,318300,728.0,679.0
887,2018/04/10,690.0,694.536,680.0,273300,714.0,680.0
888,2018/04/11,726.0,715.113,700.0,411000,728.0,696.0
889,2018/04/12,752.0,743.618,715.0,600800,764.0,715.0
890,2018/04/13,763.0,766.217,755.0,477000,780.0,753.0
891,2018/04/16,740.0,738.05,775.0,407100,775.0,707.0
892,2018/04/17,734.0,725.045,728.0,204500,744.0,705.0
893,2018/04/18,719.0,732.893,740.0,182700,748.0,717.0
894,2018/04/19,717.0,714.741,726.0,209300,726.0,702.0
895,2018/04/20,715.0,732.066,735.0,271100,750.0,714.0
896,2018/04/23,701.0,705.158,712.0,253600,722.0,696.0
897,2018/04/24,700.0,696.765,705.0,185600,711.0,686.0
898,2018/04/25,671.0,679.777,694.0,317500,704.0,668.0
899,2018/04/26,666.0,660.992,670.0,839500,678.0,637.0
900,2018/04/27,632.0,636.758,651.0,412000,657.0,621.0
901,2018/05/01,633.0,635.466,632.0,181100,650.0,626.0
902,2018/05/02,650.0,639.548,631.0,189600,653.0,627.0
903,2018/05/07,641.0,641.081,650.0,179300,657.0,632.0
904,2018/05/08,648.0,645.391,638.0,153400,651.0,635.0
905,2018/05/09,631.0,638.839,644.0,215800,658.0,628.0
906,2018/05/10,629.0,630.007,634.0,98100,635.0,624.0
907,2018/05/11,631.0,629.135,630.0,100900,635.0,624.0
908,2018/05/14,639.0,634.681,630.0,118600,642.0,626.0
909,2018/05/15,644.0,642.634,635.0,184200,649.0,635.0
910,2018/05/16,675.0,668.646,641.0,360800,684.0,641.0
911,2018/05/17,689.0,700.952,700.0,506900,727.0,677.0
912,2018/05/18,696.0,686.122,695.0,300700,700.0,668.0
913,2018/05/21,734.0,723.145,706.0,309300,734.0,701.0
914,2018/05/22,726.0,725.494,735.0,196100,738.0,713.0
915,2018/05/23,709.0,713.005,714.0,215500,733.0,704.0
916,2018/05/24,680.0,688.262,698.0,211600,700.0,676.0
917,2018/05/25,668.0,671.923,674.0,188400,686.0,664.0
918,2018/05/28,689.0,676.785,673.0,104900,689.0,659.0
919,2018/05/29,683.0,678.813,693.0,120400,693.0,668.0
920,2018/05/30,686.0,684.329,671.0,156100,693.0,670.0
921,2018/05/31,686.0,688.295,694.0,89600,697.0,681.0
922,2018/06/01,683.0,682.057,686.0,137700,694.0,672.0
923,2018/06/04,683.0,672.424,689.0,168700,689.0,662.0
924,2018/06/05,670.0,669.899,683.0,122700,683.0,666.0
925,2018/06/06,663.0,663.542,665.0,156200,678.0,655.0
926,2018/06/07,670.0,667.032,656.0,90700,673.0,656.0
927,2018/06/08,688.0,679.099,665.0,126700,689.0,665.0
928,2018/06/11,713.0,712.621,705.0,324100,726.0,699.0
929,2018/06/12,718.0,718.821,717.0,204200,728.0,712.0
930,2018/06/13,730.0,727.126,723.0,207300,733.0,720.0
931,2018/06/14,705.0,710.964,730.0,185200,730.0,700.0
932,2018/06/15,714.0,707.367,707.0,174200,717.0,697.0
933,2018/06/18,702.0,711.608,725.0,223900,728.0,700.0
934,2018/06/19,680.0,686.02,702.0,147500,704.0,672.0
935,2018/06/20,687.0,665.156,674.0,249900,687.0,649.0
936,2018/06/21,705.0,695.084,685.0,158000,709.0,680.0
937,2018/06/22,693.0,696.611,695.0,73800,708.0,691.0
938,2018/06/25,666.0,676.611,691.0,133300,701.0,662.0
939,2018/06/26,652.0,650.938,649.0,160500,660.0,641.0
940,2018/06/27,652.0,650.019,647.0,89800,659.0,644.0
941,2018/06/28,664.0,649.483,650.0,148100,664.0,636.0
942,2018/06/29,702.0,686.75,666.0,214100,702.0,660.0
943,2018/07/02,696.0,706.694,695.0,279200,718.0,691.0
944,2018/07/03,681.0,685.11,695.0,129300,707.0,669.0
945,2018/07/04,638.0,646.606,669.0,186900,669.0,633.0
946,2018/07/05,572.0,592.032,631.0,560100,632.0,569.0
947,2018/07/06,585.0,575.437,570.0,234600,587.0,562.0
948,2018/07/09,584.0,583.72,588.0,140200,593.0,575.0
949,2018/07/10,578.0,581.636,590.0,138000,590.0,577.0
950,2018/07/11,572.0,571.295,582.0,145600,582.0,563.0
951,2018/07/12,586.0,584.867,571.0,125500,593.0,571.0
952,2018/07/13,585.0,583.732,582.0,97300,591.0,580.0
953,2018/07/17,611.0,608.837,604.0,174100,619.0,597.0
954,2018/07/18,614.0,613.008,616.0,93000,618.0,607.0
955,2018/07/19,612.0,612.006,612.0,64000,616.0,606.0
956,2018/07/20,609.0,609.409,607.0,74800,615.0,604.0
957,2018/07/23,607.0,609.904,606.0,58400,615.0,602.0
958,2018/07/24,614.0,614.666,607.0,69800,620.0,605.0
959,2018/07/25,620.0,623.205,620.0,118300,631.0,612.0
960,2018/07/26,614.0,618.888,624.0,77000,627.0,614.0
961,2018/07/27,611.0,612.457,614.0,71400,620.0,606.0
962,2018/07/30,607.0,607.709,615.0,54900,615.0,604.0
963,2018/07/31,601.0,599.879,607.0,84800,607.0,595.0
964,2018/08/01,610.0,605.047,600.0,55700,611.0,599.0
965,2018/08/02,595.0,602.764,608.0,139800,613.0,593.0
966,2018/08/03,579.0,584.234,593.0,86000,600.0,578.0
967,2018/08/06,570.0,573.862,578.0,52100,582.0,569.0
968,2018/08/07,575.0,572.494,570.0,34800,576.0,570.0
969,2018/08/08,594.0,589.03,579.0,76800,596.0,577.0
970,2018/08/09,594.0,591.008,591.0,26600,596.0,585.0
971,2018/08/10,597.0,599.188,594.0,82400,607.0,587.0
972,2018/08/13,551.0,558.715,587.0,173500,587.0,551.0
973,2018/08/14,590.0,581.848,567.0,183600,594.0,561.0
974,2018/08/15,540.0,542.102,545.0,306000,552.0,531.0
975,2018/08/16,531.0,525.564,538.0,187900,538.0,520.0
976,2018/08/17,529.0,532.224,533.0,93900,541.0,526.0
977,2018/08/20,524.0,525.3,524.0,95700,531.0,521.0
978,2018/08/21,516.0,516.398,522.0,94900,523.0,509.0
979,2018/08/22,526.0,519.486,515.0,55100,526.0,514.0
980,2018/08/23,525.0,526.215,526.0,101500,532.0,522.0
981,2018/08/24,545.0,536.506,530.0,94200,547.0,527.0
982,2018/08/27,558.0,554.929,550.0,121700,565.0,547.0
983,2018/08/28,539.0,547.892,562.0,131900,563.0,538.0
984,2018/08/29,550.0,550.487,538.0,70700,557.0,538.0
985,2018/08/30,557.0,553.078,560.0,78000,560.0,543.0
986,2018/08/31,553.0,553.645,554.0,30700,557.0,550.0
987,2018/09/03,533.0,537.079,553.0,103400,553.0,531.0
988,2018/09/04,538.0,533.864,531.0,69000,541.0,528.0
989,2018/09/05,528.0,532.385,534.0,124900,543.0,527.0
990,2018/09/06,535.0,528.463,530.0,89800,536.0,520.0
991,2018/09/07,523.0,522.955,529.0,77100,532.0,519.0
992,2018/09/10,528.0,532.142,520.0,73200,541.0,520.0
993,2018/09/11,525.0,524.363,526.0,57000,532.0,519.0
994,2018/09/12,517.0,519.286,526.0,78600,531.0,512.0
995,2018/09/13,520.0,518.915,512.0,48100,525.0,512.0
996,2018/09/14,523.0,522.963,521.0,64000,529.0,518.0
997,2018/09/18,524.0,527.407,525.0,95400,534.0,521.0
998,2018/09/19,528.0,529.094,526.0,148200,535.0,524.0
999,2018/09/20,529.0,527.966,532.0,64200,533.0,524.0
1000,2018/09/21,531.0,534.905,533.0,191000,543.0,531.0
1001,2018/09/25,538.0,538.226,538.0,102800,544.0,531.0
1002,2018/09/26,547.0,543.765,538.0,90500,549.0,535.0
1003,2018/09/27,529.0,534.638,544.0,95300,544.0,528.0
1004,2018/09/28,533.0,532.363,539.0,82000,539.0,528.0
1005,2018/10/01,532.0,538.218,535.0,182100,547.0,531.0
1006,2018/10/02,523.0,527.841,538.0,179600,539.0,522.0
1007,2018/10/03,523.0,524.393,525.0,97400,530.0,519.0
1008,2018/10/04,524.0,525.592,528.0,63700,531.0,521.0
1009,2018/10/05,512.0,516.175,521.0,93900,523.0,510.0
1010,2018/10/09,502.0,503.713,510.0,109100,512.0,499.0
1011,2018/10/10,516.0,512.286,510.0,58000,519.0,506.0
1012,2018/10/11,493.0,493.441,490.0,132400,504.0,483.0
1013,2018/10/12,507.0,500.746,488.0,86900,512.0,488.0
1014,2018/10/15,497.0,502.594,507.0,74400,513.0,497.0
1015,2018/10/16,498.0,497.39,498.0,45100,506.0,492.0
1016,2018/10/17,504.0,503.811,502.0,70000,510.0,501.0
1017,2018/10/18,498.0,503.515,503.0,65500,511.0,498.0
1018,2018/10/19,492.0,491.031,491.0,71200,496.0,485.0
1019,2018/10/22,504.0,499.32,492.0,52900,510.0,487.0
1020,2018/10/23,499.0,501.35,504.0,62000,508.0,497.0
1021,2018/10/24,502.0,501.38,500.0,59800,509.0,494.0
1022,2018/10/25,461.0,480.005,492.0,217900,497.0,460.0
1023,2018/10/26,438.0,448.557,469.0,237700,474.0,430.0
1024,2018/10/29,426.0,436.368,446.0,120800,453.0,426.0
1025,2018/10/30,450.0,440.776,422.0,146300,455.0,419.0
1026,2018/10/31,467.0,465.994,459.0,116600,474.0,458.0
1027,2018/11/01,465.0,467.775,470.0,104200,476.0,458.0
1028,2018/11/02,480.0,475.441,466.0,74200,481.0,466.0
1029,2018/11/05,475.0,481.328,475.0,161900,490.0,474.0
1030,2018/11/06,472.0,474.64,475.0,58300,480.0,469.0
1031,2018/11/07,478.0,477.763,469.0,90300,484.0,469.0
1032,2018/11/08,477.0,482.04,486.0,76800,490.0,477.0
1033,2018/11/09,480.0,477.643,477.0,78500,483.0,471.0
1034,2018/11/12,467.0,474.743,478.0,89600,486.0,467.0
1035,2018/11/13,465.0,462.362,454.0,77600,474.0,453.0
1036,2018/11/14,458.0,460.445,465.0,95300,469.0,452.0
1037,2018/11/15,427.0,415.713,418.0,302300,431.0,396.0
1038,2018/11/16,410.0,423.224,435.0,110500,435.0,410.0
1039,2018/11/19,415.0,415.122,406.0,67900,423.0,406.0
1040,2018/11/20,405.0,406.221,405.0,90900,412.0,402.0
1041,2018/11/21,404.0,401.367,392.0,85400,413.0,392.0
1042,2018/11/22,408.0,404.594,403.0,105100,413.0,398.0
1043,2018/11/26,412.0,410.292,406.0,42500,417.0,402.0
1044,2018/11/27,412.0,413.668,420.0,28900,420.0,410.0
1045,2018/11/28,424.0,420.542,412.0,71400,427.0,412.0
1046,2018/11/29,428.0,431.77,425.0,83100,439.0,424.0
1047,2018/11/30,432.0,432.314,431.0,52500,437.0,427.0
1048,2018/12/03,442.0,441.258,434.0,70300,445.0,434.0
1049,2018/12/04,423.0,431.427,442.0,62700,446.0,423.0
1050,2018/12/05,416.0,418.357,415.0,63300,426.0,415.0
1051,2018/12/06,408.0,409.696,415.0,66700,415.0,406.0
1052,2018/12/07,402.0,409.297,410.0,106200,423.0,402.0
1053,2018/12/10,388.0,394.847,400.0,144500,405.0,387.0
1054,2018/12/11,380.0,382.77,388.0,118000,395.0,375.0
1055,2018/12/12,379.0,381.707,378.0,166700,392.0,378.0
1056,2018/12/13,404.0,387.735,381.0,189800,406.0,381.0
1057,2018/12/14,392.0,392.862,400.0,135000,405.0,388.0
1058,2018/12/17,386.0,390.143,392.0,88700,395.0,386.0
1059,2018/12/18,346.0,360.724,371.0,206200,372.0,346.0
1060,2018/12/19,351.0,348.748,346.0,108900,358.0,342.0
1061,2018/12/20,340.0,342.723,346.0,128300,352.0,336.0
1062,2018/12/21,329.0,324.714,333.0,158000,337.0,316.0
1063,2018/12/25,299.0,299.354,294.0,213900,308.0,294.0
1064,2018/12/26,309.0,308.605,308.0,108800,318.0,303.0
1065,2018/12/27,339.0,330.377,333.0,105600,340.0,319.0
1066,2018/12/28,333.0,335.116,331.0,90600,342.0,331.0
1067,2019/01/04,319.0,315.439,317.0,50400,320.0,310.0
1068,2019/01/07,339.0,338.326,335.0,60200,343.0,333.0
1069,2019/01/08,347.0,346.176,341.0,68200,351.0,341.0
1070,2019/01/09,340.0,344.283,352.0,35700,353.0,338.0
1071,2019/01/10,329.0,332.637,343.0,46300,343.0,325.0
1072,2019/01/11,336.0,333.933,334.0,47500,339.0,329.0
1073,2019/01/15,347.0,342.576,336.0,30400,348.0,331.0
1074,2019/01/16,340.0,342.443,347.0,39100,349.0,340.0
1075,2019/01/17,349.0,347.666,341.0,40700,353.0,341.0
1076,2019/01/18,350.0,349.882,349.0,32300,355.0,346.0
1077,2019/01/21,347.0,351.664,353.0,47600,357.0,346.0
1078,2019/01/22,345.0,343.711,348.0,26600,349.0,340.0
1079,2019/01/23,343.0,341.503,340.0,18300,345.0,337.0
1080,2019/01/24,343.0,347.094,343.0,29900,353.0,341.0
1081,2019/01/25,355.0,355.333,351.0,48100,361.0,347.0
1082,2019/01/28,350.0,353.568,365.0,69000,365.0,347.0
1083,2019/01/29,352.0,348.135,350.0,51000,352.0,340.0
1084,2019/01/30,345.0,345.406,352.0,53900,352.0,341.0
1085,2019/01/31,360.0,355.537,349.0,53600,360.0,348.0
1086,2019/02/01,354.0,358.454,356.0,79100,369.0,352.0
1087,2019/02/04,364.0,362.276,359.0,40900,366.0,356.0
1088,2019/02/05,371.0,372.632,366.0,61600,381.0,365.0
1089,2019/02/06,369.0,370.528,375.0,46400,377.0,366.0
1090,2019/02/07,360.0,362.915,369.0,42400,369.0,358.0
1091,2019/02/08,347.0,351.095,354.0,40200,358.0,346.0
1092,2019/02/12,361.0,355.663,347.0,48700,367.0,344.0
1093,2019/02/13,366.0,368.026,362.0,45900,372.0,362.0
1094,2019/02/14,365.0,363.689,366.0,59200,367.0,358.0
1095,2019/02/15,378.0,391.158,389.0,339700,410.0,377.0
1096,2019/02/18,421.0,402.233,385.0,236100,421.0,380.0
1097,2019/02/19,423.0,432.281,426.0,291300,450.0,421.0
1098,2019/02/20,429.0,427.368,429.0,120800,440.0,418.0
1099,2019/02/21,434.0,430.115,434.0,62400,434.0,424.0
1100,2019/02/22,432.0,427.814,433.0,47300,433.0,422.0
1101,2019/02/25,446.0,445.666,439.0,107100,452.0,436.0
1102,2019/02/26,439.0,439.978,447.0,74100,447.0,433.0
1103,2019/02/27,440.0,437.715,439.0,56500,442.0,433.0
1104,2019/02/28,430.0,432.931,440.0,40400,440.0,427.0
1105,2019/03/01,420.0,423.921,428.0,73600,429.0,420.0
1106,2019/03/04,421.0,425.569,426.0,159000,432.0,419.0
1107,2019/03/05,416.0,418.456,418.0,56800,424.0,415.0
1108,2019/03/06,416.0,415.491,415.0,37700,419.0,414.0
1109,2019/03/07,409.0,410.348,413.0,77700,416.0,407.0
1110,2019/03/08,394.0,395.419,402.0,76300,404.0,388.0
1111,2019/03/11,393.0,393.099,393.0,57700,401.0,387.0
1112,2019/03/12,399.0,398.042,396.0,50400,402.0,396.0
1113,2019/03/13,394.0,395.423,399.0,29100,402.0,391.0
1114,2019/03/14,388.0,391.388,395.0,63400,402.0,386.0
1115,2019/03/15,390.0,390.812,388.0,44700,394.0,387.0
1116,2019/03/18,399.0,399.32,394.0,74400,404.0,393.0
1117,2019/03/19,395.0,395.542,400.0,41500,400.0,393.0
1118,2019/03/20,401.0,401.976,397.0,45300,406.0,396.0
1119,2019/03/22,402.0,399.811,402.0,24800,402.0,397.0
1120,2019/03/25,395.0,394.272,397.0,55100,398.0,390.0
1121,2019/03/26,400.0,399.825,397.0,56100,403.0,397.0
1122,2019/03/27,419.0,412.041,405.0,73900,421.0,405.0
1123,2019/03/28,411.0,413.769,420.0,47100,420.0,409.0
1124,2019/03/29,411.0,407.704,408.0,56400,413.0,404.0
1125,2019/04/01,411.0,415.974,415.0,57300,421.0,408.0
1126,2019/04/02,409.0,408.469,415.0,25600,415.0,406.0
1127,2019/04/03,415.0,410.947,409.0,39900,415.0,404.0
1128,2019/04/04,417.0,420.431,417.0,48700,425.0,414.0
1129,2019/04/05,415.0,417.58,418.0,36700,422.0,414.0
1130,2019/04/08,406.0,408.463,416.0,54400,416.0,405.0
1131,2019/04/09,405.0,402.784,407.0,53300,408.0,398.0
1132,2019/04/10,400.0,398.678,401.0,60000,402.0,395.0
1133,2019/04/11,394.0,396.094,398.0,26700,399.0,394.0
1134,2019/04/12,392.0,392.219,393.0,34300,395.0,390.0
1135,2019/04/15,397.0,394.209,391.0,48900,397.0,390.0
1136,2019/04/16,395.0,396.749,394.0,33900,401.0,394.0
1137,2019/04/17,399.0,396.589,397.0,24600,400.0,394.0
1138,2019/04/18,386.0,390.227,401.0,95100,401.0,384.0
1139,2019/04/19,386.0,385.742,387.0,29500,391.0,384.0
1140,2019/04/22,387.0,386.891,388.0,32000,392.0,384.0
1141,2019/04/23,378.0,380.385,385.0,65500,386.0,378.0
1142,2019/04/24,380.0,382.994,380.0,35500,389.0,380.0
1143,2019/04/25,403.0,392.182,383.0,136400,403.0,379.0
1144,2019/04/26,399.0,396.342,394.0,70200,403.0,388.0
1145,2019/05/07,396.0,395.998,400.0,46700,400.0,393.0
1146,2019/05/08,391.0,389.437,391.0,37800,394.0,387.0
1147,2019/05/09,382.0,383.265,389.0,54700,389.0,379.0
1148,2019/05/10,386.0,385.74,383.0,45700,392.0,380.0
1149,2019/05/13,378.0,380.754,386.0,28800,390.0,376.0
1150,2019/05/14,375.0,371.618,370.0,71400,376.0,364.0
1151,2019/05/15,396.0,384.299,385.0,124900,397.0,372.0
1152,2019/05/16,362.0,364.201,364.0,170800,374.0,360.0
1153,2019/05/17,374.0,371.091,366.0,63600,376.0,365.0
1154,2019/05/20,365.0,370.836,378.0,51200,383.0,365.0
1155,2019/05/21,358.0,357.827,366.0,61700,366.0,354.0
1156,2019/05/22,362.0,358.924,360.0,34100,363.0,355.0
1157,2019/05/23,346.0,349.403,362.0,114700,364.0,342.0
1158,2019/05/24,353.0,348.594,345.0,33500,355.0,342.0
1159,2019/05/27,368.0,362.227,361.0,55400,368.0,354.0
1160,2019/05/28,361.0,362.515,368.0,45400,368.0,357.0
1161,2019/05/29,358.0,356.73,356.0,28900,360.0,352.0
1162,2019/05/30,357.0,353.882,355.0,53500,358.0,350.0
1163,2019/05/31,349.0,351.682,354.0,28900,356.0,348.0
1164,2019/06/03,343.0,343.632,345.0,37500,348.0,340.0
1165,2019/06/04,342.0,338.157,342.0,46000,343.0,334.0
1166,2019/06/05,352.0,349.848,350.0,75100,354.0,345.0
1167,2019/06/06,346.0,350.762,354.0,47000,355.0,346.0
1168,2019/06/07,346.0,344.608,347.0,44100,348.0,341.0
1169,2019/06/10,350.0,350.463,350.0,57300,354.0,348.0
1170,2019/06/11,348.0,351.604,352.0,32600,355.0,348.0
1171,2019/06/12,349.0,351.364,349.0,28300,356.0,348.0
1172,2019/06/13,346.0,347.732,349.0,37300,352.0,345.0
1173,2019/06/14,350.0,350.035,348.0,48800,356.0,344.0
1174,2019/06/17,355.0,353.575,355.0,23300,355.0,351.0
1175,2019/06/18,343.0,350.67,358.0,57600,359.0,343.0
1176,2019/06/19,351.0,351.093,349.0,44300,356.0,347.0
1177,2019/06/20,354.0,354.441,354.0,44400,359.0,350.0
1178,2019/06/21,359.0,357.051,356.0,48900,359.0,351.0
1179,2019/06/24,357.0,355.728,358.0,27900,359.0,352.0
1180,2019/06/25,359.0,359.946,358.0,46600,362.0,356.0
1181,2019/06/26,358.0,355.363,355.0,27000,359.0,348.0
1182,2019/06/27,362.0,357.106,359.0,42600,362.0,352.0
1183,2019/06/28,360.0,364.602,362.0,57600,371.0,359.0
1184,2019/07/01,376.0,373.245,368.0,86600,380.0,365.0
1185,2019/07/02,377.0,375.738,380.0,39300,381.0,370.0
1186,2019/07/03,371.0,372.697,379.0,42300,379.0,370.0
1187,2019/07/04,380.0,375.866,372.0,42600,381.0,372.0
1188,2019/07/05,393.0,389.055,382.0,95200,395.0,380.0
1189,2019/07/08,387.0,389.65,396.0,82200,396.0,386.0
1190,2019/07/09,378.0,382.374,388.0,45400,389.0,377.0
1191,2019/07/10,383.0,383.396,379.0,24000,387.0,379.0
1192,2019/07/11,388.0,387.281,388.0,19200,389.0,385.0
1193,2019/07/12,382.0,382.186,390.0,27900,390.0,379.0
1194,2019/07/16,376.0,376.109,381.0,34100,383.0,372.0
1195,2019/07/17,371.0,370.222,374.0,40600,375.0,366.0
1196,2019/07/18,357.0,360.997,366.0,36600,366.0,357.0
1197,2019/07/19,370.0,366.751,359.0,24100,371.0,359.0
1198,2019/07/22,367.0,365.362,368.0,28200,370.0,361.0
1199,2019/07/23,369.0,371.284,369.0,20800,375.0,368.0
1200,2019/07/24,375.0,373.77,376.0,26900,376.0,370.0
1201,2019/07/25,374.0,375.519,377.0,20600,379.0,373.0
1202,2019/07/26,373.0,370.056,370.0,126600,374.0,366.0
1203,2019/07/29,371.0,369.152,370.0,46100,372.0,365.0
1204,2019/07/30,380.0,377.714,368.0,150200,382.0,368.0
1205,2019/07/31,379.0,376.491,376.0,44200,381.0,372.0
1206,2019/08/01,378.0,377.534,378.0,24700,380.0,375.0
1207,2019/08/02,364.0,365.66,371.0,58200,372.0,361.0
1208,2019/08/05,359.0,354.148,362.0,60700,362.0,346.0
1209,2019/08/06,357.0,347.548,344.0,52400,357.0,341.0
1210,2019/08/07,362.0,357.191,361.0,22000,362.0,352.0
1211,2019/08/08,368.0,366.149,364.0,37500,370.0,361.0
1212,2019/08/09,371.0,370.167,366.0,25200,373.0,366.0
1213,2019/08/13,356.0,359.325,371.0,84300,371.0,353.0
1214,2019/08/14,364.0,361.628,359.0,49500,371.0,356.0
1215,2019/08/15,308.0,304.088,300.0,369000,311.0,296.0
1216,2019/08/16,311.0,311.25,311.0,128200,319.0,306.0
1217,2019/08/19,318.0,315.431,310.0,64500,321.0,310.0
1218,2019/08/20,324.0,321.469,318.0,53500,324.0,315.0
1219,2019/08/21,324.0,325.294,324.0,55100,329.0,323.0
1220,2019/08/22,317.0,322.823,326.0,80200,329.0,316.0
1221,2019/08/23,317.0,315.857,318.0,51000,318.0,311.0
