,Date,Close,VWAP,Open,Volume,High,Low
0,2014/08/25,170.0,166.43,166.0,1736900,172.0,162.0
1,2014/08/26,165.0,168.907,169.0,1055000,174.0,165.0
2,2014/08/27,165.0,165.372,167.0,519700,168.0,164.0
3,2014/08/28,164.0,165.9,165.0,562000,169.0,163.0
4,2014/08/29,166.0,164.589,163.0,738200,168.0,161.0
5,2014/09/01,165.0,166.091,166.0,519600,169.0,164.0
6,2014/09/02,161.0,162.169,163.0,547700,164.0,160.0
7,2014/09/03,160.0,160.521,160.0,406800,163.0,159.0
8,2014/09/04,156.0,157.478,160.0,494400,160.0,155.0
9,2014/09/05,157.0,155.773,156.0,476300,157.0,155.0
10,2014/09/08,159.0,160.312,159.0,1089700,165.0,153.0
11,2014/09/09,163.0,165.103,159.0,1826800,170.0,159.0
12,2014/09/10,160.0,159.899,160.0,578100,162.0,158.0
13,2014/09/11,157.0,158.15,160.0,486200,161.0,156.0
14,2014/09/12,158.0,157.889,159.0,421200,160.0,156.0
15,2014/09/16,156.0,157.542,159.0,227400,160.0,156.0
16,2014/09/17,155.0,156.282,156.0,193500,158.0,155.0
17,2014/09/18,155.0,153.753,156.0,358100,156.0,152.0
18,2014/09/19,153.0,153.412,153.0,623800,156.0,151.0
19,2014/09/22,155.0,154.91,153.0,582100,158.0,151.0
20,2014/09/24,156.0,156.233,154.0,705500,159.0,153.0
21,2014/09/25,162.0,163.598,156.0,4275500,171.0,156.0
22,2014/09/26,167.0,167.123,166.0,3064300,171.0,164.0
23,2014/09/29,171.0,169.41,170.0,1750800,173.0,166.0
24,2014/09/30,169.0,170.323,172.0,854600,172.0,168.0
25,2014/10/01,165.0,173.56,175.0,5083000,179.0,161.0
26,2014/10/02,160.0,159.641,160.0,1307200,164.0,157.0
27,2014/10/03,160.0,160.714,162.0,702800,164.0,159.0
28,2014/10/06,164.0,164.048,163.0,685300,167.0,160.0
29,2014/10/07,159.0,161.854,165.0,588300,166.0,158.0
30,2014/10/08,159.0,156.566,156.0,620900,159.0,153.0
31,2014/10/09,158.0,158.41,158.0,1371100,163.0,155.0
32,2014/10/10,152.0,152.608,153.0,1290600,155.0,152.0
33,2014/10/14,142.0,144.972,149.0,1362300,149.0,140.0
34,2014/10/15,145.0,143.764,143.0,544600,147.0,141.0
35,2014/10/16,139.0,139.715,140.0,979600,142.0,137.0
36,2014/10/17,138.0,140.258,141.0,603300,144.0,138.0
37,2014/10/20,145.0,143.584,141.0,605400,147.0,141.0
38,2014/10/21,142.0,143.033,143.0,228900,145.0,142.0
39,2014/10/22,146.0,147.915,143.0,653500,153.0,143.0
40,2014/10/23,145.0,145.808,146.0,169300,148.0,145.0
41,2014/10/24,148.0,146.702,146.0,1059600,149.0,144.0
42,2014/10/27,146.0,147.002,147.0,351600,150.0,145.0
43,2014/10/28,147.0,145.057,145.0,480400,148.0,143.0
44,2014/10/29,148.0,148.868,146.0,544700,152.0,146.0
45,2014/10/30,152.0,151.393,149.0,928000,155.0,147.0
46,2014/10/31,150.0,149.25,150.0,687300,152.0,147.0
47,2014/11/04,148.0,150.419,153.0,590500,154.0,148.0
48,2014/11/05,149.0,148.463,149.0,533600,150.0,147.0
49,2014/11/06,150.0,150.779,149.0,1256000,154.0,148.0
50,2014/11/07,151.0,150.135,151.0,276800,151.0,149.0
51,2014/11/10,151.0,151.566,151.0,560700,154.0,149.0
52,2014/11/11,151.0,151.399,151.0,341700,153.0,150.0
53,2014/11/12,157.0,154.513,152.0,1166600,157.0,152.0
54,2014/11/13,150.0,151.394,153.0,743200,154.0,149.0
55,2014/11/14,146.0,147.843,150.0,809600,151.0,146.0
56,2014/11/17,146.0,145.573,147.0,306100,148.0,144.0
57,2014/11/18,146.0,144.984,145.0,283700,146.0,144.0
58,2014/11/19,145.0,145.455,145.0,200700,147.0,145.0
59,2014/11/20,146.0,147.207,146.0,416800,150.0,145.0
60,2014/11/21,147.0,146.618,146.0,274300,148.0,145.0
61,2014/11/25,146.0,146.231,147.0,332200,148.0,145.0
62,2014/11/26,154.0,151.523,146.0,2097500,156.0,146.0
63,2014/11/27,169.0,165.049,160.0,5891500,172.0,156.0
64,2014/11/28,164.0,166.159,170.0,1550000,171.0,161.0
65,2014/12/01,160.0,161.341,165.0,836000,166.0,159.0
66,2014/12/02,162.0,161.322,161.0,869500,164.0,159.0
67,2014/12/03,156.0,158.254,163.0,1073400,164.0,153.0
68,2014/12/04,151.0,152.268,155.0,1241500,156.0,150.0
69,2014/12/05,160.0,159.931,151.0,1974700,165.0,150.0
70,2014/12/08,163.0,163.391,163.0,1527200,168.0,159.0
71,2014/12/09,156.0,159.84,162.0,1028700,163.0,156.0
72,2014/12/10,150.0,150.641,153.0,1804100,153.0,149.0
73,2014/12/11,152.0,150.723,149.0,669800,154.0,148.0
74,2014/12/12,159.0,160.481,156.0,2356300,165.0,155.0
75,2014/12/15,159.0,159.868,158.0,648200,164.0,156.0
76,2014/12/16,153.0,154.14,157.0,849600,158.0,153.0
77,2014/12/17,156.0,155.037,151.0,864000,159.0,151.0
78,2014/12/18,157.0,157.982,158.0,788700,161.0,156.0
79,2014/12/19,156.0,155.86,157.0,492300,158.0,154.0
80,2014/12/22,156.0,154.785,155.0,648700,158.0,153.0
81,2014/12/24,155.0,155.257,156.0,702600,157.0,154.0
82,2014/12/25,154.0,156.047,154.0,1301100,160.0,154.0
83,2014/12/26,158.0,158.448,155.0,1147200,161.0,155.0
84,2014/12/29,165.0,161.714,159.0,2034200,165.0,158.0
85,2014/12/30,160.0,163.041,165.0,1878700,168.0,158.0
86,2015/01/05,159.0,160.979,160.0,834000,164.0,158.0
87,2015/01/06,156.0,157.582,157.0,946400,161.0,156.0
88,2015/01/07,155.0,156.205,156.0,615500,157.0,155.0
89,2015/01/08,157.0,156.224,156.0,533200,158.0,155.0
90,2015/01/09,155.0,156.974,158.0,571500,159.0,155.0
91,2015/01/13,155.0,155.692,155.0,424800,157.0,155.0
92,2015/01/14,154.0,154.578,155.0,609400,156.0,154.0
93,2015/01/15,157.0,155.104,154.0,591900,158.0,154.0
94,2015/01/16,154.0,154.56,156.0,516900,157.0,153.0
95,2015/01/19,175.0,167.144,157.0,5626000,176.0,156.0
96,2015/01/20,183.0,183.876,180.0,11217600,194.0,176.0
97,2015/01/21,203.0,205.125,186.0,27636400,220.0,184.0
98,2015/01/22,205.0,207.749,214.0,10943000,219.0,198.0
99,2015/01/23,200.0,200.103,205.0,6202100,207.0,193.0
100,2015/01/26,219.0,215.241,203.0,11826800,225.0,201.0
101,2015/01/27,208.0,213.458,220.0,5323300,222.0,206.0
102,2015/01/28,208.0,206.982,204.0,2895100,215.0,198.0
103,2015/01/29,203.0,203.825,206.0,1697100,207.0,201.0
104,2015/01/30,196.0,194.402,199.0,3204100,202.0,188.0
105,2015/02/02,201.0,200.352,195.0,2648100,206.0,192.0
106,2015/02/03,189.0,192.012,196.0,2707300,201.0,185.0
107,2015/02/04,187.0,190.479,193.0,1212200,195.0,187.0
108,2015/02/05,192.0,191.38,188.0,1495200,195.0,186.0
109,2015/02/06,189.0,188.973,192.0,1087900,194.0,185.0
110,2015/02/09,198.0,200.365,199.0,4316400,206.0,194.0
111,2015/02/10,209.0,204.496,200.0,3419800,212.0,195.0
112,2015/02/12,204.0,208.603,210.0,3752400,213.0,203.0
113,2015/02/13,214.0,210.831,205.0,4791900,215.0,202.0
114,2015/02/16,211.0,213.394,213.0,3347800,219.0,208.0
115,2015/02/17,197.0,202.562,211.0,3312200,212.0,196.0
116,2015/02/18,195.0,196.673,198.0,2134300,201.0,193.0
117,2015/02/19,199.0,201.683,198.0,2398200,205.0,197.0
118,2015/02/20,197.0,199.567,201.0,1419500,204.0,196.0
119,2015/02/23,192.0,195.284,200.0,1537100,201.0,191.0
120,2015/02/24,190.0,190.067,191.0,1411100,192.0,188.0
121,2015/02/25,190.0,189.43,189.0,1006200,193.0,187.0
122,2015/02/26,190.0,192.699,190.0,1080900,197.0,190.0
123,2015/02/27,191.0,189.254,190.0,776500,192.0,187.0
124,2015/03/02,187.0,186.503,190.0,1164200,190.0,185.0
125,2015/03/03,181.0,182.218,185.0,1307700,186.0,180.0
126,2015/03/04,180.0,178.013,179.0,1104400,182.0,175.0
127,2015/03/05,190.0,188.615,184.0,1690000,193.0,184.0
128,2015/03/06,183.0,185.232,188.0,681500,188.0,183.0
129,2015/03/09,183.0,181.936,183.0,328200,184.0,180.0
130,2015/03/10,179.0,178.704,184.0,1205100,184.0,176.0
131,2015/03/11,181.0,178.596,176.0,424800,181.0,176.0
132,2015/03/12,180.0,180.668,181.0,820900,184.0,179.0
133,2015/03/13,186.0,184.56,183.0,1073100,187.0,182.0
134,2015/03/16,192.0,192.925,189.0,4172400,198.0,188.0
135,2015/03/17,192.0,191.354,193.0,1463700,195.0,188.0
136,2015/03/18,187.0,188.894,192.0,892700,193.0,186.0
137,2015/03/19,186.0,186.46,186.0,441200,188.0,185.0
138,2015/03/20,185.0,185.203,186.0,711000,188.0,183.0
139,2015/03/23,185.0,185.921,185.0,357300,188.0,184.0
140,2015/03/24,183.0,184.188,187.0,344000,187.0,182.0
141,2015/03/25,186.0,185.236,183.0,552700,188.0,182.0
142,2015/03/26,190.0,188.344,186.0,806300,190.0,185.0
143,2015/03/27,189.0,190.79,190.0,894900,194.0,187.0
144,2015/03/30,189.0,187.862,189.0,422600,191.0,186.0
145,2015/03/31,188.0,188.061,187.0,558000,191.0,186.0
146,2015/04/01,189.0,187.578,186.0,421500,190.0,186.0
147,2015/04/02,189.0,189.34,188.0,447800,191.0,188.0
148,2015/04/03,189.0,189.642,190.0,822800,193.0,187.0
149,2015/04/06,189.0,189.544,190.0,375800,191.0,188.0
150,2015/04/07,202.0,197.483,190.0,4797800,203.0,188.0
151,2015/04/08,201.0,201.023,204.0,1541200,205.0,198.0
152,2015/04/09,199.0,198.385,202.0,957100,203.0,195.0
153,2015/04/10,198.0,197.049,199.0,615500,199.0,196.0
154,2015/04/13,205.0,202.859,197.0,2275500,207.0,197.0
155,2015/04/14,207.0,207.577,205.0,2615400,212.0,204.0
156,2015/04/15,203.0,204.791,206.0,1296200,207.0,202.0
157,2015/04/16,205.0,205.696,203.0,982400,209.0,203.0
158,2015/04/17,210.0,208.192,207.0,1809800,211.0,205.0
159,2015/04/20,213.0,212.63,208.0,2913100,216.0,208.0
160,2015/04/21,212.0,211.621,213.0,831800,214.0,210.0
161,2015/04/22,210.0,210.4,212.0,839600,213.0,208.0
162,2015/04/23,208.0,208.608,209.0,871200,211.0,206.0
163,2015/04/24,205.0,204.926,208.0,857900,208.0,201.0
164,2015/04/27,201.0,200.548,200.0,907400,203.0,198.0
165,2015/04/28,198.0,199.391,201.0,644500,201.0,198.0
166,2015/04/30,194.0,195.839,198.0,903500,200.0,193.0
167,2015/05/01,195.0,192.491,191.0,800300,196.0,190.0
168,2015/05/07,197.0,197.287,192.0,457000,200.0,192.0
169,2015/05/08,198.0,198.95,197.0,401100,201.0,197.0
170,2015/05/11,204.0,200.371,200.0,763000,204.0,196.0
171,2015/05/12,206.0,205.808,204.0,851500,209.0,202.0
172,2015/05/13,207.0,206.915,208.0,600800,210.0,205.0
173,2015/05/14,205.0,205.352,207.0,352300,207.0,204.0
174,2015/05/15,206.0,208.056,207.0,1539200,211.0,205.0
175,2015/05/18,193.0,195.348,200.0,2632200,201.0,190.0
176,2015/05/19,194.0,193.28,193.0,681500,195.0,191.0
177,2015/05/20,196.0,197.215,194.0,919300,200.0,194.0
178,2015/05/21,198.0,197.391,198.0,673800,200.0,196.0
179,2015/05/22,194.0,193.856,195.0,427200,196.0,192.0
180,2015/05/25,191.0,191.023,193.0,662600,194.0,189.0
181,2015/05/26,192.0,190.999,192.0,384400,193.0,190.0
182,2015/05/27,190.0,191.062,190.0,314900,192.0,190.0
183,2015/05/28,188.0,188.811,191.0,807800,192.0,187.0
184,2015/05/29,187.0,187.139,188.0,399700,189.0,186.0
185,2015/06/01,187.0,186.106,185.0,450300,189.0,184.0
186,2015/06/02,187.0,187.15,186.0,343500,189.0,186.0
187,2015/06/03,188.0,186.903,188.0,473900,188.0,186.0
188,2015/06/04,191.0,189.709,188.0,690200,191.0,187.0
189,2015/06/05,194.0,191.465,192.0,548000,194.0,189.0
190,2015/06/08,189.0,191.524,193.0,385600,194.0,189.0
191,2015/06/09,191.0,189.096,190.0,323800,191.0,188.0
192,2015/06/10,187.0,187.751,189.0,336500,190.0,186.0
193,2015/06/11,190.0,189.279,187.0,466600,192.0,187.0
194,2015/06/12,190.0,189.584,190.0,207300,191.0,188.0
195,2015/06/15,191.0,189.255,189.0,229100,191.0,188.0
196,2015/06/16,189.0,189.82,191.0,259200,191.0,189.0
197,2015/06/17,199.0,197.725,190.0,6808900,202.0,190.0
198,2015/06/18,196.0,197.144,197.0,1877800,202.0,192.0
199,2015/06/19,203.0,199.467,196.0,2404300,204.0,193.0
200,2015/06/22,209.0,206.097,205.0,3738800,210.0,202.0
201,2015/06/23,210.0,211.183,214.0,4506900,215.0,206.0
202,2015/06/24,203.0,207.387,208.0,1882700,213.0,203.0
203,2015/06/25,200.0,201.331,203.0,1831700,205.0,198.0
204,2015/06/26,202.0,201.799,201.0,1386100,207.0,197.0
205,2015/06/29,194.0,194.741,194.0,988600,198.0,193.0
206,2015/06/30,194.0,194.218,193.0,1081900,197.0,193.0
207,2015/07/01,209.0,202.605,195.0,2633600,209.0,194.0
208,2015/07/02,217.0,213.873,212.0,6869200,219.0,209.0
209,2015/07/03,209.0,214.652,219.0,4804300,221.0,207.0
210,2015/07/06,206.0,207.621,204.0,2553100,214.0,203.0
211,2015/07/07,212.0,208.569,210.0,2259800,212.0,204.0
212,2015/07/08,197.0,201.695,210.0,3215500,210.0,196.0
213,2015/07/09,192.0,187.384,190.0,3561900,194.0,172.0
214,2015/07/10,184.0,186.353,191.0,1199900,191.0,183.0
215,2015/07/13,189.0,188.08,187.0,1240400,191.0,185.0
216,2015/07/14,190.0,192.136,193.0,1145100,196.0,189.0
217,2015/07/15,196.0,193.196,190.0,1259100,196.0,189.0
218,2015/07/16,206.0,200.784,195.0,2361200,206.0,194.0
219,2015/07/17,208.0,207.687,206.0,2217100,210.0,206.0
220,2015/07/21,208.0,210.907,210.0,2133800,214.0,208.0
221,2015/07/22,207.0,207.105,206.0,769600,210.0,205.0
222,2015/07/23,215.0,212.138,208.0,2703300,215.0,207.0
223,2015/07/24,212.0,212.727,215.0,1633300,218.0,208.0
224,2015/07/27,203.0,205.357,209.0,1079100,209.0,201.0
225,2015/07/28,204.0,200.247,197.0,822200,206.0,197.0
226,2015/07/29,200.0,201.299,203.0,500200,203.0,199.0
227,2015/07/30,202.0,202.517,203.0,238100,204.0,201.0
228,2015/07/31,207.0,204.765,203.0,527900,207.0,202.0
229,2015/08/03,207.0,204.335,205.0,603800,207.0,201.0
230,2015/08/04,207.0,204.791,207.0,441600,207.0,203.0
231,2015/08/05,207.0,206.337,206.0,418500,208.0,204.0
232,2015/08/06,209.0,209.054,209.0,768600,211.0,208.0
233,2015/08/07,208.0,209.468,209.0,1440700,212.0,206.0
234,2015/08/10,194.0,197.48,200.0,2522200,203.0,193.0
235,2015/08/11,191.0,192.222,195.0,1581000,196.0,190.0
236,2015/08/12,187.0,187.721,191.0,2093100,192.0,185.0
237,2015/08/13,185.0,186.131,187.0,1165600,188.0,185.0
238,2015/08/14,184.0,185.427,186.0,727200,187.0,184.0
239,2015/08/17,185.0,186.199,185.0,865200,189.0,185.0
240,2015/08/18,179.0,182.206,188.0,2933000,188.0,174.0
241,2015/08/19,175.0,176.475,176.0,999500,181.0,174.0
242,2015/08/20,168.0,171.155,173.0,1100500,177.0,168.0
243,2015/08/21,163.0,163.449,163.0,1161800,167.0,162.0
244,2015/08/24,148.0,155.281,159.0,2488400,161.0,148.0
245,2015/08/25,144.0,145.744,143.0,2793600,158.0,139.0
246,2015/08/26,156.0,150.08,144.0,1228400,157.0,144.0
247,2015/08/27,156.0,156.529,153.0,1395600,161.0,153.0
248,2015/08/28,161.0,160.67,158.0,938000,163.0,158.0
249,2015/08/31,158.0,159.223,160.0,436400,161.0,158.0
250,2015/09/01,156.0,157.992,159.0,648100,161.0,156.0
251,2015/09/02,153.0,154.357,153.0,598400,158.0,152.0
252,2015/09/03,154.0,154.671,154.0,250400,157.0,153.0
253,2015/09/04,147.0,148.798,154.0,579000,156.0,146.0
254,2015/09/07,146.0,144.816,144.0,464000,149.0,142.0
255,2015/09/08,146.0,146.151,146.0,273700,148.0,145.0
256,2015/09/09,159.0,156.978,151.0,744600,163.0,151.0
257,2015/09/10,158.0,155.379,153.0,309800,158.0,153.0
258,2015/09/11,161.0,159.423,157.0,312100,161.0,157.0
259,2015/09/14,157.0,160.293,161.0,457500,164.0,156.0
260,2015/09/15,158.0,156.424,157.0,245200,159.0,155.0
261,2015/09/16,158.0,157.04,158.0,262600,159.0,155.0
262,2015/09/17,161.0,159.795,160.0,260400,161.0,158.0
263,2015/09/18,156.0,156.465,160.0,348900,160.0,153.0
264,2015/09/24,152.0,154.549,158.0,235900,158.0,152.0
265,2015/09/25,152.0,151.863,151.0,216900,154.0,151.0
266,2015/09/28,159.0,156.314,152.0,226600,159.0,152.0
267,2015/09/29,152.0,153.698,156.0,293400,156.0,152.0
268,2015/09/30,154.0,154.407,154.0,121600,156.0,153.0
269,2015/10/01,155.0,155.177,155.0,328200,158.0,153.0
270,2015/10/02,165.0,167.639,155.0,4791100,177.0,155.0
271,2015/10/05,166.0,166.962,163.0,1208200,171.0,162.0
272,2015/10/06,165.0,165.582,169.0,528700,169.0,163.0
273,2015/10/07,160.0,161.87,164.0,494100,166.0,159.0
274,2015/10/08,163.0,164.075,163.0,410400,167.0,162.0
275,2015/10/09,163.0,162.411,163.0,238200,165.0,161.0
276,2015/10/13,162.0,162.47,163.0,168500,164.0,161.0
277,2015/10/14,159.0,160.093,162.0,353200,162.0,158.0
278,2015/10/15,157.0,158.562,157.0,373400,161.0,157.0
279,2015/10/16,160.0,160.598,159.0,491700,163.0,158.0
280,2015/10/19,158.0,158.841,160.0,183300,161.0,158.0
281,2015/10/20,155.0,156.602,158.0,450900,159.0,155.0
282,2015/10/21,157.0,156.158,155.0,271700,158.0,155.0
283,2015/10/22,155.0,156.218,157.0,196600,159.0,155.0
284,2015/10/23,156.0,157.614,158.0,497400,161.0,155.0
285,2015/10/26,158.0,157.914,159.0,331200,159.0,157.0
286,2015/10/27,156.0,156.523,159.0,248900,159.0,155.0
287,2015/10/28,154.0,154.766,156.0,236400,156.0,154.0
288,2015/10/29,154.0,154.767,155.0,107900,156.0,154.0
289,2015/10/30,155.0,154.787,154.0,130300,156.0,154.0
290,2015/11/02,154.0,156.662,157.0,530500,160.0,153.0
291,2015/11/04,153.0,153.203,153.0,324200,155.0,152.0
292,2015/11/05,151.0,151.468,152.0,240600,154.0,150.0
293,2015/11/06,156.0,154.064,153.0,545300,157.0,151.0
294,2015/11/09,155.0,155.943,157.0,222700,157.0,155.0
295,2015/11/10,162.0,160.349,156.0,933400,164.0,155.0
296,2015/11/11,161.0,160.376,162.0,785000,163.0,158.0
297,2015/11/12,158.0,158.963,161.0,373600,161.0,157.0
298,2015/11/13,131.0,130.338,134.0,5609400,135.0,122.0
299,2015/11/16,121.0,122.712,126.0,3605500,126.0,119.0
300,2015/11/17,120.0,119.447,121.0,2134900,121.0,118.0
301,2015/11/18,119.0,119.923,120.0,883300,122.0,118.0
302,2015/11/19,121.0,120.892,119.0,1611800,124.0,119.0
303,2015/11/20,122.0,122.28,123.0,574700,124.0,121.0
304,2015/11/24,124.0,122.647,123.0,642200,124.0,121.0
305,2015/11/25,121.0,121.984,124.0,804300,124.0,121.0
306,2015/11/26,121.0,121.822,121.0,841100,124.0,120.0
307,2015/11/27,127.0,128.211,125.0,4371300,132.0,125.0
308,2015/11/30,125.0,126.356,128.0,736400,129.0,125.0
309,2015/12/01,128.0,125.485,125.0,952500,128.0,123.0
310,2015/12/02,128.0,127.279,127.0,491300,129.0,126.0
311,2015/12/03,127.0,126.422,128.0,394100,128.0,125.0
312,2015/12/04,126.0,125.504,125.0,386500,127.0,125.0
313,2015/12/07,125.0,125.514,125.0,403900,127.0,125.0
314,2015/12/08,125.0,125.537,126.0,546300,128.0,124.0
315,2015/12/09,123.0,124.45,126.0,303200,126.0,123.0
316,2015/12/10,120.0,120.496,121.0,593000,122.0,120.0
317,2015/12/11,120.0,120.53,121.0,251100,122.0,120.0
318,2015/12/14,118.0,117.216,118.0,394800,118.0,116.0
319,2015/12/15,113.0,115.197,115.0,1132700,117.0,112.0
320,2015/12/16,115.0,120.434,126.0,1951800,126.0,115.0
321,2015/12/17,117.0,116.916,117.0,1397900,120.0,115.0
322,2015/12/18,116.0,117.509,117.0,673300,119.0,116.0
323,2015/12/21,116.0,114.775,115.0,468900,116.0,114.0
324,2015/12/22,113.0,113.754,114.0,652400,115.0,113.0
325,2015/12/24,106.0,108.732,112.0,1741400,114.0,106.0
326,2015/12/25,106.0,107.555,107.0,1569200,110.0,105.0
327,2015/12/28,110.0,108.483,106.0,697200,111.0,106.0
328,2015/12/29,110.0,110.034,110.0,367900,111.0,109.0
329,2015/12/30,114.0,111.786,110.0,788800,115.0,108.0
330,2016/01/04,116.0,115.422,114.0,632600,117.0,114.0
331,2016/01/05,114.0,114.274,114.0,443800,116.0,113.0
332,2016/01/06,113.0,114.147,114.0,374800,115.0,113.0
333,2016/01/07,110.0,110.987,111.0,317800,113.0,109.0
334,2016/01/08,108.0,108.748,108.0,399500,111.0,107.0
335,2016/01/12,102.0,103.494,107.0,839400,107.0,100.0
336,2016/01/13,106.0,104.646,103.0,399200,106.0,103.0
337,2016/01/14,102.0,100.681,104.0,1182200,104.0,98.0
338,2016/01/15,99.0,100.584,102.0,490300,104.0,99.0
339,2016/01/18,96.0,94.814,95.0,810900,97.0,93.0
340,2016/01/19,95.0,94.042,93.0,618400,96.0,93.0
341,2016/01/20,90.0,91.185,94.0,841700,94.0,89.0
342,2016/01/21,80.0,85.974,87.0,1225400,90.0,79.0
343,2016/01/22,86.0,84.086,85.0,926600,86.0,82.0
344,2016/01/25,86.0,85.58,86.0,878400,87.0,83.0
345,2016/01/26,84.0,82.138,83.0,1114500,84.0,79.0
346,2016/01/27,84.0,84.722,85.0,496600,86.0,83.0
347,2016/01/28,86.0,84.645,85.0,509200,86.0,83.0
348,2016/01/29,87.0,84.864,85.0,621400,87.0,83.0
349,2016/02/01,88.0,87.869,87.0,1598500,90.0,86.0
350,2016/02/02,86.0,86.238,86.0,664400,88.0,85.0
351,2016/02/03,84.0,83.026,85.0,562400,85.0,81.0
352,2016/02/04,82.0,82.44,84.0,592800,84.0,80.0
353,2016/02/05,79.0,79.279,80.0,741500,81.0,78.0
354,2016/02/08,77.0,77.305,76.0,897200,80.0,75.0
355,2016/02/09,69.0,72.245,74.0,1127800,76.0,69.0
356,2016/02/10,62.0,65.004,70.0,3103700,70.0,60.0
357,2016/02/12,57.0,57.413,59.0,3113200,61.0,54.0
358,2016/02/15,64.0,62.925,62.0,1976000,65.0,60.0
359,2016/02/16,65.0,63.872,62.0,1343200,67.0,61.0
360,2016/02/17,60.0,60.536,63.0,3279200,65.0,57.0
361,2016/02/18,57.0,57.308,61.0,4875500,61.0,55.0
362,2016/02/19,58.0,57.516,57.0,1939400,60.0,56.0
363,2016/02/22,64.0,61.553,59.0,3232800,64.0,58.0
364,2016/02/23,71.0,67.692,64.0,4325400,72.0,64.0
365,2016/02/24,72.0,73.067,70.0,7941500,79.0,68.0
366,2016/02/25,72.0,72.832,73.0,3052300,77.0,69.0
367,2016/02/26,69.0,70.66,72.0,1217000,72.0,69.0
368,2016/02/29,70.0,70.297,70.0,1210300,72.0,68.0
369,2016/03/01,67.0,68.329,69.0,698600,70.0,67.0
370,2016/03/02,70.0,70.104,69.0,831300,72.0,69.0
371,2016/03/03,69.0,69.337,70.0,723900,70.0,68.0
372,2016/03/04,75.0,74.077,70.0,3332500,77.0,70.0
373,2016/03/07,74.0,74.916,76.0,987400,77.0,74.0
374,2016/03/08,75.0,73.879,75.0,1028600,76.0,72.0
375,2016/03/09,73.0,72.928,73.0,644900,74.0,72.0
376,2016/03/10,73.0,73.572,73.0,420300,75.0,72.0
377,2016/03/11,73.0,72.935,73.0,619500,74.0,72.0
378,2016/03/14,88.0,83.533,75.0,8323800,91.0,75.0
379,2016/03/15,103.0,101.5,88.0,36802300,118.0,85.0
380,2016/03/16,99.0,97.987,99.0,8534900,102.0,93.0
381,2016/03/17,95.0,98.81,100.0,5373000,106.0,95.0
382,2016/03/18,89.0,90.633,94.0,3645800,94.0,89.0
383,2016/03/22,87.0,89.525,91.0,2352800,93.0,86.0
384,2016/03/23,92.0,89.252,88.0,1987200,92.0,86.0
385,2016/03/24,91.0,90.571,92.0,1676500,93.0,89.0
386,2016/03/25,89.0,88.786,90.0,1090700,91.0,88.0
387,2016/03/28,86.0,86.938,90.0,1227000,90.0,85.0
388,2016/03/29,88.0,87.151,85.0,1038400,89.0,84.0
389,2016/03/30,86.0,87.534,88.0,675000,89.0,86.0
390,2016/03/31,90.0,89.065,86.0,1268900,91.0,86.0
391,2016/04/01,88.0,88.179,90.0,1211800,91.0,87.0
392,2016/04/04,84.0,84.571,86.0,1865200,87.0,82.0
393,2016/04/05,78.0,79.57,84.0,2435500,84.0,77.0
394,2016/04/06,76.0,75.698,74.0,1171200,77.0,74.0
395,2016/04/07,81.0,83.234,76.0,5751300,91.0,76.0
396,2016/04/08,83.0,80.184,78.0,1642600,83.0,78.0
397,2016/04/11,82.0,81.327,83.0,952900,83.0,80.0
398,2016/04/12,80.0,81.209,82.0,390800,83.0,80.0
399,2016/04/13,82.0,83.023,82.0,609300,85.0,82.0
400,2016/04/14,88.0,85.454,84.0,1132600,88.0,83.0
401,2016/04/15,86.0,86.515,85.0,862500,89.0,85.0
402,2016/04/18,82.0,82.544,84.0,796300,84.0,81.0
403,2016/04/19,87.0,88.943,90.0,4333900,92.0,86.0
404,2016/04/20,88.0,87.772,88.0,827100,89.0,87.0
405,2016/04/21,88.0,88.367,88.0,728800,90.0,87.0
406,2016/04/22,89.0,88.105,88.0,550400,89.0,87.0
407,2016/04/25,92.0,91.466,90.0,1597000,93.0,89.0
408,2016/04/26,88.0,88.93,92.0,1403100,92.0,86.0
409,2016/04/27,88.0,88.234,88.0,480200,90.0,87.0
410,2016/04/28,85.0,86.919,89.0,826800,90.0,84.0
411,2016/05/02,83.0,83.307,83.0,493100,85.0,82.0
412,2016/05/06,84.0,84.371,85.0,265000,86.0,83.0
413,2016/05/09,87.0,86.987,85.0,803000,89.0,85.0
414,2016/05/10,92.0,90.695,89.0,1957400,93.0,87.0
415,2016/05/11,90.0,91.196,92.0,1130000,94.0,88.0
416,2016/05/12,90.0,87.748,89.0,920500,90.0,86.0
417,2016/05/13,85.0,86.475,88.0,883700,89.0,85.0
418,2016/05/16,82.0,82.853,84.0,1015800,85.0,81.0
419,2016/05/17,83.0,83.928,85.0,1166500,86.0,81.0
420,2016/05/18,81.0,82.365,84.0,837600,84.0,80.0
421,2016/05/19,82.0,82.339,82.0,518100,84.0,81.0
422,2016/05/20,82.0,81.984,82.0,324200,83.0,81.0
423,2016/05/23,81.0,81.979,82.0,302000,83.0,81.0
424,2016/05/24,81.0,81.843,82.0,360300,83.0,81.0
425,2016/05/25,82.0,82.945,82.0,630500,84.0,81.0
426,2016/05/26,84.0,83.704,84.0,984900,85.0,82.0
427,2016/05/27,84.0,84.097,85.0,394500,85.0,83.0
428,2016/05/30,89.0,87.179,85.0,1319000,89.0,85.0
429,2016/05/31,88.0,87.041,87.0,948000,89.0,86.0
430,2016/06/01,84.0,86.271,88.0,1005700,88.0,84.0
431,2016/06/02,83.0,84.026,84.0,581500,85.0,83.0
432,2016/06/03,85.0,84.904,84.0,476600,86.0,83.0
433,2016/06/06,85.0,84.818,85.0,415400,85.0,84.0
434,2016/06/07,85.0,85.742,86.0,595400,87.0,85.0
435,2016/06/08,88.0,87.661,85.0,1331700,90.0,84.0
436,2016/06/09,87.0,87.656,88.0,583900,89.0,87.0
437,2016/06/10,91.0,88.225,88.0,868500,91.0,86.0
438,2016/06/13,87.0,86.754,89.0,2010600,90.0,84.0
439,2016/06/14,84.0,83.934,87.0,1947100,87.0,82.0
440,2016/06/15,82.0,82.437,83.0,898800,84.0,81.0
441,2016/06/16,76.0,78.933,83.0,1491700,83.0,75.0
442,2016/06/17,75.0,77.219,78.0,1000200,81.0,75.0
443,2016/06/20,78.0,77.645,76.0,1015900,80.0,76.0
444,2016/06/21,79.0,79.194,78.0,759700,81.0,78.0
445,2016/06/22,77.0,77.996,79.0,438100,80.0,77.0
446,2016/06/23,77.0,76.659,77.0,722400,78.0,75.0
447,2016/06/24,71.0,76.507,79.0,4311800,84.0,65.0
448,2016/06/27,74.0,73.239,72.0,744600,75.0,71.0
449,2016/06/28,72.0,71.348,73.0,1086300,75.0,68.0
450,2016/06/29,77.0,75.212,74.0,570000,77.0,73.0
451,2016/06/30,78.0,78.39,78.0,587800,80.0,77.0
452,2016/07/01,78.0,78.567,79.0,258700,80.0,78.0
453,2016/07/04,80.0,79.235,77.0,896600,81.0,77.0
454,2016/07/05,76.0,77.939,79.0,736800,81.0,76.0
455,2016/07/06,73.0,72.339,76.0,1260300,77.0,70.0
456,2016/07/07,72.0,73.556,72.0,376000,75.0,72.0
457,2016/07/08,71.0,72.154,73.0,390500,74.0,71.0
458,2016/07/11,73.0,73.016,72.0,1022400,75.0,72.0
459,2016/07/12,74.0,75.229,75.0,685400,77.0,74.0
460,2016/07/13,76.0,75.855,75.0,424200,77.0,75.0
461,2016/07/14,75.0,75.619,76.0,482000,77.0,75.0
462,2016/07/15,74.0,75.026,76.0,613700,76.0,74.0
463,2016/07/19,74.0,74.04,74.0,386300,75.0,73.0
464,2016/07/20,73.0,73.335,74.0,284300,75.0,73.0
465,2016/07/21,76.0,74.854,74.0,795900,77.0,73.0
466,2016/07/22,74.0,74.853,76.0,731000,76.0,73.0
467,2016/07/25,75.0,74.91,74.0,515800,76.0,74.0
468,2016/07/26,72.0,73.245,75.0,686200,75.0,72.0
469,2016/07/27,78.0,76.248,73.0,1517600,78.0,73.0
470,2016/07/28,76.0,78.026,78.0,1169700,80.0,76.0
471,2016/07/29,76.0,75.371,77.0,797800,78.0,74.0
472,2016/08/01,80.0,79.859,77.0,1859000,82.0,76.0
473,2016/08/02,94.0,89.973,83.0,12683200,97.0,81.0
474,2016/08/03,94.0,94.185,96.0,20866600,101.0,86.0
475,2016/08/04,100.0,107.798,97.0,98546100,120.0,95.0
476,2016/08/05,105.0,101.88,100.0,58324500,112.0,90.0
477,2016/08/08,91.0,94.494,101.0,26944100,102.0,89.0
478,2016/08/09,93.0,91.399,92.0,13511900,95.0,87.0
479,2016/08/10,77.0,78.682,78.0,16601500,83.0,75.0
480,2016/08/12,80.0,79.636,77.0,6202400,83.0,76.0
481,2016/08/15,80.0,79.283,79.0,2279400,81.0,78.0
482,2016/08/16,83.0,81.426,80.0,5800700,84.0,79.0
483,2016/08/17,82.0,81.819,82.0,3002500,84.0,80.0
484,2016/08/18,79.0,80.882,82.0,2313400,83.0,79.0
485,2016/08/19,78.0,78.041,79.0,1531300,79.0,77.0
486,2016/08/22,78.0,77.856,78.0,960900,79.0,77.0
487,2016/08/23,76.0,76.96,77.0,1291900,78.0,76.0
488,2016/08/24,76.0,76.654,76.0,825300,78.0,76.0
489,2016/08/25,76.0,76.267,77.0,1182600,78.0,75.0
490,2016/08/26,75.0,76.884,76.0,2470800,80.0,75.0
491,2016/08/29,76.0,76.485,76.0,753000,78.0,75.0
492,2016/08/30,75.0,75.849,77.0,852100,77.0,75.0
493,2016/08/31,76.0,76.053,76.0,830100,77.0,75.0
494,2016/09/01,77.0,76.926,77.0,2119000,78.0,75.0
495,2016/09/02,77.0,77.432,77.0,1196400,79.0,76.0
496,2016/09/05,80.0,79.626,78.0,2801600,82.0,78.0
497,2016/09/06,79.0,81.699,81.0,4920800,84.0,78.0
498,2016/09/07,79.0,79.596,81.0,821700,81.0,79.0
499,2016/09/08,78.0,78.728,79.0,621800,80.0,78.0
500,2016/09/09,79.0,78.139,78.0,828600,79.0,77.0
501,2016/09/12,77.0,77.667,78.0,388200,79.0,77.0
502,2016/09/13,78.0,77.782,78.0,306500,79.0,77.0
503,2016/09/14,76.0,76.849,77.0,710900,77.0,76.0
504,2016/09/15,75.0,74.652,76.0,1395500,76.0,73.0
505,2016/09/16,75.0,74.003,74.0,681600,75.0,73.0
506,2016/09/20,73.0,73.628,74.0,412800,75.0,73.0
507,2016/09/21,75.0,74.457,73.0,1145800,77.0,72.0
508,2016/09/23,75.0,75.618,75.0,421100,77.0,75.0
509,2016/09/26,75.0,75.889,77.0,185700,77.0,75.0
510,2016/09/27,75.0,75.004,75.0,166200,76.0,74.0
511,2016/09/28,75.0,74.819,75.0,269900,76.0,74.0
512,2016/09/29,79.0,78.56,76.0,2075900,81.0,76.0
513,2016/09/30,77.0,76.489,78.0,1240500,79.0,75.0
514,2016/10/03,77.0,76.934,77.0,411400,78.0,76.0
515,2016/10/04,78.0,77.095,77.0,308900,78.0,76.0
516,2016/10/05,78.0,77.034,78.0,434800,78.0,76.0
517,2016/10/06,77.0,77.233,78.0,358100,78.0,76.0
518,2016/10/07,76.0,76.357,77.0,184100,77.0,76.0
519,2016/10/11,78.0,77.127,77.0,231300,78.0,76.0
520,2016/10/12,77.0,76.999,77.0,328800,78.0,76.0
521,2016/10/13,78.0,77.114,77.0,203300,78.0,76.0
522,2016/10/14,77.0,76.911,77.0,195200,78.0,76.0
523,2016/10/17,78.0,77.073,77.0,246700,78.0,76.0
524,2016/10/18,78.0,77.061,77.0,268700,78.0,77.0
525,2016/10/19,78.0,77.379,77.0,375900,78.0,76.0
526,2016/10/20,77.0,77.69,78.0,522000,79.0,77.0
527,2016/10/21,77.0,77.691,78.0,184700,78.0,77.0
528,2016/10/24,78.0,78.082,78.0,680600,79.0,77.0
529,2016/10/25,78.0,77.987,78.0,381000,79.0,77.0
530,2016/10/26,77.0,77.452,78.0,167300,78.0,77.0
531,2016/10/27,78.0,77.732,77.0,192700,78.0,77.0
532,2016/10/28,76.0,77.173,78.0,443900,78.0,76.0
533,2016/10/31,77.0,76.344,76.0,297000,77.0,76.0
534,2016/11/01,76.0,76.173,77.0,230500,77.0,76.0
535,2016/11/02,74.0,74.248,76.0,1751500,76.0,72.0
536,2016/11/04,73.0,73.018,73.0,386700,74.0,72.0
537,2016/11/07,74.0,73.168,73.0,257300,74.0,72.0
538,2016/11/08,73.0,73.119,73.0,153300,74.0,73.0
539,2016/11/09,67.0,67.68,73.0,1771300,74.0,62.0
540,2016/11/10,69.0,70.359,70.0,837300,72.0,69.0
541,2016/11/11,70.0,68.942,68.0,534800,70.0,68.0
542,2016/11/14,70.0,70.002,69.0,308400,71.0,69.0
543,2016/11/15,72.0,71.029,71.0,434500,72.0,70.0
544,2016/11/16,72.0,71.844,72.0,328400,73.0,71.0
545,2016/11/17,73.0,72.003,72.0,215000,73.0,71.0
546,2016/11/18,75.0,74.345,73.0,892900,76.0,73.0
547,2016/11/21,76.0,75.313,76.0,753000,77.0,74.0
548,2016/11/22,78.0,76.585,76.0,575800,78.0,75.0
549,2016/11/24,77.0,77.247,78.0,773300,78.0,76.0
550,2016/11/25,77.0,76.619,77.0,881900,78.0,75.0
551,2016/11/28,77.0,76.426,77.0,443000,77.0,76.0
552,2016/11/29,78.0,77.003,77.0,271500,78.0,76.0
553,2016/11/30,79.0,79.597,78.0,2167300,82.0,78.0
554,2016/12/01,83.0,81.055,80.0,3137700,83.0,78.0
555,2016/12/02,84.0,84.924,84.0,5216100,88.0,82.0
556,2016/12/05,81.0,83.35,85.0,1529400,86.0,81.0
557,2016/12/06,86.0,84.021,82.0,2877000,88.0,80.0
558,2016/12/07,87.0,87.333,87.0,3488500,90.0,84.0
559,2016/12/08,87.0,87.417,88.0,1960400,89.0,86.0
560,2016/12/09,87.0,86.828,88.0,1195100,89.0,86.0
561,2016/12/12,89.0,87.66,87.0,2201100,89.0,86.0
562,2016/12/13,91.0,90.229,89.0,2870200,92.0,88.0
563,2016/12/14,94.0,93.38,94.0,5926100,96.0,90.0
564,2016/12/15,97.0,98.487,98.0,16435100,103.0,94.0
565,2016/12/16,92.0,93.997,97.0,3601600,98.0,92.0
566,2016/12/19,88.0,88.522,91.0,3593200,91.0,87.0
567,2016/12/20,89.0,88.158,88.0,1156800,90.0,87.0
568,2016/12/21,87.0,88.426,89.0,1123700,90.0,87.0
569,2016/12/22,86.0,85.771,87.0,1484400,87.0,84.0
570,2016/12/26,85.0,85.389,85.0,1077800,87.0,85.0
571,2016/12/27,85.0,85.905,85.0,1239500,88.0,84.0
572,2016/12/28,90.0,88.327,86.0,2030300,90.0,86.0
573,2016/12/29,87.0,88.269,90.0,957700,90.0,87.0
574,2016/12/30,87.0,87.095,87.0,469200,88.0,87.0
575,2017/01/04,91.0,89.314,87.0,1334900,91.0,87.0
576,2017/01/05,89.0,90.685,91.0,1418500,92.0,89.0
577,2017/01/06,90.0,90.51,89.0,1338100,92.0,89.0
578,2017/01/10,89.0,89.647,89.0,652200,91.0,89.0
579,2017/01/11,89.0,89.208,89.0,304500,90.0,89.0
580,2017/01/12,87.0,88.038,89.0,727100,89.0,87.0
581,2017/01/13,87.0,87.016,87.0,480700,88.0,86.0
582,2017/01/16,88.0,88.388,87.0,1919100,90.0,86.0
583,2017/01/17,85.0,85.166,88.0,1812100,88.0,83.0
584,2017/01/18,85.0,84.045,83.0,795400,86.0,83.0
585,2017/01/19,85.0,84.879,85.0,638800,86.0,84.0
586,2017/01/20,83.0,83.093,84.0,1394300,85.0,82.0
587,2017/01/23,82.0,81.375,83.0,1297800,83.0,80.0
588,2017/01/24,79.0,79.747,80.0,819800,81.0,79.0
589,2017/01/25,80.0,80.224,80.0,703500,81.0,79.0
590,2017/01/26,82.0,82.362,81.0,945700,84.0,80.0
591,2017/01/27,82.0,82.915,83.0,830700,84.0,81.0
592,2017/01/30,84.0,82.959,82.0,767000,84.0,81.0
593,2017/01/31,82.0,81.918,83.0,647900,84.0,80.0
594,2017/02/01,82.0,81.011,82.0,691500,82.0,80.0
595,2017/02/02,80.0,80.673,81.0,995500,82.0,80.0
596,2017/02/03,80.0,80.241,79.0,680800,82.0,79.0
597,2017/02/06,80.0,80.104,81.0,452200,81.0,79.0
598,2017/02/07,81.0,80.87,80.0,760800,82.0,80.0
599,2017/02/08,81.0,80.316,81.0,349500,81.0,80.0
600,2017/02/09,81.0,80.38,81.0,328900,81.0,80.0
601,2017/02/10,80.0,80.132,80.0,665300,81.0,79.0
602,2017/02/13,73.0,73.598,72.0,3377300,76.0,71.0
603,2017/02/14,73.0,72.935,73.0,1109900,74.0,72.0
604,2017/02/15,74.0,74.068,74.0,823500,76.0,73.0
605,2017/02/16,73.0,73.465,73.0,295600,75.0,73.0
606,2017/02/17,73.0,73.151,74.0,464800,74.0,72.0
607,2017/02/20,74.0,74.134,74.0,525700,75.0,73.0
608,2017/02/21,74.0,74.701,75.0,232600,75.0,74.0
609,2017/02/22,77.0,76.077,75.0,1339400,78.0,74.0
610,2017/02/23,78.0,77.777,78.0,468700,78.0,77.0
611,2017/02/24,78.0,77.647,78.0,184700,78.0,77.0
612,2017/02/27,77.0,76.848,78.0,332300,78.0,76.0
613,2017/02/28,76.0,76.617,77.0,327100,78.0,76.0
614,2017/03/01,76.0,76.28,76.0,733800,78.0,75.0
615,2017/03/02,76.0,76.222,76.0,465000,77.0,76.0
616,2017/03/03,76.0,76.035,76.0,309700,77.0,75.0
617,2017/03/06,76.0,74.821,76.0,514100,76.0,74.0
618,2017/03/07,75.0,75.019,74.0,508400,76.0,74.0
619,2017/03/08,76.0,75.37,75.0,215100,76.0,75.0
620,2017/03/09,76.0,76.07,76.0,277000,77.0,75.0
621,2017/03/10,75.0,75.602,76.0,212500,76.0,75.0
622,2017/03/13,75.0,75.465,75.0,184500,76.0,75.0
623,2017/03/14,74.0,74.738,75.0,409500,75.0,74.0
624,2017/03/15,74.0,74.269,74.0,180400,75.0,74.0
625,2017/03/16,74.0,74.144,74.0,156100,75.0,74.0
626,2017/03/17,75.0,74.031,74.0,361300,75.0,73.0
627,2017/03/21,74.0,72.742,73.0,794100,74.0,72.0
628,2017/03/22,72.0,72.288,72.0,205600,73.0,72.0
629,2017/03/23,72.0,71.9,72.0,314800,73.0,71.0
630,2017/03/24,73.0,72.206,72.0,172200,73.0,72.0
631,2017/03/27,71.0,71.784,73.0,255800,73.0,71.0
632,2017/03/28,72.0,71.517,71.0,477400,73.0,70.0
633,2017/03/29,73.0,72.455,72.0,163200,73.0,71.0
634,2017/03/30,70.0,71.636,73.0,221700,73.0,70.0
635,2017/03/31,72.0,70.983,70.0,259400,72.0,70.0
636,2017/04/03,70.0,70.824,71.0,247000,72.0,70.0
637,2017/04/04,70.0,69.595,70.0,603600,71.0,68.0
638,2017/04/05,70.0,69.361,69.0,317100,71.0,68.0
639,2017/04/06,67.0,68.481,70.0,462100,70.0,67.0
640,2017/04/07,68.0,67.907,68.0,416800,69.0,67.0
641,2017/04/10,67.0,67.956,68.0,247200,69.0,67.0
642,2017/04/11,67.0,67.49,67.0,258000,69.0,67.0
643,2017/04/12,69.0,70.838,68.0,4095300,80.0,65.0
644,2017/04/13,66.0,66.254,67.0,1893600,68.0,65.0
645,2017/04/14,65.0,65.166,66.0,569200,66.0,64.0
646,2017/04/17,66.0,64.674,64.0,520300,66.0,63.0
647,2017/04/18,65.0,65.945,66.0,317100,67.0,65.0
648,2017/04/19,66.0,65.029,65.0,352100,66.0,64.0
649,2017/04/20,66.0,64.852,66.0,544600,66.0,64.0
650,2017/04/21,66.0,65.643,66.0,125100,66.0,65.0
651,2017/04/24,66.0,65.396,66.0,298800,66.0,65.0
652,2017/04/25,68.0,67.661,65.0,1563000,70.0,65.0
653,2017/04/26,69.0,68.867,68.0,628200,71.0,68.0
654,2017/04/27,69.0,68.261,69.0,118300,69.0,68.0
655,2017/04/28,68.0,69.341,68.0,492700,71.0,68.0
656,2017/05/01,68.0,68.737,68.0,196000,70.0,68.0
657,2017/05/02,69.0,69.035,69.0,195200,70.0,68.0
658,2017/05/08,69.0,70.286,69.0,689100,72.0,69.0
659,2017/05/09,71.0,71.015,70.0,1375700,73.0,69.0
660,2017/05/10,71.0,70.864,71.0,412800,72.0,70.0
661,2017/05/11,71.0,70.541,71.0,430900,71.0,70.0
662,2017/05/12,71.0,70.417,71.0,505300,72.0,70.0
663,2017/05/15,72.0,70.996,72.0,588400,72.0,70.0
664,2017/05/16,73.0,72.65,72.0,1218200,74.0,72.0
665,2017/05/17,72.0,72.599,73.0,155500,73.0,72.0
666,2017/05/18,72.0,70.886,71.0,671200,72.0,70.0
667,2017/05/19,72.0,71.412,71.0,124900,72.0,71.0
668,2017/05/22,72.0,72.332,72.0,217600,73.0,72.0
669,2017/05/23,73.0,72.654,73.0,208000,73.0,72.0
670,2017/05/24,74.0,75.543,73.0,5639200,79.0,73.0
671,2017/05/25,71.0,73.143,75.0,1606800,76.0,71.0
672,2017/05/26,72.0,71.85,72.0,301100,73.0,71.0
673,2017/05/29,70.0,70.391,73.0,1542000,73.0,69.0
674,2017/05/30,69.0,69.421,70.0,589700,71.0,69.0
675,2017/05/31,69.0,68.389,69.0,1006400,70.0,68.0
676,2017/06/01,70.0,68.926,69.0,478300,70.0,68.0
677,2017/06/02,69.0,69.118,70.0,376700,70.0,68.0
678,2017/06/05,70.0,69.907,70.0,508400,70.0,69.0
679,2017/06/06,70.0,69.1,70.0,416800,70.0,69.0
680,2017/06/07,68.0,68.906,69.0,305900,70.0,68.0
681,2017/06/08,69.0,68.892,68.0,362800,70.0,68.0
682,2017/06/09,70.0,69.379,69.0,198100,70.0,69.0
683,2017/06/12,70.0,69.843,70.0,844900,71.0,69.0
684,2017/06/13,70.0,69.914,70.0,475300,71.0,69.0
685,2017/06/14,87.0,84.182,80.0,64545100,90.0,77.0
686,2017/06/15,77.0,79.203,84.0,25842800,85.0,75.0
687,2017/06/16,83.0,85.029,86.0,28400900,90.0,81.0
688,2017/06/19,82.0,80.781,84.0,9171600,85.0,78.0
689,2017/06/20,79.0,79.446,82.0,4569500,82.0,78.0
690,2017/06/21,78.0,77.874,79.0,3085800,80.0,77.0
691,2017/06/22,77.0,77.117,78.0,3556700,79.0,76.0
692,2017/06/23,77.0,76.299,78.0,2719600,78.0,75.0
693,2017/06/26,77.0,78.329,77.0,3181900,80.0,76.0
694,2017/06/27,83.0,80.956,78.0,7174000,84.0,77.0
695,2017/06/28,84.0,82.775,84.0,6836100,84.0,81.0
696,2017/06/29,94.0,88.711,84.0,17771500,95.0,83.0
697,2017/06/30,91.0,91.066,91.0,16521000,95.0,88.0
698,2017/07/03,92.0,92.997,93.0,13966600,97.0,90.0
699,2017/07/04,88.0,90.78,95.0,17263700,96.0,86.0
700,2017/07/05,87.0,87.852,87.0,4336300,90.0,86.0
701,2017/07/06,84.0,85.76,88.0,4598400,89.0,84.0
702,2017/07/07,87.0,86.246,84.0,4058200,88.0,83.0
703,2017/07/10,88.0,87.797,88.0,2242100,89.0,87.0
704,2017/07/11,89.0,89.431,88.0,4972700,91.0,87.0
705,2017/07/12,87.0,88.188,89.0,2231400,90.0,87.0
706,2017/07/13,87.0,87.392,88.0,1349600,88.0,86.0
707,2017/07/14,88.0,87.39,89.0,2355900,89.0,86.0
708,2017/07/18,87.0,88.59,89.0,4868900,91.0,86.0
709,2017/07/19,86.0,87.048,87.0,1145900,88.0,86.0
710,2017/07/20,87.0,86.477,87.0,946200,87.0,86.0
711,2017/07/21,87.0,85.136,87.0,3494300,87.0,83.0
712,2017/07/24,87.0,87.61,87.0,3248300,89.0,86.0
713,2017/07/25,86.0,86.707,88.0,797800,88.0,86.0
714,2017/07/26,85.0,85.798,86.0,1409000,87.0,85.0
715,2017/07/27,85.0,85.391,85.0,496400,86.0,85.0
716,2017/07/28,85.0,85.34,86.0,1107600,87.0,85.0
717,2017/07/31,83.0,83.792,85.0,1654700,86.0,83.0
718,2017/08/01,81.0,80.273,82.0,3419300,83.0,78.0
719,2017/08/02,81.0,80.41,79.0,1143500,82.0,79.0
720,2017/08/03,80.0,80.796,81.0,940500,82.0,80.0
721,2017/08/04,80.0,80.151,80.0,444800,81.0,80.0
722,2017/08/07,80.0,81.41,80.0,3370100,84.0,79.0
723,2017/08/08,84.0,82.435,81.0,1420500,84.0,80.0
724,2017/08/09,84.0,82.587,84.0,1928200,84.0,81.0
725,2017/08/10,79.0,81.457,84.0,3760900,84.0,78.0
726,2017/08/14,78.0,77.747,78.0,1580100,79.0,76.0
727,2017/08/15,79.0,78.631,80.0,1109200,80.0,77.0
728,2017/08/16,80.0,78.897,78.0,708900,80.0,78.0
729,2017/08/17,80.0,80.698,80.0,1007600,82.0,79.0
730,2017/08/18,79.0,79.04,79.0,1695800,80.0,78.0
731,2017/08/21,79.0,79.608,81.0,1188200,81.0,78.0
732,2017/08/22,79.0,79.026,79.0,719500,80.0,78.0
733,2017/08/23,80.0,79.343,80.0,270100,80.0,79.0
734,2017/08/24,78.0,78.961,79.0,653800,80.0,78.0
735,2017/08/25,79.0,79.209,79.0,646200,80.0,78.0
736,2017/08/28,82.0,82.368,80.0,2520100,85.0,80.0
737,2017/08/29,83.0,83.048,82.0,1804400,85.0,82.0
738,2017/08/30,83.0,82.895,83.0,849000,84.0,82.0
739,2017/08/31,84.0,83.483,83.0,699200,84.0,82.0
740,2017/09/01,84.0,84.059,84.0,967800,85.0,83.0
741,2017/09/04,82.0,82.408,83.0,1873200,84.0,81.0
742,2017/09/05,77.0,78.951,82.0,2097000,82.0,77.0
743,2017/09/06,78.0,76.262,76.0,1883100,78.0,74.0
744,2017/09/07,77.0,76.36,76.0,2199700,78.0,75.0
745,2017/09/08,76.0,76.684,77.0,475600,78.0,76.0
746,2017/09/11,79.0,78.301,77.0,602200,80.0,76.0
747,2017/09/12,82.0,81.002,79.0,1565400,82.0,79.0
748,2017/09/13,83.0,82.243,82.0,519500,83.0,81.0
749,2017/09/14,81.0,81.44,82.0,1011200,83.0,80.0
750,2017/09/15,82.0,80.738,80.0,677700,82.0,80.0
751,2017/09/19,82.0,82.375,83.0,678000,83.0,82.0
752,2017/09/20,81.0,81.983,82.0,885100,83.0,81.0
753,2017/09/21,82.0,82.858,81.0,1109400,84.0,81.0
754,2017/09/22,81.0,81.917,82.0,884900,83.0,81.0
755,2017/09/25,81.0,81.559,82.0,585600,83.0,81.0
756,2017/09/26,79.0,79.943,81.0,822700,82.0,79.0
757,2017/09/27,81.0,80.562,80.0,974100,82.0,79.0
758,2017/09/28,81.0,80.533,80.0,303500,81.0,80.0
759,2017/09/29,82.0,80.508,81.0,774200,82.0,79.0
760,2017/10/02,82.0,82.093,82.0,690000,83.0,81.0
761,2017/10/03,83.0,82.235,82.0,727500,83.0,82.0
762,2017/10/04,81.0,82.043,83.0,441500,83.0,81.0
763,2017/10/05,80.0,80.556,81.0,706500,82.0,80.0
764,2017/10/06,81.0,80.538,80.0,425700,81.0,80.0
765,2017/10/10,82.0,80.866,80.0,584200,82.0,80.0
766,2017/10/11,82.0,81.555,82.0,359500,82.0,81.0
767,2017/10/12,80.0,80.888,81.0,620700,82.0,80.0
768,2017/10/13,81.0,80.897,81.0,668600,82.0,80.0
769,2017/10/16,79.0,79.974,80.0,1154500,81.0,79.0
770,2017/10/17,80.0,80.051,80.0,435300,81.0,79.0
771,2017/10/18,80.0,80.139,80.0,696300,81.0,80.0
772,2017/10/19,79.0,80.109,81.0,337900,81.0,79.0
773,2017/10/20,78.0,78.908,80.0,545000,80.0,78.0
774,2017/10/23,79.0,79.254,78.0,858000,80.0,78.0
775,2017/10/24,79.0,79.271,80.0,447300,80.0,79.0
776,2017/10/25,79.0,79.122,80.0,829500,80.0,79.0
777,2017/10/26,79.0,79.035,79.0,225800,80.0,79.0
778,2017/10/27,80.0,78.579,78.0,1603500,80.0,78.0
779,2017/10/30,79.0,79.588,80.0,361400,80.0,79.0
780,2017/10/31,80.0,79.413,79.0,183700,80.0,79.0
781,2017/11/01,79.0,78.972,79.0,738800,80.0,78.0
782,2017/11/02,79.0,79.37,80.0,350700,80.0,79.0
783,2017/11/06,80.0,79.148,79.0,505400,80.0,79.0
784,2017/11/07,82.0,80.682,79.0,3005400,83.0,78.0
785,2017/11/08,86.0,83.712,82.0,4585100,86.0,82.0
786,2017/11/09,85.0,85.077,87.0,4494500,88.0,83.0
787,2017/11/10,85.0,85.639,86.0,2307200,87.0,84.0
788,2017/11/13,77.0,77.252,77.0,5163900,79.0,76.0
789,2017/11/14,77.0,77.106,77.0,976700,78.0,77.0
790,2017/11/15,72.0,73.878,76.0,4274000,77.0,72.0
791,2017/11/16,73.0,72.537,72.0,1420100,73.0,71.0
792,2017/11/17,73.0,73.089,73.0,1308200,74.0,72.0
793,2017/11/20,74.0,73.825,73.0,896000,75.0,73.0
794,2017/11/21,75.0,74.575,75.0,635400,75.0,74.0
795,2017/11/22,74.0,75.038,75.0,566900,76.0,74.0
796,2017/11/24,75.0,74.413,74.0,228300,75.0,74.0
797,2017/11/27,76.0,74.912,75.0,533900,76.0,74.0
798,2017/11/28,75.0,74.508,76.0,1005800,76.0,73.0
799,2017/11/29,73.0,73.937,74.0,1057400,75.0,73.0
800,2017/11/30,73.0,72.859,73.0,1214400,74.0,72.0
801,2017/12/01,73.0,72.993,73.0,832800,74.0,72.0
802,2017/12/04,72.0,72.556,73.0,718500,73.0,72.0
803,2017/12/05,73.0,72.209,72.0,405900,73.0,72.0
804,2017/12/06,71.0,71.941,72.0,823600,73.0,71.0
805,2017/12/07,71.0,71.604,71.0,478300,72.0,71.0
806,2017/12/08,71.0,71.231,72.0,463900,72.0,71.0
807,2017/12/11,72.0,71.751,72.0,360600,72.0,71.0
808,2017/12/12,73.0,71.939,72.0,844500,73.0,71.0
809,2017/12/13,74.0,73.395,73.0,1242600,74.0,72.0
810,2017/12/14,73.0,73.155,74.0,957100,74.0,72.0
811,2017/12/15,71.0,71.952,72.0,1240200,73.0,71.0
812,2017/12/18,70.0,70.826,71.0,1196100,72.0,70.0
813,2017/12/19,70.0,70.278,70.0,1522900,72.0,69.0
814,2017/12/20,69.0,69.68,70.0,439000,70.0,69.0
815,2017/12/21,69.0,68.486,69.0,1977900,69.0,67.0
816,2017/12/22,66.0,67.253,68.0,2445200,69.0,66.0
817,2017/12/25,66.0,66.295,67.0,2801800,67.0,65.0
818,2017/12/26,66.0,65.519,66.0,2816600,67.0,65.0
819,2017/12/27,69.0,66.965,65.0,2693600,69.0,65.0
820,2017/12/28,68.0,68.833,69.0,1009900,70.0,68.0
821,2017/12/29,68.0,68.146,68.0,800800,69.0,67.0
822,2018/01/04,68.0,69.018,69.0,1083200,70.0,68.0
823,2018/01/05,69.0,68.665,69.0,277900,69.0,68.0
824,2018/01/09,70.0,70.082,69.0,2155700,72.0,69.0
825,2018/01/10,71.0,70.274,70.0,874100,71.0,70.0
826,2018/01/11,72.0,72.556,71.0,2935300,74.0,70.0
827,2018/01/12,73.0,73.019,72.0,2445900,74.0,72.0
828,2018/01/15,74.0,73.864,74.0,1651800,75.0,73.0
829,2018/01/16,75.0,76.583,74.0,8298100,81.0,73.0
830,2018/01/17,75.0,75.077,76.0,1420800,76.0,74.0
831,2018/01/18,74.0,74.271,75.0,1269900,76.0,73.0
832,2018/01/19,73.0,73.759,74.0,343100,75.0,73.0
833,2018/01/22,74.0,73.388,74.0,595300,74.0,73.0
834,2018/01/23,74.0,73.301,74.0,420900,74.0,73.0
835,2018/01/24,73.0,73.461,74.0,457800,74.0,73.0
836,2018/01/25,73.0,73.027,73.0,709500,74.0,72.0
837,2018/01/26,72.0,73.05,73.0,789100,74.0,72.0
838,2018/01/29,73.0,73.047,73.0,678100,74.0,72.0
839,2018/01/30,72.0,72.636,73.0,656200,74.0,72.0
840,2018/01/31,71.0,71.038,71.0,1070900,72.0,70.0
841,2018/02/01,74.0,72.902,71.0,970700,74.0,71.0
842,2018/02/02,72.0,72.271,73.0,654000,73.0,71.0
843,2018/02/05,70.0,70.472,71.0,1057300,71.0,70.0
844,2018/02/06,67.0,65.994,67.0,3570800,68.0,64.0
845,2018/02/07,67.0,68.042,69.0,1343400,69.0,66.0
846,2018/02/08,68.0,67.167,67.0,354800,68.0,67.0
847,2018/02/09,67.0,65.411,64.0,1191400,68.0,64.0
848,2018/02/13,64.0,64.547,67.0,2470800,68.0,63.0
849,2018/02/14,64.0,64.603,64.0,1524000,66.0,64.0
850,2018/02/15,66.0,65.064,65.0,677600,66.0,65.0
851,2018/02/16,66.0,65.578,65.0,996500,67.0,65.0
852,2018/02/19,67.0,66.162,66.0,403000,67.0,65.0
853,2018/02/20,66.0,66.634,67.0,384200,67.0,66.0
854,2018/02/21,67.0,66.943,67.0,526400,68.0,66.0
855,2018/02/22,67.0,66.981,67.0,732200,68.0,66.0
856,2018/02/23,69.0,67.781,67.0,481600,69.0,67.0
857,2018/02/26,68.0,68.371,69.0,685800,69.0,67.0
858,2018/02/27,67.0,67.792,68.0,637500,68.0,67.0
859,2018/02/28,67.0,67.664,68.0,298600,68.0,67.0
860,2018/03/01,66.0,66.913,67.0,757200,68.0,66.0
861,2018/03/02,67.0,65.77,65.0,658100,67.0,65.0
862,2018/03/05,65.0,66.013,66.0,367000,67.0,65.0
863,2018/03/06,66.0,66.08,66.0,191200,67.0,66.0
864,2018/03/07,66.0,66.004,66.0,628200,67.0,65.0
865,2018/03/08,67.0,66.058,66.0,443800,67.0,65.0
866,2018/03/09,69.0,67.801,67.0,2035800,69.0,66.0
867,2018/03/12,68.0,67.959,69.0,896900,69.0,67.0
868,2018/03/13,68.0,67.091,67.0,188600,68.0,67.0
869,2018/03/14,67.0,67.279,67.0,209900,68.0,67.0
870,2018/03/15,66.0,66.985,67.0,362100,68.0,66.0
871,2018/03/16,67.0,67.061,67.0,526600,68.0,66.0
872,2018/03/19,66.0,66.765,67.0,1196700,68.0,66.0
873,2018/03/20,65.0,65.334,66.0,567200,66.0,65.0
874,2018/03/22,66.0,65.533,65.0,297500,66.0,65.0
875,2018/03/23,64.0,64.447,65.0,754000,65.0,64.0
876,2018/03/26,63.0,63.557,63.0,1273800,65.0,63.0
877,2018/03/27,64.0,63.972,64.0,874100,65.0,63.0
878,2018/03/28,65.0,65.083,63.0,1078500,66.0,63.0
879,2018/03/29,65.0,65.011,65.0,289400,66.0,65.0
880,2018/03/30,65.0,65.762,66.0,442300,66.0,65.0
881,2018/04/02,66.0,66.104,66.0,417600,67.0,66.0
882,2018/04/03,65.0,65.398,66.0,313400,66.0,65.0
883,2018/04/04,65.0,65.281,65.0,121200,66.0,65.0
884,2018/04/05,65.0,65.329,66.0,232600,66.0,65.0
885,2018/04/06,65.0,65.234,66.0,450600,66.0,65.0
886,2018/04/09,65.0,64.335,65.0,1622300,66.0,63.0
887,2018/04/10,62.0,62.248,64.0,2641400,64.0,60.0
888,2018/04/11,60.0,60.743,62.0,2746300,63.0,60.0
889,2018/04/12,60.0,60.148,60.0,1472500,61.0,59.0
890,2018/04/13,59.0,59.325,60.0,1429200,61.0,58.0
891,2018/04/16,60.0,59.384,59.0,305900,60.0,59.0
892,2018/04/17,59.0,59.118,60.0,750700,60.0,59.0
893,2018/04/18,60.0,59.051,59.0,802800,60.0,58.0
894,2018/04/19,61.0,60.337,59.0,1430400,62.0,59.0
895,2018/04/20,60.0,60.778,60.0,564000,62.0,60.0
896,2018/04/23,61.0,60.909,60.0,937500,62.0,60.0
897,2018/04/24,63.0,61.982,61.0,872600,63.0,61.0
898,2018/04/25,61.0,61.347,62.0,1236100,62.0,60.0
899,2018/04/26,60.0,60.574,61.0,541400,61.0,60.0
900,2018/04/27,59.0,59.901,60.0,1107200,61.0,59.0
901,2018/05/01,59.0,59.484,60.0,396200,60.0,59.0
902,2018/05/02,60.0,60.037,60.0,312700,61.0,59.0
903,2018/05/07,61.0,60.58,61.0,582900,61.0,60.0
904,2018/05/08,61.0,61.575,61.0,1046200,63.0,61.0
905,2018/05/09,62.0,61.032,61.0,458400,62.0,60.0
906,2018/05/10,61.0,61.026,61.0,482700,62.0,61.0
907,2018/05/11,60.0,60.665,61.0,317100,62.0,60.0
908,2018/05/14,62.0,61.499,61.0,1066300,63.0,60.0
909,2018/05/15,61.0,60.974,62.0,545200,62.0,60.0
910,2018/05/16,60.0,60.145,60.0,203600,61.0,60.0
911,2018/05/17,60.0,60.587,60.0,991300,61.0,60.0
912,2018/05/18,61.0,60.748,61.0,142200,61.0,60.0
913,2018/05/21,63.0,62.515,61.0,2142900,64.0,61.0
914,2018/05/22,64.0,63.059,63.0,874700,64.0,62.0
915,2018/05/23,63.0,63.085,64.0,1443500,64.0,63.0
916,2018/05/24,64.0,63.233,64.0,929100,64.0,63.0
917,2018/05/25,62.0,62.401,63.0,807500,64.0,61.0
918,2018/05/28,61.0,61.088,62.0,808400,62.0,60.0
919,2018/05/29,62.0,61.155,62.0,620200,62.0,60.0
920,2018/05/30,60.0,60.784,61.0,531000,62.0,60.0
921,2018/05/31,61.0,61.005,61.0,345500,62.0,61.0
922,2018/06/01,60.0,60.941,61.0,395000,62.0,60.0
923,2018/06/04,62.0,61.273,62.0,468100,62.0,61.0
924,2018/06/05,62.0,61.052,62.0,664700,62.0,60.0
925,2018/06/06,61.0,61.049,61.0,328000,62.0,61.0
926,2018/06/07,61.0,61.341,62.0,838300,62.0,60.0
927,2018/06/08,61.0,60.703,61.0,456700,62.0,60.0
928,2018/06/11,60.0,60.528,61.0,336300,61.0,60.0
929,2018/06/12,61.0,60.72,61.0,231700,61.0,60.0
930,2018/06/13,61.0,60.702,61.0,205600,61.0,60.0
931,2018/06/14,60.0,61.006,61.0,585400,62.0,60.0
932,2018/06/15,61.0,60.992,61.0,525400,62.0,60.0
933,2018/06/18,60.0,60.353,61.0,538100,61.0,60.0
934,2018/06/19,59.0,59.826,60.0,929300,60.0,59.0
935,2018/06/20,58.0,58.407,59.0,1566400,60.0,57.0
936,2018/06/21,60.0,59.073,59.0,482700,60.0,58.0
937,2018/06/22,59.0,58.69,58.0,407300,60.0,58.0
938,2018/06/25,57.0,58.465,59.0,780900,60.0,57.0
939,2018/06/26,56.0,56.224,57.0,1444800,57.0,55.0
940,2018/06/27,57.0,56.038,56.0,555000,57.0,55.0
941,2018/06/28,56.0,56.081,56.0,326900,57.0,56.0
942,2018/06/29,57.0,56.361,56.0,273600,57.0,56.0
943,2018/07/02,55.0,55.736,56.0,478400,57.0,55.0
944,2018/07/03,61.0,61.198,61.0,24172000,66.0,58.0
945,2018/07/04,59.0,58.909,61.0,5835100,62.0,57.0
946,2018/07/05,57.0,57.597,59.0,2912100,60.0,55.0
947,2018/07/06,55.0,54.799,55.0,4556000,56.0,53.0
948,2018/07/09,54.0,54.816,56.0,1614900,56.0,54.0
949,2018/07/10,55.0,54.939,55.0,1154400,56.0,54.0
950,2018/07/11,53.0,53.619,55.0,1257200,55.0,53.0
951,2018/07/12,54.0,53.831,54.0,561600,54.0,53.0
952,2018/07/13,53.0,53.352,53.0,807500,54.0,53.0
953,2018/07/17,54.0,53.684,53.0,1435300,55.0,53.0
954,2018/07/18,55.0,54.038,54.0,1095000,55.0,53.0
955,2018/07/19,54.0,54.04,54.0,239800,55.0,54.0
956,2018/07/20,54.0,54.006,54.0,658700,55.0,53.0
957,2018/07/23,54.0,54.783,55.0,735100,56.0,54.0
958,2018/07/24,55.0,54.738,54.0,284900,55.0,54.0
959,2018/07/25,56.0,55.118,55.0,997000,56.0,54.0
960,2018/07/26,55.0,55.127,56.0,408200,56.0,55.0
961,2018/07/27,55.0,54.896,55.0,385100,55.0,54.0
962,2018/07/30,54.0,54.662,55.0,169500,55.0,54.0
963,2018/07/31,54.0,54.047,54.0,342000,55.0,54.0
964,2018/08/01,53.0,53.871,54.0,634600,55.0,53.0
965,2018/08/02,53.0,53.053,53.0,1473200,54.0,53.0
966,2018/08/03,53.0,52.658,53.0,1102800,54.0,52.0
967,2018/08/06,52.0,52.546,53.0,440000,53.0,52.0
968,2018/08/07,52.0,52.185,52.0,371400,53.0,52.0
969,2018/08/08,53.0,52.403,52.0,203600,53.0,52.0
970,2018/08/09,52.0,52.188,53.0,291200,53.0,52.0
971,2018/08/10,51.0,51.421,52.0,299500,52.0,51.0
972,2018/08/13,49.0,49.041,51.0,1753000,52.0,47.0
973,2018/08/14,48.0,47.777,48.0,1361000,49.0,47.0
974,2018/08/15,46.0,46.24,47.0,961400,47.0,46.0
975,2018/08/16,44.0,44.712,45.0,728200,45.0,44.0
976,2018/08/17,47.0,45.922,44.0,1639700,48.0,44.0
977,2018/08/20,46.0,46.569,47.0,832100,48.0,46.0
978,2018/08/21,47.0,45.93,46.0,729700,47.0,45.0
979,2018/08/22,46.0,45.945,46.0,378000,47.0,45.0
980,2018/08/23,46.0,46.037,46.0,366700,47.0,46.0
981,2018/08/24,47.0,46.839,47.0,172700,47.0,46.0
982,2018/08/27,49.0,47.942,46.0,1666100,50.0,46.0
983,2018/08/28,50.0,48.967,49.0,528900,50.0,48.0
984,2018/08/29,51.0,50.207,49.0,1163400,52.0,49.0
985,2018/08/30,52.0,52.165,51.0,894900,53.0,51.0
986,2018/08/31,53.0,53.113,52.0,1405900,55.0,51.0
987,2018/09/03,53.0,53.659,54.0,965700,55.0,53.0
988,2018/09/04,52.0,52.225,53.0,750600,54.0,51.0
989,2018/09/05,51.0,51.945,52.0,494500,53.0,51.0
990,2018/09/06,50.0,50.422,51.0,871400,52.0,49.0
991,2018/09/07,49.0,49.569,50.0,1437700,51.0,48.0
992,2018/09/10,51.0,51.25,49.0,862700,53.0,49.0
993,2018/09/11,51.0,51.289,51.0,1230900,52.0,50.0
994,2018/09/12,50.0,50.261,51.0,794100,52.0,49.0
995,2018/09/13,50.0,49.991,49.0,334700,51.0,49.0
996,2018/09/14,51.0,50.977,50.0,551000,52.0,50.0
997,2018/09/18,51.0,51.086,51.0,226600,52.0,50.0
998,2018/09/19,50.0,50.262,50.0,437300,51.0,50.0
999,2018/09/20,51.0,50.551,50.0,395800,51.0,50.0
1000,2018/09/21,51.0,50.334,51.0,817200,51.0,49.0
1001,2018/09/25,51.0,50.032,51.0,609300,51.0,49.0
1002,2018/09/26,51.0,50.915,50.0,715400,52.0,50.0
1003,2018/09/27,51.0,51.117,51.0,609500,52.0,51.0
1004,2018/09/28,52.0,51.217,51.0,393000,52.0,51.0
1005,2018/10/01,53.0,52.804,52.0,1452700,54.0,52.0
1006,2018/10/02,54.0,53.695,53.0,775400,55.0,53.0
1007,2018/10/03,51.0,52.131,53.0,838100,53.0,51.0
1008,2018/10/04,52.0,51.211,51.0,406500,52.0,51.0
1009,2018/10/05,50.0,50.585,51.0,658500,51.0,50.0
1010,2018/10/09,49.0,49.91,51.0,741800,51.0,49.0
1011,2018/10/10,52.0,51.164,50.0,2261700,53.0,49.0
1012,2018/10/11,49.0,50.603,50.0,2148200,53.0,49.0
1013,2018/10/12,51.0,50.85,50.0,776600,52.0,49.0
1014,2018/10/15,51.0,51.254,51.0,272400,52.0,51.0
1015,2018/10/16,50.0,51.292,52.0,536600,52.0,50.0
1016,2018/10/17,52.0,51.012,51.0,640200,52.0,50.0
1017,2018/10/18,51.0,50.999,51.0,378600,52.0,50.0
1018,2018/10/19,52.0,51.437,51.0,414200,52.0,51.0
1019,2018/10/22,51.0,51.679,52.0,300600,52.0,51.0
1020,2018/10/23,51.0,51.077,51.0,704800,52.0,51.0
1021,2018/10/24,50.0,50.822,51.0,383300,52.0,50.0
1022,2018/10/25,49.0,49.953,50.0,1183500,51.0,49.0
1023,2018/10/26,49.0,49.182,50.0,1150100,51.0,48.0
1024,2018/10/29,48.0,48.441,48.0,1089800,50.0,47.0
1025,2018/10/30,46.0,45.899,47.0,1894600,47.0,45.0
1026,2018/10/31,49.0,47.237,47.0,1065500,49.0,46.0
1027,2018/11/01,47.0,47.959,48.0,571200,49.0,47.0
1028,2018/11/02,49.0,48.019,48.0,564300,49.0,47.0
1029,2018/11/05,48.0,48.338,48.0,262600,49.0,48.0
1030,2018/11/06,50.0,48.887,49.0,561800,50.0,48.0
1031,2018/11/07,50.0,49.307,49.0,302800,50.0,49.0
1032,2018/11/08,50.0,49.654,50.0,416900,50.0,49.0
1033,2018/11/09,50.0,49.343,50.0,385700,50.0,49.0
1034,2018/11/12,49.0,49.251,50.0,562200,50.0,49.0
1035,2018/11/13,49.0,48.584,48.0,486500,50.0,48.0
1036,2018/11/14,46.0,46.48,47.0,2195700,48.0,45.0
1037,2018/11/15,44.0,44.546,45.0,1327900,46.0,44.0
1038,2018/11/16,44.0,44.115,44.0,559200,45.0,44.0
1039,2018/11/19,43.0,43.778,44.0,655300,45.0,43.0
1040,2018/11/20,43.0,43.255,43.0,1248400,45.0,42.0
1041,2018/11/21,43.0,43.072,43.0,615600,44.0,42.0
1042,2018/11/22,43.0,43.071,43.0,354900,44.0,43.0
1043,2018/11/26,43.0,43.332,44.0,653800,44.0,42.0
1044,2018/11/27,43.0,41.271,40.0,3496500,43.0,40.0
1045,2018/11/28,42.0,42.858,43.0,538300,43.0,42.0
1046,2018/11/29,42.0,42.799,43.0,594300,43.0,42.0
1047,2018/11/30,42.0,42.187,42.0,595200,43.0,42.0
1048,2018/12/03,42.0,42.007,42.0,862000,43.0,41.0
1049,2018/12/04,42.0,42.338,43.0,799200,43.0,42.0
1050,2018/12/05,42.0,41.873,42.0,1079600,42.0,41.0
1051,2018/12/06,40.0,41.006,42.0,1144500,42.0,40.0
1052,2018/12/07,40.0,40.054,40.0,792400,41.0,40.0
1053,2018/12/10,38.0,38.6,40.0,1963900,40.0,37.0
1054,2018/12/11,35.0,36.663,37.0,1975700,38.0,35.0
1055,2018/12/12,36.0,35.981,36.0,2661100,37.0,35.0
1056,2018/12/13,37.0,35.439,35.0,996000,37.0,35.0
1057,2018/12/14,37.0,35.936,36.0,1176100,37.0,35.0
1058,2018/12/17,35.0,35.262,35.0,624200,36.0,35.0
1059,2018/12/18,33.0,33.731,35.0,1530900,35.0,33.0
1060,2018/12/19,31.0,31.997,32.0,954600,33.0,31.0
1061,2018/12/20,29.0,29.47,30.0,2705600,31.0,28.0
1062,2018/12/21,30.0,28.87,29.0,2462600,30.0,28.0
1063,2018/12/25,25.0,26.721,27.0,2625100,29.0,25.0
1064,2018/12/26,27.0,27.135,27.0,1204300,28.0,26.0
1065,2018/12/27,29.0,29.35,29.0,2324800,31.0,28.0
1066,2018/12/28,29.0,29.743,30.0,582200,30.0,29.0
1067,2019/01/04,31.0,29.185,29.0,1352200,31.0,28.0
1068,2019/01/07,33.0,32.108,32.0,872400,33.0,31.0
1069,2019/01/08,32.0,32.789,32.0,878100,34.0,32.0
1070,2019/01/09,32.0,32.701,33.0,759500,34.0,32.0
1071,2019/01/10,33.0,32.294,33.0,705400,33.0,31.0
1072,2019/01/11,32.0,32.175,32.0,274900,33.0,32.0
1073,2019/01/15,32.0,32.458,33.0,245000,33.0,32.0
1074,2019/01/16,31.0,32.217,33.0,441700,33.0,31.0
1075,2019/01/17,32.0,32.118,31.0,2148700,34.0,31.0
1076,2019/01/18,32.0,32.586,32.0,626900,33.0,32.0
1077,2019/01/21,32.0,32.548,33.0,337700,33.0,32.0
1078,2019/01/22,31.0,31.804,32.0,718800,32.0,31.0
1079,2019/01/23,31.0,30.975,31.0,743700,32.0,30.0
1080,2019/01/24,32.0,31.212,31.0,236300,32.0,31.0
1081,2019/01/25,33.0,32.027,32.0,1156100,33.0,31.0
1082,2019/01/28,32.0,32.809,33.0,696900,33.0,32.0
1083,2019/01/29,32.0,32.621,32.0,527300,33.0,32.0
1084,2019/01/30,31.0,31.732,32.0,584500,32.0,31.0
1085,2019/01/31,31.0,31.377,32.0,352700,32.0,31.0
1086,2019/02/01,31.0,31.102,32.0,1336100,32.0,31.0
1087,2019/02/04,32.0,31.591,31.0,1124000,32.0,31.0
1088,2019/02/05,31.0,31.093,31.0,728300,32.0,31.0
1089,2019/02/06,32.0,31.736,32.0,1023400,32.0,31.0
1090,2019/02/07,31.0,31.074,31.0,407500,32.0,31.0
1091,2019/02/08,30.0,30.724,31.0,649400,31.0,30.0
1092,2019/02/12,31.0,31.015,31.0,509800,32.0,30.0
1093,2019/02/13,31.0,31.461,31.0,228400,32.0,31.0
1094,2019/02/14,30.0,29.966,30.0,1132500,31.0,29.0
1095,2019/02/15,27.0,28.168,31.0,3336000,31.0,25.0
1096,2019/02/18,28.0,27.999,28.0,648600,29.0,27.0
1097,2019/02/19,28.0,28.905,29.0,580800,29.0,28.0
1098,2019/02/20,27.0,27.937,28.0,982600,29.0,27.0
1099,2019/02/21,27.0,27.227,27.0,554300,28.0,27.0
1100,2019/02/22,28.0,27.371,27.0,424500,28.0,27.0
1101,2019/02/25,28.0,28.046,28.0,619200,29.0,27.0
1102,2019/02/26,29.0,29.575,29.0,1913800,31.0,28.0
1103,2019/02/27,32.0,31.061,30.0,2496500,33.0,29.0
1104,2019/02/28,30.0,31.228,32.0,1141700,32.0,30.0
1105,2019/03/01,31.0,30.81,30.0,708900,32.0,30.0
1106,2019/03/04,29.0,30.095,31.0,1507700,32.0,29.0
1107,2019/03/05,30.0,30.074,30.0,658600,31.0,29.0
1108,2019/03/06,30.0,29.997,30.0,943500,30.0,29.0
1109,2019/03/07,30.0,29.879,30.0,342100,30.0,29.0
1110,2019/03/08,29.0,29.131,30.0,944000,30.0,28.0
1111,2019/03/11,30.0,29.136,29.0,601000,30.0,28.0
1112,2019/03/12,29.0,29.511,29.0,488300,30.0,29.0
1113,2019/03/13,29.0,29.058,29.0,357000,30.0,29.0
1114,2019/03/14,29.0,29.883,30.0,495700,30.0,29.0
1115,2019/03/15,29.0,29.937,30.0,682900,30.0,29.0
1116,2019/03/18,29.0,29.047,29.0,734200,30.0,28.0
1117,2019/03/19,29.0,28.949,29.0,418600,29.0,28.0
1118,2019/03/20,29.0,29.064,29.0,521600,30.0,28.0
1119,2019/03/22,29.0,29.356,30.0,313900,30.0,29.0
1120,2019/03/25,29.0,29.017,29.0,931000,30.0,28.0
1121,2019/03/26,30.0,29.787,29.0,1619300,31.0,29.0
1122,2019/03/27,29.0,29.636,29.0,145400,30.0,29.0
1123,2019/03/28,29.0,29.064,29.0,700500,30.0,28.0
1124,2019/03/29,29.0,29.013,29.0,242200,30.0,29.0
1125,2019/04/01,30.0,29.343,29.0,361600,30.0,29.0
1126,2019/04/02,29.0,29.061,29.0,529600,30.0,28.0
1127,2019/04/03,29.0,28.864,28.0,429300,30.0,28.0
1128,2019/04/04,29.0,28.982,29.0,468600,30.0,28.0
1129,2019/04/05,29.0,29.013,29.0,304000,30.0,29.0
1130,2019/04/08,33.0,30.664,29.0,3986500,33.0,29.0
1131,2019/04/09,31.0,31.829,33.0,755700,33.0,31.0
1132,2019/04/10,31.0,30.937,31.0,798800,32.0,30.0
1133,2019/04/11,32.0,31.929,31.0,913800,33.0,31.0
1134,2019/04/12,31.0,32.386,33.0,917500,33.0,31.0
1135,2019/04/15,31.0,31.198,31.0,194000,32.0,31.0
1136,2019/04/16,30.0,30.841,32.0,922100,32.0,30.0
1137,2019/04/17,30.0,30.11,30.0,815300,31.0,29.0
1138,2019/04/18,30.0,30.63,31.0,629700,31.0,30.0
1139,2019/04/19,32.0,30.888,30.0,1060100,32.0,30.0
1140,2019/04/22,31.0,31.009,31.0,627700,32.0,31.0
1141,2019/04/23,30.0,30.691,31.0,253900,31.0,30.0
1142,2019/04/24,32.0,31.191,31.0,904200,32.0,31.0
1143,2019/04/25,30.0,31.303,32.0,488900,32.0,30.0
1144,2019/04/26,31.0,30.998,31.0,487700,32.0,30.0
1145,2019/05/07,31.0,31.138,31.0,1078600,32.0,30.0
1146,2019/05/08,30.0,30.412,30.0,281400,31.0,30.0
1147,2019/05/09,30.0,30.863,31.0,927500,32.0,30.0
1148,2019/05/10,30.0,30.681,31.0,281700,31.0,30.0
1149,2019/05/13,30.0,30.035,30.0,367700,31.0,30.0
1150,2019/05/14,32.0,30.013,29.0,1289200,32.0,29.0
1151,2019/05/15,31.0,30.926,31.0,306100,32.0,30.0
1152,2019/05/16,29.0,30.176,31.0,843000,31.0,29.0
1153,2019/05/17,30.0,29.901,30.0,337600,31.0,29.0
1154,2019/05/20,31.0,30.014,30.0,397600,31.0,29.0
1155,2019/05/21,29.0,29.885,30.0,406700,30.0,29.0
1156,2019/05/22,30.0,30.003,30.0,669900,31.0,29.0
1157,2019/05/23,31.0,30.863,31.0,981900,32.0,30.0
1158,2019/05/24,31.0,30.993,31.0,255900,31.0,30.0
1159,2019/05/27,32.0,31.09,31.0,720300,32.0,30.0
1160,2019/05/28,33.0,33.314,32.0,3990600,35.0,31.0
1161,2019/05/29,31.0,31.487,33.0,1892300,33.0,30.0
1162,2019/05/30,32.0,31.443,32.0,344800,32.0,30.0
1163,2019/05/31,31.0,31.413,32.0,348700,32.0,31.0
1164,2019/06/03,30.0,30.158,31.0,778100,31.0,29.0
1165,2019/06/04,31.0,30.198,30.0,527800,31.0,30.0
1166,2019/06/05,30.0,30.717,31.0,373800,31.0,30.0
1167,2019/06/06,32.0,30.561,30.0,1154900,32.0,29.0
1168,2019/06/07,31.0,31.012,31.0,287700,32.0,31.0
1169,2019/06/10,32.0,31.49,31.0,247800,32.0,31.0
1170,2019/06/11,33.0,31.997,31.0,1057700,33.0,31.0
1171,2019/06/12,33.0,32.956,33.0,295200,33.0,32.0
1172,2019/06/13,31.0,31.745,33.0,1434200,33.0,30.0
1173,2019/06/14,30.0,30.638,31.0,271100,31.0,30.0
1174,2019/06/17,32.0,31.174,31.0,744600,32.0,30.0
1175,2019/06/18,31.0,31.001,31.0,785700,32.0,30.0
1176,2019/06/19,31.0,31.021,31.0,271900,32.0,31.0
1177,2019/06/20,30.0,30.951,32.0,476300,32.0,30.0
1178,2019/06/21,30.0,30.805,31.0,360100,31.0,30.0
1179,2019/06/24,30.0,30.633,31.0,202700,31.0,30.0
1180,2019/06/25,32.0,30.845,30.0,597300,32.0,30.0
1181,2019/06/26,32.0,31.232,31.0,292600,32.0,31.0
1182,2019/06/27,31.0,31.531,32.0,214000,32.0,31.0
1183,2019/06/28,31.0,31.553,32.0,383700,32.0,31.0
1184,2019/07/01,31.0,31.055,31.0,385100,32.0,31.0
1185,2019/07/02,31.0,31.054,31.0,290400,32.0,31.0
1186,2019/07/03,31.0,31.016,31.0,1378700,32.0,31.0
1187,2019/07/04,31.0,31.019,31.0,755800,32.0,31.0
1188,2019/07/05,32.0,32.86,31.0,3993700,35.0,31.0
1189,2019/07/08,32.0,32.821,33.0,606900,34.0,32.0
1190,2019/07/09,32.0,32.014,32.0,1117600,33.0,31.0
1191,2019/07/10,32.0,32.017,32.0,387400,33.0,32.0
1192,2019/07/11,32.0,32.057,32.0,413400,33.0,32.0
1193,2019/07/12,34.0,33.869,33.0,2711900,35.0,33.0
1194,2019/07/16,40.0,37.169,35.0,5138900,40.0,35.0
1195,2019/07/17,39.0,38.265,39.0,5765500,41.0,36.0
1196,2019/07/18,35.0,36.68,39.0,4011900,40.0,35.0
1197,2019/07/19,35.0,35.931,36.0,1030800,37.0,35.0
1198,2019/07/22,37.0,35.846,35.0,1614800,38.0,35.0
1199,2019/07/23,37.0,37.618,37.0,1809300,39.0,36.0
1200,2019/07/24,42.0,40.022,38.0,5371000,43.0,37.0
1201,2019/07/25,41.0,40.952,42.0,5130700,43.0,39.0
1202,2019/07/26,41.0,41.326,41.0,1486900,42.0,41.0
1203,2019/07/29,39.0,39.896,41.0,2100500,41.0,38.0
1204,2019/07/30,39.0,39.763,40.0,687600,40.0,39.0
1205,2019/07/31,40.0,39.074,39.0,584000,40.0,38.0
1206,2019/08/01,38.0,38.379,39.0,1482100,39.0,38.0
1207,2019/08/02,37.0,37.468,38.0,2180800,39.0,36.0
1208,2019/08/05,36.0,36.991,37.0,1355300,39.0,36.0
1209,2019/08/06,35.0,34.628,35.0,2091100,36.0,33.0
1210,2019/08/07,37.0,36.177,36.0,701800,37.0,35.0
1211,2019/08/08,36.0,36.143,36.0,518800,37.0,36.0
1212,2019/08/09,34.0,33.707,34.0,1976500,35.0,32.0
1213,2019/08/13,33.0,34.096,35.0,647800,35.0,33.0
1214,2019/08/14,33.0,34.027,34.0,901400,35.0,33.0
1215,2019/08/15,33.0,32.979,33.0,719500,34.0,32.0
1216,2019/08/16,33.0,33.082,33.0,413700,34.0,32.0
1217,2019/08/19,31.0,32.0,32.0,1385100,33.0,31.0
1218,2019/08/20,33.0,32.246,32.0,992000,33.0,31.0
1219,2019/08/21,32.0,32.082,32.0,1086500,33.0,31.0
1220,2019/08/22,31.0,31.97,32.0,977900,33.0,31.0
1221,2019/08/23,33.0,33.636,33.0,2731200,35.0,33.0
