,Date,Close,VWAP,Open,Volume,High,Low
0,2014/08/25,533.0,534.073,539.0,57900,540.0,528.0
1,2014/08/26,522.0,530.288,543.0,51800,543.0,521.0
2,2014/08/27,520.0,519.993,524.0,28200,530.0,513.0
3,2014/08/28,517.0,516.633,521.0,32400,521.0,510.0
4,2014/08/29,513.0,508.224,520.0,55700,520.0,500.0
5,2014/09/01,521.0,522.817,519.0,38700,529.0,518.0
6,2014/09/02,526.0,525.19,527.0,58900,528.0,521.0
7,2014/09/03,518.0,517.936,525.0,22000,525.0,512.0
8,2014/09/04,513.0,515.63,516.0,20800,519.0,512.0
9,2014/09/05,509.0,509.641,508.0,25600,514.0,507.0
10,2014/09/08,507.0,509.802,509.0,32800,514.0,507.0
11,2014/09/09,511.0,506.842,509.0,22200,515.0,501.0
12,2014/09/10,513.0,509.591,504.0,13700,514.0,504.0
13,2014/09/11,517.0,514.68,513.0,25300,518.0,506.0
14,2014/09/12,516.0,515.821,518.0,44000,518.0,512.0
15,2014/09/16,520.0,527.916,535.0,45300,535.0,520.0
16,2014/09/17,515.0,517.659,521.0,22300,521.0,510.0
17,2014/09/18,520.0,521.188,517.0,19700,527.0,516.0
18,2014/09/19,521.0,517.568,516.0,22200,521.0,513.0
19,2014/09/22,517.0,517.714,521.0,13300,521.0,515.0
20,2014/09/24,517.0,517.022,515.0,13900,520.0,515.0
21,2014/09/25,519.0,518.725,517.0,32000,521.0,515.0
22,2014/09/26,516.0,517.352,518.0,15900,520.0,514.0
23,2014/09/29,526.0,523.203,522.0,22200,527.0,518.0
24,2014/09/30,522.0,524.721,528.0,53700,528.0,520.0
25,2014/10/01,535.0,550.029,540.0,273100,573.0,527.0
26,2014/10/02,610.0,602.868,565.0,2365800,633.0,535.0
27,2014/10/03,710.0,685.449,636.0,3509000,710.0,636.0
28,2014/10/06,580.0,600.35,625.0,2268600,631.0,566.0
29,2014/10/07,656.0,652.228,625.0,2869600,680.0,601.0
30,2014/10/08,628.0,679.733,636.0,2734100,724.0,620.0
31,2014/10/09,728.0,699.895,658.0,3973200,728.0,643.0
32,2014/10/10,830.0,820.056,743.0,7512600,874.0,734.0
33,2014/10/14,980.0,969.128,960.0,794600,980.0,952.0
34,2014/10/15,1130.0,1039.556,1058.0,7960500,1130.0,880.0
35,2014/10/16,1430.0,1385.491,1340.0,3310700,1430.0,1316.0
36,2014/10/17,1258.0,1341.971,1428.0,7792800,1528.0,1151.0
37,2014/10/20,958.0,1017.776,1048.0,2085800,1084.0,958.0
38,2014/10/21,937.0,920.036,883.0,2826700,980.0,872.0
39,2014/10/22,830.0,850.5,889.0,1741000,897.0,810.0
40,2014/10/23,875.0,900.527,885.0,2569000,959.0,866.0
41,2014/10/24,1025.0,975.638,871.0,4231600,1025.0,845.0
42,2014/10/27,1152.0,1207.854,1085.0,9015400,1320.0,1057.0
43,2014/10/28,1264.0,1286.491,1320.0,5924000,1349.0,1211.0
44,2014/10/29,1181.0,1192.685,1151.0,2274000,1279.0,1132.0
45,2014/10/30,1099.0,1131.422,1136.0,1143000,1176.0,1083.0
46,2014/10/31,1065.0,1084.856,1090.0,1111800,1143.0,1053.0
47,2014/11/04,1018.0,1011.159,1045.0,1015700,1045.0,991.0
48,2014/11/05,1134.0,1125.698,1033.0,1859800,1177.0,1032.0
49,2014/11/06,1075.0,1107.321,1044.0,1434000,1194.0,1040.0
50,2014/11/07,1089.0,1126.418,1121.0,1567600,1175.0,1067.0
51,2014/11/10,1090.0,1090.037,1107.0,496200,1115.0,1070.0
52,2014/11/11,1031.0,1034.53,1062.0,518700,1074.0,1007.0
53,2014/11/12,999.0,1001.972,1021.0,384800,1023.0,995.0
54,2014/11/13,953.0,959.251,985.0,340600,985.0,946.0
55,2014/11/14,960.0,967.546,980.0,285000,986.0,950.0
56,2014/11/17,894.0,901.455,935.0,361500,935.0,883.0
57,2014/11/18,934.0,928.867,906.0,515600,970.0,901.0
58,2014/11/19,913.0,914.305,919.0,263200,944.0,901.0
59,2014/11/20,884.0,902.754,907.0,260600,917.0,884.0
60,2014/11/21,869.0,871.238,884.0,146400,890.0,863.0
61,2014/11/25,857.0,857.72,873.0,209300,878.0,847.0
62,2014/11/26,881.0,891.562,881.0,447000,913.0,871.0
63,2014/11/27,843.0,853.401,865.0,229100,866.0,843.0
64,2014/11/28,849.0,856.366,834.0,406600,889.0,830.0
65,2014/12/01,842.0,844.56,852.0,129300,853.0,839.0
66,2014/12/02,840.0,842.011,850.0,104800,851.0,828.0
67,2014/12/03,827.0,831.941,845.0,146100,845.0,821.0
68,2014/12/04,810.0,815.342,821.0,151600,832.0,806.0
69,2014/12/05,793.0,788.124,806.0,194500,809.0,774.0
70,2014/12/08,794.0,797.457,801.0,78600,808.0,792.0
71,2014/12/09,769.0,780.863,791.0,112700,794.0,766.0
72,2014/12/10,759.0,752.306,741.0,153100,766.0,740.0
73,2014/12/11,752.0,752.031,750.0,76900,761.0,746.0
74,2014/12/12,752.0,753.271,755.0,77600,756.0,750.0
75,2014/12/15,745.0,758.473,765.0,85700,770.0,745.0
76,2014/12/16,709.0,715.998,739.0,111900,740.0,702.0
77,2014/12/17,695.0,704.386,700.0,94100,720.0,695.0
78,2014/12/18,702.0,701.168,698.0,81700,709.0,695.0
79,2014/12/19,709.0,716.674,710.0,107800,727.0,705.0
80,2014/12/22,704.0,701.478,708.0,76300,708.0,696.0
81,2014/12/24,694.0,695.392,696.0,74200,700.0,693.0
82,2014/12/25,664.0,675.439,688.0,205700,692.0,661.0
83,2014/12/26,692.0,688.635,681.0,226800,708.0,671.0
84,2014/12/29,792.0,773.657,692.0,796100,792.0,685.0
85,2014/12/30,722.0,709.181,702.0,489600,728.0,693.0
86,2015/01/05,724.0,724.797,710.0,145900,741.0,710.0
87,2015/01/06,721.0,723.86,713.0,64800,735.0,713.0
88,2015/01/07,712.0,725.781,711.0,123900,757.0,711.0
89,2015/01/08,715.0,715.306,712.0,62500,723.0,712.0
90,2015/01/09,699.0,705.052,713.0,84600,722.0,695.0
91,2015/01/13,701.0,695.703,687.0,42100,707.0,687.0
92,2015/01/14,683.0,690.463,698.0,64200,703.0,683.0
93,2015/01/15,697.0,690.309,678.0,69000,698.0,678.0
94,2015/01/16,682.0,681.979,682.0,93200,696.0,675.0
95,2015/01/19,666.0,674.345,692.0,80600,692.0,660.0
96,2015/01/20,662.0,665.469,659.0,40300,677.0,655.0
97,2015/01/21,670.0,670.451,663.0,49000,676.0,660.0
98,2015/01/22,660.0,661.484,666.0,31800,669.0,656.0
99,2015/01/23,659.0,659.845,660.0,41300,666.0,657.0
100,2015/01/26,666.0,665.466,665.0,26400,669.0,660.0
101,2015/01/27,678.0,671.043,670.0,37400,679.0,661.0
102,2015/01/28,688.0,683.42,672.0,47100,689.0,672.0
103,2015/01/29,667.0,677.613,688.0,48600,688.0,663.0
104,2015/01/30,669.0,668.148,667.0,33700,678.0,663.0
105,2015/02/02,674.0,676.763,678.0,55300,684.0,670.0
106,2015/02/03,663.0,667.648,669.0,43700,675.0,662.0
107,2015/02/04,665.0,666.629,664.0,39100,678.0,662.0
108,2015/02/05,658.0,660.862,665.0,30400,665.0,658.0
109,2015/02/06,669.0,665.126,665.0,44300,670.0,659.0
110,2015/02/09,676.0,676.482,680.0,53700,682.0,671.0
111,2015/02/10,685.0,679.891,676.0,35000,688.0,671.0
112,2015/02/12,696.0,693.434,685.0,59500,700.0,684.0
113,2015/02/13,694.0,692.534,695.0,37100,697.0,685.0
114,2015/02/16,666.0,666.324,671.0,79400,672.0,662.0
115,2015/02/17,659.0,659.539,663.0,49700,665.0,656.0
116,2015/02/18,662.0,658.422,662.0,32700,662.0,656.0
117,2015/02/19,663.0,664.937,658.0,81900,667.0,658.0
118,2015/02/20,678.0,674.023,665.0,91900,683.0,663.0
119,2015/02/23,669.0,672.679,682.0,47300,682.0,666.0
120,2015/02/24,668.0,669.854,669.0,25400,674.0,666.0
121,2015/02/25,671.0,670.515,670.0,34200,673.0,669.0
122,2015/02/26,669.0,670.375,671.0,32300,678.0,666.0
123,2015/02/27,661.0,663.298,665.0,31600,668.0,661.0
124,2015/03/02,660.0,663.405,662.0,38500,673.0,660.0
125,2015/03/03,661.0,659.531,661.0,32000,664.0,657.0
126,2015/03/04,652.0,658.306,667.0,38900,667.0,650.0
127,2015/03/05,662.0,661.94,651.0,49800,672.0,651.0
128,2015/03/06,661.0,664.188,673.0,35600,673.0,655.0
129,2015/03/09,656.0,656.958,657.0,28500,662.0,653.0
130,2015/03/10,654.0,656.847,660.0,35200,661.0,653.0
131,2015/03/11,652.0,653.504,652.0,23400,657.0,651.0
132,2015/03/12,690.0,680.337,669.0,237300,693.0,663.0
133,2015/03/13,684.0,689.375,698.0,81000,698.0,680.0
134,2015/03/16,684.0,695.774,701.0,176600,707.0,684.0
135,2015/03/17,667.0,670.573,679.0,68600,679.0,665.0
136,2015/03/18,660.0,661.889,661.0,45800,665.0,660.0
137,2015/03/19,655.0,656.319,659.0,51700,661.0,653.0
138,2015/03/20,659.0,659.405,657.0,24700,663.0,655.0
139,2015/03/23,665.0,662.776,663.0,26300,666.0,659.0
140,2015/03/24,668.0,664.429,662.0,33100,670.0,660.0
141,2015/03/25,663.0,665.687,668.0,28100,670.0,662.0
142,2015/03/26,659.0,659.904,660.0,27000,666.0,657.0
143,2015/03/27,655.0,656.067,658.0,31600,660.0,653.0
144,2015/03/30,660.0,655.981,655.0,21300,662.0,653.0
145,2015/03/31,655.0,658.211,664.0,32200,667.0,654.0
146,2015/04/01,650.0,652.06,659.0,34800,659.0,650.0
147,2015/04/02,653.0,655.339,655.0,25400,660.0,651.0
148,2015/04/03,659.0,660.511,660.0,27200,666.0,656.0
149,2015/04/06,657.0,657.276,660.0,16300,660.0,655.0
150,2015/04/07,660.0,658.93,658.0,41600,664.0,657.0
151,2015/04/08,660.0,658.816,661.0,45200,661.0,656.0
152,2015/04/09,657.0,655.621,655.0,29800,658.0,654.0
153,2015/04/10,657.0,656.311,655.0,28600,658.0,655.0
154,2015/04/13,654.0,655.113,655.0,18600,657.0,654.0
155,2015/04/14,664.0,659.654,654.0,52600,665.0,654.0
156,2015/04/15,658.0,660.341,664.0,17600,664.0,657.0
157,2015/04/16,655.0,655.856,656.0,27000,659.0,655.0
158,2015/04/17,653.0,654.835,653.0,40100,657.0,653.0
159,2015/04/20,656.0,658.874,654.0,49800,664.0,654.0
160,2015/04/21,653.0,653.967,653.0,57500,659.0,653.0
161,2015/04/22,655.0,653.402,652.0,49200,659.0,650.0
162,2015/04/23,652.0,653.554,652.0,39700,656.0,652.0
163,2015/04/24,650.0,652.111,652.0,40600,655.0,650.0
164,2015/04/27,649.0,650.045,650.0,51000,653.0,647.0
165,2015/04/28,642.0,643.246,642.0,70800,646.0,641.0
166,2015/04/30,637.0,636.666,636.0,62000,641.0,632.0
167,2015/05/01,632.0,632.517,634.0,54600,637.0,630.0
168,2015/05/07,631.0,632.129,637.0,37300,638.0,628.0
169,2015/05/08,634.0,634.172,631.0,23200,637.0,631.0
170,2015/05/11,637.0,637.412,639.0,25000,639.0,634.0
171,2015/05/12,635.0,634.041,635.0,22100,636.0,631.0
172,2015/05/13,631.0,630.84,630.0,34400,634.0,630.0
173,2015/05/14,627.0,630.692,633.0,97900,645.0,625.0
174,2015/05/15,622.0,624.102,625.0,40400,627.0,622.0
175,2015/05/18,639.0,637.023,635.0,89600,645.0,632.0
176,2015/05/19,628.0,624.576,621.0,62900,630.0,621.0
177,2015/05/20,634.0,633.813,630.0,22500,638.0,630.0
178,2015/05/21,630.0,631.988,635.0,16000,635.0,630.0
179,2015/05/22,632.0,630.574,630.0,6800,633.0,629.0
180,2015/05/25,629.0,631.148,632.0,16900,634.0,628.0
181,2015/05/26,633.0,632.85,629.0,15300,635.0,629.0
182,2015/05/27,627.0,627.316,630.0,31000,630.0,625.0
183,2015/05/28,634.0,633.149,630.0,50300,640.0,627.0
184,2015/05/29,627.0,632.764,634.0,37300,642.0,627.0
185,2015/06/01,636.0,637.611,637.0,57800,647.0,630.0
186,2015/06/02,736.0,708.748,655.0,1666600,736.0,648.0
187,2015/06/03,886.0,860.929,811.0,1745500,886.0,800.0
188,2015/06/04,981.0,982.562,991.0,5660500,1029.0,914.0
189,2015/06/05,925.0,916.958,906.0,2529000,960.0,867.0
190,2015/06/08,874.0,918.025,895.0,2642300,977.0,861.0
191,2015/06/09,838.0,859.299,874.0,1126000,900.0,838.0
192,2015/06/10,844.0,870.36,870.0,1153500,896.0,843.0
193,2015/06/11,846.0,853.016,858.0,463700,868.0,840.0
194,2015/06/12,808.0,822.869,846.0,450600,849.0,804.0
195,2015/06/15,918.0,899.216,838.0,3155700,947.0,836.0
196,2015/06/16,877.0,901.662,930.0,1258600,949.0,870.0
197,2015/06/17,858.0,861.151,876.0,474100,883.0,841.0
198,2015/06/18,812.0,816.279,828.0,396300,830.0,804.0
199,2015/06/19,793.0,789.327,811.0,377700,815.0,777.0
200,2015/06/22,766.0,763.782,782.0,339000,783.0,753.0
201,2015/06/23,776.0,777.13,796.0,221700,796.0,762.0
202,2015/06/24,760.0,764.509,776.0,171000,776.0,758.0
203,2015/06/25,747.0,749.003,757.0,142600,761.0,741.0
204,2015/06/26,748.0,750.16,740.0,123700,765.0,740.0
205,2015/06/29,706.0,717.35,726.0,150400,726.0,705.0
206,2015/06/30,706.0,704.208,696.0,106700,717.0,690.0
207,2015/07/01,731.0,751.403,710.0,779300,790.0,704.0
208,2015/07/02,717.0,718.707,717.0,167100,725.0,713.0
209,2015/07/03,724.0,717.093,710.0,60400,727.0,707.0
210,2015/07/06,695.0,708.042,710.0,178000,740.0,691.0
211,2015/07/07,700.0,707.406,705.0,55700,718.0,697.0
212,2015/07/08,665.0,676.685,701.0,113900,705.0,662.0
213,2015/07/09,670.0,650.198,660.0,132000,672.0,625.0
214,2015/07/10,673.0,667.153,668.0,76700,677.0,650.0
215,2015/07/13,686.0,682.668,668.0,40900,697.0,666.0
216,2015/07/14,712.0,709.499,696.0,120500,723.0,690.0
217,2015/07/15,715.0,712.899,712.0,51600,721.0,708.0
218,2015/07/16,709.0,711.64,719.0,35000,721.0,706.0
219,2015/07/17,714.0,712.207,715.0,28500,720.0,707.0
220,2015/07/21,722.0,716.593,713.0,64100,722.0,702.0
221,2015/07/22,706.0,709.502,709.0,29500,713.0,706.0
222,2015/07/23,704.0,704.45,707.0,22900,710.0,700.0
223,2015/07/24,697.0,700.924,704.0,15800,706.0,697.0
224,2015/07/27,675.0,684.221,691.0,22600,694.0,672.0
225,2015/07/28,678.0,676.076,668.0,29000,689.0,666.0
226,2015/07/29,674.0,675.832,683.0,16100,686.0,670.0
227,2015/07/30,692.0,680.432,673.0,54200,694.0,670.0
228,2015/07/31,708.0,703.426,694.0,72100,708.0,693.0
229,2015/08/03,708.0,704.959,693.0,46500,715.0,693.0
230,2015/08/04,690.0,696.836,705.0,44500,717.0,686.0
231,2015/08/05,726.0,743.162,770.0,208100,770.0,717.0
232,2015/08/06,732.0,735.23,738.0,102400,743.0,725.0
233,2015/08/07,736.0,726.55,725.0,53300,737.0,711.0
234,2015/08/10,751.0,742.408,739.0,72400,754.0,721.0
235,2015/08/11,743.0,757.604,765.0,172400,775.0,730.0
236,2015/08/12,745.0,746.337,736.0,72500,760.0,733.0
237,2015/08/13,753.0,751.626,736.0,39800,760.0,735.0
238,2015/08/14,750.0,755.34,749.0,34700,764.0,748.0
239,2015/08/17,744.0,744.198,741.0,18700,754.0,740.0
240,2015/08/18,752.0,753.149,740.0,26200,759.0,740.0
241,2015/08/19,745.0,751.167,757.0,67000,763.0,736.0
242,2015/08/20,718.0,726.19,744.0,31100,744.0,715.0
243,2015/08/21,686.0,695.051,692.0,48700,706.0,685.0
244,2015/08/24,628.0,651.554,660.0,114500,680.0,627.0
245,2015/08/25,612.0,616.983,600.0,126000,654.0,594.0
246,2015/08/26,640.0,632.948,617.0,47700,644.0,617.0
247,2015/08/27,641.0,646.113,642.0,39900,656.0,640.0
248,2015/08/28,674.0,671.316,654.0,39900,699.0,653.0
249,2015/08/31,684.0,677.684,667.0,17700,684.0,667.0
250,2015/09/01,665.0,668.703,675.0,28600,681.0,655.0
251,2015/09/02,656.0,659.424,645.0,23800,672.0,643.0
252,2015/09/03,641.0,652.674,653.0,28800,671.0,641.0
253,2015/09/04,631.0,633.47,647.0,25300,650.0,626.0
254,2015/09/07,631.0,630.605,625.0,31100,640.0,625.0
255,2015/09/08,624.0,629.285,631.0,29100,640.0,620.0
256,2015/09/09,640.0,632.063,628.0,31600,640.0,624.0
257,2015/09/10,630.0,625.983,636.0,35000,636.0,621.0
258,2015/09/11,631.0,629.423,625.0,30500,638.0,625.0
259,2015/09/14,615.0,626.781,638.0,64400,641.0,615.0
260,2015/09/15,620.0,623.797,625.0,20700,629.0,619.0
261,2015/09/16,616.0,616.356,620.0,31500,625.0,608.0
262,2015/09/17,624.0,618.171,613.0,22800,624.0,610.0
263,2015/09/18,615.0,617.775,616.0,14200,623.0,615.0
264,2015/09/24,615.0,616.586,615.0,18100,623.0,611.0
265,2015/09/25,614.0,611.869,615.0,21400,618.0,607.0
266,2015/09/28,620.0,619.32,615.0,17200,623.0,615.0
267,2015/09/29,608.0,626.145,650.0,66700,650.0,608.0
268,2015/09/30,614.0,616.905,624.0,22200,625.0,610.0
269,2015/10/01,613.0,616.701,622.0,29800,624.0,610.0
270,2015/10/02,629.0,625.121,615.0,30500,634.0,615.0
271,2015/10/05,634.0,636.331,635.0,30200,642.0,634.0
272,2015/10/06,641.0,649.269,652.0,48400,658.0,638.0
273,2015/10/07,667.0,661.201,645.0,36800,677.0,641.0
274,2015/10/08,671.0,674.443,673.0,31400,678.0,668.0
275,2015/10/09,699.0,686.032,674.0,60200,706.0,661.0
276,2015/10/13,710.0,708.38,699.0,78700,719.0,698.0
277,2015/10/14,682.0,690.816,697.0,26600,702.0,682.0
278,2015/10/15,706.0,695.727,672.0,52300,714.0,655.0
279,2015/10/16,707.0,712.878,718.0,44300,718.0,704.0
280,2015/10/19,703.0,702.23,706.0,13900,709.0,697.0
281,2015/10/20,693.0,688.086,700.0,10500,700.0,682.0
282,2015/10/21,699.0,695.636,686.0,17300,700.0,686.0
283,2015/10/22,697.0,694.385,695.0,12200,700.0,690.0
284,2015/10/23,695.0,697.119,697.0,20200,704.0,691.0
285,2015/10/26,714.0,706.818,705.0,44600,717.0,698.0
286,2015/10/27,705.0,710.898,714.0,11800,716.0,705.0
287,2015/10/28,708.0,708.463,712.0,10800,715.0,705.0
288,2015/10/29,687.0,697.269,715.0,51700,715.0,687.0
289,2015/10/30,705.0,711.56,697.0,85400,730.0,694.0
290,2015/11/02,698.0,693.173,691.0,43900,703.0,688.0
291,2015/11/04,700.0,701.637,700.0,28400,712.0,696.0
292,2015/11/05,703.0,705.461,700.0,48400,729.0,697.0
293,2015/11/06,712.0,708.367,708.0,25900,715.0,700.0
294,2015/11/09,720.0,717.094,712.0,53300,724.0,710.0
295,2015/11/10,726.0,721.002,720.0,50000,726.0,712.0
296,2015/11/11,714.0,716.421,729.0,52700,729.0,711.0
297,2015/11/12,714.0,713.982,708.0,32900,721.0,708.0
298,2015/11/13,712.0,715.585,720.0,46500,720.0,709.0
299,2015/11/16,704.0,705.588,707.0,33500,711.0,702.0
300,2015/11/17,708.0,708.453,706.0,26700,714.0,705.0
301,2015/11/18,705.0,708.553,710.0,18100,716.0,705.0
302,2015/11/19,710.0,712.093,712.0,51800,715.0,708.0
303,2015/11/20,719.0,717.823,709.0,69500,726.0,709.0
304,2015/11/24,726.0,728.778,730.0,103400,734.0,722.0
305,2015/11/25,721.0,720.626,730.0,52100,730.0,714.0
306,2015/11/26,721.0,723.258,726.0,33400,728.0,718.0
307,2015/11/27,716.0,719.535,720.0,36100,723.0,716.0
308,2015/11/30,718.0,719.829,716.0,38600,724.0,716.0
309,2015/12/01,716.0,718.989,726.0,70600,726.0,716.0
310,2015/12/02,703.0,705.898,716.0,115000,717.0,700.0
311,2015/12/03,712.0,707.317,702.0,73200,715.0,701.0
312,2015/12/04,699.0,697.602,703.0,88200,703.0,692.0
313,2015/12/07,699.0,701.836,702.0,55600,707.0,697.0
314,2015/12/08,694.0,691.329,702.0,60800,702.0,681.0
315,2015/12/09,713.0,702.093,694.0,115500,715.0,684.0
316,2015/12/10,694.0,696.726,698.0,55200,703.0,690.0
317,2015/12/11,693.0,692.576,691.0,26900,703.0,691.0
318,2015/12/14,685.0,674.019,685.0,58700,688.0,640.0
319,2015/12/15,655.0,667.551,673.0,111700,679.0,655.0
320,2015/12/16,678.0,666.668,655.0,70800,678.0,655.0
321,2015/12/17,677.0,676.038,685.0,60600,685.0,666.0
322,2015/12/18,668.0,669.891,677.0,40500,677.0,666.0
323,2015/12/21,658.0,659.89,664.0,45600,664.0,657.0
324,2015/12/22,658.0,656.124,653.0,41800,662.0,651.0
325,2015/12/24,648.0,653.839,656.0,54000,664.0,645.0
326,2015/12/25,643.0,642.677,648.0,58200,649.0,638.0
327,2015/12/28,649.0,641.309,633.0,27500,654.0,629.0
328,2015/12/29,660.0,658.227,657.0,27700,660.0,652.0
329,2015/12/30,660.0,658.41,658.0,25600,664.0,653.0
330,2016/01/04,687.0,681.036,675.0,85300,697.0,667.0
331,2016/01/05,689.0,687.844,694.0,57500,694.0,672.0
332,2016/01/06,676.0,674.74,695.0,40300,695.0,667.0
333,2016/01/07,655.0,658.54,673.0,49300,674.0,648.0
334,2016/01/08,645.0,648.221,646.0,19000,659.0,642.0
335,2016/01/12,613.0,621.814,637.0,39200,639.0,611.0
336,2016/01/13,634.0,633.994,631.0,15500,642.0,623.0
337,2016/01/14,617.0,615.486,617.0,31500,620.0,612.0
338,2016/01/15,622.0,627.227,622.0,51200,643.0,620.0
339,2016/01/18,605.0,596.226,601.0,57200,607.0,588.0
340,2016/01/19,615.0,619.938,605.0,30500,637.0,605.0
341,2016/01/20,590.0,599.401,618.0,51100,618.0,590.0
342,2016/01/21,559.0,587.41,590.0,81700,603.0,558.0
343,2016/01/22,581.0,570.572,581.0,55100,583.0,560.0
344,2016/01/25,603.0,598.332,601.0,35800,609.0,585.0
345,2016/01/26,595.0,596.887,603.0,22100,603.0,590.0
346,2016/01/27,610.0,607.739,599.0,19900,617.0,598.0
347,2016/01/28,609.0,609.411,610.0,30200,618.0,603.0
348,2016/01/29,616.0,609.766,609.0,35000,621.0,595.0
349,2016/02/01,637.0,632.939,625.0,28000,639.0,625.0
350,2016/02/02,659.0,664.727,677.0,127100,682.0,648.0
351,2016/02/03,650.0,661.941,676.0,127000,681.0,646.0
352,2016/02/04,637.0,639.412,656.0,35700,658.0,631.0
353,2016/02/05,643.0,662.064,683.0,83500,683.0,635.0
354,2016/02/08,666.0,654.667,632.0,54000,675.0,623.0
355,2016/02/09,627.0,627.078,633.0,50200,639.0,617.0
356,2016/02/10,600.0,601.943,621.0,57800,631.0,590.0
357,2016/02/12,552.0,568.577,590.0,67900,591.0,550.0
358,2016/02/15,652.0,631.193,572.0,112100,652.0,568.0
359,2016/02/16,684.0,680.904,646.0,112600,692.0,646.0
360,2016/02/17,678.0,675.105,673.0,48600,688.0,660.0
361,2016/02/18,695.0,695.768,688.0,53800,703.0,684.0
362,2016/02/19,688.0,683.199,679.0,22100,694.0,675.0
363,2016/02/22,691.0,686.679,681.0,18700,691.0,679.0
364,2016/02/23,672.0,676.827,692.0,9800,692.0,669.0
365,2016/02/24,631.0,632.565,660.0,75900,663.0,618.0
366,2016/02/25,650.0,645.348,634.0,28200,652.0,634.0
367,2016/02/26,668.0,679.557,695.0,54400,695.0,660.0
368,2016/02/29,646.0,656.981,668.0,42800,674.0,646.0
369,2016/03/01,626.0,629.258,638.0,33400,640.0,624.0
370,2016/03/02,634.0,634.779,635.0,19000,641.0,630.0
371,2016/03/03,634.0,633.801,635.0,19100,642.0,622.0
372,2016/03/04,643.0,643.671,643.0,30400,654.0,634.0
373,2016/03/07,647.0,647.649,647.0,19100,655.0,641.0
374,2016/03/08,643.0,635.382,645.0,15200,646.0,625.0
375,2016/03/09,630.0,626.952,630.0,14500,630.0,625.0
376,2016/03/10,640.0,634.238,630.0,12200,642.0,628.0
377,2016/03/11,636.0,628.993,640.0,45000,644.0,619.0
378,2016/03/14,626.0,630.947,630.0,30200,639.0,626.0
379,2016/03/15,633.0,632.368,627.0,12500,637.0,627.0
380,2016/03/16,634.0,632.471,629.0,13600,637.0,627.0
381,2016/03/17,629.0,630.152,637.0,13800,637.0,625.0
382,2016/03/18,624.0,619.806,630.0,26800,630.0,610.0
383,2016/03/22,639.0,636.379,640.0,28800,644.0,629.0
384,2016/03/23,637.0,637.85,641.0,12700,641.0,635.0
385,2016/03/24,628.0,632.4,637.0,11000,637.0,628.0
386,2016/03/25,629.0,633.569,630.0,14600,640.0,628.0
387,2016/03/28,634.0,629.84,633.0,15000,634.0,624.0
388,2016/03/29,637.0,635.804,639.0,17300,640.0,631.0
389,2016/03/30,698.0,681.513,632.0,211200,705.0,632.0
390,2016/03/31,692.0,700.59,710.0,120600,714.0,683.0
391,2016/04/01,668.0,673.331,690.0,57400,691.0,662.0
392,2016/04/04,692.0,687.639,676.0,139000,708.0,636.0
393,2016/04/05,641.0,653.834,692.0,59500,692.0,634.0
394,2016/04/06,629.0,632.006,635.0,34700,636.0,627.0
395,2016/04/07,617.0,621.893,628.0,31800,639.0,612.0
396,2016/04/08,621.0,615.971,610.0,38400,629.0,607.0
397,2016/04/11,619.0,617.736,616.0,18200,622.0,614.0
398,2016/04/12,620.0,622.123,621.0,21900,629.0,617.0
399,2016/04/13,624.0,623.494,626.0,16200,627.0,620.0
400,2016/04/14,634.0,630.575,627.0,33200,634.0,626.0
401,2016/04/15,627.0,628.707,625.0,20500,634.0,625.0
402,2016/04/18,615.0,616.657,618.0,36400,623.0,613.0
403,2016/04/19,622.0,621.293,618.0,37600,628.0,617.0
404,2016/04/20,624.0,624.582,626.0,18900,630.0,620.0
405,2016/04/21,634.0,631.811,630.0,24900,635.0,628.0
406,2016/04/22,630.0,627.061,625.0,19700,631.0,624.0
407,2016/04/25,628.0,629.092,639.0,26200,640.0,622.0
408,2016/04/26,630.0,627.774,628.0,25200,632.0,624.0
409,2016/04/27,627.0,626.902,630.0,24600,630.0,623.0
410,2016/04/28,621.0,624.933,627.0,36000,634.0,620.0
411,2016/05/02,605.0,604.549,612.0,33900,613.0,600.0
412,2016/05/06,611.0,608.582,608.0,18900,612.0,605.0
413,2016/05/09,613.0,611.65,611.0,17700,616.0,607.0
414,2016/05/10,624.0,621.654,620.0,18500,624.0,616.0
415,2016/05/11,628.0,629.759,631.0,19500,633.0,625.0
416,2016/05/12,629.0,625.984,623.0,24300,630.0,622.0
417,2016/05/13,621.0,624.333,630.0,14700,630.0,620.0
418,2016/05/16,625.0,630.655,637.0,73600,640.0,622.0
419,2016/05/17,634.0,631.826,625.0,22400,634.0,625.0
420,2016/05/18,630.0,630.666,635.0,33200,635.0,626.0
421,2016/05/19,642.0,638.884,630.0,38800,642.0,630.0
422,2016/05/20,646.0,647.588,642.0,39100,654.0,637.0
423,2016/05/23,677.0,665.367,647.0,59100,681.0,647.0
424,2016/05/24,653.0,661.889,667.0,38700,676.0,648.0
425,2016/05/25,651.0,652.959,653.0,29000,659.0,649.0
426,2016/05/26,664.0,657.227,652.0,33000,665.0,651.0
427,2016/05/27,658.0,660.406,664.0,25600,670.0,650.0
428,2016/05/30,660.0,662.256,658.0,20700,666.0,658.0
429,2016/05/31,658.0,657.129,660.0,21700,663.0,650.0
430,2016/06/01,673.0,672.365,658.0,51500,688.0,654.0
431,2016/06/02,651.0,655.261,666.0,26400,666.0,649.0
432,2016/06/03,656.0,656.453,650.0,16100,659.0,650.0
433,2016/06/06,663.0,661.582,656.0,28200,666.0,650.0
434,2016/06/07,675.0,676.242,663.0,34300,685.0,660.0
435,2016/06/08,670.0,670.565,676.0,13800,677.0,666.0
436,2016/06/09,664.0,667.914,670.0,20800,675.0,660.0
437,2016/06/10,662.0,660.727,662.0,20900,664.0,655.0
438,2016/06/13,636.0,638.843,655.0,25400,658.0,627.0
439,2016/06/14,628.0,631.926,636.0,13500,642.0,625.0
440,2016/06/15,628.0,630.566,629.0,20500,639.0,622.0
441,2016/06/16,613.0,617.2,624.0,20500,630.0,610.0
442,2016/06/17,618.0,618.581,620.0,7400,625.0,615.0
443,2016/06/20,628.0,625.014,620.0,7400,629.0,620.0
444,2016/06/21,636.0,630.979,629.0,14300,639.0,626.0
445,2016/06/22,638.0,640.496,649.0,13100,649.0,631.0
446,2016/06/23,635.0,631.829,632.0,24600,638.0,628.0
447,2016/06/24,603.0,611.861,636.0,30300,645.0,594.0
448,2016/06/27,612.0,608.888,603.0,19700,618.0,602.0
449,2016/06/28,610.0,608.305,600.0,15400,619.0,600.0
450,2016/06/29,618.0,618.24,620.0,9600,623.0,614.0
451,2016/06/30,620.0,619.033,617.0,15200,622.0,617.0
452,2016/07/01,620.0,621.591,620.0,10500,624.0,620.0
453,2016/07/04,619.0,621.033,620.0,9100,629.0,615.0
454,2016/07/05,620.0,619.052,619.0,5800,623.0,617.0
455,2016/07/06,609.0,611.579,615.0,14000,615.0,609.0
456,2016/07/07,611.0,608.75,604.0,4800,612.0,604.0
457,2016/07/08,605.0,606.716,611.0,6700,615.0,604.0
458,2016/07/11,627.0,623.372,625.0,9400,628.0,616.0
459,2016/07/12,626.0,626.078,620.0,11500,632.0,620.0
460,2016/07/13,628.0,626.921,634.0,6300,634.0,623.0
461,2016/07/14,621.0,624.098,634.0,12300,634.0,619.0
462,2016/07/15,623.0,620.377,631.0,12200,631.0,613.0
463,2016/07/19,625.0,619.741,623.0,13500,627.0,613.0
464,2016/07/20,626.0,623.074,618.0,6800,627.0,618.0
465,2016/07/21,631.0,630.034,623.0,11800,635.0,623.0
466,2016/07/22,634.0,628.353,631.0,11600,634.0,621.0
467,2016/07/25,632.0,633.365,638.0,9600,638.0,628.0
468,2016/07/26,626.0,627.0,632.0,15000,632.0,625.0
469,2016/07/27,626.0,627.281,621.0,18500,632.0,621.0
470,2016/07/28,622.0,621.365,633.0,27700,633.0,616.0
471,2016/07/29,630.0,618.836,622.0,16500,631.0,611.0
472,2016/08/01,623.0,618.777,618.0,14800,627.0,615.0
473,2016/08/02,617.0,621.311,617.0,9000,630.0,616.0
474,2016/08/03,610.0,611.991,615.0,11000,615.0,610.0
475,2016/08/04,610.0,610.32,617.0,10000,617.0,607.0
476,2016/08/05,607.0,607.62,607.0,20500,615.0,603.0
477,2016/08/08,611.0,608.956,611.0,4500,611.0,607.0
478,2016/08/09,605.0,606.784,607.0,7400,611.0,605.0
479,2016/08/10,607.0,608.048,605.0,6200,610.0,605.0
480,2016/08/12,613.0,610.58,607.0,5000,613.0,607.0
481,2016/08/15,608.0,607.207,606.0,9200,612.0,604.0
482,2016/08/16,602.0,604.274,605.0,12400,609.0,602.0
483,2016/08/17,603.0,602.207,601.0,9200,605.0,600.0
484,2016/08/18,604.0,602.593,601.0,8100,607.0,600.0
485,2016/08/19,606.0,606.804,601.0,5600,611.0,601.0
486,2016/08/22,602.0,603.615,609.0,7800,611.0,601.0
487,2016/08/23,604.0,603.821,601.0,5600,606.0,601.0
488,2016/08/24,603.0,604.875,601.0,4000,610.0,601.0
489,2016/08/25,605.0,605.683,608.0,6000,608.0,603.0
490,2016/08/26,606.0,610.874,616.0,8700,616.0,605.0
491,2016/08/29,610.0,610.627,613.0,5900,613.0,608.0
492,2016/08/30,608.0,608.604,610.0,9600,612.0,606.0
493,2016/08/31,610.0,609.065,606.0,13800,612.0,606.0
494,2016/09/01,610.0,610.585,610.0,10600,613.0,607.0
495,2016/09/02,623.0,618.221,615.0,13100,623.0,613.0
496,2016/09/05,620.0,626.344,632.0,25000,639.0,615.0
497,2016/09/06,625.0,623.782,620.0,5500,625.0,620.0
498,2016/09/07,625.0,625.385,624.0,11700,629.0,620.0
499,2016/09/08,621.0,620.7,625.0,8000,627.0,617.0
500,2016/09/09,619.0,616.888,615.0,8000,622.0,615.0
501,2016/09/12,615.0,618.056,613.0,9000,623.0,613.0
502,2016/09/13,616.0,619.36,618.0,13600,623.0,615.0
503,2016/09/14,614.0,618.101,617.0,14900,621.0,614.0
504,2016/09/15,606.0,608.847,613.0,12400,614.0,606.0
505,2016/09/16,602.0,604.487,606.0,11300,612.0,602.0
506,2016/09/20,603.0,607.315,605.0,5400,620.0,603.0
507,2016/09/21,612.0,606.871,611.0,9300,612.0,602.0
508,2016/09/23,611.0,611.5,615.0,7800,615.0,609.0
509,2016/09/26,606.0,607.779,608.0,7700,611.0,606.0
510,2016/09/27,607.0,604.539,606.0,12800,607.0,602.0
511,2016/09/28,612.0,610.106,609.0,4700,614.0,607.0
512,2016/09/29,615.0,612.539,609.0,8900,616.0,609.0
513,2016/09/30,608.0,608.565,609.0,10800,612.0,606.0
514,2016/10/03,606.0,606.632,609.0,12500,610.0,605.0
515,2016/10/04,607.0,606.664,606.0,14600,610.0,605.0
516,2016/10/05,611.0,611.029,614.0,6800,614.0,609.0
517,2016/10/06,609.0,610.321,613.0,7800,613.0,609.0
518,2016/10/07,608.0,607.641,607.0,3900,610.0,607.0
519,2016/10/11,619.0,617.689,615.0,36000,624.0,611.0
520,2016/10/12,623.0,629.404,614.0,47800,646.0,613.0
521,2016/10/13,623.0,622.897,625.0,19500,626.0,616.0
522,2016/10/14,621.0,622.372,626.0,4300,626.0,619.0
523,2016/10/17,631.0,628.427,622.0,16400,635.0,622.0
524,2016/10/18,629.0,628.509,630.0,10600,631.0,625.0
525,2016/10/19,632.0,632.324,630.0,3700,635.0,629.0
526,2016/10/20,631.0,629.549,626.0,11300,631.0,626.0
527,2016/10/21,629.0,629.545,635.0,11200,635.0,627.0
528,2016/10/24,635.0,634.21,626.0,11900,637.0,626.0
529,2016/10/25,636.0,634.367,635.0,9000,636.0,631.0
530,2016/10/26,635.0,634.264,636.0,7200,637.0,629.0
531,2016/10/27,633.0,634.33,638.0,9100,638.0,632.0
532,2016/10/28,633.0,633.0,633.0,23100,636.0,629.0
533,2016/10/31,633.0,633.674,636.0,8600,636.0,632.0
534,2016/11/01,636.0,634.877,636.0,13000,637.0,632.0
535,2016/11/02,626.0,629.606,633.0,19800,633.0,626.0
536,2016/11/04,623.0,620.132,618.0,9100,626.0,615.0
537,2016/11/07,625.0,623.818,623.0,5500,626.0,622.0
538,2016/11/08,624.0,624.803,627.0,6100,627.0,624.0
539,2016/11/09,602.0,604.153,624.0,37800,625.0,587.0
540,2016/11/10,619.0,618.155,615.0,16100,623.0,615.0
541,2016/11/11,620.0,622.252,621.0,25800,625.0,618.0
542,2016/11/14,628.0,625.878,620.0,19700,632.0,618.0
543,2016/11/15,629.0,629.12,635.0,11700,635.0,621.0
544,2016/11/16,632.0,629.506,629.0,15800,632.0,625.0
545,2016/11/17,631.0,627.286,622.0,14700,632.0,622.0
546,2016/11/18,631.0,630.922,631.0,19300,635.0,628.0
547,2016/11/21,638.0,637.831,632.0,72200,651.0,631.0
548,2016/11/22,639.0,639.254,644.0,33100,644.0,632.0
549,2016/11/24,646.0,644.747,645.0,60000,648.0,641.0
550,2016/11/25,652.0,650.692,650.0,58400,656.0,646.0
551,2016/11/28,655.0,652.679,652.0,24300,658.0,645.0
552,2016/11/29,670.0,678.832,685.0,275200,697.0,661.0
553,2016/11/30,666.0,666.889,675.0,33300,675.0,660.0
554,2016/12/01,664.0,663.309,665.0,53800,671.0,657.0
555,2016/12/02,661.0,660.808,664.0,24500,665.0,657.0
556,2016/12/05,662.0,659.918,654.0,26800,665.0,654.0
557,2016/12/06,665.0,665.296,667.0,15900,670.0,662.0
558,2016/12/07,661.0,660.359,665.0,35900,665.0,657.0
559,2016/12/08,664.0,662.111,667.0,22600,667.0,659.0
560,2016/12/09,663.0,658.278,658.0,43200,665.0,652.0
561,2016/12/12,662.0,662.194,663.0,29400,666.0,659.0
562,2016/12/13,663.0,659.543,661.0,44000,663.0,655.0
563,2016/12/14,660.0,658.536,663.0,22200,663.0,654.0
564,2016/12/15,662.0,660.576,660.0,14400,662.0,659.0
565,2016/12/16,662.0,660.219,660.0,43800,665.0,654.0
566,2016/12/19,660.0,658.79,661.0,39600,663.0,655.0
567,2016/12/20,658.0,656.862,661.0,80400,663.0,651.0
568,2016/12/21,652.0,656.668,658.0,34600,662.0,651.0
569,2016/12/22,653.0,652.506,653.0,23500,656.0,650.0
570,2016/12/26,654.0,654.202,653.0,22800,659.0,650.0
571,2016/12/27,651.0,653.672,654.0,31400,657.0,650.0
572,2016/12/28,646.0,644.996,643.0,24100,647.0,641.0
573,2016/12/29,643.0,642.058,646.0,17200,646.0,639.0
574,2016/12/30,648.0,643.821,640.0,16800,648.0,640.0
575,2017/01/04,652.0,650.268,646.0,24600,653.0,646.0
576,2017/01/05,653.0,650.732,652.0,23900,653.0,647.0
577,2017/01/06,650.0,649.5,647.0,13200,654.0,647.0
578,2017/01/10,651.0,653.888,662.0,24100,662.0,648.0
579,2017/01/11,650.0,650.951,654.0,14200,655.0,648.0
580,2017/01/12,648.0,646.677,650.0,17000,650.0,644.0
581,2017/01/13,651.0,650.28,648.0,15700,652.0,648.0
582,2017/01/16,646.0,646.117,655.0,11100,655.0,641.0
583,2017/01/17,637.0,638.266,643.0,15400,643.0,635.0
584,2017/01/18,632.0,632.194,636.0,12900,636.0,631.0
585,2017/01/19,641.0,639.824,635.0,13600,642.0,635.0
586,2017/01/20,642.0,640.049,641.0,10300,644.0,635.0
587,2017/01/23,636.0,637.53,637.0,10000,640.0,632.0
588,2017/01/24,637.0,636.803,636.0,7100,641.0,633.0
589,2017/01/25,640.0,638.179,639.0,24000,643.0,636.0
590,2017/01/26,645.0,645.626,644.0,18700,648.0,643.0
591,2017/01/27,646.0,646.726,651.0,10200,651.0,645.0
592,2017/01/30,647.0,644.92,646.0,11200,648.0,641.0
593,2017/01/31,639.0,642.12,646.0,9200,647.0,638.0
594,2017/02/01,638.0,638.897,640.0,21400,646.0,636.0
595,2017/02/02,632.0,635.54,638.0,7600,644.0,631.0
596,2017/02/03,632.0,634.25,637.0,6400,637.0,632.0
597,2017/02/06,640.0,641.554,650.0,14800,650.0,634.0
598,2017/02/07,655.0,658.084,650.0,78600,669.0,648.0
599,2017/02/08,655.0,653.045,652.0,13300,655.0,650.0
600,2017/02/09,654.0,655.204,656.0,14200,659.0,653.0
601,2017/02/10,655.0,654.08,656.0,26300,658.0,651.0
602,2017/02/13,659.0,661.964,663.0,27900,664.0,659.0
603,2017/02/14,658.0,659.519,662.0,18700,662.0,658.0
604,2017/02/15,660.0,659.792,658.0,22600,663.0,658.0
605,2017/02/16,652.0,653.245,661.0,38300,661.0,649.0
606,2017/02/17,653.0,652.626,652.0,9900,654.0,651.0
607,2017/02/20,654.0,653.5,653.0,9000,655.0,651.0
608,2017/02/21,657.0,655.485,655.0,20000,659.0,654.0
609,2017/02/22,668.0,667.807,660.0,74100,674.0,658.0
610,2017/02/23,675.0,671.758,668.0,36700,675.0,666.0
611,2017/02/24,673.0,674.871,677.0,34100,679.0,671.0
612,2017/02/27,668.0,669.907,673.0,12900,673.0,667.0
613,2017/02/28,664.0,669.114,668.0,25400,673.0,664.0
614,2017/03/01,670.0,668.349,664.0,16600,671.0,664.0
615,2017/03/02,693.0,689.01,670.0,98100,697.0,670.0
616,2017/03/03,709.0,701.534,693.0,86500,711.0,680.0
617,2017/03/06,700.0,697.643,710.0,48800,710.0,670.0
618,2017/03/07,694.0,691.487,700.0,40900,700.0,679.0
619,2017/03/08,700.0,698.351,695.0,33600,701.0,690.0
620,2017/03/09,698.0,700.074,704.0,25800,706.0,694.0
621,2017/03/10,704.0,701.822,700.0,30900,707.0,694.0
622,2017/03/13,699.0,700.814,705.0,33400,707.0,696.0
623,2017/03/14,702.0,701.128,700.0,9400,704.0,700.0
624,2017/03/15,694.0,695.346,700.0,7800,700.0,694.0
625,2017/03/16,695.0,694.81,694.0,13700,698.0,685.0
626,2017/03/17,695.0,694.23,696.0,12600,696.0,687.0
627,2017/03/21,719.0,712.003,700.0,58100,719.0,698.0
628,2017/03/22,701.0,708.27,714.0,43400,715.0,700.0
629,2017/03/23,705.0,710.067,701.0,36000,722.0,699.0
630,2017/03/24,855.0,818.988,750.0,831000,855.0,748.0
631,2017/03/27,899.0,912.354,915.0,2101800,957.0,865.0
632,2017/03/28,830.0,847.804,914.0,860600,915.0,817.0
633,2017/03/29,804.0,813.183,830.0,353500,845.0,800.0
634,2017/03/30,802.0,808.691,808.0,225000,824.0,800.0
635,2017/03/31,800.0,797.869,805.0,147000,807.0,791.0
636,2017/04/03,794.0,795.707,800.0,90400,807.0,784.0
637,2017/04/04,778.0,795.1,789.0,207800,825.0,772.0
638,2017/04/05,742.0,753.116,769.0,117700,777.0,735.0
639,2017/04/06,738.0,738.257,742.0,119000,758.0,722.0
640,2017/04/07,750.0,740.86,739.0,91600,756.0,724.0
641,2017/04/10,753.0,758.162,741.0,114300,774.0,741.0
642,2017/04/11,743.0,745.862,750.0,49900,751.0,740.0
643,2017/04/12,796.0,798.976,740.0,937400,839.0,735.0
644,2017/04/13,750.0,753.486,752.0,296900,785.0,732.0
645,2017/04/14,729.0,733.597,750.0,121600,756.0,721.0
646,2017/04/17,729.0,729.459,728.0,73200,736.0,726.0
647,2017/04/18,744.0,744.495,744.0,68100,753.0,729.0
648,2017/04/19,741.0,748.884,744.0,54300,760.0,739.0
649,2017/04/20,742.0,740.775,742.0,46700,745.0,735.0
650,2017/04/21,753.0,754.618,750.0,66800,761.0,744.0
651,2017/04/24,783.0,771.565,760.0,115800,785.0,759.0
652,2017/04/25,785.0,788.198,793.0,67300,794.0,783.0
653,2017/04/26,788.0,791.817,793.0,54000,796.0,787.0
654,2017/04/27,800.0,796.973,790.0,47300,807.0,784.0
655,2017/04/28,800.0,800.82,800.0,41000,805.0,797.0
656,2017/05/01,803.0,800.212,804.0,54700,807.0,789.0
657,2017/05/02,820.0,820.247,810.0,199500,836.0,800.0
658,2017/05/08,815.0,821.277,830.0,47300,834.0,811.0
659,2017/05/09,811.0,811.799,815.0,45700,816.0,804.0
660,2017/05/10,804.0,808.75,811.0,53600,816.0,804.0
661,2017/05/11,806.0,808.577,811.0,20100,812.0,805.0
662,2017/05/12,810.0,805.198,810.0,50000,813.0,799.0
663,2017/05/15,812.0,811.873,805.0,101700,831.0,802.0
664,2017/05/16,826.0,822.776,820.0,115600,834.0,813.0
665,2017/05/17,819.0,820.231,831.0,35500,831.0,815.0
666,2017/05/18,823.0,818.624,804.0,71500,826.0,804.0
667,2017/05/19,819.0,821.341,821.0,59600,827.0,815.0
668,2017/05/22,831.0,831.657,834.0,46300,839.0,826.0
669,2017/05/23,819.0,821.226,835.0,33600,835.0,811.0
670,2017/05/24,848.0,839.174,824.0,133700,850.0,820.0
671,2017/05/25,830.0,839.148,848.0,36400,848.0,830.0
672,2017/05/26,826.0,827.799,832.0,28400,836.0,822.0
673,2017/05/29,855.0,856.094,830.0,120700,874.0,829.0
674,2017/05/30,855.0,883.797,885.0,378400,905.0,855.0
675,2017/05/31,857.0,853.563,855.0,62500,864.0,845.0
676,2017/06/01,853.0,853.12,867.0,39200,867.0,849.0
677,2017/06/02,849.0,851.075,855.0,93500,861.0,844.0
678,2017/06/05,849.0,850.69,849.0,40600,855.0,846.0
679,2017/06/06,829.0,838.659,852.0,56000,854.0,828.0
680,2017/06/07,837.0,831.778,826.0,40100,842.0,820.0
681,2017/06/08,850.0,850.641,849.0,30600,855.0,843.0
682,2017/06/09,850.0,850.097,851.0,49400,854.0,848.0
683,2017/06/12,849.0,850.583,850.0,30000,860.0,846.0
684,2017/06/13,848.0,850.623,849.0,48300,857.0,848.0
685,2017/06/14,849.0,850.938,857.0,28800,857.0,847.0
686,2017/06/15,858.0,856.411,850.0,36700,864.0,850.0
687,2017/06/16,853.0,857.677,859.0,28500,862.0,851.0
688,2017/06/19,848.0,852.759,851.0,24900,861.0,848.0
689,2017/06/20,852.0,853.266,850.0,34200,860.0,850.0
690,2017/06/21,849.0,850.04,850.0,22500,856.0,847.0
691,2017/06/22,841.0,848.635,854.0,17000,854.0,841.0
692,2017/06/23,829.0,838.929,841.0,33700,848.0,828.0
693,2017/06/26,840.0,839.712,836.0,20500,845.0,836.0
694,2017/06/27,841.0,843.626,850.0,19800,850.0,841.0
695,2017/06/28,847.0,847.658,850.0,29500,851.0,842.0
696,2017/06/29,839.0,848.324,847.0,24100,856.0,839.0
697,2017/06/30,835.0,835.841,838.0,21400,840.0,830.0
698,2017/07/03,831.0,833.965,840.0,20200,842.0,826.0
699,2017/07/04,834.0,837.387,838.0,19900,843.0,834.0
700,2017/07/05,836.0,836.584,831.0,8900,842.0,831.0
701,2017/07/06,838.0,843.335,843.0,20300,850.0,836.0
702,2017/07/07,840.0,841.66,840.0,14700,847.0,840.0
703,2017/07/10,838.0,838.809,843.0,25100,849.0,834.0
704,2017/07/11,849.0,849.538,836.0,41100,856.0,836.0
705,2017/07/12,848.0,849.734,849.0,9400,854.0,847.0
706,2017/07/13,848.0,850.185,848.0,17800,854.0,848.0
707,2017/07/14,850.0,850.442,848.0,8600,853.0,848.0
708,2017/07/18,841.0,849.168,850.0,23800,854.0,841.0
709,2017/07/19,855.0,854.118,841.0,31300,858.0,841.0
710,2017/07/20,848.0,849.816,851.0,16300,855.0,846.0
711,2017/07/21,849.0,849.951,850.0,22300,853.0,848.0
712,2017/07/24,841.0,844.524,848.0,21200,854.0,837.0
713,2017/07/25,843.0,846.257,843.0,14400,851.0,842.0
714,2017/07/26,846.0,847.432,844.0,34300,853.0,842.0
715,2017/07/27,849.0,850.564,846.0,11000,855.0,846.0
716,2017/07/28,844.0,847.25,849.0,12800,852.0,842.0
717,2017/07/31,838.0,844.154,850.0,27900,852.0,837.0
718,2017/08/01,839.0,834.122,845.0,14800,845.0,828.0
719,2017/08/02,846.0,847.391,850.0,17400,857.0,836.0
720,2017/08/03,839.0,840.259,845.0,5800,849.0,836.0
721,2017/08/04,853.0,852.386,839.0,17600,857.0,839.0
722,2017/08/07,869.0,866.796,853.0,34800,872.0,853.0
723,2017/08/08,882.0,882.89,875.0,55600,891.0,875.0
724,2017/08/09,843.0,845.419,875.0,62300,875.0,831.0
725,2017/08/10,847.0,844.402,840.0,13700,851.0,839.0
726,2017/08/14,798.0,809.464,845.0,47000,845.0,796.0
727,2017/08/15,798.0,802.997,798.0,29200,809.0,798.0
728,2017/08/16,787.0,790.859,806.0,27000,806.0,783.0
729,2017/08/17,793.0,795.792,799.0,7700,799.0,793.0
730,2017/08/18,796.0,794.758,796.0,15300,798.0,788.0
731,2017/08/21,807.0,802.402,802.0,8200,807.0,799.0
732,2017/08/22,781.0,780.647,777.0,77900,789.0,776.0
733,2017/08/23,786.0,787.526,792.0,13300,795.0,784.0
734,2017/08/24,788.0,786.438,780.0,10500,789.0,780.0
735,2017/08/25,791.0,791.597,792.0,7200,795.0,791.0
736,2017/08/28,790.0,789.85,792.0,8000,793.0,786.0
737,2017/08/29,794.0,792.363,790.0,15700,796.0,789.0
738,2017/08/30,798.0,795.809,797.0,9400,799.0,791.0
739,2017/08/31,808.0,806.172,798.0,12800,814.0,798.0
740,2017/09/01,811.0,810.812,817.0,8500,817.0,807.0
741,2017/09/04,800.0,803.416,804.0,14200,817.0,797.0
742,2017/09/05,781.0,782.946,800.0,40400,809.0,764.0
743,2017/09/06,765.0,769.093,774.0,15100,786.0,754.0
744,2017/09/07,779.0,778.226,777.0,6200,786.0,771.0
745,2017/09/08,786.0,783.839,779.0,16100,790.0,779.0
746,2017/09/11,795.0,796.643,792.0,5600,804.0,792.0
747,2017/09/12,807.0,808.895,814.0,8600,817.0,802.0
748,2017/09/13,802.0,803.167,810.0,9600,814.0,795.0
749,2017/09/14,800.0,803.349,806.0,12900,810.0,796.0
750,2017/09/15,801.0,801.631,806.0,15700,808.0,795.0
751,2017/09/19,814.0,810.259,805.0,11200,815.0,805.0
752,2017/09/20,820.0,818.235,817.0,17000,822.0,809.0
753,2017/09/21,822.0,824.02,821.0,9900,830.0,820.0
754,2017/09/22,873.0,867.79,822.0,101400,914.0,812.0
755,2017/09/25,872.0,871.365,874.0,42500,880.0,860.0
756,2017/09/26,871.0,872.617,876.0,23000,877.0,868.0
757,2017/09/27,878.0,877.642,869.0,37700,888.0,860.0
758,2017/09/28,872.0,879.126,880.0,39000,888.0,864.0
759,2017/09/29,860.0,865.775,872.0,28400,880.0,860.0
760,2017/10/02,862.0,862.542,868.0,17900,868.0,859.0
761,2017/10/03,850.0,858.536,869.0,39900,874.0,844.0
762,2017/10/04,843.0,844.647,854.0,26900,854.0,837.0
763,2017/10/05,844.0,846.844,847.0,10900,850.0,844.0
764,2017/10/06,852.0,851.64,848.0,8900,854.0,848.0
765,2017/10/10,862.0,858.807,853.0,9300,864.0,853.0
766,2017/10/11,871.0,868.786,866.0,20600,874.0,861.0
767,2017/10/12,861.0,859.227,879.0,43200,879.0,843.0
768,2017/10/13,847.0,848.502,857.0,22700,866.0,843.0
769,2017/10/16,854.0,850.793,844.0,42500,861.0,839.0
770,2017/10/17,864.0,867.207,861.0,56000,884.0,850.0
771,2017/10/18,872.0,869.325,869.0,20300,877.0,864.0
772,2017/10/19,858.0,866.941,877.0,25600,877.0,856.0
773,2017/10/20,851.0,853.774,856.0,18600,857.0,848.0
774,2017/10/23,861.0,858.797,856.0,13800,863.0,853.0
775,2017/10/24,862.0,861.313,854.0,9900,865.0,854.0
776,2017/10/25,862.0,863.516,866.0,12600,868.0,860.0
777,2017/10/26,879.0,872.831,862.0,28400,879.0,860.0
778,2017/10/27,878.0,880.586,879.0,29700,884.0,875.0
779,2017/10/30,882.0,881.264,871.0,32900,887.0,871.0
780,2017/10/31,892.0,890.084,888.0,36900,893.0,885.0
781,2017/11/01,891.0,892.744,898.0,16400,898.0,889.0
782,2017/11/02,880.0,879.797,883.0,17200,885.0,871.0
783,2017/11/06,870.0,874.912,879.0,19300,879.0,870.0
784,2017/11/07,869.0,868.463,862.0,20500,878.0,861.0
785,2017/11/08,876.0,873.593,870.0,5400,877.0,870.0
786,2017/11/09,871.0,882.176,876.0,34700,893.0,865.0
787,2017/11/10,880.0,875.62,861.0,11300,887.0,861.0
788,2017/11/13,920.0,906.842,910.0,113700,925.0,876.0
789,2017/11/14,909.0,913.786,921.0,23400,924.0,909.0
790,2017/11/15,863.0,869.236,912.0,55900,912.0,850.0
791,2017/11/16,875.0,870.424,863.0,19600,885.0,855.0
792,2017/11/17,864.0,862.61,886.0,51000,886.0,851.0
793,2017/11/20,878.0,871.984,864.0,12200,879.0,861.0
794,2017/11/21,894.0,892.813,879.0,27200,904.0,879.0
795,2017/11/22,899.0,896.68,897.0,25600,905.0,883.0
796,2017/11/24,914.0,913.321,920.0,33700,920.0,904.0
797,2017/11/27,916.0,914.958,915.0,23800,919.0,910.0
798,2017/11/28,915.0,912.598,909.0,24600,918.0,906.0
799,2017/11/29,939.0,936.689,924.0,90700,947.0,915.0
800,2017/11/30,927.0,932.855,945.0,32500,945.0,917.0
801,2017/12/01,937.0,931.448,930.0,27700,938.0,921.0
802,2017/12/04,935.0,938.522,938.0,34300,945.0,930.0
803,2017/12/05,938.0,939.385,940.0,30900,944.0,930.0
804,2017/12/06,930.0,940.137,936.0,32200,950.0,930.0
805,2017/12/07,942.0,940.294,926.0,32000,947.0,926.0
806,2017/12/08,941.0,940.65,941.0,21700,945.0,935.0
807,2017/12/11,943.0,942.61,948.0,11800,948.0,939.0
808,2017/12/12,939.0,936.306,944.0,25200,946.0,928.0
809,2017/12/13,937.0,942.95,950.0,18000,950.0,936.0
810,2017/12/14,946.0,942.503,935.0,16700,947.0,935.0
811,2017/12/15,956.0,946.878,944.0,80900,960.0,932.0
812,2017/12/18,945.0,955.095,963.0,56700,966.0,940.0
813,2017/12/19,935.0,941.36,945.0,18600,948.0,935.0
814,2017/12/20,940.0,941.784,940.0,35700,949.0,937.0
815,2017/12/21,948.0,942.743,940.0,41600,950.0,936.0
816,2017/12/22,943.0,943.498,949.0,26900,951.0,939.0
817,2017/12/25,938.0,934.072,940.0,44600,943.0,924.0
818,2017/12/26,949.0,940.924,936.0,27500,949.0,926.0
819,2017/12/27,937.0,935.668,940.0,42400,945.0,929.0
820,2017/12/28,940.0,939.538,937.0,15800,945.0,933.0
821,2017/12/29,939.0,940.77,944.0,10000,944.0,937.0
822,2018/01/04,939.0,935.752,940.0,27400,944.0,925.0
823,2018/01/05,940.0,938.132,941.0,32600,944.0,929.0
824,2018/01/09,942.0,943.346,943.0,27200,949.0,933.0
825,2018/01/10,952.0,948.769,949.0,35500,955.0,941.0
826,2018/01/11,958.0,952.875,952.0,20800,959.0,943.0
827,2018/01/12,963.0,960.499,958.0,34100,970.0,952.0
828,2018/01/15,979.0,977.661,970.0,69300,988.0,970.0
829,2018/01/16,981.0,984.116,990.0,29200,990.0,978.0
830,2018/01/17,973.0,976.172,975.0,15700,983.0,969.0
831,2018/01/18,961.0,971.522,988.0,43100,988.0,953.0
832,2018/01/19,968.0,963.565,952.0,19300,976.0,952.0
833,2018/01/22,961.0,960.718,968.0,37900,971.0,950.0
834,2018/01/23,962.0,957.555,955.0,21100,965.0,952.0
835,2018/01/24,953.0,957.389,965.0,27500,981.0,950.0
836,2018/01/25,948.0,947.444,952.0,23900,953.0,940.0
837,2018/01/26,944.0,948.892,951.0,21200,957.0,944.0
838,2018/01/29,933.0,943.625,956.0,32500,961.0,931.0
839,2018/01/30,924.0,927.796,946.0,53900,946.0,909.0
840,2018/01/31,934.0,934.153,933.0,24800,937.0,931.0
841,2018/02/01,962.0,952.772,931.0,32000,967.0,931.0
842,2018/02/02,956.0,955.796,961.0,18600,965.0,949.0
843,2018/02/05,1003.0,1039.531,1084.0,324400,1100.0,997.0
844,2018/02/06,924.0,915.179,934.0,111500,960.0,890.0
845,2018/02/07,935.0,971.823,950.0,75000,996.0,935.0
846,2018/02/08,960.0,956.302,943.0,18200,970.0,943.0
847,2018/02/09,939.0,917.338,900.0,45900,940.0,899.0
848,2018/02/13,951.0,942.317,954.0,61900,964.0,917.0
849,2018/02/14,916.0,925.54,950.0,30200,950.0,907.0
850,2018/02/15,908.0,920.017,934.0,17600,934.0,907.0
851,2018/02/16,998.0,992.642,940.0,153700,1035.0,932.0
852,2018/02/19,994.0,999.462,1000.0,100900,1012.0,971.0
853,2018/02/20,994.0,995.54,1000.0,36100,1002.0,985.0
854,2018/02/21,980.0,987.165,994.0,19400,996.0,980.0
855,2018/02/22,969.0,969.369,967.0,26000,979.0,964.0
856,2018/02/23,973.0,977.012,982.0,25000,982.0,972.0
857,2018/02/26,955.0,961.62,973.0,23700,973.0,950.0
858,2018/02/27,962.0,963.432,969.0,13200,969.0,959.0
859,2018/02/28,926.0,941.319,966.0,42000,967.0,926.0
860,2018/03/01,910.0,913.831,925.0,27800,929.0,903.0
861,2018/03/02,891.0,896.342,895.0,37700,907.0,891.0
862,2018/03/05,855.0,862.724,881.0,33700,881.0,852.0
863,2018/03/06,863.0,865.353,861.0,13900,872.0,861.0
864,2018/03/07,833.0,844.783,859.0,40000,860.0,832.0
865,2018/03/08,831.0,832.985,837.0,19400,839.0,826.0
866,2018/03/09,835.0,841.503,848.0,18100,850.0,831.0
867,2018/03/12,881.0,878.663,859.0,51300,899.0,855.0
868,2018/03/13,879.0,870.588,873.0,15300,879.0,862.0
869,2018/03/14,916.0,912.624,869.0,41800,935.0,869.0
870,2018/03/15,898.0,905.68,914.0,22200,924.0,898.0
871,2018/03/16,944.0,953.477,927.0,88000,996.0,923.0
872,2018/03/19,914.0,921.935,932.0,27800,934.0,912.0
873,2018/03/20,879.0,884.166,893.0,42700,900.0,874.0
874,2018/03/22,884.0,883.93,878.0,17100,895.0,873.0
875,2018/03/23,845.0,849.038,854.0,39700,860.0,841.0
876,2018/03/26,849.0,837.823,835.0,32800,851.0,830.0
877,2018/03/27,872.0,870.098,869.0,15300,882.0,861.0
878,2018/03/28,879.0,869.881,863.0,13400,880.0,856.0
879,2018/03/29,864.0,865.68,884.0,12500,886.0,856.0
880,2018/03/30,868.0,868.215,872.0,12100,878.0,861.0
881,2018/04/02,862.0,868.099,878.0,17200,878.0,860.0
882,2018/04/03,856.0,859.52,856.0,9800,868.0,854.0
883,2018/04/04,864.0,861.359,858.0,19500,870.0,855.0
884,2018/04/05,872.0,866.632,864.0,12500,872.0,858.0
885,2018/04/06,848.0,851.964,875.0,39000,875.0,845.0
886,2018/04/09,842.0,841.083,846.0,14400,848.0,837.0
887,2018/04/10,847.0,841.993,842.0,14600,847.0,835.0
888,2018/04/11,845.0,844.558,845.0,12000,850.0,840.0
889,2018/04/12,841.0,842.296,852.0,12500,852.0,839.0
890,2018/04/13,856.0,850.117,843.0,9400,856.0,843.0
891,2018/04/16,843.0,843.954,856.0,10800,856.0,839.0
892,2018/04/17,834.0,836.053,844.0,15000,844.0,831.0
893,2018/04/18,851.0,843.629,837.0,13200,851.0,834.0
894,2018/04/19,857.0,854.0,851.0,8100,857.0,851.0
895,2018/04/20,852.0,852.029,850.0,6900,858.0,850.0
896,2018/04/23,855.0,856.097,855.0,11400,861.0,853.0
897,2018/04/24,874.0,864.994,855.0,17200,874.0,853.0
898,2018/04/25,877.0,873.648,874.0,16200,879.0,864.0
899,2018/04/26,874.0,873.091,880.0,24300,880.0,867.0
900,2018/04/27,893.0,879.627,881.0,17700,893.0,873.0
901,2018/05/01,865.0,872.162,895.0,16700,895.0,864.0
902,2018/05/02,873.0,866.829,864.0,14600,873.0,862.0
903,2018/05/07,906.0,898.102,886.0,31400,907.0,884.0
904,2018/05/08,926.0,924.64,909.0,29200,940.0,903.0
905,2018/05/09,925.0,928.686,930.0,14000,937.0,923.0
906,2018/05/10,924.0,921.644,925.0,13200,928.0,911.0
907,2018/05/11,925.0,925.003,931.0,35200,932.0,919.0
908,2018/05/14,902.0,889.785,880.0,53100,910.0,875.0
909,2018/05/15,889.0,889.183,896.0,23000,896.0,884.0
910,2018/05/16,884.0,886.857,885.0,11200,890.0,880.0
911,2018/05/17,909.0,905.49,884.0,40600,926.0,884.0
912,2018/05/18,964.0,953.803,922.0,111000,975.0,917.0
913,2018/05/21,945.0,954.918,965.0,24300,965.0,945.0
914,2018/05/22,940.0,941.851,945.0,17400,953.0,933.0
915,2018/05/23,926.0,931.026,937.0,11400,945.0,924.0
916,2018/05/24,913.0,914.365,929.0,21100,930.0,903.0
917,2018/05/25,912.0,907.965,909.0,20000,913.0,896.0
918,2018/05/28,900.0,904.634,911.0,10100,913.0,897.0
919,2018/05/29,905.0,901.68,909.0,20600,910.0,897.0
920,2018/05/30,882.0,887.08,897.0,26200,902.0,881.0
921,2018/05/31,869.0,875.808,890.0,17700,895.0,867.0
922,2018/06/01,877.0,873.791,866.0,9100,880.0,866.0
923,2018/06/04,882.0,884.778,879.0,7200,896.0,879.0
924,2018/06/05,874.0,876.319,882.0,19100,885.0,867.0
925,2018/06/06,874.0,874.333,871.0,8700,879.0,871.0
926,2018/06/07,894.0,886.803,878.0,13700,895.0,877.0
927,2018/06/08,885.0,889.813,891.0,12300,892.0,885.0
928,2018/06/11,888.0,883.871,884.0,7000,891.0,875.0
929,2018/06/12,885.0,884.684,888.0,21500,890.0,877.0
930,2018/06/13,879.0,879.99,881.0,10200,883.0,878.0
931,2018/06/14,875.0,875.327,876.0,10400,878.0,870.0
932,2018/06/15,874.0,873.405,879.0,20000,880.0,868.0
933,2018/06/18,881.0,871.617,873.0,15400,881.0,866.0
934,2018/06/19,863.0,865.96,874.0,12600,874.0,861.0
935,2018/06/20,861.0,860.119,867.0,6700,867.0,858.0
936,2018/06/21,861.0,863.048,859.0,10500,872.0,858.0
937,2018/06/22,859.0,856.917,861.0,8400,866.0,853.0
938,2018/06/25,844.0,851.279,861.0,11100,863.0,842.0
939,2018/06/26,848.0,843.226,829.0,15500,857.0,829.0
940,2018/06/27,840.0,842.67,840.0,10600,851.0,838.0
941,2018/06/28,841.0,839.403,840.0,12900,847.0,837.0
942,2018/06/29,838.0,838.067,839.0,4500,841.0,834.0
943,2018/07/02,825.0,831.974,838.0,11300,849.0,822.0
944,2018/07/03,810.0,810.533,822.0,16500,823.0,802.0
945,2018/07/04,806.0,805.675,803.0,16000,820.0,800.0
946,2018/07/05,781.0,790.193,802.0,18700,808.0,776.0
947,2018/07/06,832.0,803.27,783.0,23300,832.0,780.0
948,2018/07/09,828.0,818.627,822.0,11800,831.0,806.0
949,2018/07/10,813.0,821.856,828.0,19400,839.0,811.0
950,2018/07/11,801.0,804.492,805.0,18900,816.0,797.0
951,2018/07/12,803.0,799.104,801.0,18300,808.0,793.0
952,2018/07/13,807.0,808.831,804.0,5900,817.0,803.0
953,2018/07/17,811.0,810.922,808.0,11500,817.0,808.0
954,2018/07/18,813.0,818.949,809.0,5900,829.0,809.0
955,2018/07/19,815.0,818.194,821.0,3100,825.0,814.0
956,2018/07/20,807.0,809.449,815.0,10700,817.0,807.0
957,2018/07/23,805.0,807.423,805.0,5200,813.0,803.0
958,2018/07/24,808.0,806.516,811.0,9300,814.0,802.0
959,2018/07/25,820.0,816.478,809.0,6900,827.0,808.0
960,2018/07/26,833.0,828.714,830.0,18200,836.0,824.0
961,2018/07/27,835.0,838.557,840.0,16700,848.0,833.0
962,2018/07/30,840.0,837.809,835.0,35600,843.0,828.0
963,2018/07/31,812.0,820.817,839.0,20800,839.0,812.0
964,2018/08/01,827.0,824.201,821.0,16400,831.0,820.0
965,2018/08/02,813.0,817.488,822.0,12300,828.0,812.0
966,2018/08/03,819.0,814.376,810.0,15700,821.0,807.0
967,2018/08/06,818.0,820.522,816.0,6700,827.0,816.0
968,2018/08/07,819.0,817.518,819.0,5600,823.0,815.0
969,2018/08/08,816.0,819.409,816.0,8800,830.0,813.0
970,2018/08/09,820.0,822.292,821.0,11300,829.0,817.0
971,2018/08/10,812.0,816.436,821.0,14000,823.0,812.0
972,2018/08/13,745.0,754.039,757.0,72800,779.0,742.0
973,2018/08/14,738.0,741.036,755.0,47200,755.0,730.0
974,2018/08/15,731.0,733.955,742.0,24600,747.0,724.0
975,2018/08/16,713.0,716.573,720.0,20600,721.0,707.0
976,2018/08/17,724.0,718.982,715.0,11200,725.0,710.0
977,2018/08/20,721.0,722.139,724.0,23000,730.0,718.0
978,2018/08/21,709.0,709.963,712.0,16200,715.0,708.0
979,2018/08/22,732.0,722.451,713.0,21300,733.0,710.0
980,2018/08/23,726.0,728.866,736.0,17200,736.0,722.0
981,2018/08/24,729.0,729.273,728.0,12800,734.0,726.0
982,2018/08/27,732.0,733.83,732.0,13500,736.0,732.0
983,2018/08/28,738.0,738.206,735.0,7300,742.0,735.0
984,2018/08/29,747.0,745.97,742.0,6700,748.0,742.0
985,2018/08/30,750.0,750.973,755.0,7300,755.0,747.0
986,2018/08/31,756.0,755.872,755.0,7800,760.0,750.0
987,2018/09/03,749.0,751.967,762.0,15100,762.0,746.0
988,2018/09/04,750.0,748.524,749.0,6300,752.0,745.0
989,2018/09/05,750.0,750.311,750.0,7400,754.0,746.0
990,2018/09/06,745.0,746.63,750.0,12700,753.0,740.0
991,2018/09/07,737.0,740.069,744.0,13100,746.0,733.0
992,2018/09/10,757.0,755.561,763.0,23900,769.0,741.0
993,2018/09/11,751.0,751.289,758.0,4500,758.0,748.0
994,2018/09/12,743.0,744.859,751.0,9200,751.0,738.0
995,2018/09/13,742.0,744.237,738.0,11400,753.0,738.0
996,2018/09/14,747.0,744.943,742.0,17600,752.0,742.0
997,2018/09/18,743.0,737.206,737.0,26700,747.0,727.0
998,2018/09/19,743.0,742.536,743.0,21100,746.0,740.0
999,2018/09/20,750.0,748.254,743.0,12600,752.0,743.0
1000,2018/09/21,756.0,756.624,760.0,10900,760.0,754.0
1001,2018/09/25,778.0,766.456,756.0,19300,778.0,756.0
1002,2018/09/26,789.0,787.287,779.0,18100,793.0,779.0
1003,2018/09/27,794.0,793.064,789.0,10900,799.0,789.0
1004,2018/09/28,793.0,794.071,799.0,9800,800.0,792.0
1005,2018/10/01,787.0,793.743,793.0,17500,800.0,787.0
1006,2018/10/02,792.0,792.472,801.0,12700,802.0,789.0
1007,2018/10/03,780.0,784.225,789.0,7100,792.0,780.0
1008,2018/10/04,777.0,778.8,782.0,5500,785.0,775.0
1009,2018/10/05,775.0,776.221,778.0,7700,782.0,770.0
1010,2018/10/09,764.0,768.086,782.0,3500,782.0,763.0
1011,2018/10/10,762.0,764.212,764.0,5200,769.0,761.0
1012,2018/10/11,741.0,746.163,760.0,17200,760.0,740.0
1013,2018/10/12,741.0,739.55,739.0,10000,746.0,734.0
1014,2018/10/15,742.0,744.831,741.0,30100,753.0,739.0
1015,2018/10/16,744.0,741.369,740.0,17600,750.0,733.0
1016,2018/10/17,754.0,753.129,749.0,12400,762.0,748.0
1017,2018/10/18,756.0,756.69,756.0,10000,760.0,754.0
1018,2018/10/19,748.0,748.783,751.0,4600,751.0,746.0
1019,2018/10/22,751.0,749.483,747.0,6000,755.0,747.0
1020,2018/10/23,747.0,749.747,751.0,9100,752.0,747.0
1021,2018/10/24,747.0,746.526,749.0,9700,752.0,742.0
1022,2018/10/25,728.0,734.835,740.0,21800,742.0,727.0
1023,2018/10/26,704.0,713.866,737.0,23200,737.0,704.0
1024,2018/10/29,700.0,703.153,705.0,17000,707.0,700.0
1025,2018/10/30,718.0,704.588,698.0,31800,721.0,690.0
1026,2018/10/31,724.0,722.452,718.0,8400,726.0,718.0
1027,2018/11/01,723.0,723.263,720.0,7600,726.0,720.0
1028,2018/11/02,720.0,721.048,720.0,10500,726.0,718.0
1029,2018/11/05,717.0,717.234,720.0,7700,720.0,715.0
1030,2018/11/06,717.0,718.436,718.0,5500,723.0,717.0
1031,2018/11/07,718.0,719.115,719.0,13900,721.0,717.0
1032,2018/11/08,723.0,722.303,721.0,3300,724.0,721.0
1033,2018/11/09,720.0,720.799,720.0,13400,723.0,718.0
1034,2018/11/12,725.0,730.31,735.0,10000,735.0,725.0
1035,2018/11/13,725.0,698.442,690.0,66700,745.0,665.0
1036,2018/11/14,719.0,718.414,724.0,11100,724.0,715.0
1037,2018/11/15,712.0,712.424,713.0,3300,714.0,711.0
1038,2018/11/16,710.0,712.864,720.0,8800,720.0,709.0
1039,2018/11/19,709.0,708.888,710.0,8900,712.0,706.0
1040,2018/11/20,708.0,706.218,709.0,10100,709.0,702.0
1041,2018/11/21,698.0,699.44,694.0,9100,708.0,694.0
1042,2018/11/22,699.0,696.913,698.0,17200,699.0,693.0
1043,2018/11/26,697.0,697.242,699.0,9100,699.0,695.0
1044,2018/11/27,695.0,696.814,697.0,8600,699.0,694.0
1045,2018/11/28,699.0,698.654,699.0,10100,700.0,696.0
1046,2018/11/29,695.0,695.842,699.0,10100,699.0,693.0
1047,2018/11/30,691.0,692.452,695.0,8400,696.0,689.0
1048,2018/12/03,698.0,694.971,691.0,6900,698.0,691.0
1049,2018/12/04,690.0,692.433,705.0,13400,705.0,688.0
1050,2018/12/05,689.0,686.985,689.0,6800,690.0,683.0
1051,2018/12/06,682.0,685.769,689.0,18600,692.0,682.0
1052,2018/12/07,680.0,680.405,684.0,8400,684.0,677.0
1053,2018/12/10,680.0,680.333,680.0,5700,683.0,680.0
1054,2018/12/11,676.0,678.304,680.0,7900,681.0,675.0
1055,2018/12/12,678.0,677.234,677.0,7700,679.0,675.0
1056,2018/12/13,678.0,677.528,677.0,8900,681.0,675.0
1057,2018/12/14,670.0,675.249,678.0,24100,684.0,669.0
1058,2018/12/17,671.0,670.818,673.0,8800,673.0,670.0
1059,2018/12/18,650.0,657.598,659.0,21900,668.0,650.0
1060,2018/12/19,650.0,652.178,653.0,11800,655.0,650.0
1061,2018/12/20,629.0,644.144,653.0,21500,654.0,629.0
1062,2018/12/21,596.0,604.593,625.0,29200,628.0,596.0
1063,2018/12/25,547.0,565.105,592.0,79000,592.0,522.0
1064,2018/12/26,539.0,542.92,560.0,19900,560.0,530.0
1065,2018/12/27,579.0,564.899,565.0,26600,579.0,559.0
1066,2018/12/28,574.0,570.368,574.0,23900,579.0,561.0
1067,2019/01/04,565.0,560.53,554.0,25100,570.0,552.0
1068,2019/01/07,574.0,571.927,571.0,11000,577.0,566.0
1069,2019/01/08,589.0,580.971,574.0,10500,589.0,574.0
1070,2019/01/09,593.0,595.572,597.0,22200,608.0,584.0
1071,2019/01/10,592.0,592.252,595.0,13100,595.0,587.0
1072,2019/01/11,587.0,587.875,594.0,15200,594.0,576.0
1073,2019/01/15,587.0,586.578,584.0,6400,588.0,584.0
1074,2019/01/16,587.0,587.212,587.0,6600,589.0,586.0
1075,2019/01/17,591.0,589.424,587.0,3300,591.0,587.0
1076,2019/01/18,597.0,594.73,592.0,10000,598.0,592.0
1077,2019/01/21,594.0,596.268,597.0,7100,602.0,594.0
1078,2019/01/22,595.0,594.911,594.0,7900,597.0,592.0
1079,2019/01/23,587.0,589.544,590.0,7900,593.0,587.0
1080,2019/01/24,589.0,588.037,588.0,5400,590.0,585.0
1081,2019/01/25,590.0,591.008,589.0,12100,594.0,589.0
1082,2019/01/28,592.0,591.756,592.0,8200,594.0,590.0
1083,2019/01/29,592.0,591.038,592.0,7900,592.0,589.0
1084,2019/01/30,588.0,588.849,592.0,5300,592.0,588.0
1085,2019/01/31,587.0,587.373,595.0,16100,595.0,582.0
1086,2019/02/01,577.0,582.239,587.0,7100,588.0,577.0
1087,2019/02/04,569.0,572.783,578.0,10600,579.0,567.0
1088,2019/02/05,576.0,573.878,569.0,7400,577.0,569.0
1089,2019/02/06,573.0,575.095,576.0,9500,581.0,573.0
1090,2019/02/07,566.0,569.627,579.0,13400,579.0,565.0
1091,2019/02/08,559.0,558.413,566.0,12600,567.0,552.0
1092,2019/02/12,567.0,565.707,555.0,11600,572.0,555.0
1093,2019/02/13,583.0,574.162,568.0,27200,590.0,554.0
1094,2019/02/14,579.0,579.885,576.0,10400,586.0,570.0
1095,2019/02/15,604.0,591.433,579.0,21500,604.0,574.0
1096,2019/02/18,591.0,590.686,603.0,25800,603.0,581.0
1097,2019/02/19,597.0,597.503,594.0,15500,602.0,592.0
1098,2019/02/20,596.0,594.761,598.0,18400,604.0,583.0
1099,2019/02/21,593.0,593.578,593.0,8300,598.0,590.0
1100,2019/02/22,598.0,592.386,595.0,5700,598.0,587.0
1101,2019/02/25,595.0,595.494,599.0,7700,599.0,590.0
1102,2019/02/26,585.0,589.167,596.0,8400,597.0,583.0
1103,2019/02/27,582.0,583.856,585.0,9000,588.0,582.0
1104,2019/02/28,577.0,578.2,582.0,4000,582.0,575.0
1105,2019/03/01,585.0,581.325,577.0,12300,586.0,577.0
1106,2019/03/04,587.0,585.638,585.0,9400,589.0,583.0
1107,2019/03/05,590.0,587.0,584.0,5500,590.0,584.0
1108,2019/03/06,599.0,600.105,600.0,14300,603.0,595.0
1109,2019/03/07,603.0,601.787,602.0,7500,609.0,596.0
1110,2019/03/08,581.0,587.179,596.0,18400,596.0,573.0
1111,2019/03/11,579.0,581.391,581.0,9200,588.0,576.0
1112,2019/03/12,581.0,580.098,586.0,9200,586.0,578.0
1113,2019/03/13,579.0,580.484,581.0,9300,584.0,577.0
1114,2019/03/14,579.0,580.016,584.0,6300,584.0,578.0
1115,2019/03/15,602.0,593.585,587.0,22400,603.0,581.0
1116,2019/03/18,595.0,598.455,607.0,11200,607.0,594.0
1117,2019/03/19,584.0,586.6,594.0,6500,598.0,582.0
1118,2019/03/20,583.0,582.738,584.0,8000,585.0,581.0
1119,2019/03/22,583.0,582.732,582.0,12300,585.0,580.0
1120,2019/03/25,569.0,574.01,582.0,10200,582.0,567.0
1121,2019/03/26,579.0,576.5,569.0,16400,579.0,569.0
1122,2019/03/27,583.0,582.015,579.0,6800,584.0,579.0
1123,2019/03/28,586.0,582.763,582.0,15200,587.0,578.0
1124,2019/03/29,591.0,587.305,572.0,8200,594.0,572.0
1125,2019/04/01,607.0,605.873,592.0,25200,616.0,592.0
1126,2019/04/02,618.0,619.836,617.0,28600,629.0,611.0
1127,2019/04/03,632.0,627.57,628.0,17200,632.0,619.0
1128,2019/04/04,622.0,626.6,634.0,10500,634.0,622.0
1129,2019/04/05,613.0,613.435,614.0,13800,616.0,611.0
1130,2019/04/08,618.0,618.797,620.0,7400,623.0,614.0
1131,2019/04/09,618.0,616.889,618.0,1800,618.0,614.0
1132,2019/04/10,607.0,611.878,623.0,7400,623.0,607.0
1133,2019/04/11,599.0,603.413,617.0,4600,617.0,597.0
1134,2019/04/12,600.0,600.0,601.0,3800,602.0,599.0
1135,2019/04/15,634.0,624.175,601.0,17700,634.0,601.0
1136,2019/04/16,627.0,629.525,633.0,8000,633.0,625.0
1137,2019/04/17,631.0,628.452,628.0,3100,632.0,623.0
1138,2019/04/18,617.0,626.955,631.0,6700,631.0,617.0
1139,2019/04/19,617.0,615.515,612.0,6800,617.0,612.0
1140,2019/04/22,597.0,603.738,615.0,12200,615.0,593.0
1141,2019/04/23,598.0,597.769,600.0,6500,600.0,596.0
1142,2019/04/24,600.0,600.383,602.0,4700,603.0,598.0
1143,2019/04/25,604.0,604.413,605.0,4600,606.0,602.0
1144,2019/04/26,616.0,613.405,606.0,7900,621.0,605.0
1145,2019/05/07,616.0,618.514,620.0,7000,622.0,616.0
1146,2019/05/08,614.0,613.631,615.0,8400,615.0,607.0
1147,2019/05/09,604.0,604.912,602.0,11400,611.0,602.0
1148,2019/05/10,591.0,595.022,600.0,9200,605.0,591.0
1149,2019/05/13,583.0,586.957,594.0,16400,599.0,581.0
1150,2019/05/14,591.0,588.45,585.0,10900,595.0,582.0
1151,2019/05/15,606.0,596.717,593.0,9200,607.0,585.0
1152,2019/05/16,605.0,606.464,607.0,23900,614.0,599.0
1153,2019/05/17,621.0,613.924,603.0,17000,621.0,603.0
1154,2019/05/20,622.0,615.462,614.0,10600,623.0,605.0
1155,2019/05/21,601.0,605.639,618.0,6100,618.0,601.0
1156,2019/05/22,592.0,596.015,601.0,6800,601.0,592.0
1157,2019/05/23,587.0,594.745,593.0,5100,606.0,586.0
1158,2019/05/24,587.0,588.061,587.0,11400,592.0,587.0
1159,2019/05/27,598.0,594.917,595.0,6000,599.0,590.0
1160,2019/05/28,599.0,599.4,598.0,3500,602.0,598.0
1161,2019/05/29,593.0,594.469,599.0,4900,599.0,588.0
1162,2019/05/30,590.0,590.071,590.0,2800,593.0,588.0
1163,2019/05/31,580.0,583.192,585.0,5200,587.0,580.0
1164,2019/06/03,566.0,570.745,580.0,13700,590.0,560.0
1165,2019/06/04,567.0,564.551,566.0,4900,567.0,559.0
1166,2019/06/05,578.0,574.336,582.0,11900,585.0,568.0
1167,2019/06/06,569.0,572.605,578.0,3800,578.0,569.0
1168,2019/06/07,572.0,570.844,575.0,7700,575.0,568.0
1169,2019/06/10,575.0,576.162,574.0,3700,581.0,573.0
1170,2019/06/11,575.0,572.117,575.0,7700,576.0,569.0
1171,2019/06/12,571.0,572.89,575.0,8200,578.0,567.0
1172,2019/06/13,589.0,584.362,572.0,32300,595.0,572.0
1173,2019/06/14,589.0,590.34,592.0,14100,597.0,589.0
1174,2019/06/17,580.0,586.261,589.0,11500,592.0,579.0
1175,2019/06/18,570.0,573.5,575.0,8000,581.0,570.0
1176,2019/06/19,570.0,573.227,571.0,6600,579.0,570.0
1177,2019/06/20,581.0,579.277,579.0,6500,584.0,577.0
1178,2019/06/21,571.0,576.139,581.0,3600,581.0,570.0
1179,2019/06/24,570.0,572.759,575.0,5400,576.0,569.0
1180,2019/06/25,570.0,572.487,570.0,7400,579.0,570.0
1181,2019/06/26,574.0,574.421,573.0,1900,578.0,573.0
1182,2019/06/27,574.0,577.067,575.0,3000,583.0,574.0
1183,2019/06/28,570.0,572.315,575.0,12400,576.0,570.0
1184,2019/07/01,589.0,582.813,585.0,7500,589.0,579.0
1185,2019/07/02,590.0,589.918,589.0,6100,592.0,585.0
1186,2019/07/03,586.0,585.5,590.0,4000,590.0,580.0
1187,2019/07/04,587.0,586.654,588.0,2600,591.0,584.0
1188,2019/07/05,582.0,580.25,578.0,8400,584.0,578.0
1189,2019/07/08,583.0,584.225,582.0,4000,588.0,582.0
1190,2019/07/09,585.0,582.756,585.0,4500,585.0,582.0
1191,2019/07/10,584.0,584.351,584.0,3700,586.0,584.0
1192,2019/07/11,584.0,586.373,589.0,6700,590.0,583.0
1193,2019/07/12,580.0,581.465,584.0,4300,584.0,578.0
1194,2019/07/16,578.0,578.539,579.0,2600,582.0,575.0
1195,2019/07/17,577.0,577.244,575.0,4500,580.0,573.0
1196,2019/07/18,596.0,610.625,617.0,159900,645.0,593.0
1197,2019/07/19,603.0,603.927,605.0,20400,608.0,598.0
1198,2019/07/22,596.0,600.315,605.0,7300,605.0,596.0
1199,2019/07/23,591.0,594.339,596.0,5900,598.0,591.0
1200,2019/07/24,589.0,586.723,591.0,9400,593.0,582.0
1201,2019/07/25,594.0,591.422,589.0,9000,594.0,589.0
1202,2019/07/26,589.0,592.859,594.0,7100,597.0,589.0
1203,2019/07/29,591.0,593.077,597.0,2600,597.0,590.0
1204,2019/07/30,604.0,598.519,596.0,7900,604.0,592.0
1205,2019/07/31,594.0,594.83,594.0,4700,598.0,593.0
1206,2019/08/01,594.0,591.25,592.0,4000,594.0,589.0
1207,2019/08/02,581.0,581.827,586.0,11000,587.0,580.0
1208,2019/08/05,571.0,575.533,582.0,10700,584.0,571.0
1209,2019/08/06,575.0,572.192,568.0,9400,577.0,566.0
1210,2019/08/07,572.0,572.857,576.0,5600,576.0,569.0
1211,2019/08/08,574.0,575.146,573.0,4100,578.0,572.0
1212,2019/08/09,578.0,578.773,580.0,13200,580.0,574.0
1213,2019/08/13,573.0,571.188,576.0,8000,576.0,564.0
1214,2019/08/14,577.0,575.5,583.0,7000,583.0,571.0
1215,2019/08/15,579.0,577.427,573.0,9600,581.0,573.0
1216,2019/08/16,582.0,580.312,576.0,6100,584.0,576.0
1217,2019/08/19,582.0,584.143,588.0,3500,588.0,581.0
1218,2019/08/20,582.0,581.615,581.0,5200,584.0,580.0
1219,2019/08/21,575.0,576.14,574.0,4300,582.0,563.0
1220,2019/08/22,569.0,572.0,584.0,5300,584.0,569.0
1221,2019/08/23,570.0,570.078,569.0,5100,572.0,569.0
