ds,yhat
2019-08-19,793.008871762521
2019-08-20,781.5871083302095
2019-08-21,770.8405345245125
2019-08-22,770.0251522153862
2019-08-23,780.7591424950115
2019-08-26,810.3485301805805
2019-08-27,804.2932269488534
2019-08-28,797.1495763017446
2019-08-29,796.4035488647695
2019-08-30,805.4835475304012
2019-09-02,853.2579958408182
2019-09-03,857.2208334268128
2019-09-04,853.2191339376875
2019-09-05,846.662138154833
2019-09-06,844.6726628490452
2019-09-09,885.8094688632574
2019-09-10,897.1019253407046
2019-09-11,897.3139035030567
2019-09-12,889.8580396731255
2019-09-13,884.7245678924618
