,Date,Close,VWAP,Open,Volume,High,Low
0,2014/08/25,1850.0,1841.857,1840.0,14000,1850.0,1830.0
1,2014/08/26,1850.0,1852.444,1850.0,22500,1860.0,1840.0
2,2014/08/27,1850.0,1855.701,1850.0,21400,1870.0,1840.0
3,2014/08/28,1860.0,1856.465,1870.0,31400,1870.0,1840.0
4,2014/08/29,1840.0,1842.803,1850.0,26400,1860.0,1830.0
5,2014/09/01,1850.0,1852.112,1840.0,46400,1880.0,1840.0
6,2014/09/02,1870.0,1873.344,1860.0,29900,1890.0,1850.0
7,2014/09/03,1910.0,1899.227,1890.0,64700,1920.0,1880.0
8,2014/09/04,1990.0,1970.619,1930.0,261600,2040.0,1920.0
9,2014/09/05,1970.0,1993.574,2020.0,127300,2020.0,1960.0
10,2014/09/08,1950.0,1946.44,1970.0,57300,1980.0,1920.0
11,2014/09/09,1970.0,1959.577,1950.0,33100,1970.0,1940.0
12,2014/09/10,1950.0,1935.928,1950.0,46900,1950.0,1920.0
13,2014/09/11,1930.0,1942.573,1950.0,47800,1950.0,1930.0
14,2014/09/12,1930.0,1937.629,1940.0,60300,1950.0,1920.0
15,2014/09/16,1900.0,1913.874,1930.0,58600,1940.0,1900.0
16,2014/09/17,1900.0,1907.746,1900.0,24400,1920.0,1900.0
17,2014/09/18,1910.0,1910.301,1910.0,33200,1920.0,1900.0
18,2014/09/19,1930.0,1917.765,1910.0,60400,1930.0,1910.0
19,2014/09/22,1920.0,1929.831,1940.0,35600,1950.0,1910.0
20,2014/09/24,1920.0,1914.208,1910.0,20200,1920.0,1900.0
21,2014/09/25,1950.0,1929.712,1920.0,38200,1950.0,1910.0
22,2014/09/26,1940.0,1926.758,1920.0,29300,1940.0,1920.0
23,2014/09/29,1930.0,1935.566,1940.0,30900,1950.0,1920.0
24,2014/09/30,1900.0,1906.996,1930.0,48600,1930.0,1890.0
25,2014/10/01,1900.0,1906.795,1900.0,25900,1920.0,1900.0
26,2014/10/02,1850.0,1868.582,1890.0,54300,1890.0,1850.0
27,2014/10/03,1870.0,1866.258,1850.0,31000,1880.0,1850.0
28,2014/10/06,1890.0,1891.667,1890.0,16800,1900.0,1880.0
29,2014/10/07,1850.0,1873.658,1880.0,38000,1900.0,1850.0
30,2014/10/08,1830.0,1827.14,1830.0,50700,1850.0,1810.0
31,2014/10/09,1810.0,1824.907,1850.0,32400,1860.0,1800.0
32,2014/10/10,1760.0,1774.389,1790.0,59700,1800.0,1750.0
33,2014/10/14,1750.0,1741.769,1720.0,58800,1770.0,1720.0
34,2014/10/15,1780.0,1775.516,1770.0,22300,1790.0,1760.0
35,2014/10/16,1740.0,1746.537,1760.0,33500,1760.0,1730.0
36,2014/10/17,1720.0,1732.535,1740.0,35900,1750.0,1720.0
37,2014/10/20,1750.0,1759.465,1760.0,24300,1780.0,1750.0
38,2014/10/21,1740.0,1758.567,1760.0,33500,1770.0,1740.0
39,2014/10/22,1770.0,1772.945,1770.0,42100,1780.0,1760.0
40,2014/10/23,1800.0,1777.222,1760.0,41400,1800.0,1760.0
41,2014/10/24,1750.0,1782.496,1820.0,66100,1840.0,1750.0
42,2014/10/27,1790.0,1779.755,1780.0,20400,1790.0,1770.0
43,2014/10/28,1800.0,1781.809,1780.0,47000,1800.0,1770.0
44,2014/10/29,1790.0,1805.847,1790.0,62600,1830.0,1790.0
45,2014/10/30,1790.0,1796.223,1790.0,37600,1810.0,1790.0
46,2014/10/31,1850.0,1833.693,1820.0,57400,1850.0,1810.0
47,2014/11/04,1870.0,1888.364,1910.0,135100,1910.0,1860.0
48,2014/11/05,1850.0,1855.47,1860.0,87200,1870.0,1830.0
49,2014/11/06,1840.0,1851.16,1850.0,59500,1870.0,1830.0
50,2014/11/07,1920.0,1900.883,1850.0,122300,1930.0,1850.0
51,2014/11/10,1870.0,1891.553,1910.0,70200,1910.0,1870.0
52,2014/11/11,1880.0,1888.581,1890.0,58500,1900.0,1870.0
53,2014/11/12,1880.0,1897.945,1890.0,76400,1920.0,1870.0
54,2014/11/13,1890.0,1888.25,1880.0,64000,1900.0,1880.0
55,2014/11/14,1900.0,1900.598,1910.0,58500,1910.0,1890.0
56,2014/11/17,1880.0,1892.864,1900.0,61800,1900.0,1870.0
57,2014/11/18,1940.0,1915.725,1890.0,106900,1950.0,1890.0
58,2014/11/19,1940.0,1937.877,1930.0,47100,1950.0,1930.0
59,2014/11/20,1960.0,1957.389,1930.0,47500,1970.0,1930.0
60,2014/11/21,1960.0,1953.277,1950.0,59200,1980.0,1920.0
61,2014/11/25,1990.0,1989.193,1980.0,102900,2010.0,1960.0
62,2014/11/26,2000.0,1990.056,1990.0,53200,2000.0,1970.0
63,2014/11/27,1990.0,1983.925,2000.0,108800,2010.0,1960.0
64,2014/11/28,1970.0,1983.932,1990.0,81900,2000.0,1970.0
65,2014/12/01,2010.0,2006.737,1990.0,76000,2030.0,1980.0
66,2014/12/02,2090.0,2066.76,2020.0,174700,2100.0,2020.0
67,2014/12/03,2180.0,2182.54,2160.0,622900,2230.0,2150.0
68,2014/12/04,2210.0,2203.798,2220.0,239100,2230.0,2160.0
69,2014/12/05,2220.0,2205.517,2190.0,150800,2220.0,2190.0
70,2014/12/08,2310.0,2270.272,2220.0,337800,2310.0,2210.0
71,2014/12/09,2310.0,2313.582,2280.0,269400,2340.0,2270.0
72,2014/12/10,2260.0,2271.551,2280.0,169600,2300.0,2240.0
73,2014/12/11,2250.0,2210.664,2170.0,91900,2270.0,2160.0
74,2014/12/12,2290.0,2296.021,2280.0,150800,2320.0,2280.0
75,2014/12/15,2250.0,2266.794,2250.0,65500,2290.0,2250.0
76,2014/12/16,2200.0,2217.155,2230.0,97700,2250.0,2190.0
77,2014/12/17,2240.0,2238.826,2190.0,95400,2260.0,2190.0
78,2014/12/18,2390.0,2350.465,2300.0,380900,2400.0,2290.0
79,2014/12/19,2360.0,2385.181,2420.0,199000,2440.0,2330.0
80,2014/12/22,2460.0,2421.556,2390.0,226800,2460.0,2380.0
81,2014/12/24,2430.0,2452.413,2470.0,331600,2500.0,2400.0
82,2014/12/25,2410.0,2398.144,2440.0,160000,2440.0,2360.0
83,2014/12/26,2410.0,2385.858,2380.0,147500,2430.0,2350.0
84,2014/12/29,2360.0,2366.453,2420.0,118700,2420.0,2330.0
85,2014/12/30,2290.0,2308.332,2340.0,93500,2350.0,2280.0
86,2015/01/05,2330.0,2317.304,2270.0,103100,2350.0,2260.0
87,2015/01/06,2250.0,2268.209,2270.0,112800,2310.0,2240.0
88,2015/01/07,2260.0,2264.566,2230.0,80600,2290.0,2230.0
89,2015/01/08,2320.0,2325.282,2280.0,122300,2350.0,2270.0
90,2015/01/09,2330.0,2354.593,2350.0,151100,2400.0,2310.0
91,2015/01/13,2290.0,2279.404,2300.0,115700,2310.0,2260.0
92,2015/01/14,2320.0,2335.23,2300.0,110900,2370.0,2290.0
93,2015/01/15,2350.0,2342.327,2310.0,72200,2370.0,2300.0
94,2015/01/16,2320.0,2309.095,2320.0,84000,2340.0,2270.0
95,2015/01/19,2360.0,2342.906,2330.0,70200,2360.0,2300.0
96,2015/01/20,2390.0,2385.388,2360.0,81100,2400.0,2350.0
97,2015/01/21,2480.0,2449.628,2400.0,252700,2480.0,2390.0
98,2015/01/22,2460.0,2482.252,2480.0,191400,2540.0,2430.0
99,2015/01/23,2430.0,2433.937,2490.0,142000,2490.0,2400.0
100,2015/01/26,2390.0,2391.682,2410.0,74900,2420.0,2370.0
101,2015/01/27,2440.0,2437.214,2410.0,70700,2450.0,2410.0
102,2015/01/28,2460.0,2449.573,2410.0,93700,2470.0,2400.0
103,2015/01/29,2410.0,2430.333,2450.0,66100,2450.0,2410.0
104,2015/01/30,2420.0,2414.959,2440.0,48800,2440.0,2400.0
105,2015/02/02,2420.0,2400.52,2380.0,53800,2430.0,2370.0
106,2015/02/03,2420.0,2421.273,2420.0,99000,2460.0,2390.0
107,2015/02/04,2520.0,2500.149,2470.0,321400,2530.0,2450.0
108,2015/02/05,2470.0,2504.968,2500.0,188800,2540.0,2450.0
109,2015/02/06,2520.0,2501.824,2500.0,100900,2530.0,2460.0
110,2015/02/09,2520.0,2507.69,2520.0,114700,2530.0,2480.0
111,2015/02/10,2540.0,2528.777,2490.0,160300,2570.0,2480.0
112,2015/02/12,2730.0,2711.634,2600.0,657200,2780.0,2600.0
113,2015/02/13,2720.0,2702.746,2700.0,169000,2740.0,2680.0
114,2015/02/16,2790.0,2783.987,2740.0,213200,2820.0,2740.0
115,2015/02/17,2830.0,2803.716,2770.0,174900,2840.0,2740.0
116,2015/02/18,2850.0,2857.295,2830.0,260600,2890.0,2810.0
117,2015/02/19,2860.0,2821.488,2830.0,168700,2870.0,2770.0
118,2015/02/20,2860.0,2850.58,2850.0,110300,2870.0,2830.0
119,2015/02/23,2870.0,2875.621,2880.0,144100,2910.0,2840.0
120,2015/02/24,2840.0,2856.398,2840.0,101600,2880.0,2840.0
121,2015/02/25,2980.0,2958.325,2880.0,379000,3010.0,2860.0
122,2015/02/26,3090.0,3054.019,2980.0,315000,3100.0,2970.0
123,2015/02/27,3010.0,3060.84,3110.0,370100,3160.0,2960.0
124,2015/03/02,3040.0,3007.212,2990.0,208000,3070.0,2950.0
125,2015/03/03,2900.0,2951.267,3050.0,239200,3060.0,2900.0
126,2015/03/04,2880.0,2872.295,2860.0,218300,2930.0,2820.0
127,2015/03/05,2910.0,2917.29,2880.0,108100,2950.0,2880.0
128,2015/03/06,3000.0,2997.935,2970.0,167100,3040.0,2960.0
129,2015/03/09,3010.0,3011.982,2990.0,120600,3040.0,2960.0
130,2015/03/10,3040.0,3072.241,3040.0,220400,3120.0,3020.0
131,2015/03/11,3060.0,3047.478,3000.0,146300,3090.0,2980.0
132,2015/03/12,3140.0,3145.458,3080.0,259600,3210.0,3070.0
133,2015/03/13,3160.0,3154.449,3150.0,182300,3200.0,3120.0
134,2015/03/16,3130.0,3139.399,3180.0,76600,3190.0,3110.0
135,2015/03/17,3100.0,3122.291,3160.0,81200,3160.0,3090.0
136,2015/03/18,3050.0,3042.568,3070.0,107100,3080.0,3020.0
137,2015/03/19,3000.0,3006.387,3050.0,111000,3060.0,2990.0
138,2015/03/20,3050.0,3003.38,3000.0,100900,3060.0,2960.0
139,2015/03/23,3160.0,3119.644,3070.0,143100,3160.0,3050.0
140,2015/03/24,3160.0,3166.661,3130.0,126100,3190.0,3130.0
141,2015/03/25,3250.0,3233.486,3160.0,285100,3270.0,3160.0
142,2015/03/26,3380.0,3322.185,3250.0,439000,3420.0,3210.0
143,2015/03/27,3410.0,3430.703,3420.0,559400,3550.0,3300.0
144,2015/03/30,3540.0,3485.578,3400.0,343700,3550.0,3360.0
145,2015/03/31,3750.0,3697.281,3600.0,545000,3770.0,3570.0
146,2015/04/01,3870.0,3795.111,3770.0,596000,3930.0,3640.0
147,2015/04/02,3810.0,3845.41,3850.0,392400,3930.0,3780.0
148,2015/04/03,4020.0,3944.335,3800.0,498500,4020.0,3750.0
149,2015/04/06,4420.0,4320.142,4100.0,1074100,4450.0,4100.0
150,2015/04/07,4310.0,4335.764,4410.0,859600,4440.0,4240.0
151,2015/04/08,4260.0,4257.787,4370.0,517400,4370.0,4140.0
152,2015/04/09,4140.0,4145.221,4240.0,469300,4240.0,4070.0
153,2015/04/10,4420.0,4349.832,4100.0,1047300,4470.0,4100.0
154,2015/04/13,4320.0,4345.92,4410.0,474500,4500.0,4220.0
155,2015/04/14,4200.0,4235.732,4250.0,322400,4360.0,4170.0
156,2015/04/15,4240.0,4225.681,4190.0,366500,4300.0,4130.0
157,2015/04/16,4120.0,4113.857,4210.0,381400,4230.0,4060.0
158,2015/04/17,3840.0,3912.881,4090.0,551200,4110.0,3800.0
159,2015/04/20,3940.0,3930.029,3810.0,382900,3980.0,3800.0
160,2015/04/21,3980.0,3931.903,3940.0,180800,3980.0,3890.0
161,2015/04/22,4190.0,4052.604,3900.0,674400,4200.0,3830.0
162,2015/04/23,4100.0,4121.233,4170.0,284600,4180.0,4040.0
163,2015/04/24,4040.0,4011.761,4040.0,219700,4060.0,3960.0
164,2015/04/27,4040.0,4033.854,4060.0,175400,4080.0,4000.0
165,2015/04/28,3850.0,3889.54,3990.0,493500,4010.0,3820.0
166,2015/04/30,3710.0,3739.696,3810.0,328500,3850.0,3670.0
167,2015/05/01,3720.0,3702.011,3690.0,191400,3740.0,3660.0
168,2015/05/07,3780.0,3798.069,3670.0,259400,3880.0,3670.0
169,2015/05/08,3780.0,3773.362,3740.0,129100,3830.0,3720.0
170,2015/05/11,3830.0,3817.979,3830.0,84100,3850.0,3780.0
171,2015/05/12,3820.0,3789.165,3830.0,160500,3850.0,3730.0
172,2015/05/13,3710.0,3709.8,3760.0,254700,3780.0,3670.0
173,2015/05/14,3760.0,3729.188,3690.0,117000,3790.0,3670.0
174,2015/05/15,3780.0,3769.932,3780.0,103000,3800.0,3730.0
175,2015/05/18,3690.0,3712.692,3780.0,133000,3800.0,3680.0
176,2015/05/19,3690.0,3713.085,3710.0,116700,3760.0,3690.0
177,2015/05/20,3660.0,3680.238,3700.0,176200,3740.0,3640.0
178,2015/05/21,3530.0,3575.847,3600.0,256700,3640.0,3530.0
179,2015/05/22,3770.0,3714.414,3540.0,397600,3800.0,3540.0
180,2015/05/25,3730.0,3766.37,3790.0,162000,3840.0,3710.0
181,2015/05/26,3720.0,3731.362,3770.0,110100,3770.0,3700.0
182,2015/05/27,3700.0,3687.366,3710.0,101000,3720.0,3670.0
183,2015/05/28,3730.0,3756.279,3730.0,169600,3800.0,3710.0
184,2015/05/29,3690.0,3690.853,3720.0,107900,3720.0,3660.0
185,2015/06/01,3760.0,3734.623,3700.0,69000,3760.0,3690.0
186,2015/06/02,3720.0,3730.968,3760.0,98100,3780.0,3690.0
187,2015/06/03,4120.0,4080.269,3790.0,1696900,4230.0,3770.0
188,2015/06/04,4130.0,4130.138,4140.0,616800,4190.0,4050.0
189,2015/06/05,4120.0,4118.019,4110.0,205400,4160.0,4080.0
190,2015/06/08,4070.0,4070.979,4130.0,170600,4130.0,4020.0
191,2015/06/09,3860.0,3931.12,4020.0,276700,4030.0,3850.0
192,2015/06/10,3870.0,3887.17,3880.0,135000,3950.0,3830.0
193,2015/06/11,3830.0,3863.886,3890.0,150300,3930.0,3810.0
194,2015/06/12,3870.0,3854.783,3870.0,117300,3890.0,3810.0
195,2015/06/15,3850.0,3830.067,3840.0,120300,3880.0,3780.0
196,2015/06/16,4060.0,4010.256,3920.0,523900,4090.0,3890.0
197,2015/06/17,4190.0,4170.57,4060.0,708500,4230.0,4050.0
198,2015/06/18,4150.0,4157.603,4210.0,295400,4210.0,4110.0
199,2015/06/19,4170.0,4259.396,4300.0,1546000,4410.0,4140.0
200,2015/06/22,4190.0,4223.656,4270.0,358300,4290.0,4170.0
201,2015/06/23,4220.0,4207.007,4220.0,232200,4250.0,4170.0
202,2015/06/24,4260.0,4308.461,4270.0,397600,4370.0,4230.0
203,2015/06/25,4200.0,4222.38,4240.0,151700,4260.0,4190.0
204,2015/06/26,4100.0,4139.915,4230.0,224800,4250.0,4090.0
205,2015/06/29,3990.0,4022.439,3960.0,195200,4080.0,3950.0
206,2015/06/30,4030.0,4033.482,4020.0,174900,4100.0,4000.0
207,2015/07/01,4000.0,4018.56,4040.0,145800,4070.0,3990.0
208,2015/07/02,3990.0,4028.18,4040.0,168100,4080.0,3980.0
209,2015/07/03,3910.0,3920.537,3990.0,193700,4000.0,3900.0
210,2015/07/06,3870.0,3895.13,3840.0,180700,3970.0,3830.0
211,2015/07/07,3840.0,3866.147,3890.0,130800,3910.0,3840.0
212,2015/07/08,3670.0,3721.826,3810.0,234900,3810.0,3640.0
213,2015/07/09,3630.0,3567.918,3560.0,296800,3670.0,3460.0
214,2015/07/10,3650.0,3665.749,3660.0,152200,3730.0,3610.0
215,2015/07/13,3720.0,3696.514,3660.0,107000,3730.0,3620.0
216,2015/07/14,3730.0,3748.281,3790.0,165200,3790.0,3720.0
217,2015/07/15,3660.0,3679.08,3750.0,183600,3760.0,3630.0
218,2015/07/16,3710.0,3685.217,3650.0,94300,3730.0,3630.0
219,2015/07/17,3680.0,3683.821,3700.0,79300,3700.0,3660.0
220,2015/07/21,3770.0,3749.705,3690.0,84800,3770.0,3690.0
221,2015/07/22,3740.0,3741.304,3720.0,60600,3760.0,3720.0
222,2015/07/23,3650.0,3681.291,3740.0,165000,3740.0,3620.0
223,2015/07/24,3600.0,3615.359,3650.0,68300,3650.0,3590.0
224,2015/07/27,3500.0,3518.274,3570.0,121100,3570.0,3490.0
225,2015/07/28,3510.0,3472.776,3460.0,123200,3530.0,3410.0
226,2015/07/29,3500.0,3498.777,3500.0,59700,3530.0,3480.0
227,2015/07/30,3530.0,3539.616,3490.0,124900,3570.0,3490.0
228,2015/07/31,3590.0,3526.845,3540.0,104600,3590.0,3480.0
229,2015/08/03,3750.0,3747.317,3750.0,227700,3810.0,3700.0
230,2015/08/04,3790.0,3778.842,3710.0,190800,3870.0,3680.0
231,2015/08/05,3730.0,3751.232,3790.0,83600,3800.0,3720.0
232,2015/08/06,3710.0,3725.635,3730.0,93700,3760.0,3700.0
233,2015/08/07,3670.0,3670.79,3680.0,105000,3690.0,3650.0
234,2015/08/10,3660.0,3651.255,3650.0,77300,3680.0,3630.0
235,2015/08/11,3720.0,3700.977,3670.0,64500,3730.0,3660.0
236,2015/08/12,3630.0,3637.152,3700.0,92000,3700.0,3600.0
237,2015/08/13,3620.0,3584.484,3600.0,79400,3620.0,3560.0
238,2015/08/14,3570.0,3566.797,3570.0,56200,3590.0,3550.0
239,2015/08/17,3580.0,3568.894,3560.0,69600,3590.0,3520.0
240,2015/08/18,3530.0,3556.641,3600.0,65500,3600.0,3530.0
241,2015/08/19,3480.0,3498.523,3540.0,99500,3540.0,3460.0
242,2015/08/20,3440.0,3448.201,3430.0,56700,3470.0,3430.0
243,2015/08/21,3270.0,3291.727,3310.0,141300,3330.0,3260.0
244,2015/08/24,2980.0,3075.461,3100.0,173400,3200.0,2980.0
245,2015/08/25,2870.0,2895.812,2760.0,195800,3050.0,2710.0
246,2015/08/26,2940.0,2930.346,2930.0,213800,3010.0,2880.0
247,2015/08/27,2920.0,2980.615,2970.0,203200,3030.0,2920.0
248,2015/08/28,2990.0,2991.135,3000.0,161300,3020.0,2960.0
249,2015/08/31,3070.0,3067.197,3000.0,132700,3130.0,3000.0
250,2015/09/01,2880.0,2940.616,3000.0,199700,3000.0,2880.0
251,2015/09/02,3040.0,2987.807,2840.0,270400,3110.0,2820.0
252,2015/09/03,3250.0,3197.842,3060.0,384700,3270.0,3060.0
253,2015/09/04,3170.0,3199.293,3240.0,298500,3310.0,3100.0
254,2015/09/07,3070.0,3076.647,3100.0,116000,3130.0,3030.0
255,2015/09/08,2950.0,2991.988,3050.0,115700,3100.0,2930.0
256,2015/09/09,3070.0,3088.685,3070.0,200800,3140.0,3050.0
257,2015/09/10,3140.0,3092.56,3030.0,134000,3160.0,3000.0
258,2015/09/11,3100.0,3112.491,3080.0,80700,3160.0,3080.0
259,2015/09/14,2990.0,3009.622,3080.0,142900,3100.0,2960.0
260,2015/09/15,2890.0,2923.875,2990.0,184500,3020.0,2860.0
261,2015/09/16,2890.0,2874.837,2910.0,104600,2910.0,2850.0
262,2015/09/17,2940.0,2900.356,2890.0,98400,2950.0,2860.0
263,2015/09/18,2890.0,2891.283,2890.0,84200,2920.0,2860.0
264,2015/09/24,2770.0,2799.355,2810.0,96100,2880.0,2770.0
265,2015/09/25,2820.0,2776.108,2740.0,97900,2820.0,2730.0
266,2015/09/28,2800.0,2794.561,2830.0,70600,2840.0,2760.0
267,2015/09/29,2660.0,2697.433,2750.0,92700,2750.0,2650.0
268,2015/09/30,2770.0,2737.058,2690.0,84300,2770.0,2690.0
269,2015/10/01,2790.0,2786.808,2790.0,101500,2830.0,2750.0
270,2015/10/02,2800.0,2789.921,2760.0,50700,2840.0,2750.0
271,2015/10/05,2900.0,2894.448,2850.0,96000,2940.0,2830.0
272,2015/10/06,2880.0,2914.776,2970.0,75800,2980.0,2860.0
273,2015/10/07,2870.0,2868.3,2850.0,69400,2910.0,2830.0
274,2015/10/08,2850.0,2861.535,2880.0,80800,2890.0,2840.0
275,2015/10/09,2910.0,2892.045,2860.0,70900,2920.0,2840.0
276,2015/10/13,2960.0,2948.709,2930.0,101500,2970.0,2920.0
277,2015/10/14,2910.0,2927.006,2960.0,66800,2960.0,2900.0
278,2015/10/15,3000.0,2982.584,2890.0,86700,3010.0,2890.0
279,2015/10/16,3090.0,3116.466,3030.0,193000,3200.0,3030.0
280,2015/10/19,3150.0,3167.476,3220.0,145400,3220.0,3120.0
281,2015/10/20,3120.0,3118.656,3120.0,86300,3140.0,3090.0
282,2015/10/21,3170.0,3158.782,3110.0,93600,3190.0,3090.0
283,2015/10/22,3160.0,3184.743,3150.0,113000,3240.0,3140.0
284,2015/10/23,3200.0,3197.288,3220.0,80000,3220.0,3180.0
285,2015/10/26,3280.0,3240.324,3210.0,117400,3280.0,3180.0
286,2015/10/27,3220.0,3235.695,3280.0,105000,3280.0,3200.0
287,2015/10/28,3220.0,3221.007,3280.0,69500,3280.0,3180.0
288,2015/10/29,3450.0,3386.143,3240.0,312700,3480.0,3210.0
289,2015/10/30,3410.0,3398.189,3410.0,135800,3430.0,3350.0
290,2015/11/02,3440.0,3432.797,3480.0,345700,3490.0,3360.0
291,2015/11/04,3350.0,3378.053,3460.0,296400,3470.0,3250.0
292,2015/11/05,3420.0,3373.727,3350.0,188600,3420.0,3290.0
293,2015/11/06,3390.0,3363.86,3410.0,168900,3420.0,3290.0
294,2015/11/09,3410.0,3418.161,3400.0,112000,3450.0,3390.0
295,2015/11/10,3550.0,3498.86,3380.0,315700,3570.0,3370.0
296,2015/11/11,3540.0,3523.321,3550.0,139100,3560.0,3480.0
297,2015/11/12,3510.0,3510.049,3530.0,81600,3530.0,3480.0
298,2015/11/13,3450.0,3441.014,3450.0,177600,3490.0,3380.0
299,2015/11/16,3430.0,3417.15,3350.0,94400,3460.0,3350.0
300,2015/11/17,3550.0,3521.982,3470.0,134200,3560.0,3460.0
301,2015/11/18,3490.0,3515.321,3550.0,106000,3560.0,3480.0
302,2015/11/19,3530.0,3533.222,3520.0,98700,3560.0,3500.0
303,2015/11/20,3470.0,3486.585,3510.0,106600,3530.0,3460.0
304,2015/11/24,3680.0,3637.445,3500.0,298200,3700.0,3500.0
305,2015/11/25,3710.0,3704.799,3730.0,156500,3740.0,3650.0
306,2015/11/26,3680.0,3695.23,3710.0,139000,3720.0,3670.0
307,2015/11/27,3590.0,3613.449,3680.0,169300,3700.0,3560.0
308,2015/11/30,3440.0,3489.166,3580.0,243300,3580.0,3400.0
309,2015/12/01,3520.0,3509.297,3450.0,169300,3550.0,3450.0
310,2015/12/02,3480.0,3478.495,3510.0,119600,3530.0,3450.0
311,2015/12/03,3370.0,3385.843,3450.0,191000,3450.0,3340.0
312,2015/12/04,3320.0,3332.228,3290.0,140500,3370.0,3290.0
313,2015/12/07,3360.0,3381.677,3390.0,107900,3420.0,3350.0
314,2015/12/08,3370.0,3355.466,3360.0,71900,3370.0,3330.0
315,2015/12/09,3220.0,3258.343,3340.0,137000,3350.0,3220.0
316,2015/12/10,3240.0,3235.78,3210.0,96200,3290.0,3200.0
317,2015/12/11,3220.0,3223.414,3200.0,95200,3270.0,3200.0
318,2015/12/14,3170.0,3154.978,3170.0,91000,3180.0,3130.0
319,2015/12/15,3150.0,3169.927,3170.0,68100,3220.0,3140.0
320,2015/12/16,3230.0,3220.287,3200.0,122000,3260.0,3180.0
321,2015/12/17,3320.0,3341.63,3370.0,149700,3390.0,3290.0
322,2015/12/18,3290.0,3309.127,3310.0,132800,3370.0,3270.0
323,2015/12/21,3260.0,3243.886,3270.0,83900,3290.0,3210.0
324,2015/12/22,3190.0,3199.931,3230.0,100800,3260.0,3170.0
325,2015/12/24,3150.0,3201.531,3270.0,109700,3270.0,3140.0
326,2015/12/25,3070.0,3089.486,3150.0,171100,3160.0,3040.0
327,2015/12/28,3100.0,3063.304,3020.0,79300,3110.0,3020.0
328,2015/12/29,3090.0,3070.52,3080.0,53800,3110.0,3040.0
329,2015/12/30,3060.0,3068.344,3100.0,63400,3120.0,3040.0
330,2016/01/04,2960.0,2995.36,3070.0,108400,3070.0,2950.0
331,2016/01/05,2940.0,2954.358,2930.0,81000,3000.0,2930.0
332,2016/01/06,2900.0,2880.046,2940.0,173800,2970.0,2840.0
333,2016/01/07,2910.0,2914.382,2900.0,125500,2970.0,2880.0
334,2016/01/08,2900.0,2895.044,2870.0,90800,2930.0,2850.0
335,2016/01/12,2750.0,2776.738,2860.0,185800,2880.0,2730.0
336,2016/01/13,2810.0,2792.529,2750.0,111900,2830.0,2750.0
337,2016/01/14,2710.0,2690.872,2700.0,108900,2730.0,2660.0
338,2016/01/15,2610.0,2664.02,2730.0,152500,2800.0,2600.0
339,2016/01/18,2550.0,2513.922,2500.0,168800,2560.0,2460.0
340,2016/01/19,2540.0,2539.412,2520.0,137700,2580.0,2500.0
341,2016/01/20,2380.0,2426.188,2530.0,209600,2530.0,2370.0
342,2016/01/21,2300.0,2388.042,2370.0,208900,2470.0,2290.0
343,2016/01/22,2390.0,2390.89,2360.0,166200,2420.0,2340.0
344,2016/01/25,2470.0,2409.852,2410.0,168500,2480.0,2300.0
345,2016/01/26,2380.0,2388.792,2410.0,97700,2420.0,2350.0
346,2016/01/27,2300.0,2343.452,2430.0,323300,2440.0,2260.0
347,2016/01/28,2260.0,2272.184,2300.0,232100,2310.0,2240.0
348,2016/01/29,2350.0,2298.632,2290.0,193700,2350.0,2240.0
349,2016/02/01,2390.0,2387.71,2420.0,122700,2430.0,2350.0
350,2016/02/02,2340.0,2338.85,2360.0,123500,2370.0,2300.0
351,2016/02/03,2200.0,2211.361,2270.0,221100,2290.0,2160.0
352,2016/02/04,2160.0,2168.979,2160.0,141000,2210.0,2130.0
353,2016/02/05,2110.0,2105.463,2100.0,147000,2160.0,2070.0
354,2016/02/08,2140.0,2112.775,2050.0,99100,2160.0,2050.0
355,2016/02/09,2020.0,2038.929,2060.0,186700,2100.0,1990.0
356,2016/02/10,1920.0,1972.467,2060.0,216500,2110.0,1870.0
357,2016/02/12,1590.0,1624.95,1620.0,514500,1680.0,1590.0
358,2016/02/15,1790.0,1762.092,1790.0,280100,1800.0,1720.0
359,2016/02/16,1830.0,1824.475,1770.0,210300,1890.0,1730.0
360,2016/02/17,1860.0,1848.687,1790.0,134000,1900.0,1790.0
361,2016/02/18,2030.0,1981.48,1930.0,208800,2050.0,1920.0
362,2016/02/19,2130.0,2070.715,1980.0,267200,2150.0,1970.0
363,2016/02/22,2140.0,2141.417,2110.0,169400,2190.0,2070.0
364,2016/02/23,2120.0,2126.605,2150.0,91300,2170.0,2090.0
365,2016/02/24,2150.0,2132.515,2100.0,118900,2160.0,2080.0
366,2016/02/25,2400.0,2342.6,2210.0,413500,2430.0,2200.0
367,2016/02/26,2370.0,2372.461,2400.0,209300,2420.0,2320.0
368,2016/02/29,2430.0,2461.448,2450.0,231300,2520.0,2400.0
369,2016/03/01,2350.0,2368.131,2410.0,129500,2450.0,2320.0
370,2016/03/02,2470.0,2451.612,2450.0,170000,2470.0,2400.0
371,2016/03/03,2520.0,2528.173,2460.0,283500,2600.0,2450.0
372,2016/03/04,2560.0,2561.367,2550.0,126600,2590.0,2530.0
373,2016/03/07,2580.0,2595.2,2620.0,94800,2640.0,2560.0
374,2016/03/08,2520.0,2519.857,2550.0,90900,2570.0,2470.0
375,2016/03/09,2430.0,2444.928,2490.0,90100,2490.0,2410.0
376,2016/03/10,2500.0,2491.64,2450.0,76200,2530.0,2430.0
377,2016/03/11,2480.0,2469.04,2440.0,66700,2510.0,2440.0
378,2016/03/14,2500.0,2507.807,2490.0,71600,2550.0,2470.0
379,2016/03/15,2430.0,2460.449,2470.0,66800,2500.0,2430.0
380,2016/03/16,2380.0,2404.119,2380.0,97600,2440.0,2370.0
381,2016/03/17,2370.0,2392.804,2390.0,66700,2440.0,2350.0
382,2016/03/18,2370.0,2369.7,2370.0,70000,2400.0,2340.0
383,2016/03/22,2420.0,2411.181,2390.0,65200,2430.0,2390.0
384,2016/03/23,2500.0,2484.301,2440.0,95800,2530.0,2410.0
385,2016/03/24,2330.0,2396.935,2480.0,145200,2480.0,2330.0
386,2016/03/25,2410.0,2386.035,2340.0,102400,2420.0,2340.0
387,2016/03/28,2490.0,2470.846,2430.0,82700,2500.0,2420.0
388,2016/03/29,2420.0,2435.862,2460.0,63800,2490.0,2390.0
389,2016/03/30,2380.0,2395.54,2410.0,50000,2420.0,2370.0
390,2016/03/31,2400.0,2419.894,2400.0,93900,2470.0,2380.0
391,2016/04/01,2300.0,2316.938,2350.0,114300,2400.0,2280.0
392,2016/04/04,2220.0,2237.699,2250.0,105600,2300.0,2210.0
393,2016/04/05,2080.0,2111.966,2180.0,112400,2190.0,2070.0
394,2016/04/06,2090.0,2081.301,2050.0,70700,2120.0,2030.0
395,2016/04/07,2060.0,2085.591,2070.0,66000,2140.0,2060.0
396,2016/04/08,2100.0,2063.607,2000.0,104800,2120.0,1990.0
397,2016/04/11,2120.0,2092.086,2100.0,81500,2140.0,2050.0
398,2016/04/12,2190.0,2175.796,2090.0,64700,2230.0,2090.0
399,2016/04/13,2320.0,2296.453,2260.0,76400,2340.0,2250.0
400,2016/04/14,2400.0,2382.451,2370.0,65700,2410.0,2360.0
401,2016/04/15,2380.0,2373.197,2360.0,39100,2390.0,2340.0
402,2016/04/18,2300.0,2309.127,2320.0,111100,2340.0,2280.0
403,2016/04/19,2390.0,2372.722,2360.0,70900,2400.0,2350.0
404,2016/04/20,2320.0,2359.572,2420.0,63100,2430.0,2310.0
405,2016/04/21,2380.0,2363.819,2370.0,68600,2380.0,2320.0
406,2016/04/22,2390.0,2353.061,2340.0,70900,2390.0,2320.0
407,2016/04/25,2390.0,2399.569,2400.0,48700,2420.0,2380.0
408,2016/04/26,2340.0,2343.644,2390.0,67500,2390.0,2320.0
409,2016/04/27,2380.0,2343.544,2340.0,68000,2400.0,2290.0
410,2016/04/28,2260.0,2331.722,2390.0,123100,2420.0,2250.0
411,2016/05/02,2130.0,2135.346,2110.0,102500,2190.0,2100.0
412,2016/05/06,2150.0,2131.481,2130.0,59400,2170.0,2100.0
413,2016/05/09,2190.0,2189.685,2180.0,57200,2210.0,2170.0
414,2016/05/10,2250.0,2222.962,2210.0,47600,2250.0,2180.0
415,2016/05/11,2370.0,2361.853,2300.0,119800,2390.0,2300.0
416,2016/05/12,2270.0,2282.701,2360.0,174400,2360.0,2250.0
417,2016/05/13,2250.0,2274.6,2290.0,90000,2300.0,2250.0
418,2016/05/16,2220.0,2236.351,2220.0,58100,2260.0,2210.0
419,2016/05/17,2210.0,2210.178,2230.0,56300,2250.0,2200.0
420,2016/05/18,2220.0,2213.011,2200.0,85700,2240.0,2180.0
421,2016/05/19,2210.0,2227.153,2250.0,41100,2260.0,2200.0
422,2016/05/20,2220.0,2213.702,2200.0,73200,2230.0,2200.0
423,2016/05/23,2260.0,2216.997,2210.0,77600,2270.0,2170.0
424,2016/05/24,2250.0,2245.573,2230.0,51500,2270.0,2230.0
425,2016/05/25,2250.0,2261.712,2280.0,47900,2290.0,2250.0
426,2016/05/26,2250.0,2250.608,2240.0,44400,2270.0,2230.0
427,2016/05/27,2240.0,2243.267,2250.0,25100,2250.0,2230.0
428,2016/05/30,2340.0,2306.874,2290.0,56300,2340.0,2270.0
429,2016/05/31,2470.0,2415.15,2350.0,127000,2470.0,2350.0
430,2016/06/01,2470.0,2471.451,2450.0,117200,2500.0,2450.0
431,2016/06/02,2400.0,2407.358,2460.0,90100,2460.0,2370.0
432,2016/06/03,2370.0,2381.247,2370.0,47300,2410.0,2360.0
433,2016/06/06,2320.0,2299.935,2300.0,107700,2360.0,2240.0
434,2016/06/07,2280.0,2290.859,2330.0,62900,2350.0,2260.0
435,2016/06/08,2230.0,2235.993,2260.0,85100,2260.0,2210.0
436,2016/06/09,2190.0,2202.075,2210.0,67000,2230.0,2180.0
437,2016/06/10,2160.0,2160.645,2190.0,88400,2190.0,2130.0
438,2016/06/13,2050.0,2071.435,2100.0,104500,2110.0,2040.0
439,2016/06/14,2030.0,2028.827,2040.0,87800,2080.0,2010.0
440,2016/06/15,1990.0,2008.792,2030.0,99300,2040.0,1980.0
441,2016/06/16,1860.0,1903.992,1990.0,148800,2000.0,1820.0
442,2016/06/17,1940.0,1920.217,1910.0,138300,1940.0,1880.0
443,2016/06/20,2060.0,2005.147,1970.0,95000,2060.0,1940.0
444,2016/06/21,2050.0,2049.675,2060.0,86200,2080.0,2000.0
445,2016/06/22,2100.0,2065.188,2060.0,82300,2100.0,2020.0
446,2016/06/23,2160.0,2132.321,2090.0,113300,2170.0,2070.0
447,2016/06/24,1950.0,2044.705,2160.0,177700,2190.0,1900.0
448,2016/06/27,1950.0,1965.322,1960.0,71400,1990.0,1940.0
449,2016/06/28,1890.0,1907.552,1910.0,77600,1940.0,1870.0
450,2016/06/29,1960.0,1953.688,1950.0,113600,1980.0,1930.0
451,2016/06/30,1920.0,1963.849,1990.0,87300,2020.0,1920.0
452,2016/07/01,1970.0,1962.826,1980.0,60500,1980.0,1930.0
453,2016/07/04,1950.0,1952.679,1960.0,32100,1970.0,1930.0
454,2016/07/05,1910.0,1918.226,1940.0,46800,1960.0,1900.0
455,2016/07/06,1850.0,1843.517,1880.0,96100,1880.0,1820.0
456,2016/07/07,1830.0,1849.303,1850.0,61700,1880.0,1820.0
457,2016/07/08,1810.0,1831.559,1830.0,74400,1880.0,1810.0
458,2016/07/11,1940.0,1899.324,1860.0,82900,1940.0,1860.0
459,2016/07/12,2040.0,2022.666,1960.0,85900,2050.0,1950.0
460,2016/07/13,2090.0,2084.413,2080.0,75000,2120.0,2060.0
461,2016/07/14,2070.0,2074.266,2080.0,74300,2100.0,2050.0
462,2016/07/15,2110.0,2110.292,2070.0,61700,2140.0,2070.0
463,2016/07/19,2130.0,2123.43,2140.0,48100,2150.0,2100.0
464,2016/07/20,2050.0,2059.795,2090.0,73100,2100.0,2020.0
465,2016/07/21,2100.0,2098.425,2130.0,104100,2130.0,2060.0
466,2016/07/22,2050.0,2048.563,2070.0,66100,2090.0,2030.0
467,2016/07/25,2080.0,2067.278,2070.0,37100,2090.0,2040.0
468,2016/07/26,1970.0,1982.579,2030.0,123700,2040.0,1960.0
469,2016/07/27,1960.0,1965.988,1950.0,167000,2010.0,1940.0
470,2016/07/28,1950.0,1940.732,1940.0,71000,1960.0,1920.0
471,2016/07/29,1950.0,1933.313,1940.0,83900,1970.0,1900.0
472,2016/08/01,1740.0,1775.967,1850.0,353300,1870.0,1720.0
473,2016/08/02,1720.0,1717.474,1710.0,115600,1740.0,1710.0
474,2016/08/03,1620.0,1659.052,1710.0,209900,1710.0,1620.0
475,2016/08/04,1640.0,1646.021,1670.0,162100,1670.0,1620.0
476,2016/08/05,1660.0,1665.571,1660.0,66600,1680.0,1650.0
477,2016/08/08,1630.0,1653.327,1690.0,156600,1690.0,1620.0
478,2016/08/09,1630.0,1636.365,1650.0,77300,1650.0,1630.0
479,2016/08/10,1620.0,1614.013,1630.0,111900,1630.0,1600.0
480,2016/08/12,1650.0,1642.023,1620.0,86000,1670.0,1620.0
481,2016/08/15,1680.0,1669.631,1660.0,67800,1690.0,1650.0
482,2016/08/16,1630.0,1645.872,1670.0,89400,1670.0,1620.0
483,2016/08/17,1600.0,1609.68,1620.0,143800,1630.0,1600.0
484,2016/08/18,1580.0,1584.532,1590.0,116500,1600.0,1580.0
485,2016/08/19,1570.0,1575.227,1580.0,103300,1590.0,1560.0
486,2016/08/22,1640.0,1604.391,1570.0,87000,1640.0,1570.0
487,2016/08/23,1640.0,1638.206,1640.0,104800,1660.0,1610.0
488,2016/08/24,1650.0,1655.169,1650.0,59000,1670.0,1640.0
489,2016/08/25,1640.0,1632.535,1650.0,56800,1650.0,1620.0
490,2016/08/26,1640.0,1642.592,1650.0,46300,1660.0,1630.0
491,2016/08/29,1700.0,1684.494,1670.0,104800,1700.0,1670.0
492,2016/08/30,1730.0,1726.238,1700.0,133700,1760.0,1690.0
493,2016/08/31,1710.0,1714.633,1720.0,111800,1740.0,1700.0
494,2016/09/01,1760.0,1748.222,1710.0,137200,1780.0,1710.0
495,2016/09/02,1720.0,1727.898,1750.0,99900,1760.0,1700.0
496,2016/09/05,1750.0,1750.059,1740.0,101400,1770.0,1730.0
497,2016/09/06,1760.0,1766.258,1740.0,75900,1790.0,1740.0
498,2016/09/07,1750.0,1752.72,1760.0,48900,1770.0,1740.0
499,2016/09/08,1760.0,1764.017,1750.0,47300,1780.0,1750.0
500,2016/09/09,1760.0,1767.814,1770.0,55800,1780.0,1760.0
501,2016/09/12,1730.0,1721.189,1730.0,82400,1740.0,1700.0
502,2016/09/13,1730.0,1730.226,1740.0,48700,1740.0,1710.0
503,2016/09/14,1710.0,1709.149,1730.0,83400,1730.0,1690.0
504,2016/09/15,1700.0,1691.14,1700.0,80700,1710.0,1670.0
505,2016/09/16,1680.0,1688.923,1710.0,55700,1710.0,1670.0
506,2016/09/20,1710.0,1705.747,1710.0,79000,1730.0,1690.0
507,2016/09/21,1700.0,1698.062,1700.0,67600,1720.0,1680.0
508,2016/09/23,1720.0,1710.578,1710.0,74400,1730.0,1700.0
509,2016/09/26,1710.0,1712.765,1720.0,48100,1720.0,1700.0
510,2016/09/27,1710.0,1690.785,1690.0,58600,1710.0,1670.0
511,2016/09/28,1730.0,1712.377,1690.0,56800,1740.0,1690.0
512,2016/09/29,1760.0,1751.851,1730.0,69700,1770.0,1730.0
513,2016/09/30,1720.0,1729.376,1740.0,78500,1750.0,1710.0
514,2016/10/03,1700.0,1708.404,1730.0,54500,1730.0,1700.0
515,2016/10/04,1710.0,1701.077,1720.0,68700,1720.0,1690.0
516,2016/10/05,1710.0,1712.407,1720.0,27000,1720.0,1710.0
517,2016/10/06,1750.0,1747.882,1730.0,81700,1760.0,1730.0
518,2016/10/07,1890.0,1833.923,1770.0,323700,1890.0,1770.0
519,2016/10/11,2040.0,2013.271,1990.0,472900,2070.0,1960.0
520,2016/10/12,2010.0,2022.521,2010.0,153900,2060.0,2000.0
521,2016/10/13,1980.0,1999.645,2020.0,169100,2060.0,1950.0
522,2016/10/14,2010.0,1977.021,1960.0,132600,2020.0,1930.0
523,2016/10/17,2100.0,2068.642,2030.0,215100,2100.0,2000.0
524,2016/10/18,2150.0,2117.984,2100.0,201900,2150.0,2080.0
525,2016/10/19,2280.0,2239.795,2170.0,487800,2300.0,2170.0
526,2016/10/20,2170.0,2207.356,2260.0,396000,2270.0,2160.0
527,2016/10/21,2210.0,2228.889,2220.0,235800,2260.0,2190.0
528,2016/10/24,2210.0,2205.945,2230.0,133900,2240.0,2180.0
529,2016/10/25,2100.0,2147.534,2230.0,298000,2250.0,2090.0
530,2016/10/26,2090.0,2084.547,2090.0,135900,2110.0,2070.0
531,2016/10/27,2110.0,2103.506,2090.0,129500,2130.0,2070.0
532,2016/10/28,2120.0,2120.387,2120.0,119000,2150.0,2100.0
533,2016/10/31,2040.0,2017.867,2020.0,228300,2040.0,1980.0
534,2016/11/01,2130.0,2100.962,2010.0,175600,2150.0,2010.0
535,2016/11/02,2110.0,2107.764,2090.0,135500,2150.0,2080.0
536,2016/11/04,2090.0,2088.979,2100.0,163600,2130.0,2040.0
537,2016/11/07,2150.0,2152.124,2130.0,112500,2180.0,2130.0
538,2016/11/08,2120.0,2138.239,2180.0,72700,2180.0,2110.0
539,2016/11/09,2010.0,2025.531,2140.0,208100,2150.0,1950.0
540,2016/11/10,2140.0,2126.65,2100.0,141200,2150.0,2100.0
541,2016/11/11,2130.0,2133.292,2140.0,105700,2170.0,2100.0
542,2016/11/14,2150.0,2152.218,2120.0,114500,2180.0,2120.0
543,2016/11/15,2140.0,2134.703,2170.0,92700,2170.0,2120.0
544,2016/11/16,2170.0,2157.996,2150.0,143200,2170.0,2140.0
545,2016/11/17,2260.0,2226.774,2150.0,242700,2260.0,2150.0
546,2016/11/18,2250.0,2251.069,2280.0,131900,2280.0,2230.0
547,2016/11/21,2340.0,2332.071,2270.0,260200,2360.0,2270.0
548,2016/11/22,2400.0,2380.423,2360.0,252700,2400.0,2350.0
549,2016/11/24,2440.0,2441.417,2450.0,216000,2460.0,2420.0
550,2016/11/25,2400.0,2432.532,2440.0,233800,2490.0,2370.0
551,2016/11/28,2360.0,2372.047,2400.0,186100,2420.0,2340.0
552,2016/11/29,2440.0,2415.566,2370.0,133300,2440.0,2370.0
553,2016/11/30,2480.0,2466.81,2460.0,184000,2500.0,2430.0
554,2016/12/01,2520.0,2531.525,2530.0,257000,2560.0,2490.0
555,2016/12/02,2510.0,2521.314,2530.0,137000,2550.0,2490.0
556,2016/12/05,2510.0,2505.629,2480.0,112100,2530.0,2460.0
557,2016/12/06,2570.0,2568.757,2560.0,172900,2590.0,2550.0
558,2016/12/07,2580.0,2588.966,2580.0,148000,2620.0,2570.0
559,2016/12/08,2570.0,2587.891,2610.0,143700,2620.0,2560.0
560,2016/12/09,2570.0,2556.118,2560.0,123900,2590.0,2530.0
561,2016/12/12,2590.0,2585.226,2600.0,123800,2620.0,2540.0
562,2016/12/13,2510.0,2520.121,2560.0,190200,2570.0,2490.0
563,2016/12/14,2530.0,2527.418,2530.0,91000,2550.0,2500.0
564,2016/12/15,2500.0,2515.779,2530.0,118700,2550.0,2490.0
565,2016/12/16,2530.0,2529.863,2520.0,123700,2550.0,2510.0
566,2016/12/19,2460.0,2482.263,2520.0,166600,2520.0,2450.0
567,2016/12/20,2420.0,2430.736,2460.0,122300,2470.0,2400.0
568,2016/12/21,2380.0,2397.019,2420.0,161700,2430.0,2370.0
569,2016/12/22,2360.0,2343.398,2350.0,119200,2370.0,2310.0
570,2016/12/26,2360.0,2378.489,2360.0,126400,2400.0,2350.0
571,2016/12/27,2330.0,2348.711,2410.0,149700,2410.0,2320.0
572,2016/12/28,2320.0,2305.153,2320.0,78600,2330.0,2280.0
573,2016/12/29,2230.0,2244.612,2290.0,150700,2300.0,2220.0
574,2016/12/30,2270.0,2262.015,2230.0,78900,2290.0,2220.0
575,2017/01/04,2350.0,2330.349,2310.0,77400,2350.0,2300.0
576,2017/01/05,2370.0,2352.686,2350.0,102000,2370.0,2330.0
577,2017/01/06,2320.0,2327.764,2340.0,93900,2360.0,2300.0
578,2017/01/10,2310.0,2316.04,2320.0,64400,2340.0,2290.0
579,2017/01/11,2820.0,2884.356,3110.0,10261700,3110.0,2690.0
580,2017/01/12,3090.0,3044.774,2840.0,13126000,3280.0,2760.0
581,2017/01/13,3330.0,3218.562,3060.0,4420800,3380.0,2970.0
582,2017/01/16,3250.0,3352.016,3260.0,2948800,3560.0,3210.0
583,2017/01/17,3040.0,3116.796,3250.0,1124400,3260.0,3000.0
584,2017/01/18,3060.0,3063.217,3000.0,683900,3120.0,3000.0
585,2017/01/19,2940.0,2954.926,3070.0,774800,3090.0,2890.0
586,2017/01/20,2890.0,2881.639,2920.0,446000,2940.0,2840.0
587,2017/01/23,2850.0,2890.06,2920.0,299700,2960.0,2850.0
588,2017/01/24,2900.0,2910.299,2880.0,321600,2970.0,2850.0
589,2017/01/25,2870.0,2909.45,2950.0,230700,2980.0,2870.0
590,2017/01/26,2820.0,2829.162,2850.0,454800,2890.0,2780.0
591,2017/01/27,2850.0,2847.206,2820.0,234800,2870.0,2810.0
592,2017/01/30,2810.0,2827.878,2870.0,138100,2870.0,2800.0
593,2017/01/31,2750.0,2767.145,2770.0,211200,2830.0,2730.0
594,2017/02/01,2870.0,2855.479,2750.0,275400,2920.0,2740.0
595,2017/02/02,2810.0,2841.367,2870.0,152200,2900.0,2800.0
596,2017/02/03,2790.0,2804.965,2800.0,142800,2850.0,2770.0
597,2017/02/06,2840.0,2820.0,2820.0,145700,2850.0,2790.0
598,2017/02/07,3020.0,2997.697,2850.0,621000,3090.0,2850.0
599,2017/02/08,2960.0,2984.216,3030.0,178600,3070.0,2940.0
600,2017/02/09,2910.0,2920.99,2940.0,143500,2960.0,2880.0
601,2017/02/10,3010.0,3004.821,2950.0,249100,3040.0,2950.0
602,2017/02/13,3010.0,3052.611,3100.0,353500,3130.0,2950.0
603,2017/02/14,3040.0,3049.236,3020.0,238200,3090.0,3010.0
604,2017/02/15,3020.0,3040.0,3090.0,230800,3090.0,2980.0
605,2017/02/16,3000.0,2988.027,3010.0,111000,3020.0,2960.0
606,2017/02/17,2980.0,2974.505,2980.0,91900,2990.0,2950.0
607,2017/02/20,2990.0,2980.456,2960.0,140200,3020.0,2920.0
608,2017/02/21,2980.0,2965.014,3000.0,105900,3000.0,2940.0
609,2017/02/22,3000.0,2978.885,2980.0,112100,3000.0,2960.0
610,2017/02/23,2960.0,2960.856,3000.0,132000,3010.0,2940.0
611,2017/02/24,2910.0,2907.317,2940.0,155800,2950.0,2880.0
612,2017/02/27,2900.0,2877.084,2870.0,116600,2910.0,2830.0
613,2017/02/28,2890.0,2912.718,2890.0,94200,2930.0,2890.0
614,2017/03/01,2910.0,2892.97,2910.0,101700,2920.0,2850.0
615,2017/03/02,2930.0,2931.299,2930.0,104700,2950.0,2910.0
616,2017/03/03,2920.0,2923.934,2930.0,78800,2950.0,2910.0
617,2017/03/06,2970.0,2973.06,2950.0,167000,3000.0,2930.0
618,2017/03/07,2970.0,3002.868,2970.0,178900,3040.0,2970.0
619,2017/03/08,2960.0,2970.183,2980.0,71000,3000.0,2950.0
620,2017/03/09,3000.0,3004.552,2980.0,132700,3030.0,2970.0
621,2017/03/10,3000.0,3002.403,3030.0,118600,3030.0,2980.0
622,2017/03/13,3000.0,2996.86,3000.0,153800,3030.0,2980.0
623,2017/03/14,2990.0,2985.719,2990.0,57000,3000.0,2970.0
624,2017/03/15,2940.0,2951.976,2980.0,93100,2980.0,2930.0
625,2017/03/16,3200.0,3123.189,2970.0,876900,3200.0,2960.0
626,2017/03/17,3220.0,3252.006,3300.0,812700,3330.0,3170.0
627,2017/03/21,3170.0,3197.83,3200.0,184800,3250.0,3160.0
628,2017/03/22,3070.0,3090.009,3050.0,333100,3150.0,3050.0
629,2017/03/23,3080.0,3082.6,3090.0,130400,3110.0,3060.0
630,2017/03/24,3220.0,3206.205,3100.0,356300,3260.0,3080.0
631,2017/03/27,3180.0,3184.991,3220.0,212800,3220.0,3150.0
632,2017/03/28,3200.0,3206.672,3200.0,202800,3230.0,3180.0
633,2017/03/29,3360.0,3339.954,3270.0,629200,3390.0,3250.0
634,2017/03/30,3310.0,3332.584,3340.0,273600,3360.0,3290.0
635,2017/03/31,3340.0,3415.933,3370.0,670800,3470.0,3340.0
636,2017/04/03,3290.0,3356.305,3390.0,460100,3460.0,3290.0
637,2017/04/04,3170.0,3200.394,3320.0,433700,3330.0,3110.0
638,2017/04/05,3130.0,3128.927,3170.0,235700,3200.0,3090.0
639,2017/04/06,3020.0,3057.534,3130.0,266400,3130.0,3020.0
640,2017/04/07,3010.0,3034.075,3060.0,276100,3100.0,2980.0
641,2017/04/10,2990.0,3003.328,3030.0,171900,3050.0,2970.0
642,2017/04/11,2980.0,2967.229,2990.0,210000,3010.0,2930.0
643,2017/04/12,2900.0,2892.274,2930.0,274400,2960.0,2840.0
644,2017/04/13,2890.0,2855.755,2820.0,151700,2890.0,2810.0
645,2017/04/14,2890.0,2879.655,2890.0,214400,2920.0,2840.0
646,2017/04/17,2890.0,2890.884,2870.0,106300,2940.0,2870.0
647,2017/04/18,2950.0,2954.329,2940.0,140000,2980.0,2930.0
648,2017/04/19,3060.0,3027.226,2950.0,209100,3090.0,2940.0
649,2017/04/20,3010.0,3057.551,3060.0,151500,3090.0,3010.0
650,2017/04/21,3150.0,3148.645,3130.0,281100,3180.0,3110.0
651,2017/04/24,3070.0,3112.363,3180.0,195900,3190.0,3060.0
652,2017/04/25,3110.0,3099.953,3090.0,171000,3140.0,3060.0
653,2017/04/26,3140.0,3138.093,3150.0,144700,3160.0,3100.0
654,2017/04/27,3180.0,3158.415,3110.0,128700,3190.0,3100.0
655,2017/04/28,3140.0,3157.464,3180.0,97400,3190.0,3140.0
656,2017/05/01,3030.0,3026.752,3000.0,214900,3080.0,2970.0
657,2017/05/02,2980.0,3015.69,3030.0,236400,3060.0,2980.0
658,2017/05/08,3080.0,3065.83,3050.0,137900,3090.0,3020.0
659,2017/05/09,3000.0,3027.365,3080.0,164300,3090.0,3000.0
660,2017/05/10,3100.0,3064.312,3020.0,191100,3100.0,3020.0
661,2017/05/11,3080.0,3088.074,3100.0,162500,3110.0,3060.0
662,2017/05/12,3010.0,3017.37,3070.0,205700,3080.0,2980.0
663,2017/05/15,2990.0,2979.001,2980.0,121100,3010.0,2950.0
664,2017/05/16,3000.0,3001.25,3010.0,70400,3020.0,2980.0
665,2017/05/17,2960.0,2976.439,3000.0,128900,3000.0,2960.0
666,2017/05/18,2910.0,2895.765,2880.0,153000,2930.0,2870.0
667,2017/05/19,2960.0,2930.157,2900.0,139700,2970.0,2900.0
668,2017/05/22,3040.0,3031.979,2990.0,195000,3060.0,2980.0
669,2017/05/23,3010.0,3032.72,3050.0,71700,3060.0,3010.0
670,2017/05/24,3060.0,3039.298,3040.0,74100,3060.0,3010.0
671,2017/05/25,3030.0,3047.862,3060.0,58000,3080.0,3030.0
672,2017/05/26,3000.0,3004.107,3030.0,119300,3030.0,2980.0
673,2017/05/29,3020.0,3018.789,3000.0,54500,3040.0,2990.0
674,2017/05/30,3060.0,3042.78,3020.0,118700,3070.0,2990.0
675,2017/05/31,3040.0,3052.459,3050.0,121600,3070.0,3040.0
676,2017/06/01,3090.0,3077.402,3050.0,150500,3100.0,3040.0
677,2017/06/02,3090.0,3104.795,3110.0,129500,3130.0,3080.0
678,2017/06/05,3050.0,3056.561,3080.0,126200,3100.0,3030.0
679,2017/06/06,3220.0,3200.528,3160.0,698500,3270.0,3150.0
680,2017/06/07,3300.0,3291.52,3230.0,651900,3350.0,3220.0
681,2017/06/08,3200.0,3258.009,3330.0,270700,3330.0,3200.0
682,2017/06/09,3510.0,3408.84,3210.0,1111400,3530.0,3210.0
683,2017/06/12,3790.0,3663.374,3560.0,1362900,3790.0,3490.0
684,2017/06/13,3640.0,3707.598,3740.0,579200,3820.0,3630.0
685,2017/06/14,3670.0,3660.493,3700.0,328400,3720.0,3600.0
686,2017/06/15,3600.0,3634.299,3640.0,221900,3700.0,3600.0
687,2017/06/16,3660.0,3696.566,3610.0,415800,3750.0,3610.0
688,2017/06/19,3630.0,3648.21,3680.0,245200,3730.0,3610.0
689,2017/06/20,3620.0,3640.932,3660.0,165200,3690.0,3610.0
690,2017/06/21,3560.0,3581.851,3600.0,202000,3630.0,3540.0
691,2017/06/22,3540.0,3558.803,3560.0,208000,3610.0,3520.0
692,2017/06/23,3530.0,3524.158,3550.0,122900,3560.0,3500.0
693,2017/06/26,3640.0,3605.042,3530.0,203700,3640.0,3530.0
694,2017/06/27,3640.0,3675.55,3650.0,314400,3730.0,3630.0
695,2017/06/28,3580.0,3600.125,3570.0,364200,3705.0,3560.0
696,2017/06/29,3540.0,3577.15,3610.0,136300,3655.0,3520.0
697,2017/06/30,3485.0,3472.752,3485.0,264200,3545.0,3440.0
698,2017/07/03,3350.0,3387.617,3480.0,318100,3520.0,3330.0
699,2017/07/04,3260.0,3286.286,3390.0,432400,3390.0,3255.0
700,2017/07/05,3260.0,3260.177,3295.0,234300,3295.0,3240.0
701,2017/07/06,3245.0,3243.183,3260.0,143600,3285.0,3210.0
702,2017/07/07,3250.0,3252.857,3225.0,114300,3275.0,3225.0
703,2017/07/10,3385.0,3348.012,3280.0,171500,3390.0,3280.0
704,2017/07/11,3410.0,3420.933,3415.0,174200,3445.0,3395.0
705,2017/07/12,3415.0,3427.015,3450.0,138000,3480.0,3390.0
706,2017/07/13,3490.0,3446.822,3430.0,142400,3490.0,3400.0
707,2017/07/14,3485.0,3491.069,3490.0,86500,3530.0,3465.0
708,2017/07/18,3500.0,3492.351,3485.0,90600,3520.0,3460.0
709,2017/07/19,3680.0,3613.45,3470.0,315200,3680.0,3470.0
710,2017/07/20,3790.0,3783.035,3680.0,387600,3825.0,3675.0
711,2017/07/21,3895.0,3857.633,3775.0,415500,3920.0,3740.0
712,2017/07/24,3810.0,3833.396,3905.0,133700,3905.0,3775.0
713,2017/07/25,3770.0,3780.727,3785.0,116200,3825.0,3755.0
714,2017/07/26,3705.0,3716.173,3785.0,201700,3810.0,3650.0
715,2017/07/27,3635.0,3666.424,3655.0,148200,3715.0,3630.0
716,2017/07/28,3615.0,3619.044,3635.0,111400,3660.0,3590.0
717,2017/07/31,3610.0,3612.841,3595.0,86600,3640.0,3570.0
718,2017/08/01,3605.0,3626.226,3640.0,129300,3680.0,3585.0
719,2017/08/02,3645.0,3637.046,3650.0,121200,3665.0,3610.0
720,2017/08/03,3730.0,3676.889,3660.0,188700,3735.0,3600.0
721,2017/08/04,3480.0,3505.383,3640.0,320000,3690.0,3425.0
722,2017/08/07,3985.0,3908.059,3760.0,1123800,3990.0,3760.0
723,2017/08/08,3995.0,3956.988,3955.0,699800,4010.0,3845.0
724,2017/08/09,4010.0,4052.808,4010.0,378400,4130.0,3980.0
725,2017/08/10,3980.0,3984.363,3955.0,189800,4035.0,3940.0
726,2017/08/14,3895.0,3909.915,3840.0,241200,3960.0,3840.0
727,2017/08/15,3880.0,3919.439,3935.0,168500,3995.0,3850.0
728,2017/08/16,3905.0,3926.806,3880.0,111600,3975.0,3880.0
729,2017/08/17,3925.0,3934.429,3920.0,109400,3965.0,3885.0
730,2017/08/18,4030.0,4003.163,3890.0,237600,4060.0,3885.0
731,2017/08/21,4120.0,4176.06,4020.0,403700,4250.0,4020.0
732,2017/08/22,4065.0,4072.967,4100.0,171700,4110.0,4030.0
733,2017/08/23,4085.0,4122.821,4135.0,142700,4180.0,4070.0
734,2017/08/24,4060.0,4091.917,4090.0,100400,4135.0,4050.0
735,2017/08/25,4065.0,4030.732,4045.0,146200,4095.0,3975.0
736,2017/08/28,4075.0,4073.41,4065.0,78600,4100.0,4040.0
737,2017/08/29,4095.0,4071.7,4015.0,95900,4115.0,4015.0
738,2017/08/30,4125.0,4183.573,4140.0,291500,4275.0,4105.0
739,2017/08/31,4115.0,4126.261,4195.0,149500,4195.0,4070.0
740,2017/09/01,4140.0,4127.995,4120.0,118700,4170.0,4065.0
741,2017/09/04,4040.0,4041.215,4070.0,203700,4080.0,4005.0
742,2017/09/05,3920.0,3984.112,4020.0,219700,4110.0,3910.0
743,2017/09/06,4005.0,3938.906,3850.0,129300,4010.0,3850.0
744,2017/09/07,3950.0,3950.388,4020.0,136600,4030.0,3900.0
745,2017/09/08,3930.0,3924.263,3950.0,130200,3985.0,3890.0
746,2017/09/11,4025.0,4043.154,3950.0,210700,4100.0,3950.0
747,2017/09/12,4110.0,4089.282,4065.0,207500,4135.0,4020.0
748,2017/09/13,4110.0,4191.547,4210.0,391300,4350.0,4075.0
749,2017/09/14,4045.0,4054.801,4135.0,231300,4140.0,4015.0
750,2017/09/15,4160.0,4154.727,4065.0,335400,4210.0,4050.0
751,2017/09/19,4200.0,4190.4,4200.0,290000,4270.0,4135.0
752,2017/09/20,4190.0,4188.311,4175.0,114000,4240.0,4165.0
753,2017/09/21,4105.0,4139.249,4230.0,196500,4230.0,4080.0
754,2017/09/22,3980.0,3994.898,4110.0,229300,4135.0,3950.0
755,2017/09/25,3965.0,3982.246,4000.0,102200,4065.0,3945.0
756,2017/09/26,3930.0,3917.356,3940.0,107400,3955.0,3890.0
757,2017/09/27,3990.0,3963.972,3935.0,117200,4010.0,3910.0
758,2017/09/28,4290.0,4281.626,4125.0,1074900,4430.0,4125.0
759,2017/09/29,4395.0,4356.929,4280.0,394200,4400.0,4260.0
760,2017/10/02,4475.0,4489.341,4435.0,434500,4540.0,4435.0
761,2017/10/03,4435.0,4474.959,4545.0,252900,4595.0,4420.0
762,2017/10/04,4505.0,4494.831,4425.0,271400,4560.0,4380.0
763,2017/10/05,4355.0,4404.981,4460.0,182900,4500.0,4340.0
764,2017/10/06,4400.0,4392.792,4355.0,162600,4440.0,4355.0
765,2017/10/10,4620.0,4575.538,4440.0,526000,4660.0,4420.0
766,2017/10/11,4735.0,4696.814,4600.0,406800,4765.0,4600.0
767,2017/10/12,4815.0,4844.122,4820.0,530800,4920.0,4780.0
768,2017/10/13,4885.0,4850.801,4790.0,327000,4890.0,4760.0
769,2017/10/16,4910.0,4987.407,4950.0,520200,5160.0,4880.0
770,2017/10/17,4755.0,4768.882,4865.0,541200,4865.0,4680.0
771,2017/10/18,4620.0,4646.662,4725.0,357100,4795.0,4590.0
772,2017/10/19,4650.0,4627.314,4660.0,277700,4685.0,4580.0
773,2017/10/20,4640.0,4648.105,4655.0,150100,4695.0,4610.0
774,2017/10/23,4770.0,4743.764,4710.0,193700,4790.0,4665.0
775,2017/10/24,4775.0,4749.349,4780.0,162100,4795.0,4690.0
776,2017/10/25,4790.0,4822.671,4775.0,218100,4880.0,4775.0
777,2017/10/26,4775.0,4802.468,4755.0,156600,4845.0,4725.0
778,2017/10/27,4775.0,4768.728,4815.0,149800,4825.0,4725.0
779,2017/10/30,4705.0,4646.081,4770.0,403500,4770.0,4580.0
780,2017/10/31,4945.0,4977.51,4795.0,743000,5160.0,4780.0
781,2017/11/01,4880.0,4942.348,5010.0,240600,5040.0,4875.0
782,2017/11/02,4780.0,4756.805,4875.0,395900,4885.0,4695.0
783,2017/11/06,4640.0,4684.058,4835.0,363000,4835.0,4630.0
784,2017/11/07,4665.0,4650.253,4710.0,296100,4725.0,4610.0
785,2017/11/08,4625.0,4589.508,4635.0,236800,4645.0,4525.0
786,2017/11/09,4650.0,4622.587,4625.0,313700,4685.0,4575.0
787,2017/11/10,4575.0,4576.242,4580.0,159000,4640.0,4545.0
788,2017/11/13,4575.0,4558.502,4575.0,197900,4630.0,4495.0
789,2017/11/14,4510.0,4554.323,4575.0,235700,4635.0,4500.0
790,2017/11/15,4415.0,4434.427,4500.0,336200,4505.0,4365.0
791,2017/11/16,4530.0,4468.479,4345.0,202500,4540.0,4345.0
792,2017/11/17,4600.0,4625.795,4585.0,217600,4695.0,4580.0
793,2017/11/20,4530.0,4563.732,4570.0,112400,4655.0,4515.0
794,2017/11/21,4555.0,4545.239,4600.0,121600,4610.0,4495.0
795,2017/11/22,4560.0,4547.401,4575.0,108100,4580.0,4525.0
796,2017/11/24,4435.0,4447.266,4540.0,129500,4545.0,4415.0
797,2017/11/27,4475.0,4457.143,4440.0,129500,4495.0,4415.0
798,2017/11/28,4355.0,4379.169,4450.0,123900,4465.0,4350.0
799,2017/11/29,4285.0,4299.767,4370.0,175900,4395.0,4250.0
800,2017/11/30,4385.0,4336.579,4320.0,160200,4395.0,4255.0
801,2017/12/01,4310.0,4335.016,4425.0,127200,4425.0,4290.0
802,2017/12/04,4355.0,4355.751,4315.0,109200,4405.0,4290.0
803,2017/12/05,4420.0,4372.263,4330.0,102300,4420.0,4315.0
804,2017/12/06,4285.0,4308.862,4385.0,123500,4385.0,4260.0
805,2017/12/07,4430.0,4390.33,4305.0,113700,4430.0,4305.0
806,2017/12/08,4465.0,4433.881,4420.0,80900,4465.0,4390.0
807,2017/12/11,4555.0,4515.919,4500.0,106600,4555.0,4455.0
808,2017/12/12,4430.0,4472.367,4560.0,109000,4575.0,4430.0
809,2017/12/13,4300.0,4319.768,4430.0,193800,4450.0,4285.0
810,2017/12/14,4315.0,4314.509,4290.0,96700,4360.0,4280.0
811,2017/12/15,4880.0,4823.692,4735.0,1327300,4945.0,4690.0
812,2017/12/18,4840.0,4889.683,4880.0,299900,4990.0,4820.0
813,2017/12/19,4600.0,4665.111,4820.0,431900,4830.0,4580.0
814,2017/12/20,4645.0,4586.747,4605.0,183200,4645.0,4515.0
815,2017/12/21,4730.0,4688.008,4655.0,211600,4760.0,4610.0
816,2017/12/22,4720.0,4695.208,4705.0,148900,4730.0,4650.0
817,2017/12/25,5050.0,5010.638,4950.0,736400,5120.0,4930.0
818,2017/12/26,4995.0,5111.312,5010.0,555000,5230.0,4975.0
819,2017/12/27,4925.0,4955.752,4955.0,189400,5060.0,4905.0
820,2017/12/28,5080.0,5055.488,4935.0,321600,5140.0,4905.0
821,2017/12/29,5070.0,5143.025,5180.0,290600,5250.0,5030.0
822,2018/01/04,5310.0,5250.915,5220.0,395800,5350.0,5110.0
823,2018/01/05,5310.0,5327.792,5330.0,225500,5430.0,5260.0
824,2018/01/09,5330.0,5367.75,5350.0,231600,5460.0,5290.0
825,2018/01/10,5270.0,5270.441,5440.0,360300,5450.0,5200.0
826,2018/01/11,5470.0,5419.253,5270.0,325200,5490.0,5260.0
827,2018/01/12,5480.0,5481.944,5470.0,227900,5560.0,5410.0
828,2018/01/15,5420.0,5425.433,5510.0,130500,5530.0,5380.0
829,2018/01/16,5540.0,5498.915,5490.0,153900,5560.0,5430.0
830,2018/01/17,5500.0,5530.355,5540.0,222500,5590.0,5490.0
831,2018/01/18,5240.0,5336.356,5550.0,413300,5550.0,5220.0
832,2018/01/19,5210.0,5206.244,5160.0,203400,5280.0,5160.0
833,2018/01/22,5150.0,5180.908,5200.0,150900,5250.0,5130.0
834,2018/01/23,5290.0,5227.795,5180.0,170100,5290.0,5130.0
835,2018/01/24,5200.0,5223.216,5280.0,156100,5280.0,5160.0
836,2018/01/25,5220.0,5218.789,5170.0,102400,5250.0,5160.0
837,2018/01/26,5260.0,5266.337,5290.0,120400,5320.0,5220.0
838,2018/01/29,5290.0,5306.599,5280.0,112600,5350.0,5270.0
839,2018/01/30,5320.0,5304.736,5300.0,163000,5340.0,5260.0
840,2018/01/31,5240.0,5278.92,5260.0,175900,5370.0,5220.0
841,2018/02/01,5330.0,5307.211,5270.0,133400,5350.0,5260.0
842,2018/02/02,5320.0,5319.75,5330.0,160000,5380.0,5280.0
843,2018/02/05,5040.0,5070.663,5160.0,300000,5170.0,5010.0
844,2018/02/06,4650.0,4614.906,4520.0,550500,4855.0,4520.0
845,2018/02/07,4690.0,4822.456,4950.0,200700,4970.0,4690.0
846,2018/02/08,4875.0,4838.029,4745.0,255700,4905.0,4730.0
847,2018/02/09,4690.0,4664.848,4665.0,220600,4720.0,4590.0
848,2018/02/13,5390.0,5390.0,5390.0,87600,5390.0,5390.0
849,2018/02/14,5550.0,5545.385,5490.0,1371700,5780.0,5280.0
850,2018/02/15,5390.0,5404.478,5530.0,417200,5540.0,5240.0
851,2018/02/16,5720.0,5687.418,5510.0,718400,5820.0,5380.0
852,2018/02/19,5810.0,5770.206,5820.0,354400,5870.0,5650.0
853,2018/02/20,5810.0,5884.526,5840.0,388900,5980.0,5780.0
854,2018/02/21,6370.0,6231.1,5910.0,849400,6440.0,5890.0
855,2018/02/22,6430.0,6408.456,6360.0,632100,6540.0,6230.0
856,2018/02/23,6340.0,6342.104,6430.0,320300,6470.0,6240.0
857,2018/02/26,6250.0,6254.526,6380.0,393100,6400.0,6130.0
858,2018/02/27,6230.0,6234.904,6240.0,176400,6290.0,6180.0
859,2018/02/28,6180.0,6217.322,6200.0,242300,6330.0,6140.0
860,2018/03/01,6090.0,6074.655,6200.0,362400,6220.0,5970.0
861,2018/03/02,6100.0,6077.125,5900.0,258800,6180.0,5900.0
862,2018/03/05,5740.0,5866.663,6060.0,330800,6090.0,5730.0
863,2018/03/06,5820.0,5843.45,5890.0,233600,5930.0,5790.0
864,2018/03/07,5710.0,5764.614,5770.0,204600,5860.0,5690.0
865,2018/03/08,5710.0,5697.176,5770.0,163600,5790.0,5620.0
866,2018/03/09,5670.0,5720.537,5840.0,216100,5850.0,5610.0
867,2018/03/12,5750.0,5784.066,5750.0,229700,5930.0,5640.0
868,2018/03/13,5580.0,5589.81,5670.0,215900,5690.0,5520.0
869,2018/03/14,5610.0,5614.14,5520.0,170300,5680.0,5520.0
870,2018/03/15,5750.0,5678.355,5610.0,226100,5760.0,5590.0
871,2018/03/16,5650.0,5624.394,5780.0,257200,5800.0,5530.0
872,2018/03/19,5440.0,5493.92,5580.0,204600,5590.0,5420.0
873,2018/03/20,5290.0,5303.522,5280.0,201600,5350.0,5240.0
874,2018/03/22,5310.0,5323.565,5340.0,218800,5420.0,5260.0
875,2018/03/23,5030.0,5075.218,5110.0,289200,5170.0,5010.0
876,2018/03/26,5070.0,4975.649,4970.0,180200,5070.0,4870.0
877,2018/03/27,5210.0,5148.629,5180.0,210800,5210.0,5070.0
878,2018/03/28,5120.0,5091.199,5140.0,150100,5160.0,5010.0
879,2018/03/29,5140.0,5137.332,5200.0,123700,5210.0,5070.0
880,2018/03/30,5400.0,5345.268,5210.0,270500,5440.0,5160.0
881,2018/04/02,5440.0,5480.333,5500.0,456000,5630.0,5370.0
882,2018/04/03,5460.0,5423.904,5350.0,266400,5490.0,5330.0
883,2018/04/04,4625.0,4779.91,5320.0,1206900,5340.0,4550.0
884,2018/04/05,4675.0,4711.809,4600.0,709400,4875.0,4555.0
885,2018/04/06,4665.0,4710.729,4605.0,325700,4815.0,4605.0
886,2018/04/09,4655.0,4640.275,4715.0,187600,4735.0,4565.0
887,2018/04/10,4695.0,4660.894,4630.0,217100,4740.0,4545.0
888,2018/04/11,4775.0,4760.218,4720.0,302500,4825.0,4705.0
889,2018/04/12,4650.0,4699.0,4760.0,213900,4805.0,4635.0
890,2018/04/13,4760.0,4762.022,4670.0,245600,4835.0,4670.0
891,2018/04/16,4715.0,4755.548,4805.0,248200,4875.0,4695.0
892,2018/04/17,4890.0,4811.644,4735.0,385900,4905.0,4680.0
893,2018/04/18,5070.0,4991.968,4925.0,468100,5100.0,4880.0
894,2018/04/19,5070.0,5101.621,5120.0,369000,5190.0,5010.0
895,2018/04/20,4895.0,4927.572,5000.0,457100,5030.0,4870.0
896,2018/04/23,4970.0,4953.483,4940.0,422900,5050.0,4840.0
897,2018/04/24,5120.0,5240.952,5070.0,928600,5400.0,5060.0
898,2018/04/25,4850.0,4969.335,5040.0,596300,5130.0,4845.0
899,2018/04/26,4860.0,4870.245,4865.0,384100,4970.0,4805.0
900,2018/04/27,4975.0,4944.385,4930.0,251900,4990.0,4875.0
901,2018/05/01,5490.0,5590.669,5650.0,1383300,5680.0,5380.0
902,2018/05/02,5380.0,5265.557,5470.0,900100,5480.0,5110.0
903,2018/05/07,5440.0,5357.301,5450.0,349700,5450.0,5230.0
904,2018/05/08,5600.0,5553.876,5430.0,761600,5660.0,5360.0
905,2018/05/09,5510.0,5659.692,5700.0,885600,5820.0,5500.0
906,2018/05/10,5720.0,5667.822,5540.0,428900,5740.0,5510.0
907,2018/05/11,5710.0,5698.311,5730.0,286000,5780.0,5630.0
908,2018/05/14,5690.0,5704.388,5780.0,294000,5790.0,5630.0
909,2018/05/15,5550.0,5612.065,5700.0,235300,5720.0,5540.0
910,2018/05/16,5580.0,5533.151,5500.0,176800,5600.0,5460.0
911,2018/05/17,5610.0,5613.065,5510.0,261300,5660.0,5510.0
912,2018/05/18,6060.0,5977.495,5770.0,994900,6160.0,5720.0
913,2018/05/21,6110.0,6085.33,6160.0,519500,6170.0,6010.0
914,2018/05/22,6120.0,6122.676,6170.0,315800,6200.0,6060.0
915,2018/05/23,6040.0,6056.358,6110.0,405800,6150.0,5980.0
916,2018/05/24,6010.0,6023.971,6050.0,290600,6090.0,5960.0
917,2018/05/25,6020.0,5997.761,5910.0,228700,6060.0,5910.0
918,2018/05/28,6100.0,6110.839,6040.0,281200,6200.0,6010.0
919,2018/05/29,6110.0,6109.056,6200.0,493400,6240.0,5990.0
920,2018/05/30,6240.0,6208.022,6000.0,689400,6320.0,5960.0
921,2018/05/31,6400.0,6347.979,6230.0,800600,6430.0,6210.0
922,2018/06/01,6460.0,6492.237,6370.0,596900,6580.0,6360.0
923,2018/06/04,6640.0,6694.446,6660.0,726100,6800.0,6620.0
924,2018/06/05,6650.0,6612.362,6740.0,468600,6740.0,6500.0
925,2018/06/06,6340.0,6412.08,6590.0,485600,6620.0,6250.0
926,2018/06/07,6880.0,6756.325,6440.0,1140500,6880.0,6430.0
927,2018/06/08,6850.0,6777.123,6840.0,581100,6870.0,6660.0
928,2018/06/11,6840.0,6795.258,6850.0,354700,6860.0,6720.0
929,2018/06/12,6900.0,6861.272,6840.0,411100,6930.0,6760.0
930,2018/06/13,7090.0,7006.395,6850.0,595800,7120.0,6820.0
931,2018/06/14,6980.0,6989.855,7040.0,373100,7130.0,6900.0
932,2018/06/15,6850.0,6877.325,7020.0,355900,7020.0,6780.0
933,2018/06/18,6660.0,6678.041,6800.0,407800,6840.0,6560.0
934,2018/06/19,6370.0,6502.903,6600.0,422700,6760.0,6360.0
935,2018/06/20,6350.0,6240.145,6300.0,649800,6390.0,6090.0
936,2018/06/21,6400.0,6451.151,6550.0,479400,6630.0,6340.0
937,2018/06/22,6340.0,6339.944,6300.0,341500,6440.0,6220.0
938,2018/06/25,6130.0,6213.644,6340.0,349900,6390.0,6110.0
939,2018/06/26,6210.0,6162.447,6000.0,290200,6290.0,6000.0
940,2018/06/27,6080.0,6114.298,6210.0,205000,6230.0,6050.0
941,2018/06/28,6150.0,6124.104,6080.0,200800,6180.0,6070.0
942,2018/06/29,6210.0,6166.919,6130.0,207400,6230.0,6080.0
943,2018/07/02,6150.0,6294.335,6220.0,453500,6450.0,6130.0
944,2018/07/03,6110.0,6141.758,6130.0,246300,6280.0,6050.0
945,2018/07/04,5920.0,5952.191,6080.0,267900,6090.0,5850.0
946,2018/07/05,5780.0,5839.103,5940.0,256500,5990.0,5750.0
947,2018/07/06,6040.0,5928.925,5850.0,283600,6070.0,5770.0
948,2018/07/09,6010.0,6013.417,6050.0,211300,6070.0,5940.0
949,2018/07/10,6020.0,6038.282,6110.0,214200,6110.0,5950.0
950,2018/07/11,5930.0,5945.153,5930.0,189600,6020.0,5870.0
951,2018/07/12,6010.0,5969.07,5970.0,246100,6050.0,5880.0
952,2018/07/13,6180.0,6162.832,6050.0,503900,6330.0,5980.0
953,2018/07/17,6170.0,6189.356,6240.0,416000,6280.0,6090.0
954,2018/07/18,6060.0,6113.614,6220.0,247900,6240.0,6030.0
955,2018/07/19,6140.0,6183.061,6100.0,215600,6280.0,6080.0
956,2018/07/20,6280.0,6233.346,6290.0,348800,6300.0,6160.0
957,2018/07/23,5950.0,6021.782,6180.0,410900,6180.0,5940.0
958,2018/07/24,5980.0,5931.797,6020.0,297700,6030.0,5840.0
959,2018/07/25,6210.0,6111.47,5980.0,275600,6220.0,5950.0
960,2018/07/26,6330.0,6312.708,6190.0,350800,6410.0,6170.0
961,2018/07/27,6350.0,6316.495,6350.0,161500,6360.0,6270.0
962,2018/07/30,6390.0,6375.146,6340.0,215900,6440.0,6320.0
963,2018/07/31,6420.0,6372.589,6350.0,181900,6440.0,6300.0
964,2018/08/01,6590.0,6544.851,6480.0,272500,6600.0,6460.0
965,2018/08/02,6640.0,6628.924,6570.0,355800,6710.0,6500.0
966,2018/08/03,6610.0,6606.205,6640.0,224500,6660.0,6530.0
967,2018/08/06,6500.0,6500.974,6590.0,230000,6610.0,6450.0
968,2018/08/07,6570.0,6525.973,6450.0,215800,6590.0,6450.0
969,2018/08/08,6260.0,6343.694,6500.0,411500,6520.0,6230.0
970,2018/08/09,6700.0,6479.842,6230.0,742300,6720.0,6060.0
971,2018/08/10,6740.0,6710.091,6700.0,637200,6820.0,6520.0
972,2018/08/13,6540.0,6638.19,6550.0,743100,6940.0,6400.0
973,2018/08/14,6700.0,6705.023,6660.0,471800,6800.0,6620.0
974,2018/08/15,6300.0,6453.893,6740.0,495500,6740.0,6280.0
975,2018/08/16,5770.0,5767.937,5800.0,1059900,5970.0,5630.0
976,2018/08/17,5870.0,5833.217,5820.0,384800,5920.0,5710.0
977,2018/08/20,5750.0,5799.138,5830.0,246000,5880.0,5750.0
978,2018/08/21,5900.0,5848.942,5690.0,250500,5950.0,5680.0
979,2018/08/22,6060.0,5995.695,5900.0,263900,6090.0,5890.0
980,2018/08/23,6170.0,6135.316,6120.0,251500,6200.0,6070.0
981,2018/08/24,6120.0,6120.676,6220.0,177600,6240.0,6030.0
982,2018/08/27,6410.0,6326.997,6180.0,317700,6450.0,6170.0
983,2018/08/28,6430.0,6436.593,6500.0,230700,6550.0,6340.0
984,2018/08/29,6520.0,6516.874,6410.0,206000,6580.0,6410.0
985,2018/08/30,6790.0,6776.68,6640.0,625200,6880.0,6610.0
986,2018/08/31,6850.0,6835.629,6730.0,368300,6930.0,6700.0
987,2018/09/03,6780.0,6785.712,6890.0,231100,6910.0,6680.0
988,2018/09/04,6950.0,6899.59,6780.0,331900,6980.0,6770.0
989,2018/09/05,6830.0,6877.729,6950.0,223200,7000.0,6800.0
990,2018/09/06,6830.0,6778.161,6760.0,220200,6870.0,6700.0
991,2018/09/07,6660.0,6688.838,6730.0,231400,6760.0,6630.0
992,2018/09/10,6480.0,6530.857,6560.0,228600,6640.0,6450.0
993,2018/09/11,6790.0,6777.51,6550.0,483600,6870.0,6540.0
994,2018/09/12,6750.0,6738.755,6870.0,251400,6900.0,6610.0
995,2018/09/13,6820.0,6787.637,6750.0,179000,6880.0,6690.0
996,2018/09/14,7100.0,7036.12,6880.0,596400,7180.0,6860.0
997,2018/09/18,7250.0,7211.142,7090.0,349400,7340.0,7030.0
998,2018/09/19,7220.0,7278.809,7380.0,288700,7420.0,7170.0
999,2018/09/20,7270.0,7259.961,7210.0,232400,7340.0,7170.0
1000,2018/09/21,7470.0,7463.78,7350.0,405300,7570.0,7310.0
1001,2018/09/25,7570.0,7533.883,7450.0,346400,7610.0,7360.0
1002,2018/09/26,7830.0,7834.354,7640.0,417100,7980.0,7600.0
1003,2018/09/27,7760.0,7813.951,7860.0,286500,7980.0,7680.0
1004,2018/09/28,7870.0,7944.765,7900.0,414700,8060.0,7840.0
1005,2018/10/01,8080.0,8019.287,7960.0,335300,8130.0,7860.0
1006,2018/10/02,7890.0,7980.876,8140.0,393800,8170.0,7840.0
1007,2018/10/03,7630.0,7659.028,7740.0,512100,7810.0,7520.0
1008,2018/10/04,7670.0,7750.1,7780.0,259600,7910.0,7640.0
1009,2018/10/05,7610.0,7623.671,7580.0,179800,7730.0,7520.0
1010,2018/10/09,7360.0,7388.26,7490.0,288000,7500.0,7320.0
1011,2018/10/10,7710.0,7652.281,7590.0,416900,7770.0,7530.0
1012,2018/10/11,7480.0,7397.647,7300.0,365900,7510.0,7220.0
1013,2018/10/12,7870.0,7716.823,7450.0,334300,7890.0,7450.0
1014,2018/10/15,7550.0,7657.518,7820.0,323100,7840.0,7550.0
1015,2018/10/16,7680.0,7599.188,7640.0,274700,7750.0,7460.0
1016,2018/10/17,7800.0,7848.672,7850.0,327600,7970.0,7740.0
1017,2018/10/18,7590.0,7668.522,7810.0,262500,7830.0,7570.0
1018,2018/10/19,7620.0,7542.72,7460.0,221300,7660.0,7430.0
1019,2018/10/22,7580.0,7521.97,7550.0,259400,7670.0,7340.0
1020,2018/10/23,7370.0,7384.705,7430.0,298200,7520.0,7270.0
1021,2018/10/24,6950.0,7101.734,7370.0,435900,7440.0,6950.0
1022,2018/10/25,6560.0,6639.293,6600.0,748300,6770.0,6530.0
1023,2018/10/26,6210.0,6336.839,6680.0,634300,6750.0,6140.0
1024,2018/10/29,6000.0,6110.933,6290.0,354700,6320.0,5960.0
1025,2018/10/30,6110.0,5978.491,5820.0,614800,6170.0,5730.0
1026,2018/10/31,6400.0,6298.021,6280.0,397200,6420.0,6190.0
1027,2018/11/01,6360.0,6362.047,6300.0,379500,6470.0,6270.0
1028,2018/11/02,6860.0,6695.445,6490.0,482500,6880.0,6480.0
1029,2018/11/05,6680.0,6743.295,6720.0,275600,6850.0,6670.0
1030,2018/11/06,6750.0,6815.576,6880.0,266700,6940.0,6710.0
1031,2018/11/07,7050.0,7084.059,7070.0,780800,7320.0,6820.0
1032,2018/11/08,6440.0,6698.456,7060.0,1272300,7340.0,6410.0
1033,2018/11/09,6350.0,6406.205,6530.0,592300,6560.0,6280.0
1034,2018/11/12,6290.0,6359.411,6320.0,331300,6500.0,6210.0
1035,2018/11/13,6020.0,5953.723,6040.0,478100,6080.0,5780.0
1036,2018/11/14,5830.0,5918.15,6100.0,349100,6140.0,5820.0
1037,2018/11/15,5900.0,5814.788,5730.0,561400,5950.0,5630.0
1038,2018/11/16,5500.0,5619.925,5980.0,643300,6040.0,5420.0
1039,2018/11/19,5650.0,5585.751,5470.0,404600,5660.0,5460.0
1040,2018/11/20,5490.0,5490.291,5490.0,271100,5570.0,5440.0
1041,2018/11/21,5540.0,5488.571,5350.0,270900,5570.0,5340.0
1042,2018/11/22,5330.0,5332.191,5560.0,493800,5560.0,5240.0
1043,2018/11/26,5390.0,5362.771,5330.0,224100,5420.0,5250.0
1044,2018/11/27,5330.0,5338.188,5450.0,192100,5470.0,5260.0
1045,2018/11/28,5370.0,5369.978,5360.0,181000,5430.0,5320.0
1046,2018/11/29,5360.0,5393.391,5490.0,207300,5510.0,5320.0
1047,2018/11/30,5420.0,5376.65,5410.0,274600,5430.0,5290.0
1048,2018/12/03,5670.0,5632.104,5620.0,364000,5690.0,5550.0
1049,2018/12/04,5190.0,5295.978,5630.0,770300,5630.0,5150.0
1050,2018/12/05,4920.0,4970.495,5010.0,876400,5130.0,4900.0
1051,2018/12/06,4870.0,4850.704,4890.0,485000,4975.0,4780.0
1052,2018/12/07,4940.0,4923.626,4940.0,435900,5010.0,4815.0
1053,2018/12/10,4620.0,4656.78,4765.0,501400,4805.0,4580.0
1054,2018/12/11,4555.0,4582.033,4660.0,734800,4750.0,4475.0
1055,2018/12/12,4790.0,4763.503,4625.0,440000,4855.0,4585.0
1056,2018/12/13,4805.0,4754.809,4810.0,368400,4875.0,4620.0
1057,2018/12/14,4750.0,4751.991,4785.0,282500,4830.0,4650.0
1058,2018/12/17,4645.0,4691.062,4680.0,303600,4795.0,4635.0
1059,2018/12/18,4535.0,4550.094,4500.0,299400,4655.0,4470.0
1060,2018/12/19,4575.0,4551.595,4515.0,250100,4630.0,4435.0
1061,2018/12/20,4350.0,4429.102,4540.0,336100,4590.0,4300.0
1062,2018/12/21,4100.0,4145.432,4260.0,654500,4345.0,4070.0
1063,2018/12/25,3850.0,3897.243,3820.0,439600,3990.0,3805.0
1064,2018/12/26,3955.0,3944.545,3940.0,397900,4045.0,3860.0
1065,2018/12/27,4125.0,4094.147,4165.0,378500,4185.0,4005.0
1066,2018/12/28,4025.0,4053.726,4070.0,272400,4135.0,4000.0
1067,2019/01/04,3855.0,3767.905,3815.0,339600,3875.0,3670.0
1068,2019/01/07,3965.0,4009.099,4005.0,545200,4085.0,3950.0
1069,2019/01/08,4225.0,4186.855,3970.0,879600,4335.0,3955.0
1070,2019/01/09,4360.0,4392.454,4355.0,592400,4460.0,4325.0
1071,2019/01/10,4105.0,4116.105,4265.0,587000,4270.0,4060.0
1072,2019/01/11,4110.0,4183.408,4160.0,346400,4275.0,4095.0
1073,2019/01/15,4295.0,4249.274,4105.0,341700,4320.0,4080.0
1074,2019/01/16,4140.0,4192.578,4310.0,386800,4340.0,4130.0
1075,2019/01/17,4180.0,4216.419,4215.0,338200,4315.0,4145.0
1076,2019/01/18,4385.0,4338.842,4245.0,356300,4405.0,4200.0
1077,2019/01/21,4360.0,4410.07,4510.0,426300,4545.0,4325.0
1078,2019/01/22,4220.0,4268.152,4350.0,235100,4400.0,4220.0
1079,2019/01/23,4300.0,4211.324,4150.0,284300,4310.0,4070.0
1080,2019/01/24,4335.0,4361.401,4370.0,397500,4440.0,4295.0
1081,2019/01/25,4495.0,4436.189,4295.0,487600,4515.0,4250.0
1082,2019/01/28,4410.0,4440.425,4505.0,497200,4605.0,4365.0
1083,2019/01/29,4295.0,4246.713,4350.0,522800,4350.0,4185.0
1084,2019/01/30,4190.0,4253.805,4315.0,435000,4355.0,4185.0
1085,2019/01/31,4305.0,4267.653,4250.0,387000,4315.0,4225.0
1086,2019/02/01,4325.0,4293.016,4270.0,265900,4325.0,4230.0
1087,2019/02/04,4385.0,4357.682,4340.0,219800,4390.0,4310.0
1088,2019/02/05,4315.0,4300.505,4405.0,384500,4420.0,4250.0
1089,2019/02/06,4290.0,4277.154,4325.0,229800,4330.0,4240.0
1090,2019/02/07,4190.0,4218.318,4300.0,222600,4300.0,4175.0
1091,2019/02/08,4010.0,4026.248,4105.0,448200,4110.0,3980.0
1092,2019/02/12,4710.0,4632.606,4550.0,557400,4710.0,4540.0
1093,2019/02/13,5410.0,5164.979,4850.0,2004100,5410.0,4850.0
1094,2019/02/14,5430.0,5436.075,5410.0,1285100,5580.0,5140.0
1095,2019/02/15,5150.0,5237.622,5290.0,789600,5380.0,5120.0
1096,2019/02/18,5320.0,5326.085,5400.0,696100,5440.0,5200.0
1097,2019/02/19,5260.0,5275.416,5260.0,272700,5340.0,5220.0
1098,2019/02/20,5150.0,5156.243,5290.0,475100,5300.0,5080.0
1099,2019/02/21,5240.0,5246.284,5230.0,381600,5300.0,5150.0
1100,2019/02/22,5280.0,5217.893,5180.0,258600,5310.0,5110.0
1101,2019/02/25,5310.0,5313.689,5330.0,271600,5360.0,5280.0
1102,2019/02/26,5310.0,5330.172,5380.0,400800,5430.0,5240.0
1103,2019/02/27,5500.0,5549.998,5410.0,915500,5760.0,5390.0
1104,2019/02/28,5560.0,5528.902,5460.0,508400,5650.0,5380.0
1105,2019/03/01,5610.0,5624.114,5620.0,415400,5730.0,5560.0
1106,2019/03/04,5570.0,5557.262,5630.0,357500,5680.0,5500.0
1107,2019/03/05,5410.0,5423.466,5480.0,428400,5560.0,5350.0
1108,2019/03/06,5390.0,5341.666,5360.0,283900,5410.0,5280.0
1109,2019/03/07,5240.0,5270.79,5320.0,251900,5340.0,5230.0
1110,2019/03/08,5120.0,5127.389,5120.0,500900,5190.0,5080.0
1111,2019/03/11,5050.0,5017.548,5100.0,439000,5130.0,4885.0
1112,2019/03/12,5070.0,5116.278,5200.0,242900,5220.0,5040.0
1113,2019/03/13,5020.0,5014.319,5000.0,208400,5080.0,4960.0
1114,2019/03/14,4940.0,5035.131,5090.0,301100,5170.0,4940.0
1115,2019/03/15,5010.0,4996.547,4910.0,200700,5060.0,4910.0
1116,2019/03/18,5100.0,5082.855,5100.0,162900,5130.0,5040.0
1117,2019/03/19,4870.0,4909.417,5020.0,670200,5070.0,4865.0
1118,2019/03/20,5010.0,4970.707,4880.0,354900,5020.0,4880.0
1119,2019/03/22,4940.0,4964.001,5010.0,223300,5070.0,4910.0
1120,2019/03/25,4765.0,4761.9,4730.0,272100,4815.0,4705.0
1121,2019/03/26,4845.0,4834.411,4825.0,238700,4880.0,4765.0
1122,2019/03/27,4910.0,4874.358,4870.0,229900,4935.0,4815.0
1123,2019/03/28,4820.0,4833.748,4840.0,257100,4875.0,4800.0
1124,2019/03/29,4910.0,4865.724,4855.0,171900,4910.0,4805.0
1125,2019/04/01,5000.0,5005.772,4960.0,204700,5050.0,4960.0
1126,2019/04/02,4995.0,5052.7,5080.0,242200,5140.0,4995.0
1127,2019/04/03,5180.0,5108.791,4965.0,361800,5220.0,4955.0
1128,2019/04/04,5310.0,5314.118,5250.0,412600,5390.0,5200.0
1129,2019/04/05,5320.0,5312.971,5320.0,223500,5370.0,5250.0
1130,2019/04/08,5210.0,5294.813,5380.0,290900,5430.0,5200.0
1131,2019/04/09,5260.0,5246.262,5230.0,192900,5310.0,5200.0
1132,2019/04/10,5270.0,5235.122,5160.0,225500,5290.0,5120.0
1133,2019/04/11,5220.0,5248.597,5270.0,158900,5290.0,5220.0
1134,2019/04/12,5190.0,5197.878,5230.0,132400,5240.0,5160.0
1135,2019/04/15,5310.0,5298.044,5230.0,252100,5350.0,5220.0
1136,2019/04/16,5290.0,5329.251,5350.0,209700,5380.0,5280.0
1137,2019/04/17,5410.0,5373.786,5310.0,301900,5420.0,5290.0
1138,2019/04/18,5260.0,5395.417,5460.0,342100,5520.0,5250.0
1139,2019/04/19,5390.0,5361.582,5360.0,166300,5410.0,5310.0
1140,2019/04/22,5290.0,5323.585,5370.0,156200,5390.0,5290.0
1141,2019/04/23,5040.0,5038.98,5200.0,516600,5200.0,4965.0
1142,2019/04/24,4910.0,4992.154,5120.0,388600,5160.0,4910.0
1143,2019/04/25,4935.0,4957.253,4910.0,278100,5020.0,4895.0
1144,2019/04/26,4880.0,4836.9,4875.0,297600,4895.0,4775.0
1145,2019/05/07,4735.0,4836.737,4900.0,319600,4950.0,4735.0
1146,2019/05/08,4740.0,4694.222,4620.0,320100,4770.0,4605.0
1147,2019/05/09,4545.0,4587.987,4690.0,335100,4695.0,4530.0
1148,2019/05/10,4235.0,4221.541,4200.0,1027600,4370.0,4105.0
1149,2019/05/13,4025.0,4200.609,4300.0,900900,4465.0,4020.0
1150,2019/05/14,4165.0,4062.111,3940.0,435200,4175.0,3915.0
1151,2019/05/15,4215.0,4209.805,4235.0,348100,4260.0,4165.0
1152,2019/05/16,4175.0,4183.831,4200.0,307100,4240.0,4145.0
1153,2019/05/17,4205.0,4211.654,4230.0,153300,4255.0,4170.0
1154,2019/05/20,4105.0,4119.326,4195.0,292100,4230.0,4085.0
1155,2019/05/21,4120.0,4077.213,4085.0,247900,4145.0,4000.0
1156,2019/05/22,4125.0,4138.816,4165.0,190100,4190.0,4100.0
1157,2019/05/23,4035.0,4049.093,4085.0,198400,4125.0,4020.0
1158,2019/05/24,4010.0,4002.235,3955.0,273800,4090.0,3945.0
1159,2019/05/27,4025.0,4047.444,4040.0,205000,4110.0,4000.0
1160,2019/05/28,4115.0,4055.618,4000.0,304200,4120.0,3960.0
1161,2019/05/29,3995.0,3988.756,4025.0,274900,4035.0,3950.0
1162,2019/05/30,4025.0,3997.917,4000.0,204300,4025.0,3955.0
1163,2019/05/31,3960.0,3973.255,3980.0,214900,4000.0,3945.0
1164,2019/06/03,3905.0,3888.926,3940.0,248700,3940.0,3855.0
1165,2019/06/04,4055.0,4021.818,3995.0,390100,4065.0,3955.0
1166,2019/06/05,4060.0,4047.682,4125.0,449000,4135.0,3990.0
1167,2019/06/06,3990.0,4000.083,4015.0,216500,4045.0,3985.0
1168,2019/06/07,4070.0,4060.127,4030.0,233200,4090.0,4015.0
1169,2019/06/10,4240.0,4192.567,4150.0,212700,4240.0,4145.0
1170,2019/06/11,4375.0,4323.867,4240.0,377800,4395.0,4195.0
1171,2019/06/12,4295.0,4331.478,4370.0,255400,4410.0,4280.0
1172,2019/06/13,4190.0,4198.724,4235.0,297300,4280.0,4150.0
1173,2019/06/14,4225.0,4193.692,4180.0,171300,4225.0,4145.0
1174,2019/06/17,4200.0,4167.116,4215.0,178900,4235.0,4135.0
1175,2019/06/18,4150.0,4164.725,4190.0,196300,4210.0,4120.0
1176,2019/06/19,4260.0,4238.21,4230.0,227600,4260.0,4200.0
1177,2019/06/20,4225.0,4218.943,4215.0,247400,4260.0,4175.0
1178,2019/06/21,4200.0,4193.476,4225.0,219200,4225.0,4170.0
1179,2019/06/24,4210.0,4206.249,4200.0,150900,4230.0,4175.0
1180,2019/06/25,4235.0,4236.607,4230.0,194800,4280.0,4205.0
1181,2019/06/26,4125.0,4141.27,4120.0,150400,4190.0,4090.0
1182,2019/06/27,4195.0,4195.826,4155.0,156800,4250.0,4145.0
1183,2019/06/28,4130.0,4141.472,4170.0,162700,4195.0,4120.0
1184,2019/07/01,4255.0,4234.18,4245.0,225000,4255.0,4205.0
1185,2019/07/02,4185.0,4175.913,4185.0,241000,4215.0,4155.0
1186,2019/07/03,4160.0,4148.334,4160.0,166900,4170.0,4130.0
1187,2019/07/04,4215.0,4197.547,4215.0,180600,4215.0,4175.0
1188,2019/07/05,4225.0,4214.841,4210.0,78800,4240.0,4195.0
1189,2019/07/08,4175.0,4202.942,4235.0,100100,4235.0,4170.0
1190,2019/07/09,4150.0,4151.868,4165.0,88600,4170.0,4140.0
1191,2019/07/10,4110.0,4112.317,4135.0,108100,4135.0,4100.0
1192,2019/07/11,4165.0,4143.072,4100.0,65600,4175.0,4085.0
1193,2019/07/12,4140.0,4149.456,4180.0,83600,4190.0,4130.0
1194,2019/07/16,4150.0,4160.854,4165.0,114800,4200.0,4135.0
1195,2019/07/17,4155.0,4146.837,4130.0,73500,4170.0,4115.0
1196,2019/07/18,4070.0,4089.705,4115.0,118700,4130.0,4065.0
1197,2019/07/19,4115.0,4117.691,4075.0,89200,4150.0,4075.0
1198,2019/07/22,4110.0,4127.208,4105.0,66800,4165.0,4105.0
1199,2019/07/23,4185.0,4150.393,4080.0,98000,4185.0,4075.0
1200,2019/07/24,4205.0,4208.624,4195.0,143500,4240.0,4190.0
1201,2019/07/25,4270.0,4262.675,4225.0,199800,4295.0,4220.0
1202,2019/07/26,4260.0,4252.876,4270.0,97000,4295.0,4215.0
1203,2019/07/29,4275.0,4270.563,4280.0,88800,4290.0,4230.0
1204,2019/07/30,4270.0,4296.054,4290.0,165100,4340.0,4260.0
1205,2019/07/31,4220.0,4224.299,4225.0,150500,4280.0,4205.0
1206,2019/08/01,4170.0,4166.762,4190.0,125400,4210.0,4110.0
1207,2019/08/02,4000.0,4019.021,4080.0,252900,4080.0,3980.0
1208,2019/08/05,3830.0,3843.201,3960.0,262300,3970.0,3765.0
1209,2019/08/06,3775.0,3708.685,3600.0,252100,3800.0,3600.0
1210,2019/08/07,3885.0,3844.46,3825.0,344400,3920.0,3770.0
1211,2019/08/08,3925.0,3880.114,3880.0,250700,3945.0,3805.0
1212,2019/08/09,3935.0,3911.894,3960.0,218800,3970.0,3845.0
1213,2019/08/13,3720.0,3707.23,3770.0,345300,3815.0,3640.0
1214,2019/08/14,3650.0,3682.857,3770.0,256900,3795.0,3635.0
1215,2019/08/15,3550.0,3523.888,3540.0,251700,3560.0,3465.0
1216,2019/08/16,3495.0,3498.253,3530.0,228900,3530.0,3475.0
1217,2019/08/19,3530.0,3543.174,3560.0,164000,3575.0,3515.0
1218,2019/08/20,3550.0,3538.459,3540.0,100900,3560.0,3520.0
1219,2019/08/21,3500.0,3517.392,3515.0,92600,3550.0,3500.0
1220,2019/08/22,3550.0,3558.92,3540.0,117100,3595.0,3540.0
1221,2019/08/23,3555.0,3566.8,3570.0,87500,3585.0,3550.0
