ds,yhat
2019-07-16,1894.9741729787595
2019-07-17,1899.7868212478477
2019-07-18,1901.8724251048206
2019-07-19,1903.179608511607
2019-07-22,1915.2611698439414
2019-07-23,1919.3671725985748
2019-07-24,1923.5598287975774
2019-07-25,1930.014206280465
2019-07-26,1940.109680614805
2019-07-29,1977.7858026505862
2019-07-30,1988.472263025133
2019-07-31,1999.773717797774
2019-08-01,2012.183624922402
2019-08-02,2023.728350363449
2019-08-05,2032.6750572029143
2019-08-06,2033.059988744799
2019-08-07,2037.6442980149898
2019-08-08,2045.4194893972485
2019-08-09,2052.2555010210563
