ds,yhat
2019-08-22,2230.891208451129
2019-08-23,2253.6171413121087
2019-08-26,2255.5286682499136
2019-08-27,2253.926347041205
2019-08-28,2254.1852326558355
2019-08-29,2255.680758087983
2019-08-30,2261.7034877662327
2019-09-02,2301.8223324483
2019-09-03,2287.150970655738
2019-09-04,2249.335815509785
2019-09-05,2205.882511601021
2019-09-06,2180.5369963523885
2019-09-09,2210.572856569129
2019-09-10,2186.8765805036787
2019-09-11,2137.2657219725843
2019-09-12,2088.2954348100675
2019-09-13,2066.3654298331944
2019-09-17,2092.2586447202807
2019-09-18,2061.3536759566005
2019-09-19,2038.6612432511238
2019-09-20,2039.0463517212047
