,Date,Close,VWAP,Open,Volume,High,Low
0,2014/08/25,2358.0,2357.08,2335.0,313200,2373.0,2325.0
1,2014/08/26,2323.0,2331.26,2360.0,244100,2360.0,2321.0
2,2014/08/27,2326.0,2328.765,2330.0,293800,2364.0,2316.0
3,2014/08/28,2293.0,2293.87,2312.0,262600,2313.0,2284.0
4,2014/08/29,2283.0,2282.669,2281.0,203300,2297.0,2269.0
5,2014/09/01,2268.0,2265.044,2282.0,184700,2287.0,2253.0
6,2014/09/02,2299.0,2293.773,2290.0,230000,2308.0,2276.0
7,2014/09/03,2292.0,2297.804,2310.0,321900,2333.0,2277.0
8,2014/09/04,2405.0,2403.831,2319.0,1123800,2452.0,2302.0
9,2014/09/05,2371.0,2384.611,2405.0,572500,2420.0,2357.0
10,2014/09/08,2422.0,2415.099,2399.0,380900,2429.0,2392.0
11,2014/09/09,2433.0,2424.26,2430.0,288000,2437.0,2406.0
12,2014/09/10,2440.0,2431.89,2440.0,345700,2450.0,2414.0
13,2014/09/11,2403.0,2426.308,2459.0,662700,2478.0,2395.0
14,2014/09/12,2342.0,2360.911,2390.0,690100,2391.0,2336.0
15,2014/09/16,2355.0,2352.182,2350.0,527700,2367.0,2342.0
16,2014/09/17,2343.0,2346.666,2355.0,263000,2361.0,2339.0
17,2014/09/18,2355.0,2356.872,2360.0,462900,2372.0,2342.0
18,2014/09/19,2410.0,2397.021,2370.0,426600,2414.0,2347.0
19,2014/09/22,2427.0,2412.961,2408.0,367500,2427.0,2384.0
20,2014/09/24,2381.0,2389.182,2401.0,339600,2415.0,2373.0
21,2014/09/25,2407.0,2400.285,2401.0,456200,2407.0,2384.0
22,2014/09/26,2416.0,2411.678,2390.0,349700,2428.0,2389.0
23,2014/09/29,2469.0,2467.444,2433.0,466500,2488.0,2433.0
24,2014/09/30,2449.0,2447.008,2454.0,326700,2478.0,2418.0
25,2014/10/01,2434.0,2451.595,2447.0,249100,2469.0,2433.0
26,2014/10/02,2382.0,2397.944,2403.0,483900,2418.0,2374.0
27,2014/10/03,2438.0,2423.847,2382.0,370300,2443.0,2382.0
28,2014/10/06,2443.0,2442.091,2459.0,402800,2462.0,2426.0
29,2014/10/07,2442.0,2464.75,2447.0,296100,2487.0,2434.0
30,2014/10/08,2467.0,2439.366,2428.0,451500,2469.0,2395.0
31,2014/10/09,2476.0,2484.364,2470.0,461800,2499.0,2455.0
32,2014/10/10,2381.0,2373.258,2429.0,697400,2444.0,2341.0
33,2014/10/14,2329.0,2324.262,2331.0,449200,2335.0,2302.0
34,2014/10/15,2362.0,2352.578,2331.0,296500,2367.0,2324.0
35,2014/10/16,2408.0,2398.441,2360.0,754100,2438.0,2340.0
36,2014/10/17,2359.0,2403.811,2423.0,719700,2485.0,2352.0
37,2014/10/20,2436.0,2411.993,2405.0,567800,2445.0,2346.0
38,2014/10/21,2372.0,2401.266,2424.0,486800,2459.0,2367.0
39,2014/10/22,2451.0,2437.501,2403.0,292900,2457.0,2399.0
40,2014/10/23,2481.0,2467.09,2428.0,339700,2492.0,2417.0
41,2014/10/24,2495.0,2495.565,2495.0,374900,2509.0,2471.0
42,2014/10/27,2533.0,2531.015,2515.0,345800,2546.0,2509.0
43,2014/10/28,2546.0,2542.2,2535.0,278500,2552.0,2525.0
44,2014/10/29,2558.0,2555.548,2552.0,239000,2569.0,2533.0
45,2014/10/30,2584.0,2574.573,2556.0,546300,2584.0,2552.0
46,2014/10/31,2660.0,2618.795,2593.0,628400,2667.0,2561.0
47,2014/11/04,2699.0,2715.29,2756.0,573800,2765.0,2687.0
48,2014/11/05,2644.0,2638.134,2690.0,622200,2718.0,2548.0
49,2014/11/06,2577.0,2602.415,2660.0,335500,2679.0,2570.0
50,2014/11/07,2569.0,2571.738,2580.0,287600,2591.0,2557.0
51,2014/11/10,2579.0,2567.17,2558.0,224800,2586.0,2543.0
52,2014/11/11,2594.0,2582.412,2579.0,242700,2619.0,2554.0
53,2014/11/12,2552.0,2547.547,2565.0,663700,2575.0,2501.0
54,2014/11/13,2572.0,2567.587,2522.0,317800,2586.0,2522.0
55,2014/11/14,2490.0,2494.956,2534.0,1479500,2547.0,2476.0
56,2014/11/17,2328.0,2366.429,2461.0,1510600,2465.0,2315.0
57,2014/11/18,2437.0,2417.338,2369.0,735200,2440.0,2368.0
58,2014/11/19,2434.0,2442.901,2435.0,367700,2471.0,2427.0
59,2014/11/20,2401.0,2406.519,2442.0,292000,2445.0,2394.0
60,2014/11/21,2375.0,2383.364,2386.0,456000,2417.0,2370.0
61,2014/11/25,2341.0,2348.548,2370.0,436400,2383.0,2338.0
62,2014/11/26,2355.0,2360.099,2334.0,315800,2375.0,2334.0
63,2014/11/27,2356.0,2363.324,2371.0,349500,2389.0,2351.0
64,2014/11/28,2437.0,2426.813,2387.0,566500,2445.0,2383.0
65,2014/12/01,2462.0,2474.123,2469.0,435700,2495.0,2455.0
66,2014/12/02,2440.0,2435.649,2435.0,388300,2450.0,2427.0
67,2014/12/03,2454.0,2454.512,2450.0,623900,2479.0,2429.0
68,2014/12/04,2534.0,2511.853,2490.0,906100,2537.0,2474.0
69,2014/12/05,2529.0,2529.135,2530.0,357600,2540.0,2515.0
70,2014/12/08,2613.0,2612.455,2570.0,1067600,2674.0,2569.0
71,2014/12/09,2581.0,2587.602,2584.0,474600,2607.0,2575.0
72,2014/12/10,2548.0,2551.838,2574.0,443000,2577.0,2531.0
73,2014/12/11,2579.0,2569.069,2547.0,606300,2595.0,2533.0
74,2014/12/12,2624.0,2623.727,2602.0,661400,2650.0,2599.0
75,2014/12/15,2620.0,2628.306,2621.0,589700,2657.0,2611.0
76,2014/12/16,2595.0,2607.062,2610.0,459800,2639.0,2586.0
77,2014/12/17,2565.0,2580.517,2564.0,532400,2615.0,2551.0
78,2014/12/18,2585.0,2595.776,2625.0,615400,2625.0,2582.0
79,2014/12/19,2652.0,2644.48,2625.0,884100,2680.0,2603.0
80,2014/12/22,2648.0,2635.979,2660.0,333000,2661.0,2620.0
81,2014/12/24,2683.0,2683.542,2660.0,345700,2696.0,2653.0
82,2014/12/25,2682.0,2680.012,2684.0,148700,2696.0,2669.0
83,2014/12/26,2688.0,2683.478,2678.0,160400,2694.0,2666.0
84,2014/12/29,2682.0,2681.47,2695.0,309500,2705.0,2651.0
85,2014/12/30,2651.0,2660.355,2699.0,175700,2699.0,2645.0
86,2015/01/05,2660.0,2659.581,2639.0,314800,2681.0,2620.0
87,2015/01/06,2634.0,2641.887,2630.0,395600,2675.0,2626.0
88,2015/01/07,2611.0,2613.939,2611.0,371000,2640.0,2596.0
89,2015/01/08,2711.0,2699.071,2640.0,540300,2724.0,2629.0
90,2015/01/09,2735.0,2745.005,2735.0,551900,2780.0,2726.0
91,2015/01/13,2794.0,2774.276,2747.0,697300,2804.0,2735.0
92,2015/01/14,2751.0,2765.447,2800.0,373300,2828.0,2735.0
93,2015/01/15,2759.0,2770.442,2764.0,420400,2795.0,2748.0
94,2015/01/16,2719.0,2716.278,2740.0,463400,2750.0,2685.0
95,2015/01/19,2733.0,2736.27,2735.0,127600,2767.0,2719.0
96,2015/01/20,2762.0,2740.118,2750.0,245000,2763.0,2715.0
97,2015/01/21,2766.0,2755.011,2770.0,404500,2794.0,2731.0
98,2015/01/22,2799.0,2779.878,2777.0,446400,2807.0,2741.0
99,2015/01/23,2818.0,2814.383,2820.0,405800,2850.0,2788.0
100,2015/01/26,2764.0,2765.099,2787.0,332200,2792.0,2756.0
101,2015/01/27,2797.0,2793.415,2788.0,462700,2821.0,2773.0
102,2015/01/28,2851.0,2841.845,2809.0,392600,2864.0,2803.0
103,2015/01/29,2824.0,2839.447,2850.0,177900,2859.0,2820.0
104,2015/01/30,2835.0,2853.471,2874.0,285800,2880.0,2835.0
105,2015/02/02,2821.0,2818.02,2861.0,314500,2867.0,2802.0
106,2015/02/03,2765.0,2776.666,2821.0,364600,2821.0,2747.0
107,2015/02/04,2770.0,2783.616,2815.0,363300,2830.0,2757.0
108,2015/02/05,2737.0,2740.02,2750.0,378900,2756.0,2713.0
109,2015/02/06,2718.0,2723.183,2750.0,351600,2761.0,2713.0
110,2015/02/09,2691.0,2688.142,2700.0,359100,2704.0,2670.0
111,2015/02/10,2693.0,2677.741,2671.0,246000,2695.0,2656.0
112,2015/02/12,2701.0,2717.318,2726.0,447100,2756.0,2688.0
113,2015/02/13,2661.0,2668.226,2700.0,513700,2703.0,2641.0
114,2015/02/16,2672.0,2692.368,2725.0,397400,2728.0,2662.0
115,2015/02/17,2696.0,2690.865,2697.0,323800,2705.0,2655.0
116,2015/02/18,2710.0,2725.997,2727.0,462200,2772.0,2698.0
117,2015/02/19,2890.0,2832.87,2750.0,973100,2896.0,2745.0
118,2015/02/20,2834.0,2838.371,2880.0,502900,2887.0,2808.0
119,2015/02/23,2822.0,2821.086,2821.0,638800,2858.0,2794.0
120,2015/02/24,2828.0,2820.79,2800.0,333500,2834.0,2788.0
121,2015/02/25,2800.0,2814.191,2840.0,485300,2864.0,2785.0
122,2015/02/26,2816.0,2815.113,2810.0,263100,2829.0,2795.0
123,2015/02/27,2888.0,2889.179,2823.0,750500,2917.0,2823.0
124,2015/03/02,2898.0,2919.357,2938.0,492700,2958.0,2892.0
125,2015/03/03,2957.0,2959.494,2929.0,632400,2985.0,2929.0
126,2015/03/04,2944.0,2949.197,2975.0,360300,2975.0,2914.0
127,2015/03/05,2938.0,2927.941,2919.0,261300,2944.0,2902.0
128,2015/03/06,2992.0,2975.362,2949.0,597900,2998.0,2940.0
129,2015/03/09,2987.0,3000.046,2990.0,375600,3020.0,2966.0
130,2015/03/10,2982.0,2991.027,3005.0,561200,3040.0,2967.0
131,2015/03/11,2971.0,2968.778,2976.0,369900,2990.0,2951.0
132,2015/03/12,3005.0,2999.569,2992.0,300300,3010.0,2974.0
133,2015/03/13,2996.0,3007.334,3015.0,461800,3020.0,2985.0
134,2015/03/16,3015.0,3011.393,3005.0,345400,3025.0,2998.0
135,2015/03/17,3090.0,3056.305,3020.0,701700,3100.0,2998.0
136,2015/03/18,3100.0,3107.738,3115.0,364700,3145.0,3070.0
137,2015/03/19,3180.0,3143.13,3115.0,512600,3185.0,3095.0
138,2015/03/20,3365.0,3319.91,3200.0,1058900,3375.0,3170.0
139,2015/03/23,3255.0,3269.293,3325.0,503600,3325.0,3235.0
140,2015/03/24,3245.0,3238.26,3275.0,411500,3280.0,3210.0
141,2015/03/25,3225.0,3206.037,3245.0,450400,3245.0,3160.0
142,2015/03/26,3220.0,3233.077,3280.0,804600,3280.0,3185.0
143,2015/03/27,3150.0,3136.701,3100.0,560700,3190.0,3085.0
144,2015/03/30,3150.0,3148.171,3125.0,262700,3185.0,3115.0
145,2015/03/31,3130.0,3164.484,3170.0,441000,3205.0,3125.0
146,2015/04/01,3175.0,3165.507,3135.0,597800,3220.0,3110.0
147,2015/04/02,3210.0,3218.412,3200.0,377100,3245.0,3175.0
148,2015/04/03,3300.0,3281.759,3240.0,424700,3300.0,3205.0
149,2015/04/06,3355.0,3358.144,3305.0,491200,3390.0,3280.0
150,2015/04/07,3340.0,3365.001,3400.0,497200,3440.0,3320.0
151,2015/04/08,3390.0,3380.083,3380.0,407500,3405.0,3340.0
152,2015/04/09,3400.0,3372.757,3390.0,435200,3405.0,3320.0
153,2015/04/10,3405.0,3403.803,3410.0,312400,3415.0,3375.0
154,2015/04/13,3340.0,3349.673,3410.0,438200,3410.0,3300.0
155,2015/04/14,3320.0,3340.004,3340.0,344000,3380.0,3305.0
156,2015/04/15,3340.0,3325.446,3305.0,626500,3355.0,3270.0
157,2015/04/16,3245.0,3255.83,3345.0,622200,3365.0,3210.0
158,2015/04/17,3140.0,3146.774,3210.0,1010800,3230.0,3105.0
159,2015/04/20,3165.0,3171.491,3135.0,486700,3205.0,3100.0
160,2015/04/21,3215.0,3187.215,3170.0,434100,3220.0,3105.0
161,2015/04/22,3240.0,3224.263,3215.0,393400,3245.0,3180.0
162,2015/04/23,3140.0,3167.042,3250.0,415000,3260.0,3115.0
163,2015/04/24,3155.0,3146.134,3140.0,218700,3160.0,3130.0
164,2015/04/27,3175.0,3175.806,3180.0,176800,3190.0,3165.0
165,2015/04/28,3170.0,3165.572,3160.0,289400,3180.0,3125.0
166,2015/04/30,3130.0,3129.779,3170.0,515700,3170.0,3110.0
167,2015/05/01,3100.0,3078.594,3105.0,300200,3110.0,3055.0
168,2015/05/07,3000.0,3001.207,3030.0,672000,3050.0,2981.0
169,2015/05/08,3010.0,2998.707,2979.0,500300,3025.0,2960.0
170,2015/05/11,3030.0,3033.802,3025.0,397700,3070.0,2984.0
171,2015/05/12,3020.0,3027.081,3030.0,241000,3055.0,3010.0
172,2015/05/13,2955.0,2950.676,2955.0,772600,2997.0,2903.0
173,2015/05/14,2801.0,2835.258,2963.0,1127500,2985.0,2791.0
174,2015/05/15,2965.0,2940.396,2850.0,907300,2975.0,2848.0
175,2015/05/18,2977.0,2981.072,2975.0,369600,3015.0,2955.0
176,2015/05/19,2966.0,2979.249,2977.0,394500,3005.0,2956.0
177,2015/05/20,3005.0,3009.246,2999.0,393000,3045.0,2985.0
178,2015/05/21,2960.0,2977.869,2993.0,371500,3010.0,2953.0
179,2015/05/22,3105.0,3084.598,3045.0,745400,3135.0,3025.0
180,2015/05/25,3115.0,3106.961,3115.0,397000,3130.0,3070.0
181,2015/05/26,3135.0,3160.274,3130.0,441500,3200.0,3130.0
182,2015/05/27,3185.0,3180.344,3115.0,434900,3195.0,3115.0
183,2015/05/28,3180.0,3167.971,3190.0,420300,3195.0,3110.0
184,2015/05/29,3145.0,3151.278,3150.0,381400,3175.0,3135.0
185,2015/06/01,3125.0,3111.986,3105.0,396300,3140.0,3090.0
186,2015/06/02,3100.0,3096.91,3120.0,335100,3130.0,3075.0
187,2015/06/03,3040.0,3052.308,3070.0,379800,3090.0,3035.0
188,2015/06/04,3005.0,3011.32,3035.0,368800,3050.0,2998.0
189,2015/06/05,3010.0,3004.005,2996.0,290000,3020.0,2976.0
190,2015/06/08,2977.0,2989.319,3020.0,394600,3025.0,2970.0
191,2015/06/09,2911.0,2923.338,2970.0,598300,2970.0,2898.0
192,2015/06/10,3015.0,2997.774,2942.0,822600,3045.0,2942.0
193,2015/06/11,3030.0,3027.79,3015.0,307000,3045.0,3015.0
194,2015/06/12,3070.0,3072.528,3080.0,529000,3090.0,3045.0
195,2015/06/15,3085.0,3080.731,3100.0,338800,3130.0,3040.0
196,2015/06/16,3080.0,3081.33,3095.0,365800,3095.0,3055.0
197,2015/06/17,3070.0,3081.689,3100.0,507700,3125.0,3040.0
198,2015/06/18,3120.0,3115.77,3110.0,633500,3150.0,3070.0
199,2015/06/19,3160.0,3159.351,3160.0,492900,3190.0,3130.0
200,2015/06/22,3165.0,3158.385,3175.0,304700,3185.0,3130.0
201,2015/06/23,3135.0,3137.069,3175.0,286100,3175.0,3120.0
202,2015/06/24,3065.0,3075.062,3145.0,601900,3145.0,3050.0
203,2015/06/25,3045.0,3054.292,3065.0,288800,3080.0,3035.0
204,2015/06/26,3005.0,3012.375,3035.0,287200,3050.0,2998.0
205,2015/06/29,2955.0,2958.914,2923.0,362200,2987.0,2913.0
206,2015/06/30,2978.0,2969.107,2945.0,348500,2987.0,2941.0
207,2015/07/01,3050.0,3023.695,2996.0,309500,3055.0,2971.0
208,2015/07/02,3130.0,3115.565,3085.0,659200,3140.0,3060.0
209,2015/07/03,3090.0,3087.834,3125.0,366600,3130.0,3065.0
210,2015/07/06,3060.0,3060.533,3035.0,441900,3095.0,3020.0
211,2015/07/07,3105.0,3100.483,3105.0,244400,3120.0,3075.0
212,2015/07/08,3095.0,3105.776,3120.0,653200,3130.0,3065.0
213,2015/07/09,3085.0,3051.363,3015.0,706700,3115.0,2994.0
214,2015/07/10,3035.0,3068.82,3100.0,544800,3120.0,3020.0
215,2015/07/13,3020.0,3022.599,3035.0,365200,3045.0,3000.0
216,2015/07/14,3065.0,3065.122,3060.0,320800,3080.0,3035.0
217,2015/07/15,3155.0,3134.676,3095.0,480100,3160.0,3080.0
218,2015/07/16,3165.0,3157.994,3160.0,242500,3170.0,3140.0
219,2015/07/17,3210.0,3198.917,3180.0,418100,3220.0,3165.0
220,2015/07/21,3235.0,3237.668,3245.0,312200,3250.0,3220.0
221,2015/07/22,3205.0,3205.463,3220.0,236500,3230.0,3185.0
222,2015/07/23,3220.0,3204.961,3200.0,244800,3230.0,3175.0
223,2015/07/24,3200.0,3205.671,3205.0,127400,3225.0,3190.0
224,2015/07/27,3145.0,3155.226,3190.0,258400,3190.0,3135.0
225,2015/07/28,3120.0,3101.485,3100.0,335100,3145.0,3065.0
226,2015/07/29,3130.0,3113.345,3115.0,171900,3140.0,3080.0
227,2015/07/30,3120.0,3127.301,3125.0,285700,3165.0,3100.0
228,2015/07/31,3065.0,3098.211,3140.0,318300,3140.0,3065.0
229,2015/08/03,3060.0,3053.344,3080.0,430300,3090.0,3025.0
230,2015/08/04,3170.0,3138.09,3100.0,349200,3175.0,3095.0
231,2015/08/05,3180.0,3161.143,3145.0,366100,3185.0,3125.0
232,2015/08/06,3160.0,3159.467,3130.0,454000,3195.0,3105.0
233,2015/08/07,3505.0,3488.341,3440.0,2494300,3600.0,3330.0
234,2015/08/10,3765.0,3684.455,3550.0,1392800,3800.0,3525.0
235,2015/08/11,3635.0,3624.452,3645.0,967700,3660.0,3570.0
236,2015/08/12,3715.0,3690.264,3645.0,649700,3730.0,3635.0
237,2015/08/13,3725.0,3724.558,3705.0,597000,3760.0,3700.0
238,2015/08/14,3605.0,3621.187,3645.0,714600,3675.0,3590.0
239,2015/08/17,3625.0,3606.948,3560.0,585400,3635.0,3545.0
240,2015/08/18,3565.0,3586.66,3605.0,386100,3655.0,3560.0
241,2015/08/19,3450.0,3480.155,3520.0,494500,3570.0,3450.0
242,2015/08/20,3410.0,3462.891,3500.0,680400,3555.0,3405.0
243,2015/08/21,3290.0,3313.358,3305.0,710500,3375.0,3285.0
244,2015/08/24,3100.0,3171.66,3200.0,836800,3245.0,3095.0
245,2015/08/25,3015.0,3044.352,2946.0,1193700,3175.0,2905.0
246,2015/08/26,3060.0,3045.219,3060.0,907200,3120.0,3010.0
247,2015/08/27,3150.0,3154.633,3130.0,455000,3200.0,3105.0
248,2015/08/28,3195.0,3176.526,3210.0,391900,3235.0,3155.0
249,2015/08/31,3230.0,3211.674,3200.0,485000,3230.0,3175.0
250,2015/09/01,3120.0,3199.852,3230.0,690900,3320.0,3120.0
251,2015/09/02,3035.0,3056.394,3040.0,588100,3105.0,3020.0
252,2015/09/03,3035.0,3059.69,3050.0,308400,3105.0,3030.0
253,2015/09/04,2941.0,2958.129,3025.0,805800,3035.0,2915.0
254,2015/09/07,2919.0,2916.393,2935.0,612600,2979.0,2882.0
255,2015/09/08,2819.0,2854.855,2934.0,499700,2953.0,2819.0
256,2015/09/09,2969.0,2930.205,2915.0,465700,2969.0,2877.0
257,2015/09/10,2935.0,2915.791,2919.0,407300,2949.0,2875.0
258,2015/09/11,2966.0,2927.609,2885.0,421800,2978.0,2880.0
259,2015/09/14,3015.0,3014.517,3000.0,507700,3045.0,2963.0
260,2015/09/15,3005.0,3014.69,3015.0,395700,3045.0,2989.0
261,2015/09/16,2945.0,2951.488,3015.0,502900,3020.0,2922.0
262,2015/09/17,2991.0,2976.865,2957.0,293400,3000.0,2937.0
263,2015/09/18,2970.0,2967.184,2992.0,434700,3010.0,2938.0
264,2015/09/24,2890.0,2927.242,2911.0,767300,2988.0,2890.0
265,2015/09/25,2909.0,2892.072,2881.0,447700,2915.0,2861.0
266,2015/09/28,2978.0,2957.702,2911.0,327400,2982.0,2880.0
267,2015/09/29,2909.0,2923.511,2947.0,366900,2956.0,2893.0
268,2015/09/30,2969.0,2966.909,2945.0,245500,2993.0,2913.0
269,2015/10/01,3125.0,3103.585,2999.0,600700,3160.0,2981.0
270,2015/10/02,3145.0,3137.108,3075.0,382900,3175.0,3070.0
271,2015/10/05,3165.0,3159.186,3170.0,367400,3180.0,3130.0
272,2015/10/06,3160.0,3179.778,3200.0,380800,3210.0,3155.0
273,2015/10/07,3185.0,3146.45,3145.0,396000,3190.0,3100.0
274,2015/10/08,3115.0,3118.254,3160.0,309900,3160.0,3090.0
275,2015/10/09,3130.0,3117.335,3140.0,292100,3160.0,3075.0
276,2015/10/13,3115.0,3132.812,3120.0,243400,3170.0,3095.0
277,2015/10/14,3065.0,3084.304,3120.0,634100,3135.0,3060.0
278,2015/10/15,3145.0,3107.554,3035.0,401100,3155.0,3015.0
279,2015/10/16,3145.0,3159.667,3160.0,261600,3190.0,3125.0
280,2015/10/19,3160.0,3150.085,3135.0,241200,3180.0,3105.0
281,2015/10/20,3110.0,3132.723,3160.0,207500,3175.0,3105.0
282,2015/10/21,3110.0,3087.49,3115.0,365600,3115.0,3055.0
283,2015/10/22,3005.0,3033.924,3060.0,523000,3095.0,3000.0
284,2015/10/23,3040.0,3038.721,3060.0,430800,3070.0,3020.0
285,2015/10/26,3010.0,3012.177,3040.0,375700,3050.0,3000.0
286,2015/10/27,3050.0,3068.059,3040.0,235900,3100.0,3010.0
287,2015/10/28,3060.0,3062.187,3050.0,214700,3080.0,3050.0
288,2015/10/29,3080.0,3083.337,3090.0,782400,3115.0,3045.0
289,2015/10/30,3120.0,3118.078,3085.0,359600,3140.0,3075.0
290,2015/11/02,3085.0,3083.705,3090.0,250200,3110.0,3050.0
291,2015/11/04,3200.0,3196.995,3135.0,740300,3245.0,3120.0
292,2015/11/05,3205.0,3185.007,3200.0,359500,3220.0,3140.0
293,2015/11/06,3225.0,3215.12,3225.0,174600,3230.0,3200.0
294,2015/11/09,3250.0,3237.079,3235.0,364100,3255.0,3200.0
295,2015/11/10,3285.0,3251.145,3200.0,413000,3290.0,3175.0
296,2015/11/11,3085.0,3077.541,3100.0,1168900,3125.0,3020.0
297,2015/11/12,3115.0,3106.011,3070.0,478400,3125.0,3065.0
298,2015/11/13,3190.0,3170.426,3130.0,611000,3195.0,3120.0
299,2015/11/16,3160.0,3159.823,3130.0,402100,3175.0,3120.0
300,2015/11/17,3205.0,3196.641,3205.0,423000,3210.0,3170.0
301,2015/11/18,3205.0,3227.563,3240.0,408500,3260.0,3200.0
302,2015/11/19,3215.0,3220.039,3225.0,475700,3250.0,3170.0
303,2015/11/20,3310.0,3285.98,3245.0,599800,3320.0,3230.0
304,2015/11/24,3300.0,3301.939,3290.0,383000,3320.0,3265.0
305,2015/11/25,3310.0,3303.165,3285.0,237900,3320.0,3280.0
306,2015/11/26,3320.0,3331.481,3310.0,312300,3365.0,3300.0
307,2015/11/27,3305.0,3313.028,3335.0,197500,3350.0,3290.0
308,2015/11/30,3285.0,3286.135,3305.0,242300,3305.0,3260.0
309,2015/12/01,3315.0,3313.432,3290.0,277500,3330.0,3285.0
310,2015/12/02,3335.0,3313.974,3310.0,296800,3345.0,3280.0
311,2015/12/03,3315.0,3309.615,3340.0,265900,3340.0,3295.0
312,2015/12/04,3220.0,3226.819,3245.0,305900,3255.0,3205.0
313,2015/12/07,3275.0,3278.033,3275.0,231100,3300.0,3260.0
314,2015/12/08,3265.0,3272.814,3270.0,487200,3315.0,3250.0
315,2015/12/09,3185.0,3196.741,3280.0,442600,3295.0,3130.0
316,2015/12/10,3110.0,3117.643,3105.0,464500,3150.0,3075.0
317,2015/12/11,3100.0,3095.788,3070.0,396700,3150.0,3070.0
318,2015/12/14,3050.0,3036.456,3035.0,354000,3050.0,3015.0
319,2015/12/15,2985.0,3022.048,3055.0,397600,3105.0,2980.0
320,2015/12/16,3005.0,3009.959,3035.0,457800,3060.0,2996.0
321,2015/12/17,3045.0,3054.432,3075.0,512400,3095.0,3025.0
322,2015/12/18,3050.0,3097.132,3060.0,657400,3145.0,3050.0
323,2015/12/21,3160.0,3126.732,3065.0,832000,3175.0,3055.0
324,2015/12/22,3175.0,3172.785,3130.0,351000,3195.0,3130.0
325,2015/12/24,3110.0,3128.805,3175.0,243000,3185.0,3100.0
326,2015/12/25,3145.0,3148.994,3145.0,307200,3190.0,3120.0
327,2015/12/28,3165.0,3143.54,3135.0,378300,3175.0,3095.0
328,2015/12/29,3185.0,3171.49,3130.0,234300,3195.0,3110.0
329,2015/12/30,3205.0,3190.301,3185.0,194200,3210.0,3160.0
330,2016/01/04,3105.0,3147.535,3195.0,564000,3235.0,3090.0
331,2016/01/05,3160.0,3156.932,3100.0,435000,3200.0,3095.0
332,2016/01/06,3140.0,3158.686,3180.0,234800,3200.0,3120.0
333,2016/01/07,3130.0,3156.015,3145.0,466700,3205.0,3125.0
334,2016/01/08,3030.0,3048.896,3090.0,582600,3100.0,3000.0
335,2016/01/12,2947.0,2984.665,3005.0,445400,3050.0,2944.0
336,2016/01/13,3060.0,3047.048,3015.0,299100,3065.0,3010.0
337,2016/01/14,2990.0,2979.681,3000.0,641800,3020.0,2921.0
338,2016/01/15,2983.0,3006.375,3020.0,438500,3050.0,2964.0
339,2016/01/18,2939.0,2931.288,2908.0,416700,2959.0,2899.0
340,2016/01/19,2935.0,2944.403,2906.0,604200,2994.0,2895.0
341,2016/01/20,2833.0,2873.325,2935.0,538000,2949.0,2827.0
342,2016/01/21,2738.0,2804.612,2823.0,383400,2867.0,2738.0
343,2016/01/22,2817.0,2803.458,2809.0,824600,2840.0,2773.0
344,2016/01/25,2921.0,2908.841,2896.0,635700,2937.0,2882.0
345,2016/01/26,2872.0,2892.707,2886.0,323700,2925.0,2864.0
346,2016/01/27,2917.0,2921.952,2928.0,287500,2949.0,2901.0
347,2016/01/28,2917.0,2917.945,2894.0,226300,2943.0,2872.0
348,2016/01/29,3005.0,2926.462,2885.0,671100,3005.0,2855.0
349,2016/02/01,3150.0,3139.493,3030.0,509400,3185.0,3030.0
350,2016/02/02,3145.0,3141.434,3120.0,309600,3165.0,3110.0
351,2016/02/03,3085.0,3072.836,3050.0,302500,3100.0,3040.0
352,2016/02/04,3000.0,3020.81,3045.0,322200,3080.0,2981.0
353,2016/02/05,2948.0,2943.855,2999.0,367600,2999.0,2910.0
354,2016/02/08,3000.0,2980.304,2900.0,431900,3040.0,2889.0
355,2016/02/09,2823.0,2845.001,2895.0,575700,2929.0,2808.0
356,2016/02/10,2633.0,2594.555,2750.0,1814100,2750.0,2440.0
357,2016/02/12,2400.0,2433.948,2506.0,944300,2506.0,2390.0
358,2016/02/15,2618.0,2605.118,2530.0,653900,2658.0,2510.0
359,2016/02/16,2569.0,2592.097,2582.0,632100,2650.0,2561.0
360,2016/02/17,2560.0,2541.592,2560.0,574800,2592.0,2505.0
361,2016/02/18,2575.0,2594.54,2643.0,448200,2646.0,2570.0
362,2016/02/19,2469.0,2473.427,2502.0,982700,2525.0,2427.0
363,2016/02/22,2513.0,2484.011,2431.0,575900,2533.0,2418.0
364,2016/02/23,2469.0,2483.672,2525.0,435600,2536.0,2463.0
365,2016/02/24,2460.0,2456.365,2420.0,631600,2492.0,2412.0
366,2016/02/25,2572.0,2559.969,2479.0,775200,2591.0,2479.0
367,2016/02/26,2551.0,2574.588,2612.0,749100,2627.0,2545.0
368,2016/02/29,2601.0,2621.032,2594.0,831800,2672.0,2553.0
369,2016/03/01,2618.0,2616.456,2591.0,440300,2640.0,2591.0
370,2016/03/02,2716.0,2712.173,2709.0,578400,2732.0,2672.0
371,2016/03/03,2760.0,2762.319,2716.0,569200,2804.0,2716.0
372,2016/03/04,2774.0,2775.358,2810.0,719300,2816.0,2747.0
373,2016/03/07,2742.0,2763.496,2767.0,520300,2800.0,2737.0
374,2016/03/08,2706.0,2684.272,2700.0,581100,2733.0,2647.0
375,2016/03/09,2633.0,2631.409,2682.0,866600,2695.0,2601.0
376,2016/03/10,2689.0,2692.599,2676.0,746600,2719.0,2672.0
377,2016/03/11,2710.0,2679.551,2639.0,578300,2729.0,2633.0
378,2016/03/14,2762.0,2774.022,2770.0,610700,2805.0,2751.0
379,2016/03/15,2728.0,2733.377,2739.0,355200,2767.0,2712.0
380,2016/03/16,2731.0,2730.519,2713.0,470100,2748.0,2703.0
381,2016/03/17,2705.0,2715.605,2732.0,537000,2758.0,2691.0
382,2016/03/18,2583.0,2584.943,2670.0,1226500,2672.0,2564.0
383,2016/03/22,2533.0,2537.215,2563.0,1438200,2573.0,2513.0
384,2016/03/23,2539.0,2527.722,2536.0,751900,2547.0,2510.0
385,2016/03/24,2537.0,2537.939,2537.0,898000,2557.0,2521.0
386,2016/03/25,2543.0,2538.173,2539.0,550300,2561.0,2521.0
387,2016/03/28,2574.0,2552.927,2550.0,1166000,2574.0,2526.0
388,2016/03/29,2568.0,2556.204,2545.0,630800,2575.0,2516.0
389,2016/03/30,2582.0,2602.061,2609.0,705000,2640.0,2563.0
390,2016/03/31,2529.0,2559.753,2593.0,528500,2612.0,2527.0
391,2016/04/01,2456.0,2485.795,2518.0,656600,2540.0,2454.0
392,2016/04/04,2446.0,2461.162,2434.0,551600,2498.0,2430.0
393,2016/04/05,2366.0,2391.474,2423.0,622300,2435.0,2364.0
394,2016/04/06,2359.0,2339.674,2329.0,1023100,2372.0,2274.0
395,2016/04/07,2348.0,2347.545,2349.0,619400,2390.0,2322.0
396,2016/04/08,2355.0,2349.189,2300.0,676300,2390.0,2289.0
397,2016/04/11,2335.0,2326.39,2350.0,252600,2358.0,2309.0
398,2016/04/12,2344.0,2341.774,2332.0,326500,2363.0,2318.0
399,2016/04/13,2369.0,2363.307,2365.0,491900,2380.0,2345.0
400,2016/04/14,2403.0,2382.678,2377.0,914100,2403.0,2351.0
401,2016/04/15,2381.0,2362.959,2361.0,828700,2382.0,2342.0
402,2016/04/18,2275.0,2281.615,2290.0,664900,2302.0,2266.0
403,2016/04/19,2304.0,2296.228,2285.0,667300,2316.0,2248.0
404,2016/04/20,2338.0,2342.804,2330.0,412600,2370.0,2326.0
405,2016/04/21,2375.0,2371.311,2360.0,387600,2385.0,2344.0
406,2016/04/22,2376.0,2376.955,2396.0,601500,2429.0,2343.0
407,2016/04/25,2390.0,2391.996,2406.0,579700,2416.0,2380.0
408,2016/04/26,2355.0,2352.501,2379.0,425900,2390.0,2328.0
409,2016/04/27,2369.0,2377.471,2390.0,346900,2406.0,2358.0
410,2016/04/28,2303.0,2361.288,2415.0,548000,2438.0,2302.0
411,2016/05/02,2223.0,2221.278,2233.0,445600,2244.0,2208.0
412,2016/05/06,2242.0,2245.124,2235.0,567000,2259.0,2226.0
413,2016/05/09,2275.0,2270.747,2274.0,512100,2287.0,2236.0
414,2016/05/10,2358.0,2330.292,2311.0,555500,2360.0,2274.0
415,2016/05/11,2329.0,2351.444,2390.0,306000,2402.0,2324.0
416,2016/05/12,2325.0,2315.351,2328.0,261100,2335.0,2296.0
417,2016/05/13,2283.0,2298.742,2325.0,361400,2328.0,2283.0
418,2016/05/16,2110.0,2157.257,2170.0,1600300,2256.0,2098.0
419,2016/05/17,2148.0,2161.542,2133.0,1074000,2192.0,2123.0
420,2016/05/18,2131.0,2139.733,2134.0,662700,2172.0,2118.0
421,2016/05/19,2196.0,2186.814,2184.0,824000,2206.0,2161.0
422,2016/05/20,2347.0,2322.395,2235.0,1046500,2364.0,2230.0
423,2016/05/23,2396.0,2375.51,2334.0,1140300,2407.0,2320.0
424,2016/05/24,2331.0,2351.721,2385.0,630800,2386.0,2325.0
425,2016/05/25,2318.0,2345.213,2375.0,551800,2380.0,2315.0
426,2016/05/26,2324.0,2320.994,2294.0,395700,2334.0,2256.0
427,2016/05/27,2318.0,2316.087,2328.0,229800,2328.0,2278.0
428,2016/05/30,2311.0,2310.779,2334.0,395800,2346.0,2300.0
429,2016/05/31,2332.0,2314.564,2301.0,505500,2332.0,2284.0
430,2016/06/01,2268.0,2277.222,2322.0,474800,2322.0,2252.0
431,2016/06/02,2218.0,2221.763,2244.0,433300,2247.0,2208.0
432,2016/06/03,2249.0,2246.037,2229.0,234000,2273.0,2229.0
433,2016/06/06,2254.0,2248.866,2238.0,363700,2264.0,2231.0
434,2016/06/07,2278.0,2273.577,2264.0,352500,2289.0,2249.0
435,2016/06/08,2291.0,2274.618,2287.0,313500,2291.0,2251.0
436,2016/06/09,2295.0,2291.767,2276.0,475100,2311.0,2265.0
437,2016/06/10,2311.0,2307.902,2311.0,874800,2323.0,2284.0
438,2016/06/13,2217.0,2222.398,2252.0,666600,2261.0,2203.0
439,2016/06/14,2231.0,2219.154,2217.0,722900,2244.0,2192.0
440,2016/06/15,2251.0,2252.461,2263.0,598000,2282.0,2230.0
441,2016/06/16,2191.0,2207.75,2250.0,611900,2258.0,2182.0
442,2016/06/17,2117.0,2135.534,2194.0,820000,2200.0,2110.0
443,2016/06/20,2167.0,2151.207,2150.0,614100,2179.0,2122.0
444,2016/06/21,2214.0,2180.622,2150.0,474600,2220.0,2136.0
445,2016/06/22,2210.0,2206.889,2212.0,335900,2224.0,2192.0
446,2016/06/23,2212.0,2194.446,2215.0,453100,2215.0,2168.0
447,2016/06/24,2109.0,2158.961,2244.0,1117800,2272.0,2087.0
448,2016/06/27,2103.0,2103.029,2119.0,1020300,2157.0,2068.0
449,2016/06/28,2139.0,2122.644,2110.0,706200,2160.0,2070.0
450,2016/06/29,2148.0,2137.098,2148.0,618400,2171.0,2103.0
451,2016/06/30,2202.0,2212.02,2213.0,487000,2226.0,2200.0
452,2016/07/01,2223.0,2227.627,2219.0,296500,2250.0,2210.0
453,2016/07/04,2227.0,2225.179,2222.0,310500,2241.0,2208.0
454,2016/07/05,2202.0,2202.261,2208.0,238600,2212.0,2186.0
455,2016/07/06,2165.0,2158.103,2155.0,411700,2177.0,2139.0
456,2016/07/07,2134.0,2135.741,2142.0,425400,2171.0,2121.0
457,2016/07/08,2095.0,2124.501,2153.0,362500,2169.0,2094.0
458,2016/07/11,2177.0,2169.279,2130.0,233900,2185.0,2130.0
459,2016/07/12,2231.0,2243.289,2227.0,410400,2268.0,2227.0
460,2016/07/13,2281.0,2283.409,2241.0,667300,2311.0,2219.0
461,2016/07/14,2255.0,2258.242,2276.0,673200,2283.0,2245.0
462,2016/07/15,2266.0,2278.001,2280.0,640500,2314.0,2261.0
463,2016/07/19,2283.0,2275.315,2284.0,349700,2307.0,2256.0
464,2016/07/20,2298.0,2283.725,2285.0,188800,2301.0,2255.0
465,2016/07/21,2307.0,2302.81,2312.0,200400,2312.0,2291.0
466,2016/07/22,2314.0,2304.511,2280.0,367900,2314.0,2262.0
467,2016/07/25,2325.0,2332.59,2320.0,432800,2359.0,2314.0
468,2016/07/26,2287.0,2296.632,2310.0,289100,2335.0,2281.0
469,2016/07/27,2295.0,2301.69,2302.0,367500,2341.0,2278.0
470,2016/07/28,2278.0,2296.461,2307.0,357000,2332.0,2275.0
471,2016/07/29,2345.0,2312.706,2291.0,352500,2345.0,2273.0
472,2016/08/01,2348.0,2338.691,2329.0,314500,2357.0,2299.0
473,2016/08/02,2305.0,2319.713,2320.0,175600,2338.0,2305.0
474,2016/08/03,2250.0,2260.197,2270.0,268000,2288.0,2242.0
475,2016/08/04,2268.0,2251.514,2254.0,305700,2275.0,2208.0
476,2016/08/05,2264.0,2267.662,2256.0,289100,2286.0,2254.0
477,2016/08/08,2319.0,2304.743,2314.0,265200,2319.0,2283.0
478,2016/08/09,2405.0,2355.134,2296.0,442600,2406.0,2293.0
479,2016/08/10,2036.0,2068.226,2165.0,2998700,2186.0,1975.0
480,2016/08/12,2097.0,2087.51,2037.0,1259100,2117.0,2037.0
481,2016/08/15,2060.0,2078.736,2100.0,572400,2117.0,2053.0
482,2016/08/16,2036.0,2045.984,2063.0,628500,2076.0,2030.0
483,2016/08/17,2046.0,2055.265,2042.0,433900,2080.0,2036.0
484,2016/08/18,2034.0,2050.84,2065.0,436500,2070.0,2029.0
485,2016/08/19,2106.0,2084.161,2063.0,651700,2114.0,2035.0
486,2016/08/22,2137.0,2127.825,2106.0,494600,2150.0,2085.0
487,2016/08/23,2119.0,2123.517,2120.0,528000,2146.0,2109.0
488,2016/08/24,2132.0,2132.158,2125.0,351200,2147.0,2113.0
489,2016/08/25,2119.0,2104.769,2090.0,341500,2126.0,2076.0
490,2016/08/26,2124.0,2124.112,2108.0,296500,2135.0,2104.0
491,2016/08/29,2134.0,2135.376,2125.0,250400,2150.0,2114.0
492,2016/08/30,2167.0,2164.52,2141.0,360400,2181.0,2137.0
493,2016/08/31,2204.0,2191.842,2181.0,583600,2206.0,2171.0
494,2016/09/01,2219.0,2223.735,2217.0,466400,2242.0,2209.0
495,2016/09/02,2246.0,2255.507,2219.0,472300,2286.0,2217.0
496,2016/09/05,2235.0,2238.41,2255.0,512600,2255.0,2216.0
497,2016/09/06,2233.0,2233.284,2235.0,402300,2245.0,2225.0
498,2016/09/07,2229.0,2221.482,2214.0,427000,2230.0,2206.0
499,2016/09/08,2210.0,2218.409,2236.0,499300,2246.0,2203.0
500,2016/09/09,2189.0,2189.289,2190.0,601500,2204.0,2177.0
501,2016/09/12,2103.0,2113.687,2150.0,501400,2153.0,2098.0
502,2016/09/13,2085.0,2096.194,2112.0,452700,2122.0,2077.0
503,2016/09/14,2072.0,2070.414,2079.0,618300,2091.0,2042.0
504,2016/09/15,2049.0,2038.503,2068.0,460900,2080.0,2005.0
505,2016/09/16,2052.0,2045.869,2045.0,462200,2053.0,2030.0
506,2016/09/20,2037.0,2039.348,2030.0,363100,2059.0,2030.0
507,2016/09/21,2063.0,2033.174,2012.0,463800,2064.0,2002.0
508,2016/09/23,2023.0,2021.536,2055.0,568400,2056.0,2012.0
509,2016/09/26,2022.0,2032.49,2033.0,355700,2055.0,2021.0
510,2016/09/27,2078.0,2048.677,2009.0,574300,2080.0,2009.0
511,2016/09/28,2059.0,2051.831,2059.0,564600,2068.0,2032.0
512,2016/09/29,2096.0,2098.012,2093.0,666600,2109.0,2083.0
513,2016/09/30,2048.0,2047.217,2046.0,451400,2068.0,2027.0
514,2016/10/03,2078.0,2081.586,2080.0,478200,2099.0,2071.0
515,2016/10/04,2110.0,2109.853,2108.0,653800,2128.0,2094.0
516,2016/10/05,2072.0,2085.45,2108.0,429300,2110.0,2065.0
517,2016/10/06,2035.0,2046.428,2058.0,456400,2068.0,2027.0
518,2016/10/07,2016.0,2015.226,2030.0,602400,2035.0,2004.0
519,2016/10/11,2006.0,2009.262,2036.0,490000,2037.0,1992.0
520,2016/10/12,1995.0,1993.385,1980.0,594700,2010.0,1970.0
521,2016/10/13,1990.0,1991.368,2010.0,445700,2011.0,1980.0
522,2016/10/14,1999.0,1996.13,1980.0,378700,2005.0,1980.0
523,2016/10/17,1990.0,1984.012,1990.0,424400,1995.0,1970.0
524,2016/10/18,2025.0,2013.776,1991.0,716600,2026.0,1991.0
525,2016/10/19,2028.0,2025.425,2025.0,422200,2034.0,2016.0
526,2016/10/20,2078.0,2065.019,2030.0,514100,2085.0,2026.0
527,2016/10/21,2112.0,2112.256,2097.0,546100,2126.0,2089.0
528,2016/10/24,2126.0,2125.305,2105.0,476600,2135.0,2103.0
529,2016/10/25,2137.0,2147.735,2140.0,471400,2169.0,2134.0
530,2016/10/26,2159.0,2155.132,2121.0,509200,2168.0,2121.0
531,2016/10/27,2151.0,2154.15,2146.0,401400,2178.0,2134.0
532,2016/10/28,2176.0,2175.49,2146.0,824200,2188.0,2145.0
533,2016/10/31,2101.0,2076.438,2072.0,1781900,2155.0,2006.0
534,2016/11/01,2121.0,2104.934,2068.0,721900,2124.0,2066.0
535,2016/11/02,2113.0,2104.389,2096.0,561700,2114.0,2093.0
536,2016/11/04,2106.0,2101.863,2087.0,526800,2113.0,2082.0
537,2016/11/07,2113.0,2106.649,2100.0,456100,2127.0,2089.0
538,2016/11/08,2100.0,2104.914,2125.0,197400,2136.0,2091.0
539,2016/11/09,1992.0,2015.562,2101.0,592400,2113.0,1952.0
540,2016/11/10,2095.0,2091.795,2079.0,602200,2110.0,2070.0
541,2016/11/11,2055.0,2068.031,2101.0,698300,2101.0,2053.0
542,2016/11/14,2066.0,2058.861,2056.0,511900,2071.0,2034.0
543,2016/11/15,2082.0,2075.567,2084.0,501100,2091.0,2051.0
544,2016/11/16,2094.0,2091.382,2100.0,427300,2121.0,2077.0
545,2016/11/17,2070.0,2070.645,2080.0,262700,2082.0,2062.0
546,2016/11/18,2148.0,2134.59,2105.0,646600,2154.0,2074.0
547,2016/11/21,2234.0,2218.178,2198.0,790200,2241.0,2181.0
548,2016/11/22,2264.0,2261.492,2245.0,549200,2277.0,2243.0
549,2016/11/24,2257.0,2259.9,2285.0,322800,2285.0,2249.0
550,2016/11/25,2262.0,2269.733,2279.0,430200,2292.0,2251.0
551,2016/11/28,2156.0,2140.101,2157.0,989500,2175.0,2114.0
552,2016/11/29,2200.0,2187.051,2170.0,571100,2204.0,2164.0
553,2016/11/30,2215.0,2204.87,2192.0,486600,2215.0,2182.0
554,2016/12/01,2221.0,2227.858,2229.0,402500,2246.0,2214.0
555,2016/12/02,2199.0,2196.981,2191.0,430200,2212.0,2175.0
556,2016/12/05,2195.0,2203.78,2233.0,454100,2233.0,2190.0
557,2016/12/06,2200.0,2201.791,2187.0,517800,2216.0,2184.0
558,2016/12/07,2186.0,2181.962,2197.0,397500,2197.0,2167.0
559,2016/12/08,2191.0,2185.967,2191.0,397200,2204.0,2169.0
560,2016/12/09,2246.0,2229.073,2191.0,438900,2249.0,2191.0
561,2016/12/12,2219.0,2230.207,2272.0,399900,2274.0,2206.0
562,2016/12/13,2162.0,2162.426,2194.0,694800,2202.0,2140.0
563,2016/12/14,2110.0,2114.187,2119.0,901600,2136.0,2101.0
564,2016/12/15,2195.0,2169.86,2115.0,939200,2213.0,2106.0
565,2016/12/16,2184.0,2188.977,2196.0,554600,2217.0,2168.0
566,2016/12/19,2199.0,2176.882,2162.0,482300,2205.0,2140.0
567,2016/12/20,2236.0,2226.356,2220.0,401800,2239.0,2209.0
568,2016/12/21,2174.0,2195.962,2230.0,435600,2238.0,2169.0
569,2016/12/22,2158.0,2156.268,2166.0,262300,2172.0,2146.0
570,2016/12/26,2183.0,2165.995,2126.0,386800,2186.0,2120.0
571,2016/12/27,2179.0,2186.921,2186.0,256500,2209.0,2168.0
572,2016/12/28,2195.0,2199.121,2194.0,186500,2209.0,2186.0
573,2016/12/29,2149.0,2154.295,2187.0,272900,2189.0,2143.0
574,2016/12/30,2158.0,2153.213,2146.0,236500,2166.0,2133.0
575,2017/01/04,2219.0,2208.112,2180.0,426600,2222.0,2169.0
576,2017/01/05,2295.0,2285.22,2231.0,927500,2309.0,2223.0
577,2017/01/06,2316.0,2316.183,2300.0,697200,2333.0,2283.0
578,2017/01/10,2265.0,2268.769,2277.0,535500,2295.0,2252.0
579,2017/01/11,2234.0,2240.567,2250.0,361700,2272.0,2227.0
580,2017/01/12,2221.0,2231.712,2247.0,464000,2254.0,2217.0
581,2017/01/13,2222.0,2230.875,2214.0,408000,2263.0,2211.0
582,2017/01/16,2184.0,2194.577,2214.0,335300,2226.0,2180.0
583,2017/01/17,2134.0,2148.983,2168.0,366000,2174.0,2134.0
584,2017/01/18,2081.0,2083.129,2108.0,889000,2125.0,2070.0
585,2017/01/19,2110.0,2119.183,2114.0,501900,2135.0,2109.0
586,2017/01/20,2116.0,2108.062,2100.0,504500,2121.0,2090.0
587,2017/01/23,2083.0,2091.821,2118.0,466100,2118.0,2082.0
588,2017/01/24,2032.0,2036.918,2067.0,996200,2076.0,2019.0
589,2017/01/25,2067.0,2054.665,2030.0,753800,2071.0,2030.0
590,2017/01/26,2069.0,2070.48,2096.0,440200,2096.0,2056.0
591,2017/01/27,2079.0,2086.732,2087.0,300000,2105.0,2077.0
592,2017/01/30,2063.0,2065.87,2080.0,604400,2088.0,2052.0
593,2017/01/31,2082.0,2083.94,2072.0,520800,2096.0,2065.0
594,2017/02/01,2081.0,2075.874,2077.0,471300,2090.0,2059.0
595,2017/02/02,2074.0,2097.712,2118.0,491200,2126.0,2073.0
596,2017/02/03,2056.0,2065.279,2074.0,451400,2096.0,2052.0
597,2017/02/06,2095.0,2091.93,2077.0,263800,2099.0,2076.0
598,2017/02/07,2056.0,2064.845,2090.0,349200,2090.0,2056.0
599,2017/02/08,2086.0,2073.146,2064.0,354700,2089.0,2053.0
600,2017/02/09,2032.0,2044.928,2055.0,616800,2067.0,2026.0
601,2017/02/10,2218.0,2243.986,2249.0,1780100,2282.0,2210.0
602,2017/02/13,2250.0,2233.32,2215.0,695100,2257.0,2192.0
603,2017/02/14,2249.0,2255.745,2257.0,443000,2264.0,2247.0
604,2017/02/15,2262.0,2255.073,2207.0,514000,2277.0,2195.0
605,2017/02/16,2239.0,2234.261,2270.0,477700,2270.0,2210.0
606,2017/02/17,2237.0,2225.164,2223.0,612600,2247.0,2200.0
607,2017/02/20,2201.0,2202.425,2231.0,457500,2235.0,2192.0
608,2017/02/21,2160.0,2149.48,2142.0,866800,2178.0,2100.0
609,2017/02/22,2122.0,2120.529,2140.0,783500,2151.0,2113.0
610,2017/02/23,2087.0,2083.737,2103.0,1028300,2112.0,2066.0
611,2017/02/24,2078.0,2075.645,2070.0,519200,2090.0,2065.0
612,2017/02/27,2074.0,2067.785,2069.0,517800,2082.0,2050.0
613,2017/02/28,2060.0,2074.803,2073.0,551300,2093.0,2059.0
614,2017/03/01,2090.0,2072.521,2076.0,664000,2095.0,2046.0
615,2017/03/02,2075.0,2081.938,2105.0,803600,2110.0,2072.0
616,2017/03/03,2035.0,2042.658,2063.0,847800,2070.0,2028.0
617,2017/03/06,2045.0,2044.209,2050.0,471100,2056.0,2033.0
618,2017/03/07,2058.0,2055.385,2059.0,414300,2062.0,2048.0
619,2017/03/08,2055.0,2052.507,2057.0,323700,2059.0,2044.0
620,2017/03/09,2067.0,2067.64,2063.0,347900,2073.0,2058.0
621,2017/03/10,2049.0,2058.613,2071.0,681300,2075.0,2048.0
622,2017/03/13,2040.0,2041.231,2050.0,655900,2059.0,2028.0
623,2017/03/14,2043.0,2041.936,2052.0,425400,2055.0,2037.0
624,2017/03/15,2042.0,2038.368,2040.0,343700,2045.0,2030.0
625,2017/03/16,2032.0,2030.333,2031.0,581500,2043.0,2021.0
626,2017/03/17,2029.0,2031.586,2037.0,538100,2041.0,2024.0
627,2017/03/21,2027.0,2033.734,2039.0,654200,2045.0,2026.0
628,2017/03/22,2009.0,2020.056,2015.0,751100,2032.0,2008.0
629,2017/03/23,2006.0,2002.074,2000.0,790400,2012.0,1996.0
630,2017/03/24,2033.0,2027.813,2008.0,695000,2043.0,1998.0
631,2017/03/27,2013.0,2036.378,2072.0,1015300,2075.0,2009.0
632,2017/03/28,2046.0,2038.67,2034.0,1247500,2048.0,2028.0
633,2017/03/29,2007.0,2014.998,2029.0,981600,2030.0,2000.0
634,2017/03/30,1978.0,1990.206,2005.0,683600,2010.0,1975.0
635,2017/03/31,1960.0,1976.658,1986.0,545500,1994.0,1960.0
636,2017/04/03,1958.0,1961.195,1979.0,497700,1981.0,1953.0
637,2017/04/04,1899.0,1911.53,1951.0,915300,1953.0,1889.0
638,2017/04/05,1885.0,1885.203,1894.0,1020300,1902.0,1872.0
639,2017/04/06,1864.0,1871.155,1887.0,993400,1890.0,1862.0
640,2017/04/07,1878.0,1877.474,1869.0,1004900,1893.0,1861.0
641,2017/04/10,1863.0,1868.366,1886.0,669300,1895.0,1854.0
642,2017/04/11,1822.0,1824.629,1840.0,1254600,1850.0,1810.0
643,2017/04/12,1819.0,1807.439,1800.0,957900,1821.0,1790.0
644,2017/04/13,1836.0,1838.782,1819.0,1227400,1859.0,1819.0
645,2017/04/14,1811.0,1817.863,1831.0,362000,1840.0,1805.0
646,2017/04/17,1836.0,1826.195,1808.0,348200,1841.0,1805.0
647,2017/04/18,1828.0,1836.307,1838.0,657100,1861.0,1825.0
648,2017/04/19,1833.0,1836.486,1819.0,509600,1853.0,1817.0
649,2017/04/20,1831.0,1837.513,1832.0,471600,1847.0,1831.0
650,2017/04/21,1854.0,1848.608,1843.0,554400,1860.0,1832.0
651,2017/04/24,1874.0,1875.562,1878.0,711300,1891.0,1856.0
652,2017/04/25,1910.0,1904.705,1899.0,1202900,1919.0,1892.0
653,2017/04/26,1948.0,1939.68,1926.0,830600,1957.0,1911.0
654,2017/04/27,1930.0,1927.08,1934.0,337100,1935.0,1915.0
655,2017/04/28,1918.0,1923.237,1950.0,350800,1950.0,1910.0
656,2017/05/01,1930.0,1925.529,1921.0,363100,1936.0,1912.0
657,2017/05/02,1969.0,1969.504,1950.0,577300,1983.0,1948.0
658,2017/05/08,1968.0,1970.861,1981.0,734500,1983.0,1959.0
659,2017/05/09,1971.0,1971.787,1972.0,355200,1978.0,1964.0
660,2017/05/10,1972.0,1977.546,1970.0,483400,1991.0,1967.0
661,2017/05/11,1964.0,1965.281,1975.0,414800,1975.0,1956.0
662,2017/05/12,1977.0,1972.663,1964.0,458200,1978.0,1963.0
663,2017/05/15,1967.0,1965.005,1955.0,703800,1994.0,1948.0
664,2017/05/16,1890.0,1908.418,1949.0,1133900,1959.0,1885.0
665,2017/05/17,1849.0,1851.006,1866.0,1187400,1870.0,1827.0
666,2017/05/18,1914.0,1889.403,1835.0,967900,1914.0,1835.0
667,2017/05/19,1991.0,1973.32,1940.0,1217600,2000.0,1928.0
668,2017/05/22,2015.0,2001.114,1978.0,1029000,2016.0,1972.0
669,2017/05/23,2055.0,2041.324,2015.0,1057500,2056.0,2015.0
670,2017/05/24,2036.0,2041.742,2061.0,621900,2068.0,2028.0
671,2017/05/25,2033.0,2022.143,1993.0,522700,2038.0,1991.0
672,2017/05/26,2013.0,2018.132,2011.0,374700,2029.0,2011.0
673,2017/05/29,2068.0,2061.985,2017.0,621500,2076.0,2017.0
674,2017/05/30,2056.0,2070.271,2083.0,775300,2088.0,2053.0
675,2017/05/31,2054.0,2052.502,2055.0,397400,2061.0,2046.0
676,2017/06/01,2088.0,2078.76,2055.0,423900,2088.0,2054.0
677,2017/06/02,2116.0,2110.028,2098.0,734500,2117.0,2094.0
678,2017/06/05,2117.0,2120.296,2116.0,566500,2129.0,2111.0
679,2017/06/06,2081.0,2091.055,2112.0,461000,2115.0,2080.0
680,2017/06/07,2090.0,2083.105,2067.0,315200,2094.0,2067.0
681,2017/06/08,2090.0,2093.734,2091.0,563000,2107.0,2071.0
682,2017/06/09,2081.0,2084.615,2087.0,563400,2095.0,2076.0
683,2017/06/12,2132.0,2114.104,2085.0,697600,2132.0,2079.0
684,2017/06/13,2121.0,2134.422,2126.0,512500,2154.0,2120.0
685,2017/06/14,2125.0,2131.982,2127.0,303300,2145.0,2125.0
686,2017/06/15,2150.0,2128.528,2113.0,539300,2153.0,2104.0
687,2017/06/16,2170.0,2160.934,2154.0,643600,2170.0,2143.0
688,2017/06/19,2225.0,2212.212,2173.0,613100,2230.0,2173.0
689,2017/06/20,2219.0,2234.537,2233.0,538100,2252.0,2219.0
690,2017/06/21,2184.0,2192.961,2201.0,458500,2209.0,2181.0
691,2017/06/22,2149.0,2159.969,2190.0,628000,2191.0,2145.0
692,2017/06/23,2156.0,2154.899,2161.0,348300,2166.0,2148.0
693,2017/06/26,2149.0,2146.772,2157.0,379100,2159.0,2135.0
694,2017/06/27,2135.0,2132.19,2145.0,538100,2148.0,2117.0
695,2017/06/28,2099.0,2106.647,2114.0,585600,2121.0,2097.0
696,2017/06/29,2102.0,2086.535,2101.0,899100,2108.0,2070.0
697,2017/06/30,2070.0,2075.383,2078.0,459400,2089.0,2065.0
698,2017/07/03,2089.0,2088.843,2091.0,275300,2101.0,2077.0
699,2017/07/04,2086.0,2090.839,2105.0,227800,2109.0,2079.0
700,2017/07/05,2108.0,2098.2,2087.0,285600,2110.0,2077.0
701,2017/07/06,2096.0,2098.476,2101.0,242800,2110.0,2092.0
702,2017/07/07,2049.0,2059.114,2070.0,397100,2086.0,2046.0
703,2017/07/10,2056.0,2059.523,2054.0,396000,2070.0,2052.0
704,2017/07/11,2052.0,2039.254,2039.0,481200,2055.0,2026.0
705,2017/07/12,2022.0,2028.87,2050.0,392200,2056.0,2016.0
706,2017/07/13,2039.0,2036.735,2026.0,359100,2045.0,2024.0
707,2017/07/14,2075.0,2075.786,2057.0,607400,2093.0,2043.0
708,2017/07/18,2062.0,2058.608,2071.0,206500,2073.0,2046.0
709,2017/07/19,2034.0,2041.761,2048.0,410500,2060.0,2031.0
710,2017/07/20,2034.0,2024.741,2011.0,457000,2035.0,2008.0
711,2017/07/21,2006.0,2009.904,2016.0,354600,2023.0,2004.0
712,2017/07/24,2021.0,2011.79,2001.0,276300,2025.0,1994.0
713,2017/07/25,2018.0,2025.142,2022.0,279500,2038.0,2017.0
714,2017/07/26,2017.0,2011.497,2012.0,366800,2019.0,1995.0
715,2017/07/27,2030.0,2031.454,2013.0,384700,2046.0,2009.0
716,2017/07/28,2050.0,2047.573,2043.0,288000,2054.0,2038.0
717,2017/07/31,2034.0,2030.756,2033.0,312400,2041.0,2018.0
718,2017/08/01,2059.0,2057.152,2037.0,357500,2072.0,2032.0
719,2017/08/02,2042.0,2052.736,2072.0,246400,2074.0,2040.0
720,2017/08/03,2062.0,2054.487,2038.0,406200,2066.0,2035.0
721,2017/08/04,2050.0,2049.946,2052.0,162000,2056.0,2042.0
722,2017/08/07,2044.0,2048.291,2059.0,215700,2065.0,2040.0
723,2017/08/08,2018.0,2020.548,2041.0,372100,2041.0,2012.0
724,2017/08/09,1999.0,1999.386,2010.0,425700,2017.0,1992.0
725,2017/08/10,2240.0,2208.218,2148.0,2771300,2248.0,2147.0
726,2017/08/14,2113.0,2146.489,2191.0,1152800,2202.0,2111.0
727,2017/08/15,2151.0,2134.524,2109.0,745800,2157.0,2093.0
728,2017/08/16,2127.0,2128.893,2145.0,465800,2150.0,2105.0
729,2017/08/17,2143.0,2146.099,2127.0,386800,2161.0,2123.0
730,2017/08/18,2116.0,2120.508,2120.0,393800,2138.0,2108.0
731,2017/08/21,2110.0,2112.533,2122.0,282200,2128.0,2101.0
732,2017/08/22,2128.0,2118.832,2116.0,348600,2130.0,2101.0
733,2017/08/23,2138.0,2140.274,2148.0,282800,2150.0,2127.0
734,2017/08/24,2069.0,2087.742,2124.0,551200,2124.0,2068.0
735,2017/08/25,2068.0,2070.207,2070.0,343400,2084.0,2057.0
736,2017/08/28,2061.0,2057.97,2060.0,307000,2066.0,2049.0
737,2017/08/29,2042.0,2037.223,2026.0,344700,2047.0,2019.0
738,2017/08/30,2069.0,2057.878,2052.0,362700,2074.0,2038.0
739,2017/08/31,2057.0,2070.358,2080.0,566600,2103.0,2053.0
740,2017/09/01,2038.0,2041.219,2062.0,495600,2062.0,2027.0
741,2017/09/04,2024.0,2026.711,2030.0,354700,2038.0,2015.0
742,2017/09/05,2019.0,2028.423,2027.0,403200,2047.0,2019.0
743,2017/09/06,2032.0,2025.762,2011.0,398500,2039.0,2004.0
744,2017/09/07,2034.0,2035.019,2041.0,406300,2049.0,2023.0
745,2017/09/08,1989.0,2003.086,2011.0,685900,2020.0,1989.0
746,2017/09/11,2005.0,2004.731,2015.0,351400,2020.0,1996.0
747,2017/09/12,2008.0,2004.201,2005.0,514300,2011.0,1991.0
748,2017/09/13,2013.0,2012.857,2018.0,348400,2021.0,2002.0
749,2017/09/14,1981.0,1993.281,2013.0,574600,2015.0,1981.0
750,2017/09/15,1970.0,1971.196,1980.0,744900,1988.0,1959.0
751,2017/09/19,2013.0,2006.924,2000.0,679300,2018.0,1991.0
752,2017/09/20,1989.0,1997.012,2015.0,463500,2017.0,1983.0
753,2017/09/21,1995.0,1991.07,1981.0,449600,2005.0,1974.0
754,2017/09/22,1993.0,1986.774,1978.0,385800,1999.0,1977.0
755,2017/09/25,1990.0,1992.072,1995.0,335700,2004.0,1985.0
756,2017/09/26,2017.0,2010.448,1991.0,310100,2020.0,1991.0
757,2017/09/27,2009.0,1999.703,1995.0,324400,2011.0,1987.0
758,2017/09/28,2024.0,2025.879,2024.0,334600,2035.0,2015.0
759,2017/09/29,2013.0,2018.654,2030.0,287800,2035.0,2008.0
760,2017/10/02,2020.0,2024.576,2015.0,250800,2033.0,2014.0
761,2017/10/03,2051.0,2058.054,2040.0,669100,2074.0,2039.0
762,2017/10/04,2103.0,2097.739,2067.0,851300,2123.0,2063.0
763,2017/10/05,2081.0,2091.676,2109.0,380900,2124.0,2075.0
764,2017/10/06,2079.0,2079.382,2086.0,209200,2095.0,2073.0
765,2017/10/10,2101.0,2096.706,2087.0,299200,2106.0,2077.0
766,2017/10/11,2128.0,2124.22,2109.0,488200,2137.0,2106.0
767,2017/10/12,2193.0,2177.79,2150.0,1037600,2199.0,2150.0
768,2017/10/13,2188.0,2184.647,2172.0,427500,2201.0,2159.0
769,2017/10/16,2199.0,2203.127,2186.0,355000,2215.0,2172.0
770,2017/10/17,2215.0,2208.969,2200.0,553400,2230.0,2184.0
771,2017/10/18,2211.0,2206.97,2200.0,295900,2217.0,2195.0
772,2017/10/19,2214.0,2218.139,2205.0,495000,2232.0,2203.0
773,2017/10/20,2204.0,2207.807,2205.0,394900,2224.0,2194.0
774,2017/10/23,2217.0,2218.675,2228.0,293900,2228.0,2210.0
775,2017/10/24,2239.0,2240.994,2232.0,408600,2249.0,2230.0
776,2017/10/25,2202.0,2220.594,2250.0,425600,2251.0,2198.0
777,2017/10/26,2198.0,2199.182,2191.0,256100,2211.0,2187.0
778,2017/10/27,2236.0,2231.977,2215.0,257600,2242.0,2214.0
779,2017/10/30,2226.0,2221.726,2221.0,367400,2230.0,2205.0
780,2017/10/31,2225.0,2223.025,2232.0,291500,2241.0,2205.0
781,2017/11/01,2222.0,2223.288,2239.0,319900,2239.0,2213.0
782,2017/11/02,2254.0,2245.757,2223.0,291300,2263.0,2218.0
783,2017/11/06,2239.0,2243.663,2254.0,182400,2260.0,2235.0
784,2017/11/07,2281.0,2268.04,2244.0,354700,2282.0,2244.0
785,2017/11/08,2314.0,2299.675,2288.0,368000,2315.0,2279.0
786,2017/11/09,2294.0,2310.522,2310.0,579500,2334.0,2271.0
787,2017/11/10,2288.0,2276.789,2230.0,768700,2300.0,2230.0
788,2017/11/13,2292.0,2316.536,2338.0,723500,2345.0,2289.0
789,2017/11/14,2300.0,2303.481,2302.0,478000,2321.0,2295.0
790,2017/11/15,2236.0,2256.354,2292.0,558400,2303.0,2233.0
791,2017/11/16,2218.0,2221.683,2217.0,482100,2235.0,2210.0
792,2017/11/17,2229.0,2225.949,2231.0,476300,2235.0,2207.0
793,2017/11/20,2250.0,2244.723,2218.0,379400,2257.0,2218.0
794,2017/11/21,2260.0,2269.703,2275.0,342500,2289.0,2256.0
795,2017/11/22,2277.0,2282.162,2300.0,431800,2300.0,2267.0
796,2017/11/24,2277.0,2277.277,2279.0,308400,2293.0,2261.0
797,2017/11/27,2361.0,2345.647,2289.0,815000,2371.0,2289.0
798,2017/11/28,2309.0,2317.376,2360.0,389400,2360.0,2303.0
799,2017/11/29,2417.0,2385.579,2339.0,766100,2418.0,2333.0
800,2017/11/30,2456.0,2433.184,2419.0,848600,2458.0,2395.0
801,2017/12/01,2390.0,2394.896,2450.0,504600,2450.0,2374.0
802,2017/12/04,2371.0,2388.055,2396.0,278000,2408.0,2369.0
803,2017/12/05,2424.0,2415.3,2404.0,485000,2431.0,2389.0
804,2017/12/06,2401.0,2407.125,2442.0,557600,2443.0,2388.0
805,2017/12/07,2434.0,2438.28,2433.0,437300,2451.0,2417.0
806,2017/12/08,2442.0,2439.153,2439.0,529200,2454.0,2422.0
807,2017/12/11,2427.0,2425.784,2442.0,400800,2443.0,2414.0
808,2017/12/12,2445.0,2443.4,2435.0,281300,2458.0,2433.0
809,2017/12/13,2463.0,2459.27,2449.0,318800,2470.0,2440.0
810,2017/12/14,2534.0,2524.72,2513.0,720500,2551.0,2506.0
811,2017/12/15,2535.0,2531.909,2534.0,435900,2553.0,2506.0
812,2017/12/18,2560.0,2565.382,2563.0,511200,2587.0,2547.0
813,2017/12/19,2556.0,2557.057,2570.0,588100,2575.0,2530.0
814,2017/12/20,2505.0,2515.508,2526.0,415900,2537.0,2500.0
815,2017/12/21,2552.0,2541.793,2524.0,372100,2555.0,2518.0
816,2017/12/22,2544.0,2550.201,2552.0,316900,2565.0,2541.0
817,2017/12/25,2590.0,2575.594,2550.0,422800,2594.0,2545.0
818,2017/12/26,2593.0,2594.792,2591.0,262200,2607.0,2585.0
819,2017/12/27,2592.0,2595.502,2592.0,252200,2609.0,2586.0
820,2017/12/28,2555.0,2570.086,2596.0,331000,2599.0,2552.0
821,2017/12/29,2561.0,2559.606,2561.0,201800,2567.0,2550.0
822,2018/01/04,2600.0,2582.209,2583.0,295400,2600.0,2555.0
823,2018/01/05,2620.0,2609.409,2610.0,368400,2622.0,2587.0
824,2018/01/09,2652.0,2648.742,2626.0,441400,2664.0,2620.0
825,2018/01/10,2594.0,2582.433,2628.0,856300,2635.0,2541.0
826,2018/01/11,2602.0,2607.222,2602.0,705500,2647.0,2591.0
827,2018/01/12,2626.0,2631.902,2613.0,573300,2659.0,2607.0
828,2018/01/15,2692.0,2696.338,2669.0,697900,2717.0,2667.0
829,2018/01/16,2645.0,2652.467,2699.0,471500,2699.0,2636.0
830,2018/01/17,2677.0,2665.075,2645.0,500800,2684.0,2631.0
831,2018/01/18,2600.0,2630.095,2696.0,609500,2696.0,2599.0
832,2018/01/19,2597.0,2587.806,2598.0,565600,2604.0,2570.0
833,2018/01/22,2578.0,2574.846,2587.0,417600,2592.0,2561.0
834,2018/01/23,2631.0,2619.958,2601.0,448000,2635.0,2597.0
835,2018/01/24,2665.0,2664.972,2649.0,372400,2674.0,2646.0
836,2018/01/25,2669.0,2667.447,2663.0,253000,2675.0,2650.0
837,2018/01/26,2694.0,2702.834,2673.0,419400,2727.0,2666.0
838,2018/01/29,2715.0,2715.715,2709.0,363200,2726.0,2696.0
839,2018/01/30,2617.0,2620.738,2689.0,842500,2691.0,2595.0
840,2018/01/31,2595.0,2620.311,2602.0,407900,2657.0,2594.0
841,2018/02/01,2644.0,2634.72,2600.0,226600,2650.0,2600.0
842,2018/02/02,2651.0,2647.815,2650.0,219400,2664.0,2623.0
843,2018/02/05,2531.0,2553.278,2581.0,700100,2608.0,2524.0
844,2018/02/06,2447.0,2434.161,2415.0,683100,2458.0,2399.0
845,2018/02/07,2473.0,2508.824,2547.0,490300,2548.0,2471.0
846,2018/02/08,2477.0,2481.166,2469.0,999900,2505.0,2441.0
847,2018/02/09,2429.0,2396.468,2332.0,1158800,2432.0,2319.0
848,2018/02/13,2421.0,2430.087,2479.0,654100,2479.0,2402.0
849,2018/02/14,2353.0,2355.349,2420.0,669300,2421.0,2320.0
850,2018/02/15,2339.0,2347.496,2370.0,482500,2374.0,2323.0
851,2018/02/16,2341.0,2349.787,2353.0,646000,2368.0,2336.0
852,2018/02/19,2434.0,2414.463,2391.0,370100,2438.0,2381.0
853,2018/02/20,2419.0,2424.195,2440.0,244800,2462.0,2402.0
854,2018/02/21,2431.0,2424.453,2414.0,194700,2447.0,2396.0
855,2018/02/22,2415.0,2414.287,2420.0,226500,2430.0,2396.0
856,2018/02/23,2409.0,2406.858,2393.0,257700,2423.0,2392.0
857,2018/02/26,2425.0,2423.351,2432.0,307300,2439.0,2401.0
858,2018/02/27,2416.0,2409.836,2420.0,274500,2423.0,2398.0
859,2018/02/28,2417.0,2424.178,2408.0,350600,2438.0,2407.0
860,2018/03/01,2378.0,2381.704,2399.0,509400,2401.0,2371.0
861,2018/03/02,2342.0,2339.415,2330.0,393000,2358.0,2322.0
862,2018/03/05,2302.0,2307.037,2309.0,366500,2330.0,2298.0
863,2018/03/06,2344.0,2345.912,2320.0,289100,2363.0,2314.0
864,2018/03/07,2347.0,2347.917,2338.0,235200,2373.0,2328.0
865,2018/03/08,2362.0,2365.662,2385.0,258200,2388.0,2355.0
866,2018/03/09,2346.0,2358.636,2395.0,403800,2395.0,2336.0
867,2018/03/12,2368.0,2365.938,2384.0,220700,2385.0,2351.0
868,2018/03/13,2398.0,2383.102,2360.0,239500,2398.0,2358.0
869,2018/03/14,2374.0,2366.767,2382.0,248000,2387.0,2354.0
870,2018/03/15,2387.0,2380.6,2380.0,180900,2394.0,2353.0
871,2018/03/16,2358.0,2360.984,2387.0,432500,2387.0,2350.0
872,2018/03/19,2319.0,2326.756,2350.0,333300,2361.0,2312.0
873,2018/03/20,2311.0,2301.766,2317.0,375700,2317.0,2284.0
874,2018/03/22,2308.0,2302.639,2309.0,574100,2314.0,2289.0
875,2018/03/23,2222.0,2232.194,2224.0,925700,2269.0,2208.0
876,2018/03/26,2220.0,2203.163,2201.0,1084500,2220.0,2175.0
877,2018/03/27,2292.0,2259.931,2245.0,1149000,2292.0,2229.0
878,2018/03/28,2218.0,2228.91,2256.0,766500,2256.0,2197.0
879,2018/03/29,2231.0,2228.749,2232.0,478700,2243.0,2212.0
880,2018/03/30,2233.0,2231.802,2222.0,348300,2248.0,2222.0
881,2018/04/02,2199.0,2208.188,2214.0,372200,2222.0,2198.0
882,2018/04/03,2121.0,2141.791,2175.0,1009000,2186.0,2113.0
883,2018/04/04,2102.0,2101.52,2122.0,1210600,2126.0,2079.0
884,2018/04/05,2136.0,2137.082,2100.0,905700,2161.0,2079.0
885,2018/04/06,2124.0,2120.447,2125.0,652000,2139.0,2100.0
886,2018/04/09,2137.0,2128.902,2109.0,512700,2143.0,2106.0
887,2018/04/10,2121.0,2127.31,2130.0,388000,2142.0,2113.0
888,2018/04/11,2130.0,2127.563,2133.0,367800,2139.0,2102.0
889,2018/04/12,2133.0,2133.002,2131.0,324600,2143.0,2117.0
890,2018/04/13,2144.0,2141.581,2150.0,330800,2155.0,2128.0
891,2018/04/16,2174.0,2167.217,2152.0,399800,2178.0,2140.0
892,2018/04/17,2184.0,2183.75,2175.0,472700,2200.0,2155.0
893,2018/04/18,2206.0,2203.046,2184.0,219600,2210.0,2184.0
894,2018/04/19,2216.0,2216.836,2216.0,307100,2233.0,2203.0
895,2018/04/20,2244.0,2241.986,2204.0,417900,2255.0,2201.0
896,2018/04/23,2216.0,2215.526,2225.0,248400,2230.0,2204.0
897,2018/04/24,2235.0,2232.259,2228.0,204900,2247.0,2221.0
898,2018/04/25,2250.0,2245.299,2223.0,156700,2259.0,2217.0
899,2018/04/26,2252.0,2247.413,2260.0,256500,2260.0,2231.0
900,2018/04/27,2274.0,2271.138,2264.0,273900,2290.0,2251.0
901,2018/05/01,2272.0,2267.149,2279.0,195000,2280.0,2245.0
902,2018/05/02,2269.0,2265.903,2285.0,185000,2285.0,2252.0
903,2018/05/07,2321.0,2313.178,2285.0,361600,2325.0,2285.0
904,2018/05/08,2329.0,2330.3,2321.0,327800,2345.0,2317.0
905,2018/05/09,2311.0,2315.485,2331.0,300100,2337.0,2299.0
906,2018/05/10,2308.0,2307.059,2307.0,303400,2322.0,2292.0
907,2018/05/11,2297.0,2293.301,2273.0,306100,2304.0,2271.0
908,2018/05/14,2334.0,2304.226,2303.0,766100,2354.0,2251.0
909,2018/05/15,2314.0,2357.74,2380.0,882500,2410.0,2307.0
910,2018/05/16,2254.0,2260.583,2272.0,655400,2303.0,2236.0
911,2018/05/17,2213.0,2219.514,2244.0,460300,2247.0,2211.0
912,2018/05/18,2162.0,2154.883,2210.0,835100,2210.0,2127.0
913,2018/05/21,2127.0,2119.165,2150.0,774200,2150.0,2103.0
914,2018/05/22,2125.0,2116.739,2140.0,494400,2140.0,2109.0
915,2018/05/23,2111.0,2111.474,2110.0,600400,2118.0,2107.0
916,2018/05/24,2065.0,2075.187,2100.0,717400,2103.0,2054.0
917,2018/05/25,2061.0,2063.645,2060.0,389200,2082.0,2040.0
918,2018/05/28,2076.0,2065.022,2059.0,333200,2080.0,2044.0
919,2018/05/29,2035.0,2039.999,2074.0,412800,2074.0,2032.0
920,2018/05/30,2002.0,2003.511,2015.0,562400,2015.0,1998.0
921,2018/05/31,2002.0,2005.729,2022.0,529900,2023.0,1998.0
922,2018/06/01,2015.0,2010.862,2000.0,443300,2026.0,1989.0
923,2018/06/04,2041.0,2039.352,2034.0,322500,2049.0,2031.0
924,2018/06/05,2031.0,2029.973,2036.0,283800,2041.0,2022.0
925,2018/06/06,2044.0,2043.398,2024.0,299100,2058.0,2018.0
926,2018/06/07,2058.0,2058.062,2054.0,280300,2066.0,2044.0
927,2018/06/08,2052.0,2055.571,2052.0,343400,2073.0,2049.0
928,2018/06/11,2074.0,2075.439,2049.0,346000,2091.0,2049.0
929,2018/06/12,2103.0,2099.114,2098.0,269600,2108.0,2085.0
930,2018/06/13,2113.0,2115.67,2103.0,290000,2124.0,2097.0
931,2018/06/14,2101.0,2098.262,2090.0,398900,2110.0,2052.0
932,2018/06/15,2064.0,2073.218,2118.0,373600,2118.0,2056.0
933,2018/06/18,2044.0,2041.686,2061.0,319000,2072.0,2023.0
934,2018/06/19,2023.0,2039.117,2040.0,283600,2066.0,2023.0
935,2018/06/20,2016.0,2005.847,2031.0,410300,2034.0,1994.0
936,2018/06/21,1994.0,1999.34,2005.0,281500,2015.0,1994.0
937,2018/06/22,1986.0,1981.966,1992.0,394700,1994.0,1970.0
938,2018/06/25,1974.0,1980.174,1978.0,329500,1994.0,1964.0
939,2018/06/26,1978.0,1970.922,1963.0,317200,1981.0,1959.0
940,2018/06/27,1998.0,1993.67,1985.0,333000,2002.0,1980.0
941,2018/06/28,1979.0,1980.427,1998.0,277800,1998.0,1971.0
942,2018/06/29,1960.0,1955.824,1972.0,312800,1972.0,1946.0
943,2018/07/02,1889.0,1914.082,1946.0,516400,1946.0,1887.0
944,2018/07/03,1882.0,1887.765,1905.0,475400,1927.0,1868.0
945,2018/07/04,1890.0,1887.738,1875.0,478900,1898.0,1875.0
946,2018/07/05,1862.0,1871.313,1890.0,410100,1901.0,1855.0
947,2018/07/06,1844.0,1849.165,1880.0,574200,1882.0,1837.0
948,2018/07/09,1866.0,1851.022,1844.0,499300,1870.0,1825.0
949,2018/07/10,1877.0,1889.699,1883.0,373700,1914.0,1877.0
950,2018/07/11,1849.0,1852.682,1857.0,447200,1869.0,1847.0
951,2018/07/12,1871.0,1882.136,1863.0,363700,1903.0,1863.0
952,2018/07/13,1891.0,1891.454,1877.0,218700,1901.0,1877.0
953,2018/07/17,1925.0,1918.888,1887.0,359300,1932.0,1887.0
954,2018/07/18,1963.0,1974.993,1965.0,505200,1994.0,1959.0
955,2018/07/19,1965.0,1964.751,1980.0,432600,1987.0,1955.0
956,2018/07/20,2017.0,2003.553,1967.0,704200,2019.0,1962.0
957,2018/07/23,2015.0,2026.89,2033.0,440100,2052.0,2003.0
958,2018/07/24,2017.0,2021.748,2049.0,296700,2058.0,2002.0
959,2018/07/25,2019.0,2016.541,2033.0,275500,2038.0,2008.0
960,2018/07/26,2062.0,2055.089,2051.0,383900,2070.0,2040.0
961,2018/07/27,2057.0,2050.082,2060.0,240100,2062.0,2038.0
962,2018/07/30,2054.0,2052.106,2050.0,200500,2061.0,2038.0
963,2018/07/31,2046.0,2044.727,2058.0,207300,2061.0,2029.0
964,2018/08/01,2040.0,2049.196,2079.0,292600,2085.0,2036.0
965,2018/08/02,2013.0,2019.161,2036.0,311400,2047.0,2006.0
966,2018/08/03,1999.0,1997.603,2008.0,312300,2012.0,1987.0
967,2018/08/06,1971.0,1976.169,1971.0,363800,1992.0,1966.0
968,2018/08/07,1997.0,1986.819,1974.0,255100,1997.0,1966.0
969,2018/08/08,2004.0,2002.088,1999.0,434600,2018.0,1985.0
970,2018/08/09,1803.0,1822.669,1844.0,1847600,1866.0,1801.0
971,2018/08/10,1735.0,1760.162,1805.0,1447800,1808.0,1726.0
972,2018/08/13,1693.0,1694.547,1719.0,795100,1721.0,1686.0
973,2018/08/14,1717.0,1719.284,1710.0,440800,1730.0,1710.0
974,2018/08/15,1688.0,1693.398,1720.0,693100,1720.0,1677.0
975,2018/08/16,1656.0,1653.702,1662.0,675600,1663.0,1644.0
976,2018/08/17,1674.0,1663.61,1656.0,609300,1674.0,1638.0
977,2018/08/20,1690.0,1688.809,1675.0,384100,1697.0,1673.0
978,2018/08/21,1642.0,1648.919,1680.0,810200,1681.0,1638.0
979,2018/08/22,1662.0,1655.34,1643.0,328700,1664.0,1639.0
980,2018/08/23,1720.0,1706.764,1678.0,759000,1723.0,1678.0
981,2018/08/24,1797.0,1798.598,1800.0,1497500,1821.0,1772.0
982,2018/08/27,1789.0,1777.77,1770.0,886300,1789.0,1762.0
983,2018/08/28,1780.0,1784.654,1814.0,574800,1814.0,1767.0
984,2018/08/29,1784.0,1793.589,1781.0,388500,1807.0,1775.0
985,2018/08/30,1778.0,1771.722,1774.0,627500,1786.0,1753.0
986,2018/08/31,1798.0,1790.513,1755.0,585600,1806.0,1754.0
987,2018/09/03,1783.0,1787.691,1796.0,364900,1803.0,1772.0
988,2018/09/04,1794.0,1790.91,1783.0,429900,1800.0,1778.0
989,2018/09/05,1781.0,1783.588,1799.0,399100,1803.0,1770.0
990,2018/09/06,1777.0,1782.872,1785.0,587700,1798.0,1771.0
991,2018/09/07,1750.0,1746.519,1751.0,411600,1765.0,1735.0
992,2018/09/10,1766.0,1773.482,1765.0,553000,1794.0,1758.0
993,2018/09/11,1759.0,1762.026,1780.0,394200,1784.0,1754.0
994,2018/09/12,1745.0,1736.929,1754.0,346800,1754.0,1714.0
995,2018/09/13,1772.0,1776.786,1762.0,348800,1790.0,1758.0
996,2018/09/14,1775.0,1782.67,1784.0,269800,1796.0,1769.0
997,2018/09/18,1831.0,1817.124,1782.0,485000,1836.0,1772.0
998,2018/09/19,1869.0,1862.118,1853.0,493600,1874.0,1845.0
999,2018/09/20,1875.0,1875.393,1887.0,379600,1887.0,1865.0
1000,2018/09/21,1910.0,1908.182,1892.0,575900,1920.0,1892.0
1001,2018/09/25,1880.0,1875.712,1878.0,740400,1891.0,1856.0
1002,2018/09/26,1870.0,1850.82,1850.0,391800,1872.0,1827.0
1003,2018/09/27,1842.0,1852.578,1875.0,347200,1876.0,1836.0
1004,2018/09/28,1873.0,1877.33,1862.0,424200,1900.0,1847.0
1005,2018/10/01,1856.0,1856.133,1870.0,293300,1870.0,1845.0
1006,2018/10/02,1861.0,1861.614,1852.0,315300,1874.0,1848.0
1007,2018/10/03,1869.0,1872.677,1866.0,391500,1887.0,1858.0
1008,2018/10/04,1850.0,1847.277,1857.0,365300,1859.0,1832.0
1009,2018/10/05,1826.0,1833.953,1831.0,347700,1847.0,1824.0
1010,2018/10/09,1789.0,1795.49,1827.0,493900,1838.0,1781.0
1011,2018/10/10,1790.0,1802.942,1797.0,496900,1824.0,1787.0
1012,2018/10/11,1718.0,1721.251,1726.0,645700,1740.0,1710.0
1013,2018/10/12,1703.0,1701.732,1700.0,602200,1711.0,1685.0
1014,2018/10/15,1682.0,1689.476,1696.0,353100,1706.0,1681.0
1015,2018/10/16,1673.0,1674.818,1672.0,319900,1686.0,1669.0
1016,2018/10/17,1727.0,1714.957,1698.0,535000,1729.0,1682.0
1017,2018/10/18,1729.0,1732.836,1728.0,329400,1750.0,1720.0
1018,2018/10/19,1720.0,1715.159,1700.0,273500,1725.0,1695.0
1019,2018/10/22,1710.0,1707.325,1695.0,269900,1719.0,1690.0
1020,2018/10/23,1662.0,1674.483,1686.0,284300,1693.0,1661.0
1021,2018/10/24,1685.0,1680.345,1679.0,255200,1693.0,1663.0
1022,2018/10/25,1634.0,1642.86,1650.0,418900,1661.0,1633.0
1023,2018/10/26,1635.0,1636.961,1645.0,401900,1650.0,1626.0
1024,2018/10/29,1642.0,1646.58,1642.0,281700,1658.0,1634.0
1025,2018/10/30,1707.0,1692.844,1637.0,474800,1715.0,1633.0
1026,2018/10/31,1737.0,1726.612,1704.0,306600,1738.0,1696.0
1027,2018/11/01,1763.0,1757.485,1738.0,354500,1775.0,1730.0
1028,2018/11/02,1763.0,1756.219,1764.0,307700,1772.0,1738.0
1029,2018/11/05,1770.0,1770.877,1758.0,212400,1781.0,1754.0
1030,2018/11/06,1810.0,1802.668,1775.0,342900,1816.0,1769.0
1031,2018/11/07,1791.0,1811.492,1814.0,617200,1832.0,1782.0
1032,2018/11/08,1833.0,1845.131,1843.0,584200,1889.0,1822.0
1033,2018/11/09,1815.0,1792.344,1753.0,729600,1825.0,1742.0
1034,2018/11/12,1722.0,1743.684,1758.0,590000,1793.0,1717.0
1035,2018/11/13,1715.0,1705.0,1687.0,646900,1718.0,1682.0
1036,2018/11/14,1733.0,1733.379,1721.0,245400,1742.0,1717.0
1037,2018/11/15,1775.0,1758.423,1733.0,281400,1775.0,1724.0
1038,2018/11/16,1796.0,1795.829,1791.0,359900,1816.0,1776.0
1039,2018/11/19,1833.0,1824.113,1834.0,393800,1840.0,1797.0
1040,2018/11/20,1801.0,1801.774,1805.0,343800,1818.0,1792.0
1041,2018/11/21,1821.0,1810.4,1782.0,483600,1828.0,1780.0
1042,2018/11/22,1789.0,1791.758,1821.0,422400,1828.0,1771.0
1043,2018/11/26,1807.0,1803.664,1773.0,256900,1820.0,1769.0
1044,2018/11/27,1836.0,1837.075,1825.0,289700,1846.0,1814.0
1045,2018/11/28,1807.0,1815.402,1847.0,259200,1850.0,1807.0
1046,2018/11/29,1858.0,1851.28,1831.0,335900,1865.0,1825.0
1047,2018/11/30,1867.0,1863.389,1855.0,259400,1868.0,1848.0
1048,2018/12/03,1876.0,1873.527,1871.0,250500,1880.0,1859.0
1049,2018/12/04,1810.0,1821.6,1871.0,261100,1871.0,1806.0
1050,2018/12/05,1761.0,1765.209,1770.0,332200,1781.0,1756.0
1051,2018/12/06,1732.0,1736.366,1753.0,283300,1764.0,1724.0
1052,2018/12/07,1733.0,1726.843,1732.0,365900,1740.0,1706.0
1053,2018/12/10,1682.0,1698.267,1746.0,396200,1756.0,1677.0
1054,2018/12/11,1666.0,1674.835,1689.0,362500,1697.0,1658.0
1055,2018/12/12,1669.0,1666.683,1666.0,389200,1679.0,1656.0
1056,2018/12/13,1685.0,1684.904,1676.0,297100,1694.0,1672.0
1057,2018/12/14,1659.0,1666.242,1685.0,383600,1685.0,1644.0
1058,2018/12/17,1658.0,1661.899,1661.0,260200,1677.0,1655.0
1059,2018/12/18,1622.0,1628.31,1642.0,367200,1647.0,1618.0
1060,2018/12/19,1640.0,1631.781,1630.0,368800,1646.0,1618.0
1061,2018/12/20,1568.0,1578.67,1610.0,639000,1616.0,1559.0
1062,2018/12/21,1520.0,1524.813,1565.0,439000,1575.0,1506.0
1063,2018/12/25,1442.0,1438.313,1470.0,518500,1473.0,1421.0
1064,2018/12/26,1447.0,1449.468,1445.0,474400,1488.0,1423.0
1065,2018/12/27,1564.0,1546.348,1507.0,438900,1565.0,1502.0
1066,2018/12/28,1611.0,1597.663,1564.0,466600,1611.0,1561.0
1067,2019/01/04,1574.0,1555.984,1550.0,380400,1574.0,1528.0
1068,2019/01/07,1610.0,1615.742,1614.0,310800,1634.0,1608.0
1069,2019/01/08,1594.0,1596.445,1610.0,383800,1620.0,1583.0
1070,2019/01/09,1611.0,1614.03,1624.0,365800,1638.0,1600.0
1071,2019/01/10,1594.0,1595.24,1595.0,326600,1605.0,1587.0
1072,2019/01/11,1593.0,1593.256,1603.0,202600,1610.0,1584.0
1073,2019/01/15,1606.0,1598.985,1575.0,312600,1609.0,1569.0
1074,2019/01/16,1613.0,1620.51,1612.0,220600,1632.0,1607.0
1075,2019/01/17,1621.0,1629.307,1634.0,238100,1649.0,1617.0
1076,2019/01/18,1644.0,1646.101,1625.0,175900,1658.0,1625.0
1077,2019/01/21,1667.0,1673.368,1666.0,213300,1685.0,1655.0
1078,2019/01/22,1642.0,1647.259,1669.0,171100,1670.0,1637.0
1079,2019/01/23,1599.0,1604.181,1612.0,434800,1620.0,1591.0
1080,2019/01/24,1607.0,1602.318,1597.0,254100,1619.0,1579.0
1081,2019/01/25,1620.0,1616.86,1610.0,353500,1624.0,1607.0
1082,2019/01/28,1590.0,1597.505,1605.0,334100,1611.0,1590.0
1083,2019/01/29,1580.0,1579.736,1581.0,337800,1591.0,1571.0
1084,2019/01/30,1532.0,1545.524,1567.0,655500,1571.0,1530.0
1085,2019/01/31,1521.0,1531.547,1559.0,654800,1562.0,1519.0
1086,2019/02/01,1549.0,1546.536,1530.0,311900,1554.0,1530.0
1087,2019/02/04,1573.0,1565.088,1546.0,313800,1575.0,1545.0
1088,2019/02/05,1592.0,1598.563,1573.0,392600,1613.0,1573.0
1089,2019/02/06,1598.0,1597.739,1592.0,289000,1609.0,1586.0
1090,2019/02/07,1571.0,1570.219,1590.0,287900,1591.0,1557.0
1091,2019/02/08,1528.0,1532.653,1531.0,488900,1567.0,1522.0
1092,2019/02/12,1528.0,1530.526,1515.0,571300,1543.0,1515.0
1093,2019/02/13,1549.0,1550.721,1536.0,446000,1564.0,1535.0
1094,2019/02/14,1542.0,1559.144,1553.0,448900,1587.0,1542.0
1095,2019/02/15,1524.0,1521.988,1529.0,425900,1533.0,1511.0
1096,2019/02/18,1557.0,1553.46,1549.0,303700,1567.0,1534.0
1097,2019/02/19,1560.0,1560.494,1569.0,196600,1570.0,1552.0
1098,2019/02/20,1585.0,1578.429,1570.0,255300,1585.0,1565.0
1099,2019/02/21,1583.0,1583.91,1597.0,387300,1610.0,1571.0
1100,2019/02/22,1574.0,1569.004,1571.0,361100,1581.0,1551.0
1101,2019/02/25,1577.0,1574.405,1584.0,213100,1585.0,1568.0
1102,2019/02/26,1568.0,1570.786,1575.0,178400,1580.0,1563.0
1103,2019/02/27,1564.0,1566.553,1566.0,238400,1576.0,1562.0
1104,2019/02/28,1544.0,1553.962,1577.0,380800,1578.0,1543.0
1105,2019/03/01,1530.0,1523.833,1532.0,658400,1535.0,1514.0
1106,2019/03/04,1528.0,1537.093,1550.0,560100,1554.0,1525.0
1107,2019/03/05,1514.0,1518.733,1525.0,539800,1530.0,1512.0
1108,2019/03/06,1525.0,1525.602,1521.0,366200,1531.0,1517.0
1109,2019/03/07,1516.0,1517.788,1535.0,281400,1535.0,1507.0
1110,2019/03/08,1474.0,1482.512,1499.0,585200,1507.0,1467.0
1111,2019/03/11,1469.0,1473.656,1496.0,277000,1501.0,1458.0
1112,2019/03/12,1497.0,1498.563,1488.0,335400,1512.0,1485.0
1113,2019/03/13,1483.0,1488.114,1496.0,337500,1500.0,1478.0
1114,2019/03/14,1498.0,1500.334,1496.0,428700,1511.0,1493.0
1115,2019/03/15,1506.0,1506.342,1498.0,623600,1521.0,1497.0
1116,2019/03/18,1518.0,1512.103,1513.0,420500,1521.0,1498.0
1117,2019/03/19,1516.0,1515.404,1519.0,493100,1520.0,1504.0
1118,2019/03/20,1508.0,1507.114,1507.0,417600,1516.0,1502.0
1119,2019/03/22,1532.0,1515.44,1504.0,768500,1532.0,1501.0
1120,2019/03/25,1526.0,1514.6,1506.0,1298100,1528.0,1503.0
1121,2019/03/26,1589.0,1570.094,1545.0,2005700,1601.0,1535.0
1122,2019/03/27,1583.0,1576.94,1575.0,1105800,1595.0,1561.0
1123,2019/03/28,1497.0,1514.038,1561.0,708400,1564.0,1494.0
1124,2019/03/29,1500.0,1498.1,1510.0,374700,1510.0,1480.0
1125,2019/04/01,1546.0,1544.364,1519.0,428100,1555.0,1513.0
1126,2019/04/02,1535.0,1548.166,1570.0,295500,1577.0,1533.0
1127,2019/04/03,1536.0,1537.012,1535.0,206400,1544.0,1523.0
1128,2019/04/04,1560.0,1565.222,1548.0,341300,1579.0,1543.0
1129,2019/04/05,1569.0,1565.743,1570.0,239000,1578.0,1556.0
1130,2019/04/08,1551.0,1553.812,1570.0,198500,1576.0,1546.0
1131,2019/04/09,1539.0,1534.729,1550.0,191300,1552.0,1526.0
1132,2019/04/10,1537.0,1533.575,1526.0,161800,1539.0,1524.0
1133,2019/04/11,1563.0,1554.588,1541.0,230500,1569.0,1537.0
1134,2019/04/12,1558.0,1558.556,1560.0,181400,1564.0,1552.0
1135,2019/04/15,1581.0,1583.301,1578.0,263100,1594.0,1578.0
1136,2019/04/16,1572.0,1575.843,1579.0,150800,1588.0,1568.0
1137,2019/04/17,1579.0,1577.69,1579.0,158900,1583.0,1572.0
1138,2019/04/18,1553.0,1556.568,1570.0,177000,1573.0,1548.0
1139,2019/04/19,1566.0,1560.557,1563.0,103900,1566.0,1553.0
1140,2019/04/22,1571.0,1569.388,1562.0,139400,1577.0,1552.0
1141,2019/04/23,1564.0,1559.451,1558.0,192100,1567.0,1551.0
1142,2019/04/24,1567.0,1572.765,1576.0,256700,1585.0,1562.0
1143,2019/04/25,1595.0,1588.863,1572.0,375900,1603.0,1566.0
1144,2019/04/26,1550.0,1552.466,1587.0,379200,1587.0,1537.0
1145,2019/05/07,1528.0,1529.812,1547.0,317000,1547.0,1519.0
1146,2019/05/08,1496.0,1496.378,1506.0,342400,1509.0,1490.0
1147,2019/05/09,1474.0,1474.333,1480.0,341000,1486.0,1463.0
1148,2019/05/10,1488.0,1491.632,1475.0,266100,1507.0,1472.0
1149,2019/05/13,1491.0,1495.575,1480.0,335100,1516.0,1471.0
1150,2019/05/14,1519.0,1496.942,1450.0,377000,1520.0,1447.0
1151,2019/05/15,1529.0,1530.68,1520.0,495500,1555.0,1509.0
1152,2019/05/16,1597.0,1603.929,1548.0,1036000,1635.0,1548.0
1153,2019/05/17,1725.0,1705.6,1630.0,1235100,1733.0,1628.0
1154,2019/05/20,1760.0,1742.955,1704.0,752900,1766.0,1702.0
1155,2019/05/21,1763.0,1748.371,1727.0,484600,1767.0,1718.0
1156,2019/05/22,1722.0,1717.935,1747.0,757900,1755.0,1700.0
1157,2019/05/23,1748.0,1741.98,1729.0,428600,1753.0,1725.0
1158,2019/05/24,1752.0,1739.837,1735.0,470600,1752.0,1713.0
1159,2019/05/27,1731.0,1732.316,1736.0,373600,1749.0,1722.0
1160,2019/05/28,1733.0,1733.17,1730.0,824600,1750.0,1713.0
1161,2019/05/29,1737.0,1736.094,1721.0,410900,1752.0,1717.0
1162,2019/05/30,1699.0,1694.02,1700.0,395500,1701.0,1677.0
1163,2019/05/31,1682.0,1690.846,1694.0,343800,1704.0,1680.0
1164,2019/06/03,1676.0,1671.064,1653.0,301800,1683.0,1643.0
1165,2019/06/04,1680.0,1674.202,1680.0,294300,1683.0,1665.0
1166,2019/06/05,1686.0,1672.68,1681.0,539400,1686.0,1647.0
1167,2019/06/06,1689.0,1688.167,1682.0,315200,1703.0,1668.0
1168,2019/06/07,1708.0,1699.566,1699.0,251200,1708.0,1687.0
1169,2019/06/10,1727.0,1719.545,1730.0,316800,1739.0,1706.0
1170,2019/06/11,1704.0,1701.602,1718.0,343200,1718.0,1693.0
1171,2019/06/12,1676.0,1679.295,1697.0,410300,1697.0,1672.0
1172,2019/06/13,1661.0,1654.586,1665.0,450700,1673.0,1635.0
1173,2019/06/14,1666.0,1661.402,1672.0,428800,1678.0,1646.0
1174,2019/06/17,1644.0,1648.487,1666.0,389400,1673.0,1640.0
1175,2019/06/18,1625.0,1633.567,1638.0,350600,1657.0,1619.0
1176,2019/06/19,1648.0,1644.837,1633.0,290500,1654.0,1625.0
1177,2019/06/20,1659.0,1653.646,1646.0,264700,1663.0,1635.0
1178,2019/06/21,1656.0,1653.4,1665.0,360500,1665.0,1643.0
1179,2019/06/24,1638.0,1638.276,1644.0,187400,1645.0,1629.0
1180,2019/06/25,1644.0,1651.015,1650.0,317200,1665.0,1642.0
1181,2019/06/26,1632.0,1632.371,1619.0,326600,1647.0,1616.0
1182,2019/06/27,1655.0,1648.71,1652.0,246800,1658.0,1635.0
1183,2019/06/28,1649.0,1649.02,1657.0,409500,1667.0,1631.0
1184,2019/07/01,1659.0,1653.998,1664.0,366300,1671.0,1638.0
1185,2019/07/02,1663.0,1656.762,1653.0,364900,1666.0,1641.0
1186,2019/07/03,1646.0,1648.396,1647.0,253500,1663.0,1640.0
1187,2019/07/04,1680.0,1677.346,1667.0,300900,1684.0,1664.0
1188,2019/07/05,1688.0,1687.335,1694.0,261000,1697.0,1680.0
1189,2019/07/08,1658.0,1667.425,1683.0,192800,1688.0,1657.0
1190,2019/07/09,1638.0,1642.844,1655.0,184400,1664.0,1633.0
1191,2019/07/10,1625.0,1628.041,1649.0,291200,1649.0,1617.0
1192,2019/07/11,1622.0,1614.867,1617.0,269200,1624.0,1603.0
1193,2019/07/12,1619.0,1619.149,1616.0,227000,1629.0,1612.0
1194,2019/07/16,1618.0,1617.139,1620.0,195600,1623.0,1606.0
1195,2019/07/17,1633.0,1633.582,1624.0,281900,1649.0,1618.0
1196,2019/07/18,1589.0,1600.842,1618.0,374500,1621.0,1585.0
1197,2019/07/19,1617.0,1614.26,1605.0,220600,1621.0,1599.0
1198,2019/07/22,1562.0,1572.791,1593.0,336800,1595.0,1562.0
1199,2019/07/23,1582.0,1573.54,1567.0,280600,1585.0,1558.0
1200,2019/07/24,1599.0,1593.343,1586.0,347600,1602.0,1572.0
1201,2019/07/25,1578.0,1583.828,1603.0,211200,1605.0,1575.0
1202,2019/07/26,1599.0,1596.962,1590.0,366400,1607.0,1585.0
1203,2019/07/29,1600.0,1599.608,1600.0,199400,1604.0,1592.0
1204,2019/07/30,1624.0,1618.011,1614.0,254800,1626.0,1603.0
1205,2019/07/31,1588.0,1591.841,1608.0,328500,1610.0,1583.0
1206,2019/08/01,1579.0,1573.82,1567.0,331700,1585.0,1557.0
1207,2019/08/02,1560.0,1562.844,1560.0,431000,1584.0,1546.0
1208,2019/08/05,1535.0,1530.179,1545.0,370500,1552.0,1513.0
1209,2019/08/06,1534.0,1514.304,1482.0,371900,1539.0,1470.0
1210,2019/08/07,1551.0,1545.828,1517.0,496700,1558.0,1515.0
1211,2019/08/08,1547.0,1547.268,1538.0,551700,1564.0,1525.0
1212,2019/08/09,1548.0,1520.152,1525.0,845300,1556.0,1462.0
1213,2019/08/13,1548.0,1537.668,1525.0,592800,1555.0,1510.0
1214,2019/08/14,1577.0,1574.567,1554.0,586000,1589.0,1552.0
1215,2019/08/15,1575.0,1575.786,1568.0,423300,1586.0,1564.0
1216,2019/08/16,1579.0,1578.633,1572.0,463900,1593.0,1555.0
1217,2019/08/19,1624.0,1616.576,1602.0,415100,1625.0,1601.0
1218,2019/08/20,1650.0,1629.923,1630.0,552000,1650.0,1603.0
1219,2019/08/21,1649.0,1639.367,1650.0,400600,1652.0,1619.0
1220,2019/08/22,1676.0,1666.049,1655.0,459800,1676.0,1651.0
1221,2019/08/23,1693.0,1685.787,1687.0,410800,1696.0,1673.0
