,Date,Close,VWAP,Open,Volume,High,Low
0,2017/03/22,1680.0,1806.917,1867.0,5551200,1874.0,1651.0
1,2017/03/23,1805.0,1773.573,1650.0,1632700,1842.0,1640.0
2,2017/03/24,1753.0,1754.533,1820.0,726300,1845.0,1717.0
3,2017/03/27,1735.0,1728.754,1753.0,271900,1762.0,1707.0
4,2017/03/28,1719.0,1715.645,1750.0,261900,1750.0,1699.0
5,2017/03/29,1750.0,1712.062,1746.0,380700,1750.0,1667.0
6,2017/03/30,1822.0,1808.082,1790.0,624000,1836.0,1751.0
7,2017/03/31,1892.0,1880.014,1814.0,908800,1939.0,1766.0
8,2017/04/03,1801.0,1819.199,1865.0,243300,1889.0,1792.0
9,2017/04/04,1855.0,1848.559,1841.0,434800,1880.0,1805.0
10,2017/04/05,1891.0,1875.372,1845.0,279900,1900.0,1845.0
11,2017/04/06,1910.0,1893.596,1891.0,373900,1913.0,1873.0
12,2017/04/07,1888.0,1897.993,1920.0,233200,1927.0,1878.0
13,2017/04/10,1892.0,1881.719,1869.0,307500,1894.0,1841.0
14,2017/04/11,1910.0,1906.111,1892.0,366100,1918.0,1880.0
15,2017/04/12,1940.0,1920.115,1892.0,442400,1945.0,1889.0
16,2017/04/13,1939.0,1934.782,1920.0,468400,1950.0,1901.0
17,2017/04/14,1915.0,1919.375,1926.0,320500,1938.0,1900.0
18,2017/04/17,1905.0,1907.816,1875.0,175100,1920.0,1870.0
19,2017/04/18,1927.0,1927.384,1908.0,291600,1944.0,1904.0
20,2017/04/19,1926.0,1928.069,1921.0,195600,1947.0,1906.0
21,2017/04/20,1947.0,1939.29,1935.0,296000,1950.0,1921.0
22,2017/04/21,1951.0,1952.128,1928.0,631500,1972.0,1924.0
23,2017/04/24,1962.0,1959.231,1965.0,375400,1968.0,1945.0
24,2017/04/25,1935.0,1945.833,1959.0,387100,1960.0,1931.0
25,2017/04/26,1915.0,1917.948,1925.0,429600,1948.0,1858.0
26,2017/04/27,1950.0,1956.04,1923.0,2452900,1970.0,1923.0
27,2017/04/28,1954.0,1953.895,1965.0,434200,1969.0,1936.0
28,2017/05/01,1961.0,1967.117,1964.0,557900,1985.0,1951.0
29,2017/05/02,2000.0,1980.832,1970.0,953500,2000.0,1962.0
30,2017/05/08,1973.0,1981.0,2005.0,683100,2020.0,1952.0
31,2017/05/09,1958.0,1962.328,1963.0,317600,1987.0,1942.0
32,2017/05/10,1975.0,1974.013,1963.0,449800,1988.0,1958.0
33,2017/05/11,1999.0,1993.45,1989.0,521100,2001.0,1979.0
34,2017/05/12,1995.0,2008.146,2000.0,992400,2034.0,1970.0
35,2017/05/15,1992.0,1986.447,1996.0,203800,2002.0,1956.0
36,2017/05/16,1965.0,1969.943,1983.0,151400,1990.0,1959.0
37,2017/05/17,1951.0,1959.471,1958.0,267600,1968.0,1950.0
38,2017/05/18,1911.0,1911.768,1918.0,212600,1939.0,1894.0
39,2017/05/19,1973.0,1961.876,1912.0,302300,1976.0,1912.0
40,2017/05/22,1950.0,1962.86,1979.0,197100,1987.0,1949.0
41,2017/05/23,1968.0,1973.951,1970.0,217600,1982.0,1961.0
42,2017/05/24,1995.0,1986.973,1967.0,473200,2010.0,1937.0
43,2017/05/25,2081.0,2086.763,2070.0,1391700,2137.0,2060.0
44,2017/05/26,2065.0,2062.751,2078.0,249600,2090.0,2042.0
45,2017/05/29,2044.0,2049.547,2065.0,109100,2068.0,2040.0
46,2017/05/30,2052.0,2032.991,2030.0,181300,2055.0,2002.0
47,2017/05/31,2015.0,2014.856,2024.0,176700,2032.0,2004.0
48,2017/06/01,2027.0,2025.301,2014.0,228000,2040.0,2013.0
49,2017/06/02,2038.0,2035.376,2033.0,246300,2042.0,2022.0
50,2017/06/05,2070.0,2070.193,2050.0,303700,2086.0,2050.0
51,2017/06/06,2087.0,2076.684,2075.0,227900,2093.0,2064.0
52,2017/06/07,2171.0,2159.526,2093.0,1007500,2200.0,2090.0
53,2017/06/08,2245.0,2255.577,2189.0,1599000,2335.0,2153.0
54,2017/06/09,2363.0,2355.851,2290.0,1148200,2436.0,2288.0
55,2017/06/12,2304.0,2279.454,2310.0,376900,2315.0,2226.0
56,2017/06/13,2295.0,2335.823,2305.0,497400,2380.0,2291.0
57,2017/06/14,2222.0,2261.216,2301.0,206600,2312.0,2222.0
58,2017/06/15,2167.0,2174.554,2188.0,361400,2199.0,2142.0
59,2017/06/16,2182.0,2187.261,2167.0,225700,2209.0,2161.0
60,2017/06/19,2266.0,2265.197,2192.0,369800,2288.0,2190.0
61,2017/06/20,2447.0,2363.806,2271.0,815700,2447.0,2264.0
62,2017/06/21,2544.0,2525.764,2427.0,1093300,2580.0,2400.0
63,2017/06/22,2596.0,2560.327,2496.0,553200,2605.0,2470.0
64,2017/06/23,2522.0,2571.904,2601.0,436100,2635.0,2503.0
65,2017/06/26,2560.0,2549.495,2572.0,328800,2572.0,2512.0
66,2017/06/27,2567.0,2572.982,2600.0,219700,2615.0,2540.0
67,2017/06/28,2405.0,2452.046,2550.0,280900,2570.0,2402.0
68,2017/06/29,2380.0,2380.301,2436.0,293500,2440.0,2340.0
69,2017/06/30,2369.0,2361.154,2372.0,206400,2383.0,2331.0
70,2017/07/03,2465.0,2470.184,2430.0,370700,2500.0,2409.0
71,2017/07/04,2479.0,2497.272,2500.0,305800,2530.0,2459.0
72,2017/07/05,2457.0,2457.596,2460.0,126100,2482.0,2435.0
73,2017/07/06,2463.0,2475.056,2457.0,136600,2507.0,2454.0
74,2017/07/07,2546.0,2532.959,2463.0,473300,2567.0,2448.0
75,2017/07/10,2718.0,2684.117,2569.0,617600,2731.0,2567.0
76,2017/07/11,2616.0,2639.305,2697.0,282200,2697.0,2600.0
77,2017/07/12,2643.0,2647.053,2599.0,124000,2679.0,2590.0
78,2017/07/13,2675.0,2678.043,2683.0,134100,2708.0,2643.0
79,2017/07/14,2692.0,2685.079,2678.0,139600,2710.0,2651.0
80,2017/07/18,2667.0,2652.369,2697.0,197600,2697.0,2600.0
81,2017/07/19,2583.0,2604.557,2617.0,316500,2650.0,2576.0
82,2017/07/20,2797.0,2772.019,2648.0,1361700,3085.0,2637.0
83,2017/07/21,2683.0,2700.216,2731.0,339200,2750.0,2674.0
84,2017/07/24,2677.0,2666.588,2660.0,226500,2718.0,2595.0
85,2017/07/25,2714.0,2725.19,2700.0,129300,2765.0,2688.0
86,2017/07/26,2697.0,2707.994,2764.0,102200,2764.0,2674.0
87,2017/07/27,2596.0,2623.149,2677.0,241600,2682.0,2576.0
88,2017/07/28,2483.0,2511.825,2605.0,240400,2613.0,2469.0
89,2017/07/31,2497.0,2521.532,2483.0,201700,2580.0,2446.0
90,2017/08/01,2504.0,2527.431,2597.0,147200,2597.0,2489.0
91,2017/08/02,2588.0,2596.909,2511.0,216400,2644.0,2511.0
92,2017/08/03,2515.0,2505.695,2538.0,237500,2568.0,2455.0
93,2017/08/04,2507.0,2464.073,2471.0,251500,2507.0,2415.0
94,2017/08/07,2428.0,2451.526,2500.0,206400,2513.0,2412.0
95,2017/08/08,2492.0,2463.89,2445.0,182700,2498.0,2414.0
96,2017/08/09,2534.0,2517.899,2478.0,880900,2631.0,2320.0
97,2017/08/10,2568.0,2569.356,2600.0,281000,2610.0,2533.0
98,2017/08/14,2582.0,2554.902,2495.0,312500,2617.0,2452.0
99,2017/08/15,2574.0,2602.961,2592.0,280000,2640.0,2562.0
100,2017/08/16,2477.0,2499.889,2551.0,275400,2575.0,2472.0
101,2017/08/17,2398.0,2411.229,2477.0,489400,2490.0,2394.0
102,2017/08/18,2361.0,2360.438,2368.0,333700,2399.0,2344.0
103,2017/08/21,2358.0,2357.126,2361.0,217900,2398.0,2328.0
104,2017/08/22,2378.0,2381.645,2400.0,164300,2401.0,2350.0
105,2017/08/23,2375.0,2384.734,2395.0,172800,2408.0,2368.0
106,2017/08/24,2291.0,2315.177,2361.0,201100,2362.0,2288.0
107,2017/08/25,2267.0,2264.374,2260.0,138700,2280.0,2250.0
108,2017/08/28,2380.0,2382.636,2320.0,295600,2413.0,2319.0
109,2017/08/29,2412.0,2394.333,2332.0,101800,2414.0,2332.0
110,2017/08/30,2375.0,2413.777,2441.0,271300,2487.0,2361.0
111,2017/08/31,2361.0,2373.511,2408.0,155900,2419.0,2351.0
112,2017/09/01,2338.0,2337.281,2363.0,156800,2364.0,2311.0
113,2017/09/04,2321.0,2325.922,2333.0,141300,2359.0,2293.0
114,2017/09/05,2183.0,2197.792,2271.0,275000,2290.0,2157.0
115,2017/09/06,2293.0,2276.785,2162.0,378500,2344.0,2162.0
116,2017/09/07,2424.0,2405.202,2343.0,378100,2431.0,2326.0
117,2017/09/08,2499.0,2488.136,2435.0,530800,2530.0,2411.0
118,2017/09/11,2522.0,2519.042,2511.0,489900,2555.0,2489.0
119,2017/09/12,2504.0,2493.639,2549.0,288000,2549.0,2445.0
120,2017/09/13,2554.0,2554.731,2531.0,399800,2583.0,2485.0
121,2017/09/14,2618.0,2625.247,2560.0,608800,2670.0,2517.0
122,2017/09/15,2622.0,2622.467,2633.0,915700,2670.0,2599.0
123,2017/09/19,2673.0,2691.323,2670.0,547800,2738.0,2652.0
124,2017/09/20,2668.0,2665.697,2650.0,406000,2698.0,2625.0
125,2017/09/21,2535.0,2554.164,2651.0,672000,2678.0,2491.0
126,2017/09/22,2434.0,2431.401,2489.0,701800,2490.0,2382.0
127,2017/09/25,2447.0,2439.98,2449.0,191400,2469.0,2414.0
128,2017/09/26,2519.0,2514.355,2468.0,187100,2541.0,2451.0
129,2017/09/27,2495.0,2494.456,2500.0,99800,2511.0,2472.0
130,2017/09/28,2563.0,2581.416,2522.0,311700,2629.0,2506.0
131,2017/09/29,2551.0,2581.029,2564.0,289900,2625.0,2545.0
132,2017/10/02,2552.0,2572.751,2582.0,263800,2598.0,2549.0
133,2017/10/03,2725.0,2798.434,2800.0,1391400,2880.0,2714.0
134,2017/10/04,2766.0,2787.541,2790.0,629500,2824.0,2735.0
135,2017/10/05,2691.0,2701.437,2756.0,478000,2784.0,2671.0
136,2017/10/06,2702.0,2680.03,2691.0,309100,2721.0,2638.0
137,2017/10/10,2805.0,2810.217,2738.0,340300,2837.0,2738.0
138,2017/10/11,2895.0,2907.578,2900.0,587500,2933.0,2880.0
139,2017/10/12,2970.0,2969.015,2896.0,350600,3025.0,2889.0
140,2017/10/13,3160.0,3096.418,2971.0,487800,3175.0,2966.0
141,2017/10/16,3085.0,3096.333,3160.0,542900,3180.0,3035.0
142,2017/10/17,3105.0,3090.255,3060.0,282500,3145.0,3040.0
143,2017/10/18,3030.0,3040.168,3075.0,276100,3100.0,3005.0
144,2017/10/19,3020.0,3014.125,3005.0,219800,3065.0,2996.0
145,2017/10/20,3010.0,3013.654,2990.0,107500,3055.0,2990.0
146,2017/10/23,3130.0,3121.551,3040.0,195100,3170.0,3040.0
147,2017/10/24,3205.0,3204.37,3115.0,269900,3240.0,3115.0
148,2017/10/25,3165.0,3188.757,3200.0,187800,3250.0,3135.0
149,2017/10/26,3170.0,3177.873,3160.0,109300,3235.0,3145.0
150,2017/10/27,3325.0,3313.798,3240.0,204300,3350.0,3225.0
151,2017/10/30,3350.0,3327.743,3310.0,308400,3380.0,3290.0
152,2017/10/31,3410.0,3421.782,3390.0,291800,3500.0,3360.0
153,2017/11/01,3410.0,3401.757,3410.0,147700,3450.0,3355.0
154,2017/11/02,3205.0,3226.421,3430.0,596000,3445.0,3150.0
155,2017/11/06,3225.0,3230.973,3245.0,369100,3380.0,3180.0
156,2017/11/07,3285.0,3258.719,3220.0,160800,3300.0,3200.0
157,2017/11/08,3040.0,2932.19,2785.0,1535300,3075.0,2785.0
158,2017/11/09,3055.0,3061.959,3035.0,983300,3165.0,3000.0
159,2017/11/10,3020.0,3020.385,3000.0,493000,3075.0,2983.0
160,2017/11/13,2950.0,2966.181,3000.0,416800,3025.0,2934.0
161,2017/11/14,2940.0,2955.749,2922.0,486200,3015.0,2922.0
162,2017/11/15,2987.0,2980.818,2900.0,313000,3030.0,2893.0
163,2017/11/16,2842.0,2839.203,2929.0,457600,2947.0,2798.0
164,2017/11/17,2806.0,2791.342,2834.0,525400,2858.0,2722.0
165,2017/11/20,2791.0,2779.024,2756.0,403900,2818.0,2707.0
166,2017/11/21,2824.0,2776.854,2741.0,464800,2828.0,2682.0
167,2017/11/22,2834.0,2839.922,2800.0,303600,2880.0,2800.0
168,2017/11/24,2829.0,2829.289,2812.0,130600,2857.0,2790.0
169,2017/11/27,2833.0,2829.9,2800.0,381200,2878.0,2761.0
170,2017/11/28,2812.0,2827.419,2820.0,278700,2871.0,2791.0
171,2017/11/29,2897.0,2891.409,2848.0,322500,2927.0,2840.0
172,2017/11/30,2913.0,2911.702,2900.0,933400,2980.0,2845.0
173,2017/12/01,2904.0,2903.946,2925.0,205700,2975.0,2865.0
174,2017/12/04,2944.0,2965.552,2950.0,297100,2998.0,2932.0
175,2017/12/05,2942.0,2919.127,2952.0,231000,2972.0,2852.0
176,2017/12/06,2774.0,2795.779,2867.0,505700,2891.0,2727.0
177,2017/12/07,2790.0,2809.157,2800.0,466600,2847.0,2772.0
178,2017/12/08,2787.0,2754.823,2737.0,405900,2802.0,2702.0
179,2017/12/11,2767.0,2769.319,2792.0,119200,2815.0,2750.0
180,2017/12/12,2718.0,2718.9,2755.0,372900,2788.0,2700.0
181,2017/12/13,2693.0,2699.852,2750.0,271600,2787.0,2664.0
182,2017/12/14,2693.0,2674.052,2700.0,159600,2709.0,2644.0
183,2017/12/15,2635.0,2645.67,2680.0,270000,2680.0,2626.0
184,2017/12/18,2561.0,2583.405,2625.0,584100,2652.0,2553.0
185,2017/12/19,2611.0,2589.878,2548.0,453000,2640.0,2540.0
186,2017/12/20,2667.0,2668.115,2611.0,249800,2699.0,2611.0
187,2017/12/21,2607.0,2616.391,2655.0,212800,2681.0,2598.0
188,2017/12/22,2607.0,2631.896,2610.0,186000,2678.0,2605.0
189,2017/12/25,2631.0,2625.176,2607.0,93800,2649.0,2603.0
190,2017/12/26,2597.0,2607.773,2638.0,116300,2645.0,2590.0
191,2017/12/27,2660.0,2631.904,2591.0,155700,2665.0,2591.0
192,2017/12/28,2651.0,2651.981,2662.0,132400,2675.0,2635.0
193,2017/12/29,2693.0,2668.424,2660.0,170900,2695.0,2641.0
194,2018/01/04,2649.0,2684.691,2792.0,498400,2800.0,2635.0
195,2018/01/05,2737.0,2745.463,2663.0,558300,2793.0,2652.0
196,2018/01/09,2702.0,2708.931,2771.0,588800,2772.0,2689.0
197,2018/01/10,2757.0,2728.057,2705.0,314700,2772.0,2679.0
198,2018/01/11,2739.0,2732.775,2750.0,278300,2750.0,2711.0
199,2018/01/12,2715.0,2747.334,2750.0,464900,2778.0,2711.0
200,2018/01/15,2782.0,2790.212,2750.0,683500,2824.0,2739.0
201,2018/01/16,2772.0,2774.979,2792.0,320900,2800.0,2751.0
202,2018/01/17,2780.0,2777.901,2770.0,342700,2798.0,2740.0
203,2018/01/18,2696.0,2712.377,2800.0,446900,2809.0,2674.0
204,2018/01/19,2667.0,2667.145,2670.0,375400,2696.0,2652.0
205,2018/01/22,2761.0,2723.228,2674.0,356300,2765.0,2647.0
206,2018/01/23,2795.0,2792.908,2780.0,484300,2812.0,2764.0
207,2018/01/24,2748.0,2730.537,2796.0,413400,2799.0,2700.0
208,2018/01/25,2752.0,2766.133,2750.0,333200,2784.0,2730.0
209,2018/01/26,2726.0,2770.696,2760.0,307200,2804.0,2721.0
210,2018/01/29,2777.0,2750.848,2707.0,278700,2779.0,2683.0
211,2018/01/30,2775.0,2759.798,2778.0,1066200,2785.0,2714.0
212,2018/01/31,2779.0,2796.241,2775.0,474100,2848.0,2758.0
213,2018/02/01,2725.0,2708.681,2769.0,628100,2781.0,2660.0
214,2018/02/02,2751.0,2739.714,2725.0,478800,2785.0,2702.0
215,2018/02/05,2652.0,2657.67,2700.0,425700,2726.0,2603.0
216,2018/02/06,2666.0,2641.102,2600.0,1261200,2713.0,2571.0
217,2018/02/07,2585.0,2639.015,2698.0,853700,2744.0,2582.0
218,2018/02/08,2709.0,2701.229,2647.0,550200,2735.0,2642.0
219,2018/02/09,2635.0,2646.27,2650.0,504000,2722.0,2607.0
220,2018/02/13,2685.0,2671.82,2681.0,397100,2711.0,2619.0
221,2018/02/14,2729.0,2740.924,2700.0,466800,2778.0,2655.0
222,2018/02/15,2825.0,2811.673,2751.0,553500,2835.0,2744.0
223,2018/02/16,2921.0,2914.107,2850.0,517300,2955.0,2828.0
224,2018/02/19,3010.0,2994.653,2962.0,492500,3025.0,2952.0
225,2018/02/20,2940.0,2949.321,3000.0,460000,3000.0,2800.0
226,2018/02/21,2907.0,2915.93,2942.0,442800,2960.0,2872.0
227,2018/02/22,2883.0,2889.668,2900.0,283000,2935.0,2850.0
228,2018/02/23,2891.0,2875.867,2887.0,339800,2915.0,2845.0
229,2018/02/26,2895.0,2909.556,2900.0,317700,2949.0,2861.0
230,2018/02/27,2944.0,2938.041,2905.0,218800,2952.0,2851.0
231,2018/02/28,3005.0,2997.62,2912.0,333300,3050.0,2900.0
232,2018/03/01,2983.0,2984.186,3020.0,360200,3020.0,2933.0
233,2018/03/02,2937.0,2938.08,2948.0,424600,2980.0,2902.0
234,2018/03/05,2964.0,2951.6,2925.0,186100,2994.0,2915.0
235,2018/03/06,2922.0,2934.587,3000.0,139800,3000.0,2919.0
236,2018/03/07,3115.0,3073.118,2906.0,315200,3140.0,2905.0
237,2018/03/08,3120.0,3109.04,3100.0,258400,3145.0,3025.0
238,2018/03/09,3035.0,3118.082,3160.0,160800,3195.0,3030.0
239,2018/03/12,3085.0,3063.167,3045.0,178400,3105.0,2992.0
240,2018/03/13,3120.0,3104.468,3060.0,161900,3125.0,2970.0
241,2018/03/14,3160.0,3182.84,3120.0,169000,3275.0,3110.0
242,2018/03/15,3165.0,3136.475,3145.0,134900,3185.0,3075.0
243,2018/03/16,3135.0,3127.762,3175.0,89600,3175.0,3100.0
244,2018/03/19,3090.0,3055.779,3105.0,168900,3120.0,2972.0
245,2018/03/20,3155.0,3172.893,3160.0,264800,3220.0,3130.0
246,2018/03/22,3240.0,3242.84,3200.0,330500,3290.0,3150.0
247,2018/03/23,3140.0,3176.617,3175.0,171600,3215.0,3110.0
248,2018/03/26,3190.0,3164.542,3095.0,216100,3230.0,3040.0
249,2018/03/27,3060.0,3049.27,3165.0,377500,3195.0,2969.0
250,2018/03/28,3200.0,3152.389,3080.0,272500,3210.0,3060.0
251,2018/03/29,3255.0,3273.545,3200.0,289600,3370.0,3190.0
252,2018/03/30,3160.0,3166.248,3255.0,312200,3270.0,3085.0
253,2018/04/02,3175.0,3191.204,3200.0,184800,3245.0,3145.0
254,2018/04/03,3250.0,3231.446,3200.0,313900,3270.0,3180.0
255,2018/04/04,3130.0,3149.871,3210.0,263300,3225.0,3110.0
256,2018/04/05,2972.0,2952.062,3035.0,631000,3035.0,2865.0
257,2018/04/06,2989.0,3008.474,3020.0,234900,3095.0,2959.0
258,2018/04/09,3100.0,3116.075,3075.0,376200,3205.0,3035.0
259,2018/04/10,3010.0,3034.107,3105.0,174300,3130.0,2997.0
260,2018/04/11,2953.0,2974.027,3010.0,234200,3060.0,2950.0
261,2018/04/12,2888.0,2910.847,2918.0,256800,2971.0,2872.0
262,2018/04/13,2911.0,2909.558,2890.0,147000,2929.0,2869.0
263,2018/04/16,2808.0,2801.357,2895.0,354500,2895.0,2760.0
264,2018/04/17,2751.0,2777.85,2787.0,331900,2855.0,2738.0
265,2018/04/18,2837.0,2837.071,2740.0,378600,2870.0,2740.0
266,2018/04/19,2802.0,2805.517,2843.0,215000,2864.0,2773.0
267,2018/04/20,2928.0,2924.279,2852.0,307400,2970.0,2852.0
268,2018/04/23,2914.0,2918.796,2917.0,124800,2940.0,2885.0
269,2018/04/24,2936.0,2920.974,2910.0,205300,2942.0,2874.0
270,2018/04/25,2905.0,2909.094,2906.0,299300,2964.0,2891.0
271,2018/04/26,2882.0,2888.933,2905.0,698800,2919.0,2844.0
272,2018/04/27,2953.0,2944.778,2945.0,262200,2963.0,2910.0
273,2018/05/01,2772.0,2808.305,2952.0,669000,2975.0,2727.0
274,2018/05/02,2784.0,2770.296,2765.0,283100,2795.0,2727.0
275,2018/05/07,2669.0,2675.316,2732.0,449400,2739.0,2614.0
276,2018/05/08,2768.0,2724.304,2680.0,332600,2780.0,2663.0
277,2018/05/09,2631.0,2718.456,2900.0,1046600,2935.0,2609.0
278,2018/05/10,2641.0,2649.746,2676.0,532100,2722.0,2616.0
279,2018/05/11,2685.0,2660.749,2680.0,377300,2693.0,2602.0
280,2018/05/14,2538.0,2551.653,2610.0,648400,2666.0,2483.0
281,2018/05/15,2636.0,2612.447,2538.0,380400,2665.0,2537.0
282,2018/05/16,2729.0,2707.084,2602.0,391000,2750.0,2602.0
283,2018/05/17,2736.0,2741.26,2772.0,94200,2775.0,2723.0
284,2018/05/18,2659.0,2666.736,2734.0,143500,2734.0,2638.0
285,2018/05/21,2683.0,2682.203,2659.0,78700,2704.0,2654.0
286,2018/05/22,2684.0,2676.456,2687.0,52600,2689.0,2658.0
287,2018/05/23,2626.0,2607.619,2657.0,257200,2657.0,2563.0
288,2018/05/24,2602.0,2595.865,2612.0,312300,2639.0,2548.0
289,2018/05/25,2528.0,2535.641,2552.0,149300,2562.0,2522.0
290,2018/05/28,2464.0,2473.872,2504.0,337000,2529.0,2458.0
291,2018/05/29,2493.0,2488.191,2456.0,183100,2504.0,2456.0
292,2018/05/30,2474.0,2449.916,2450.0,240700,2482.0,2408.0
293,2018/05/31,2558.0,2536.659,2450.0,589800,2585.0,2435.0
294,2018/06/01,2455.0,2479.759,2575.0,158800,2575.0,2450.0
295,2018/06/04,2466.0,2447.278,2461.0,189700,2485.0,2421.0
296,2018/06/05,2490.0,2494.344,2469.0,116700,2518.0,2469.0
297,2018/06/06,2468.0,2487.628,2534.0,143900,2537.0,2436.0
298,2018/06/07,2406.0,2408.63,2467.0,448500,2471.0,2390.0
299,2018/06/08,2393.0,2380.664,2406.0,381700,2411.0,2332.0
300,2018/06/11,2414.0,2429.864,2385.0,302000,2466.0,2381.0
301,2018/06/12,2514.0,2510.146,2480.0,338200,2545.0,2445.0
302,2018/06/13,2500.0,2507.435,2520.0,228800,2545.0,2472.0
303,2018/06/14,2554.0,2569.258,2521.0,324900,2646.0,2479.0
304,2018/06/15,2500.0,2563.247,2588.0,668000,2666.0,2499.0
305,2018/06/18,2577.0,2567.642,2510.0,425600,2613.0,2474.0
306,2018/06/19,2631.0,2629.873,2550.0,558800,2691.0,2506.0
307,2018/06/20,2644.0,2627.536,2655.0,294700,2688.0,2551.0
308,2018/06/21,2673.0,2670.123,2635.0,162100,2695.0,2610.0
309,2018/06/22,2712.0,2704.319,2650.0,391600,2730.0,2634.0
310,2018/06/25,2666.0,2736.476,2770.0,380500,2851.0,2649.0
311,2018/06/26,2687.0,2715.73,2740.0,260600,2778.0,2670.0
312,2018/06/27,2717.0,2706.426,2630.0,128800,2740.0,2593.0
313,2018/06/28,2731.0,2709.773,2716.0,86800,2739.0,2650.0
314,2018/06/29,2725.0,2719.067,2681.0,109800,2740.0,2680.0
315,2018/07/02,2673.0,2694.79,2700.0,171500,2721.0,2666.0
316,2018/07/03,2576.0,2580.043,2673.0,370900,2714.0,2510.0
317,2018/07/04,2629.0,2614.449,2600.0,108800,2664.0,2550.0
318,2018/07/05,2515.0,2546.569,2619.0,73000,2619.0,2506.0
319,2018/07/06,2546.0,2536.049,2517.0,111900,2572.0,2501.0
320,2018/07/09,2689.0,2670.411,2560.0,153400,2728.0,2557.0
321,2018/07/10,2734.0,2747.782,2665.0,319500,2781.0,2665.0
322,2018/07/11,2687.0,2677.944,2734.0,323700,2734.0,2600.0
323,2018/07/12,2815.0,2805.022,2730.0,391600,2833.0,2727.0
324,2018/07/13,2725.0,2748.723,2820.0,262400,2840.0,2678.0
325,2018/07/17,2670.0,2699.519,2700.0,221900,2748.0,2661.0
326,2018/07/18,2641.0,2639.184,2671.0,333700,2700.0,2612.0
327,2018/07/19,2835.0,2792.932,2669.0,468700,2858.0,2640.0
328,2018/07/20,2733.0,2737.085,2820.0,217800,2840.0,2682.0
329,2018/07/23,2695.0,2691.157,2687.0,180500,2740.0,2636.0
330,2018/07/24,2640.0,2653.288,2705.0,307800,2760.0,2611.0
331,2018/07/25,2690.0,2665.542,2650.0,235900,2699.0,2622.0
332,2018/07/26,2709.0,2710.277,2689.0,160900,2743.0,2642.0
333,2018/07/27,2696.0,2675.042,2700.0,174400,2725.0,2646.0
334,2018/07/30,2651.0,2670.171,2695.0,183400,2716.0,2643.0
335,2018/07/31,2630.0,2616.678,2651.0,196100,2678.0,2580.0
336,2018/08/01,2558.0,2569.195,2600.0,168400,2626.0,2555.0
337,2018/08/02,2517.0,2522.844,2551.0,175800,2575.0,2504.0
338,2018/08/03,2432.0,2456.169,2514.0,123500,2515.0,2428.0
339,2018/08/06,2483.0,2475.201,2441.0,247500,2503.0,2425.0
340,2018/08/07,2488.0,2438.642,2478.0,436500,2512.0,2386.0
341,2018/08/08,2586.0,2681.706,2738.0,758400,2768.0,2573.0
342,2018/08/09,2633.0,2547.732,2556.0,461900,2643.0,2492.0
343,2018/08/10,2641.0,2669.133,2623.0,204200,2718.0,2592.0
344,2018/08/13,2607.0,2634.608,2645.0,172500,2715.0,2577.0
345,2018/08/14,2705.0,2698.998,2654.0,251800,2719.0,2650.0
346,2018/08/15,2634.0,2635.79,2700.0,177500,2700.0,2594.0
347,2018/08/16,2619.0,2636.736,2640.0,183200,2675.0,2602.0
348,2018/08/17,2642.0,2645.906,2655.0,71400,2680.0,2611.0
349,2018/08/20,2689.0,2687.889,2642.0,128200,2715.0,2642.0
350,2018/08/21,2669.0,2694.533,2676.0,194300,2731.0,2647.0
351,2018/08/22,2669.0,2686.608,2642.0,332400,2744.0,2626.0
352,2018/08/23,2674.0,2686.397,2700.0,102300,2739.0,2660.0
353,2018/08/24,2860.0,2808.727,2699.0,433200,2876.0,2699.0
354,2018/08/27,2895.0,2878.461,2863.0,238400,2923.0,2793.0
355,2018/08/28,2791.0,2815.431,2855.0,132000,2896.0,2779.0
356,2018/08/29,2738.0,2744.358,2796.0,175700,2796.0,2723.0
357,2018/08/30,2685.0,2713.912,2750.0,159700,2766.0,2684.0
358,2018/08/31,2687.0,2676.851,2666.0,185800,2702.0,2659.0
359,2018/09/03,2708.0,2710.231,2697.0,182300,2730.0,2690.0
360,2018/09/04,2627.0,2666.206,2711.0,347800,2715.0,2621.0
361,2018/09/05,2577.0,2556.853,2600.0,397200,2601.0,2522.0
362,2018/09/06,2525.0,2547.061,2549.0,277400,2582.0,2521.0
363,2018/09/07,2452.0,2477.422,2500.0,164300,2515.0,2446.0
364,2018/09/10,2524.0,2526.172,2472.0,257000,2556.0,2472.0
365,2018/09/11,2481.0,2481.214,2500.0,146600,2500.0,2465.0
366,2018/09/12,2483.0,2458.872,2500.0,166800,2503.0,2409.0
367,2018/09/13,2454.0,2451.193,2498.0,226300,2521.0,2422.0
368,2018/09/14,2484.0,2458.81,2456.0,242200,2489.0,2426.0
369,2018/09/18,2429.0,2426.46,2480.0,234900,2480.0,2403.0
370,2018/09/19,2435.0,2427.106,2450.0,216500,2477.0,2394.0
371,2018/09/20,2458.0,2473.807,2435.0,228600,2510.0,2435.0
372,2018/09/21,2443.0,2446.815,2474.0,274100,2478.0,2428.0
373,2018/09/25,2465.0,2456.601,2440.0,449000,2492.0,2416.0
374,2018/09/26,2534.0,2528.78,2500.0,412600,2556.0,2473.0
375,2018/09/27,2454.0,2450.855,2511.0,271500,2513.0,2420.0
376,2018/09/28,2405.0,2395.476,2425.0,596600,2425.0,2357.0
377,2018/10/01,2494.0,2478.248,2401.0,412600,2504.0,2398.0
378,2018/10/02,2467.0,2519.833,2524.0,305000,2595.0,2460.0
379,2018/10/03,2500.0,2503.768,2478.0,442400,2538.0,2475.0
380,2018/10/04,2519.0,2527.866,2505.0,281400,2558.0,2494.0
381,2018/10/05,2444.0,2460.985,2481.0,237500,2507.0,2421.0
382,2018/10/09,2382.0,2388.755,2430.0,406700,2435.0,2352.0
383,2018/10/10,2508.0,2488.609,2419.0,369700,2523.0,2406.0
384,2018/10/11,2341.0,2373.829,2394.0,371300,2445.0,2340.0
385,2018/10/12,2344.0,2322.559,2320.0,285400,2350.0,2281.0
386,2018/10/15,2332.0,2341.68,2344.0,143300,2360.0,2321.0
387,2018/10/16,2293.0,2287.617,2320.0,137100,2328.0,2262.0
388,2018/10/17,2344.0,2336.493,2343.0,188700,2355.0,2318.0
389,2018/10/18,2337.0,2355.801,2368.0,171200,2401.0,2328.0
390,2018/10/19,2337.0,2329.553,2335.0,186400,2374.0,2306.0
391,2018/10/22,2271.0,2287.882,2300.0,200100,2318.0,2259.0
392,2018/10/23,2180.0,2163.399,2222.0,621900,2231.0,2109.0
393,2018/10/24,2302.0,2279.896,2230.0,448300,2335.0,2191.0
394,2018/10/25,2145.0,2165.807,2227.0,290000,2240.0,2137.0
395,2018/10/26,2056.0,2081.952,2164.0,292700,2180.0,2036.0
396,2018/10/29,2025.0,2050.371,2055.0,425000,2141.0,2010.0
397,2018/10/30,2098.0,2054.805,2005.0,483600,2112.0,2000.0
398,2018/10/31,2240.0,2210.409,2171.0,260400,2244.0,2154.0
399,2018/11/01,2149.0,2149.767,2200.0,221000,2222.0,2110.0
400,2018/11/02,2170.0,2157.691,2146.0,116000,2179.0,2128.0
401,2018/11/05,2167.0,2178.331,2172.0,147600,2206.0,2154.0
402,2018/11/06,2148.0,2148.312,2180.0,122000,2193.0,2112.0
403,2018/11/07,2206.0,2200.563,2164.0,326800,2240.0,2155.0
404,2018/11/08,2247.0,2180.759,2106.0,664700,2259.0,2086.0
405,2018/11/09,2194.0,2194.514,2234.0,250700,2246.0,2155.0
406,2018/11/12,1952.0,2028.882,2145.0,485300,2145.0,1950.0
407,2018/11/13,1939.0,1943.525,1923.0,341500,1996.0,1897.0
408,2018/11/14,1839.0,1851.53,1901.0,545200,1914.0,1832.0
409,2018/11/15,1844.0,1848.985,1819.0,213900,1879.0,1810.0
410,2018/11/16,1759.0,1754.644,1844.0,716100,1887.0,1700.0
411,2018/11/19,1808.0,1805.141,1759.0,341200,1840.0,1748.0
412,2018/11/20,1746.0,1754.618,1760.0,159100,1782.0,1740.0
413,2018/11/21,1690.0,1701.707,1706.0,343300,1736.0,1676.0
414,2018/11/22,1723.0,1706.839,1674.0,188300,1737.0,1674.0
415,2018/11/26,1762.0,1750.565,1703.0,171900,1783.0,1693.0
416,2018/11/27,1726.0,1725.904,1751.0,233200,1789.0,1705.0
417,2018/11/28,1757.0,1750.696,1715.0,80600,1780.0,1715.0
418,2018/11/29,1766.0,1768.638,1770.0,183900,1783.0,1752.0
419,2018/11/30,1781.0,1796.355,1799.0,309100,1857.0,1768.0
420,2018/12/03,1822.0,1809.199,1785.0,193300,1847.0,1760.0
421,2018/12/04,1821.0,1859.069,1800.0,384000,1917.0,1790.0
422,2018/12/05,1803.0,1815.565,1768.0,297800,1849.0,1768.0
423,2018/12/06,1808.0,1825.633,1859.0,372300,1885.0,1788.0
424,2018/12/07,1723.0,1729.26,1802.0,410400,1834.0,1703.0
425,2018/12/10,1660.0,1677.286,1684.0,192800,1712.0,1657.0
426,2018/12/11,1600.0,1602.984,1670.0,271100,1673.0,1582.0
427,2018/12/12,1665.0,1669.248,1603.0,265800,1710.0,1603.0
428,2018/12/13,1721.0,1717.613,1660.0,143300,1747.0,1655.0
429,2018/12/14,1691.0,1686.853,1709.0,200700,1712.0,1654.0
430,2018/12/17,1621.0,1636.379,1686.0,182700,1688.0,1611.0
431,2018/12/18,1547.0,1546.81,1566.0,245900,1574.0,1523.0
432,2018/12/19,1527.0,1543.833,1535.0,319200,1599.0,1501.0
433,2018/12/20,1459.0,1479.773,1505.0,332400,1525.0,1453.0
434,2018/12/21,1436.0,1437.515,1440.0,748700,1473.0,1412.0
435,2018/12/25,1357.0,1378.75,1364.0,283900,1410.0,1350.0
436,2018/12/26,1397.0,1404.601,1345.0,177400,1441.0,1345.0
437,2018/12/27,1467.0,1462.775,1455.0,129100,1489.0,1439.0
438,2018/12/28,1430.0,1416.01,1436.0,136400,1448.0,1391.0
439,2019/01/04,1410.0,1413.993,1400.0,251100,1452.0,1372.0
440,2019/01/07,1497.0,1501.163,1461.0,228500,1526.0,1460.0
441,2019/01/08,1529.0,1521.824,1510.0,257000,1555.0,1494.0
442,2019/01/09,1476.0,1499.238,1544.0,150200,1544.0,1472.0
443,2019/01/10,1445.0,1457.23,1496.0,138100,1496.0,1436.0
444,2019/01/11,1521.0,1517.556,1464.0,396600,1566.0,1447.0
445,2019/01/15,1562.0,1568.803,1561.0,310900,1590.0,1536.0
446,2019/01/16,1564.0,1577.643,1599.0,236500,1634.0,1548.0
447,2019/01/17,1567.0,1566.766,1565.0,134000,1604.0,1548.0
448,2019/01/18,1690.0,1670.6,1645.0,527000,1695.0,1616.0
449,2019/01/21,1606.0,1638.604,1739.0,427500,1739.0,1601.0
450,2019/01/22,1574.0,1581.744,1615.0,247100,1622.0,1562.0
451,2019/01/23,1580.0,1559.654,1542.0,401200,1590.0,1524.0
452,2019/01/24,1605.0,1577.558,1548.0,183800,1609.0,1531.0
453,2019/01/25,1638.0,1636.276,1600.0,399300,1661.0,1586.0
454,2019/01/28,1583.0,1587.681,1649.0,483100,1649.0,1568.0
455,2019/01/29,1538.0,1521.14,1569.0,447800,1569.0,1487.0
456,2019/01/30,1527.0,1533.4,1545.0,1121500,1588.0,1516.0
457,2019/01/31,1546.0,1559.723,1557.0,430800,1594.0,1536.0
458,2019/02/01,1596.0,1574.601,1560.0,368500,1605.0,1532.0
459,2019/02/04,1600.0,1604.174,1600.0,334600,1627.0,1587.0
460,2019/02/05,1656.0,1629.859,1624.0,480800,1665.0,1595.0
461,2019/02/06,1588.0,1591.793,1666.0,347500,1666.0,1568.0
462,2019/02/07,1544.0,1550.232,1599.0,519400,1609.0,1527.0
463,2019/02/08,1502.0,1512.381,1539.0,538800,1561.0,1483.0
464,2019/02/12,1598.0,1566.287,1524.0,431600,1609.0,1507.0
465,2019/02/13,1392.0,1334.99,1418.0,1999000,1430.0,1247.0
466,2019/02/14,1351.0,1390.979,1434.0,1259600,1447.0,1322.0
467,2019/02/15,1366.0,1359.122,1310.0,753800,1389.0,1310.0
468,2019/02/18,1379.0,1376.325,1384.0,244200,1396.0,1362.0
469,2019/02/19,1395.0,1396.346,1376.0,386200,1411.0,1375.0
470,2019/02/20,1385.0,1382.958,1400.0,372200,1408.0,1360.0
471,2019/02/21,1395.0,1396.047,1389.0,405000,1406.0,1385.0
472,2019/02/22,1396.0,1386.278,1394.0,350800,1401.0,1366.0
473,2019/02/25,1379.0,1374.891,1388.0,316700,1398.0,1357.0
474,2019/02/26,1377.0,1382.885,1392.0,555300,1408.0,1358.0
475,2019/02/27,1442.0,1422.71,1390.0,842400,1449.0,1387.0
476,2019/02/28,1407.0,1427.944,1437.0,294900,1459.0,1400.0
477,2019/03/01,1437.0,1431.511,1406.0,214000,1443.0,1404.0
478,2019/03/04,1445.0,1440.629,1437.0,182700,1452.0,1430.0
479,2019/03/05,1429.0,1442.49,1444.0,279800,1475.0,1420.0
480,2019/03/06,1445.0,1431.868,1418.0,178500,1450.0,1404.0
481,2019/03/07,1380.0,1386.564,1430.0,214600,1430.0,1369.0
482,2019/03/08,1410.0,1387.276,1352.0,375100,1417.0,1352.0
483,2019/03/11,1398.0,1389.679,1395.0,196200,1409.0,1360.0
484,2019/03/12,1410.0,1407.187,1412.0,176800,1427.0,1395.0
485,2019/03/13,1408.0,1405.011,1415.0,163500,1424.0,1392.0
486,2019/03/14,1425.0,1421.382,1408.0,145800,1432.0,1400.0
487,2019/03/15,1383.0,1393.556,1430.0,191300,1430.0,1380.0
488,2019/03/18,1409.0,1406.931,1406.0,190600,1414.0,1384.0
489,2019/03/19,1408.0,1403.584,1410.0,126300,1415.0,1383.0
490,2019/03/20,1425.0,1414.423,1400.0,127700,1427.0,1396.0
491,2019/03/22,1426.0,1408.548,1420.0,238500,1427.0,1390.0
492,2019/03/25,1369.0,1375.341,1391.0,196500,1391.0,1362.0
493,2019/03/26,1335.0,1345.443,1374.0,299300,1383.0,1326.0
494,2019/03/27,1321.0,1309.527,1329.0,346400,1331.0,1293.0
495,2019/03/28,1349.0,1335.921,1329.0,220900,1356.0,1310.0
496,2019/03/29,1334.0,1331.45,1340.0,200100,1355.0,1314.0
497,2019/04/01,1364.0,1361.973,1358.0,526500,1383.0,1342.0
498,2019/04/02,1416.0,1417.673,1388.0,510300,1441.0,1388.0
499,2019/04/03,1459.0,1451.302,1420.0,347900,1467.0,1420.0
500,2019/04/04,1397.0,1416.812,1466.0,391000,1467.0,1393.0
501,2019/04/05,1441.0,1433.898,1410.0,425500,1453.0,1409.0
502,2019/04/08,1505.0,1499.068,1471.0,489600,1517.0,1471.0
503,2019/04/09,1453.0,1473.114,1518.0,794900,1542.0,1442.0
504,2019/04/10,1386.0,1384.665,1409.0,581900,1419.0,1368.0
505,2019/04/11,1345.0,1348.945,1370.0,268000,1385.0,1334.0
506,2019/04/12,1367.0,1376.043,1368.0,432600,1401.0,1359.0
507,2019/04/15,1379.0,1384.691,1390.0,221600,1400.0,1372.0
508,2019/04/16,1371.0,1383.425,1388.0,227200,1400.0,1368.0
509,2019/04/17,1403.0,1397.222,1379.0,310000,1412.0,1375.0
510,2019/04/18,1333.0,1354.025,1394.0,481500,1403.0,1327.0
511,2019/04/19,1350.0,1357.871,1363.0,158100,1377.0,1347.0
512,2019/04/22,1302.0,1308.764,1349.0,300400,1349.0,1293.0
513,2019/04/23,1295.0,1295.241,1305.0,348400,1317.0,1275.0
514,2019/04/24,1286.0,1297.221,1310.0,164500,1316.0,1284.0
515,2019/04/25,1302.0,1288.436,1289.0,200400,1306.0,1265.0
516,2019/04/26,1271.0,1269.915,1302.0,301700,1302.0,1255.0
517,2019/05/07,1257.0,1263.485,1271.0,215900,1282.0,1246.0
518,2019/05/08,1247.0,1242.945,1240.0,249700,1258.0,1214.0
519,2019/05/09,1204.0,1209.524,1232.0,238700,1232.0,1202.0
520,2019/05/10,1215.0,1206.791,1201.0,478400,1234.0,1181.0
521,2019/05/13,1184.0,1202.126,1221.0,357500,1234.0,1178.0
522,2019/05/14,1367.0,1343.039,1304.0,1436800,1370.0,1276.0
523,2019/05/15,1399.0,1398.478,1386.0,683100,1426.0,1371.0
524,2019/05/16,1462.0,1446.263,1406.0,618100,1470.0,1405.0
525,2019/05/17,1432.0,1443.997,1461.0,449800,1461.0,1414.0
526,2019/05/20,1400.0,1377.758,1412.0,468500,1415.0,1322.0
527,2019/05/21,1302.0,1299.972,1351.0,708500,1361.0,1267.0
528,2019/05/22,1315.0,1322.16,1308.0,260200,1335.0,1308.0
529,2019/05/23,1281.0,1262.191,1301.0,533000,1301.0,1237.0
530,2019/05/24,1247.0,1248.702,1260.0,364400,1268.0,1217.0
531,2019/05/27,1220.0,1224.37,1253.0,384600,1256.0,1212.0
532,2019/05/28,1245.0,1222.557,1213.0,954800,1249.0,1177.0
533,2019/05/29,1222.0,1217.446,1211.0,523900,1236.0,1188.0
534,2019/05/30,1236.0,1225.994,1221.0,176600,1248.0,1209.0
535,2019/05/31,1238.0,1229.479,1228.0,248500,1241.0,1205.0
536,2019/06/03,1183.0,1196.365,1210.0,378800,1214.0,1180.0
537,2019/06/04,1205.0,1192.638,1199.0,440700,1208.0,1175.0
538,2019/06/05,1210.0,1210.338,1228.0,281300,1229.0,1197.0
539,2019/06/06,1171.0,1183.503,1206.0,332100,1216.0,1166.0
540,2019/06/07,1195.0,1190.761,1172.0,277400,1200.0,1172.0
541,2019/06/10,1169.0,1175.206,1201.0,408100,1208.0,1158.0
542,2019/06/11,1163.0,1161.865,1165.0,405900,1179.0,1152.0
543,2019/06/12,1165.0,1169.291,1160.0,186100,1180.0,1157.0
544,2019/06/13,1120.0,1133.922,1160.0,486800,1175.0,1110.0
545,2019/06/14,1144.0,1147.13,1129.0,435700,1168.0,1119.0
546,2019/06/17,1154.0,1149.656,1145.0,236400,1166.0,1134.0
547,2019/06/18,1140.0,1147.164,1154.0,263600,1171.0,1135.0
548,2019/06/19,1186.0,1191.201,1160.0,404000,1208.0,1159.0
549,2019/06/20,1237.0,1226.662,1205.0,490100,1247.0,1192.0
550,2019/06/21,1230.0,1239.828,1264.0,449100,1264.0,1221.0
551,2019/06/24,1252.0,1248.112,1233.0,240400,1263.0,1218.0
552,2019/06/25,1237.0,1255.912,1261.0,416600,1288.0,1233.0
553,2019/06/26,1209.0,1208.025,1223.0,312100,1225.0,1182.0
554,2019/06/27,1250.0,1235.131,1209.0,395300,1253.0,1204.0
555,2019/06/28,1293.0,1278.651,1263.0,406800,1296.0,1250.0
556,2019/07/01,1293.0,1289.177,1309.0,369000,1309.0,1276.0
557,2019/07/02,1320.0,1325.415,1300.0,373200,1344.0,1293.0
558,2019/07/03,1323.0,1316.993,1313.0,260900,1330.0,1298.0
559,2019/07/04,1366.0,1361.537,1336.0,269800,1378.0,1330.0
560,2019/07/05,1386.0,1376.321,1358.0,316800,1392.0,1341.0
561,2019/07/08,1392.0,1396.41,1385.0,284300,1415.0,1378.0
562,2019/07/09,1344.0,1358.132,1372.0,343600,1390.0,1336.0
563,2019/07/10,1326.0,1333.18,1330.0,340400,1361.0,1325.0
564,2019/07/11,1279.0,1280.0,1317.0,458900,1318.0,1256.0
565,2019/07/12,1300.0,1312.207,1291.0,495300,1338.0,1283.0
566,2019/07/16,1278.0,1284.321,1282.0,275700,1313.0,1270.0
567,2019/07/17,1293.0,1283.029,1274.0,316900,1298.0,1259.0
568,2019/07/18,1264.0,1255.913,1280.0,317500,1282.0,1235.0
569,2019/07/19,1278.0,1280.165,1264.0,177200,1299.0,1264.0
570,2019/07/22,1245.0,1254.299,1277.0,157400,1282.0,1240.0
571,2019/07/23,1283.0,1276.469,1257.0,153000,1288.0,1249.0
572,2019/07/24,1282.0,1283.014,1292.0,136900,1307.0,1266.0
573,2019/07/25,1280.0,1271.711,1265.0,153800,1289.0,1252.0
574,2019/07/26,1290.0,1286.506,1286.0,135700,1298.0,1270.0
575,2019/07/29,1284.0,1287.257,1284.0,105100,1310.0,1275.0
576,2019/07/30,1297.0,1290.473,1293.0,131100,1298.0,1277.0
577,2019/07/31,1275.0,1272.768,1280.0,166400,1287.0,1262.0
578,2019/08/01,1271.0,1277.414,1277.0,158600,1298.0,1263.0
579,2019/08/02,1252.0,1248.49,1250.0,217000,1259.0,1236.0
580,2019/08/05,1194.0,1195.473,1228.0,290700,1230.0,1179.0
581,2019/08/06,1195.0,1183.325,1164.0,300300,1196.0,1146.0
582,2019/08/07,1204.0,1200.644,1200.0,457800,1229.0,1177.0
583,2019/08/08,1015.0,1023.13,1084.0,1839200,1084.0,994.0
584,2019/08/09,1001.0,1005.221,1015.0,621200,1025.0,997.0
585,2019/08/13,978.0,977.736,987.0,529200,999.0,961.0
586,2019/08/14,987.0,974.542,987.0,594700,987.0,955.0
587,2019/08/15,954.0,953.807,956.0,412300,977.0,949.0
588,2019/08/16,926.0,930.401,942.0,536500,944.0,920.0
589,2019/08/19,924.0,922.747,930.0,544800,934.0,910.0
590,2019/08/20,914.0,911.164,916.0,622500,925.0,900.0
591,2019/08/21,942.0,932.5,913.0,466300,954.0,910.0
592,2019/08/22,913.0,916.826,935.0,406300,938.0,905.0
593,2019/08/23,913.0,911.742,903.0,248900,922.0,894.0
