ds,yhat
2019-08-22,3653.133763151294
2019-08-23,3615.219077877542
2019-08-26,3498.250111343414
2019-08-27,3469.971972047657
2019-08-28,3457.573426215678
2019-08-29,3453.789160004767
2019-08-30,3442.034678565162
2019-09-02,3321.039676099326
2019-09-03,3306.460396346686
2019-09-04,3323.33079005547
2019-09-05,3354.036311347537
2019-09-06,3372.354734616539
2019-09-09,3314.042656425974
2019-09-10,3314.7223381638128
2019-09-11,3340.8633791054635
2019-09-12,3379.2295089293243
2019-09-13,3415.017300415912
2019-09-17,3546.31752158752
2019-09-18,3583.847978887984
2019-09-19,3611.645343446909
2019-09-20,3630.102904986994
