,Date,Close,VWAP,Open,Volume,High,Low
0,2014/08/25,1927.0,1918.662,1837.0,575400,1979.0,1825.0
1,2014/08/26,1847.0,1880.605,1949.0,362500,1949.0,1835.0
2,2014/08/27,1858.0,1851.619,1845.0,128500,1875.0,1832.0
3,2014/08/28,1818.0,1832.466,1864.0,214200,1895.0,1811.0
4,2014/08/29,1828.0,1825.556,1820.0,110000,1842.0,1808.0
5,2014/09/01,1820.0,1819.438,1817.0,141000,1844.0,1811.0
6,2014/09/02,1797.0,1806.115,1827.0,138400,1828.0,1780.0
7,2014/09/03,1811.0,1805.552,1803.0,106400,1830.0,1782.0
8,2014/09/04,1807.0,1811.07,1803.0,81800,1827.0,1797.0
9,2014/09/05,1794.0,1802.545,1821.0,106700,1821.0,1789.0
10,2014/09/08,1835.0,1825.196,1805.0,83200,1854.0,1795.0
11,2014/09/09,1829.0,1839.841,1850.0,68400,1865.0,1825.0
12,2014/09/10,1828.0,1821.942,1811.0,88200,1838.0,1805.0
13,2014/09/11,1825.0,1819.712,1830.0,68000,1836.0,1808.0
14,2014/09/12,1874.0,1865.363,1840.0,200800,1884.0,1829.0
15,2014/09/16,1879.0,1883.362,1880.0,102600,1903.0,1857.0
16,2014/09/17,1866.0,1878.366,1871.0,133500,1905.0,1859.0
17,2014/09/18,1857.0,1849.743,1828.0,109800,1876.0,1825.0
18,2014/09/19,1915.0,1905.934,1876.0,185500,1923.0,1876.0
19,2014/09/22,1946.0,1943.764,1925.0,186700,1963.0,1915.0
20,2014/09/24,1953.0,1961.034,1946.0,171700,1988.0,1935.0
21,2014/09/25,1959.0,1954.579,1984.0,107700,1984.0,1925.0
22,2014/09/26,1930.0,1915.734,1910.0,103300,1949.0,1880.0
23,2014/09/29,1911.0,1912.691,1945.0,51200,1945.0,1888.0
24,2014/09/30,1791.0,1800.289,1882.0,284700,1885.0,1775.0
25,2014/10/01,1771.0,1769.774,1806.0,144300,1807.0,1747.0
26,2014/10/02,1700.0,1712.211,1731.0,137600,1743.0,1699.0
27,2014/10/03,1768.0,1747.606,1701.0,99800,1775.0,1701.0
28,2014/10/06,1797.0,1789.169,1775.0,47300,1807.0,1759.0
29,2014/10/07,1751.0,1765.012,1771.0,75400,1789.0,1747.0
30,2014/10/08,1727.0,1722.539,1702.0,52100,1738.0,1702.0
31,2014/10/09,1695.0,1704.786,1727.0,69200,1734.0,1695.0
32,2014/10/10,1667.0,1659.536,1665.0,75200,1672.0,1647.0
33,2014/10/14,1667.0,1657.272,1626.0,100100,1678.0,1625.0
34,2014/10/15,1631.0,1636.907,1660.0,138400,1680.0,1606.0
35,2014/10/16,1591.0,1597.535,1592.0,97900,1612.0,1583.0
36,2014/10/17,1603.0,1604.986,1592.0,106000,1627.0,1586.0
37,2014/10/20,1659.0,1656.56,1658.0,44100,1669.0,1642.0
38,2014/10/21,1635.0,1645.406,1659.0,95400,1662.0,1628.0
39,2014/10/22,1723.0,1699.362,1675.0,97900,1723.0,1664.0
40,2014/10/23,1702.0,1713.799,1709.0,79200,1733.0,1693.0
41,2014/10/24,1716.0,1728.762,1742.0,59700,1747.0,1709.0
42,2014/10/27,1729.0,1735.237,1719.0,63600,1752.0,1704.0
43,2014/10/28,1738.0,1739.075,1719.0,56000,1754.0,1714.0
44,2014/10/29,1742.0,1744.673,1733.0,32100,1759.0,1728.0
45,2014/10/30,1746.0,1752.419,1739.0,42200,1768.0,1739.0
46,2014/10/31,1795.0,1777.001,1750.0,84700,1799.0,1743.0
47,2014/11/04,1813.0,1825.383,1825.0,116200,1838.0,1810.0
48,2014/11/05,1891.0,1864.798,1813.0,127000,1897.0,1810.0
49,2014/11/06,1853.0,1865.691,1884.0,58900,1890.0,1846.0
50,2014/11/07,1854.0,1849.251,1853.0,51500,1857.0,1835.0
51,2014/11/10,1770.0,1765.599,1800.0,132300,1806.0,1742.0
52,2014/11/11,1753.0,1747.665,1765.0,101800,1770.0,1732.0
53,2014/11/12,1740.0,1748.982,1753.0,94600,1761.0,1740.0
54,2014/11/13,1720.0,1717.523,1731.0,84600,1736.0,1701.0
55,2014/11/14,1695.0,1691.286,1713.0,125500,1719.0,1670.0
56,2014/11/17,1669.0,1684.796,1696.0,71200,1702.0,1667.0
57,2014/11/18,1710.0,1689.04,1666.0,67400,1715.0,1666.0
58,2014/11/19,1683.0,1693.801,1701.0,43600,1718.0,1682.0
59,2014/11/20,1687.0,1694.734,1698.0,23300,1707.0,1683.0
60,2014/11/21,1739.0,1717.281,1687.0,78900,1742.0,1685.0
61,2014/11/25,1735.0,1745.938,1779.0,43200,1779.0,1734.0
62,2014/11/26,1747.0,1748.472,1740.0,40700,1756.0,1738.0
63,2014/11/27,1739.0,1744.645,1751.0,39700,1759.0,1735.0
64,2014/11/28,1743.0,1744.568,1739.0,48400,1756.0,1737.0
65,2014/12/01,1728.0,1730.485,1743.0,46200,1743.0,1723.0
66,2014/12/02,1736.0,1728.344,1718.0,50900,1738.0,1718.0
67,2014/12/03,1791.0,1784.94,1730.0,132400,1811.0,1725.0
68,2014/12/04,1788.0,1793.601,1808.0,29300,1808.0,1777.0
69,2014/12/05,1792.0,1790.063,1795.0,23700,1795.0,1777.0
70,2014/12/08,1783.0,1789.517,1800.0,35000,1802.0,1780.0
71,2014/12/09,1780.0,1780.853,1760.0,35300,1799.0,1757.0
72,2014/12/10,1752.0,1759.512,1766.0,38900,1774.0,1747.0
73,2014/12/11,1726.0,1729.484,1741.0,33300,1748.0,1722.0
74,2014/12/12,1725.0,1731.497,1725.0,81100,1750.0,1723.0
75,2014/12/15,1752.0,1728.036,1722.0,53300,1761.0,1704.0
76,2014/12/16,1684.0,1694.965,1733.0,81800,1734.0,1683.0
77,2014/12/17,1683.0,1688.487,1683.0,38400,1708.0,1675.0
78,2014/12/18,1698.0,1706.885,1718.0,43400,1725.0,1695.0
79,2014/12/19,1706.0,1709.376,1713.0,33500,1721.0,1698.0
80,2014/12/22,1706.0,1703.563,1703.0,35700,1712.0,1695.0
81,2014/12/24,1702.0,1705.147,1706.0,100200,1727.0,1683.0
82,2014/12/25,1704.0,1698.45,1709.0,41300,1709.0,1690.0
83,2014/12/26,1712.0,1713.009,1691.0,42700,1726.0,1691.0
84,2014/12/29,1704.0,1714.927,1724.0,43600,1730.0,1701.0
85,2014/12/30,1703.0,1712.556,1718.0,52900,1722.0,1700.0
86,2015/01/05,1755.0,1742.602,1717.0,72400,1767.0,1702.0
87,2015/01/06,1719.0,1724.271,1730.0,49900,1732.0,1715.0
88,2015/01/07,1735.0,1731.537,1705.0,48600,1752.0,1705.0
89,2015/01/08,1775.0,1772.961,1756.0,73600,1788.0,1756.0
90,2015/01/09,1790.0,1790.791,1788.0,58700,1807.0,1778.0
91,2015/01/13,1809.0,1801.729,1791.0,96600,1825.0,1783.0
92,2015/01/14,1773.0,1790.413,1815.0,64200,1822.0,1763.0
93,2015/01/15,1782.0,1779.398,1770.0,22600,1791.0,1769.0
94,2015/01/16,1744.0,1741.377,1763.0,61500,1773.0,1726.0
95,2015/01/19,1778.0,1775.379,1760.0,48800,1787.0,1760.0
96,2015/01/20,1825.0,1814.694,1794.0,91200,1827.0,1778.0
97,2015/01/21,1794.0,1800.213,1832.0,37100,1832.0,1791.0
98,2015/01/22,1792.0,1784.948,1804.0,57700,1804.0,1764.0
99,2015/01/23,1833.0,1822.693,1817.0,61200,1834.0,1802.0
100,2015/01/26,1824.0,1822.552,1809.0,29700,1832.0,1809.0
101,2015/01/27,1841.0,1848.204,1835.0,56000,1864.0,1835.0
102,2015/01/28,1817.0,1818.7,1821.0,37000,1830.0,1804.0
103,2015/01/29,1812.0,1817.253,1839.0,30400,1839.0,1805.0
104,2015/01/30,1813.0,1815.878,1840.0,36000,1840.0,1807.0
105,2015/02/02,1807.0,1800.26,1808.0,48400,1812.0,1786.0
106,2015/02/03,1827.0,1829.806,1830.0,83400,1840.0,1819.0
107,2015/02/04,1813.0,1821.715,1823.0,55000,1845.0,1809.0
108,2015/02/05,1857.0,1844.045,1830.0,93100,1882.0,1801.0
109,2015/02/06,1840.0,1836.915,1860.0,44800,1860.0,1824.0
110,2015/02/09,1798.0,1798.46,1780.0,103700,1835.0,1770.0
111,2015/02/10,1832.0,1840.715,1833.0,65500,1858.0,1819.0
112,2015/02/12,1885.0,1873.742,1843.0,101600,1892.0,1823.0
113,2015/02/13,1849.0,1860.992,1880.0,79200,1894.0,1844.0
114,2015/02/16,1877.0,1885.555,1850.0,59300,1907.0,1850.0
115,2015/02/17,1916.0,1909.023,1889.0,113100,1929.0,1887.0
116,2015/02/18,1904.0,1919.586,1930.0,109300,1956.0,1900.0
117,2015/02/19,1948.0,1944.729,1944.0,88900,1954.0,1922.0
118,2015/02/20,1951.0,1952.534,1940.0,57900,1968.0,1933.0
119,2015/02/23,1985.0,1987.115,1973.0,88700,2006.0,1973.0
120,2015/02/24,2006.0,2007.701,1985.0,106000,2031.0,1983.0
121,2015/02/25,2000.0,2008.677,2006.0,52000,2024.0,1997.0
122,2015/02/26,2021.0,2018.807,2000.0,59100,2030.0,1999.0
123,2015/02/27,1976.0,1993.471,2028.0,83800,2028.0,1968.0
124,2015/03/02,2002.0,1995.364,1975.0,67900,2017.0,1963.0
125,2015/03/03,1966.0,1980.673,1994.0,75600,2015.0,1957.0
126,2015/03/04,1967.0,1965.954,1963.0,62600,1985.0,1946.0
127,2015/03/05,1981.0,1983.843,1966.0,56500,1995.0,1966.0
128,2015/03/06,2015.0,2004.799,1995.0,63700,2020.0,1985.0
129,2015/03/09,2017.0,2009.815,1999.0,58300,2022.0,1990.0
130,2015/03/10,2027.0,2028.525,2025.0,61300,2041.0,2011.0
131,2015/03/11,2011.0,2002.331,2001.0,54700,2020.0,1971.0
132,2015/03/12,2043.0,2046.157,2022.0,72700,2062.0,2022.0
133,2015/03/13,2053.0,2062.832,2062.0,111600,2097.0,2032.0
134,2015/03/16,2102.0,2094.371,2070.0,84700,2115.0,2069.0
135,2015/03/17,2128.0,2123.984,2110.0,78700,2139.0,2106.0
136,2015/03/18,2167.0,2152.477,2127.0,69400,2171.0,2121.0
137,2015/03/19,2221.0,2208.462,2160.0,139100,2245.0,2158.0
138,2015/03/20,2174.0,2177.024,2201.0,80200,2211.0,2157.0
139,2015/03/23,2133.0,2134.351,2153.0,81600,2153.0,2120.0
140,2015/03/24,2126.0,2131.226,2132.0,40700,2161.0,2120.0
141,2015/03/25,2131.0,2126.615,2150.0,38400,2150.0,2111.0
142,2015/03/26,2103.0,2107.884,2102.0,68200,2127.0,2085.0
143,2015/03/27,2053.0,2076.966,2090.0,55900,2120.0,2040.0
144,2015/03/30,2045.0,2021.106,2013.0,84200,2058.0,1988.0
145,2015/03/31,2083.0,2078.677,2045.0,75500,2102.0,2040.0
146,2015/04/01,2067.0,2055.936,2051.0,85400,2079.0,2034.0
147,2015/04/02,2069.0,2069.692,2051.0,32800,2082.0,2051.0
148,2015/04/03,2092.0,2073.529,2067.0,31400,2092.0,2052.0
149,2015/04/06,2075.0,2069.735,2070.0,24500,2079.0,2060.0
150,2015/04/07,2059.0,2060.486,2066.0,56400,2097.0,2047.0
151,2015/04/08,2177.0,2169.205,2096.0,201200,2208.0,2086.0
152,2015/04/09,2119.0,2138.11,2157.0,68500,2176.0,2115.0
153,2015/04/10,2124.0,2107.485,2116.0,78500,2133.0,2070.0
154,2015/04/13,2139.0,2133.992,2133.0,36100,2159.0,2093.0
155,2015/04/14,2166.0,2153.43,2152.0,31400,2167.0,2134.0
156,2015/04/15,2172.0,2174.351,2148.0,54700,2195.0,2142.0
157,2015/04/16,2227.0,2211.586,2172.0,88800,2232.0,2172.0
158,2015/04/17,2224.0,2222.997,2228.0,86100,2259.0,2194.0
159,2015/04/20,2245.0,2253.389,2210.0,94700,2286.0,2204.0
160,2015/04/21,2203.0,2221.819,2250.0,66900,2268.0,2196.0
161,2015/04/22,2214.0,2219.289,2203.0,39100,2238.0,2195.0
162,2015/04/23,2206.0,2217.376,2239.0,23400,2246.0,2202.0
163,2015/04/24,2164.0,2166.292,2183.0,67500,2194.0,2153.0
164,2015/04/27,2174.0,2168.551,2151.0,20700,2180.0,2150.0
165,2015/04/28,2174.0,2159.024,2134.0,45600,2187.0,2134.0
166,2015/04/30,2130.0,2134.288,2120.0,41300,2154.0,2120.0
167,2015/05/01,2150.0,2143.846,2139.0,55900,2163.0,2124.0
168,2015/05/07,2164.0,2180.781,2165.0,77700,2216.0,2152.0
169,2015/05/08,2174.0,2177.401,2164.0,100200,2216.0,2146.0
170,2015/05/11,2149.0,2151.237,2174.0,81600,2200.0,2111.0
171,2015/05/12,2159.0,2151.925,2149.0,48100,2163.0,2133.0
172,2015/05/13,2206.0,2196.221,2159.0,57000,2215.0,2146.0
173,2015/05/14,2195.0,2191.642,2200.0,29900,2204.0,2177.0
174,2015/05/15,2263.0,2257.78,2214.0,80600,2280.0,2201.0
175,2015/05/18,2217.0,2216.428,2231.0,54500,2263.0,2205.0
176,2015/05/19,2234.0,2241.927,2239.0,38300,2258.0,2230.0
177,2015/05/20,2259.0,2269.586,2250.0,74400,2295.0,2250.0
178,2015/05/21,2232.0,2248.138,2278.0,52800,2278.0,2232.0
179,2015/05/22,2273.0,2259.138,2235.0,58200,2278.0,2234.0
180,2015/05/25,2291.0,2291.632,2295.0,35900,2298.0,2273.0
181,2015/05/26,2288.0,2290.924,2294.0,26200,2299.0,2280.0
182,2015/05/27,2266.0,2264.241,2278.0,63500,2293.0,2248.0
183,2015/05/28,2224.0,2238.739,2260.0,46300,2269.0,2218.0
184,2015/05/29,2233.0,2243.074,2257.0,90000,2262.0,2233.0
185,2015/06/01,2308.0,2291.722,2233.0,90000,2319.0,2229.0
186,2015/06/02,2362.0,2342.329,2315.0,101800,2369.0,2279.0
187,2015/06/03,2404.0,2393.486,2356.0,107300,2410.0,2356.0
188,2015/06/04,2423.0,2417.154,2385.0,114100,2450.0,2376.0
189,2015/06/05,2430.0,2429.688,2420.0,79800,2457.0,2391.0
190,2015/06/08,2518.0,2510.498,2459.0,103900,2534.0,2459.0
191,2015/06/09,2498.0,2507.942,2520.0,99100,2532.0,2493.0
192,2015/06/10,2541.0,2543.389,2500.0,120700,2575.0,2500.0
193,2015/06/11,2512.0,2554.661,2580.0,70700,2620.0,2505.0
194,2015/06/12,2525.0,2539.485,2539.0,75000,2584.0,2512.0
195,2015/06/15,2499.0,2499.341,2500.0,43100,2518.0,2448.0
196,2015/06/16,2466.0,2465.745,2460.0,53400,2487.0,2450.0
197,2015/06/17,2449.0,2444.115,2430.0,84300,2473.0,2403.0
198,2015/06/18,2460.0,2464.679,2499.0,42100,2499.0,2435.0
199,2015/06/19,2537.0,2529.321,2474.0,95600,2555.0,2470.0
200,2015/06/22,2492.0,2496.77,2500.0,71700,2548.0,2481.0
201,2015/06/23,2560.0,2552.659,2530.0,90000,2573.0,2507.0
202,2015/06/24,2693.0,2679.063,2581.0,175500,2727.0,2579.0
203,2015/06/25,2632.0,2655.681,2686.0,65500,2686.0,2630.0
204,2015/06/26,2610.0,2624.473,2667.0,47200,2669.0,2599.0
205,2015/06/29,2573.0,2569.394,2510.0,76700,2610.0,2510.0
206,2015/06/30,2619.0,2597.522,2557.0,110000,2626.0,2557.0
207,2015/07/01,2643.0,2660.89,2639.0,112900,2689.0,2626.0
208,2015/07/02,2633.0,2684.007,2670.0,108800,2735.0,2624.0
209,2015/07/03,2563.0,2585.409,2633.0,96700,2633.0,2554.0
210,2015/07/06,2486.0,2495.608,2528.0,96100,2528.0,2478.0
211,2015/07/07,2524.0,2526.386,2517.0,52400,2543.0,2514.0
212,2015/07/08,2421.0,2457.484,2540.0,92400,2545.0,2417.0
213,2015/07/09,2446.0,2381.424,2380.0,113200,2452.0,2310.0
214,2015/07/10,2374.0,2405.881,2451.0,90200,2473.0,2372.0
215,2015/07/13,2466.0,2446.047,2391.0,51400,2484.0,2391.0
216,2015/07/14,2558.0,2543.787,2528.0,54400,2569.0,2500.0
217,2015/07/15,2578.0,2587.049,2577.0,65000,2638.0,2560.0
218,2015/07/16,2587.0,2576.915,2599.0,48100,2604.0,2563.0
219,2015/07/17,2592.0,2594.335,2595.0,38500,2637.0,2578.0
220,2015/07/21,2621.0,2631.065,2615.0,41500,2668.0,2611.0
221,2015/07/22,2592.0,2597.888,2628.0,54400,2644.0,2557.0
222,2015/07/23,2668.0,2647.58,2616.0,46200,2676.0,2593.0
223,2015/07/24,2677.0,2676.277,2682.0,60200,2695.0,2653.0
224,2015/07/27,2576.0,2601.492,2617.0,66700,2657.0,2570.0
225,2015/07/28,2610.0,2566.656,2561.0,46500,2620.0,2529.0
226,2015/07/29,2569.0,2559.722,2582.0,28400,2607.0,2540.0
227,2015/07/30,2579.0,2585.615,2589.0,36600,2610.0,2551.0
228,2015/07/31,2617.0,2597.865,2600.0,53200,2619.0,2572.0
229,2015/08/03,2435.0,2430.621,2417.0,141800,2483.0,2406.0
230,2015/08/04,2463.0,2438.278,2435.0,70500,2467.0,2394.0
231,2015/08/05,2491.0,2486.106,2463.0,71800,2516.0,2443.0
232,2015/08/06,2510.0,2502.239,2500.0,50600,2530.0,2475.0
233,2015/08/07,2525.0,2526.461,2510.0,34500,2548.0,2501.0
234,2015/08/10,2595.0,2564.931,2531.0,46400,2599.0,2521.0
235,2015/08/11,2660.0,2637.502,2616.0,66500,2673.0,2582.0
236,2015/08/12,2520.0,2557.601,2633.0,68200,2633.0,2508.0
237,2015/08/13,2513.0,2506.347,2513.0,45000,2526.0,2465.0
238,2015/08/14,2552.0,2549.338,2503.0,60300,2590.0,2501.0
239,2015/08/17,2549.0,2547.631,2571.0,24900,2571.0,2529.0
240,2015/08/18,2509.0,2513.456,2534.0,30700,2540.0,2498.0
241,2015/08/19,2482.0,2484.896,2501.0,39500,2505.0,2471.0
242,2015/08/20,2469.0,2475.318,2460.0,36200,2515.0,2440.0
243,2015/08/21,2413.0,2431.943,2395.0,66600,2465.0,2354.0
244,2015/08/24,2275.0,2317.857,2320.0,76100,2392.0,2265.0
245,2015/08/25,2143.0,2176.571,2078.0,87900,2276.0,2060.0
246,2015/08/26,2231.0,2172.496,2175.0,110700,2239.0,2143.0
247,2015/08/27,2257.0,2274.521,2281.0,35500,2304.0,2252.0
248,2015/08/28,2345.0,2348.9,2325.0,33100,2370.0,2324.0
249,2015/08/31,2363.0,2358.032,2350.0,34700,2390.0,2332.0
250,2015/09/01,2287.0,2312.347,2340.0,35200,2340.0,2275.0
251,2015/09/02,2298.0,2267.253,2241.0,110000,2344.0,2203.0
252,2015/09/03,2307.0,2330.551,2358.0,26300,2367.0,2302.0
253,2015/09/04,2257.0,2274.906,2334.0,56400,2334.0,2240.0
254,2015/09/07,2168.0,2180.934,2222.0,45600,2222.0,2154.0
255,2015/09/08,2162.0,2168.628,2147.0,131100,2241.0,2147.0
256,2015/09/09,2272.0,2256.087,2250.0,80300,2281.0,2221.0
257,2015/09/10,2304.0,2272.724,2225.0,46000,2318.0,2172.0
258,2015/09/11,2286.0,2270.294,2254.0,43900,2308.0,2254.0
259,2015/09/14,2270.0,2285.311,2301.0,31500,2327.0,2258.0
260,2015/09/15,2259.0,2285.944,2282.0,23300,2324.0,2256.0
261,2015/09/16,2283.0,2275.851,2290.0,17400,2298.0,2253.0
262,2015/09/17,2283.0,2275.968,2253.0,28000,2290.0,2253.0
263,2015/09/18,2276.0,2290.379,2283.0,40900,2332.0,2239.0
264,2015/09/24,2193.0,2210.947,2212.0,50700,2262.0,2160.0
265,2015/09/25,2252.0,2228.986,2207.0,48300,2271.0,2175.0
266,2015/09/28,2279.0,2263.691,2218.0,27500,2300.0,2182.0
267,2015/09/29,2204.0,2216.552,2248.0,22300,2248.0,2198.0
268,2015/09/30,2286.0,2271.855,2231.0,30400,2298.0,2211.0
269,2015/10/01,2350.0,2337.42,2314.0,48100,2360.0,2282.0
270,2015/10/02,2397.0,2371.101,2321.0,17800,2397.0,2319.0
271,2015/10/05,2416.0,2406.983,2397.0,23500,2420.0,2377.0
272,2015/10/06,2420.0,2429.692,2425.0,25300,2461.0,2406.0
273,2015/10/07,2401.0,2408.181,2420.0,30400,2435.0,2386.0
274,2015/10/08,2389.0,2385.416,2401.0,35800,2427.0,2361.0
275,2015/10/09,2429.0,2417.486,2396.0,28200,2429.0,2396.0
276,2015/10/13,2401.0,2406.964,2429.0,19500,2430.0,2384.0
277,2015/10/14,2358.0,2366.732,2406.0,35100,2406.0,2350.0
278,2015/10/15,2441.0,2430.269,2360.0,26000,2447.0,2360.0
279,2015/10/16,2417.0,2441.364,2443.0,22000,2464.0,2417.0
280,2015/10/19,2404.0,2405.33,2413.0,21800,2423.0,2379.0
281,2015/10/20,2423.0,2422.956,2403.0,9000,2433.0,2403.0
282,2015/10/21,2477.0,2456.543,2412.0,39800,2492.0,2412.0
283,2015/10/22,2441.0,2441.172,2458.0,23300,2458.0,2428.0
284,2015/10/23,2453.0,2470.814,2497.0,24700,2498.0,2453.0
285,2015/10/26,2495.0,2480.453,2478.0,30500,2500.0,2451.0
286,2015/10/27,2458.0,2466.744,2475.0,15600,2485.0,2455.0
287,2015/10/28,2444.0,2450.293,2459.0,16400,2498.0,2429.0
288,2015/10/29,2400.0,2411.297,2444.0,43100,2456.0,2361.0
289,2015/10/30,2434.0,2428.659,2389.0,13800,2449.0,2389.0
290,2015/11/02,2471.0,2452.301,2435.0,50800,2490.0,2381.0
291,2015/11/04,2528.0,2527.369,2480.0,47100,2573.0,2480.0
292,2015/11/05,2641.0,2617.766,2528.0,70800,2657.0,2528.0
293,2015/11/06,2635.0,2628.168,2639.0,45800,2660.0,2584.0
294,2015/11/09,2675.0,2665.811,2635.0,44900,2687.0,2634.0
295,2015/11/10,2647.0,2640.442,2629.0,28300,2666.0,2612.0
296,2015/11/11,2682.0,2679.275,2654.0,30500,2690.0,2653.0
297,2015/11/12,2667.0,2666.677,2654.0,39600,2682.0,2653.0
298,2015/11/13,2665.0,2656.009,2618.0,43200,2690.0,2603.0
299,2015/11/16,2649.0,2635.185,2603.0,29700,2658.0,2603.0
300,2015/11/17,2666.0,2671.806,2656.0,47000,2685.0,2656.0
301,2015/11/18,2696.0,2691.46,2661.0,58500,2718.0,2661.0
302,2015/11/19,2724.0,2731.498,2736.0,121600,2780.0,2660.0
303,2015/11/20,2732.0,2721.501,2720.0,70900,2739.0,2691.0
304,2015/11/24,2672.0,2678.312,2730.0,84300,2730.0,2650.0
305,2015/11/25,2611.0,2615.553,2635.0,44300,2635.0,2603.0
306,2015/11/26,2579.0,2581.741,2599.0,71900,2603.0,2564.0
307,2015/11/27,2609.0,2608.856,2579.0,37400,2628.0,2579.0
308,2015/11/30,2659.0,2638.96,2608.0,52900,2659.0,2596.0
309,2015/12/01,2905.0,2860.9,2801.0,294300,2937.0,2801.0
310,2015/12/02,2866.0,2866.701,2921.0,163000,2923.0,2789.0
311,2015/12/03,2855.0,2869.053,2828.0,103400,2889.0,2828.0
312,2015/12/04,2811.0,2804.754,2824.0,80500,2849.0,2768.0
313,2015/12/07,2815.0,2833.378,2822.0,62700,2859.0,2805.0
314,2015/12/08,2847.0,2826.477,2815.0,84200,2861.0,2790.0
315,2015/12/09,2849.0,2839.683,2835.0,68100,2857.0,2816.0
316,2015/12/10,2800.0,2796.8,2799.0,72100,2805.0,2777.0
317,2015/12/11,2792.0,2771.021,2750.0,82100,2801.0,2723.0
318,2015/12/14,2827.0,2809.644,2740.0,93000,2845.0,2740.0
319,2015/12/15,2778.0,2798.55,2844.0,75400,2844.0,2774.0
320,2015/12/16,2804.0,2799.503,2800.0,55900,2818.0,2767.0
321,2015/12/17,2775.0,2798.176,2828.0,82200,2837.0,2766.0
322,2015/12/18,2807.0,2811.243,2767.0,113400,2850.0,2759.0
323,2015/12/21,2798.0,2785.893,2780.0,57100,2811.0,2750.0
324,2015/12/22,2823.0,2831.984,2820.0,88000,2845.0,2802.0
325,2015/12/24,2793.0,2803.094,2816.0,52400,2841.0,2785.0
326,2015/12/25,2718.0,2745.588,2797.0,50000,2800.0,2709.0
327,2015/12/28,2704.0,2732.37,2740.0,41100,2795.0,2700.0
328,2015/12/29,2790.0,2766.589,2716.0,23100,2799.0,2700.0
329,2015/12/30,2729.0,2745.252,2790.0,31400,2790.0,2722.0
330,2016/01/04,2654.0,2662.548,2702.0,53100,2704.0,2635.0
331,2016/01/05,2683.0,2651.869,2640.0,73100,2687.0,2611.0
332,2016/01/06,2652.0,2661.315,2668.0,52700,2714.0,2631.0
333,2016/01/07,2580.0,2610.345,2640.0,76600,2679.0,2568.0
334,2016/01/08,2522.0,2549.014,2560.0,70000,2600.0,2510.0
335,2016/01/12,2406.0,2428.535,2481.0,69500,2490.0,2383.0
336,2016/01/13,2489.0,2468.682,2414.0,35500,2490.0,2414.0
337,2016/01/14,2417.0,2412.598,2439.0,29600,2439.0,2388.0
338,2016/01/15,2397.0,2417.843,2431.0,43300,2469.0,2375.0
339,2016/01/18,2341.0,2319.431,2315.0,38300,2348.0,2276.0
340,2016/01/19,2428.0,2399.446,2341.0,50700,2437.0,2341.0
341,2016/01/20,2304.0,2350.011,2400.0,37400,2412.0,2302.0
342,2016/01/21,2225.0,2296.064,2270.0,64100,2338.0,2225.0
343,2016/01/22,2399.0,2349.612,2290.0,54100,2406.0,2261.0
344,2016/01/25,2386.0,2400.91,2449.0,24500,2449.0,2370.0
345,2016/01/26,2350.0,2343.557,2331.0,32700,2365.0,2312.0
346,2016/01/27,2449.0,2429.076,2389.0,30400,2493.0,2385.0
347,2016/01/28,2538.0,2509.823,2449.0,59300,2550.0,2427.0
348,2016/01/29,2492.0,2457.275,2501.0,53400,2525.0,2401.0
349,2016/02/01,2357.0,2401.761,2486.0,80200,2507.0,2355.0
350,2016/02/02,2367.0,2355.363,2358.0,80500,2382.0,2342.0
351,2016/02/03,2314.0,2309.627,2317.0,39100,2344.0,2272.0
352,2016/02/04,2292.0,2291.619,2275.0,44900,2323.0,2256.0
353,2016/02/05,2255.0,2262.621,2255.0,38000,2304.0,2233.0
354,2016/02/08,2358.0,2309.862,2207.0,45800,2365.0,2207.0
355,2016/02/09,2122.0,2215.577,2258.0,95400,2258.0,2121.0
356,2016/02/10,2017.0,2048.187,2127.0,60600,2151.0,1990.0
357,2016/02/12,1922.0,1947.235,1921.0,61300,2011.0,1907.0
358,2016/02/15,1999.0,1998.067,1956.0,89100,2026.0,1951.0
359,2016/02/16,2035.0,2035.17,2039.0,80200,2080.0,1949.0
360,2016/02/17,2063.0,2054.948,2038.0,44500,2082.0,2027.0
361,2016/02/18,2114.0,2119.335,2113.0,36100,2145.0,2090.0
362,2016/02/19,2056.0,2061.468,2092.0,48300,2092.0,2043.0
363,2016/02/22,2065.0,2055.737,2040.0,13300,2073.0,2035.0
364,2016/02/23,2055.0,2081.602,2075.0,45200,2107.0,2050.0
365,2016/02/24,2066.0,2059.443,2021.0,37500,2080.0,2005.0
366,2016/02/25,2123.0,2123.713,2099.0,27200,2154.0,2098.0
367,2016/02/26,2136.0,2144.12,2123.0,50800,2173.0,2114.0
368,2016/02/29,2018.0,2080.704,2173.0,57100,2193.0,2016.0
369,2016/03/01,2058.0,2040.964,2022.0,25300,2068.0,2010.0
370,2016/03/02,2157.0,2152.268,2100.0,28400,2176.0,2097.0
371,2016/03/03,2139.0,2140.524,2150.0,22900,2157.0,2124.0
372,2016/03/04,2156.0,2161.168,2148.0,39400,2195.0,2143.0
373,2016/03/07,2140.0,2156.457,2174.0,17500,2180.0,2132.0
374,2016/03/08,2123.0,2124.71,2126.0,48200,2158.0,2062.0
375,2016/03/09,2076.0,2084.745,2095.0,38100,2099.0,2060.0
376,2016/03/10,2163.0,2152.603,2103.0,23700,2165.0,2103.0
377,2016/03/11,2222.0,2186.539,2153.0,50500,2232.0,2138.0
378,2016/03/14,2303.0,2294.198,2271.0,33300,2316.0,2247.0
379,2016/03/15,2228.0,2250.568,2283.0,45400,2287.0,2212.0
380,2016/03/16,2291.0,2286.551,2243.0,46300,2306.0,2243.0
381,2016/03/17,2330.0,2332.676,2306.0,64800,2360.0,2261.0
382,2016/03/18,2335.0,2330.611,2345.0,50600,2378.0,2282.0
383,2016/03/22,2370.0,2371.313,2368.0,29100,2397.0,2342.0
384,2016/03/23,2317.0,2339.837,2370.0,38000,2370.0,2300.0
385,2016/03/24,2383.0,2381.398,2317.0,92000,2415.0,2317.0
386,2016/03/25,2351.0,2365.458,2404.0,24900,2404.0,2338.0
387,2016/03/28,2357.0,2356.415,2351.0,28200,2389.0,2332.0
388,2016/03/29,2301.0,2305.906,2332.0,31800,2340.0,2286.0
389,2016/03/30,2265.0,2278.813,2316.0,41800,2316.0,2255.0
390,2016/03/31,2233.0,2245.648,2250.0,43400,2270.0,2228.0
391,2016/04/01,2163.0,2172.77,2248.0,48700,2248.0,2137.0
392,2016/04/04,2190.0,2176.685,2152.0,42600,2220.0,2147.0
393,2016/04/05,2098.0,2123.183,2179.0,33300,2179.0,2093.0
394,2016/04/06,2153.0,2124.39,2061.0,46400,2170.0,2060.0
395,2016/04/07,2156.0,2153.669,2149.0,27200,2180.0,2131.0
396,2016/04/08,2156.0,2151.655,2106.0,47000,2190.0,2079.0
397,2016/04/11,2109.0,2096.458,2156.0,23600,2156.0,2065.0
398,2016/04/12,2144.0,2131.121,2087.0,27300,2154.0,2066.0
399,2016/04/13,2185.0,2174.913,2156.0,24100,2194.0,2148.0
400,2016/04/14,2232.0,2220.736,2232.0,27600,2237.0,2196.0
401,2016/04/15,2212.0,2214.234,2226.0,27400,2231.0,2188.0
402,2016/04/18,2048.0,2083.218,2134.0,54100,2144.0,2041.0
403,2016/04/19,2107.0,2106.141,2111.0,27000,2130.0,2086.0
404,2016/04/20,2123.0,2123.051,2120.0,41100,2152.0,2106.0
405,2016/04/21,2159.0,2166.26,2173.0,32300,2196.0,2151.0
406,2016/04/22,2156.0,2134.298,2141.0,25200,2161.0,2103.0
407,2016/04/25,2012.0,2047.839,2120.0,114000,2120.0,2008.0
408,2016/04/26,2055.0,2051.724,2015.0,81200,2084.0,2010.0
409,2016/04/27,2091.0,2066.977,2045.0,43300,2096.0,2028.0
410,2016/04/28,1964.0,2012.179,2091.0,141400,2103.0,1957.0
411,2016/05/02,1832.0,1857.117,1868.0,120100,1895.0,1828.0
412,2016/05/06,1806.0,1810.119,1851.0,74200,1861.0,1795.0
413,2016/05/09,1890.0,1886.583,1855.0,65900,1932.0,1844.0
414,2016/05/10,1895.0,1897.856,1899.0,65100,1925.0,1864.0
415,2016/05/11,1947.0,1993.213,2049.0,142600,2070.0,1930.0
416,2016/05/12,1931.0,1911.286,1911.0,41600,1932.0,1881.0
417,2016/05/13,1866.0,1882.573,1931.0,70200,1940.0,1863.0
418,2016/05/16,1804.0,1826.711,1858.0,114600,1873.0,1793.0
419,2016/05/17,1821.0,1807.169,1822.0,85400,1828.0,1780.0
420,2016/05/18,1812.0,1830.818,1837.0,109800,1878.0,1800.0
421,2016/05/19,1831.0,1839.875,1849.0,71100,1856.0,1824.0
422,2016/05/20,1872.0,1863.553,1847.0,38900,1877.0,1836.0
423,2016/05/23,1876.0,1868.3,1866.0,44400,1888.0,1846.0
424,2016/05/24,1855.0,1869.742,1876.0,27500,1895.0,1853.0
425,2016/05/25,1827.0,1838.658,1869.0,103100,1879.0,1813.0
426,2016/05/26,1830.0,1832.331,1834.0,46900,1843.0,1818.0
427,2016/05/27,1836.0,1833.828,1844.0,52200,1844.0,1823.0
428,2016/05/30,1894.0,1875.412,1864.0,47300,1898.0,1847.0
429,2016/05/31,1909.0,1907.936,1893.0,117100,1933.0,1881.0
430,2016/06/01,1862.0,1875.116,1881.0,60500,1907.0,1854.0
431,2016/06/02,1823.0,1830.967,1855.0,42300,1855.0,1818.0
432,2016/06/03,1835.0,1826.649,1823.0,43000,1843.0,1820.0
433,2016/06/06,1805.0,1800.327,1805.0,53500,1814.0,1790.0
434,2016/06/07,1812.0,1818.149,1828.0,63600,1842.0,1804.0
435,2016/06/08,1901.0,1870.02,1829.0,81400,1901.0,1825.0
436,2016/06/09,1899.0,1913.329,1920.0,70300,1942.0,1896.0
437,2016/06/10,1879.0,1877.95,1881.0,71500,1904.0,1855.0
438,2016/06/13,1799.0,1808.235,1850.0,81200,1869.0,1794.0
439,2016/06/14,1774.0,1779.11,1788.0,71100,1826.0,1750.0
440,2016/06/15,1786.0,1784.548,1772.0,60600,1803.0,1759.0
441,2016/06/16,1694.0,1718.013,1769.0,90500,1800.0,1692.0
442,2016/06/17,1635.0,1680.374,1731.0,192400,1754.0,1635.0
443,2016/06/20,1720.0,1724.132,1662.0,88700,1763.0,1662.0
444,2016/06/21,1714.0,1709.609,1710.0,43700,1727.0,1676.0
445,2016/06/22,1686.0,1682.91,1705.0,55400,1709.0,1667.0
446,2016/06/23,1681.0,1675.606,1671.0,38100,1688.0,1660.0
447,2016/06/24,1546.0,1582.566,1702.0,103100,1711.0,1511.0
448,2016/06/27,1527.0,1539.932,1545.0,85300,1575.0,1520.0
449,2016/06/28,1546.0,1526.285,1500.0,51600,1551.0,1481.0
450,2016/06/29,1571.0,1570.306,1560.0,47100,1587.0,1555.0
451,2016/06/30,1555.0,1563.262,1585.0,54600,1597.0,1546.0
452,2016/07/01,1542.0,1551.818,1570.0,47800,1574.0,1536.0
453,2016/07/04,1542.0,1538.552,1534.0,37900,1549.0,1525.0
454,2016/07/05,1534.0,1525.202,1530.0,46500,1538.0,1503.0
455,2016/07/06,1498.0,1491.19,1503.0,71200,1506.0,1474.0
456,2016/07/07,1488.0,1503.428,1500.0,45300,1528.0,1484.0
457,2016/07/08,1488.0,1492.444,1489.0,36900,1508.0,1477.0
458,2016/07/11,1558.0,1554.555,1511.0,47600,1575.0,1511.0
459,2016/07/12,1595.0,1594.846,1575.0,57300,1611.0,1571.0
460,2016/07/13,1621.0,1637.167,1649.0,53400,1671.0,1611.0
461,2016/07/14,1620.0,1616.93,1601.0,47000,1633.0,1601.0
462,2016/07/15,1664.0,1676.732,1660.0,48900,1693.0,1659.0
463,2016/07/19,1660.0,1657.446,1665.0,39500,1667.0,1638.0
464,2016/07/20,1626.0,1625.647,1667.0,46200,1667.0,1611.0
465,2016/07/21,1628.0,1634.636,1635.0,25000,1662.0,1625.0
466,2016/07/22,1630.0,1626.195,1615.0,22600,1637.0,1606.0
467,2016/07/25,1631.0,1630.293,1632.0,45000,1646.0,1617.0
468,2016/07/26,1634.0,1630.163,1621.0,37400,1639.0,1621.0
469,2016/07/27,1653.0,1648.425,1630.0,42400,1667.0,1628.0
470,2016/07/28,1621.0,1623.606,1636.0,39100,1650.0,1613.0
471,2016/07/29,1630.0,1611.359,1617.0,42300,1640.0,1585.0
472,2016/08/01,1594.0,1599.615,1613.0,36600,1619.0,1590.0
473,2016/08/02,1586.0,1598.391,1585.0,34500,1618.0,1582.0
474,2016/08/03,1535.0,1552.229,1570.0,41100,1571.0,1533.0
475,2016/08/04,1578.0,1558.979,1546.0,24100,1581.0,1536.0
476,2016/08/05,1561.0,1563.592,1559.0,19600,1583.0,1547.0
477,2016/08/08,1600.0,1598.743,1565.0,20200,1618.0,1565.0
478,2016/08/09,1559.0,1558.731,1580.0,40500,1588.0,1551.0
479,2016/08/10,1589.0,1580.757,1564.0,17700,1589.0,1564.0
480,2016/08/12,1575.0,1570.308,1573.0,24000,1586.0,1557.0
481,2016/08/15,1451.0,1470.757,1540.0,125900,1540.0,1450.0
482,2016/08/16,1429.0,1440.039,1443.0,91500,1458.0,1427.0
483,2016/08/17,1443.0,1437.79,1427.0,51300,1449.0,1427.0
484,2016/08/18,1462.0,1456.495,1438.0,81600,1476.0,1430.0
485,2016/08/19,1515.0,1506.269,1477.0,56200,1526.0,1477.0
486,2016/08/22,1513.0,1511.222,1520.0,25200,1530.0,1480.0
487,2016/08/23,1502.0,1501.336,1498.0,26500,1519.0,1490.0
488,2016/08/24,1500.0,1502.347,1505.0,62500,1525.0,1489.0
489,2016/08/25,1523.0,1520.868,1524.0,33400,1540.0,1500.0
490,2016/08/26,1518.0,1507.356,1529.0,52000,1532.0,1493.0
491,2016/08/29,1541.0,1548.43,1538.0,32300,1566.0,1532.0
492,2016/08/30,1538.0,1539.269,1542.0,14900,1562.0,1527.0
493,2016/08/31,1579.0,1564.789,1536.0,57200,1579.0,1536.0
494,2016/09/01,1597.0,1585.008,1573.0,37300,1600.0,1550.0
495,2016/09/02,1596.0,1599.754,1581.0,51300,1618.0,1581.0
496,2016/09/05,1636.0,1632.111,1618.0,62300,1641.0,1615.0
497,2016/09/06,1674.0,1667.507,1650.0,71200,1688.0,1649.0
498,2016/09/07,1658.0,1661.788,1679.0,69900,1690.0,1639.0
499,2016/09/08,1705.0,1689.887,1682.0,95900,1707.0,1672.0
500,2016/09/09,1677.0,1686.187,1686.0,58300,1700.0,1675.0
501,2016/09/12,1663.0,1660.467,1669.0,67200,1685.0,1644.0
502,2016/09/13,1645.0,1656.6,1672.0,55700,1682.0,1636.0
503,2016/09/14,1641.0,1650.371,1640.0,26400,1668.0,1635.0
504,2016/09/15,1665.0,1657.028,1658.0,46400,1672.0,1638.0
505,2016/09/16,1643.0,1638.423,1648.0,58700,1658.0,1629.0
506,2016/09/20,1635.0,1641.412,1635.0,37400,1669.0,1624.0
507,2016/09/21,1674.0,1646.469,1649.0,58800,1676.0,1619.0
508,2016/09/23,1659.0,1660.802,1661.0,63500,1678.0,1647.0
509,2016/09/26,1648.0,1657.04,1674.0,44900,1674.0,1644.0
510,2016/09/27,1658.0,1623.276,1628.0,67300,1659.0,1578.0
511,2016/09/28,1622.0,1617.143,1628.0,39200,1646.0,1603.0
512,2016/09/29,1660.0,1652.741,1639.0,45900,1676.0,1635.0
513,2016/09/30,1651.0,1637.29,1641.0,51300,1651.0,1605.0
514,2016/10/03,1646.0,1654.42,1659.0,20500,1671.0,1643.0
515,2016/10/04,1691.0,1680.224,1653.0,66000,1694.0,1653.0
516,2016/10/05,1722.0,1718.448,1698.0,85500,1736.0,1685.0
517,2016/10/06,1743.0,1757.119,1749.0,78400,1777.0,1743.0
518,2016/10/07,1737.0,1732.804,1726.0,39800,1753.0,1719.0
519,2016/10/11,1716.0,1731.779,1733.0,39900,1758.0,1712.0
520,2016/10/12,1692.0,1704.323,1716.0,36900,1724.0,1691.0
521,2016/10/13,1685.0,1694.048,1692.0,49800,1710.0,1679.0
522,2016/10/14,1675.0,1671.736,1676.0,29200,1687.0,1662.0
523,2016/10/17,1688.0,1684.934,1680.0,37600,1694.0,1669.0
524,2016/10/18,1714.0,1707.978,1698.0,40200,1718.0,1689.0
525,2016/10/19,1742.0,1739.484,1721.0,36400,1749.0,1721.0
526,2016/10/20,1754.0,1757.539,1745.0,57000,1766.0,1745.0
527,2016/10/21,1747.0,1758.34,1761.0,69800,1770.0,1740.0
528,2016/10/24,1739.0,1743.58,1747.0,46000,1756.0,1732.0
529,2016/10/25,1764.0,1757.473,1745.0,38500,1766.0,1745.0
530,2016/10/26,1768.0,1763.313,1764.0,27200,1769.0,1754.0
531,2016/10/27,1758.0,1763.896,1772.0,26900,1780.0,1750.0
532,2016/10/28,1749.0,1758.159,1758.0,63400,1777.0,1747.0
533,2016/10/31,1758.0,1729.775,1719.0,93500,1766.0,1705.0
534,2016/11/01,1804.0,1784.648,1732.0,88700,1815.0,1732.0
535,2016/11/02,1790.0,1786.835,1791.0,58000,1794.0,1779.0
536,2016/11/04,1801.0,1790.264,1789.0,116500,1816.0,1765.0
537,2016/11/07,1826.0,1827.226,1815.0,77600,1837.0,1814.0
538,2016/11/08,1825.0,1826.903,1846.0,30800,1850.0,1810.0
539,2016/11/09,1696.0,1732.077,1825.0,98300,1830.0,1690.0
540,2016/11/10,1850.0,1827.801,1776.0,111600,1855.0,1769.0
541,2016/11/11,1841.0,1852.233,1860.0,83000,1900.0,1831.0
542,2016/11/14,1871.0,1865.084,1830.0,56900,1883.0,1830.0
543,2016/11/15,1885.0,1881.329,1878.0,55000,1896.0,1853.0
544,2016/11/16,1923.0,1914.282,1895.0,69500,1931.0,1895.0
545,2016/11/17,1926.0,1917.584,1909.0,33400,1930.0,1892.0
546,2016/11/18,1938.0,1938.504,1929.0,51200,1961.0,1929.0
547,2016/11/21,1987.0,1975.137,1940.0,54100,1989.0,1940.0
548,2016/11/22,2004.0,2006.22,1998.0,69700,2020.0,1986.0
549,2016/11/24,2042.0,2040.094,2020.0,88500,2056.0,2019.0
550,2016/11/25,2039.0,2049.32,2041.0,83100,2077.0,2028.0
551,2016/11/28,2041.0,2024.343,2021.0,45200,2044.0,2009.0
552,2016/11/29,2075.0,2075.839,2041.0,85100,2104.0,2041.0
553,2016/11/30,2094.0,2111.572,2089.0,92300,2143.0,2079.0
554,2016/12/01,2112.0,2112.862,2100.0,83400,2140.0,2090.0
555,2016/12/02,2149.0,2144.593,2113.0,99300,2165.0,2108.0
556,2016/12/05,2144.0,2143.986,2136.0,97000,2160.0,2121.0
557,2016/12/06,2123.0,2122.375,2128.0,114500,2137.0,2099.0
558,2016/12/07,2115.0,2117.793,2105.0,102600,2140.0,2094.0
559,2016/12/08,2115.0,2111.898,2137.0,96800,2140.0,2095.0
560,2016/12/09,2097.0,2086.919,2102.0,95400,2106.0,2057.0
561,2016/12/12,2087.0,2091.313,2102.0,69100,2118.0,2067.0
562,2016/12/13,2140.0,2101.497,2087.0,67800,2142.0,2063.0
563,2016/12/14,2158.0,2161.916,2152.0,46400,2178.0,2140.0
564,2016/12/15,2135.0,2145.15,2158.0,45900,2171.0,2129.0
565,2016/12/16,2212.0,2192.389,2145.0,100900,2212.0,2145.0
566,2016/12/19,2163.0,2174.475,2212.0,98900,2212.0,2149.0
567,2016/12/20,2162.0,2155.547,2163.0,97200,2170.0,2141.0
568,2016/12/21,2176.0,2179.326,2178.0,36200,2195.0,2165.0
569,2016/12/22,2158.0,2157.504,2176.0,41300,2177.0,2136.0
570,2016/12/26,2136.0,2146.707,2158.0,42700,2172.0,2134.0
571,2016/12/27,2130.0,2137.402,2130.0,44000,2158.0,2113.0
572,2016/12/28,2152.0,2153.949,2130.0,27600,2167.0,2126.0
573,2016/12/29,2090.0,2101.393,2148.0,55700,2148.0,2086.0
574,2016/12/30,2097.0,2097.276,2090.0,39900,2111.0,2080.0
575,2017/01/04,2201.0,2174.609,2102.0,109300,2203.0,2102.0
576,2017/01/05,2229.0,2224.776,2215.0,73800,2238.0,2198.0
577,2017/01/06,2234.0,2240.249,2215.0,73400,2263.0,2215.0
578,2017/01/10,2233.0,2254.749,2249.0,88400,2289.0,2232.0
579,2017/01/11,2235.0,2242.988,2246.0,32800,2272.0,2228.0
580,2017/01/12,2224.0,2228.904,2242.0,39400,2264.0,2209.0
581,2017/01/13,2235.0,2227.947,2215.0,30200,2245.0,2198.0
582,2017/01/16,2196.0,2216.97,2229.0,26700,2260.0,2190.0
583,2017/01/17,2183.0,2192.741,2204.0,44000,2214.0,2173.0
584,2017/01/18,2222.0,2194.051,2180.0,43100,2222.0,2164.0
585,2017/01/19,2258.0,2258.46,2240.0,48900,2285.0,2240.0
586,2017/01/20,2290.0,2280.757,2258.0,37100,2291.0,2258.0
587,2017/01/23,2270.0,2278.842,2293.0,34200,2293.0,2260.0
588,2017/01/24,2272.0,2282.123,2270.0,45600,2300.0,2267.0
589,2017/01/25,2307.0,2305.73,2301.0,40000,2318.0,2293.0
590,2017/01/26,2346.0,2337.413,2330.0,57400,2348.0,2314.0
591,2017/01/27,2355.0,2370.61,2369.0,51800,2388.0,2349.0
592,2017/01/30,2355.0,2356.155,2350.0,23900,2377.0,2346.0
593,2017/01/31,2195.0,2178.255,2200.0,154400,2225.0,2122.0
594,2017/02/01,2190.0,2188.822,2169.0,78600,2212.0,2164.0
595,2017/02/02,2150.0,2169.649,2205.0,67600,2214.0,2145.0
596,2017/02/03,2187.0,2191.364,2151.0,53800,2214.0,2151.0
597,2017/02/06,2213.0,2204.245,2209.0,36300,2220.0,2184.0
598,2017/02/07,2210.0,2214.751,2207.0,43800,2233.0,2200.0
599,2017/02/08,2228.0,2225.897,2217.0,31000,2238.0,2209.0
600,2017/02/09,2207.0,2208.109,2218.0,30300,2228.0,2203.0
601,2017/02/10,2251.0,2248.978,2248.0,48800,2263.0,2230.0
602,2017/02/13,2257.0,2253.438,2250.0,33600,2268.0,2240.0
603,2017/02/14,2239.0,2250.759,2257.0,28200,2276.0,2239.0
604,2017/02/15,2273.0,2272.613,2276.0,19900,2282.0,2260.0
605,2017/02/16,2256.0,2257.465,2285.0,42400,2292.0,2238.0
606,2017/02/17,2247.0,2249.417,2256.0,19200,2264.0,2242.0
607,2017/02/20,2238.0,2239.082,2244.0,15900,2244.0,2227.0
608,2017/02/21,2224.0,2224.014,2238.0,28300,2238.0,2214.0
609,2017/02/22,2243.0,2241.667,2236.0,16500,2252.0,2231.0
610,2017/02/23,2218.0,2226.858,2243.0,27500,2262.0,2210.0
611,2017/02/24,2231.0,2239.191,2219.0,31900,2259.0,2219.0
612,2017/02/27,2173.0,2178.569,2204.0,49600,2204.0,2164.0
613,2017/02/28,2185.0,2191.849,2180.0,66800,2223.0,2175.0
614,2017/03/01,2195.0,2192.257,2198.0,41200,2211.0,2175.0
615,2017/03/02,2250.0,2244.016,2240.0,37300,2253.0,2231.0
616,2017/03/03,2215.0,2220.995,2247.0,19500,2247.0,2210.0
617,2017/03/06,2217.0,2214.828,2215.0,19800,2221.0,2209.0
618,2017/03/07,2199.0,2197.341,2200.0,44000,2219.0,2183.0
619,2017/03/08,2192.0,2193.511,2197.0,22700,2216.0,2180.0
620,2017/03/09,2165.0,2170.218,2192.0,51400,2207.0,2154.0
621,2017/03/10,2189.0,2186.881,2191.0,45400,2203.0,2166.0
622,2017/03/13,2173.0,2178.181,2172.0,23700,2193.0,2172.0
623,2017/03/14,2150.0,2157.015,2173.0,33000,2180.0,2145.0
624,2017/03/15,2116.0,2125.249,2130.0,26500,2142.0,2116.0
625,2017/03/16,2134.0,2125.705,2117.0,21000,2138.0,2100.0
626,2017/03/17,2135.0,2124.132,2120.0,40200,2135.0,2111.0
627,2017/03/21,2130.0,2124.096,2131.0,47700,2139.0,2110.0
628,2017/03/22,2060.0,2068.996,2088.0,73200,2099.0,2042.0
629,2017/03/23,2063.0,2063.269,2060.0,21200,2074.0,2056.0
630,2017/03/24,2073.0,2074.74,2073.0,32700,2086.0,2056.0
631,2017/03/27,2036.0,2048.995,2069.0,65200,2089.0,2033.0
632,2017/03/28,2070.0,2063.804,2060.0,57200,2070.0,2047.0
633,2017/03/29,2056.0,2042.784,2050.0,39300,2067.0,2030.0
634,2017/03/30,2033.0,2043.54,2056.0,25200,2060.0,2032.0
635,2017/03/31,2044.0,2049.802,2054.0,80800,2069.0,2036.0
636,2017/04/03,2057.0,2063.869,2046.0,61200,2077.0,2046.0
637,2017/04/04,2045.0,2040.585,2056.0,64500,2067.0,2022.0
638,2017/04/05,2005.0,2017.055,2036.0,56200,2064.0,1992.0
639,2017/04/06,1928.0,1935.451,1978.0,69200,1979.0,1909.0
640,2017/04/07,1936.0,1934.626,1941.0,47600,1957.0,1915.0
641,2017/04/10,1937.0,1939.269,1940.0,28300,1955.0,1929.0
642,2017/04/11,1918.0,1918.582,1931.0,40900,1937.0,1910.0
643,2017/04/12,1906.0,1900.903,1912.0,44500,1918.0,1890.0
644,2017/04/13,1869.0,1864.601,1871.0,40600,1875.0,1855.0
645,2017/04/14,1859.0,1861.062,1861.0,21000,1870.0,1847.0
646,2017/04/17,1854.0,1848.481,1851.0,41600,1871.0,1833.0
647,2017/04/18,1854.0,1864.122,1889.0,24600,1902.0,1853.0
648,2017/04/19,1854.0,1859.16,1858.0,37600,1871.0,1850.0
649,2017/04/20,1864.0,1863.492,1854.0,31500,1874.0,1847.0
650,2017/04/21,1920.0,1906.064,1874.0,43900,1921.0,1873.0
651,2017/04/24,1927.0,1931.09,1960.0,76900,1960.0,1916.0
652,2017/04/25,1962.0,1957.708,1926.0,61600,1977.0,1923.0
653,2017/04/26,2016.0,2004.941,1977.0,65700,2023.0,1973.0
654,2017/04/27,2044.0,2042.807,2023.0,51200,2063.0,2023.0
655,2017/04/28,2031.0,2031.77,2043.0,33000,2051.0,2022.0
656,2017/05/01,2072.0,2062.589,2032.0,34800,2080.0,2032.0
657,2017/05/02,2083.0,2085.558,2074.0,49100,2098.0,2064.0
658,2017/05/08,2183.0,2161.262,2133.0,81700,2183.0,2122.0
659,2017/05/09,2186.0,2176.314,2158.0,64700,2191.0,2156.0
660,2017/05/10,2268.0,2243.218,2195.0,106700,2270.0,2195.0
661,2017/05/11,2009.0,2023.082,2025.0,285600,2091.0,1958.0
662,2017/05/12,2012.0,2017.706,2009.0,130400,2040.0,2004.0
663,2017/05/15,2026.0,2019.791,2013.0,57500,2036.0,2003.0
664,2017/05/16,2048.0,2036.441,2038.0,67800,2052.0,2023.0
665,2017/05/17,2010.0,2020.693,2034.0,67800,2045.0,2006.0
666,2017/05/18,1960.0,1956.054,1987.0,90600,1987.0,1933.0
667,2017/05/19,2019.0,1995.597,1969.0,56600,2023.0,1967.0
668,2017/05/22,2031.0,2028.583,2027.0,39800,2044.0,2010.0
669,2017/05/23,1966.0,1975.546,2038.0,84500,2038.0,1960.0
670,2017/05/24,2005.0,1999.671,1996.0,50400,2011.0,1985.0
671,2017/05/25,2061.0,2053.742,2029.0,116300,2076.0,2019.0
672,2017/05/26,2064.0,2063.039,2071.0,46400,2071.0,2058.0
673,2017/05/29,2058.0,2070.449,2089.0,62600,2089.0,2046.0
674,2017/05/30,2095.0,2083.995,2070.0,81400,2101.0,2066.0
675,2017/05/31,1978.0,1999.477,2045.0,230700,2055.0,1970.0
676,2017/06/01,1959.0,1965.406,1976.0,104700,1991.0,1953.0
677,2017/06/02,1984.0,1978.152,1963.0,102400,1992.0,1963.0
678,2017/06/05,1975.0,1977.409,1989.0,64600,1994.0,1963.0
679,2017/06/06,1921.0,1945.772,1973.0,80300,1975.0,1919.0
680,2017/06/07,1929.0,1931.198,1929.0,59600,1945.0,1922.0
681,2017/06/08,1959.0,1942.299,1929.0,101200,1964.0,1915.0
682,2017/06/09,1958.0,1953.139,1946.0,43300,1965.0,1935.0
683,2017/06/12,1944.0,1943.884,1939.0,32800,1959.0,1936.0
684,2017/06/13,1935.0,1936.972,1941.0,39300,1945.0,1922.0
685,2017/06/14,1905.0,1912.233,1920.0,73500,1930.0,1899.0
686,2017/06/15,1909.0,1900.07,1886.0,69800,1917.0,1881.0
687,2017/06/16,1936.0,1925.552,1923.0,127100,1939.0,1905.0
688,2017/06/19,1907.0,1906.918,1934.0,63300,1934.0,1897.0
689,2017/06/20,1925.0,1920.498,1918.0,55800,1931.0,1909.0
690,2017/06/21,1908.0,1913.005,1905.0,57300,1928.0,1905.0
691,2017/06/22,1922.0,1918.583,1905.0,38100,1926.0,1902.0
692,2017/06/23,1911.0,1908.806,1931.0,67000,1931.0,1901.0
693,2017/06/26,1905.0,1906.494,1909.0,64200,1922.0,1895.0
694,2017/06/27,1892.0,1898.893,1915.0,45600,1915.0,1891.0
695,2017/06/28,1887.0,1895.588,1893.0,54600,1913.0,1887.0
696,2017/06/29,1941.0,1923.854,1909.0,121600,1955.0,1894.0
697,2017/06/30,1890.0,1894.319,1902.0,82100,1921.0,1882.0
698,2017/07/03,1898.0,1894.096,1890.0,51300,1903.0,1888.0
699,2017/07/04,1886.0,1889.986,1917.0,49000,1917.0,1877.0
700,2017/07/05,1891.0,1898.963,1896.0,64800,1907.0,1882.0
701,2017/07/06,1906.0,1904.231,1891.0,52800,1911.0,1891.0
702,2017/07/07,1887.0,1893.008,1891.0,84400,1910.0,1880.0
703,2017/07/10,1899.0,1901.855,1904.0,53700,1909.0,1892.0
704,2017/07/11,1899.0,1900.78,1900.0,41300,1907.0,1894.0
705,2017/07/12,1885.0,1886.64,1898.0,41900,1904.0,1877.0
706,2017/07/13,1891.0,1893.905,1900.0,67200,1905.0,1885.0
707,2017/07/14,1901.0,1899.434,1903.0,41900,1906.0,1893.0
708,2017/07/18,1897.0,1898.085,1900.0,70500,1908.0,1884.0
709,2017/07/19,1761.0,1772.603,1817.0,364400,1839.0,1734.0
710,2017/07/20,1692.0,1703.914,1755.0,351800,1758.0,1680.0
711,2017/07/21,1669.0,1667.911,1683.0,223200,1689.0,1657.0
712,2017/07/24,1687.0,1671.515,1667.0,126500,1688.0,1651.0
713,2017/07/25,1679.0,1679.893,1695.0,71600,1698.0,1672.0
714,2017/07/26,1627.0,1641.96,1655.0,249100,1664.0,1626.0
715,2017/07/27,1636.0,1632.598,1632.0,204200,1646.0,1622.0
716,2017/07/28,1627.0,1614.636,1636.0,202900,1636.0,1603.0
717,2017/07/31,1657.0,1645.942,1633.0,97400,1659.0,1627.0
718,2017/08/01,1691.0,1694.898,1737.0,364100,1742.0,1663.0
719,2017/08/02,1680.0,1683.75,1711.0,229200,1723.0,1667.0
720,2017/08/03,1688.0,1683.468,1690.0,246000,1695.0,1675.0
721,2017/08/04,1707.0,1699.954,1699.0,198400,1717.0,1684.0
722,2017/08/07,1756.0,1750.314,1735.0,205100,1762.0,1734.0
723,2017/08/08,1782.0,1788.023,1774.0,180500,1806.0,1774.0
724,2017/08/09,1774.0,1767.56,1776.0,106200,1781.0,1758.0
725,2017/08/10,1750.0,1759.063,1773.0,105600,1782.0,1745.0
726,2017/08/14,1739.0,1737.778,1745.0,116900,1752.0,1722.0
727,2017/08/15,1768.0,1756.248,1743.0,177900,1775.0,1734.0
728,2017/08/16,1818.0,1802.94,1769.0,135700,1828.0,1764.0
729,2017/08/17,1844.0,1830.244,1812.0,97300,1846.0,1807.0
730,2017/08/18,1824.0,1817.089,1830.0,77300,1830.0,1805.0
731,2017/08/21,1836.0,1820.058,1822.0,84000,1837.0,1799.0
732,2017/08/22,1843.0,1837.541,1836.0,65600,1847.0,1823.0
733,2017/08/23,1886.0,1882.256,1848.0,170100,1897.0,1836.0
734,2017/08/24,1885.0,1885.786,1883.0,86800,1897.0,1871.0
735,2017/08/25,1898.0,1903.59,1890.0,97000,1923.0,1885.0
736,2017/08/28,1899.0,1888.699,1880.0,73000,1904.0,1873.0
737,2017/08/29,1931.0,1914.132,1870.0,140200,1935.0,1869.0
738,2017/08/30,1941.0,1930.931,1948.0,88900,1948.0,1907.0
739,2017/08/31,1928.0,1943.988,1945.0,122100,1966.0,1925.0
740,2017/09/01,1925.0,1903.978,1922.0,188200,1927.0,1881.0
741,2017/09/04,1901.0,1898.007,1918.0,107500,1920.0,1884.0
742,2017/09/05,1866.0,1878.543,1902.0,110700,1917.0,1861.0
743,2017/09/06,1878.0,1860.32,1830.0,69400,1882.0,1830.0
744,2017/09/07,1876.0,1882.384,1879.0,79600,1899.0,1866.0
745,2017/09/08,1863.0,1869.741,1860.0,64200,1883.0,1859.0
746,2017/09/11,1882.0,1884.233,1865.0,52000,1897.0,1865.0
747,2017/09/12,1917.0,1911.7,1902.0,51400,1920.0,1902.0
748,2017/09/13,1912.0,1918.106,1920.0,67700,1939.0,1910.0
749,2017/09/14,1891.0,1901.603,1913.0,47900,1925.0,1889.0
750,2017/09/15,1905.0,1904.461,1910.0,80100,1912.0,1892.0
751,2017/09/19,1933.0,1927.396,1931.0,106700,1936.0,1918.0
752,2017/09/20,1959.0,1953.785,1930.0,101600,1977.0,1925.0
753,2017/09/21,1974.0,1978.898,1981.0,95300,2000.0,1965.0
754,2017/09/22,1955.0,1976.169,1979.0,191800,2015.0,1950.0
755,2017/09/25,1985.0,1985.487,1982.0,72100,1996.0,1978.0
756,2017/09/26,1971.0,1978.938,1988.0,116100,1993.0,1970.0
757,2017/09/27,1958.0,1959.769,1951.0,78400,1972.0,1942.0
758,2017/09/28,1976.0,1965.034,1961.0,58800,1977.0,1946.0
759,2017/09/29,1944.0,1951.743,1964.0,61500,1972.0,1943.0
760,2017/10/02,1954.0,1947.993,1950.0,88500,1960.0,1936.0
761,2017/10/03,1946.0,1947.775,1966.0,55200,1966.0,1938.0
762,2017/10/04,1942.0,1941.373,1946.0,63000,1948.0,1935.0
763,2017/10/05,1945.0,1936.338,1942.0,96300,1948.0,1922.0
764,2017/10/06,1966.0,1946.642,1947.0,85400,1967.0,1923.0
765,2017/10/10,1968.0,1968.871,1967.0,107300,1978.0,1961.0
766,2017/10/11,1964.0,1964.976,1985.0,131700,1985.0,1955.0
767,2017/10/12,1957.0,1957.631,1972.0,82000,1978.0,1948.0
768,2017/10/13,1972.0,1967.988,1963.0,117900,1977.0,1953.0
769,2017/10/16,1980.0,1980.246,1975.0,145200,1989.0,1966.0
770,2017/10/17,1971.0,1971.354,1984.0,119300,1984.0,1962.0
771,2017/10/18,1966.0,1963.527,1971.0,62100,1972.0,1957.0
772,2017/10/19,1970.0,1962.719,1967.0,106900,1972.0,1954.0
773,2017/10/20,1966.0,1959.356,1970.0,105800,1974.0,1943.0
774,2017/10/23,1887.0,1883.211,1926.0,473100,1932.0,1850.0
775,2017/10/24,1947.0,1918.429,1880.0,193600,1947.0,1880.0
776,2017/10/25,1925.0,1934.998,1944.0,119900,1950.0,1921.0
777,2017/10/26,1920.0,1918.05,1927.0,48100,1927.0,1911.0
778,2017/10/27,1915.0,1914.966,1916.0,77200,1923.0,1908.0
779,2017/10/30,1919.0,1916.17,1937.0,98700,1937.0,1907.0
780,2017/10/31,1946.0,1931.901,1920.0,76700,1948.0,1912.0
781,2017/11/01,1978.0,1978.843,1976.0,119200,1994.0,1965.0
782,2017/11/02,1949.0,1951.962,1982.0,102300,1982.0,1939.0
783,2017/11/06,1939.0,1945.415,1964.0,116400,1964.0,1933.0
784,2017/11/07,1979.0,1966.763,1940.0,104100,1982.0,1928.0
785,2017/11/08,2009.0,2000.089,1982.0,149500,2013.0,1976.0
786,2017/11/09,2013.0,2018.44,2028.0,145500,2039.0,1990.0
787,2017/11/10,1982.0,1983.682,1999.0,97800,2002.0,1974.0
788,2017/11/13,2007.0,1995.234,1985.0,91200,2010.0,1971.0
789,2017/11/14,2116.0,2118.73,2030.0,430000,2165.0,2028.0
790,2017/11/15,1971.0,2008.939,2105.0,181600,2107.0,1964.0
791,2017/11/16,1967.0,1957.449,1948.0,119100,1974.0,1934.0
792,2017/11/17,1962.0,1960.797,1979.0,136200,1982.0,1950.0
793,2017/11/20,1952.0,1943.763,1930.0,114100,1958.0,1925.0
794,2017/11/21,1938.0,1942.347,1951.0,60500,1962.0,1935.0
795,2017/11/22,1981.0,1962.99,1958.0,109800,1983.0,1937.0
796,2017/11/24,1974.0,1967.703,1978.0,73800,1980.0,1951.0
797,2017/11/27,1971.0,1972.656,1986.0,71600,1986.0,1963.0
798,2017/11/28,1928.0,1938.144,1970.0,148600,1970.0,1916.0
799,2017/11/29,1922.0,1928.869,1931.0,99700,1949.0,1916.0
800,2017/11/30,1930.0,1924.556,1915.0,126900,1940.0,1905.0
801,2017/12/01,1946.0,1942.93,1940.0,87700,1957.0,1934.0
802,2017/12/04,1943.0,1946.821,1939.0,56500,1958.0,1931.0
803,2017/12/05,1929.0,1914.46,1935.0,96400,1935.0,1895.0
804,2017/12/06,1934.0,1937.954,1939.0,76300,1951.0,1925.0
805,2017/12/07,1963.0,1953.122,1931.0,69700,1963.0,1929.0
806,2017/12/08,1993.0,1978.137,1938.0,125300,1993.0,1938.0
807,2017/12/11,2022.0,2010.135,2001.0,111500,2029.0,1987.0
808,2017/12/12,2041.0,2035.08,2022.0,123000,2054.0,2010.0
809,2017/12/13,2088.0,2074.691,2068.0,196400,2090.0,2059.0
810,2017/12/14,2125.0,2110.943,2094.0,137400,2137.0,2080.0
811,2017/12/15,2143.0,2176.694,2199.0,269000,2246.0,2127.0
812,2017/12/18,2166.0,2152.06,2128.0,139100,2182.0,2111.0
813,2017/12/19,2201.0,2205.243,2200.0,151600,2221.0,2188.0
814,2017/12/20,2223.0,2212.991,2204.0,112600,2235.0,2172.0
815,2017/12/21,2284.0,2262.707,2235.0,131900,2287.0,2228.0
816,2017/12/22,2310.0,2299.023,2280.0,146600,2317.0,2270.0
817,2017/12/25,2326.0,2335.032,2350.0,198800,2378.0,2308.0
818,2017/12/26,2326.0,2322.4,2333.0,102700,2346.0,2300.0
819,2017/12/27,2462.0,2434.759,2370.0,521800,2548.0,2350.0
820,2017/12/28,2481.0,2480.559,2479.0,233600,2506.0,2444.0
821,2017/12/29,2485.0,2490.976,2470.0,145400,2509.0,2466.0
822,2018/01/04,2513.0,2507.915,2516.0,152700,2530.0,2482.0
823,2018/01/05,2481.0,2489.863,2512.0,95000,2525.0,2475.0
824,2018/01/09,2433.0,2418.496,2470.0,243400,2470.0,2385.0
825,2018/01/10,2412.0,2423.21,2443.0,137400,2468.0,2394.0
826,2018/01/11,2373.0,2383.297,2401.0,155700,2415.0,2350.0
827,2018/01/12,2380.0,2395.05,2379.0,120200,2430.0,2377.0
828,2018/01/15,2405.0,2417.185,2444.0,134000,2466.0,2395.0
829,2018/01/16,2439.0,2424.467,2425.0,78300,2449.0,2401.0
830,2018/01/17,2402.0,2422.192,2438.0,92700,2461.0,2394.0
831,2018/01/18,2352.0,2378.737,2420.0,101500,2422.0,2344.0
832,2018/01/19,2327.0,2333.659,2331.0,82500,2357.0,2320.0
833,2018/01/22,2345.0,2340.3,2315.0,82300,2361.0,2315.0
834,2018/01/23,2371.0,2363.409,2348.0,57400,2378.0,2341.0
835,2018/01/24,2354.0,2362.212,2374.0,57600,2380.0,2344.0
836,2018/01/25,2333.0,2334.678,2349.0,51800,2349.0,2323.0
837,2018/01/26,2326.0,2330.816,2328.0,59100,2346.0,2322.0
838,2018/01/29,2372.0,2364.53,2323.0,100500,2382.0,2323.0
839,2018/01/30,2353.0,2356.809,2373.0,118600,2377.0,2335.0
840,2018/01/31,2325.0,2335.301,2323.0,90700,2361.0,2310.0
841,2018/02/01,2398.0,2379.879,2328.0,78600,2400.0,2328.0
842,2018/02/02,2389.0,2390.082,2392.0,63300,2416.0,2359.0
843,2018/02/05,2333.0,2320.254,2290.0,114100,2340.0,2290.0
844,2018/02/06,2184.0,2165.597,2183.0,230000,2200.0,2116.0
845,2018/02/07,2193.0,2237.909,2234.0,103800,2271.0,2193.0
846,2018/02/08,2243.0,2233.245,2196.0,102500,2261.0,2195.0
847,2018/02/09,2252.0,2224.956,2171.0,146700,2263.0,2171.0
848,2018/02/13,2147.0,2189.013,2263.0,176300,2300.0,2141.0
849,2018/02/14,2212.0,2196.964,2143.0,147300,2251.0,2141.0
850,2018/02/15,2237.0,2210.54,2213.0,141400,2243.0,2152.0
851,2018/02/16,2246.0,2258.573,2242.0,53900,2292.0,2242.0
852,2018/02/19,2278.0,2259.841,2247.0,44100,2279.0,2244.0
853,2018/02/20,2296.0,2278.743,2270.0,51800,2302.0,2240.0
854,2018/02/21,2305.0,2304.646,2291.0,52500,2325.0,2282.0
855,2018/02/22,2345.0,2345.021,2350.0,75700,2379.0,2310.0
856,2018/02/23,2325.0,2319.62,2344.0,69800,2344.0,2305.0
857,2018/02/26,2336.0,2331.742,2345.0,50000,2350.0,2311.0
858,2018/02/27,2375.0,2364.713,2340.0,71000,2383.0,2340.0
859,2018/02/28,2355.0,2373.368,2355.0,66900,2400.0,2353.0
860,2018/03/01,2307.0,2316.803,2344.0,57400,2349.0,2296.0
861,2018/03/02,2278.0,2272.007,2250.0,46300,2294.0,2241.0
862,2018/03/05,2228.0,2243.005,2268.0,61300,2268.0,2221.0
863,2018/03/06,2227.0,2232.774,2250.0,45200,2260.0,2216.0
864,2018/03/07,2191.0,2205.59,2238.0,63200,2240.0,2188.0
865,2018/03/08,2216.0,2205.872,2207.0,40600,2218.0,2186.0
866,2018/03/09,2212.0,2214.936,2222.0,64400,2240.0,2187.0
867,2018/03/12,2256.0,2246.973,2230.0,37000,2262.0,2229.0
868,2018/03/13,2273.0,2257.794,2254.0,34400,2273.0,2242.0
869,2018/03/14,2262.0,2264.222,2262.0,50900,2273.0,2256.0
870,2018/03/15,2233.0,2229.336,2261.0,44900,2261.0,2202.0
871,2018/03/16,2204.0,2207.444,2233.0,53200,2233.0,2199.0
872,2018/03/19,2168.0,2154.057,2199.0,72600,2199.0,2125.0
873,2018/03/20,2199.0,2173.145,2149.0,55300,2202.0,2136.0
874,2018/03/22,2209.0,2196.98,2199.0,40500,2209.0,2183.0
875,2018/03/23,2141.0,2155.056,2170.0,93100,2175.0,2129.0
876,2018/03/26,2139.0,2111.888,2121.0,80400,2139.0,2085.0
877,2018/03/27,2193.0,2183.725,2180.0,58500,2193.0,2163.0
878,2018/03/28,2155.0,2132.195,2130.0,50300,2155.0,2105.0
879,2018/03/29,2173.0,2168.396,2158.0,35900,2183.0,2148.0
880,2018/03/30,2214.0,2207.935,2187.0,38200,2222.0,2187.0
881,2018/04/02,2155.0,2166.572,2203.0,39700,2211.0,2154.0
882,2018/04/03,2160.0,2134.276,2126.0,50800,2165.0,2093.0
883,2018/04/04,2186.0,2178.143,2166.0,33600,2191.0,2147.0
884,2018/04/05,2187.0,2189.247,2186.0,43300,2210.0,2169.0
885,2018/04/06,2163.0,2163.187,2182.0,56700,2187.0,2147.0
886,2018/04/09,2157.0,2156.067,2165.0,49100,2183.0,2135.0
887,2018/04/10,2195.0,2173.648,2153.0,45400,2198.0,2136.0
888,2018/04/11,2197.0,2198.269,2174.0,26400,2209.0,2174.0
889,2018/04/12,2163.0,2171.995,2208.0,36500,2208.0,2159.0
890,2018/04/13,2197.0,2195.069,2177.0,20300,2206.0,2177.0
891,2018/04/16,2188.0,2177.254,2157.0,51500,2198.0,2157.0
892,2018/04/17,2202.0,2209.904,2188.0,29100,2238.0,2188.0
893,2018/04/18,2206.0,2199.078,2198.0,23200,2216.0,2183.0
894,2018/04/19,2218.0,2208.773,2222.0,34300,2222.0,2189.0
895,2018/04/20,2250.0,2235.951,2216.0,35000,2252.0,2207.0
896,2018/04/23,2280.0,2277.366,2270.0,25700,2291.0,2260.0
897,2018/04/24,2313.0,2307.259,2297.0,44000,2320.0,2290.0
898,2018/04/25,2324.0,2310.373,2312.0,25500,2327.0,2288.0
899,2018/04/26,2326.0,2326.407,2311.0,24600,2338.0,2311.0
900,2018/04/27,2312.0,2308.479,2340.0,26300,2340.0,2284.0
901,2018/05/01,2306.0,2305.658,2317.0,21900,2320.0,2292.0
902,2018/05/02,2288.0,2289.825,2307.0,16000,2308.0,2280.0
903,2018/05/07,2271.0,2267.646,2280.0,16400,2280.0,2256.0
904,2018/05/08,2299.0,2295.988,2270.0,32400,2310.0,2263.0
905,2018/05/09,2278.0,2283.914,2310.0,23200,2310.0,2270.0
906,2018/05/10,2293.0,2284.091,2268.0,14300,2299.0,2264.0
907,2018/05/11,2338.0,2333.939,2276.0,49000,2352.0,2276.0
908,2018/05/14,2353.0,2321.675,2229.0,91300,2358.0,2224.0
909,2018/05/15,2365.0,2376.351,2359.0,74600,2396.0,2352.0
910,2018/05/16,2377.0,2379.351,2379.0,46100,2393.0,2365.0
911,2018/05/17,2366.0,2364.109,2388.0,39500,2388.0,2342.0
912,2018/05/18,2348.0,2349.737,2361.0,30400,2364.0,2340.0
913,2018/05/21,2354.0,2376.089,2366.0,43900,2406.0,2352.0
914,2018/05/22,2348.0,2355.904,2360.0,41600,2384.0,2334.0
915,2018/05/23,2337.0,2339.628,2349.0,24700,2355.0,2327.0
916,2018/05/24,2291.0,2313.762,2330.0,45700,2332.0,2288.0
917,2018/05/25,2250.0,2265.327,2280.0,86900,2287.0,2243.0
918,2018/05/28,2219.0,2226.178,2280.0,29300,2280.0,2206.0
919,2018/05/29,2152.0,2163.57,2207.0,24400,2211.0,2148.0
920,2018/05/30,2170.0,2156.006,2152.0,49200,2174.0,2136.0
921,2018/05/31,2217.0,2207.426,2190.0,48600,2225.0,2184.0
922,2018/06/01,2226.0,2221.019,2217.0,25900,2241.0,2192.0
923,2018/06/04,2278.0,2271.728,2263.0,34900,2280.0,2254.0
924,2018/06/05,2387.0,2362.987,2308.0,135200,2392.0,2295.0
925,2018/06/06,2394.0,2414.534,2387.0,121600,2444.0,2385.0
926,2018/06/07,2419.0,2470.579,2438.0,164700,2525.0,2409.0
927,2018/06/08,2318.0,2361.758,2401.0,71100,2415.0,2317.0
928,2018/06/11,2261.0,2284.27,2318.0,34500,2335.0,2261.0
929,2018/06/12,2295.0,2292.186,2311.0,51200,2334.0,2269.0
930,2018/06/13,2327.0,2322.19,2305.0,26800,2334.0,2301.0
931,2018/06/14,2302.0,2316.64,2332.0,27500,2354.0,2294.0
932,2018/06/15,2292.0,2293.805,2315.0,26700,2315.0,2285.0
933,2018/06/18,2309.0,2297.78,2280.0,29100,2319.0,2280.0
934,2018/06/19,2311.0,2308.521,2301.0,33800,2327.0,2293.0
935,2018/06/20,2358.0,2330.452,2311.0,52200,2360.0,2289.0
936,2018/06/21,2351.0,2371.072,2378.0,69600,2413.0,2349.0
937,2018/06/22,2359.0,2341.058,2335.0,95500,2359.0,2281.0
938,2018/06/25,2314.0,2321.922,2357.0,26900,2357.0,2304.0
939,2018/06/26,2282.0,2281.28,2287.0,39300,2300.0,2259.0
940,2018/06/27,2293.0,2287.707,2268.0,43000,2325.0,2263.0
941,2018/06/28,2250.0,2252.391,2261.0,37600,2266.0,2241.0
942,2018/06/29,2258.0,2252.171,2242.0,27500,2272.0,2236.0
943,2018/07/02,2240.0,2265.542,2256.0,28400,2299.0,2237.0
944,2018/07/03,2250.0,2242.069,2240.0,55300,2251.0,2225.0
945,2018/07/04,2254.0,2249.754,2226.0,48700,2266.0,2212.0
946,2018/07/05,2247.0,2265.307,2252.0,48800,2290.0,2242.0
947,2018/07/06,2265.0,2254.461,2250.0,51900,2272.0,2240.0
948,2018/07/09,2273.0,2266.004,2266.0,22900,2281.0,2233.0
949,2018/07/10,2282.0,2296.186,2299.0,31700,2318.0,2282.0
950,2018/07/11,2263.0,2258.985,2280.0,27200,2280.0,2243.0
951,2018/07/12,2285.0,2285.649,2289.0,29300,2297.0,2265.0
952,2018/07/13,2324.0,2319.432,2308.0,25900,2335.0,2308.0
953,2018/07/17,2338.0,2344.216,2330.0,27800,2363.0,2330.0
954,2018/07/18,2325.0,2336.257,2350.0,23000,2354.0,2319.0
955,2018/07/19,2328.0,2324.98,2312.0,24400,2334.0,2311.0
956,2018/07/20,2315.0,2314.152,2331.0,23700,2331.0,2297.0
957,2018/07/23,2334.0,2335.835,2314.0,24900,2356.0,2309.0
958,2018/07/24,2332.0,2331.853,2349.0,18400,2349.0,2322.0
959,2018/07/25,2369.0,2361.739,2350.0,27200,2372.0,2342.0
960,2018/07/26,2399.0,2398.728,2380.0,41600,2413.0,2380.0
961,2018/07/27,2366.0,2375.22,2382.0,38700,2403.0,2358.0
962,2018/07/30,2311.0,2321.476,2380.0,49000,2380.0,2294.0
963,2018/07/31,2280.0,2284.143,2311.0,51000,2324.0,2271.0
964,2018/08/01,2268.0,2264.676,2288.0,42900,2288.0,2248.0
965,2018/08/02,2245.0,2247.268,2269.0,49600,2301.0,2234.0
966,2018/08/03,2212.0,2222.407,2250.0,25300,2262.0,2207.0
967,2018/08/06,2192.0,2203.685,2212.0,29800,2224.0,2180.0
968,2018/08/07,2196.0,2198.373,2172.0,20900,2229.0,2172.0
969,2018/08/08,2202.0,2208.221,2198.0,19900,2222.0,2197.0
970,2018/08/09,2195.0,2192.101,2195.0,29600,2207.0,2176.0
971,2018/08/10,2196.0,2196.099,2193.0,23300,2214.0,2182.0
972,2018/08/13,2122.0,2135.641,2164.0,41200,2167.0,2119.0
973,2018/08/14,2239.0,2221.807,2172.0,54900,2279.0,2163.0
974,2018/08/15,2250.0,2250.39,2239.0,44100,2259.0,2230.0
975,2018/08/16,2214.0,2220.057,2247.0,21200,2247.0,2200.0
976,2018/08/17,2204.0,2199.691,2214.0,19100,2214.0,2190.0
977,2018/08/20,2155.0,2167.213,2199.0,27300,2199.0,2155.0
978,2018/08/21,2201.0,2180.468,2158.0,47700,2208.0,2141.0
979,2018/08/22,2256.0,2233.291,2197.0,36400,2261.0,2189.0
980,2018/08/23,2297.0,2293.419,2257.0,45100,2313.0,2254.0
981,2018/08/24,2305.0,2297.704,2294.0,27000,2305.0,2281.0
982,2018/08/27,2314.0,2311.378,2305.0,56600,2321.0,2296.0
983,2018/08/28,2369.0,2358.751,2347.0,38200,2369.0,2342.0
984,2018/08/29,2396.0,2394.638,2365.0,40100,2409.0,2365.0
985,2018/08/30,2427.0,2422.506,2408.0,38900,2438.0,2407.0
986,2018/08/31,2449.0,2447.348,2392.0,39700,2469.0,2392.0
987,2018/09/03,2423.0,2430.765,2457.0,18300,2457.0,2401.0
988,2018/09/04,2384.0,2395.154,2423.0,21500,2427.0,2382.0
989,2018/09/05,2361.0,2366.984,2390.0,18700,2391.0,2355.0
990,2018/09/06,2341.0,2336.567,2329.0,20800,2349.0,2325.0
991,2018/09/07,2346.0,2338.839,2330.0,20500,2353.0,2310.0
992,2018/09/10,2344.0,2351.475,2349.0,14100,2370.0,2344.0
993,2018/09/11,2353.0,2351.0,2347.0,24600,2361.0,2330.0
994,2018/09/12,2304.0,2306.428,2365.0,22200,2365.0,2292.0
995,2018/09/13,2320.0,2323.033,2301.0,15000,2350.0,2292.0
996,2018/09/14,2440.0,2399.931,2341.0,76900,2446.0,2341.0
997,2018/09/18,2663.0,2620.587,2560.0,594400,2700.0,2520.0
998,2018/09/19,2697.0,2684.014,2700.0,239500,2708.0,2650.0
999,2018/09/20,2702.0,2675.428,2671.0,159000,2703.0,2629.0
1000,2018/09/21,2681.0,2673.273,2683.0,153600,2704.0,2631.0
1001,2018/09/25,2740.0,2724.398,2697.0,113600,2747.0,2670.0
1002,2018/09/26,2700.0,2664.082,2685.0,94900,2702.0,2623.0
1003,2018/09/27,2620.0,2635.835,2675.0,62500,2675.0,2606.0
1004,2018/09/28,2619.0,2631.583,2657.0,52500,2660.0,2607.0
1005,2018/10/01,2631.0,2624.95,2603.0,35900,2652.0,2582.0
1006,2018/10/02,2572.0,2604.037,2618.0,59100,2669.0,2568.0
1007,2018/10/03,2544.0,2562.959,2574.0,31900,2596.0,2537.0
1008,2018/10/04,2563.0,2544.426,2534.0,65500,2582.0,2501.0
1009,2018/10/05,2557.0,2561.675,2502.0,58500,2580.0,2502.0
1010,2018/10/09,2553.0,2559.437,2563.0,47400,2587.0,2536.0
1011,2018/10/10,2559.0,2545.902,2535.0,29500,2569.0,2513.0
1012,2018/10/11,2414.0,2428.099,2448.0,70700,2456.0,2408.0
1013,2018/10/12,2414.0,2416.751,2378.0,55900,2441.0,2378.0
1014,2018/10/15,2353.0,2377.389,2420.0,45500,2421.0,2350.0
1015,2018/10/16,2354.0,2337.576,2350.0,37000,2368.0,2310.0
1016,2018/10/17,2410.0,2402.088,2405.0,63700,2431.0,2380.0
1017,2018/10/18,2414.0,2424.31,2430.0,45800,2446.0,2399.0
1018,2018/10/19,2353.0,2353.218,2382.0,60500,2393.0,2332.0
1019,2018/10/22,2359.0,2344.441,2315.0,44400,2377.0,2308.0
1020,2018/10/23,2308.0,2310.795,2352.0,37100,2352.0,2287.0
1021,2018/10/24,2305.0,2280.303,2302.0,100300,2316.0,2245.0
1022,2018/10/25,2180.0,2218.858,2260.0,74400,2269.0,2180.0
1023,2018/10/26,2140.0,2162.971,2202.0,55200,2211.0,2132.0
1024,2018/10/29,2066.0,2096.251,2142.0,64100,2150.0,2063.0
1025,2018/10/30,2110.0,2076.679,2026.0,115500,2120.0,1999.0
1026,2018/10/31,2206.0,2183.277,2160.0,68900,2206.0,2133.0
1027,2018/11/01,2180.0,2194.479,2185.0,55300,2216.0,2172.0
1028,2018/11/02,2259.0,2235.95,2203.0,53600,2263.0,2200.0
1029,2018/11/05,2281.0,2282.384,2260.0,42500,2300.0,2233.0
1030,2018/11/06,2322.0,2321.99,2288.0,38800,2340.0,2288.0
1031,2018/11/07,2240.0,2252.844,2240.0,102900,2305.0,2212.0
1032,2018/11/08,2547.0,2513.747,2307.0,174000,2572.0,2300.0
1033,2018/11/09,2588.0,2603.949,2548.0,128900,2667.0,2540.0
1034,2018/11/12,2540.0,2555.004,2571.0,46300,2587.0,2533.0
1035,2018/11/13,2483.0,2488.677,2507.0,43400,2510.0,2472.0
1036,2018/11/14,2465.0,2478.196,2484.0,42400,2505.0,2463.0
1037,2018/11/15,2427.0,2444.656,2425.0,40100,2490.0,2417.0
1038,2018/11/16,2304.0,2338.515,2415.0,65700,2435.0,2297.0
1039,2018/11/19,2366.0,2365.366,2291.0,69700,2394.0,2291.0
1040,2018/11/20,2325.0,2314.073,2316.0,33100,2338.0,2280.0
1041,2018/11/21,2304.0,2301.512,2276.0,42000,2334.0,2237.0
1042,2018/11/22,2299.0,2296.795,2353.0,33100,2353.0,2260.0
1043,2018/11/26,2336.0,2330.179,2286.0,36800,2357.0,2281.0
1044,2018/11/27,2366.0,2356.705,2355.0,42400,2378.0,2303.0
1045,2018/11/28,2412.0,2393.638,2366.0,50500,2413.0,2342.0
1046,2018/11/29,2420.0,2428.043,2451.0,34700,2468.0,2407.0
1047,2018/11/30,2436.0,2428.512,2398.0,65100,2444.0,2387.0
1048,2018/12/03,2441.0,2450.511,2473.0,37600,2473.0,2431.0
1049,2018/12/04,2421.0,2421.377,2435.0,54400,2449.0,2400.0
1050,2018/12/05,2379.0,2377.059,2371.0,40800,2421.0,2339.0
1051,2018/12/06,2386.0,2379.064,2429.0,91600,2429.0,2352.0
1052,2018/12/07,2360.0,2354.468,2386.0,49100,2412.0,2322.0
1053,2018/12/10,2346.0,2335.669,2316.0,60800,2383.0,2283.0
1054,2018/12/11,2254.0,2289.803,2337.0,31500,2363.0,2250.0
1055,2018/12/12,2239.0,2251.119,2248.0,44700,2291.0,2207.0
1056,2018/12/13,2248.0,2252.868,2250.0,39500,2278.0,2230.0
1057,2018/12/14,2160.0,2186.89,2236.0,64600,2236.0,2153.0
1058,2018/12/17,2156.0,2153.412,2158.0,58700,2174.0,2121.0
1059,2018/12/18,2060.0,2076.994,2100.0,49400,2116.0,2057.0
1060,2018/12/19,2049.0,2054.245,2060.0,54800,2074.0,2012.0
1061,2018/12/20,1943.0,1949.255,2009.0,66700,2011.0,1920.0
1062,2018/12/21,1872.0,1877.595,1923.0,119100,1937.0,1843.0
1063,2018/12/25,1750.0,1757.983,1764.0,120700,1793.0,1735.0
1064,2018/12/26,1775.0,1773.999,1748.0,119400,1813.0,1740.0
1065,2018/12/27,1853.0,1842.562,1880.0,94200,1880.0,1814.0
1066,2018/12/28,1835.0,1832.795,1816.0,63900,1851.0,1809.0
1067,2019/01/04,1766.0,1743.156,1756.0,101600,1773.0,1706.0
1068,2019/01/07,1855.0,1853.883,1830.0,87100,1882.0,1818.0
1069,2019/01/08,1829.0,1828.424,1858.0,58700,1858.0,1811.0
1070,2019/01/09,1798.0,1812.575,1834.0,144800,1847.0,1788.0
1071,2019/01/10,1832.0,1831.162,1795.0,82700,1871.0,1785.0
1072,2019/01/11,1804.0,1808.989,1813.0,97400,1843.0,1769.0
1073,2019/01/15,1854.0,1837.211,1809.0,78200,1868.0,1781.0
1074,2019/01/16,1888.0,1889.036,1865.0,72400,1910.0,1853.0
1075,2019/01/17,1911.0,1921.966,1959.0,78200,1959.0,1884.0
1076,2019/01/18,1909.0,1919.119,1942.0,59000,1948.0,1898.0
1077,2019/01/21,1968.0,1974.665,1950.0,94400,1998.0,1945.0
1078,2019/01/22,1963.0,1963.619,1981.0,82100,1984.0,1949.0
1079,2019/01/23,1951.0,1952.711,1933.0,69900,1984.0,1913.0
1080,2019/01/24,1994.0,1976.348,1953.0,89600,2001.0,1905.0
1081,2019/01/25,1993.0,2007.071,2007.0,81600,2042.0,1977.0
1082,2019/01/28,1984.0,1996.293,2011.0,45000,2017.0,1980.0
1083,2019/01/29,1974.0,1961.379,1980.0,91300,1986.0,1939.0
1084,2019/01/30,1921.0,1936.476,1970.0,63300,1979.0,1921.0
1085,2019/01/31,1918.0,1923.236,1930.0,82900,1945.0,1904.0
1086,2019/02/01,1930.0,1939.889,1926.0,92200,1970.0,1918.0
1087,2019/02/04,1995.0,1978.947,1943.0,79900,2012.0,1933.0
1088,2019/02/05,2038.0,2024.58,2008.0,78600,2041.0,1994.0
1089,2019/02/06,2004.0,2008.675,2031.0,57500,2031.0,1989.0
1090,2019/02/07,2003.0,1991.53,2004.0,67600,2020.0,1966.0
1091,2019/02/08,1921.0,1924.624,1933.0,113400,1962.0,1904.0
1092,2019/02/12,1987.0,1977.825,1939.0,74300,1992.0,1921.0
1093,2019/02/13,2054.0,2034.477,2012.0,74400,2058.0,1988.0
1094,2019/02/14,2032.0,2038.91,2044.0,69100,2061.0,2025.0
1095,2019/02/15,2017.0,2012.641,2020.0,37600,2028.0,1992.0
1096,2019/02/18,2045.0,2049.923,2040.0,36200,2065.0,2030.0
1097,2019/02/19,2083.0,2073.158,2058.0,59500,2089.0,2046.0
1098,2019/02/20,2054.0,2072.075,2082.0,38900,2100.0,2052.0
1099,2019/02/21,2075.0,2066.648,2078.0,77800,2078.0,2047.0
1100,2019/02/22,2060.0,2062.281,2067.0,41300,2084.0,2052.0
1101,2019/02/25,2052.0,2052.876,2088.0,53100,2089.0,2038.0
1102,2019/02/26,2046.0,2041.977,2050.0,43300,2059.0,2033.0
1103,2019/02/27,2069.0,2059.738,2047.0,58700,2075.0,2043.0
1104,2019/02/28,2062.0,2056.767,2048.0,72500,2067.0,2040.0
1105,2019/03/01,2033.0,2054.183,2050.0,76000,2089.0,2033.0
1106,2019/03/04,2045.0,2034.912,2039.0,52300,2049.0,2020.0
1107,2019/03/05,2017.0,2011.775,2026.0,75400,2027.0,1999.0
1108,2019/03/06,1996.0,2000.659,2020.0,55700,2020.0,1996.0
1109,2019/03/07,1949.0,1953.533,1993.0,81800,1993.0,1935.0
1110,2019/03/08,1887.0,1890.377,1912.0,94700,1917.0,1865.0
1111,2019/03/11,1874.0,1871.536,1884.0,71500,1897.0,1857.0
1112,2019/03/12,1895.0,1894.657,1906.0,88000,1912.0,1882.0
1113,2019/03/13,1850.0,1858.859,1895.0,111200,1895.0,1840.0
1114,2019/03/14,1827.0,1837.34,1861.0,86300,1861.0,1825.0
1115,2019/03/15,1822.0,1833.314,1837.0,98500,1852.0,1821.0
1116,2019/03/18,1896.0,1872.982,1850.0,112600,1896.0,1844.0
1117,2019/03/19,1886.0,1888.853,1898.0,89800,1898.0,1877.0
1118,2019/03/20,1939.0,1918.603,1891.0,108200,1940.0,1890.0
1119,2019/03/22,1983.0,1967.359,1943.0,150900,1984.0,1939.0
1120,2019/03/25,1941.0,1935.598,1960.0,100000,1960.0,1917.0
1121,2019/03/26,1978.0,1986.911,1958.0,246200,2011.0,1958.0
1122,2019/03/27,2047.0,2025.52,1981.0,294500,2052.0,1962.0
1123,2019/03/28,2027.0,2011.191,2008.0,97800,2038.0,1966.0
1124,2019/03/29,2047.0,2038.369,2025.0,131300,2058.0,1998.0
1125,2019/04/01,2037.0,2047.304,2060.0,82700,2066.0,2029.0
1126,2019/04/02,2034.0,2048.512,2062.0,159700,2082.0,2028.0
1127,2019/04/03,2063.0,2075.148,2068.0,199600,2097.0,2053.0
1128,2019/04/04,2024.0,2046.069,2058.0,152000,2093.0,2020.0
1129,2019/04/05,1982.0,1988.601,2024.0,129200,2025.0,1977.0
1130,2019/04/08,1915.0,1931.244,1987.0,119900,1987.0,1913.0
1131,2019/04/09,1931.0,1924.363,1910.0,95700,1935.0,1910.0
1132,2019/04/10,1894.0,1900.72,1912.0,85700,1924.0,1894.0
1133,2019/04/11,1896.0,1900.635,1899.0,54800,1916.0,1890.0
1134,2019/04/12,1952.0,1933.829,1916.0,105500,1961.0,1898.0
1135,2019/04/15,1988.0,1992.124,1980.0,109300,2027.0,1979.0
1136,2019/04/16,1939.0,1947.886,1965.0,64800,1971.0,1933.0
1137,2019/04/17,1940.0,1943.325,1949.0,65000,1963.0,1929.0
1138,2019/04/18,1882.0,1896.83,1940.0,115000,1940.0,1875.0
1139,2019/04/19,1881.0,1883.368,1890.0,42700,1903.0,1875.0
1140,2019/04/22,1882.0,1878.114,1884.0,56100,1889.0,1865.0
1141,2019/04/23,1865.0,1864.991,1875.0,67100,1882.0,1856.0
1142,2019/04/24,1825.0,1840.414,1870.0,85100,1870.0,1824.0
1143,2019/04/25,1818.0,1815.03,1824.0,95400,1827.0,1804.0
1144,2019/04/26,1799.0,1786.999,1804.0,130100,1804.0,1771.0
1145,2019/05/07,1786.0,1799.785,1794.0,117600,1823.0,1786.0
1146,2019/05/08,1726.0,1736.747,1757.0,125100,1766.0,1723.0
1147,2019/05/09,1668.0,1687.778,1716.0,148100,1722.0,1668.0
1148,2019/05/10,1704.0,1695.974,1668.0,136300,1721.0,1652.0
1149,2019/05/13,1666.0,1678.387,1686.0,77800,1701.0,1661.0
1150,2019/05/14,1563.0,1539.469,1501.0,171400,1582.0,1490.0
1151,2019/05/15,1601.0,1585.946,1591.0,123200,1602.0,1549.0
1152,2019/05/16,1552.0,1560.207,1582.0,146600,1582.0,1547.0
1153,2019/05/17,1587.0,1570.394,1573.0,167900,1590.0,1540.0
1154,2019/05/20,1577.0,1578.989,1581.0,141400,1613.0,1562.0
1155,2019/05/21,1573.0,1565.264,1565.0,134500,1589.0,1549.0
1156,2019/05/22,1577.0,1590.379,1590.0,181300,1612.0,1572.0
1157,2019/05/23,1577.0,1582.739,1572.0,170600,1605.0,1565.0
1158,2019/05/24,1556.0,1557.564,1582.0,150900,1582.0,1540.0
1159,2019/05/27,1550.0,1551.22,1551.0,187600,1567.0,1531.0
1160,2019/05/28,1561.0,1555.404,1559.0,165000,1569.0,1545.0
1161,2019/05/29,1533.0,1531.667,1542.0,126600,1549.0,1512.0
1162,2019/05/30,1517.0,1506.824,1514.0,214400,1519.0,1487.0
1163,2019/05/31,1494.0,1502.522,1506.0,102000,1518.0,1486.0
1164,2019/06/03,1423.0,1432.061,1468.0,178800,1470.0,1412.0
1165,2019/06/04,1478.0,1460.996,1440.0,112300,1479.0,1433.0
1166,2019/06/05,1508.0,1505.561,1505.0,106000,1517.0,1489.0
1167,2019/06/06,1466.0,1486.24,1508.0,85000,1515.0,1466.0
1168,2019/06/07,1492.0,1492.826,1469.0,93400,1503.0,1469.0
1169,2019/06/10,1507.0,1510.002,1509.0,90300,1522.0,1501.0
1170,2019/06/11,1530.0,1525.663,1507.0,66700,1538.0,1498.0
1171,2019/06/12,1522.0,1527.604,1530.0,61400,1536.0,1521.0
1172,2019/06/13,1467.0,1477.0,1500.0,113400,1502.0,1462.0
1173,2019/06/14,1469.0,1472.264,1469.0,69400,1481.0,1460.0
1174,2019/06/17,1448.0,1455.493,1469.0,85000,1472.0,1448.0
1175,2019/06/18,1412.0,1429.406,1448.0,128500,1455.0,1412.0
1176,2019/06/19,1478.0,1466.538,1432.0,160000,1478.0,1431.0
1177,2019/06/20,1488.0,1485.394,1481.0,112600,1495.0,1469.0
1178,2019/06/21,1490.0,1495.278,1491.0,195400,1523.0,1478.0
1179,2019/06/24,1507.0,1503.511,1509.0,58100,1512.0,1489.0
1180,2019/06/25,1507.0,1518.663,1529.0,74200,1536.0,1503.0
1181,2019/06/26,1511.0,1522.297,1511.0,91900,1538.0,1504.0
1182,2019/06/27,1552.0,1544.275,1533.0,103500,1553.0,1526.0
1183,2019/06/28,1555.0,1558.698,1551.0,100900,1580.0,1547.0
1184,2019/07/01,1614.0,1597.197,1595.0,113500,1614.0,1576.0
1185,2019/07/02,1620.0,1611.37,1620.0,98900,1622.0,1596.0
1186,2019/07/03,1612.0,1614.628,1617.0,93900,1630.0,1605.0
1187,2019/07/04,1635.0,1629.105,1613.0,58800,1640.0,1612.0
1188,2019/07/05,1626.0,1624.757,1633.0,48500,1640.0,1615.0
1189,2019/07/08,1619.0,1623.988,1628.0,60200,1633.0,1616.0
1190,2019/07/09,1618.0,1624.932,1622.0,71900,1639.0,1618.0
1191,2019/07/10,1612.0,1612.556,1612.0,73900,1628.0,1598.0
1192,2019/07/11,1626.0,1624.932,1616.0,49600,1635.0,1613.0
1193,2019/07/12,1598.0,1610.1,1630.0,74000,1631.0,1598.0
1194,2019/07/16,1581.0,1588.117,1595.0,65100,1608.0,1580.0
1195,2019/07/17,1569.0,1569.299,1571.0,72900,1585.0,1551.0
1196,2019/07/18,1525.0,1530.731,1551.0,115000,1552.0,1516.0
1197,2019/07/19,1571.0,1566.856,1543.0,72800,1577.0,1543.0
1198,2019/07/22,1585.0,1584.71,1571.0,71400,1592.0,1567.0
1199,2019/07/23,1629.0,1626.738,1590.0,87900,1641.0,1590.0
1200,2019/07/24,1686.0,1675.953,1658.0,129800,1694.0,1644.0
1201,2019/07/25,1706.0,1702.797,1722.0,116300,1722.0,1679.0
1202,2019/07/26,1673.0,1676.848,1688.0,85100,1691.0,1670.0
1203,2019/07/29,1653.0,1654.36,1681.0,59800,1681.0,1646.0
1204,2019/07/30,1663.0,1661.817,1653.0,64500,1673.0,1653.0
1205,2019/07/31,1648.0,1652.786,1658.0,60200,1665.0,1648.0
1206,2019/08/01,1675.0,1668.944,1651.0,55000,1679.0,1651.0
1207,2019/08/02,1592.0,1603.652,1630.0,121700,1639.0,1578.0
1208,2019/08/05,1558.0,1555.623,1574.0,96900,1583.0,1532.0
1209,2019/08/06,1559.0,1526.104,1487.0,152900,1559.0,1475.0
1210,2019/08/07,1547.0,1553.044,1558.0,68900,1571.0,1545.0
1211,2019/08/08,1555.0,1555.969,1552.0,73400,1568.0,1543.0
1212,2019/08/09,1561.0,1559.663,1566.0,82800,1566.0,1547.0
1213,2019/08/13,1603.0,1596.31,1562.0,116600,1628.0,1562.0
1214,2019/08/14,1668.0,1698.171,1762.0,307500,1763.0,1654.0
1215,2019/08/15,1649.0,1630.528,1620.0,199500,1660.0,1590.0
1216,2019/08/16,1660.0,1660.99,1649.0,85500,1675.0,1647.0
1217,2019/08/19,1659.0,1672.072,1689.0,96500,1690.0,1658.0
1218,2019/08/20,1680.0,1677.897,1670.0,67800,1689.0,1659.0
1219,2019/08/21,1693.0,1685.787,1683.0,85900,1698.0,1670.0
1220,2019/08/22,1682.0,1701.611,1713.0,120400,1729.0,1676.0
1221,2019/08/23,1719.0,1708.481,1697.0,110700,1722.0,1688.0
