,Date,Close,VWAP,Open,Volume,High,Low
0,2014/08/25,5900.0,5896.718,5880.0,78300,5930.0,5850.0
1,2014/08/26,5850.0,5880.692,5940.0,91100,5940.0,5850.0
2,2014/08/27,5960.0,5932.662,5900.0,140500,5990.0,5870.0
3,2014/08/28,5910.0,5908.922,5920.0,135400,5930.0,5890.0
4,2014/08/29,5870.0,5885.915,5910.0,131700,5910.0,5850.0
5,2014/09/01,5490.0,5589.991,5810.0,541700,5840.0,5460.0
6,2014/09/02,5340.0,5321.079,5450.0,490300,5460.0,5250.0
7,2014/09/03,5320.0,5323.905,5370.0,310600,5440.0,5250.0
8,2014/09/04,5320.0,5340.678,5420.0,154900,5420.0,5310.0
9,2014/09/05,5250.0,5277.729,5320.0,154100,5360.0,5250.0
10,2014/09/08,5290.0,5273.722,5260.0,93500,5310.0,5250.0
11,2014/09/09,5260.0,5278.809,5280.0,97400,5300.0,5260.0
12,2014/09/10,5310.0,5237.102,5250.0,157700,5340.0,5150.0
13,2014/09/11,5440.0,5415.759,5380.0,167900,5480.0,5330.0
14,2014/09/12,5280.0,5346.067,5420.0,194500,5430.0,5280.0
15,2014/09/16,5350.0,5309.174,5320.0,163500,5370.0,5250.0
16,2014/09/17,5320.0,5335.184,5390.0,128100,5400.0,5310.0
17,2014/09/18,5380.0,5363.992,5330.0,155800,5420.0,5300.0
18,2014/09/19,5460.0,5448.092,5440.0,95900,5480.0,5400.0
19,2014/09/22,5690.0,5621.072,5500.0,224800,5730.0,5480.0
20,2014/09/24,5590.0,5618.736,5680.0,185900,5700.0,5560.0
21,2014/09/25,5610.0,5614.163,5590.0,112900,5640.0,5590.0
22,2014/09/26,5610.0,5553.889,5450.0,161500,5640.0,5440.0
23,2014/09/29,5600.0,5611.917,5700.0,100700,5700.0,5550.0
24,2014/09/30,5600.0,5582.47,5590.0,82600,5630.0,5540.0
25,2014/10/01,5390.0,5441.498,5550.0,140900,5550.0,5360.0
26,2014/10/02,5110.0,5163.304,5280.0,308400,5290.0,5070.0
27,2014/10/03,5130.0,5088.691,5090.0,195600,5150.0,5010.0
28,2014/10/06,5260.0,5247.998,5220.0,87400,5290.0,5190.0
29,2014/10/07,5220.0,5218.146,5180.0,76600,5270.0,5180.0
30,2014/10/08,5140.0,5150.009,5120.0,117600,5200.0,5120.0
31,2014/10/09,5050.0,5086.521,5150.0,103200,5170.0,5030.0
32,2014/10/10,4930.0,4943.793,4975.0,198900,5020.0,4885.0
33,2014/10/14,4870.0,4874.771,4800.0,155300,4935.0,4775.0
34,2014/10/15,4915.0,4902.903,4905.0,96800,4945.0,4870.0
35,2014/10/16,4830.0,4819.051,4775.0,221900,4880.0,4745.0
36,2014/10/17,4775.0,4796.961,4800.0,177700,4930.0,4730.0
37,2014/10/20,5050.0,5002.352,4875.0,104400,5060.0,4875.0
38,2014/10/21,4795.0,4846.018,5010.0,178800,5020.0,4780.0
39,2014/10/22,4965.0,4917.559,4905.0,101200,4975.0,4850.0
40,2014/10/23,4915.0,4932.261,4920.0,69000,4985.0,4870.0
41,2014/10/24,4910.0,4935.474,5010.0,69700,5020.0,4880.0
42,2014/10/27,4915.0,4915.31,4980.0,75900,4990.0,4875.0
43,2014/10/28,4880.0,4893.365,4900.0,83800,4980.0,4830.0
44,2014/10/29,4930.0,4911.969,4950.0,109200,4960.0,4885.0
45,2014/10/30,5040.0,5013.634,4945.0,165400,5050.0,4930.0
46,2014/10/31,4110.0,4121.442,4100.0,941500,4285.0,4040.0
47,2014/11/04,3900.0,4016.724,4240.0,814800,4240.0,3855.0
48,2014/11/05,3995.0,3978.411,3900.0,549400,4075.0,3820.0
49,2014/11/06,3900.0,3956.019,4040.0,350200,4045.0,3895.0
50,2014/11/07,3905.0,3907.859,3910.0,208800,3960.0,3880.0
51,2014/11/10,3945.0,3936.116,3925.0,155000,3990.0,3900.0
52,2014/11/11,3915.0,3915.267,3945.0,200400,3950.0,3890.0
53,2014/11/12,3925.0,3925.337,3940.0,202000,3945.0,3905.0
54,2014/11/13,3995.0,3953.782,3905.0,186000,4015.0,3895.0
55,2014/11/14,4090.0,4059.539,4000.0,187600,4090.0,4000.0
56,2014/11/17,3940.0,3984.552,4095.0,206600,4125.0,3910.0
57,2014/11/18,3960.0,3942.866,3930.0,116000,4000.0,3910.0
58,2014/11/19,3945.0,3963.008,3985.0,112200,4010.0,3945.0
59,2014/11/20,3935.0,3958.84,3965.0,191800,4035.0,3925.0
60,2014/11/21,3870.0,3871.206,3885.0,213900,3890.0,3830.0
61,2014/11/25,3910.0,3885.183,3875.0,144700,3910.0,3860.0
62,2014/11/26,3940.0,3929.874,3900.0,111300,3965.0,3885.0
63,2014/11/27,3990.0,3999.56,3975.0,155800,4045.0,3930.0
64,2014/11/28,3965.0,3965.007,4000.0,136700,4015.0,3930.0
65,2014/12/01,3900.0,3911.681,3935.0,130600,3945.0,3895.0
66,2014/12/02,3935.0,3914.137,3900.0,102500,3935.0,3895.0
67,2014/12/03,3890.0,3890.868,3910.0,283900,3925.0,3870.0
68,2014/12/04,4120.0,4023.694,3905.0,420200,4130.0,3905.0
69,2014/12/05,4460.0,4338.21,4120.0,740900,4470.0,4120.0
70,2014/12/08,4415.0,4363.728,4510.0,706200,4585.0,4245.0
71,2014/12/09,4240.0,4284.173,4310.0,432700,4350.0,4225.0
72,2014/12/10,4280.0,4270.305,4190.0,216100,4340.0,4165.0
73,2014/12/11,4310.0,4255.943,4250.0,189200,4315.0,4190.0
74,2014/12/12,4335.0,4450.342,4540.0,466700,4550.0,4335.0
75,2014/12/15,4185.0,4224.308,4265.0,193500,4300.0,4180.0
76,2014/12/16,4235.0,4241.789,4185.0,217700,4305.0,4175.0
77,2014/12/17,4160.0,4186.522,4215.0,111400,4220.0,4155.0
78,2014/12/18,4175.0,4204.219,4230.0,86400,4245.0,4165.0
79,2014/12/19,4270.0,4254.686,4245.0,361300,4290.0,4220.0
80,2014/12/22,4320.0,4303.213,4270.0,148000,4340.0,4270.0
81,2014/12/24,4265.0,4279.602,4350.0,197100,4375.0,4245.0
82,2014/12/25,4065.0,4104.43,4200.0,369000,4220.0,4030.0
83,2014/12/26,4145.0,4100.931,4075.0,100400,4150.0,4060.0
84,2014/12/29,4125.0,4111.073,4145.0,79700,4145.0,4070.0
85,2014/12/30,4100.0,4086.494,4100.0,69600,4110.0,4065.0
86,2015/01/05,4195.0,4177.229,4110.0,147600,4210.0,4085.0
87,2015/01/06,4145.0,4149.041,4135.0,145400,4185.0,4110.0
88,2015/01/07,4170.0,4158.226,4145.0,115300,4185.0,4125.0
89,2015/01/08,4250.0,4224.221,4185.0,114900,4260.0,4180.0
90,2015/01/09,4285.0,4282.794,4255.0,160000,4325.0,4230.0
91,2015/01/13,4280.0,4269.531,4280.0,141700,4310.0,4220.0
92,2015/01/14,4260.0,4284.926,4280.0,134300,4310.0,4260.0
93,2015/01/15,4250.0,4215.765,4260.0,162800,4275.0,4175.0
94,2015/01/16,4200.0,4155.247,4160.0,147600,4200.0,4125.0
95,2015/01/19,4205.0,4190.465,4200.0,105400,4230.0,4140.0
96,2015/01/20,4220.0,4222.187,4205.0,93300,4280.0,4190.0
97,2015/01/21,4220.0,4227.414,4220.0,69600,4260.0,4180.0
98,2015/01/22,4225.0,4205.117,4210.0,63900,4245.0,4190.0
99,2015/01/23,4230.0,4232.698,4250.0,63200,4250.0,4205.0
100,2015/01/26,4335.0,4298.674,4225.0,167100,4340.0,4210.0
101,2015/01/27,4295.0,4299.15,4350.0,85300,4355.0,4250.0
102,2015/01/28,4245.0,4219.598,4235.0,124400,4260.0,4190.0
103,2015/01/29,4155.0,4180.764,4190.0,141300,4230.0,4155.0
104,2015/01/30,4225.0,4172.625,4085.0,110300,4235.0,4070.0
105,2015/02/02,4500.0,4420.009,4335.0,458000,4510.0,4310.0
106,2015/02/03,4400.0,4470.612,4505.0,238500,4615.0,4345.0
107,2015/02/04,4475.0,4495.123,4500.0,113700,4525.0,4460.0
108,2015/02/05,4425.0,4425.577,4470.0,99600,4485.0,4400.0
109,2015/02/06,4460.0,4445.111,4440.0,54300,4470.0,4405.0
110,2015/02/09,4460.0,4469.346,4465.0,94800,4505.0,4425.0
111,2015/02/10,4465.0,4474.119,4460.0,69800,4515.0,4410.0
112,2015/02/12,4355.0,4393.923,4500.0,188000,4515.0,4335.0
113,2015/02/13,4355.0,4360.43,4355.0,148800,4395.0,4340.0
114,2015/02/16,4515.0,4481.354,4395.0,229700,4530.0,4365.0
115,2015/02/17,4600.0,4581.045,4510.0,175200,4630.0,4495.0
116,2015/02/18,4695.0,4696.239,4645.0,182000,4740.0,4645.0
117,2015/02/19,5020.0,4964.069,4855.0,470000,5050.0,4855.0
118,2015/02/20,4905.0,4919.757,5030.0,201400,5040.0,4845.0
119,2015/02/23,4980.0,4960.502,4905.0,113600,4995.0,4895.0
120,2015/02/24,5020.0,5010.083,4975.0,89900,5050.0,4970.0
121,2015/02/25,5040.0,5025.179,5010.0,86500,5080.0,4980.0
122,2015/02/26,5060.0,5081.279,5040.0,158000,5170.0,4990.0
123,2015/02/27,5100.0,5099.643,5040.0,78400,5150.0,5030.0
124,2015/03/02,5070.0,5101.037,5120.0,79100,5140.0,5050.0
125,2015/03/03,5010.0,4994.325,5050.0,152500,5060.0,4960.0
126,2015/03/04,4995.0,4958.49,4910.0,116200,5010.0,4875.0
127,2015/03/05,5000.0,4991.735,4950.0,51600,5030.0,4950.0
128,2015/03/06,4995.0,4986.469,4970.0,61600,5020.0,4970.0
129,2015/03/09,5000.0,4989.587,4980.0,82300,5030.0,4930.0
130,2015/03/10,5040.0,5047.573,5000.0,82400,5100.0,4980.0
131,2015/03/11,5010.0,5002.216,4985.0,51900,5040.0,4970.0
132,2015/03/12,4995.0,4994.953,5010.0,63800,5030.0,4970.0
133,2015/03/13,4975.0,4979.262,4990.0,100900,5010.0,4930.0
134,2015/03/16,4935.0,4948.023,5000.0,122400,5000.0,4915.0
135,2015/03/17,4965.0,4992.084,4940.0,110600,5020.0,4935.0
136,2015/03/18,5000.0,4962.538,4965.0,72500,5000.0,4925.0
137,2015/03/19,5010.0,4990.478,4955.0,52300,5010.0,4955.0
138,2015/03/20,5000.0,4995.267,5010.0,39400,5010.0,4970.0
139,2015/03/23,4960.0,4969.224,4975.0,90200,5010.0,4945.0
140,2015/03/24,4995.0,4994.662,4970.0,79800,5010.0,4950.0
141,2015/03/25,4905.0,4911.678,4950.0,117400,4975.0,4885.0
142,2015/03/26,4760.0,4783.774,4835.0,89300,4835.0,4760.0
143,2015/03/27,4745.0,4763.183,4725.0,87800,4850.0,4700.0
144,2015/03/30,4790.0,4780.596,4815.0,49500,4815.0,4720.0
145,2015/03/31,4825.0,4828.683,4835.0,50500,4865.0,4805.0
146,2015/04/01,4845.0,4796.213,4775.0,121600,4855.0,4745.0
147,2015/04/02,4925.0,4905.949,4845.0,148100,4950.0,4820.0
148,2015/04/03,5010.0,4977.597,4935.0,100700,5010.0,4900.0
149,2015/04/06,5010.0,4996.768,4945.0,88800,5040.0,4915.0
150,2015/04/07,5070.0,5044.905,5020.0,99500,5090.0,4980.0
151,2015/04/08,5060.0,5064.758,5090.0,74400,5100.0,5020.0
152,2015/04/09,5020.0,5029.698,5090.0,52900,5090.0,5000.0
153,2015/04/10,5020.0,5022.658,5050.0,33300,5060.0,4990.0
154,2015/04/13,5070.0,5083.907,5020.0,86000,5120.0,5020.0
155,2015/04/14,5170.0,5137.305,5050.0,102400,5200.0,5050.0
156,2015/04/15,5090.0,5110.107,5140.0,37400,5160.0,5090.0
157,2015/04/16,5110.0,5086.628,5150.0,52200,5150.0,5050.0
158,2015/04/17,5030.0,5036.961,5120.0,43100,5120.0,5010.0
159,2015/04/20,5010.0,5015.329,5000.0,38000,5050.0,4995.0
160,2015/04/21,5050.0,5026.463,5040.0,29400,5050.0,5010.0
161,2015/04/22,5020.0,5018.955,5070.0,22000,5070.0,5000.0
162,2015/04/23,5010.0,5013.75,5020.0,38800,5050.0,4990.0
163,2015/04/24,4980.0,4992.01,4995.0,40300,5010.0,4975.0
164,2015/04/27,5010.0,5007.532,4960.0,31400,5040.0,4960.0
165,2015/04/28,4940.0,4969.53,5050.0,82900,5050.0,4935.0
166,2015/04/30,4840.0,4782.396,4750.0,160300,4855.0,4720.0
167,2015/05/01,4905.0,4874.077,4830.0,69900,4905.0,4830.0
168,2015/05/07,4850.0,4852.584,4895.0,95400,4915.0,4810.0
169,2015/05/08,4835.0,4824.637,4825.0,73000,4845.0,4805.0
170,2015/05/11,4990.0,4989.469,4900.0,116800,5030.0,4900.0
171,2015/05/12,4940.0,4942.861,4990.0,42300,4990.0,4920.0
172,2015/05/13,5130.0,5085.143,4990.0,129600,5130.0,4990.0
173,2015/05/14,5070.0,5091.093,5080.0,55800,5130.0,5060.0
174,2015/05/15,5170.0,5148.509,5090.0,138800,5180.0,5080.0
175,2015/05/18,5230.0,5183.321,5150.0,104500,5240.0,5120.0
176,2015/05/19,5360.0,5310.182,5260.0,110100,5390.0,5250.0
177,2015/05/20,5390.0,5360.428,5400.0,67700,5400.0,5310.0
178,2015/05/21,5400.0,5387.026,5390.0,42700,5420.0,5360.0
179,2015/05/22,5420.0,5390.127,5350.0,55000,5420.0,5350.0
180,2015/05/25,5300.0,5324.107,5420.0,44800,5420.0,5280.0
181,2015/05/26,5340.0,5306.651,5300.0,43300,5350.0,5260.0
182,2015/05/27,5350.0,5312.109,5270.0,27500,5350.0,5270.0
183,2015/05/28,5340.0,5347.845,5320.0,34800,5370.0,5310.0
184,2015/05/29,5310.0,5294.753,5270.0,46500,5320.0,5260.0
185,2015/06/01,5310.0,5311.353,5320.0,56900,5340.0,5280.0
186,2015/06/02,5340.0,5318.567,5340.0,67700,5360.0,5260.0
187,2015/06/03,5400.0,5376.323,5330.0,55200,5400.0,5330.0
188,2015/06/04,5140.0,5169.846,5270.0,194800,5280.0,5120.0
189,2015/06/05,4990.0,4994.796,5050.0,178900,5060.0,4955.0
190,2015/06/08,4995.0,5007.284,4990.0,70700,5050.0,4990.0
191,2015/06/09,4865.0,4901.093,4975.0,115300,4980.0,4865.0
192,2015/06/10,4870.0,4870.366,4900.0,68400,4900.0,4850.0
193,2015/06/11,4930.0,4924.473,4905.0,58800,4945.0,4885.0
194,2015/06/12,4980.0,4964.283,4955.0,55100,4985.0,4945.0
195,2015/06/15,5030.0,5005.425,4975.0,45900,5030.0,4975.0
196,2015/06/16,5000.0,5004.331,5030.0,39600,5040.0,4990.0
197,2015/06/17,5000.0,4995.291,5000.0,41300,5020.0,4980.0
198,2015/06/18,4995.0,4993.31,4975.0,50600,5020.0,4975.0
199,2015/06/19,5140.0,5103.159,4995.0,119200,5160.0,4995.0
200,2015/06/22,5090.0,5071.902,5090.0,44700,5130.0,5030.0
201,2015/06/23,5160.0,5148.195,5120.0,69800,5180.0,5110.0
202,2015/06/24,5220.0,5205.082,5150.0,85200,5250.0,5150.0
203,2015/06/25,5080.0,5100.798,5150.0,65200,5160.0,5050.0
204,2015/06/26,5050.0,5075.67,5090.0,35100,5120.0,5050.0
205,2015/06/29,4960.0,4962.884,4915.0,50800,4990.0,4915.0
206,2015/06/30,4975.0,4964.102,4940.0,47300,4990.0,4930.0
207,2015/07/01,5090.0,5063.503,4990.0,39400,5100.0,4990.0
208,2015/07/02,5050.0,5064.029,5090.0,34000,5120.0,5020.0
209,2015/07/03,5010.0,5011.907,5020.0,58200,5050.0,4995.0
210,2015/07/06,5010.0,5006.827,5000.0,52000,5050.0,4965.0
211,2015/07/07,4940.0,4954.537,5000.0,136200,5020.0,4920.0
212,2015/07/08,4950.0,4946.298,4940.0,95500,4970.0,4920.0
213,2015/07/09,4875.0,4804.152,4850.0,91400,4875.0,4720.0
214,2015/07/10,4875.0,4840.925,4875.0,84300,4890.0,4770.0
215,2015/07/13,5010.0,4968.36,4875.0,56700,5020.0,4850.0
216,2015/07/14,5010.0,5019.213,5050.0,92800,5090.0,4980.0
217,2015/07/15,5020.0,5004.533,5030.0,50300,5050.0,4985.0
218,2015/07/16,4990.0,4960.42,5000.0,95300,5010.0,4920.0
219,2015/07/17,5010.0,4989.357,5000.0,45900,5010.0,4940.0
220,2015/07/21,4995.0,4965.912,5010.0,74600,5010.0,4935.0
221,2015/07/22,4910.0,4902.377,4945.0,97200,4955.0,4870.0
222,2015/07/23,4865.0,4850.164,4905.0,57800,4905.0,4825.0
223,2015/07/24,4835.0,4851.203,4840.0,32000,4880.0,4830.0
224,2015/07/27,4755.0,4785.675,4815.0,74100,4850.0,4740.0
225,2015/07/28,5050.0,4993.452,4745.0,279700,5080.0,4745.0
226,2015/07/29,5020.0,5028.527,5050.0,93700,5100.0,4960.0
227,2015/07/30,4905.0,4937.755,5000.0,136300,5040.0,4885.0
228,2015/07/31,5000.0,4944.039,4905.0,108700,5020.0,4845.0
229,2015/08/03,5030.0,5034.626,5030.0,73500,5070.0,5010.0
230,2015/08/04,5020.0,5021.372,5030.0,73600,5060.0,5000.0
231,2015/08/05,5040.0,5011.78,5000.0,82600,5040.0,4950.0
232,2015/08/06,5010.0,4997.613,5050.0,92600,5050.0,4950.0
233,2015/08/07,5060.0,5055.737,5020.0,80700,5080.0,5010.0
234,2015/08/10,5020.0,4985.134,5090.0,131000,5090.0,4940.0
235,2015/08/11,5020.0,5020.911,5020.0,65300,5050.0,4990.0
236,2015/08/12,5040.0,5044.187,5020.0,52300,5070.0,5010.0
237,2015/08/13,4705.0,4787.514,5000.0,294800,5000.0,4700.0
238,2015/08/14,4835.0,4777.178,4715.0,130600,4835.0,4705.0
239,2015/08/17,4925.0,4889.086,4840.0,125300,4935.0,4840.0
240,2015/08/18,5010.0,4985.109,4925.0,142400,5020.0,4925.0
241,2015/08/19,4900.0,4916.67,4960.0,53600,4980.0,4885.0
242,2015/08/20,4755.0,4791.392,4850.0,67900,4870.0,4745.0
243,2015/08/21,4525.0,4602.805,4755.0,83600,4755.0,4515.0
244,2015/08/24,4195.0,4333.432,4455.0,125600,4475.0,4195.0
245,2015/08/25,3990.0,4055.533,3975.0,126600,4200.0,3890.0
246,2015/08/26,4175.0,4113.409,4060.0,88000,4210.0,3960.0
247,2015/08/27,4255.0,4286.788,4300.0,85000,4335.0,4230.0
248,2015/08/28,4375.0,4374.861,4325.0,97200,4430.0,4305.0
249,2015/08/31,4310.0,4321.779,4355.0,56200,4370.0,4275.0
250,2015/09/01,4315.0,4325.593,4310.0,152500,4350.0,4290.0
251,2015/09/02,4045.0,4107.508,4160.0,123000,4225.0,4025.0
252,2015/09/03,4150.0,4169.011,4115.0,61200,4215.0,4115.0
253,2015/09/04,4075.0,4081.395,4145.0,99300,4150.0,4015.0
254,2015/09/07,4000.0,4009.972,3980.0,35400,4080.0,3965.0
255,2015/09/08,4005.0,4026.253,4010.0,45500,4095.0,3995.0
256,2015/09/09,4190.0,4166.314,4135.0,45300,4190.0,4135.0
257,2015/09/10,4185.0,4176.443,4120.0,92200,4220.0,4115.0
258,2015/09/11,4220.0,4196.66,4175.0,76500,4250.0,4140.0
259,2015/09/14,4185.0,4178.486,4255.0,24100,4255.0,4135.0
260,2015/09/15,4175.0,4195.78,4190.0,25000,4235.0,4155.0
261,2015/09/16,4235.0,4228.579,4200.0,29200,4265.0,4160.0
262,2015/09/17,4330.0,4324.195,4245.0,44700,4370.0,4225.0
263,2015/09/18,4230.0,4245.783,4330.0,34500,4330.0,4220.0
264,2015/09/24,4115.0,4121.722,4175.0,39500,4175.0,4085.0
265,2015/09/25,4160.0,4108.358,4090.0,26800,4160.0,4055.0
266,2015/09/28,4135.0,4141.71,4140.0,23100,4200.0,4060.0
267,2015/09/29,3990.0,4005.516,4065.0,32000,4070.0,3965.0
268,2015/09/30,4130.0,4105.062,4060.0,32400,4150.0,4035.0
269,2015/10/01,4255.0,4241.439,4190.0,27800,4280.0,4190.0
270,2015/10/02,4305.0,4271.478,4200.0,29100,4325.0,4180.0
271,2015/10/05,4270.0,4292.968,4350.0,34200,4350.0,4240.0
272,2015/10/06,4300.0,4352.8,4340.0,52500,4400.0,4300.0
273,2015/10/07,4395.0,4381.692,4310.0,47000,4415.0,4310.0
274,2015/10/08,4365.0,4394.0,4390.0,44500,4430.0,4350.0
275,2015/10/09,4455.0,4432.167,4370.0,36000,4470.0,4365.0
276,2015/10/13,4460.0,4446.779,4470.0,93600,4510.0,4400.0
277,2015/10/14,4435.0,4422.534,4430.0,66100,4455.0,4375.0
278,2015/10/15,4530.0,4505.915,4410.0,51900,4540.0,4410.0
279,2015/10/16,4380.0,4428.047,4535.0,79100,4535.0,4370.0
280,2015/10/19,4415.0,4431.565,4405.0,62300,4475.0,4390.0
281,2015/10/20,4500.0,4488.474,4415.0,53400,4515.0,4415.0
282,2015/10/21,4560.0,4550.15,4500.0,53400,4575.0,4500.0
283,2015/10/22,4635.0,4604.743,4510.0,44800,4650.0,4505.0
284,2015/10/23,4600.0,4605.3,4695.0,51600,4695.0,4545.0
285,2015/10/26,4650.0,4627.068,4600.0,53200,4670.0,4575.0
286,2015/10/27,4770.0,4779.098,4765.0,187400,4855.0,4650.0
287,2015/10/28,4400.0,4453.277,4605.0,217400,4610.0,4385.0
288,2015/10/29,4470.0,4455.383,4400.0,123900,4485.0,4395.0
289,2015/10/30,4470.0,4457.196,4495.0,46000,4495.0,4410.0
290,2015/11/02,4420.0,4416.377,4460.0,36300,4460.0,4370.0
291,2015/11/04,4490.0,4493.668,4490.0,39400,4515.0,4475.0
292,2015/11/05,4790.0,4758.95,4550.0,151400,4815.0,4550.0
293,2015/11/06,4910.0,4882.311,4790.0,101700,4925.0,4790.0
294,2015/11/09,4975.0,4961.557,4895.0,62300,4985.0,4895.0
295,2015/11/10,4905.0,4897.689,4885.0,25100,4935.0,4840.0
296,2015/11/11,4910.0,4899.24,4855.0,21700,4920.0,4855.0
297,2015/11/12,4910.0,4910.807,4915.0,21700,4930.0,4870.0
298,2015/11/13,4935.0,4919.932,4850.0,36700,4950.0,4850.0
299,2015/11/16,4820.0,4827.957,4840.0,32800,4870.0,4800.0
300,2015/11/17,4890.0,4890.892,4835.0,42600,4910.0,4835.0
301,2015/11/18,4860.0,4873.941,4835.0,28800,4910.0,4835.0
302,2015/11/19,4855.0,4877.252,4920.0,33300,4920.0,4855.0
303,2015/11/20,4880.0,4863.89,4850.0,44600,4890.0,4830.0
304,2015/11/24,4835.0,4838.584,4850.0,34600,4860.0,4825.0
305,2015/11/25,4775.0,4786.693,4815.0,38400,4820.0,4755.0
306,2015/11/26,4795.0,4811.426,4765.0,53300,4850.0,4765.0
307,2015/11/27,4780.0,4795.866,4825.0,28300,4825.0,4770.0
308,2015/11/30,4820.0,4811.21,4780.0,50000,4825.0,4780.0
309,2015/12/01,4930.0,4900.309,4825.0,66400,4940.0,4825.0
310,2015/12/02,4885.0,4897.36,4945.0,42800,4970.0,4860.0
311,2015/12/03,4835.0,4833.821,4890.0,24600,4895.0,4800.0
312,2015/12/04,4775.0,4757.79,4720.0,23300,4785.0,4710.0
313,2015/12/07,4830.0,4831.098,4775.0,34600,4870.0,4775.0
314,2015/12/08,4790.0,4790.67,4815.0,22400,4815.0,4755.0
315,2015/12/09,4725.0,4743.624,4750.0,39600,4790.0,4715.0
316,2015/12/10,4740.0,4721.051,4700.0,39500,4750.0,4630.0
317,2015/12/11,4730.0,4735.544,4730.0,23900,4780.0,4710.0
318,2015/12/14,4630.0,4624.192,4640.0,16700,4655.0,4585.0
319,2015/12/15,4570.0,4580.917,4590.0,32700,4640.0,4555.0
320,2015/12/16,4595.0,4561.137,4600.0,59800,4600.0,4505.0
321,2015/12/17,4545.0,4581.958,4630.0,52600,4675.0,4515.0
322,2015/12/18,4510.0,4540.709,4520.0,52900,4625.0,4500.0
323,2015/12/21,4460.0,4440.391,4440.0,30700,4470.0,4395.0
324,2015/12/22,4420.0,4431.452,4480.0,15500,4480.0,4405.0
325,2015/12/24,4250.0,4327.521,4420.0,60700,4445.0,4240.0
326,2015/12/25,4225.0,4236.153,4225.0,59400,4270.0,4210.0
327,2015/12/28,4300.0,4325.267,4290.0,30000,4355.0,4290.0
328,2015/12/29,4350.0,4334.956,4330.0,22500,4360.0,4260.0
329,2015/12/30,4365.0,4373.414,4350.0,20800,4400.0,4350.0
330,2016/01/04,4220.0,4251.883,4295.0,38500,4330.0,4210.0
331,2016/01/05,4185.0,4193.376,4210.0,27400,4225.0,4175.0
332,2016/01/06,4140.0,4147.932,4180.0,35300,4210.0,4105.0
333,2016/01/07,4075.0,4071.937,4095.0,81300,4105.0,4045.0
334,2016/01/08,4080.0,4088.823,4025.0,37800,4160.0,4025.0
335,2016/01/12,3930.0,3989.484,4045.0,83400,4135.0,3925.0
336,2016/01/13,4105.0,4090.668,4025.0,38200,4125.0,4005.0
337,2016/01/14,3975.0,3941.497,4000.0,53100,4000.0,3900.0
338,2016/01/15,3920.0,3948.714,4020.0,41200,4050.0,3885.0
339,2016/01/18,3895.0,3847.398,3825.0,24600,3900.0,3770.0
340,2016/01/19,3880.0,3872.606,3850.0,33000,3930.0,3835.0
341,2016/01/20,3735.0,3796.005,3870.0,43800,3940.0,3730.0
342,2016/01/21,3615.0,3691.231,3665.0,58500,3810.0,3610.0
343,2016/01/22,3865.0,3794.556,3755.0,34900,3875.0,3720.0
344,2016/01/25,3860.0,3885.762,3865.0,46600,3965.0,3825.0
345,2016/01/26,4030.0,4083.185,4100.0,161700,4170.0,4000.0
346,2016/01/27,4145.0,4139.718,4170.0,85200,4210.0,4085.0
347,2016/01/28,4105.0,4121.473,4130.0,64500,4185.0,4070.0
348,2016/01/29,4190.0,4153.575,4105.0,60000,4250.0,4075.0
349,2016/02/01,4275.0,4279.648,4250.0,69600,4310.0,4250.0
350,2016/02/02,4225.0,4236.723,4270.0,41800,4295.0,4210.0
351,2016/02/03,4095.0,4085.67,4100.0,45500,4140.0,4050.0
352,2016/02/04,3990.0,4009.579,4025.0,36800,4075.0,3970.0
353,2016/02/05,3965.0,3943.284,3900.0,27100,3975.0,3900.0
354,2016/02/08,4010.0,3986.828,3875.0,26800,4050.0,3870.0
355,2016/02/09,3805.0,3806.584,3830.0,42300,3870.0,3765.0
356,2016/02/10,3725.0,3748.313,3815.0,64900,3895.0,3680.0
357,2016/02/12,3515.0,3553.678,3580.0,60500,3625.0,3500.0
358,2016/02/15,3735.0,3704.673,3615.0,55000,3765.0,3615.0
359,2016/02/16,3740.0,3773.814,3730.0,35000,3840.0,3725.0
360,2016/02/17,3720.0,3729.183,3740.0,31200,3800.0,3650.0
361,2016/02/18,3870.0,3861.118,3795.0,48300,3905.0,3790.0
362,2016/02/19,3800.0,3815.773,3850.0,38800,3855.0,3775.0
363,2016/02/22,3815.0,3813.9,3770.0,24100,3850.0,3770.0
364,2016/02/23,3800.0,3833.455,3820.0,35600,3890.0,3785.0
365,2016/02/24,3755.0,3752.12,3755.0,49300,3790.0,3720.0
366,2016/02/25,3900.0,3883.994,3780.0,33800,3920.0,3780.0
367,2016/02/26,3975.0,3979.638,3930.0,42800,4010.0,3920.0
368,2016/02/29,3950.0,4033.291,4035.0,50900,4100.0,3950.0
369,2016/03/01,3975.0,3971.335,3930.0,42700,4000.0,3930.0
370,2016/03/02,3965.0,3998.331,4050.0,59000,4075.0,3940.0
371,2016/03/03,4015.0,3987.513,3965.0,19300,4015.0,3960.0
372,2016/03/04,4150.0,4118.018,4020.0,38100,4155.0,4005.0
373,2016/03/07,4070.0,4087.561,4145.0,20500,4160.0,4055.0
374,2016/03/08,4040.0,4044.138,4070.0,49900,4120.0,3970.0
375,2016/03/09,4035.0,4000.735,3995.0,24500,4055.0,3940.0
376,2016/03/10,4190.0,4161.814,4100.0,45200,4210.0,4100.0
377,2016/03/11,4190.0,4163.066,4145.0,42400,4210.0,4110.0
378,2016/03/14,4275.0,4263.148,4250.0,27000,4290.0,4200.0
379,2016/03/15,4275.0,4266.221,4255.0,38100,4295.0,4200.0
380,2016/03/16,4270.0,4298.109,4275.0,26700,4345.0,4260.0
381,2016/03/17,4290.0,4309.835,4300.0,24300,4345.0,4250.0
382,2016/03/18,4175.0,4166.544,4245.0,48900,4270.0,4120.0
383,2016/03/22,4265.0,4254.195,4265.0,44100,4295.0,4195.0
384,2016/03/23,4195.0,4211.68,4290.0,24700,4305.0,4155.0
385,2016/03/24,4175.0,4189.512,4195.0,29700,4250.0,4145.0
386,2016/03/25,4190.0,4188.621,4245.0,29000,4245.0,4150.0
387,2016/03/28,4205.0,4206.603,4240.0,29000,4260.0,4165.0
388,2016/03/29,4160.0,4153.153,4155.0,24900,4190.0,4115.0
389,2016/03/30,4210.0,4194.575,4175.0,32900,4250.0,4130.0
390,2016/03/31,4170.0,4198.774,4240.0,26100,4280.0,4170.0
391,2016/04/01,4090.0,4106.844,4200.0,53700,4200.0,4060.0
392,2016/04/04,4075.0,4087.643,4095.0,24400,4155.0,4035.0
393,2016/04/05,3910.0,3945.264,4010.0,24600,4030.0,3910.0
394,2016/04/06,3880.0,3877.121,3900.0,42900,3930.0,3845.0
395,2016/04/07,3770.0,3785.642,3905.0,63100,3940.0,3730.0
396,2016/04/08,3880.0,3831.422,3755.0,45700,3920.0,3705.0
397,2016/04/11,3800.0,3790.196,3870.0,38200,3870.0,3740.0
398,2016/04/12,3850.0,3860.375,3800.0,26700,3890.0,3800.0
399,2016/04/13,3950.0,3923.475,3900.0,35400,3965.0,3885.0
400,2016/04/14,4100.0,4076.905,3990.0,56700,4110.0,3990.0
401,2016/04/15,4095.0,4092.509,4030.0,28300,4125.0,4025.0
402,2016/04/18,4005.0,4011.982,4020.0,22200,4050.0,3965.0
403,2016/04/19,3870.0,3859.112,3845.0,119400,3920.0,3805.0
404,2016/04/20,3670.0,3757.371,3860.0,141700,3870.0,3665.0
405,2016/04/21,3385.0,3414.299,3460.0,393500,3530.0,3365.0
406,2016/04/22,3295.0,3321.07,3385.0,285900,3405.0,3270.0
407,2016/04/25,3270.0,3302.972,3340.0,145700,3355.0,3270.0
408,2016/04/26,3250.0,3228.222,3270.0,111100,3270.0,3175.0
409,2016/04/27,3160.0,3201.271,3310.0,141600,3315.0,3145.0
410,2016/04/28,3120.0,3166.954,3185.0,91100,3245.0,3120.0
411,2016/05/02,2986.0,2981.37,3035.0,151000,3045.0,2942.0
412,2016/05/06,2977.0,2986.083,3050.0,106000,3050.0,2945.0
413,2016/05/09,3005.0,2989.826,3020.0,86000,3025.0,2963.0
414,2016/05/10,3060.0,3037.781,2996.0,83100,3075.0,2970.0
415,2016/05/11,3080.0,3077.88,3080.0,75700,3115.0,3050.0
416,2016/05/12,3070.0,3065.111,3060.0,40500,3090.0,3030.0
417,2016/05/13,3000.0,3007.168,3045.0,84600,3045.0,2970.0
418,2016/05/16,2990.0,3002.753,2964.0,59000,3035.0,2964.0
419,2016/05/17,3015.0,2990.521,2985.0,87000,3020.0,2967.0
420,2016/05/18,3035.0,3022.977,3015.0,65300,3045.0,2994.0
421,2016/05/19,3065.0,3063.989,3060.0,45500,3085.0,3030.0
422,2016/05/20,3105.0,3110.374,3065.0,58800,3135.0,3050.0
423,2016/05/23,3135.0,3108.459,3105.0,45100,3140.0,3065.0
424,2016/05/24,3100.0,3113.857,3110.0,45500,3160.0,3090.0
425,2016/05/25,3130.0,3139.758,3170.0,28900,3170.0,3115.0
426,2016/05/26,3105.0,3124.308,3155.0,19500,3155.0,3090.0
427,2016/05/27,3115.0,3107.784,3105.0,37900,3130.0,3080.0
428,2016/05/30,3190.0,3156.35,3125.0,28900,3190.0,3120.0
429,2016/05/31,3245.0,3227.48,3195.0,50400,3245.0,3195.0
430,2016/06/01,3215.0,3226.379,3200.0,40600,3255.0,3200.0
431,2016/06/02,3065.0,3119.892,3185.0,69200,3215.0,3065.0
432,2016/06/03,3075.0,3078.571,3070.0,26600,3125.0,3050.0
433,2016/06/06,3130.0,3088.829,3035.0,52500,3135.0,3005.0
434,2016/06/07,3120.0,3125.278,3130.0,16200,3150.0,3110.0
435,2016/06/08,3105.0,3084.538,3115.0,55200,3115.0,3060.0
436,2016/06/09,3100.0,3096.254,3105.0,34700,3110.0,3075.0
437,2016/06/10,3000.0,3042.219,3100.0,58800,3100.0,3000.0
438,2016/06/13,2910.0,2925.219,2995.0,75200,2995.0,2892.0
439,2016/06/14,2800.0,2823.687,2887.0,71500,2891.0,2793.0
440,2016/06/15,2855.0,2840.522,2788.0,45200,2890.0,2784.0
441,2016/06/16,2708.0,2765.905,2870.0,86500,2899.0,2700.0
442,2016/06/17,2798.0,2830.31,2799.0,102900,2870.0,2769.0
443,2016/06/20,2897.0,2920.9,2883.0,104400,3000.0,2849.0
444,2016/06/21,2931.0,2932.425,2918.0,42600,2983.0,2883.0
445,2016/06/22,2836.0,2864.258,2931.0,53200,2931.0,2815.0
446,2016/06/23,2876.0,2855.969,2830.0,32500,2878.0,2810.0
447,2016/06/24,2620.0,2709.68,2926.0,78800,2948.0,2597.0
448,2016/06/27,2654.0,2647.464,2620.0,57300,2696.0,2611.0
449,2016/06/28,2614.0,2601.067,2607.0,58500,2655.0,2541.0
450,2016/06/29,2687.0,2648.67,2621.0,83300,2710.0,2592.0
451,2016/06/30,2689.0,2694.487,2687.0,44600,2732.0,2675.0
452,2016/07/01,2733.0,2736.394,2686.0,44200,2775.0,2677.0
453,2016/07/04,2705.0,2698.813,2692.0,24000,2730.0,2661.0
454,2016/07/05,2634.0,2648.707,2690.0,36500,2725.0,2620.0
455,2016/07/06,2571.0,2562.2,2599.0,45000,2599.0,2529.0
456,2016/07/07,2517.0,2545.823,2569.0,46900,2626.0,2501.0
457,2016/07/08,2512.0,2530.703,2500.0,48200,2558.0,2500.0
458,2016/07/11,2640.0,2595.881,2548.0,80700,2664.0,2537.0
459,2016/07/12,2830.0,2796.448,2700.0,91800,2832.0,2699.0
460,2016/07/13,2864.0,2872.372,2856.0,66900,2893.0,2830.0
461,2016/07/14,2807.0,2820.887,2864.0,46200,2872.0,2805.0
462,2016/07/15,2892.0,2886.914,2849.0,40800,2932.0,2815.0
463,2016/07/19,2967.0,2946.802,2893.0,59000,2973.0,2893.0
464,2016/07/20,2881.0,2892.345,2918.0,63200,2965.0,2865.0
465,2016/07/21,2614.0,2631.142,2631.0,206400,2680.0,2571.0
466,2016/07/22,2664.0,2645.34,2606.0,110700,2688.0,2605.0
467,2016/07/25,2865.0,2825.687,2697.0,121600,2880.0,2697.0
468,2016/07/26,2846.0,2862.67,2863.0,95800,2913.0,2821.0
469,2016/07/27,2906.0,2885.669,2872.0,38400,2920.0,2832.0
470,2016/07/28,2871.0,2873.175,2912.0,37800,2928.0,2832.0
471,2016/07/29,2898.0,2879.842,2847.0,56400,2908.0,2830.0
472,2016/08/01,2876.0,2871.094,2876.0,34000,2904.0,2822.0
473,2016/08/02,2849.0,2862.945,2877.0,25300,2900.0,2841.0
474,2016/08/03,2765.0,2769.231,2805.0,37200,2819.0,2743.0
475,2016/08/04,2946.0,2887.736,2804.0,76100,2960.0,2804.0
476,2016/08/05,2920.0,2912.279,2910.0,63800,2940.0,2865.0
477,2016/08/08,2903.0,2879.903,2881.0,73400,2911.0,2845.0
478,2016/08/09,2910.0,2911.56,2886.0,35700,2932.0,2875.0
479,2016/08/10,2864.0,2861.681,2909.0,20400,2909.0,2836.0
480,2016/08/12,2892.0,2888.364,2856.0,19800,2909.0,2856.0
481,2016/08/15,2890.0,2899.923,2918.0,16900,2920.0,2877.0
482,2016/08/16,2786.0,2814.96,2863.0,47300,2873.0,2786.0
483,2016/08/17,2804.0,2784.208,2773.0,23600,2818.0,2758.0
484,2016/08/18,2771.0,2782.926,2761.0,28200,2810.0,2761.0
485,2016/08/19,2854.0,2828.952,2760.0,29200,2873.0,2760.0
486,2016/08/22,2857.0,2848.829,2858.0,23900,2873.0,2810.0
487,2016/08/23,2782.0,2789.764,2813.0,26700,2836.0,2774.0
488,2016/08/24,2737.0,2746.282,2750.0,28700,2789.0,2733.0
489,2016/08/25,2784.0,2784.412,2787.0,23300,2800.0,2768.0
490,2016/08/26,2777.0,2763.388,2768.0,21900,2782.0,2743.0
491,2016/08/29,2873.0,2860.707,2810.0,33400,2884.0,2810.0
492,2016/08/30,2859.0,2865.587,2832.0,18400,2891.0,2832.0
493,2016/08/31,2897.0,2888.513,2848.0,40000,2904.0,2780.0
494,2016/09/01,2901.0,2902.861,2897.0,20800,2923.0,2880.0
495,2016/09/02,2839.0,2852.424,2902.0,18400,2902.0,2811.0
496,2016/09/05,2879.0,2906.348,2907.0,31000,2940.0,2873.0
497,2016/09/06,2900.0,2902.508,2911.0,13200,2914.0,2887.0
498,2016/09/07,2904.0,2890.015,2864.0,19900,2911.0,2850.0
499,2016/09/08,2938.0,2928.699,2916.0,34500,2954.0,2868.0
500,2016/09/09,2937.0,2946.547,2942.0,34400,2960.0,2930.0
501,2016/09/12,2882.0,2881.384,2887.0,17700,2912.0,2855.0
502,2016/09/13,2854.0,2865.977,2922.0,17200,2922.0,2848.0
503,2016/09/14,2834.0,2837.096,2860.0,12500,2860.0,2815.0
504,2016/09/15,2818.0,2803.092,2807.0,15300,2823.0,2783.0
505,2016/09/16,2908.0,2892.477,2830.0,26200,2928.0,2830.0
506,2016/09/20,2860.0,2864.865,2916.0,21400,2916.0,2842.0
507,2016/09/21,2957.0,2912.681,2828.0,43500,2972.0,2820.0
508,2016/09/23,2974.0,2965.725,2957.0,34900,2990.0,2927.0
509,2016/09/26,2945.0,2946.093,2950.0,35500,2963.0,2925.0
510,2016/09/27,2960.0,2920.061,2925.0,46000,2962.0,2874.0
511,2016/09/28,3000.0,2966.005,2900.0,38400,3020.0,2898.0
512,2016/09/29,3115.0,3079.364,3025.0,51900,3130.0,3015.0
513,2016/09/30,3060.0,3045.169,3065.0,36000,3085.0,2988.0
514,2016/10/03,3115.0,3107.3,3060.0,33700,3130.0,3060.0
515,2016/10/04,3250.0,3221.16,3130.0,100400,3250.0,3115.0
516,2016/10/05,3245.0,3246.705,3220.0,65100,3270.0,3220.0
517,2016/10/06,3235.0,3263.601,3255.0,48600,3320.0,3220.0
518,2016/10/07,3225.0,3222.347,3210.0,44100,3250.0,3115.0
519,2016/10/11,3225.0,3228.056,3250.0,36000,3260.0,3185.0
520,2016/10/12,3185.0,3196.639,3185.0,36000,3220.0,3180.0
521,2016/10/13,3210.0,3194.167,3195.0,33000,3220.0,3175.0
522,2016/10/14,3220.0,3204.696,3200.0,21400,3230.0,3160.0
523,2016/10/17,3225.0,3220.17,3180.0,14700,3250.0,3165.0
524,2016/10/18,3205.0,3174.75,3210.0,66100,3210.0,3140.0
525,2016/10/19,3210.0,3197.636,3175.0,33000,3210.0,3175.0
526,2016/10/20,3345.0,3290.262,3230.0,66700,3345.0,3230.0
527,2016/10/21,3215.0,3227.705,3215.0,108300,3295.0,3180.0
528,2016/10/24,3075.0,3122.419,3220.0,86200,3220.0,3050.0
529,2016/10/25,3110.0,3092.686,3075.0,107600,3140.0,3025.0
530,2016/10/26,3180.0,3159.419,3110.0,39600,3200.0,3110.0
531,2016/10/27,3185.0,3180.79,3145.0,38000,3210.0,3135.0
532,2016/10/28,3285.0,3269.567,3180.0,112000,3310.0,3130.0
533,2016/10/31,3245.0,3235.988,3250.0,31900,3290.0,3200.0
534,2016/11/01,3215.0,3215.309,3215.0,25900,3230.0,3200.0
535,2016/11/02,3210.0,3216.628,3195.0,38700,3240.0,3175.0
536,2016/11/04,3245.0,3186.355,3160.0,52400,3250.0,3120.0
537,2016/11/07,3275.0,3277.756,3210.0,43900,3315.0,3210.0
538,2016/11/08,3215.0,3233.056,3275.0,45000,3305.0,3195.0
539,2016/11/09,2987.0,3073.274,3195.0,74400,3265.0,2926.0
540,2016/11/10,3150.0,3150.534,3175.0,76800,3215.0,3100.0
541,2016/11/11,3125.0,3169.818,3180.0,44000,3240.0,3120.0
542,2016/11/14,3140.0,3138.753,3110.0,50100,3170.0,3090.0
543,2016/11/15,3060.0,3072.829,3095.0,40300,3120.0,3055.0
544,2016/11/16,3110.0,3091.031,3050.0,38800,3125.0,3045.0
545,2016/11/17,3135.0,3128.658,3105.0,35400,3155.0,3090.0
546,2016/11/18,3175.0,3173.245,3165.0,41600,3200.0,3160.0
547,2016/11/21,3170.0,3181.021,3180.0,19100,3205.0,3165.0
548,2016/11/22,3140.0,3149.727,3175.0,23800,3185.0,3135.0
549,2016/11/24,3175.0,3182.363,3165.0,43800,3205.0,3145.0
550,2016/11/25,3215.0,3221.379,3205.0,31900,3250.0,3200.0
551,2016/11/28,3225.0,3214.957,3225.0,34500,3240.0,3185.0
552,2016/11/29,3260.0,3241.601,3245.0,35300,3260.0,3210.0
553,2016/11/30,3295.0,3320.226,3270.0,101800,3375.0,3250.0
554,2016/12/01,3350.0,3340.981,3310.0,96300,3385.0,3300.0
555,2016/12/02,3320.0,3311.239,3335.0,80300,3340.0,3265.0
556,2016/12/05,3295.0,3293.138,3275.0,42700,3325.0,3275.0
557,2016/12/06,3330.0,3340.145,3300.0,34600,3370.0,3300.0
558,2016/12/07,3370.0,3353.002,3350.0,45300,3380.0,3280.0
559,2016/12/08,3425.0,3412.949,3390.0,57300,3435.0,3390.0
560,2016/12/09,3490.0,3463.953,3420.0,57800,3495.0,3420.0
561,2016/12/12,3570.0,3546.578,3520.0,84300,3575.0,3510.0
562,2016/12/13,3625.0,3606.536,3550.0,86900,3645.0,3515.0
563,2016/12/14,3620.0,3608.0,3605.0,47000,3630.0,3550.0
564,2016/12/15,3600.0,3593.194,3615.0,31000,3625.0,3560.0
565,2016/12/16,3645.0,3647.297,3620.0,45500,3665.0,3615.0
566,2016/12/19,3620.0,3620.094,3640.0,26700,3660.0,3595.0
567,2016/12/20,3585.0,3576.779,3600.0,28100,3605.0,3540.0
568,2016/12/21,3520.0,3532.912,3585.0,36400,3590.0,3505.0
569,2016/12/22,3570.0,3539.383,3500.0,24300,3570.0,3480.0
570,2016/12/26,3485.0,3495.069,3535.0,29000,3560.0,3460.0
571,2016/12/27,3475.0,3479.329,3465.0,23100,3510.0,3450.0
572,2016/12/28,3510.0,3492.237,3470.0,15200,3525.0,3465.0
573,2016/12/29,3475.0,3469.706,3495.0,25500,3510.0,3445.0
574,2016/12/30,3450.0,3450.508,3435.0,31500,3475.0,3430.0
575,2017/01/04,3590.0,3577.193,3450.0,44000,3620.0,3450.0
576,2017/01/05,3575.0,3576.059,3620.0,42500,3620.0,3540.0
577,2017/01/06,3525.0,3535.976,3570.0,24600,3570.0,3505.0
578,2017/01/10,3475.0,3477.29,3485.0,41700,3520.0,3440.0
579,2017/01/11,3505.0,3487.804,3465.0,27100,3515.0,3440.0
580,2017/01/12,3560.0,3531.128,3470.0,36800,3565.0,3450.0
581,2017/01/13,3510.0,3524.132,3535.0,19000,3560.0,3495.0
582,2017/01/16,3360.0,3388.457,3465.0,54100,3485.0,3340.0
583,2017/01/17,3300.0,3323.006,3330.0,36600,3375.0,3285.0
584,2017/01/18,3370.0,3342.913,3290.0,43600,3385.0,3270.0
585,2017/01/19,3385.0,3375.211,3375.0,19000,3400.0,3340.0
586,2017/01/20,3370.0,3372.562,3385.0,20300,3420.0,3320.0
587,2017/01/23,3320.0,3344.759,3370.0,14500,3385.0,3320.0
588,2017/01/24,3385.0,3368.721,3300.0,47300,3390.0,3300.0
589,2017/01/25,3440.0,3429.216,3455.0,45300,3465.0,3395.0
590,2017/01/26,3445.0,3477.789,3455.0,78700,3520.0,3425.0
591,2017/01/27,3455.0,3456.691,3465.0,61800,3505.0,3405.0
592,2017/01/30,3420.0,3434.934,3455.0,15100,3465.0,3415.0
593,2017/01/31,3340.0,3356.856,3375.0,29900,3390.0,3340.0
594,2017/02/01,3465.0,3431.903,3355.0,71200,3470.0,3340.0
595,2017/02/02,3410.0,3434.107,3460.0,45900,3485.0,3395.0
596,2017/02/03,3415.0,3425.139,3400.0,35900,3470.0,3395.0
597,2017/02/06,3400.0,3402.4,3460.0,25000,3470.0,3375.0
598,2017/02/07,3310.0,3323.443,3365.0,47200,3375.0,3295.0
599,2017/02/08,3330.0,3317.31,3320.0,55200,3345.0,3285.0
600,2017/02/09,3355.0,3350.354,3345.0,48000,3370.0,3330.0
601,2017/02/10,3420.0,3422.847,3410.0,42500,3440.0,3400.0
602,2017/02/13,3450.0,3454.257,3430.0,50500,3505.0,3425.0
603,2017/02/14,3485.0,3511.08,3485.0,32400,3540.0,3485.0
604,2017/02/15,3530.0,3528.312,3485.0,39700,3545.0,3485.0
605,2017/02/16,3465.0,3477.571,3545.0,49000,3545.0,3435.0
606,2017/02/17,3515.0,3506.649,3460.0,47600,3535.0,3440.0
607,2017/02/20,3525.0,3536.873,3530.0,25100,3570.0,3520.0
608,2017/02/21,3540.0,3542.581,3545.0,24600,3565.0,3520.0
609,2017/02/22,3525.0,3526.982,3575.0,33300,3590.0,3485.0
610,2017/02/23,3515.0,3503.81,3495.0,33600,3520.0,3475.0
611,2017/02/24,3430.0,3444.294,3515.0,55200,3530.0,3405.0
612,2017/02/27,3365.0,3375.259,3400.0,46400,3430.0,3340.0
613,2017/02/28,3345.0,3367.918,3355.0,47300,3410.0,3340.0
614,2017/03/01,3405.0,3380.154,3370.0,29300,3410.0,3340.0
615,2017/03/02,3425.0,3436.287,3455.0,20200,3460.0,3420.0
616,2017/03/03,3355.0,3368.097,3420.0,36000,3420.0,3340.0
617,2017/03/06,3270.0,3294.539,3350.0,61800,3355.0,3255.0
618,2017/03/07,3235.0,3224.7,3270.0,64900,3275.0,3205.0
619,2017/03/08,3250.0,3241.033,3235.0,52300,3260.0,3220.0
620,2017/03/09,3250.0,3265.505,3240.0,47500,3290.0,3240.0
621,2017/03/10,3295.0,3295.313,3300.0,55900,3310.0,3255.0
622,2017/03/13,3275.0,3288.754,3300.0,28100,3325.0,3270.0
623,2017/03/14,3245.0,3253.524,3275.0,37600,3280.0,3230.0
624,2017/03/15,3220.0,3227.679,3245.0,30800,3250.0,3210.0
625,2017/03/16,3225.0,3227.1,3205.0,41900,3260.0,3200.0
626,2017/03/17,3250.0,3235.101,3225.0,44700,3250.0,3205.0
627,2017/03/21,3205.0,3202.183,3220.0,49700,3230.0,3180.0
628,2017/03/22,3205.0,3197.455,3195.0,72500,3220.0,3180.0
629,2017/03/23,3175.0,3174.226,3190.0,29700,3200.0,3160.0
630,2017/03/24,3170.0,3178.769,3175.0,32500,3205.0,3165.0
631,2017/03/27,3095.0,3114.899,3170.0,49700,3175.0,3085.0
632,2017/03/28,3140.0,3140.918,3115.0,45200,3165.0,3115.0
633,2017/03/29,3125.0,3129.434,3130.0,59200,3155.0,3100.0
634,2017/03/30,3155.0,3159.546,3145.0,66000,3195.0,3135.0
635,2017/03/31,3085.0,3122.156,3140.0,37800,3155.0,3085.0
636,2017/04/03,3090.0,3104.033,3080.0,48600,3135.0,3080.0
637,2017/04/04,3090.0,3092.684,3090.0,71900,3115.0,3075.0
638,2017/04/05,3080.0,3080.516,3085.0,44600,3105.0,3050.0
639,2017/04/06,3030.0,3040.135,3055.0,51700,3070.0,3015.0
640,2017/04/07,3025.0,3037.833,3005.0,46600,3065.0,3005.0
641,2017/04/10,3000.0,3004.403,3015.0,75400,3050.0,2982.0
642,2017/04/11,3000.0,2994.941,2985.0,54300,3015.0,2967.0
643,2017/04/12,2956.0,2959.529,3000.0,58600,3000.0,2941.0
644,2017/04/13,2961.0,2951.657,2956.0,60100,2965.0,2913.0
645,2017/04/14,2919.0,2928.677,2920.0,46400,2954.0,2910.0
646,2017/04/17,2929.0,2925.539,2922.0,44900,2947.0,2902.0
647,2017/04/18,2956.0,2963.621,2960.0,57700,3020.0,2933.0
648,2017/04/19,3150.0,3091.247,2972.0,146700,3155.0,2972.0
649,2017/04/20,3170.0,3158.53,3155.0,103400,3195.0,3120.0
650,2017/04/21,3015.0,2975.21,2960.0,277400,3030.0,2914.0
651,2017/04/24,3130.0,3112.371,3085.0,187900,3165.0,3055.0
652,2017/04/25,3065.0,3068.006,3080.0,115100,3100.0,3010.0
653,2017/04/26,3090.0,3086.646,3120.0,63500,3120.0,3055.0
654,2017/04/27,3085.0,3085.777,3090.0,85000,3100.0,3060.0
655,2017/04/28,3045.0,3061.985,3075.0,80100,3115.0,3025.0
656,2017/05/01,3080.0,3061.284,3010.0,51400,3100.0,3010.0
657,2017/05/02,3170.0,3158.15,3110.0,62700,3175.0,3110.0
658,2017/05/08,3180.0,3189.591,3175.0,125900,3210.0,3160.0
659,2017/05/09,3210.0,3203.466,3185.0,116700,3235.0,3170.0
660,2017/05/10,3245.0,3232.503,3220.0,101100,3250.0,3200.0
661,2017/05/11,3270.0,3261.082,3250.0,96600,3295.0,3235.0
662,2017/05/12,3255.0,3248.413,3235.0,89800,3275.0,3230.0
663,2017/05/15,3240.0,3246.024,3230.0,90800,3270.0,3215.0
664,2017/05/16,3280.0,3265.497,3275.0,56300,3285.0,3235.0
665,2017/05/17,3130.0,3162.244,3220.0,88900,3230.0,3125.0
666,2017/05/18,3130.0,3125.015,3100.0,66500,3170.0,3085.0
667,2017/05/19,3170.0,3173.616,3150.0,81300,3195.0,3140.0
668,2017/05/22,3285.0,3270.547,3230.0,88600,3295.0,3215.0
669,2017/05/23,3295.0,3305.14,3305.0,82400,3335.0,3285.0
670,2017/05/24,3340.0,3331.749,3310.0,44300,3350.0,3305.0
671,2017/05/25,3305.0,3312.724,3345.0,30100,3350.0,3290.0
672,2017/05/26,3295.0,3302.827,3320.0,54300,3320.0,3285.0
673,2017/05/29,3310.0,3346.627,3325.0,72200,3380.0,3310.0
674,2017/05/30,3275.0,3262.286,3295.0,46800,3295.0,3240.0
675,2017/05/31,3275.0,3283.559,3290.0,74600,3310.0,3255.0
676,2017/06/01,3250.0,3259.0,3250.0,60500,3275.0,3240.0
677,2017/06/02,3380.0,3357.469,3280.0,73300,3380.0,3275.0
678,2017/06/05,3320.0,3338.07,3380.0,52600,3380.0,3320.0
679,2017/06/06,3300.0,3311.785,3350.0,56300,3350.0,3280.0
680,2017/06/07,3375.0,3357.388,3265.0,116400,3390.0,3255.0
681,2017/06/08,3355.0,3357.558,3335.0,68600,3380.0,3335.0
682,2017/06/09,3380.0,3369.926,3365.0,53900,3390.0,3320.0
683,2017/06/12,3315.0,3335.665,3380.0,50400,3390.0,3300.0
684,2017/06/13,3310.0,3309.394,3310.0,39600,3330.0,3295.0
685,2017/06/14,3315.0,3315.725,3330.0,33800,3350.0,3305.0
686,2017/06/15,3370.0,3361.837,3325.0,80300,3380.0,3310.0
687,2017/06/16,3295.0,3328.798,3350.0,209600,3410.0,3295.0
688,2017/06/19,3450.0,3410.349,3340.0,124700,3450.0,3335.0
689,2017/06/20,3500.0,3500.465,3465.0,79500,3515.0,3465.0
690,2017/06/21,3495.0,3507.94,3500.0,43200,3525.0,3490.0
691,2017/06/22,3470.0,3475.48,3485.0,25000,3505.0,3460.0
692,2017/06/23,3490.0,3491.368,3470.0,28500,3505.0,3460.0
693,2017/06/26,3510.0,3501.084,3455.0,34600,3525.0,3455.0
694,2017/06/27,3525.0,3526.114,3500.0,37700,3540.0,3500.0
695,2017/06/28,3440.0,3468.637,3510.0,48800,3525.0,3440.0
696,2017/06/29,3505.0,3488.519,3470.0,54000,3515.0,3450.0
697,2017/06/30,3465.0,3448.552,3485.0,92900,3485.0,3410.0
698,2017/07/03,3430.0,3431.537,3485.0,50100,3485.0,3405.0
699,2017/07/04,3450.0,3444.668,3485.0,72200,3485.0,3425.0
700,2017/07/05,3555.0,3526.141,3475.0,75400,3555.0,3460.0
701,2017/07/06,3540.0,3547.116,3565.0,74200,3580.0,3525.0
702,2017/07/07,3525.0,3529.366,3515.0,29200,3555.0,3485.0
703,2017/07/10,3555.0,3538.525,3550.0,59000,3570.0,3505.0
704,2017/07/11,3580.0,3569.094,3525.0,26500,3580.0,3525.0
705,2017/07/12,3595.0,3588.973,3575.0,41400,3600.0,3570.0
706,2017/07/13,3560.0,3566.28,3595.0,25400,3595.0,3540.0
707,2017/07/14,3560.0,3534.95,3535.0,49600,3560.0,3495.0
708,2017/07/18,3490.0,3497.857,3540.0,42000,3540.0,3480.0
709,2017/07/19,3565.0,3525.982,3475.0,60600,3565.0,3460.0
710,2017/07/20,3620.0,3597.586,3600.0,90500,3625.0,3565.0
711,2017/07/21,4010.0,4306.462,4320.0,550100,4320.0,4010.0
712,2017/07/24,4550.0,4403.947,4155.0,821100,4590.0,4125.0
713,2017/07/25,4765.0,4678.624,4560.0,487000,4805.0,4510.0
714,2017/07/26,4715.0,4716.202,4760.0,213800,4775.0,4670.0
715,2017/07/27,4710.0,4650.554,4700.0,212000,4715.0,4575.0
716,2017/07/28,4670.0,4636.569,4680.0,124600,4695.0,4590.0
717,2017/07/31,4535.0,4575.604,4620.0,118300,4670.0,4535.0
718,2017/08/01,4490.0,4531.226,4540.0,128500,4650.0,4475.0
719,2017/08/02,4605.0,4549.924,4520.0,79300,4615.0,4495.0
720,2017/08/03,4610.0,4593.96,4560.0,66800,4625.0,4540.0
721,2017/08/04,4575.0,4583.253,4585.0,51800,4635.0,4535.0
722,2017/08/07,4540.0,4547.262,4575.0,84900,4580.0,4510.0
723,2017/08/08,4520.0,4512.029,4530.0,63100,4550.0,4475.0
724,2017/08/09,4435.0,4460.729,4505.0,76800,4530.0,4425.0
725,2017/08/10,4405.0,4422.563,4425.0,63800,4485.0,4385.0
726,2017/08/14,4300.0,4324.769,4300.0,127800,4405.0,4285.0
727,2017/08/15,4420.0,4392.819,4335.0,98100,4465.0,4285.0
728,2017/08/16,4470.0,4464.224,4370.0,58600,4505.0,4340.0
729,2017/08/17,4470.0,4489.436,4495.0,46100,4535.0,4470.0
730,2017/08/18,4460.0,4426.462,4350.0,53000,4490.0,4350.0
731,2017/08/21,4430.0,4448.985,4460.0,46800,4495.0,4425.0
732,2017/08/22,4440.0,4439.474,4390.0,50400,4475.0,4390.0
733,2017/08/23,4465.0,4479.131,4510.0,46600,4530.0,4450.0
734,2017/08/24,4630.0,4586.795,4445.0,95000,4645.0,4435.0
735,2017/08/25,4640.0,4640.126,4615.0,71200,4690.0,4610.0
736,2017/08/28,4560.0,4574.924,4655.0,46200,4660.0,4535.0
737,2017/08/29,4655.0,4625.601,4540.0,69100,4660.0,4520.0
738,2017/08/30,4605.0,4602.166,4655.0,139900,4655.0,4545.0
739,2017/08/31,4750.0,4726.007,4675.0,98300,4765.0,4615.0
740,2017/09/01,4750.0,4733.053,4800.0,84500,4840.0,4655.0
741,2017/09/04,4635.0,4637.86,4680.0,44400,4705.0,4605.0
742,2017/09/05,4460.0,4516.762,4555.0,76600,4620.0,4460.0
743,2017/09/06,4550.0,4509.159,4430.0,44600,4565.0,4375.0
744,2017/09/07,4575.0,4565.533,4530.0,29100,4595.0,4520.0
745,2017/09/08,4540.0,4556.562,4555.0,30100,4595.0,4520.0
746,2017/09/11,4620.0,4599.488,4555.0,28300,4620.0,4555.0
747,2017/09/12,4710.0,4683.867,4660.0,36200,4715.0,4620.0
748,2017/09/13,4665.0,4687.048,4700.0,24900,4725.0,4660.0
749,2017/09/14,4535.0,4572.239,4660.0,46000,4665.0,4530.0
750,2017/09/15,4620.0,4628.496,4540.0,44200,4665.0,4540.0
751,2017/09/19,4720.0,4676.153,4720.0,67200,4735.0,4600.0
752,2017/09/20,4765.0,4751.941,4730.0,40700,4775.0,4690.0
753,2017/09/21,4685.0,4713.443,4800.0,30500,4800.0,4675.0
754,2017/09/22,4680.0,4685.506,4745.0,33600,4755.0,4645.0
755,2017/09/25,4825.0,4784.892,4675.0,60000,4835.0,4670.0
756,2017/09/26,5000.0,4975.546,4845.0,143800,5050.0,4830.0
757,2017/09/27,4925.0,4928.854,4945.0,47100,4970.0,4880.0
758,2017/09/28,5280.0,5197.794,4995.0,196700,5300.0,4995.0
759,2017/09/29,5210.0,5194.698,5210.0,82800,5230.0,5140.0
760,2017/10/02,5290.0,5249.024,5210.0,71700,5300.0,5180.0
761,2017/10/03,5210.0,5224.598,5350.0,65900,5350.0,5140.0
762,2017/10/04,5150.0,5139.846,5160.0,51900,5190.0,5090.0
763,2017/10/05,5100.0,5134.605,5150.0,35400,5170.0,5100.0
764,2017/10/06,5120.0,5132.202,5100.0,37700,5190.0,5080.0
765,2017/10/10,5210.0,5202.878,5170.0,60800,5250.0,5160.0
766,2017/10/11,5050.0,5084.45,5210.0,42700,5210.0,5040.0
767,2017/10/12,4985.0,4996.431,5020.0,68500,5070.0,4970.0
768,2017/10/13,5030.0,5007.628,4985.0,48700,5040.0,4925.0
769,2017/10/16,4940.0,4961.755,5040.0,60100,5040.0,4935.0
770,2017/10/17,4915.0,4901.648,4935.0,81000,4940.0,4860.0
771,2017/10/18,4825.0,4845.657,4930.0,71500,4930.0,4805.0
772,2017/10/19,4840.0,4843.967,4830.0,51300,4900.0,4815.0
773,2017/10/20,4795.0,4773.247,4805.0,112400,4840.0,4665.0
774,2017/10/23,5190.0,4881.134,4585.0,633500,5250.0,4530.0
775,2017/10/24,4880.0,4915.745,5090.0,316700,5090.0,4840.0
776,2017/10/25,4945.0,4935.364,4915.0,155300,5020.0,4825.0
777,2017/10/26,4840.0,4867.588,4950.0,119000,4950.0,4770.0
778,2017/10/27,4790.0,4782.02,4790.0,157400,4835.0,4725.0
779,2017/10/30,4775.0,4740.575,4790.0,160100,4805.0,4675.0
780,2017/10/31,4790.0,4752.67,4715.0,199600,4850.0,4670.0
781,2017/11/01,4750.0,4740.791,4825.0,105000,4825.0,4700.0
782,2017/11/02,4670.0,4658.783,4715.0,140100,4720.0,4625.0
783,2017/11/06,4650.0,4623.319,4605.0,225700,4705.0,4490.0
784,2017/11/07,4790.0,4772.077,4660.0,112400,4810.0,4650.0
785,2017/11/08,4790.0,4758.935,4735.0,59600,4795.0,4715.0
786,2017/11/09,4845.0,4853.328,4805.0,124100,4905.0,4785.0
787,2017/11/10,4795.0,4791.302,4750.0,36100,4835.0,4740.0
788,2017/11/13,4820.0,4830.987,4810.0,62800,4870.0,4800.0
789,2017/11/14,4905.0,4892.633,4845.0,109000,4940.0,4825.0
790,2017/11/15,4780.0,4859.3,4895.0,159900,5010.0,4770.0
791,2017/11/16,4970.0,4918.473,4760.0,131000,4980.0,4705.0
792,2017/11/17,5020.0,5020.133,5010.0,109000,5100.0,4970.0
793,2017/11/20,5030.0,5097.228,5100.0,114000,5210.0,5030.0
794,2017/11/21,5100.0,5063.946,5010.0,89200,5150.0,4990.0
795,2017/11/22,5090.0,5144.535,5180.0,108500,5230.0,5070.0
796,2017/11/24,5100.0,5123.991,5180.0,93200,5210.0,5060.0
797,2017/11/27,4980.0,5030.516,5150.0,115400,5150.0,4960.0
798,2017/11/28,4805.0,4836.688,4980.0,69000,4980.0,4800.0
799,2017/11/29,4745.0,4761.052,4815.0,65100,4820.0,4725.0
800,2017/11/30,4635.0,4635.046,4715.0,108500,4730.0,4585.0
801,2017/12/01,4645.0,4682.55,4690.0,55300,4790.0,4640.0
802,2017/12/04,4585.0,4607.852,4690.0,52600,4690.0,4570.0
803,2017/12/05,4530.0,4529.234,4595.0,38500,4595.0,4500.0
804,2017/12/06,4480.0,4488.318,4505.0,76400,4540.0,4465.0
805,2017/12/07,4620.0,4609.814,4545.0,72500,4665.0,4530.0
806,2017/12/08,4605.0,4565.0,4550.0,75300,4615.0,4520.0
807,2017/12/11,4630.0,4621.517,4630.0,33300,4645.0,4585.0
808,2017/12/12,4555.0,4573.449,4650.0,41900,4650.0,4540.0
809,2017/12/13,4535.0,4540.05,4560.0,80100,4605.0,4505.0
810,2017/12/14,4630.0,4617.429,4560.0,42400,4645.0,4560.0
811,2017/12/15,4505.0,4507.545,4560.0,88200,4560.0,4475.0
812,2017/12/18,4630.0,4611.743,4540.0,50200,4665.0,4515.0
813,2017/12/19,4575.0,4593.75,4675.0,31200,4680.0,4555.0
814,2017/12/20,4640.0,4632.099,4600.0,39300,4665.0,4570.0
815,2017/12/21,4750.0,4734.612,4660.0,64500,4775.0,4635.0
816,2017/12/22,4740.0,4747.332,4755.0,35800,4775.0,4725.0
817,2017/12/25,4710.0,4725.139,4760.0,32400,4795.0,4695.0
818,2017/12/26,4740.0,4752.921,4760.0,51700,4830.0,4710.0
819,2017/12/27,4680.0,4701.283,4750.0,33900,4750.0,4670.0
820,2017/12/28,4670.0,4695.56,4730.0,26800,4730.0,4670.0
821,2017/12/29,4680.0,4678.82,4670.0,25000,4695.0,4655.0
822,2018/01/04,4785.0,4759.069,4780.0,30600,4795.0,4720.0
823,2018/01/05,4780.0,4770.335,4770.0,19400,4785.0,4755.0
824,2018/01/09,4880.0,4845.094,4800.0,48000,4890.0,4765.0
825,2018/01/10,4675.0,4720.824,4880.0,72800,4890.0,4675.0
826,2018/01/11,4700.0,4671.936,4670.0,53200,4705.0,4605.0
827,2018/01/12,4695.0,4696.593,4700.0,27000,4725.0,4675.0
828,2018/01/15,4775.0,4751.227,4725.0,43600,4780.0,4705.0
829,2018/01/16,4775.0,4758.108,4790.0,21400,4790.0,4725.0
830,2018/01/17,4780.0,4764.894,4705.0,28400,4790.0,4705.0
831,2018/01/18,4700.0,4748.748,4775.0,107400,4810.0,4695.0
832,2018/01/19,4780.0,4780.608,4690.0,72400,4825.0,4690.0
833,2018/01/22,4875.0,4845.476,4810.0,91400,4900.0,4760.0
834,2018/01/23,4865.0,4872.558,4905.0,56300,4930.0,4825.0
835,2018/01/24,4895.0,4871.007,4870.0,94300,4910.0,4820.0
836,2018/01/25,4950.0,4886.298,4930.0,130600,4950.0,4785.0
837,2018/01/26,4250.0,4285.276,4390.0,741700,4410.0,4250.0
838,2018/01/29,4200.0,4211.671,4260.0,415300,4285.0,4135.0
839,2018/01/30,4135.0,4141.39,4195.0,244700,4200.0,4115.0
840,2018/01/31,4115.0,4141.65,4105.0,161500,4195.0,4080.0
841,2018/02/01,4210.0,4161.008,4150.0,85300,4210.0,4105.0
842,2018/02/02,4170.0,4159.722,4180.0,98900,4180.0,4135.0
843,2018/02/05,4045.0,4038.593,4075.0,138200,4075.0,4005.0
844,2018/02/06,3815.0,3768.123,3825.0,197900,3855.0,3665.0
845,2018/02/07,3745.0,3840.08,3945.0,125600,3950.0,3740.0
846,2018/02/08,3760.0,3748.59,3745.0,150000,3800.0,3695.0
847,2018/02/09,3615.0,3590.871,3550.0,110200,3620.0,3535.0
848,2018/02/13,3585.0,3625.026,3645.0,115700,3670.0,3575.0
849,2018/02/14,3515.0,3537.966,3595.0,95600,3615.0,3500.0
850,2018/02/15,3575.0,3567.298,3515.0,57000,3620.0,3505.0
851,2018/02/16,3560.0,3581.628,3600.0,55900,3630.0,3550.0
852,2018/02/19,3660.0,3642.532,3660.0,55300,3685.0,3595.0
853,2018/02/20,3670.0,3636.895,3680.0,44600,3680.0,3585.0
854,2018/02/21,3670.0,3674.868,3670.0,41600,3710.0,3640.0
855,2018/02/22,3785.0,3763.766,3675.0,104900,3815.0,3650.0
856,2018/02/23,3755.0,3740.499,3780.0,102300,3785.0,3700.0
857,2018/02/26,3800.0,3790.33,3765.0,72700,3815.0,3735.0
858,2018/02/27,3925.0,3908.233,3820.0,121400,3955.0,3820.0
859,2018/02/28,3915.0,3935.939,3920.0,113400,3965.0,3895.0
860,2018/03/01,3800.0,3811.838,3870.0,81900,3870.0,3785.0
861,2018/03/02,3760.0,3775.064,3730.0,54700,3815.0,3710.0
862,2018/03/05,3640.0,3663.894,3730.0,62400,3745.0,3625.0
863,2018/03/06,3675.0,3703.857,3700.0,58600,3765.0,3675.0
864,2018/03/07,3625.0,3632.558,3650.0,82300,3690.0,3575.0
865,2018/03/08,3625.0,3646.06,3655.0,40100,3710.0,3605.0
866,2018/03/09,3670.0,3662.022,3680.0,40800,3700.0,3620.0
867,2018/03/12,3670.0,3659.316,3680.0,87700,3705.0,3630.0
868,2018/03/13,3740.0,3711.265,3685.0,40700,3745.0,3660.0
869,2018/03/14,3675.0,3689.761,3730.0,31400,3730.0,3670.0
870,2018/03/15,3650.0,3641.61,3670.0,61800,3680.0,3585.0
871,2018/03/16,3625.0,3633.38,3680.0,42900,3690.0,3610.0
872,2018/03/19,3600.0,3576.396,3600.0,64100,3620.0,3530.0
873,2018/03/20,3595.0,3579.58,3540.0,53600,3615.0,3520.0
874,2018/03/22,3580.0,3573.35,3570.0,30900,3605.0,3550.0
875,2018/03/23,3360.0,3392.59,3370.0,100200,3460.0,3345.0
876,2018/03/26,3415.0,3376.753,3305.0,91000,3425.0,3305.0
877,2018/03/27,3495.0,3467.716,3475.0,60200,3505.0,3415.0
878,2018/03/28,3560.0,3537.47,3465.0,117000,3585.0,3450.0
879,2018/03/29,3445.0,3489.254,3565.0,138800,3585.0,3420.0
880,2018/03/30,3555.0,3528.677,3515.0,42700,3555.0,3475.0
881,2018/04/02,3545.0,3569.693,3585.0,39100,3630.0,3540.0
882,2018/04/03,3475.0,3486.062,3490.0,41900,3510.0,3465.0
883,2018/04/04,3485.0,3495.098,3470.0,71800,3530.0,3460.0
884,2018/04/05,3435.0,3449.24,3500.0,111800,3510.0,3405.0
885,2018/04/06,3455.0,3458.076,3420.0,119800,3490.0,3415.0
886,2018/04/09,3400.0,3407.72,3445.0,105700,3470.0,3340.0
887,2018/04/10,3465.0,3422.2,3385.0,45000,3470.0,3360.0
888,2018/04/11,3535.0,3536.942,3525.0,41700,3560.0,3500.0
889,2018/04/12,3520.0,3533.218,3565.0,44900,3565.0,3505.0
890,2018/04/13,3605.0,3606.925,3550.0,70400,3645.0,3550.0
891,2018/04/16,3605.0,3595.212,3600.0,61400,3630.0,3560.0
892,2018/04/17,3610.0,3609.043,3630.0,75200,3630.0,3580.0
893,2018/04/18,3825.0,3772.306,3635.0,256100,3875.0,3635.0
894,2018/04/19,3750.0,3756.878,3800.0,58300,3800.0,3725.0
895,2018/04/20,3580.0,3629.21,3685.0,163900,3755.0,3570.0
896,2018/04/23,3005.0,3058.092,3100.0,793200,3165.0,2996.0
897,2018/04/24,3010.0,2987.434,3005.0,571100,3025.0,2935.0
898,2018/04/25,3000.0,2975.576,2951.0,364900,3010.0,2927.0
899,2018/04/26,3115.0,3081.937,3000.0,271600,3130.0,3000.0
900,2018/04/27,3165.0,3147.552,3140.0,148900,3175.0,3105.0
901,2018/05/01,3205.0,3200.379,3140.0,142500,3240.0,3125.0
902,2018/05/02,3175.0,3210.343,3215.0,159100,3290.0,3170.0
903,2018/05/07,3255.0,3230.306,3175.0,148500,3260.0,3160.0
904,2018/05/08,3270.0,3264.065,3250.0,111200,3295.0,3240.0
905,2018/05/09,3310.0,3310.534,3250.0,94600,3360.0,3245.0
906,2018/05/10,3305.0,3339.97,3320.0,165700,3410.0,3290.0
907,2018/05/11,3380.0,3372.262,3320.0,101700,3400.0,3295.0
908,2018/05/14,3380.0,3347.314,3375.0,63100,3380.0,3305.0
909,2018/05/15,3380.0,3383.657,3350.0,75200,3410.0,3350.0
910,2018/05/16,3375.0,3378.836,3350.0,54100,3410.0,3350.0
911,2018/05/17,3430.0,3431.529,3395.0,49700,3450.0,3395.0
912,2018/05/18,3440.0,3438.673,3430.0,71200,3475.0,3420.0
913,2018/05/21,3445.0,3434.583,3440.0,36000,3445.0,3395.0
914,2018/05/22,3485.0,3474.36,3450.0,42200,3490.0,3450.0
915,2018/05/23,3485.0,3468.905,3465.0,53900,3495.0,3425.0
916,2018/05/24,3320.0,3344.241,3450.0,76400,3450.0,3315.0
917,2018/05/25,3305.0,3318.992,3300.0,39700,3370.0,3290.0
918,2018/05/28,3310.0,3295.326,3310.0,33700,3320.0,3275.0
919,2018/05/29,3275.0,3267.161,3300.0,48600,3300.0,3240.0
920,2018/05/30,3180.0,3195.87,3230.0,47700,3230.0,3175.0
921,2018/05/31,3200.0,3187.427,3215.0,58500,3215.0,3155.0
922,2018/06/01,3215.0,3201.436,3205.0,40400,3230.0,3165.0
923,2018/06/04,3300.0,3296.977,3280.0,57400,3335.0,3245.0
924,2018/06/05,3305.0,3301.119,3300.0,28600,3325.0,3285.0
925,2018/06/06,3320.0,3318.746,3300.0,33500,3350.0,3295.0
926,2018/06/07,3345.0,3361.638,3360.0,40600,3385.0,3325.0
927,2018/06/08,3320.0,3329.132,3345.0,33400,3345.0,3310.0
928,2018/06/11,3335.0,3328.962,3330.0,21200,3345.0,3310.0
929,2018/06/12,3280.0,3289.222,3350.0,37900,3350.0,3275.0
930,2018/06/13,3275.0,3284.111,3280.0,20800,3305.0,3265.0
931,2018/06/14,3220.0,3225.96,3270.0,27600,3270.0,3210.0
932,2018/06/15,3200.0,3206.811,3250.0,42800,3250.0,3190.0
933,2018/06/18,3130.0,3146.952,3200.0,25100,3200.0,3125.0
934,2018/06/19,3130.0,3127.444,3130.0,40300,3155.0,3110.0
935,2018/06/20,3125.0,3094.32,3130.0,33100,3135.0,3055.0
936,2018/06/21,3140.0,3139.358,3120.0,29600,3170.0,3115.0
937,2018/06/22,3110.0,3101.025,3080.0,79500,3120.0,3060.0
938,2018/06/25,3070.0,3089.73,3110.0,57500,3125.0,3065.0
939,2018/06/26,3060.0,3028.224,3035.0,59800,3065.0,2993.0
940,2018/06/27,3105.0,3105.934,3080.0,48200,3135.0,3075.0
941,2018/06/28,3090.0,3092.097,3110.0,32900,3125.0,3055.0
942,2018/06/29,3090.0,3090.659,3125.0,37200,3125.0,3060.0
943,2018/07/02,3105.0,3123.156,3120.0,32800,3180.0,3090.0
944,2018/07/03,3080.0,3085.624,3105.0,43300,3125.0,3070.0
945,2018/07/04,3025.0,3022.053,3030.0,53100,3040.0,3000.0
946,2018/07/05,2977.0,2972.769,2975.0,54900,2999.0,2952.0
947,2018/07/06,3125.0,3107.607,2977.0,85800,3160.0,2977.0
948,2018/07/09,3210.0,3170.236,3125.0,19100,3210.0,3125.0
949,2018/07/10,3230.0,3238.852,3210.0,34400,3280.0,3200.0
950,2018/07/11,3140.0,3138.688,3165.0,38500,3180.0,3110.0
951,2018/07/12,3160.0,3150.622,3170.0,23300,3175.0,3110.0
952,2018/07/13,3155.0,3160.94,3160.0,31400,3205.0,3150.0
953,2018/07/17,3180.0,3180.804,3155.0,31100,3215.0,3130.0
954,2018/07/18,3220.0,3220.863,3185.0,30700,3250.0,3185.0
955,2018/07/19,3140.0,3172.797,3205.0,56500,3250.0,3130.0
956,2018/07/20,3110.0,3114.885,3110.0,61100,3150.0,3085.0
957,2018/07/23,3315.0,3269.177,3170.0,266000,3340.0,3155.0
958,2018/07/24,3260.0,3287.387,3325.0,93000,3375.0,3225.0
959,2018/07/25,3200.0,3178.888,3265.0,89000,3265.0,3115.0
960,2018/07/26,3285.0,3266.228,3230.0,46000,3300.0,3230.0
961,2018/07/27,3270.0,3272.084,3280.0,46300,3320.0,3240.0
962,2018/07/30,3170.0,3179.23,3200.0,81200,3230.0,3150.0
963,2018/07/31,3145.0,3163.986,3170.0,36500,3200.0,3145.0
964,2018/08/01,3190.0,3187.357,3170.0,33300,3205.0,3150.0
965,2018/08/02,3200.0,3205.872,3155.0,36700,3240.0,3155.0
966,2018/08/03,3165.0,3176.545,3160.0,19100,3215.0,3160.0
967,2018/08/06,3150.0,3170.094,3140.0,42400,3220.0,3125.0
968,2018/08/07,3155.0,3147.843,3150.0,39400,3175.0,3120.0
969,2018/08/08,3210.0,3201.885,3130.0,38200,3225.0,3130.0
970,2018/08/09,3175.0,3160.131,3210.0,80200,3210.0,3130.0
971,2018/08/10,3050.0,3061.411,3145.0,102400,3150.0,3030.0
972,2018/08/13,2996.0,2991.729,3030.0,76400,3040.0,2960.0
973,2018/08/14,3050.0,3045.044,3025.0,45600,3070.0,3020.0
974,2018/08/15,3020.0,3034.623,3045.0,26500,3060.0,3015.0
975,2018/08/16,2974.0,2970.872,3000.0,63400,3005.0,2943.0
976,2018/08/17,3025.0,3004.067,2976.0,12000,3030.0,2975.0
977,2018/08/20,3015.0,3010.879,2996.0,17300,3030.0,2990.0
978,2018/08/21,3000.0,2981.932,2997.0,42800,3015.0,2955.0
979,2018/08/22,3075.0,3066.16,3030.0,36200,3085.0,2998.0
980,2018/08/23,3050.0,3073.453,3080.0,32000,3120.0,3045.0
981,2018/08/24,3115.0,3103.702,3075.0,25800,3125.0,3070.0
982,2018/08/27,3225.0,3202.933,3125.0,69900,3230.0,3125.0
983,2018/08/28,3190.0,3192.121,3225.0,48100,3240.0,3135.0
984,2018/08/29,3180.0,3186.667,3180.0,22800,3215.0,3175.0
985,2018/08/30,3175.0,3179.314,3180.0,48100,3210.0,3145.0
986,2018/08/31,3175.0,3168.333,3130.0,20100,3195.0,3130.0
987,2018/09/03,3185.0,3175.666,3175.0,61600,3210.0,3125.0
988,2018/09/04,3185.0,3187.306,3180.0,28400,3205.0,3155.0
989,2018/09/05,3250.0,3231.182,3185.0,46100,3260.0,3180.0
990,2018/09/06,3210.0,3203.565,3220.0,62000,3245.0,3150.0
991,2018/09/07,3090.0,3095.929,3150.0,49500,3160.0,3065.0
992,2018/09/10,3055.0,3064.094,3070.0,30900,3115.0,3045.0
993,2018/09/11,3090.0,3078.883,3055.0,28200,3100.0,3040.0
994,2018/09/12,3005.0,3013.171,3090.0,66600,3090.0,2987.0
995,2018/09/13,2992.0,2990.797,2980.0,88200,3040.0,2960.0
996,2018/09/14,3060.0,3050.824,3015.0,37000,3090.0,3015.0
997,2018/09/18,3075.0,3066.73,3085.0,26300,3095.0,3030.0
998,2018/09/19,3135.0,3143.519,3120.0,39500,3180.0,3100.0
999,2018/09/20,3070.0,3089.527,3155.0,32800,3160.0,3065.0
1000,2018/09/21,3100.0,3088.33,3105.0,51500,3105.0,3055.0
1001,2018/09/25,3150.0,3089.305,3090.0,66900,3150.0,3015.0
1002,2018/09/26,3190.0,3158.625,3130.0,36000,3195.0,3110.0
1003,2018/09/27,3240.0,3211.987,3180.0,60400,3280.0,3150.0
1004,2018/09/28,3260.0,3271.498,3250.0,76100,3315.0,3245.0
1005,2018/10/01,3250.0,3251.729,3260.0,42800,3295.0,3195.0
1006,2018/10/02,3290.0,3308.793,3290.0,43500,3340.0,3275.0
1007,2018/10/03,3210.0,3221.382,3270.0,55000,3275.0,3185.0
1008,2018/10/04,3300.0,3283.075,3255.0,53500,3335.0,3235.0
1009,2018/10/05,3245.0,3250.444,3245.0,38300,3290.0,3225.0
1010,2018/10/09,3275.0,3291.101,3190.0,69500,3345.0,3190.0
1011,2018/10/10,3240.0,3242.977,3275.0,35100,3290.0,3190.0
1012,2018/10/11,3175.0,3171.111,3125.0,91400,3220.0,3125.0
1013,2018/10/12,3155.0,3158.399,3175.0,40900,3195.0,3135.0
1014,2018/10/15,3105.0,3125.089,3130.0,39400,3165.0,3100.0
1015,2018/10/16,3090.0,3092.462,3070.0,26400,3135.0,3070.0
1016,2018/10/17,3200.0,3189.855,3175.0,37900,3215.0,3160.0
1017,2018/10/18,3165.0,3167.972,3200.0,35500,3205.0,3130.0
1018,2018/10/19,3085.0,3088.719,3075.0,63600,3135.0,3065.0
1019,2018/10/22,2991.0,2985.515,3030.0,179900,3085.0,2933.0
1020,2018/10/23,2963.0,2977.067,3000.0,87600,3045.0,2939.0
1021,2018/10/24,2928.0,2940.166,2963.0,72100,2995.0,2905.0
1022,2018/10/25,2936.0,2939.16,2913.0,66200,2961.0,2905.0
1023,2018/10/26,2879.0,2890.085,2923.0,101300,2964.0,2847.0
1024,2018/10/29,2985.0,2973.488,2890.0,71300,3015.0,2890.0
1025,2018/10/30,2982.0,2965.901,2900.0,65700,2994.0,2900.0
1026,2018/10/31,3060.0,3046.792,3000.0,54400,3075.0,2967.0
1027,2018/11/01,3145.0,3142.914,3040.0,72400,3170.0,3030.0
1028,2018/11/02,3195.0,3171.1,3130.0,53200,3205.0,3120.0
1029,2018/11/05,3215.0,3213.632,3170.0,32900,3250.0,3160.0
1030,2018/11/06,3210.0,3235.133,3215.0,30000,3265.0,3190.0
1031,2018/11/07,3140.0,3158.691,3225.0,29400,3225.0,3130.0
1032,2018/11/08,3170.0,3197.794,3145.0,38300,3245.0,3145.0
1033,2018/11/09,3190.0,3172.122,3170.0,17200,3190.0,3140.0
1034,2018/11/12,3160.0,3159.526,3165.0,11600,3185.0,3115.0
1035,2018/11/13,3065.0,3056.959,3110.0,26800,3115.0,3030.0
1036,2018/11/14,3040.0,3063.441,3010.0,55300,3125.0,2990.0
1037,2018/11/15,3025.0,3013.207,2995.0,53200,3040.0,2987.0
1038,2018/11/16,2998.0,2990.392,2987.0,75800,3010.0,2945.0
1039,2018/11/19,3040.0,3028.754,3025.0,39500,3060.0,2996.0
1040,2018/11/20,3065.0,3051.546,3035.0,22000,3080.0,3025.0
1041,2018/11/21,3045.0,3034.215,3005.0,28900,3065.0,2991.0
1042,2018/11/22,3020.0,3020.831,3030.0,29000,3045.0,2995.0
1043,2018/11/26,3015.0,3017.008,3035.0,39400,3060.0,2999.0
1044,2018/11/27,3045.0,3040.415,3015.0,32500,3070.0,3005.0
1045,2018/11/28,3130.0,3090.535,3050.0,35500,3145.0,3005.0
1046,2018/11/29,3095.0,3125.702,3170.0,29900,3180.0,3090.0
1047,2018/11/30,3135.0,3123.689,3095.0,24400,3135.0,3075.0
1048,2018/12/03,3155.0,3148.864,3135.0,29500,3165.0,3135.0
1049,2018/12/04,3125.0,3123.407,3145.0,24800,3170.0,3100.0
1050,2018/12/05,3145.0,3136.003,3075.0,38900,3160.0,3075.0
1051,2018/12/06,3020.0,3032.072,3085.0,33300,3100.0,3010.0
1052,2018/12/07,3050.0,3026.673,3025.0,25400,3055.0,3000.0
1053,2018/12/10,3000.0,3000.093,3025.0,32300,3025.0,2980.0
1054,2018/12/11,3005.0,3009.246,2990.0,31300,3040.0,2983.0
1055,2018/12/12,3030.0,3044.491,3010.0,33000,3080.0,2995.0
1056,2018/12/13,3040.0,3041.481,3040.0,23300,3070.0,3025.0
1057,2018/12/14,3055.0,3039.808,3020.0,39000,3070.0,3005.0
1058,2018/12/17,3005.0,3040.135,3020.0,29700,3095.0,3000.0
1059,2018/12/18,2952.0,2942.007,2940.0,41300,2976.0,2913.0
1060,2018/12/19,2986.0,2976.664,2950.0,45800,2997.0,2931.0
1061,2018/12/20,2845.0,2880.846,2982.0,40200,2993.0,2834.0
1062,2018/12/21,2749.0,2744.905,2810.0,68400,2835.0,2710.0
1063,2018/12/25,2517.0,2556.135,2612.0,61500,2612.0,2513.0
1064,2018/12/26,2514.0,2510.939,2550.0,40700,2550.0,2473.0
1065,2018/12/27,2691.0,2668.405,2650.0,35800,2691.0,2637.0
1066,2018/12/28,2729.0,2719.414,2691.0,33800,2749.0,2671.0
1067,2019/01/04,2585.0,2618.712,2704.0,73200,2729.0,2568.0
1068,2019/01/07,2980.0,2957.82,2785.0,322100,3035.0,2785.0
1069,2019/01/08,2940.0,2961.873,2973.0,94400,3010.0,2932.0
1070,2019/01/09,2944.0,2946.869,2954.0,41200,2980.0,2931.0
1071,2019/01/10,2961.0,2962.243,2947.0,33800,2992.0,2910.0
1072,2019/01/11,2950.0,2959.385,2972.0,28600,2990.0,2940.0
1073,2019/01/15,2988.0,2975.299,2950.0,37800,2996.0,2923.0
1074,2019/01/16,2958.0,2963.861,2970.0,15100,2988.0,2947.0
1075,2019/01/17,2974.0,2968.457,2964.0,18600,2999.0,2944.0
1076,2019/01/18,3015.0,3017.076,2995.0,27600,3040.0,2978.0
1077,2019/01/21,3060.0,3047.271,3045.0,33900,3065.0,3020.0
1078,2019/01/22,3060.0,3065.656,3080.0,34300,3115.0,3040.0
1079,2019/01/23,3075.0,3051.723,3020.0,25300,3090.0,2990.0
1080,2019/01/24,3080.0,3082.672,3075.0,20400,3115.0,3055.0
1081,2019/01/25,3100.0,3106.042,3100.0,38400,3155.0,3075.0
1082,2019/01/28,3110.0,3119.514,3100.0,81200,3145.0,3090.0
1083,2019/01/29,3010.0,3008.011,3095.0,72300,3110.0,2965.0
1084,2019/01/30,2948.0,2945.957,2980.0,63400,2990.0,2900.0
1085,2019/01/31,2951.0,2959.223,2952.0,52900,3015.0,2926.0
1086,2019/02/01,2932.0,2947.528,2951.0,47200,2995.0,2920.0
1087,2019/02/04,2990.0,2979.258,2926.0,39100,3005.0,2926.0
1088,2019/02/05,3010.0,3000.765,2959.0,16600,3015.0,2959.0
1089,2019/02/06,3000.0,3008.748,3010.0,12300,3025.0,2993.0
1090,2019/02/07,2977.0,2970.777,2980.0,39400,3005.0,2934.0
1091,2019/02/08,2927.0,2931.848,2941.0,31500,2951.0,2920.0
1092,2019/02/12,3030.0,3026.688,2991.0,28800,3050.0,2990.0
1093,2019/02/13,3090.0,3063.936,3035.0,20200,3095.0,3035.0
1094,2019/02/14,3115.0,3104.743,3085.0,31100,3120.0,3065.0
1095,2019/02/15,3055.0,3063.315,3055.0,9200,3100.0,3035.0
1096,2019/02/18,3100.0,3097.019,3110.0,27000,3110.0,3080.0
1097,2019/02/19,3100.0,3098.808,3095.0,21400,3110.0,3075.0
1098,2019/02/20,3050.0,3068.993,3100.0,13900,3110.0,3045.0
1099,2019/02/21,3050.0,3049.764,3050.0,14800,3070.0,3030.0
1100,2019/02/22,3020.0,3021.185,3025.0,21100,3050.0,3005.0
1101,2019/02/25,3040.0,3037.706,3030.0,17000,3065.0,3015.0
1102,2019/02/26,3010.0,3010.597,3050.0,18600,3050.0,2999.0
1103,2019/02/27,3010.0,3008.5,3010.0,17200,3020.0,2994.0
1104,2019/02/28,2974.0,2989.582,3010.0,36400,3015.0,2973.0
1105,2019/03/01,3000.0,2996.123,2997.0,23600,3025.0,2972.0
1106,2019/03/04,3020.0,3027.778,3050.0,19800,3050.0,3010.0
1107,2019/03/05,2945.0,2947.374,3005.0,45200,3010.0,2926.0
1108,2019/03/06,2890.0,2891.476,2946.0,67500,2946.0,2845.0
1109,2019/03/07,2813.0,2815.603,2864.0,70300,2864.0,2798.0
1110,2019/03/08,2813.0,2807.125,2801.0,74200,2836.0,2785.0
1111,2019/03/11,2800.0,2804.029,2818.0,30800,2821.0,2796.0
1112,2019/03/12,2842.0,2848.506,2865.0,34000,2874.0,2835.0
1113,2019/03/13,2801.0,2803.443,2805.0,38400,2839.0,2798.0
1114,2019/03/14,2798.0,2805.905,2830.0,38000,2839.0,2798.0
1115,2019/03/15,2793.0,2800.801,2824.0,68200,2829.0,2789.0
1116,2019/03/18,2833.0,2822.904,2808.0,27100,2838.0,2808.0
1117,2019/03/19,2803.0,2805.879,2833.0,14100,2833.0,2800.0
1118,2019/03/20,2833.0,2825.594,2805.0,24900,2836.0,2805.0
1119,2019/03/22,2902.0,2880.909,2833.0,40800,2923.0,2833.0
1120,2019/03/25,2864.0,2858.874,2846.0,35800,2881.0,2814.0
1121,2019/03/26,2830.0,2749.79,2690.0,138800,2853.0,2682.0
1122,2019/03/27,2935.0,2899.421,2802.0,66300,2936.0,2802.0
1123,2019/03/28,2869.0,2885.0,2912.0,34800,2915.0,2866.0
1124,2019/03/29,2848.0,2866.689,2919.0,20600,2919.0,2846.0
1125,2019/04/01,2905.0,2908.202,2898.0,26700,2927.0,2866.0
1126,2019/04/02,2913.0,2919.832,2938.0,20800,2949.0,2907.0
1127,2019/04/03,2954.0,2948.539,2900.0,27300,2967.0,2898.0
1128,2019/04/04,3010.0,2989.822,2954.0,31400,3015.0,2941.0
1129,2019/04/05,3035.0,3029.527,2990.0,29600,3060.0,2990.0
1130,2019/04/08,3010.0,3010.786,3020.0,20100,3025.0,2998.0
1131,2019/04/09,3010.0,3007.785,3010.0,20000,3020.0,2996.0
1132,2019/04/10,2991.0,2971.993,2960.0,13400,3000.0,2943.0
1133,2019/04/11,2966.0,2965.24,2972.0,15000,2977.0,2939.0
1134,2019/04/12,2958.0,2956.984,2970.0,12700,2976.0,2940.0
1135,2019/04/15,3030.0,3030.442,3010.0,32800,3050.0,3005.0
1136,2019/04/16,3015.0,3010.168,3005.0,14300,3030.0,2992.0
1137,2019/04/17,3015.0,3008.11,2966.0,49800,3055.0,2965.0
1138,2019/04/18,2983.0,2986.441,3000.0,22200,3020.0,2961.0
1139,2019/04/19,3030.0,3015.1,2978.0,48000,3035.0,2970.0
1140,2019/04/22,3040.0,3066.172,3010.0,97500,3150.0,2958.0
1141,2019/04/23,3090.0,3077.303,3040.0,35600,3100.0,3025.0
1142,2019/04/24,3075.0,3088.943,3100.0,24600,3115.0,3075.0
1143,2019/04/25,3190.0,3157.948,3120.0,59700,3190.0,3110.0
1144,2019/04/26,3150.0,3141.574,3145.0,28900,3180.0,3115.0
1145,2019/05/07,3045.0,3064.165,3150.0,40100,3160.0,3030.0
1146,2019/05/08,3040.0,3032.269,2984.0,30900,3070.0,2975.0
1147,2019/05/09,3005.0,3003.794,2985.0,36400,3030.0,2971.0
1148,2019/05/10,3005.0,3010.973,3005.0,26000,3040.0,2982.0
1149,2019/05/13,2964.0,2976.81,3020.0,33700,3020.0,2959.0
1150,2019/05/14,2959.0,2953.111,2920.0,47700,2970.0,2909.0
1151,2019/05/15,3005.0,2966.504,2968.0,38700,3005.0,2925.0
1152,2019/05/16,3020.0,3016.885,3010.0,47100,3070.0,2966.0
1153,2019/05/17,3055.0,3051.484,3050.0,25600,3070.0,3025.0
1154,2019/05/20,3085.0,3095.378,3085.0,35700,3115.0,3055.0
1155,2019/05/21,3105.0,3111.083,3100.0,43400,3135.0,3080.0
1156,2019/05/22,3120.0,3113.082,3130.0,37800,3140.0,3085.0
1157,2019/05/23,3100.0,3100.951,3110.0,18400,3120.0,3075.0
1158,2019/05/24,3100.0,3084.77,3065.0,15200,3100.0,3055.0
1159,2019/05/27,3025.0,3052.688,3100.0,17300,3115.0,3025.0
1160,2019/05/28,3055.0,3058.127,3055.0,32300,3075.0,3045.0
1161,2019/05/29,3055.0,3053.104,3055.0,32700,3070.0,3010.0
1162,2019/05/30,3065.0,3068.285,3070.0,37600,3090.0,3040.0
1163,2019/05/31,3030.0,3028.357,3080.0,41700,3080.0,3010.0
1164,2019/06/03,2956.0,2966.406,2981.0,42400,2985.0,2951.0
1165,2019/06/04,2992.0,2968.671,2977.0,56200,2995.0,2940.0
1166,2019/06/05,3140.0,3105.155,3025.0,29000,3140.0,3025.0
1167,2019/06/06,3105.0,3119.715,3135.0,22800,3135.0,3100.0
1168,2019/06/07,3130.0,3128.513,3130.0,42700,3140.0,3110.0
1169,2019/06/10,3150.0,3139.846,3150.0,32400,3165.0,3120.0
1170,2019/06/11,3150.0,3148.371,3150.0,22400,3155.0,3135.0
1171,2019/06/12,3140.0,3143.523,3145.0,34200,3160.0,3130.0
1172,2019/06/13,3140.0,3124.23,3135.0,29200,3145.0,3105.0
1173,2019/06/14,3115.0,3119.33,3140.0,19400,3140.0,3100.0
1174,2019/06/17,3090.0,3089.385,3115.0,13000,3115.0,3075.0
1175,2019/06/18,3030.0,3047.205,3090.0,19500,3100.0,3030.0
1176,2019/06/19,3140.0,3128.779,3090.0,30700,3150.0,3085.0
1177,2019/06/20,3165.0,3160.288,3140.0,39900,3170.0,3140.0
1178,2019/06/21,3175.0,3166.058,3165.0,75600,3205.0,3125.0
1179,2019/06/24,3125.0,3134.121,3175.0,16500,3180.0,3120.0
1180,2019/06/25,3175.0,3168.158,3155.0,22800,3180.0,3130.0
1181,2019/06/26,3180.0,3180.969,3170.0,19600,3195.0,3150.0
1182,2019/06/27,3200.0,3198.08,3180.0,22400,3215.0,3180.0
1183,2019/06/28,3200.0,3195.181,3200.0,22100,3220.0,3180.0
1184,2019/07/01,3250.0,3234.345,3230.0,37400,3255.0,3210.0
1185,2019/07/02,3265.0,3261.395,3250.0,49100,3280.0,3240.0
1186,2019/07/03,3220.0,3236.989,3270.0,46500,3270.0,3210.0
1187,2019/07/04,3295.0,3288.721,3245.0,34800,3310.0,3215.0
1188,2019/07/05,3290.0,3291.246,3310.0,30100,3315.0,3270.0
1189,2019/07/08,3270.0,3274.316,3290.0,33600,3310.0,3250.0
1190,2019/07/09,3235.0,3236.115,3275.0,26900,3280.0,3225.0
1191,2019/07/10,3245.0,3240.686,3235.0,29900,3255.0,3210.0
1192,2019/07/11,3200.0,3228.479,3250.0,55900,3285.0,3195.0
1193,2019/07/12,3230.0,3220.214,3215.0,44300,3260.0,3165.0
1194,2019/07/16,3195.0,3214.646,3215.0,32500,3250.0,3195.0
1195,2019/07/17,3180.0,3184.663,3190.0,35600,3210.0,3155.0
1196,2019/07/18,3125.0,3147.984,3175.0,30500,3175.0,3120.0
1197,2019/07/19,3135.0,3146.087,3140.0,56100,3175.0,3125.0
1198,2019/07/22,3505.0,3556.128,3555.0,587400,3635.0,3460.0
1199,2019/07/23,3485.0,3512.51,3485.0,121300,3555.0,3475.0
1200,2019/07/24,3505.0,3503.575,3480.0,120000,3535.0,3475.0
1201,2019/07/25,3600.0,3619.165,3575.0,179700,3670.0,3555.0
1202,2019/07/26,3600.0,3588.252,3575.0,65200,3605.0,3560.0
1203,2019/07/29,3575.0,3582.407,3600.0,51100,3600.0,3555.0
1204,2019/07/30,3580.0,3579.426,3590.0,44400,3600.0,3560.0
1205,2019/07/31,3495.0,3525.257,3570.0,68100,3570.0,3495.0
1206,2019/08/01,3460.0,3473.939,3440.0,36300,3510.0,3420.0
1207,2019/08/02,3450.0,3445.092,3395.0,43700,3490.0,3380.0
1208,2019/08/05,3385.0,3402.353,3405.0,40800,3455.0,3365.0
1209,2019/08/06,3320.0,3318.08,3305.0,48700,3355.0,3290.0
1210,2019/08/07,3205.0,3250.357,3315.0,77100,3315.0,3190.0
1211,2019/08/08,3225.0,3229.954,3215.0,21700,3280.0,3205.0
1212,2019/08/09,3275.0,3262.209,3265.0,25800,3275.0,3230.0
1213,2019/08/13,3180.0,3199.515,3205.0,43300,3230.0,3180.0
1214,2019/08/14,3230.0,3224.599,3265.0,31200,3265.0,3200.0
1215,2019/08/15,3160.0,3156.616,3155.0,33100,3175.0,3140.0
1216,2019/08/16,3155.0,3152.052,3160.0,25100,3160.0,3140.0
1217,2019/08/19,3165.0,3169.173,3170.0,26600,3180.0,3155.0
1218,2019/08/20,3155.0,3158.032,3180.0,31000,3225.0,3140.0
1219,2019/08/21,3170.0,3147.464,3145.0,20700,3180.0,3105.0
1220,2019/08/22,3110.0,3135.345,3190.0,17400,3190.0,3110.0
1221,2019/08/23,3115.0,3107.466,3120.0,14600,3120.0,3090.0
