ds,yhat
2019-07-16,870.2824529337302
2019-07-17,876.7544775708257
2019-07-18,884.040161889985
2019-07-19,884.8437120590643
2019-07-22,867.1495711901107
2019-07-23,870.1828214440559
2019-07-24,875.4152003072128
2019-07-25,878.1529708184446
2019-07-26,877.4146732907236
2019-07-29,869.4612394570903
2019-07-30,858.5033536112417
2019-07-31,840.9753387915802
2019-08-01,824.3628691154859
2019-08-02,819.6121060071815
2019-08-05,885.0886692593949
2019-08-06,901.1803145682159
2019-08-07,906.1046967692508
2019-08-08,908.700475028889
2019-08-09,918.9724048244153
