,Date,Close,VWAP,Open,Volume,High,Low
0,2014/08/25,342.0,339.003,341.0,89700,342.0,333.0
1,2014/08/26,348.0,344.777,342.0,171200,349.0,339.0
2,2014/08/27,357.0,354.866,349.0,325300,360.0,349.0
3,2014/08/28,357.0,356.277,358.0,147800,359.0,352.0
4,2014/08/29,357.0,354.523,355.0,87700,357.0,351.0
5,2014/09/01,363.0,361.467,361.0,276200,363.0,359.0
6,2014/09/02,367.0,367.914,364.0,254200,373.0,364.0
7,2014/09/03,368.0,368.247,367.0,149200,373.0,364.0
8,2014/09/04,360.0,364.871,368.0,75000,370.0,360.0
9,2014/09/05,353.0,353.387,360.0,184700,361.0,345.0
10,2014/09/08,370.0,364.345,359.0,171700,370.0,358.0
11,2014/09/09,367.0,369.64,373.0,373300,375.0,364.0
12,2014/09/10,365.0,362.86,365.0,156900,366.0,360.0
13,2014/09/11,365.0,365.322,365.0,126100,368.0,363.0
14,2014/09/12,364.0,366.63,369.0,114000,369.0,362.0
15,2014/09/16,362.0,361.755,361.0,66200,364.0,357.0
16,2014/09/17,358.0,358.801,360.0,55900,361.0,356.0
17,2014/09/18,353.0,354.109,351.0,102200,358.0,351.0
18,2014/09/19,359.0,356.831,358.0,102900,359.0,354.0
19,2014/09/22,361.0,358.364,356.0,97700,363.0,354.0
20,2014/09/24,364.0,362.536,359.0,100700,366.0,358.0
21,2014/09/25,387.0,385.097,378.0,1187000,393.0,378.0
22,2014/09/26,388.0,383.814,380.0,296200,388.0,380.0
23,2014/09/29,389.0,388.972,392.0,220100,393.0,385.0
24,2014/09/30,410.0,399.643,389.0,933700,417.0,383.0
25,2014/10/01,396.0,401.926,407.0,500000,410.0,395.0
26,2014/10/02,382.0,384.248,383.0,269400,389.0,381.0
27,2014/10/03,400.0,392.944,382.0,221500,400.0,382.0
28,2014/10/06,408.0,407.011,407.0,242700,410.0,402.0
29,2014/10/07,396.0,401.181,405.0,180300,405.0,395.0
30,2014/10/08,391.0,387.082,385.0,179000,394.0,384.0
31,2014/10/09,384.0,390.053,396.0,123600,396.0,384.0
32,2014/10/10,375.0,374.575,377.0,180900,377.0,371.0
33,2014/10/14,362.0,363.538,362.0,184200,368.0,360.0
34,2014/10/15,370.0,366.858,362.0,121800,372.0,362.0
35,2014/10/16,361.0,363.074,362.0,108900,367.0,359.0
36,2014/10/17,358.0,362.746,367.0,114700,372.0,358.0
37,2014/10/20,377.0,374.671,375.0,150800,378.0,368.0
38,2014/10/21,368.0,372.908,377.0,91700,378.0,367.0
39,2014/10/22,381.0,377.187,374.0,76000,381.0,374.0
40,2014/10/23,380.0,381.537,380.0,130200,386.0,376.0
41,2014/10/24,376.0,378.662,384.0,133100,384.0,376.0
42,2014/10/27,379.0,381.616,381.0,156400,384.0,378.0
43,2014/10/28,379.0,377.259,379.0,131800,379.0,375.0
44,2014/10/29,384.0,383.309,379.0,110000,386.0,379.0
45,2014/10/30,380.0,381.918,382.0,129700,385.0,380.0
46,2014/10/31,387.0,385.445,380.0,282200,389.0,380.0
47,2014/11/04,383.0,392.412,400.0,359700,400.0,383.0
48,2014/11/05,388.0,384.45,380.0,156200,390.0,377.0
49,2014/11/06,382.0,385.691,391.0,82900,392.0,379.0
50,2014/11/07,384.0,384.707,386.0,83500,388.0,381.0
51,2014/11/10,380.0,380.429,384.0,69200,384.0,377.0
52,2014/11/11,376.0,373.152,384.0,400400,384.0,367.0
53,2014/11/12,400.0,394.148,382.0,573300,403.0,382.0
54,2014/11/13,434.0,435.21,401.0,2391400,479.0,401.0
55,2014/11/14,436.0,435.771,436.0,704500,444.0,430.0
56,2014/11/17,424.0,427.768,432.0,355600,438.0,421.0
57,2014/11/18,424.0,425.964,420.0,319500,432.0,420.0
58,2014/11/19,420.0,420.078,428.0,433400,428.0,415.0
59,2014/11/20,429.0,427.464,420.0,238800,438.0,419.0
60,2014/11/21,426.0,427.509,431.0,352200,434.0,422.0
61,2014/11/25,440.0,434.929,431.0,231600,440.0,429.0
62,2014/11/26,438.0,439.96,443.0,198200,445.0,436.0
63,2014/11/27,431.0,433.548,437.0,171500,439.0,429.0
64,2014/11/28,439.0,436.642,428.0,180500,441.0,428.0
65,2014/12/01,437.0,437.346,436.0,80400,440.0,435.0
66,2014/12/02,438.0,433.571,432.0,136100,438.0,430.0
67,2014/12/03,435.0,436.884,439.0,152400,440.0,435.0
68,2014/12/04,448.0,446.171,440.0,348300,452.0,437.0
69,2014/12/05,463.0,458.097,448.0,299600,465.0,444.0
70,2014/12/08,453.0,455.624,465.0,182600,466.0,450.0
71,2014/12/09,445.0,446.676,448.0,201200,454.0,443.0
72,2014/12/10,440.0,440.568,440.0,184300,445.0,436.0
73,2014/12/11,436.0,433.744,432.0,129100,438.0,429.0
74,2014/12/12,446.0,445.262,440.0,134200,450.0,440.0
75,2014/12/15,455.0,453.821,444.0,296500,465.0,440.0
76,2014/12/16,453.0,456.16,454.0,249300,464.0,446.0
77,2014/12/17,449.0,450.065,447.0,152700,456.0,444.0
78,2014/12/18,466.0,463.652,453.0,224700,470.0,453.0
79,2014/12/19,464.0,465.606,470.0,274300,473.0,459.0
80,2014/12/22,460.0,462.789,458.0,162200,468.0,458.0
81,2014/12/24,465.0,465.373,464.0,119000,468.0,461.0
82,2014/12/25,460.0,463.064,468.0,84700,468.0,460.0
83,2014/12/26,472.0,469.051,461.0,167500,473.0,461.0
84,2014/12/29,488.0,482.85,471.0,259600,490.0,470.0
85,2014/12/30,481.0,482.893,489.0,143100,490.0,480.0
86,2015/01/05,477.0,477.17,481.0,120200,481.0,473.0
87,2015/01/06,456.0,462.231,469.0,242000,471.0,453.0
88,2015/01/07,455.0,456.541,449.0,100400,462.0,449.0
89,2015/01/08,459.0,461.015,462.0,58300,463.0,458.0
90,2015/01/09,451.0,454.946,462.0,166300,463.0,448.0
91,2015/01/13,445.0,442.748,439.0,162700,447.0,438.0
92,2015/01/14,435.0,439.155,440.0,134600,445.0,434.0
93,2015/01/15,438.0,436.179,434.0,153500,439.0,432.0
94,2015/01/16,424.0,426.376,435.0,236000,437.0,422.0
95,2015/01/19,427.0,427.596,427.0,96900,433.0,424.0
96,2015/01/20,436.0,433.12,432.0,74000,436.0,426.0
97,2015/01/21,439.0,438.668,438.0,118100,443.0,431.0
98,2015/01/22,440.0,439.229,444.0,74300,444.0,436.0
99,2015/01/23,438.0,438.522,446.0,60200,446.0,435.0
100,2015/01/26,442.0,439.421,435.0,86400,445.0,433.0
101,2015/01/27,442.0,441.877,441.0,71500,445.0,437.0
102,2015/01/28,448.0,446.619,444.0,110100,451.0,443.0
103,2015/01/29,443.0,445.956,448.0,104400,452.0,442.0
104,2015/01/30,448.0,446.689,445.0,99700,451.0,442.0
105,2015/02/02,437.0,440.095,448.0,72300,448.0,436.0
106,2015/02/03,427.0,431.329,439.0,167000,442.0,423.0
107,2015/02/04,435.0,433.562,430.0,91400,436.0,428.0
108,2015/02/05,433.0,433.506,437.0,66200,439.0,431.0
109,2015/02/06,436.0,434.821,438.0,53000,438.0,431.0
110,2015/02/09,444.0,442.898,440.0,123900,445.0,437.0
111,2015/02/10,460.0,452.99,445.0,165000,460.0,441.0
112,2015/02/12,453.0,462.765,470.0,471500,474.0,441.0
113,2015/02/13,446.0,452.383,454.0,280000,466.0,444.0
114,2015/02/16,445.0,446.803,450.0,132500,452.0,444.0
115,2015/02/17,443.0,444.459,450.0,162800,450.0,440.0
116,2015/02/18,436.0,440.913,445.0,249500,447.0,436.0
117,2015/02/19,442.0,441.833,442.0,260200,445.0,439.0
118,2015/02/20,438.0,441.307,445.0,201300,446.0,436.0
119,2015/02/23,443.0,442.211,442.0,71200,444.0,441.0
120,2015/02/24,446.0,446.281,441.0,119200,449.0,441.0
121,2015/02/25,455.0,452.186,449.0,203100,455.0,447.0
122,2015/02/26,455.0,453.583,456.0,194400,456.0,451.0
123,2015/02/27,454.0,455.438,455.0,118200,457.0,452.0
124,2015/03/02,460.0,462.018,458.0,186600,466.0,457.0
125,2015/03/03,454.0,456.636,458.0,119600,462.0,452.0
126,2015/03/04,458.0,453.836,451.0,143600,461.0,447.0
127,2015/03/05,457.0,460.082,463.0,150100,464.0,455.0
128,2015/03/06,451.0,453.903,460.0,114600,460.0,451.0
129,2015/03/09,455.0,454.632,457.0,95200,458.0,451.0
130,2015/03/10,457.0,458.479,457.0,140100,460.0,456.0
131,2015/03/11,470.0,465.535,454.0,207700,470.0,454.0
132,2015/03/12,472.0,471.383,474.0,168900,474.0,467.0
133,2015/03/13,474.0,475.47,475.0,191600,478.0,473.0
134,2015/03/16,481.0,477.633,474.0,144300,481.0,473.0
135,2015/03/17,478.0,481.857,484.0,159200,484.0,477.0
136,2015/03/18,479.0,477.388,478.0,125200,482.0,472.0
137,2015/03/19,477.0,477.355,476.0,97100,480.0,475.0
138,2015/03/20,480.0,481.559,481.0,107600,484.0,478.0
139,2015/03/23,478.0,479.237,480.0,90400,483.0,476.0
140,2015/03/24,475.0,476.016,474.0,57200,480.0,473.0
141,2015/03/25,474.0,474.136,472.0,45500,476.0,472.0
142,2015/03/26,468.0,468.254,469.0,67700,473.0,465.0
143,2015/03/27,459.0,463.616,462.0,92000,472.0,455.0
144,2015/03/30,460.0,457.808,459.0,102900,462.0,451.0
145,2015/03/31,468.0,469.878,470.0,139000,473.0,465.0
146,2015/04/01,472.0,468.712,464.0,131400,474.0,461.0
147,2015/04/02,472.0,473.244,470.0,146300,477.0,468.0
148,2015/04/03,476.0,469.46,473.0,98300,478.0,460.0
149,2015/04/06,470.0,470.84,470.0,46300,473.0,469.0
150,2015/04/07,471.0,470.304,472.0,61800,474.0,466.0
151,2015/04/08,468.0,470.822,473.0,67000,474.0,468.0
152,2015/04/09,469.0,465.736,468.0,80300,469.0,463.0
153,2015/04/10,470.0,468.172,469.0,130200,473.0,464.0
154,2015/04/13,470.0,469.625,473.0,37300,473.0,467.0
155,2015/04/14,473.0,468.648,471.0,61300,473.0,464.0
156,2015/04/15,470.0,469.792,472.0,41400,472.0,466.0
157,2015/04/16,468.0,465.919,470.0,70400,470.0,463.0
158,2015/04/17,460.0,462.666,463.0,157900,466.0,460.0
159,2015/04/20,462.0,461.573,456.0,63900,466.0,456.0
160,2015/04/21,458.0,458.962,462.0,87400,464.0,456.0
161,2015/04/22,459.0,460.505,460.0,47900,463.0,458.0
162,2015/04/23,463.0,461.682,460.0,104700,466.0,457.0
163,2015/04/24,462.0,462.871,465.0,71900,465.0,461.0
164,2015/04/27,466.0,464.715,465.0,68400,467.0,462.0
165,2015/04/28,458.0,459.411,462.0,114400,465.0,457.0
166,2015/04/30,449.0,450.082,459.0,191900,459.0,430.0
167,2015/05/01,442.0,444.554,441.0,109900,452.0,441.0
168,2015/05/07,442.0,442.993,441.0,70300,446.0,440.0
169,2015/05/08,444.0,444.022,442.0,98500,448.0,440.0
170,2015/05/11,454.0,453.411,448.0,101000,459.0,446.0
171,2015/05/12,456.0,451.913,455.0,97600,456.0,449.0
172,2015/05/13,458.0,454.626,451.0,68500,460.0,450.0
173,2015/05/14,453.0,452.426,455.0,100400,457.0,447.0
174,2015/05/15,445.0,455.441,456.0,189300,464.0,444.0
175,2015/05/18,478.0,474.641,475.0,565400,485.0,464.0
176,2015/05/19,486.0,487.743,486.0,390200,494.0,482.0
177,2015/05/20,473.0,480.292,497.0,486200,497.0,467.0
178,2015/05/21,472.0,473.432,471.0,176300,480.0,466.0
179,2015/05/22,494.0,486.067,477.0,324000,495.0,473.0
180,2015/05/25,502.0,497.456,499.0,349900,503.0,486.0
181,2015/05/26,529.0,527.184,505.0,1249300,545.0,504.0
182,2015/05/27,532.0,529.794,527.0,437100,536.0,523.0
183,2015/05/28,540.0,540.789,539.0,347600,547.0,536.0
184,2015/05/29,569.0,557.027,538.0,681600,570.0,537.0
185,2015/06/01,591.0,594.691,589.0,903500,611.0,576.0
186,2015/06/02,577.0,581.551,596.0,403500,600.0,571.0
187,2015/06/03,593.0,584.714,577.0,417100,593.0,574.0
188,2015/06/04,599.0,598.763,593.0,296600,604.0,593.0
189,2015/06/05,587.0,587.348,600.0,267100,600.0,580.0
190,2015/06/08,583.0,582.792,580.0,257300,596.0,570.0
191,2015/06/09,561.0,569.243,580.0,309700,582.0,561.0
192,2015/06/10,585.0,584.234,563.0,360100,595.0,563.0
193,2015/06/11,591.0,591.297,586.0,219000,597.0,585.0
194,2015/06/12,588.0,589.504,591.0,199600,594.0,584.0
195,2015/06/15,587.0,587.16,585.0,74500,593.0,583.0
196,2015/06/16,576.0,579.199,581.0,137200,585.0,576.0
197,2015/06/17,585.0,584.814,580.0,155600,588.0,580.0
198,2015/06/18,579.0,581.694,585.0,101500,587.0,577.0
199,2015/06/19,574.0,576.342,581.0,100300,583.0,572.0
200,2015/06/22,578.0,576.456,572.0,91100,584.0,572.0
201,2015/06/23,577.0,578.298,583.0,128700,584.0,574.0
202,2015/06/24,582.0,581.334,578.0,144100,585.0,577.0
203,2015/06/25,582.0,581.488,582.0,116500,587.0,576.0
204,2015/06/26,578.0,578.06,582.0,94900,582.0,573.0
205,2015/06/29,548.0,556.452,556.0,195500,565.0,548.0
206,2015/06/30,568.0,563.37,552.0,156400,570.0,552.0
207,2015/07/01,578.0,575.284,570.0,138600,585.0,563.0
208,2015/07/02,582.0,583.48,579.0,111300,587.0,578.0
209,2015/07/03,582.0,580.505,586.0,131300,586.0,577.0
210,2015/07/06,578.0,579.081,578.0,123900,584.0,572.0
211,2015/07/07,586.0,586.416,584.0,143600,590.0,580.0
212,2015/07/08,569.0,578.865,590.0,171100,593.0,569.0
213,2015/07/09,561.0,553.872,550.0,160800,565.0,530.0
214,2015/07/10,566.0,569.356,568.0,119900,579.0,563.0
215,2015/07/13,582.0,580.775,570.0,97800,586.0,570.0
216,2015/07/14,591.0,591.691,595.0,109200,596.0,585.0
217,2015/07/15,591.0,591.407,595.0,85700,595.0,586.0
218,2015/07/16,609.0,604.608,594.0,270900,613.0,590.0
219,2015/07/17,605.0,606.351,609.0,109000,615.0,602.0
220,2015/07/21,607.0,606.708,605.0,73900,610.0,604.0
221,2015/07/22,597.0,601.266,601.0,95100,606.0,597.0
222,2015/07/23,602.0,600.649,601.0,51300,606.0,596.0
223,2015/07/24,601.0,599.514,605.0,91600,605.0,595.0
224,2015/07/27,594.0,596.217,595.0,74300,602.0,593.0
225,2015/07/28,599.0,591.996,590.0,114200,605.0,582.0
226,2015/07/29,596.0,596.479,604.0,47400,604.0,593.0
227,2015/07/30,596.0,596.44,599.0,50000,602.0,593.0
228,2015/07/31,595.0,593.355,595.0,61100,597.0,590.0
229,2015/08/03,595.0,591.72,594.0,48200,597.0,587.0
230,2015/08/04,594.0,592.842,597.0,65100,598.0,588.0
231,2015/08/05,606.0,600.096,592.0,121600,609.0,586.0
232,2015/08/06,600.0,605.5,609.0,106900,610.0,598.0
233,2015/08/07,625.0,615.524,602.0,225800,626.0,600.0
234,2015/08/10,636.0,630.743,630.0,152300,637.0,623.0
235,2015/08/11,640.0,645.991,642.0,234000,663.0,624.0
236,2015/08/12,598.0,612.747,629.0,255100,633.0,595.0
237,2015/08/13,611.0,601.69,598.0,188600,614.0,590.0
238,2015/08/14,628.0,616.313,610.0,101600,629.0,603.0
239,2015/08/17,649.0,643.905,634.0,177400,650.0,634.0
240,2015/08/18,684.0,682.431,678.0,344200,690.0,673.0
241,2015/08/19,660.0,664.385,680.0,170600,680.0,646.0
242,2015/08/20,659.0,664.885,653.0,115200,674.0,653.0
243,2015/08/21,628.0,642.471,650.0,212300,667.0,625.0
244,2015/08/24,571.0,595.723,605.0,196600,623.0,571.0
245,2015/08/25,559.0,571.624,551.0,246700,610.0,543.0
246,2015/08/26,568.0,569.114,560.0,188300,581.0,559.0
247,2015/08/27,596.0,596.318,593.0,149000,607.0,581.0
248,2015/08/28,617.0,609.532,606.0,181900,620.0,599.0
249,2015/08/31,635.0,629.461,620.0,162200,638.0,612.0
250,2015/09/01,616.0,627.684,634.0,116400,642.0,615.0
251,2015/09/02,599.0,606.668,594.0,216900,620.0,592.0
252,2015/09/03,614.0,620.176,609.0,94200,629.0,609.0
253,2015/09/04,590.0,595.225,617.0,164300,617.0,580.0
254,2015/09/07,569.0,571.664,573.0,205600,585.0,557.0
255,2015/09/08,539.0,552.552,566.0,140100,573.0,538.0
256,2015/09/09,574.0,565.122,557.0,123500,574.0,557.0
257,2015/09/10,583.0,571.131,562.0,115600,586.0,556.0
258,2015/09/11,598.0,595.418,588.0,165700,608.0,585.0
259,2015/09/14,578.0,585.824,607.0,133700,607.0,576.0
260,2015/09/15,578.0,579.191,584.0,81200,586.0,572.0
261,2015/09/16,587.0,579.415,585.0,98100,588.0,572.0
262,2015/09/17,599.0,593.043,587.0,74600,600.0,586.0
263,2015/09/18,598.0,600.344,600.0,119400,609.0,590.0
264,2015/09/24,590.0,594.54,590.0,100000,604.0,587.0
265,2015/09/25,615.0,604.036,596.0,113800,615.0,591.0
266,2015/09/28,623.0,617.111,621.0,132600,628.0,606.0
267,2015/09/29,578.0,582.646,600.0,197900,604.0,570.0
268,2015/09/30,608.0,600.162,600.0,99200,609.0,587.0
269,2015/10/01,615.0,612.807,617.0,63100,620.0,604.0
270,2015/10/02,611.0,603.121,607.0,83700,615.0,592.0
271,2015/10/05,625.0,619.691,616.0,60200,627.0,607.0
272,2015/10/06,624.0,624.261,630.0,58700,635.0,618.0
273,2015/10/07,618.0,609.99,625.0,98600,625.0,597.0
274,2015/10/08,613.0,611.516,610.0,45900,619.0,609.0
275,2015/10/09,632.0,620.827,617.0,90900,632.0,604.0
276,2015/10/13,616.0,618.599,626.0,94400,627.0,613.0
277,2015/10/14,595.0,599.981,608.0,121500,610.0,594.0
278,2015/10/15,602.0,601.604,592.0,80600,607.0,592.0
279,2015/10/16,594.0,596.242,609.0,113400,609.0,591.0
280,2015/10/19,583.0,582.968,589.0,115600,591.0,574.0
281,2015/10/20,566.0,570.923,584.0,120500,586.0,560.0
282,2015/10/21,583.0,576.305,561.0,159200,588.0,557.0
283,2015/10/22,565.0,563.639,582.0,217300,582.0,553.0
284,2015/10/23,574.0,574.897,578.0,69000,579.0,571.0
285,2015/10/26,571.0,570.31,578.0,100900,578.0,565.0
286,2015/10/27,564.0,568.428,576.0,46500,576.0,563.0
287,2015/10/28,559.0,561.15,565.0,58100,566.0,556.0
288,2015/10/29,557.0,556.653,560.0,93900,563.0,551.0
289,2015/10/30,577.0,571.1,563.0,100300,579.0,560.0
290,2015/11/02,555.0,562.044,572.0,97600,572.0,555.0
291,2015/11/04,543.0,549.05,564.0,117000,566.0,540.0
292,2015/11/05,541.0,544.492,547.0,71600,550.0,540.0
293,2015/11/06,548.0,546.314,541.0,74900,552.0,541.0
294,2015/11/09,565.0,561.679,555.0,101200,566.0,551.0
295,2015/11/10,555.0,556.404,555.0,66300,561.0,551.0
296,2015/11/11,645.0,636.12,565.0,1390200,655.0,562.0
297,2015/11/12,631.0,640.951,644.0,825600,664.0,624.0
298,2015/11/13,650.0,651.707,624.0,456400,669.0,621.0
299,2015/11/16,633.0,639.62,640.0,224100,651.0,632.0
300,2015/11/17,637.0,637.835,638.0,232900,649.0,632.0
301,2015/11/18,616.0,627.018,643.0,236500,646.0,612.0
302,2015/11/19,622.0,627.084,625.0,221300,638.0,618.0
303,2015/11/20,623.0,620.055,623.0,100100,625.0,616.0
304,2015/11/24,650.0,642.752,626.0,275500,652.0,626.0
305,2015/11/25,650.0,649.528,650.0,208600,660.0,638.0
306,2015/11/26,678.0,683.936,690.0,303400,697.0,673.0
307,2015/11/27,685.0,680.642,678.0,142300,688.0,674.0
308,2015/11/30,707.0,701.8,694.0,284000,708.0,692.0
309,2015/12/01,727.0,716.581,710.0,324000,728.0,705.0
310,2015/12/02,715.0,720.017,729.0,213400,729.0,713.0
311,2015/12/03,722.0,717.478,715.0,169100,724.0,710.0
312,2015/12/04,704.0,706.076,714.0,176600,714.0,700.0
313,2015/12/07,733.0,735.362,716.0,331100,745.0,716.0
314,2015/12/08,716.0,725.436,740.0,168500,740.0,714.0
315,2015/12/09,703.0,702.708,711.0,146000,718.0,694.0
316,2015/12/10,695.0,692.991,690.0,99900,699.0,680.0
317,2015/12/11,699.0,693.322,687.0,105900,706.0,687.0
318,2015/12/14,697.0,690.429,676.0,138700,701.0,676.0
319,2015/12/15,680.0,688.012,701.0,117100,707.0,680.0
320,2015/12/16,687.0,686.595,690.0,92200,693.0,682.0
321,2015/12/17,704.0,704.411,707.0,204800,717.0,696.0
322,2015/12/18,678.0,687.242,701.0,198000,701.0,677.0
323,2015/12/21,666.0,656.11,679.0,313500,682.0,639.0
324,2015/12/22,654.0,656.464,664.0,149700,670.0,648.0
325,2015/12/24,647.0,651.479,661.0,60800,663.0,647.0
326,2015/12/25,652.0,647.997,649.0,111200,652.0,641.0
327,2015/12/28,658.0,654.024,664.0,50300,664.0,648.0
328,2015/12/29,659.0,652.753,652.0,69700,661.0,644.0
329,2015/12/30,661.0,660.025,662.0,47300,665.0,655.0
330,2016/01/04,628.0,635.197,649.0,153500,651.0,626.0
331,2016/01/05,620.0,622.145,622.0,167200,630.0,615.0
332,2016/01/06,621.0,618.609,619.0,118800,628.0,611.0
333,2016/01/07,609.0,617.146,621.0,96800,633.0,609.0
334,2016/01/08,600.0,603.584,601.0,111500,619.0,594.0
335,2016/01/12,572.0,583.178,595.0,137300,601.0,571.0
336,2016/01/13,597.0,591.693,578.0,124900,601.0,578.0
337,2016/01/14,588.0,578.911,579.0,238200,591.0,567.0
338,2016/01/15,570.0,579.815,600.0,89800,601.0,567.0
339,2016/01/18,554.0,552.973,551.0,120500,561.0,545.0
340,2016/01/19,550.0,548.857,553.0,120000,555.0,543.0
341,2016/01/20,533.0,543.58,560.0,150900,561.0,530.0
342,2016/01/21,502.0,524.873,533.0,113900,544.0,502.0
343,2016/01/22,545.0,526.89,515.0,120200,546.0,510.0
344,2016/01/25,547.0,546.76,555.0,129400,557.0,535.0
345,2016/01/26,536.0,542.016,547.0,67000,547.0,536.0
346,2016/01/27,552.0,549.201,544.0,97900,554.0,543.0
347,2016/01/28,558.0,551.357,546.0,71900,560.0,539.0
348,2016/01/29,577.0,564.518,559.0,157200,583.0,545.0
349,2016/02/01,591.0,592.211,596.0,123000,599.0,586.0
350,2016/02/02,584.0,583.447,592.0,164700,592.0,577.0
351,2016/02/03,555.0,557.845,566.0,124100,567.0,549.0
352,2016/02/04,551.0,550.804,555.0,91000,559.0,546.0
353,2016/02/05,530.0,533.031,545.0,104400,546.0,524.0
354,2016/02/08,543.0,534.846,518.0,69500,550.0,518.0
355,2016/02/09,511.0,514.403,517.0,117000,522.0,505.0
356,2016/02/10,476.0,491.946,513.0,176800,522.0,450.0
357,2016/02/12,459.0,471.674,460.0,265600,489.0,457.0
358,2016/02/15,497.0,484.731,485.0,212700,501.0,470.0
359,2016/02/16,505.0,509.765,493.0,95000,523.0,490.0
360,2016/02/17,512.0,509.785,512.0,117400,525.0,498.0
361,2016/02/18,528.0,525.651,528.0,94900,534.0,516.0
362,2016/02/19,519.0,520.836,520.0,139400,529.0,515.0
363,2016/02/22,520.0,519.917,516.0,62800,527.0,510.0
364,2016/02/23,498.0,509.744,521.0,89700,522.0,496.0
365,2016/02/24,504.0,505.667,493.0,87800,517.0,487.0
366,2016/02/25,524.0,526.138,506.0,79100,534.0,506.0
367,2016/02/26,517.0,519.785,526.0,74000,537.0,512.0
368,2016/02/29,504.0,509.843,520.0,86600,520.0,501.0
369,2016/03/01,498.0,500.698,500.0,69900,509.0,495.0
370,2016/03/02,511.0,514.057,514.0,104500,519.0,508.0
371,2016/03/03,524.0,517.724,510.0,56800,525.0,508.0
372,2016/03/04,526.0,529.111,528.0,92600,536.0,520.0
373,2016/03/07,530.0,527.617,527.0,90700,532.0,522.0
374,2016/03/08,518.0,518.161,529.0,90500,529.0,507.0
375,2016/03/09,506.0,506.379,512.0,51400,516.0,502.0
376,2016/03/10,513.0,511.698,512.0,57600,518.0,503.0
377,2016/03/11,521.0,511.367,503.0,119200,522.0,502.0
378,2016/03/14,537.0,534.703,531.0,88200,538.0,527.0
379,2016/03/15,531.0,537.848,540.0,129900,547.0,529.0
380,2016/03/16,527.0,529.214,529.0,84700,537.0,526.0
381,2016/03/17,549.0,545.643,532.0,142300,553.0,532.0
382,2016/03/18,549.0,547.625,555.0,78600,555.0,541.0
383,2016/03/22,563.0,554.385,559.0,100200,564.0,541.0
384,2016/03/23,564.0,561.705,564.0,78700,566.0,558.0
385,2016/03/24,566.0,562.382,560.0,103000,570.0,549.0
386,2016/03/25,560.0,559.521,568.0,65100,568.0,551.0
387,2016/03/28,558.0,554.723,560.0,67100,562.0,550.0
388,2016/03/29,557.0,554.326,549.0,40800,560.0,549.0
389,2016/03/30,532.0,538.146,554.0,113400,554.0,530.0
390,2016/03/31,531.0,533.216,535.0,85200,541.0,530.0
391,2016/04/01,509.0,516.289,530.0,115100,532.0,509.0
392,2016/04/04,510.0,510.339,509.0,96000,519.0,503.0
393,2016/04/05,496.0,497.887,510.0,137100,511.0,490.0
394,2016/04/06,491.0,490.705,489.0,69200,495.0,487.0
395,2016/04/07,490.0,493.263,491.0,81800,504.0,486.0
396,2016/04/08,500.0,494.617,485.0,79400,509.0,479.0
397,2016/04/11,497.0,490.956,503.0,58500,504.0,481.0
398,2016/04/12,504.0,499.054,496.0,100500,509.0,493.0
399,2016/04/13,516.0,517.139,510.0,97100,523.0,510.0
400,2016/04/14,530.0,526.114,526.0,113600,532.0,519.0
401,2016/04/15,526.0,526.689,521.0,51500,530.0,519.0
402,2016/04/18,530.0,525.541,522.0,91700,533.0,513.0
403,2016/04/19,527.0,530.498,534.0,81900,539.0,525.0
404,2016/04/20,522.0,524.855,527.0,77000,532.0,520.0
405,2016/04/21,525.0,526.649,532.0,124500,537.0,518.0
406,2016/04/22,547.0,530.036,518.0,135400,549.0,517.0
407,2016/04/25,547.0,545.723,551.0,105100,554.0,541.0
408,2016/04/26,536.0,533.073,544.0,87500,544.0,522.0
409,2016/04/27,530.0,524.871,537.0,157500,537.0,515.0
410,2016/04/28,510.0,513.714,535.0,186000,538.0,503.0
411,2016/05/02,503.0,497.402,488.0,85500,504.0,488.0
412,2016/05/06,496.0,497.664,501.0,60700,508.0,492.0
413,2016/05/09,498.0,500.998,499.0,50500,510.0,496.0
414,2016/05/10,510.0,506.759,500.0,86000,512.0,498.0
415,2016/05/11,501.0,504.507,510.0,170300,515.0,500.0
416,2016/05/12,497.0,491.431,495.0,167600,498.0,485.0
417,2016/05/13,488.0,487.532,493.0,96100,493.0,482.0
418,2016/05/16,499.0,499.216,486.0,191300,506.0,486.0
419,2016/05/17,556.0,538.704,506.0,274300,558.0,506.0
420,2016/05/18,578.0,572.162,551.0,355200,587.0,549.0
421,2016/05/19,612.0,600.026,584.0,319100,613.0,583.0
422,2016/05/20,606.0,604.75,605.0,209900,609.0,598.0
423,2016/05/23,619.0,616.962,606.0,191900,629.0,606.0
424,2016/05/24,643.0,634.399,617.0,193100,647.0,616.0
425,2016/05/25,666.0,663.816,643.0,232400,681.0,643.0
426,2016/05/26,669.0,675.957,670.0,222100,690.0,661.0
427,2016/05/27,670.0,670.604,679.0,132300,679.0,663.0
428,2016/05/30,673.0,669.584,670.0,76500,676.0,664.0
429,2016/05/31,685.0,681.858,675.0,83000,688.0,671.0
430,2016/06/01,690.0,687.772,676.0,118200,695.0,672.0
431,2016/06/02,665.0,671.113,683.0,88700,688.0,661.0
432,2016/06/03,654.0,659.467,660.0,182400,671.0,650.0
433,2016/06/06,671.0,663.677,642.0,152500,675.0,639.0
434,2016/06/07,673.0,676.091,675.0,59300,684.0,672.0
435,2016/06/08,664.0,664.659,673.0,114400,678.0,655.0
436,2016/06/09,667.0,665.802,660.0,35400,671.0,659.0
437,2016/06/10,659.0,661.937,665.0,102900,668.0,656.0
438,2016/06/13,632.0,641.024,642.0,103000,654.0,632.0
439,2016/06/14,616.0,621.364,626.0,87400,638.0,615.0
440,2016/06/15,620.0,620.62,611.0,81000,629.0,610.0
441,2016/06/16,593.0,603.111,618.0,84700,623.0,593.0
442,2016/06/17,603.0,601.781,593.0,125400,611.0,593.0
443,2016/06/20,614.0,615.956,610.0,45100,622.0,610.0
444,2016/06/21,625.0,619.477,614.0,52800,628.0,606.0
445,2016/06/22,610.0,610.384,625.0,66900,625.0,605.0
446,2016/06/23,615.0,620.467,608.0,211600,640.0,597.0
447,2016/06/24,569.0,588.635,627.0,158500,639.0,550.0
448,2016/06/27,654.0,634.404,609.0,274300,659.0,602.0
449,2016/06/28,666.0,661.835,664.0,272000,679.0,642.0
450,2016/06/29,698.0,691.492,680.0,265900,704.0,672.0
451,2016/06/30,668.0,686.688,715.0,254000,716.0,662.0
452,2016/07/01,697.0,686.647,673.0,154700,698.0,667.0
453,2016/07/04,667.0,674.027,695.0,159900,695.0,664.0
454,2016/07/05,735.0,712.393,668.0,517700,736.0,665.0
455,2016/07/06,774.0,748.508,732.0,400600,775.0,720.0
456,2016/07/07,770.0,772.225,781.0,316600,794.0,754.0
457,2016/07/08,764.0,766.281,760.0,160300,779.0,752.0
458,2016/07/11,783.0,782.038,778.0,157600,789.0,769.0
459,2016/07/12,805.0,802.801,798.0,257700,810.0,791.0
460,2016/07/13,801.0,797.407,806.0,194400,819.0,760.0
461,2016/07/14,831.0,824.815,795.0,184000,844.0,795.0
462,2016/07/15,817.0,822.989,835.0,161900,843.0,807.0
463,2016/07/19,864.0,851.082,826.0,285500,865.0,818.0
464,2016/07/20,865.0,855.982,855.0,182600,868.0,838.0
465,2016/07/21,879.0,874.823,875.0,197100,884.0,862.0
466,2016/07/22,885.0,878.977,878.0,203200,890.0,865.0
467,2016/07/25,894.0,894.954,890.0,288200,908.0,880.0
468,2016/07/26,874.0,878.166,879.0,223500,894.0,866.0
469,2016/07/27,880.0,877.474,882.0,173400,891.0,866.0
470,2016/07/28,911.0,897.982,889.0,272700,915.0,874.0
471,2016/07/29,921.0,911.743,909.0,203200,928.0,891.0
472,2016/08/01,890.0,898.501,930.0,144600,930.0,882.0
473,2016/08/02,871.0,876.089,882.0,146900,889.0,865.0
474,2016/08/03,849.0,855.814,860.0,128800,870.0,846.0
475,2016/08/04,848.0,846.466,849.0,126000,866.0,835.0
476,2016/08/05,811.0,822.494,848.0,225800,853.0,806.0
477,2016/08/08,863.0,840.347,807.0,447000,876.0,800.0
478,2016/08/09,808.0,823.297,865.0,351200,866.0,801.0
479,2016/08/10,813.0,805.947,800.0,269800,821.0,793.0
480,2016/08/12,825.0,828.957,821.0,141600,843.0,820.0
481,2016/08/15,806.0,811.229,818.0,67700,820.0,805.0
482,2016/08/16,788.0,794.432,808.0,98600,812.0,787.0
483,2016/08/17,777.0,772.816,775.0,181800,793.0,761.0
484,2016/08/18,771.0,776.569,772.0,97800,789.0,767.0
485,2016/08/19,764.0,765.321,776.0,81900,784.0,758.0
486,2016/08/22,819.0,802.304,760.0,237700,824.0,760.0
487,2016/08/23,807.0,816.432,821.0,245200,832.0,800.0
488,2016/08/24,816.0,815.56,828.0,89000,828.0,803.0
489,2016/08/25,792.0,795.54,801.0,103100,808.0,786.0
490,2016/08/26,791.0,791.691,793.0,103300,801.0,785.0
491,2016/08/29,790.0,788.621,786.0,60400,801.0,783.0
492,2016/08/30,787.0,777.725,782.0,158300,791.0,766.0
493,2016/08/31,807.0,805.939,802.0,168800,823.0,797.0
494,2016/09/01,834.0,833.962,820.0,347300,862.0,816.0
495,2016/09/02,845.0,839.74,830.0,206600,851.0,827.0
496,2016/09/05,834.0,842.1,859.0,123500,859.0,832.0
497,2016/09/06,895.0,871.912,834.0,329900,900.0,832.0
498,2016/09/07,907.0,907.285,890.0,387100,928.0,883.0
499,2016/09/08,898.0,899.099,904.0,165400,909.0,886.0
500,2016/09/09,864.0,879.042,902.0,168600,902.0,863.0
501,2016/09/12,875.0,866.149,855.0,118000,878.0,848.0
502,2016/09/13,883.0,889.061,886.0,167000,905.0,879.0
503,2016/09/14,868.0,869.794,875.0,126400,881.0,863.0
504,2016/09/15,862.0,864.883,862.0,107200,880.0,859.0
505,2016/09/16,873.0,871.051,871.0,542300,876.0,855.0
506,2016/09/20,880.0,879.991,856.0,143100,897.0,856.0
507,2016/09/21,897.0,886.797,881.0,125200,898.0,873.0
508,2016/09/23,897.0,899.56,900.0,168800,913.0,892.0
509,2016/09/26,911.0,909.183,897.0,150100,920.0,889.0
510,2016/09/27,921.0,915.292,907.0,159700,922.0,894.0
511,2016/09/28,929.0,927.436,927.0,158700,940.0,910.0
512,2016/09/29,918.0,922.295,932.0,111900,938.0,914.0
513,2016/09/30,914.0,917.113,915.0,72800,925.0,910.0
514,2016/10/03,921.0,919.475,922.0,116400,928.0,914.0
515,2016/10/04,920.0,918.063,923.0,100200,923.0,913.0
516,2016/10/05,916.0,918.534,929.0,108900,938.0,912.0
517,2016/10/06,927.0,924.526,921.0,74100,928.0,918.0
518,2016/10/07,921.0,921.098,930.0,85000,934.0,914.0
519,2016/10/11,927.0,926.037,921.0,57500,934.0,919.0
520,2016/10/12,913.0,916.42,917.0,112200,923.0,911.0
521,2016/10/13,937.0,931.076,915.0,135100,940.0,915.0
522,2016/10/14,955.0,949.357,937.0,159800,960.0,935.0
523,2016/10/17,957.0,958.716,959.0,132000,972.0,948.0
524,2016/10/18,952.0,950.985,959.0,108900,963.0,945.0
525,2016/10/19,980.0,976.148,960.0,177500,987.0,959.0
526,2016/10/20,994.0,995.055,985.0,154900,1005.0,981.0
527,2016/10/21,971.0,978.878,1000.0,140600,1001.0,967.0
528,2016/10/24,976.0,974.956,971.0,83200,986.0,961.0
529,2016/10/25,991.0,987.707,979.0,115000,998.0,972.0
530,2016/10/26,995.0,993.451,994.0,120900,1005.0,985.0
531,2016/10/27,1026.0,1020.887,1002.0,158700,1029.0,997.0
532,2016/10/28,1033.0,1031.248,1036.0,172700,1040.0,1015.0
533,2016/10/31,1014.0,1016.525,1030.0,145400,1033.0,1007.0
534,2016/11/01,1010.0,1007.447,1022.0,98400,1022.0,993.0
535,2016/11/02,997.0,996.418,1000.0,210100,1013.0,984.0
536,2016/11/04,981.0,974.688,976.0,151500,985.0,963.0
537,2016/11/07,1007.0,999.063,996.0,89400,1008.0,985.0
538,2016/11/08,1005.0,1002.619,1013.0,78700,1017.0,988.0
539,2016/11/09,936.0,954.324,1005.0,199200,1008.0,907.0
540,2016/11/10,982.0,986.526,996.0,157500,1005.0,963.0
541,2016/11/11,992.0,990.797,996.0,121800,1005.0,982.0
542,2016/11/14,1019.0,1011.65,982.0,120700,1025.0,982.0
543,2016/11/15,954.0,967.264,1024.0,251500,1024.0,945.0
544,2016/11/16,943.0,946.336,960.0,300700,974.0,939.0
545,2016/11/17,933.0,930.746,939.0,220000,945.0,913.0
546,2016/11/18,947.0,946.171,944.0,117600,954.0,936.0
547,2016/11/21,919.0,927.29,952.0,199200,952.0,915.0
548,2016/11/22,915.0,917.631,922.0,157400,928.0,913.0
549,2016/11/24,916.0,922.416,923.0,123700,932.0,915.0
550,2016/11/25,966.0,957.168,924.0,222300,969.0,924.0
551,2016/11/28,1021.0,1005.166,972.0,323000,1021.0,969.0
552,2016/11/29,970.0,978.266,1030.0,399900,1037.0,964.0
553,2016/11/30,967.0,968.84,967.0,818900,981.0,955.0
554,2016/12/01,995.0,985.671,973.0,343700,1003.0,957.0
555,2016/12/02,959.0,964.09,987.0,277500,990.0,952.0
556,2016/12/05,940.0,941.753,952.0,131200,959.0,935.0
557,2016/12/06,936.0,936.083,946.0,160700,950.0,927.0
558,2016/12/07,948.0,939.763,933.0,183600,959.0,924.0
559,2016/12/08,954.0,951.378,958.0,131400,958.0,943.0
560,2016/12/09,944.0,937.267,946.0,225800,950.0,928.0
561,2016/12/12,936.0,932.817,942.0,124400,944.0,922.0
562,2016/12/13,952.0,944.207,936.0,115000,952.0,930.0
563,2016/12/14,943.0,943.322,952.0,139100,956.0,931.0
564,2016/12/15,948.0,941.511,948.0,151600,949.0,930.0
565,2016/12/16,948.0,957.187,954.0,178300,970.0,946.0
566,2016/12/19,943.0,942.324,951.0,116500,956.0,937.0
567,2016/12/20,961.0,954.538,942.0,112900,963.0,939.0
568,2016/12/21,939.0,941.119,961.0,139500,961.0,934.0
569,2016/12/22,946.0,945.34,940.0,102000,953.0,938.0
570,2016/12/26,943.0,943.998,951.0,54500,951.0,940.0
571,2016/12/27,941.0,940.705,945.0,108300,953.0,933.0
572,2016/12/28,948.0,946.694,939.0,97500,954.0,937.0
573,2016/12/29,951.0,947.706,946.0,120600,953.0,939.0
574,2016/12/30,942.0,938.926,947.0,116000,947.0,932.0
575,2017/01/04,1003.0,982.94,948.0,341400,1003.0,946.0
576,2017/01/05,993.0,991.768,997.0,126900,999.0,983.0
577,2017/01/06,963.0,963.87,982.0,210700,982.0,957.0
578,2017/01/10,948.0,955.467,962.0,187200,977.0,942.0
579,2017/01/11,947.0,950.892,946.0,71000,960.0,943.0
580,2017/01/12,913.0,920.86,943.0,303000,943.0,913.0
581,2017/01/13,929.0,921.06,913.0,155400,933.0,895.0
582,2017/01/16,932.0,929.041,923.0,100900,942.0,918.0
583,2017/01/17,916.0,919.817,922.0,119400,930.0,913.0
584,2017/01/18,909.0,907.236,901.0,136200,915.0,901.0
585,2017/01/19,912.0,917.077,910.0,147200,934.0,910.0
586,2017/01/20,904.0,902.117,905.0,242800,911.0,894.0
587,2017/01/23,890.0,892.32,903.0,161800,907.0,885.0
588,2017/01/24,885.0,883.596,885.0,106300,889.0,880.0
589,2017/01/25,889.0,891.944,890.0,120300,928.0,883.0
590,2017/01/26,896.0,894.023,904.0,85600,907.0,887.0
591,2017/01/27,893.0,894.954,902.0,89800,902.0,891.0
592,2017/01/30,896.0,888.292,893.0,123300,896.0,878.0
593,2017/01/31,871.0,873.872,880.0,244100,890.0,863.0
594,2017/02/01,886.0,875.888,866.0,127600,887.0,861.0
595,2017/02/02,857.0,866.961,887.0,109800,887.0,857.0
596,2017/02/03,863.0,864.408,858.0,121700,873.0,857.0
597,2017/02/06,861.0,860.046,870.0,91800,881.0,853.0
598,2017/02/07,899.0,885.016,861.0,239800,900.0,860.0
599,2017/02/08,898.0,896.949,910.0,347800,922.0,873.0
600,2017/02/09,854.0,864.212,899.0,408900,906.0,849.0
601,2017/02/10,879.0,874.279,866.0,227500,883.0,859.0
602,2017/02/13,877.0,880.461,886.0,204600,893.0,870.0
603,2017/02/14,880.0,887.5,882.0,173300,900.0,877.0
604,2017/02/15,916.0,905.087,885.0,243600,917.0,885.0
605,2017/02/16,903.0,904.882,917.0,91500,918.0,896.0
606,2017/02/17,900.0,897.364,900.0,65600,906.0,884.0
607,2017/02/20,929.0,919.975,901.0,156300,930.0,892.0
608,2017/02/21,932.0,928.852,929.0,72400,935.0,920.0
609,2017/02/22,951.0,939.061,932.0,182100,952.0,922.0
610,2017/02/23,950.0,945.909,951.0,112500,956.0,934.0
611,2017/02/24,942.0,936.504,941.0,131200,944.0,927.0
612,2017/02/27,940.0,933.953,936.0,94700,942.0,921.0
613,2017/02/28,953.0,956.488,951.0,221800,965.0,942.0
614,2017/03/01,947.0,943.738,954.0,196900,957.0,932.0
615,2017/03/02,946.0,954.008,960.0,174100,976.0,942.0
616,2017/03/03,951.0,948.633,949.0,73900,955.0,942.0
617,2017/03/06,951.0,951.23,950.0,69700,958.0,946.0
618,2017/03/07,948.0,946.986,951.0,78300,955.0,936.0
619,2017/03/08,955.0,952.258,944.0,75100,959.0,943.0
620,2017/03/09,964.0,963.928,957.0,180200,976.0,953.0
621,2017/03/10,967.0,966.776,976.0,139100,976.0,960.0
622,2017/03/13,955.0,958.284,971.0,120600,971.0,955.0
623,2017/03/14,963.0,962.161,952.0,81600,970.0,952.0
624,2017/03/15,953.0,952.308,954.0,53300,955.0,948.0
625,2017/03/16,954.0,952.494,950.0,130100,960.0,948.0
626,2017/03/17,954.0,950.551,951.0,69000,956.0,943.0
627,2017/03/21,957.0,954.014,950.0,59300,959.0,947.0
628,2017/03/22,935.0,941.871,944.0,134200,953.0,935.0
629,2017/03/23,937.0,933.466,930.0,63700,939.0,926.0
630,2017/03/24,962.0,956.318,935.0,131300,964.0,935.0
631,2017/03/27,959.0,955.891,948.0,105900,962.0,947.0
632,2017/03/28,958.0,956.97,963.0,95300,964.0,951.0
633,2017/03/29,959.0,953.588,957.0,101700,964.0,944.0
634,2017/03/30,918.0,933.774,953.0,147000,958.0,918.0
635,2017/03/31,894.0,911.668,923.0,180300,933.0,894.0
636,2017/04/03,896.0,895.757,890.0,114900,905.0,885.0
637,2017/04/04,878.0,886.631,892.0,131200,901.0,876.0
638,2017/04/05,872.0,878.248,889.0,127700,893.0,870.0
639,2017/04/06,855.0,860.298,873.0,116300,879.0,852.0
640,2017/04/07,859.0,860.22,860.0,155200,871.0,848.0
641,2017/04/10,876.0,872.782,874.0,99300,877.0,866.0
642,2017/04/11,871.0,872.009,881.0,121000,885.0,866.0
643,2017/04/12,853.0,850.295,872.0,126800,872.0,842.0
644,2017/04/13,848.0,844.685,843.0,89200,851.0,837.0
645,2017/04/14,831.0,834.043,843.0,71600,844.0,828.0
646,2017/04/17,837.0,833.465,827.0,81000,838.0,827.0
647,2017/04/18,843.0,845.436,852.0,69300,856.0,839.0
648,2017/04/19,848.0,846.864,841.0,63800,852.0,836.0
649,2017/04/20,845.0,843.448,848.0,172700,850.0,837.0
650,2017/04/21,860.0,857.624,845.0,86700,864.0,845.0
651,2017/04/24,867.0,867.853,871.0,89100,876.0,862.0
652,2017/04/25,865.0,864.685,866.0,76800,870.0,861.0
653,2017/04/26,873.0,869.714,866.0,140100,879.0,845.0
654,2017/04/27,870.0,875.264,880.0,118900,883.0,868.0
655,2017/04/28,876.0,872.67,877.0,153600,879.0,867.0
656,2017/05/01,896.0,889.616,880.0,97500,897.0,880.0
657,2017/05/02,901.0,903.737,899.0,103500,912.0,897.0
658,2017/05/08,936.0,929.343,918.0,218400,939.0,915.0
659,2017/05/09,935.0,933.098,935.0,111900,941.0,922.0
660,2017/05/10,931.0,931.894,935.0,73600,936.0,926.0
661,2017/05/11,932.0,929.493,930.0,141600,935.0,923.0
662,2017/05/12,970.0,952.709,932.0,331600,978.0,924.0
663,2017/05/15,973.0,971.575,961.0,203800,982.0,956.0
664,2017/05/16,999.0,990.746,982.0,231900,1002.0,976.0
665,2017/05/17,1006.0,999.795,993.0,231600,1012.0,985.0
666,2017/05/18,1029.0,1016.715,982.0,270800,1032.0,978.0
667,2017/05/19,1027.0,1025.664,1030.0,144100,1032.0,1017.0
668,2017/05/22,1055.0,1046.635,1026.0,294400,1058.0,1018.0
669,2017/05/23,1053.0,1055.236,1059.0,201000,1064.0,1049.0
670,2017/05/24,1072.0,1061.907,1050.0,274700,1076.0,1047.0
671,2017/05/25,1057.0,1063.462,1064.0,119000,1074.0,1057.0
672,2017/05/26,1041.0,1046.738,1054.0,107500,1057.0,1040.0
673,2017/05/29,1032.0,1038.313,1035.0,64200,1048.0,1032.0
674,2017/05/30,1032.0,1030.614,1021.0,61900,1050.0,1020.0
675,2017/05/31,1031.0,1028.497,1022.0,67400,1033.0,1022.0
676,2017/06/01,1042.0,1040.457,1031.0,79000,1047.0,1031.0
677,2017/06/02,1033.0,1039.357,1043.0,152600,1049.0,1031.0
678,2017/06/05,1025.0,1024.736,1024.0,151200,1031.0,1011.0
679,2017/06/06,1015.0,1019.135,1025.0,99200,1028.0,1012.0
680,2017/06/07,1002.0,1006.225,1010.0,87000,1016.0,1000.0
681,2017/06/08,990.0,996.881,1007.0,99900,1009.0,989.0
682,2017/06/09,968.0,977.855,985.0,161000,992.0,968.0
683,2017/06/12,979.0,972.367,961.0,97600,982.0,960.0
684,2017/06/13,984.0,986.498,979.0,66300,992.0,978.0
685,2017/06/14,969.0,974.503,984.0,59100,985.0,969.0
686,2017/06/15,969.0,966.467,958.0,127100,974.0,949.0
687,2017/06/16,975.0,970.614,978.0,121400,978.0,960.0
688,2017/06/19,971.0,975.565,976.0,51500,983.0,970.0
689,2017/06/20,982.0,979.579,972.0,74600,985.0,968.0
690,2017/06/21,976.0,982.621,985.0,81200,991.0,976.0
691,2017/06/22,968.0,971.511,979.0,69300,979.0,968.0
692,2017/06/23,957.0,959.555,966.0,77500,967.0,955.0
693,2017/06/26,946.0,949.053,957.0,92600,957.0,943.0
694,2017/06/27,943.0,942.402,957.0,87600,957.0,938.0
695,2017/06/28,929.0,931.439,943.0,126100,944.0,925.0
696,2017/06/29,939.0,933.751,931.0,80700,939.0,928.0
697,2017/06/30,913.0,915.475,930.0,136100,930.0,910.0
698,2017/07/03,918.0,917.23,915.0,102500,926.0,911.0
699,2017/07/04,910.0,910.936,922.0,99400,923.0,907.0
700,2017/07/05,916.0,907.753,906.0,189000,918.0,896.0
701,2017/07/06,940.0,932.107,910.0,126300,944.0,909.0
702,2017/07/07,932.0,931.547,935.0,106500,940.0,920.0
703,2017/07/10,945.0,942.732,939.0,106800,949.0,931.0
704,2017/07/11,956.0,952.108,946.0,76900,957.0,943.0
705,2017/07/12,944.0,944.022,956.0,104300,959.0,936.0
706,2017/07/13,933.0,937.511,946.0,63200,952.0,929.0
707,2017/07/14,940.0,935.405,933.0,82800,941.0,925.0
708,2017/07/18,940.0,935.545,940.0,88600,946.0,925.0
709,2017/07/19,934.0,934.497,931.0,58300,940.0,930.0
710,2017/07/20,935.0,936.552,934.0,45300,943.0,932.0
711,2017/07/21,928.0,926.38,934.0,53200,934.0,921.0
712,2017/07/24,936.0,927.36,922.0,80200,937.0,918.0
713,2017/07/25,939.0,936.968,943.0,83400,946.0,929.0
714,2017/07/26,922.0,923.654,942.0,104600,942.0,916.0
715,2017/07/27,913.0,916.554,923.0,92300,932.0,907.0
716,2017/07/28,908.0,903.511,911.0,123500,911.0,900.0
717,2017/07/31,899.0,896.066,903.0,86600,906.0,891.0
718,2017/08/01,908.0,904.051,898.0,46800,908.0,898.0
719,2017/08/02,920.0,913.845,915.0,131600,922.0,899.0
720,2017/08/03,890.0,893.243,916.0,207700,916.0,888.0
721,2017/08/04,918.0,910.094,895.0,142600,918.0,894.0
722,2017/08/07,948.0,935.905,922.0,140300,951.0,922.0
723,2017/08/08,941.0,945.538,950.0,78700,956.0,938.0
724,2017/08/09,910.0,910.944,928.0,117400,933.0,900.0
725,2017/08/10,857.0,863.599,887.0,237100,902.0,840.0
726,2017/08/14,831.0,835.353,856.0,144300,856.0,828.0
727,2017/08/15,836.0,836.33,831.0,140500,843.0,829.0
728,2017/08/16,833.0,824.66,834.0,182500,840.0,815.0
729,2017/08/17,834.0,834.966,840.0,102100,842.0,828.0
730,2017/08/18,831.0,826.026,827.0,80100,832.0,819.0
731,2017/08/21,847.0,840.615,834.0,108600,847.0,832.0
732,2017/08/22,845.0,845.126,854.0,110600,854.0,836.0
733,2017/08/23,834.0,834.849,847.0,99200,847.0,829.0
734,2017/08/24,816.0,821.48,829.0,139700,830.0,816.0
735,2017/08/25,833.0,826.648,823.0,67800,833.0,816.0
736,2017/08/28,828.0,826.602,833.0,100000,835.0,821.0
737,2017/08/29,824.0,824.294,822.0,85800,830.0,819.0
738,2017/08/30,815.0,817.763,824.0,129200,826.0,813.0
739,2017/08/31,805.0,810.721,820.0,253600,824.0,803.0
740,2017/09/01,811.0,810.651,806.0,197600,814.0,806.0
741,2017/09/04,812.0,812.719,812.0,107100,817.0,807.0
742,2017/09/05,799.0,805.579,812.0,157100,818.0,798.0
743,2017/09/06,780.0,770.497,784.0,294300,786.0,756.0
744,2017/09/07,824.0,816.133,794.0,278400,825.0,793.0
745,2017/09/08,831.0,825.223,821.0,240100,834.0,813.0
746,2017/09/11,794.0,800.689,836.0,304000,836.0,788.0
747,2017/09/12,820.0,816.27,802.0,182700,823.0,802.0
748,2017/09/13,827.0,823.537,822.0,111100,830.0,817.0
749,2017/09/14,823.0,827.731,826.0,112800,835.0,820.0
750,2017/09/15,837.0,832.795,821.0,175100,843.0,818.0
751,2017/09/19,846.0,849.082,851.0,122600,860.0,840.0
752,2017/09/20,848.0,844.809,842.0,122500,850.0,838.0
753,2017/09/21,867.0,862.401,850.0,173800,871.0,845.0
754,2017/09/22,861.0,863.939,870.0,137100,876.0,856.0
755,2017/09/25,879.0,880.157,876.0,145500,885.0,873.0
756,2017/09/26,870.0,871.779,880.0,105100,884.0,866.0
757,2017/09/27,873.0,866.836,876.0,103700,876.0,855.0
758,2017/09/28,866.0,863.85,875.0,104100,875.0,856.0
759,2017/09/29,868.0,864.883,866.0,75900,869.0,858.0
760,2017/10/02,875.0,873.411,872.0,82300,878.0,867.0
761,2017/10/03,879.0,878.341,878.0,124200,891.0,868.0
762,2017/10/04,888.0,887.856,884.0,145100,896.0,879.0
763,2017/10/05,913.0,909.474,889.0,240800,920.0,889.0
764,2017/10/06,910.0,909.683,918.0,88100,918.0,904.0
765,2017/10/10,909.0,909.289,911.0,122300,925.0,899.0
766,2017/10/11,898.0,900.607,910.0,144100,910.0,894.0
767,2017/10/12,902.0,904.565,900.0,94700,911.0,900.0
768,2017/10/13,907.0,908.106,904.0,103000,913.0,902.0
769,2017/10/16,909.0,908.216,907.0,70800,912.0,904.0
770,2017/10/17,907.0,902.208,902.0,74000,907.0,895.0
771,2017/10/18,929.0,924.862,907.0,219800,932.0,907.0
772,2017/10/19,940.0,947.523,935.0,234800,965.0,930.0
773,2017/10/20,932.0,931.376,930.0,140600,940.0,919.0
774,2017/10/23,926.0,927.153,940.0,172100,940.0,913.0
775,2017/10/24,934.0,930.285,927.0,65700,934.0,925.0
776,2017/10/25,945.0,948.665,939.0,152200,957.0,939.0
777,2017/10/26,954.0,950.528,946.0,68400,958.0,941.0
778,2017/10/27,969.0,969.249,959.0,172400,977.0,954.0
779,2017/10/30,985.0,984.329,971.0,220100,990.0,970.0
780,2017/10/31,1005.0,1003.516,993.0,187200,1018.0,991.0
781,2017/11/01,1007.0,1002.502,1010.0,170900,1015.0,995.0
782,2017/11/02,1011.0,1009.573,1012.0,97300,1016.0,997.0
783,2017/11/06,1022.0,1017.787,1015.0,136800,1025.0,1007.0
784,2017/11/07,1024.0,1014.214,1007.0,116900,1026.0,1002.0
785,2017/11/08,1016.0,1017.295,1020.0,177300,1028.0,1011.0
786,2017/11/09,1034.0,1037.029,1016.0,336800,1048.0,1011.0
787,2017/11/10,1059.0,1060.015,1025.0,271900,1081.0,1020.0
788,2017/11/13,961.0,987.261,1036.0,247200,1036.0,960.0
789,2017/11/14,908.0,926.596,958.0,394600,962.0,906.0
790,2017/11/15,875.0,880.981,906.0,337400,906.0,866.0
791,2017/11/16,885.0,872.555,873.0,283400,890.0,854.0
792,2017/11/17,880.0,880.523,885.0,190500,892.0,873.0
793,2017/11/20,893.0,887.077,880.0,200300,898.0,872.0
794,2017/11/21,913.0,913.599,899.0,163400,933.0,899.0
795,2017/11/22,923.0,917.185,913.0,144400,927.0,897.0
796,2017/11/24,920.0,918.476,925.0,68500,926.0,912.0
797,2017/11/27,907.0,904.687,920.0,105600,920.0,896.0
798,2017/11/28,909.0,908.77,905.0,89600,917.0,901.0
799,2017/11/29,927.0,921.763,917.0,115600,929.0,905.0
800,2017/11/30,938.0,933.662,924.0,159600,938.0,924.0
801,2017/12/01,938.0,941.091,938.0,152300,954.0,933.0
802,2017/12/04,922.0,926.675,938.0,166100,941.0,918.0
803,2017/12/05,921.0,920.462,919.0,152500,929.0,906.0
804,2017/12/06,955.0,938.847,911.0,464300,960.0,907.0
805,2017/12/07,966.0,964.854,955.0,233400,978.0,952.0
806,2017/12/08,976.0,966.213,951.0,184600,981.0,951.0
807,2017/12/11,982.0,978.547,982.0,168000,987.0,965.0
808,2017/12/12,962.0,962.864,980.0,131100,981.0,955.0
809,2017/12/13,932.0,941.11,962.0,149700,964.0,929.0
810,2017/12/14,975.0,964.998,946.0,254600,977.0,936.0
811,2017/12/15,990.0,989.372,988.0,306000,1001.0,970.0
812,2017/12/18,1003.0,1003.89,1003.0,173900,1015.0,990.0
813,2017/12/19,972.0,978.968,1001.0,105500,1003.0,970.0
814,2017/12/20,955.0,956.457,972.0,63000,972.0,950.0
815,2017/12/21,957.0,954.376,960.0,64300,961.0,945.0
816,2017/12/22,951.0,952.06,957.0,62000,961.0,947.0
817,2017/12/25,948.0,948.891,957.0,40500,960.0,944.0
818,2017/12/26,949.0,944.971,948.0,88000,957.0,935.0
819,2017/12/27,986.0,984.622,959.0,134900,994.0,958.0
820,2017/12/28,994.0,997.655,985.0,158700,1005.0,982.0
821,2017/12/29,988.0,986.824,994.0,76800,995.0,977.0
822,2018/01/04,988.0,985.513,990.0,161600,998.0,977.0
823,2018/01/05,1007.0,1000.487,992.0,175500,1010.0,986.0
824,2018/01/09,997.0,998.211,1012.0,123300,1013.0,992.0
825,2018/01/10,1007.0,1010.746,1000.0,154800,1022.0,997.0
826,2018/01/11,1016.0,1010.028,1006.0,141000,1025.0,992.0
827,2018/01/12,1010.0,1009.706,1011.0,108700,1018.0,1000.0
828,2018/01/15,1014.0,1021.137,1012.0,116100,1031.0,1012.0
829,2018/01/16,1010.0,1013.387,1014.0,55300,1020.0,1010.0
830,2018/01/17,1002.0,1000.343,1004.0,131900,1008.0,992.0
831,2018/01/18,991.0,995.619,1002.0,118500,1009.0,989.0
832,2018/01/19,1008.0,1008.049,995.0,79700,1012.0,995.0
833,2018/01/22,1019.0,1012.023,1002.0,125300,1023.0,996.0
834,2018/01/23,1025.0,1027.259,1019.0,138800,1035.0,1019.0
835,2018/01/24,1041.0,1040.067,1025.0,138100,1048.0,1025.0
836,2018/01/25,1037.0,1037.007,1044.0,45900,1044.0,1030.0
837,2018/01/26,1039.0,1041.917,1036.0,55300,1048.0,1034.0
838,2018/01/29,1043.0,1043.201,1042.0,69700,1047.0,1033.0
839,2018/01/30,1031.0,1038.838,1041.0,106100,1052.0,1026.0
840,2018/01/31,1029.0,1040.107,1026.0,134200,1059.0,1021.0
841,2018/02/01,1036.0,1038.562,1031.0,143200,1048.0,1026.0
842,2018/02/02,1055.0,1053.083,1026.0,137200,1062.0,1026.0
843,2018/02/05,1041.0,1048.469,1025.0,155100,1061.0,1025.0
844,2018/02/06,945.0,952.174,974.0,225900,977.0,924.0
845,2018/02/07,936.0,957.373,979.0,118100,988.0,935.0
846,2018/02/08,947.0,947.5,936.0,140200,968.0,930.0
847,2018/02/09,965.0,947.856,902.0,167600,967.0,902.0
848,2018/02/13,970.0,975.588,980.0,164700,994.0,966.0
849,2018/02/14,941.0,945.364,970.0,118200,973.0,931.0
850,2018/02/15,947.0,946.977,953.0,89900,954.0,937.0
851,2018/02/16,970.0,969.832,955.0,64300,982.0,955.0
852,2018/02/19,1019.0,1004.194,972.0,86700,1020.0,972.0
853,2018/02/20,1023.0,1013.645,995.0,52600,1027.0,995.0
854,2018/02/21,1040.0,1038.479,1022.0,103500,1056.0,1013.0
855,2018/02/22,1021.0,1020.175,1028.0,59500,1028.0,1009.0
856,2018/02/23,1037.0,1034.876,1027.0,77900,1046.0,1020.0
857,2018/02/26,1064.0,1054.05,1037.0,198300,1074.0,1033.0
858,2018/02/27,1061.0,1062.052,1063.0,113000,1072.0,1055.0
859,2018/02/28,1059.0,1062.908,1061.0,177800,1084.0,1049.0
860,2018/03/01,1060.0,1053.097,1044.0,138500,1066.0,1031.0
861,2018/03/02,1049.0,1051.148,1044.0,107300,1060.0,1042.0
862,2018/03/05,1053.0,1048.411,1048.0,110700,1056.0,1033.0
863,2018/03/06,1060.0,1066.584,1064.0,84600,1078.0,1058.0
864,2018/03/07,1073.0,1073.931,1061.0,79100,1083.0,1059.0
865,2018/03/08,1075.0,1074.724,1074.0,70200,1080.0,1068.0
866,2018/03/09,1098.0,1103.638,1083.0,202800,1124.0,1083.0
867,2018/03/12,1114.0,1117.958,1114.0,143700,1132.0,1104.0
868,2018/03/13,1150.0,1134.894,1108.0,164700,1150.0,1105.0
869,2018/03/14,1146.0,1140.661,1137.0,143400,1153.0,1121.0
870,2018/03/15,1132.0,1131.308,1144.0,74900,1147.0,1111.0
871,2018/03/16,1128.0,1125.042,1124.0,74400,1138.0,1116.0
872,2018/03/19,1107.0,1110.24,1118.0,48800,1125.0,1101.0
873,2018/03/20,1114.0,1102.716,1082.0,64500,1115.0,1082.0
874,2018/03/22,1130.0,1122.904,1115.0,74300,1134.0,1106.0
875,2018/03/23,1080.0,1087.777,1100.0,92400,1104.0,1074.0
876,2018/03/26,1085.0,1069.723,1069.0,100700,1085.0,1051.0
877,2018/03/27,1130.0,1122.514,1094.0,77200,1131.0,1092.0
878,2018/03/28,1132.0,1125.472,1123.0,66700,1135.0,1111.0
879,2018/03/29,1136.0,1132.652,1140.0,62300,1149.0,1112.0
880,2018/03/30,1157.0,1147.36,1141.0,98400,1166.0,1113.0
881,2018/04/02,1162.0,1161.518,1165.0,108600,1175.0,1137.0
882,2018/04/03,1146.0,1146.499,1136.0,69700,1157.0,1128.0
883,2018/04/04,1171.0,1170.163,1155.0,100800,1178.0,1151.0
884,2018/04/05,1175.0,1180.177,1177.0,87700,1188.0,1172.0
885,2018/04/06,1168.0,1171.77,1180.0,63800,1180.0,1166.0
886,2018/04/09,1182.0,1178.57,1165.0,93500,1192.0,1165.0
887,2018/04/10,1182.0,1184.375,1181.0,60200,1195.0,1176.0
888,2018/04/11,1184.0,1180.952,1178.0,66000,1189.0,1168.0
889,2018/04/12,1164.0,1166.215,1182.0,65600,1182.0,1159.0
890,2018/04/13,1169.0,1162.489,1168.0,75700,1172.0,1151.0
891,2018/04/16,1184.0,1180.911,1168.0,49600,1188.0,1167.0
892,2018/04/17,1178.0,1179.186,1183.0,34400,1186.0,1172.0
893,2018/04/18,1188.0,1183.415,1170.0,62700,1190.0,1170.0
894,2018/04/19,1177.0,1182.157,1187.0,74500,1192.0,1175.0
895,2018/04/20,1181.0,1180.114,1175.0,86700,1186.0,1172.0
896,2018/04/23,1178.0,1181.316,1178.0,42400,1193.0,1174.0
897,2018/04/24,1188.0,1185.61,1176.0,50200,1192.0,1175.0
898,2018/04/25,1185.0,1185.042,1183.0,47600,1191.0,1176.0
899,2018/04/26,1197.0,1191.86,1189.0,55500,1197.0,1180.0
900,2018/04/27,1216.0,1213.888,1200.0,120400,1227.0,1200.0
901,2018/05/01,1200.0,1202.223,1207.0,47600,1211.0,1192.0
902,2018/05/02,1211.0,1211.765,1202.0,60800,1224.0,1202.0
903,2018/05/07,1242.0,1232.757,1211.0,59200,1245.0,1211.0
904,2018/05/08,1239.0,1240.841,1242.0,68700,1252.0,1224.0
905,2018/05/09,1244.0,1240.607,1238.0,50600,1249.0,1232.0
906,2018/05/10,1249.0,1236.059,1246.0,70700,1255.0,1218.0
907,2018/05/11,1342.0,1307.764,1251.0,232600,1350.0,1251.0
908,2018/05/14,1371.0,1367.734,1340.0,158200,1379.0,1333.0
909,2018/05/15,1368.0,1371.9,1372.0,113400,1394.0,1354.0
910,2018/05/16,1362.0,1373.926,1374.0,135600,1394.0,1357.0
911,2018/05/17,1356.0,1354.087,1360.0,70000,1361.0,1336.0
912,2018/05/18,1339.0,1347.257,1350.0,81600,1371.0,1335.0
913,2018/05/21,1397.0,1383.594,1331.0,111800,1404.0,1329.0
914,2018/05/22,1365.0,1370.67,1398.0,81200,1399.0,1354.0
915,2018/05/23,1362.0,1360.928,1360.0,79400,1376.0,1347.0
916,2018/05/24,1334.0,1340.047,1360.0,55800,1360.0,1333.0
917,2018/05/25,1341.0,1342.752,1323.0,72700,1364.0,1319.0
918,2018/05/28,1348.0,1341.046,1340.0,79700,1353.0,1327.0
919,2018/05/29,1325.0,1325.441,1341.0,66900,1355.0,1313.0
920,2018/05/30,1306.0,1304.958,1304.0,99400,1316.0,1292.0
921,2018/05/31,1278.0,1287.217,1304.0,196900,1311.0,1265.0
922,2018/06/01,1250.0,1249.62,1252.0,196200,1257.0,1233.0
923,2018/06/04,1260.0,1261.337,1262.0,198500,1279.0,1247.0
924,2018/06/05,1252.0,1245.668,1268.0,118700,1274.0,1233.0
925,2018/06/06,1291.0,1285.79,1250.0,155400,1310.0,1245.0
926,2018/06/07,1290.0,1292.05,1308.0,63700,1310.0,1280.0
927,2018/06/08,1285.0,1279.137,1274.0,57800,1286.0,1274.0
928,2018/06/11,1293.0,1291.179,1288.0,40800,1297.0,1283.0
929,2018/06/12,1307.0,1299.217,1306.0,41900,1308.0,1286.0
930,2018/06/13,1324.0,1314.787,1307.0,61600,1325.0,1298.0
931,2018/06/14,1338.0,1329.945,1313.0,106600,1342.0,1303.0
932,2018/06/15,1330.0,1335.837,1340.0,87300,1353.0,1326.0
933,2018/06/18,1306.0,1326.122,1338.0,74000,1354.0,1304.0
934,2018/06/19,1272.0,1284.236,1306.0,56700,1316.0,1266.0
935,2018/06/20,1318.0,1303.87,1275.0,93700,1320.0,1275.0
936,2018/06/21,1308.0,1310.884,1319.0,40600,1321.0,1298.0
937,2018/06/22,1295.0,1293.136,1297.0,39000,1307.0,1283.0
938,2018/06/25,1271.0,1280.098,1295.0,60100,1311.0,1264.0
939,2018/06/26,1290.0,1284.954,1246.0,78700,1299.0,1246.0
940,2018/06/27,1274.0,1275.846,1290.0,93400,1296.0,1255.0
941,2018/06/28,1270.0,1266.928,1264.0,40200,1273.0,1259.0
942,2018/06/29,1279.0,1276.042,1271.0,52800,1289.0,1263.0
943,2018/07/02,1234.0,1253.235,1271.0,60100,1278.0,1234.0
944,2018/07/03,1221.0,1230.412,1240.0,83900,1245.0,1216.0
945,2018/07/04,1195.0,1199.89,1204.0,75200,1213.0,1190.0
946,2018/07/05,1160.0,1168.803,1190.0,64800,1192.0,1153.0
947,2018/07/06,1184.0,1189.921,1218.0,73500,1218.0,1171.0
948,2018/07/09,1229.0,1209.943,1194.0,52400,1229.0,1184.0
949,2018/07/10,1239.0,1240.494,1237.0,57900,1251.0,1226.0
950,2018/07/11,1226.0,1232.624,1236.0,62300,1250.0,1224.0
951,2018/07/12,1239.0,1246.024,1236.0,58300,1270.0,1234.0
952,2018/07/13,1255.0,1251.745,1242.0,42300,1259.0,1240.0
953,2018/07/17,1285.0,1278.465,1262.0,47300,1293.0,1256.0
954,2018/07/18,1303.0,1305.883,1298.0,59600,1321.0,1294.0
955,2018/07/19,1289.0,1293.056,1316.0,23100,1316.0,1286.0
956,2018/07/20,1288.0,1288.595,1289.0,37300,1303.0,1274.0
957,2018/07/23,1285.0,1281.98,1281.0,43800,1291.0,1271.0
958,2018/07/24,1317.0,1312.25,1298.0,72500,1318.0,1290.0
959,2018/07/25,1331.0,1334.105,1334.0,69500,1347.0,1326.0
960,2018/07/26,1373.0,1363.374,1357.0,81800,1377.0,1344.0
961,2018/07/27,1406.0,1405.689,1381.0,103000,1427.0,1381.0
962,2018/07/30,1436.0,1438.796,1450.0,132600,1452.0,1431.0
963,2018/07/31,1413.0,1412.806,1436.0,162500,1437.0,1396.0
964,2018/08/01,1420.0,1408.852,1401.0,219100,1434.0,1369.0
965,2018/08/02,1391.0,1404.87,1420.0,99800,1426.0,1390.0
966,2018/08/03,1391.0,1392.225,1380.0,104500,1408.0,1375.0
967,2018/08/06,1358.0,1366.682,1391.0,134800,1391.0,1353.0
968,2018/08/07,1352.0,1347.938,1349.0,84200,1359.0,1340.0
969,2018/08/08,1337.0,1346.282,1352.0,163000,1367.0,1334.0
970,2018/08/09,1308.0,1304.501,1325.0,230300,1331.0,1280.0
971,2018/08/10,1214.0,1229.917,1320.0,255500,1320.0,1198.0
972,2018/08/13,1201.0,1205.178,1222.0,146900,1241.0,1186.0
973,2018/08/14,1207.0,1205.24,1193.0,114400,1211.0,1193.0
974,2018/08/15,1202.0,1201.698,1200.0,79400,1208.0,1193.0
975,2018/08/16,1154.0,1165.672,1187.0,102600,1199.0,1151.0
976,2018/08/17,1143.0,1143.259,1160.0,72200,1161.0,1131.0
977,2018/08/20,1142.0,1141.879,1138.0,77600,1155.0,1130.0
978,2018/08/21,1124.0,1127.101,1131.0,43600,1140.0,1122.0
979,2018/08/22,1142.0,1140.928,1124.0,55200,1153.0,1124.0
980,2018/08/23,1142.0,1143.13,1138.0,57100,1148.0,1136.0
981,2018/08/24,1164.0,1161.747,1164.0,106900,1172.0,1144.0
982,2018/08/27,1170.0,1165.614,1164.0,89600,1181.0,1146.0
983,2018/08/28,1193.0,1190.234,1183.0,80100,1196.0,1182.0
984,2018/08/29,1187.0,1187.721,1197.0,67100,1201.0,1180.0
985,2018/08/30,1204.0,1202.94,1195.0,115800,1210.0,1193.0
986,2018/08/31,1186.0,1195.627,1193.0,61900,1210.0,1185.0
987,2018/09/03,1142.0,1155.521,1189.0,104800,1194.0,1138.0
988,2018/09/04,1139.0,1138.936,1140.0,96400,1144.0,1132.0
989,2018/09/05,1152.0,1147.514,1139.0,77500,1160.0,1139.0
990,2018/09/06,1157.0,1160.079,1155.0,61000,1179.0,1151.0
991,2018/09/07,1160.0,1158.678,1150.0,63600,1164.0,1146.0
992,2018/09/10,1166.0,1168.784,1160.0,98300,1177.0,1157.0
993,2018/09/11,1155.0,1160.312,1166.0,97400,1175.0,1150.0
994,2018/09/12,1115.0,1122.468,1150.0,80700,1153.0,1109.0
995,2018/09/13,1122.0,1124.686,1120.0,50600,1140.0,1114.0
996,2018/09/14,1145.0,1141.543,1129.0,80800,1158.0,1129.0
997,2018/09/18,1144.0,1135.633,1135.0,117800,1150.0,1117.0
998,2018/09/19,1161.0,1155.722,1167.0,85100,1167.0,1141.0
999,2018/09/20,1164.0,1165.83,1172.0,55300,1175.0,1158.0
1000,2018/09/21,1193.0,1190.857,1167.0,76300,1198.0,1167.0
1001,2018/09/25,1213.0,1206.807,1200.0,102600,1213.0,1196.0
1002,2018/09/26,1215.0,1213.217,1220.0,106100,1220.0,1201.0
1003,2018/09/27,1222.0,1226.463,1213.0,81300,1240.0,1207.0
1004,2018/09/28,1238.0,1240.033,1227.0,86200,1251.0,1222.0
1005,2018/10/01,1240.0,1241.963,1236.0,53300,1250.0,1232.0
1006,2018/10/02,1225.0,1238.567,1253.0,74900,1267.0,1223.0
1007,2018/10/03,1196.0,1210.101,1225.0,93100,1231.0,1194.0
1008,2018/10/04,1184.0,1186.73,1218.0,67000,1218.0,1172.0
1009,2018/10/05,1169.0,1176.105,1188.0,67900,1191.0,1167.0
1010,2018/10/09,1146.0,1152.95,1169.0,53500,1180.0,1142.0
1011,2018/10/10,1153.0,1149.92,1162.0,72400,1162.0,1133.0
1012,2018/10/11,1093.0,1099.124,1123.0,107100,1132.0,1088.0
1013,2018/10/12,1105.0,1096.939,1085.0,104900,1115.0,1076.0
1014,2018/10/15,1097.0,1101.58,1100.0,57600,1121.0,1092.0
1015,2018/10/16,1089.0,1094.123,1095.0,59200,1116.0,1084.0
1016,2018/10/17,1119.0,1113.154,1100.0,60500,1123.0,1093.0
1017,2018/10/18,1093.0,1104.127,1118.0,64600,1123.0,1090.0
1018,2018/10/19,1095.0,1089.234,1082.0,34600,1096.0,1079.0
1019,2018/10/22,1100.0,1096.779,1084.0,40700,1108.0,1083.0
1020,2018/10/23,1066.0,1080.402,1088.0,70700,1094.0,1066.0
1021,2018/10/24,1090.0,1081.823,1071.0,54200,1095.0,1067.0
1022,2018/10/25,1015.0,1020.837,1042.0,106800,1044.0,1004.0
1023,2018/10/26,1002.0,1005.969,1015.0,97200,1025.0,994.0
1024,2018/10/29,1021.0,1026.917,1014.0,62600,1039.0,1014.0
1025,2018/10/30,1044.0,1039.692,1022.0,89700,1051.0,1013.0
1026,2018/10/31,1070.0,1059.273,1046.0,65900,1070.0,1038.0
1027,2018/11/01,1071.0,1073.369,1063.0,55600,1081.0,1061.0
1028,2018/11/02,1087.0,1080.826,1070.0,87200,1087.0,1065.0
1029,2018/11/05,1083.0,1080.12,1067.0,40900,1091.0,1066.0
1030,2018/11/06,1090.0,1087.353,1094.0,54700,1094.0,1075.0
1031,2018/11/07,1103.0,1106.848,1085.0,84100,1117.0,1080.0
1032,2018/11/08,1108.0,1117.114,1115.0,57900,1128.0,1108.0
1033,2018/11/09,1105.0,1109.231,1104.0,26400,1123.0,1103.0
1034,2018/11/12,1093.0,1092.636,1096.0,53900,1103.0,1085.0
1035,2018/11/13,1095.0,1083.593,1077.0,77800,1100.0,1058.0
1036,2018/11/14,1088.0,1092.628,1090.0,96800,1109.0,1076.0
1037,2018/11/15,1160.0,1161.665,1088.0,202900,1187.0,1088.0
1038,2018/11/16,1191.0,1190.261,1170.0,143900,1212.0,1169.0
1039,2018/11/19,1215.0,1218.223,1196.0,103700,1229.0,1196.0
1040,2018/11/20,1207.0,1219.692,1215.0,108000,1242.0,1204.0
1041,2018/11/21,1202.0,1204.404,1194.0,81900,1218.0,1187.0
1042,2018/11/22,1198.0,1196.72,1213.0,84400,1224.0,1188.0
1043,2018/11/26,1198.0,1203.365,1205.0,85000,1221.0,1195.0
1044,2018/11/27,1209.0,1206.97,1210.0,84000,1220.0,1198.0
1045,2018/11/28,1229.0,1217.664,1220.0,166800,1233.0,1194.0
1046,2018/11/29,1213.0,1228.87,1247.0,88400,1253.0,1210.0
1047,2018/11/30,1210.0,1213.368,1219.0,97700,1236.0,1205.0
1048,2018/12/03,1238.0,1231.98,1222.0,79900,1248.0,1208.0
1049,2018/12/04,1200.0,1203.916,1226.0,89900,1230.0,1198.0
1050,2018/12/05,1164.0,1168.646,1182.0,83800,1183.0,1163.0
1051,2018/12/06,1140.0,1140.844,1154.0,89200,1154.0,1132.0
1052,2018/12/07,1111.0,1118.24,1131.0,78200,1140.0,1108.0
1053,2018/12/10,1062.0,1076.124,1092.0,83900,1099.0,1061.0
1054,2018/12/11,1053.0,1055.474,1060.0,65000,1068.0,1048.0
1055,2018/12/12,1087.0,1079.136,1065.0,52900,1089.0,1063.0
1056,2018/12/13,1095.0,1090.648,1097.0,57700,1099.0,1076.0
1057,2018/12/14,1084.0,1089.322,1097.0,88800,1101.0,1083.0
1058,2018/12/17,1083.0,1084.327,1089.0,53500,1099.0,1076.0
1059,2018/12/18,1080.0,1076.717,1074.0,90700,1092.0,1058.0
1060,2018/12/19,1088.0,1085.229,1085.0,49800,1094.0,1070.0
1061,2018/12/20,1070.0,1072.307,1082.0,104600,1085.0,1063.0
1062,2018/12/21,1030.0,1023.654,1069.0,134100,1069.0,997.0
1063,2018/12/25,949.0,966.315,1000.0,79800,1000.0,946.0
1064,2018/12/26,957.0,955.348,964.0,48800,971.0,940.0
1065,2018/12/27,1020.0,1015.023,983.0,74400,1026.0,983.0
1066,2018/12/28,1042.0,1034.696,1024.0,60100,1048.0,1009.0
1067,2019/01/04,1032.0,1033.201,1021.0,61700,1043.0,1019.0
1068,2019/01/07,1057.0,1059.664,1062.0,53500,1077.0,1051.0
1069,2019/01/08,1054.0,1055.213,1062.0,47900,1076.0,1049.0
1070,2019/01/09,1072.0,1069.113,1060.0,63600,1084.0,1051.0
1071,2019/01/10,1061.0,1058.683,1064.0,43200,1064.0,1049.0
1072,2019/01/11,1050.0,1052.024,1061.0,55300,1073.0,1034.0
1073,2019/01/15,1075.0,1070.762,1039.0,59300,1082.0,1039.0
1074,2019/01/16,1047.0,1058.091,1075.0,58500,1076.0,1043.0
1075,2019/01/17,1063.0,1057.16,1052.0,91200,1080.0,1042.0
1076,2019/01/18,1063.0,1072.385,1067.0,55400,1086.0,1053.0
1077,2019/01/21,1085.0,1080.797,1074.0,73400,1092.0,1068.0
1078,2019/01/22,1085.0,1086.371,1092.0,36700,1096.0,1078.0
1079,2019/01/23,1085.0,1086.507,1076.0,67600,1099.0,1071.0
1080,2019/01/24,1086.0,1085.656,1084.0,59800,1091.0,1074.0
1081,2019/01/25,1063.0,1075.846,1102.0,84800,1108.0,1062.0
1082,2019/01/28,1033.0,1040.232,1052.0,44000,1060.0,1031.0
1083,2019/01/29,1045.0,1034.749,1034.0,62100,1047.0,1019.0
1084,2019/01/30,1029.0,1037.302,1056.0,72300,1057.0,1028.0
1085,2019/01/31,1002.0,1011.515,1043.0,79000,1043.0,998.0
1086,2019/02/01,1009.0,998.076,1001.0,78800,1011.0,981.0
1087,2019/02/04,1060.0,1041.821,1022.0,100700,1060.0,1015.0
1088,2019/02/05,1063.0,1067.317,1059.0,78000,1079.0,1052.0
1089,2019/02/06,1069.0,1061.715,1074.0,72000,1074.0,1044.0
1090,2019/02/07,1094.0,1091.481,1075.0,126700,1100.0,1075.0
1091,2019/02/08,1095.0,1090.122,1072.0,120200,1104.0,1055.0
1092,2019/02/12,1003.0,1004.365,1035.0,123900,1056.0,980.0
1093,2019/02/13,982.0,984.184,1000.0,109200,1004.0,979.0
1094,2019/02/14,985.0,982.064,975.0,41900,989.0,971.0
1095,2019/02/15,971.0,970.737,982.0,36500,982.0,965.0
1096,2019/02/18,990.0,987.598,986.0,40000,993.0,979.0
1097,2019/02/19,972.0,975.357,989.0,61000,991.0,966.0
1098,2019/02/20,981.0,978.323,966.0,59500,985.0,966.0
1099,2019/02/21,1010.0,1003.294,989.0,83000,1014.0,987.0
1100,2019/02/22,1042.0,1032.554,1009.0,75700,1045.0,1005.0
1101,2019/02/25,1048.0,1047.618,1044.0,55200,1057.0,1040.0
1102,2019/02/26,1034.0,1036.991,1047.0,33700,1047.0,1031.0
1103,2019/02/27,1049.0,1049.311,1039.0,56300,1059.0,1039.0
1104,2019/02/28,1051.0,1051.937,1050.0,59100,1064.0,1049.0
1105,2019/03/01,1037.0,1041.91,1048.0,62400,1058.0,1030.0
1106,2019/03/04,1014.0,1020.257,1045.0,46400,1045.0,1010.0
1107,2019/03/05,994.0,996.009,1015.0,45700,1016.0,989.0
1108,2019/03/06,988.0,986.76,993.0,52900,995.0,978.0
1109,2019/03/07,989.0,985.919,984.0,56500,993.0,976.0
1110,2019/03/08,958.0,966.814,974.0,77600,976.0,957.0
1111,2019/03/11,989.0,979.545,964.0,39100,990.0,959.0
1112,2019/03/12,1013.0,1015.188,1003.0,47400,1028.0,1003.0
1113,2019/03/13,993.0,997.114,1004.0,18400,1004.0,992.0
1114,2019/03/14,966.0,974.204,987.0,36300,993.0,965.0
1115,2019/03/15,971.0,974.247,968.0,45000,983.0,967.0
1116,2019/03/18,994.0,987.266,981.0,35700,995.0,971.0
1117,2019/03/19,974.0,975.37,993.0,23000,993.0,970.0
1118,2019/03/20,984.0,976.296,976.0,30100,986.0,968.0
1119,2019/03/22,1007.0,1004.03,986.0,53000,1013.0,986.0
1120,2019/03/25,971.0,980.802,993.0,59700,993.0,962.0
1121,2019/03/26,1020.0,1012.124,983.0,88800,1020.0,980.0
1122,2019/03/27,1010.0,1009.027,1014.0,36500,1017.0,1000.0
1123,2019/03/28,991.0,988.048,999.0,48400,999.0,975.0
1124,2019/03/29,981.0,978.467,992.0,48400,996.0,971.0
1125,2019/04/01,1003.0,1000.553,1003.0,70400,1009.0,992.0
1126,2019/04/02,980.0,986.304,1008.0,38500,1009.0,979.0
1127,2019/04/03,980.0,971.688,978.0,57000,981.0,959.0
1128,2019/04/04,967.0,969.187,981.0,38000,982.0,965.0
1129,2019/04/05,979.0,974.169,972.0,25500,979.0,963.0
1130,2019/04/08,974.0,972.991,981.0,11400,981.0,968.0
1131,2019/04/09,958.0,958.574,975.0,27200,975.0,953.0
1132,2019/04/10,948.0,946.833,953.0,25100,953.0,942.0
1133,2019/04/11,938.0,939.448,945.0,23900,945.0,931.0
1134,2019/04/12,960.0,957.819,950.0,40400,963.0,949.0
1135,2019/04/15,979.0,977.08,965.0,40200,983.0,965.0
1136,2019/04/16,968.0,973.347,983.0,24500,987.0,966.0
1137,2019/04/17,970.0,968.646,973.0,20900,974.0,962.0
1138,2019/04/18,943.0,947.599,967.0,32700,967.0,937.0
1139,2019/04/19,941.0,945.867,957.0,9800,957.0,939.0
1140,2019/04/22,944.0,942.849,948.0,9900,951.0,937.0
1141,2019/04/23,966.0,958.851,948.0,30800,966.0,948.0
1142,2019/04/24,945.0,952.356,970.0,26700,973.0,941.0
1143,2019/04/25,948.0,949.632,960.0,53800,960.0,933.0
1144,2019/04/26,953.0,950.478,944.0,30100,959.0,931.0
1145,2019/05/07,961.0,969.84,956.0,77500,982.0,956.0
1146,2019/05/08,902.0,912.586,941.0,81800,943.0,901.0
1147,2019/05/09,861.0,872.464,901.0,55000,901.0,861.0
1148,2019/05/10,880.0,882.665,862.0,50500,900.0,862.0
1149,2019/05/13,845.0,866.677,880.0,44900,891.0,844.0
1150,2019/05/14,831.0,824.886,800.0,78100,837.0,798.0
1151,2019/05/15,843.0,838.273,835.0,71100,855.0,823.0
1152,2019/05/16,856.0,853.005,839.0,43800,865.0,828.0
1153,2019/05/17,895.0,894.256,868.0,94000,915.0,868.0
1154,2019/05/20,931.0,927.703,907.0,96900,943.0,902.0
1155,2019/05/21,944.0,943.332,922.0,86400,963.0,913.0
1156,2019/05/22,908.0,917.508,945.0,78400,952.0,901.0
1157,2019/05/23,894.0,902.755,899.0,60000,916.0,893.0
1158,2019/05/24,934.0,924.023,888.0,60300,939.0,884.0
1159,2019/05/27,938.0,938.769,933.0,31100,951.0,927.0
1160,2019/05/28,910.0,916.227,936.0,100000,940.0,904.0
1161,2019/05/29,899.0,900.051,902.0,63200,907.0,888.0
1162,2019/05/30,902.0,903.303,889.0,48500,914.0,889.0
1163,2019/05/31,881.0,887.298,889.0,52700,900.0,878.0
1164,2019/06/03,875.0,877.321,872.0,38600,890.0,869.0
1165,2019/06/04,898.0,890.775,879.0,27500,899.0,876.0
1166,2019/06/05,928.0,917.443,908.0,83800,933.0,892.0
1167,2019/06/06,942.0,944.326,928.0,62800,959.0,927.0
1168,2019/06/07,939.0,937.362,946.0,57800,947.0,927.0
1169,2019/06/10,956.0,952.849,942.0,38500,959.0,942.0
1170,2019/06/11,931.0,937.525,957.0,50100,959.0,928.0
1171,2019/06/12,919.0,922.181,932.0,24900,937.0,917.0
1172,2019/06/13,909.0,909.67,913.0,31800,924.0,903.0
1173,2019/06/14,881.0,889.051,894.0,66800,896.0,881.0
1174,2019/06/17,897.0,891.975,884.0,67800,911.0,872.0
1175,2019/06/18,880.0,889.325,903.0,34500,917.0,878.0
1176,2019/06/19,907.0,901.085,895.0,37500,909.0,886.0
1177,2019/06/20,908.0,909.79,909.0,24700,920.0,903.0
1178,2019/06/21,906.0,912.785,912.0,51500,923.0,905.0
1179,2019/06/24,919.0,916.35,907.0,23400,920.0,907.0
1180,2019/06/25,882.0,893.077,915.0,40300,915.0,882.0
1181,2019/06/26,888.0,891.949,884.0,43400,898.0,880.0
1182,2019/06/27,911.0,904.126,890.0,49900,911.0,889.0
1183,2019/06/28,891.0,896.394,903.0,59900,912.0,889.0
1184,2019/07/01,929.0,921.736,914.0,43500,929.0,911.0
1185,2019/07/02,917.0,919.881,927.0,35200,927.0,911.0
1186,2019/07/03,926.0,920.502,917.0,27300,928.0,908.0
1187,2019/07/04,935.0,937.855,927.0,44800,947.0,927.0
1188,2019/07/05,940.0,938.66,934.0,42300,948.0,929.0
1189,2019/07/08,910.0,917.909,935.0,58500,939.0,909.0
1190,2019/07/09,899.0,904.911,913.0,48100,919.0,899.0
1191,2019/07/10,904.0,905.037,900.0,43000,915.0,894.0
1192,2019/07/11,912.0,910.976,904.0,33600,915.0,904.0
1193,2019/07/12,909.0,911.652,912.0,39400,915.0,906.0
1194,2019/07/16,901.0,904.849,905.0,25900,913.0,901.0
1195,2019/07/17,918.0,915.463,902.0,53400,928.0,891.0
1196,2019/07/18,872.0,885.376,907.0,69500,913.0,872.0
1197,2019/07/19,911.0,900.562,877.0,38600,912.0,877.0
1198,2019/07/22,894.0,900.058,911.0,38000,918.0,891.0
1199,2019/07/23,893.0,895.42,898.0,30000,905.0,887.0
1200,2019/07/24,887.0,888.213,896.0,28700,897.0,884.0
1201,2019/07/25,897.0,897.543,902.0,36300,902.0,883.0
1202,2019/07/26,887.0,887.646,887.0,24600,891.0,884.0
1203,2019/07/29,876.0,876.166,889.0,33700,894.0,870.0
1204,2019/07/30,881.0,880.548,882.0,63100,887.0,872.0
1205,2019/07/31,859.0,865.915,875.0,95600,884.0,853.0
1206,2019/08/01,863.0,859.15,855.0,26700,863.0,853.0
1207,2019/08/02,829.0,836.347,848.0,70000,854.0,825.0
1208,2019/08/05,816.0,814.737,823.0,52900,825.0,804.0
1209,2019/08/06,799.0,796.411,798.0,65400,805.0,783.0
1210,2019/08/07,798.0,796.16,795.0,47600,802.0,787.0
1211,2019/08/08,806.0,807.897,807.0,30100,821.0,794.0
1212,2019/08/09,804.0,807.332,806.0,43400,820.0,795.0
1213,2019/08/13,700.0,711.906,729.0,107600,752.0,696.0
1214,2019/08/14,752.0,735.089,706.0,137900,754.0,706.0
1215,2019/08/15,738.0,734.49,727.0,48400,741.0,724.0
1216,2019/08/16,736.0,736.686,728.0,34400,743.0,725.0
1217,2019/08/19,742.0,745.865,742.0,24500,754.0,740.0
1218,2019/08/20,760.0,755.408,750.0,33600,766.0,748.0
1219,2019/08/21,746.0,747.081,749.0,28500,755.0,742.0
1220,2019/08/22,740.0,743.703,750.0,19200,755.0,740.0
1221,2019/08/23,751.0,750.064,748.0,34300,756.0,746.0
