,Date,Close,VWAP,Open,Volume,High,Low
0,2014/08/25,2271.0,2260.638,2251.0,600900,2278.0,2232.0
1,2014/08/26,2238.0,2247.09,2276.0,485400,2282.0,2234.0
2,2014/08/27,2205.0,2216.015,2248.0,621400,2266.0,2199.0
3,2014/08/28,2168.0,2166.018,2194.0,754700,2194.0,2152.0
4,2014/08/29,2131.0,2137.286,2157.0,954300,2171.0,2125.0
5,2014/09/01,2134.0,2116.705,2115.0,873700,2135.0,2105.0
6,2014/09/02,2115.0,2118.05,2123.0,1453900,2146.0,2092.0
7,2014/09/03,2084.0,2092.784,2141.0,1647500,2142.0,2077.0
8,2014/09/04,2098.0,2096.159,2087.0,855800,2109.0,2073.0
9,2014/09/05,2110.0,2106.815,2117.0,768200,2121.0,2093.0
10,2014/09/08,2060.0,2068.776,2115.0,931400,2117.0,2053.0
11,2014/09/09,2043.0,2046.399,2057.0,912500,2059.0,2038.0
12,2014/09/10,2076.0,2060.719,2049.0,970800,2079.0,2032.0
13,2014/09/11,2079.0,2095.101,2083.0,1414900,2132.0,2076.0
14,2014/09/12,2146.0,2132.309,2099.0,2078900,2163.0,2088.0
15,2014/09/16,2128.0,2141.243,2153.0,861200,2168.0,2124.0
16,2014/09/17,2150.0,2152.316,2166.0,1357300,2172.0,2139.0
17,2014/09/18,2306.0,2252.171,2200.0,3226900,2309.0,2165.0
18,2014/09/19,2320.0,2304.547,2295.0,1533900,2328.0,2286.0
19,2014/09/22,2314.0,2314.151,2320.0,654700,2337.0,2300.0
20,2014/09/24,2322.0,2321.059,2270.0,948100,2358.0,2270.0
21,2014/09/25,2409.0,2388.26,2330.0,1448400,2413.0,2330.0
22,2014/09/26,2366.0,2368.382,2381.0,1386700,2395.0,2342.0
23,2014/09/29,2419.0,2409.874,2406.0,825300,2430.0,2380.0
24,2014/09/30,2471.0,2459.977,2430.0,2211300,2483.0,2421.0
25,2014/10/01,2465.0,2469.451,2450.0,925900,2488.0,2443.0
26,2014/10/02,2410.0,2437.249,2465.0,1471000,2490.0,2403.0
27,2014/10/03,2430.0,2428.667,2404.0,854100,2448.0,2402.0
28,2014/10/06,2463.0,2459.224,2460.0,650000,2474.0,2431.0
29,2014/10/07,2458.0,2467.759,2456.0,811500,2484.0,2441.0
30,2014/10/08,2459.0,2448.199,2425.0,833800,2462.0,2415.0
31,2014/10/09,2414.0,2429.845,2453.0,652600,2473.0,2408.0
32,2014/10/10,2353.0,2343.286,2338.0,1187300,2360.0,2328.0
33,2014/10/14,2326.0,2341.569,2353.0,1707500,2406.0,2307.0
34,2014/10/15,2281.0,2294.229,2326.0,1127800,2359.0,2277.0
35,2014/10/16,2276.0,2257.691,2245.0,1463800,2303.0,2205.0
36,2014/10/17,2269.0,2293.867,2300.0,1099900,2313.0,2266.0
37,2014/10/20,2358.0,2349.313,2317.0,592300,2368.0,2314.0
38,2014/10/21,2374.0,2382.648,2360.0,831000,2407.0,2342.0
39,2014/10/22,2428.0,2418.615,2415.0,482900,2441.0,2399.0
40,2014/10/23,2396.0,2397.562,2413.0,471200,2414.0,2384.0
41,2014/10/24,2409.0,2409.846,2411.0,641400,2436.0,2394.0
42,2014/10/27,2424.0,2429.948,2432.0,669000,2447.0,2420.0
43,2014/10/28,2447.0,2446.237,2451.0,911300,2466.0,2418.0
44,2014/10/29,2465.0,2471.375,2468.0,667600,2489.0,2459.0
45,2014/10/30,2487.0,2488.886,2461.0,952700,2502.0,2447.0
46,2014/10/31,2586.0,2567.106,2512.0,1486500,2600.0,2506.0
47,2014/11/04,2772.0,2819.875,2986.0,1875900,2986.0,2762.0
48,2014/11/05,2782.0,2768.044,2786.0,1238900,2835.0,2731.0
49,2014/11/06,2742.0,2763.61,2800.0,728400,2820.0,2734.0
50,2014/11/07,2790.0,2786.118,2785.0,587000,2807.0,2740.0
51,2014/11/10,2880.0,2900.356,2980.0,1435300,2989.0,2866.0
52,2014/11/11,2919.0,2921.66,2900.0,719100,2937.0,2894.0
53,2014/11/12,2985.0,2992.273,2950.0,1025700,3030.0,2950.0
54,2014/11/13,2980.0,2968.979,2954.0,593000,2987.0,2942.0
55,2014/11/14,2997.0,2993.539,3000.0,799300,3020.0,2970.0
56,2014/11/17,2916.0,2939.077,3025.0,763700,3025.0,2909.0
57,2014/11/18,2977.0,2930.416,2900.0,1149000,2977.0,2876.0
58,2014/11/19,3005.0,3019.152,2990.0,692100,3060.0,2989.0
59,2014/11/20,3060.0,3062.428,3050.0,546200,3085.0,3020.0
60,2014/11/21,3035.0,3023.822,3045.0,582300,3045.0,3000.0
61,2014/11/25,3035.0,3030.304,3085.0,820800,3090.0,3005.0
62,2014/11/26,2994.0,3002.127,2996.0,899000,3030.0,2973.0
63,2014/11/27,2996.0,3003.113,2991.0,512900,3020.0,2985.0
64,2014/11/28,3005.0,2991.645,2976.0,486400,3010.0,2951.0
65,2014/12/01,3080.0,3065.95,3015.0,475400,3090.0,3010.0
66,2014/12/02,3100.0,3090.518,3040.0,567800,3115.0,3035.0
67,2014/12/03,3075.0,3093.443,3115.0,488100,3135.0,3060.0
68,2014/12/04,3090.0,3072.995,3090.0,576700,3095.0,3050.0
69,2014/12/05,3100.0,3089.086,3085.0,319000,3105.0,3070.0
70,2014/12/08,2999.0,3029.965,3130.0,641400,3135.0,2994.0
71,2014/12/09,2991.0,3009.205,2991.0,749400,3050.0,2981.0
72,2014/12/10,2924.0,2943.364,2950.0,561400,2994.0,2912.0
73,2014/12/11,2993.0,2964.965,2918.0,1084300,3005.0,2912.0
74,2014/12/12,2970.0,2979.022,2967.0,816800,3015.0,2957.0
75,2014/12/15,2935.0,2938.104,2911.0,359400,2970.0,2911.0
76,2014/12/16,2874.0,2887.163,2900.0,473300,2916.0,2872.0
77,2014/12/17,2849.0,2865.516,2846.0,693300,2892.0,2846.0
78,2014/12/18,2867.0,2897.801,2920.0,645600,2928.0,2860.0
79,2014/12/19,2984.0,2966.915,2951.0,536100,2988.0,2935.0
80,2014/12/22,2954.0,2969.718,3000.0,408800,3040.0,2936.0
81,2014/12/24,3005.0,2998.594,3000.0,405100,3010.0,2972.0
82,2014/12/25,2953.0,2963.134,2998.0,324600,2998.0,2947.0
83,2014/12/26,2995.0,2982.074,2932.0,261100,3000.0,2926.0
84,2014/12/29,2946.0,2954.339,2999.0,272800,3000.0,2916.0
85,2014/12/30,2895.0,2907.567,2949.0,305900,2955.0,2895.0
86,2015/01/05,2812.0,2813.461,2855.0,786000,2860.0,2792.0
87,2015/01/06,2730.0,2746.292,2757.0,839600,2797.0,2730.0
88,2015/01/07,2731.0,2741.967,2715.0,578300,2771.0,2711.0
89,2015/01/08,2827.0,2813.885,2790.0,626800,2839.0,2782.0
90,2015/01/09,2802.0,2817.258,2832.0,475900,2850.0,2790.0
91,2015/01/13,2805.0,2753.156,2745.0,863800,2806.0,2713.0
92,2015/01/14,2808.0,2801.867,2778.0,420800,2829.0,2777.0
93,2015/01/15,2798.0,2816.981,2819.0,927000,2876.0,2792.0
94,2015/01/16,2742.0,2730.001,2740.0,648400,2765.0,2702.0
95,2015/01/19,2735.0,2737.786,2757.0,669200,2778.0,2709.0
96,2015/01/20,2775.0,2752.877,2757.0,844900,2784.0,2716.0
97,2015/01/21,2841.0,2828.743,2785.0,1004700,2858.0,2774.0
98,2015/01/22,2824.0,2807.769,2840.0,747600,2850.0,2770.0
99,2015/01/23,2839.0,2839.004,2874.0,633900,2881.0,2815.0
100,2015/01/26,2836.0,2832.1,2817.0,828000,2857.0,2799.0
101,2015/01/27,2914.0,2895.031,2879.0,580400,2915.0,2864.0
102,2015/01/28,2886.0,2887.426,2894.0,497900,2909.0,2869.0
103,2015/01/29,2871.0,2885.608,2860.0,588900,2909.0,2852.0
104,2015/01/30,2910.0,2920.353,2904.0,646300,2949.0,2903.0
105,2015/02/02,2861.0,2870.743,2891.0,436900,2919.0,2853.0
106,2015/02/03,2760.0,2788.654,2865.0,686800,2866.0,2750.0
107,2015/02/04,2800.0,2810.478,2817.0,749500,2848.0,2791.0
108,2015/02/05,2847.0,2845.419,2831.0,1068600,2874.0,2806.0
109,2015/02/06,2867.0,2899.473,2888.0,663200,2959.0,2861.0
110,2015/02/09,2866.0,2871.976,2919.0,379900,2919.0,2853.0
111,2015/02/10,2851.0,2853.097,2870.0,427100,2910.0,2826.0
112,2015/02/12,2957.0,2940.405,2918.0,989400,2968.0,2887.0
113,2015/02/13,2962.0,2955.251,2950.0,592700,2975.0,2930.0
114,2015/02/16,2666.0,2683.648,2770.0,3176000,2770.0,2634.0
115,2015/02/17,2755.0,2739.87,2714.0,1672000,2761.0,2682.0
116,2015/02/18,2799.0,2780.465,2770.0,1144900,2800.0,2700.0
117,2015/02/19,2897.0,2857.855,2794.0,1374100,2924.0,2771.0
118,2015/02/20,2950.0,2940.303,2898.0,1086700,2972.0,2878.0
119,2015/02/23,2971.0,2973.43,2970.0,972800,2996.0,2950.0
120,2015/02/24,2994.0,2978.553,2991.0,1335800,2994.0,2944.0
121,2015/02/25,3015.0,2993.84,2999.0,952000,3015.0,2960.0
122,2015/02/26,3095.0,3059.115,2975.0,1285200,3120.0,2964.0
123,2015/02/27,3130.0,3139.289,3115.0,1095700,3175.0,3080.0
124,2015/03/02,3090.0,3084.621,3135.0,824900,3145.0,3050.0
125,2015/03/03,3105.0,3103.081,3090.0,508300,3130.0,3080.0
126,2015/03/04,3010.0,3014.408,3060.0,682500,3070.0,2965.0
127,2015/03/05,2999.0,2994.272,3000.0,598700,3020.0,2969.0
128,2015/03/06,3135.0,3085.301,2990.0,752600,3140.0,2990.0
129,2015/03/09,3080.0,3081.914,3135.0,450900,3135.0,3060.0
130,2015/03/10,3090.0,3092.175,3110.0,513900,3130.0,3070.0
131,2015/03/11,3050.0,3049.277,3045.0,536500,3095.0,3030.0
132,2015/03/12,3080.0,3070.536,3055.0,479400,3090.0,3045.0
133,2015/03/13,3025.0,3051.596,3080.0,1060700,3095.0,3020.0
134,2015/03/16,3080.0,3039.375,3015.0,794100,3085.0,2977.0
135,2015/03/17,3070.0,3058.248,3095.0,493000,3095.0,3035.0
136,2015/03/18,3130.0,3122.184,3075.0,788300,3150.0,3075.0
137,2015/03/19,3140.0,3122.826,3120.0,738800,3160.0,3060.0
138,2015/03/20,3215.0,3196.252,3170.0,712600,3230.0,3140.0
139,2015/03/23,3210.0,3210.222,3225.0,475200,3235.0,3180.0
140,2015/03/24,3295.0,3259.632,3165.0,1503400,3325.0,3125.0
141,2015/03/25,3425.0,3401.178,3305.0,1335800,3455.0,3305.0
142,2015/03/26,3300.0,3279.078,3355.0,1223300,3355.0,3215.0
143,2015/03/27,3260.0,3273.753,3305.0,559300,3340.0,3220.0
144,2015/03/30,3315.0,3283.899,3200.0,576400,3355.0,3180.0
145,2015/03/31,3270.0,3332.826,3400.0,919900,3420.0,3270.0
146,2015/04/01,3260.0,3279.995,3265.0,1173300,3320.0,3220.0
147,2015/04/02,3235.0,3236.578,3235.0,1028200,3280.0,3200.0
148,2015/04/03,3275.0,3252.488,3255.0,512800,3280.0,3215.0
149,2015/04/06,3275.0,3248.007,3220.0,500000,3280.0,3215.0
150,2015/04/07,3215.0,3210.751,3240.0,1147300,3250.0,3160.0
151,2015/04/08,3240.0,3219.058,3220.0,752600,3245.0,3180.0
152,2015/04/09,3240.0,3209.676,3240.0,822900,3240.0,3175.0
153,2015/04/10,3225.0,3227.649,3250.0,637700,3250.0,3205.0
154,2015/04/13,3240.0,3216.998,3220.0,617700,3250.0,3165.0
155,2015/04/14,3305.0,3294.827,3270.0,888000,3325.0,3260.0
156,2015/04/15,3160.0,3197.55,3300.0,1194800,3300.0,3135.0
157,2015/04/16,3145.0,3131.368,3175.0,721700,3180.0,3110.0
158,2015/04/17,3045.0,3060.145,3125.0,1018800,3125.0,3020.0
159,2015/04/20,3060.0,3058.346,3020.0,503900,3115.0,2988.0
160,2015/04/21,3115.0,3079.216,3050.0,826900,3125.0,3010.0
161,2015/04/22,3125.0,3134.571,3130.0,503500,3160.0,3110.0
162,2015/04/23,3100.0,3110.116,3150.0,505700,3150.0,3080.0
163,2015/04/24,3090.0,3100.079,3105.0,367500,3125.0,3065.0
164,2015/04/27,3165.0,3149.915,3120.0,544300,3175.0,3110.0
165,2015/04/28,3160.0,3165.173,3160.0,445800,3185.0,3135.0
166,2015/04/30,3070.0,3090.072,3150.0,870800,3165.0,3055.0
167,2015/05/01,3070.0,3063.745,3080.0,638700,3115.0,3035.0
168,2015/05/07,3075.0,3074.608,3070.0,967200,3140.0,3050.0
169,2015/05/08,3025.0,3039.21,3055.0,718900,3095.0,3025.0
170,2015/05/11,3020.0,3040.002,3065.0,866600,3075.0,3020.0
171,2015/05/12,3185.0,3126.38,3035.0,1541900,3200.0,2990.0
172,2015/05/13,3190.0,3185.965,3185.0,633300,3230.0,3140.0
173,2015/05/14,3120.0,3144.389,3120.0,715500,3200.0,3105.0
174,2015/05/15,3120.0,3105.43,3110.0,586600,3145.0,3070.0
175,2015/05/18,3175.0,3165.103,3135.0,437400,3190.0,3135.0
176,2015/05/19,3285.0,3261.436,3195.0,1070100,3295.0,3190.0
177,2015/05/20,3275.0,3281.266,3290.0,529000,3295.0,3250.0
178,2015/05/21,3265.0,3277.642,3300.0,379900,3300.0,3255.0
179,2015/05/22,3225.0,3232.592,3295.0,619300,3300.0,3215.0
180,2015/05/25,3130.0,3137.971,3255.0,1321200,3255.0,3100.0
181,2015/05/26,3160.0,3157.936,3165.0,926900,3170.0,3135.0
182,2015/05/27,3180.0,3180.729,3170.0,570500,3210.0,3140.0
183,2015/05/28,3230.0,3215.555,3200.0,599600,3240.0,3185.0
184,2015/05/29,3310.0,3288.175,3245.0,1008900,3315.0,3235.0
185,2015/06/01,3340.0,3340.347,3340.0,910600,3395.0,3290.0
186,2015/06/02,3335.0,3335.986,3350.0,499000,3360.0,3300.0
187,2015/06/03,3325.0,3328.665,3310.0,419400,3345.0,3305.0
188,2015/06/04,3285.0,3314.898,3360.0,503900,3380.0,3285.0
189,2015/06/05,3265.0,3255.815,3270.0,977000,3280.0,3220.0
190,2015/06/08,3310.0,3300.427,3315.0,1109500,3330.0,3260.0
191,2015/06/09,3270.0,3289.423,3305.0,876600,3330.0,3260.0
192,2015/06/10,3225.0,3230.986,3240.0,714200,3260.0,3210.0
193,2015/06/11,3195.0,3202.735,3245.0,665200,3250.0,3170.0
194,2015/06/12,3160.0,3166.245,3175.0,1101700,3185.0,3150.0
195,2015/06/15,3115.0,3107.645,3105.0,876900,3135.0,3085.0
196,2015/06/16,3130.0,3117.495,3100.0,751300,3150.0,3080.0
197,2015/06/17,3100.0,3100.022,3130.0,587000,3140.0,3080.0
198,2015/06/18,3095.0,3101.453,3100.0,550900,3120.0,3085.0
199,2015/06/19,3135.0,3138.963,3135.0,872800,3160.0,3120.0
200,2015/06/22,3195.0,3176.619,3145.0,626300,3195.0,3140.0
201,2015/06/23,3255.0,3234.755,3210.0,580700,3255.0,3185.0
202,2015/06/24,3275.0,3281.303,3300.0,826500,3300.0,3265.0
203,2015/06/25,3240.0,3239.755,3235.0,484700,3270.0,3205.0
204,2015/06/26,3235.0,3226.391,3240.0,692100,3250.0,3190.0
205,2015/06/29,3175.0,3171.969,3140.0,573300,3215.0,3110.0
206,2015/06/30,3165.0,3163.57,3140.0,581600,3180.0,3135.0
207,2015/07/01,3290.0,3248.158,3175.0,697500,3300.0,3170.0
208,2015/07/02,3385.0,3385.907,3360.0,1153700,3435.0,3325.0
209,2015/07/03,3350.0,3353.613,3370.0,661700,3370.0,3340.0
210,2015/07/06,3300.0,3305.636,3285.0,611900,3350.0,3265.0
211,2015/07/07,3330.0,3339.912,3330.0,551700,3360.0,3325.0
212,2015/07/08,3240.0,3262.94,3295.0,881100,3300.0,3240.0
213,2015/07/09,3220.0,3183.558,3180.0,1162700,3230.0,3120.0
214,2015/07/10,3140.0,3164.897,3215.0,857300,3240.0,3120.0
215,2015/07/13,3185.0,3175.992,3165.0,655900,3205.0,3135.0
216,2015/07/14,3250.0,3271.626,3265.0,755700,3305.0,3240.0
217,2015/07/15,3300.0,3300.082,3295.0,428700,3315.0,3285.0
218,2015/07/16,3400.0,3385.295,3350.0,590400,3405.0,3325.0
219,2015/07/17,3480.0,3468.273,3390.0,685000,3505.0,3390.0
220,2015/07/21,3485.0,3474.814,3510.0,564000,3525.0,3420.0
221,2015/07/22,3460.0,3463.903,3485.0,457500,3495.0,3435.0
222,2015/07/23,3520.0,3504.425,3450.0,819300,3535.0,3450.0
223,2015/07/24,3495.0,3523.272,3535.0,519600,3575.0,3485.0
224,2015/07/27,3425.0,3437.306,3485.0,449000,3485.0,3405.0
225,2015/07/28,3420.0,3428.6,3385.0,617500,3470.0,3380.0
226,2015/07/29,3540.0,3513.598,3455.0,848700,3550.0,3445.0
227,2015/07/30,3490.0,3507.551,3580.0,1520900,3610.0,3470.0
228,2015/07/31,3565.0,3551.023,3545.0,1057700,3590.0,3495.0
229,2015/08/03,3580.0,3562.391,3550.0,517000,3580.0,3535.0
230,2015/08/04,3740.0,3700.989,3580.0,1359400,3755.0,3565.0
231,2015/08/05,3655.0,3662.522,3710.0,833600,3710.0,3625.0
232,2015/08/06,3590.0,3640.474,3695.0,906800,3700.0,3590.0
233,2015/08/07,3495.0,3505.451,3455.0,1291200,3590.0,3425.0
234,2015/08/10,3640.0,3590.963,3530.0,777100,3655.0,3485.0
235,2015/08/11,3710.0,3711.709,3645.0,962900,3775.0,3635.0
236,2015/08/12,3865.0,3887.229,3935.0,1469800,4000.0,3820.0
237,2015/08/13,3825.0,3794.952,3760.0,899200,3860.0,3715.0
238,2015/08/14,3805.0,3858.577,3880.0,1005800,3945.0,3800.0
239,2015/08/17,3905.0,3881.931,3805.0,727700,3935.0,3785.0
240,2015/08/18,3885.0,3876.41,3905.0,657300,3925.0,3810.0
241,2015/08/19,3780.0,3803.595,3860.0,680000,3885.0,3765.0
242,2015/08/20,3760.0,3776.267,3740.0,823000,3845.0,3725.0
243,2015/08/21,3535.0,3570.592,3600.0,1397700,3670.0,3525.0
244,2015/08/24,3350.0,3391.577,3420.0,1323400,3475.0,3335.0
245,2015/08/25,3190.0,3266.481,3160.0,1937200,3370.0,3150.0
246,2015/08/26,3410.0,3349.766,3295.0,1474700,3425.0,3225.0
247,2015/08/27,3410.0,3445.455,3480.0,718400,3540.0,3385.0
248,2015/08/28,3605.0,3572.148,3560.0,1168900,3615.0,3515.0
249,2015/08/31,3550.0,3558.435,3580.0,1438200,3625.0,3520.0
250,2015/09/01,3435.0,3479.27,3545.0,961400,3545.0,3435.0
251,2015/09/02,3405.0,3444.899,3380.0,1075400,3510.0,3320.0
252,2015/09/03,3350.0,3376.267,3450.0,844800,3460.0,3330.0
253,2015/09/04,3320.0,3321.27,3400.0,883200,3400.0,3270.0
254,2015/09/07,3345.0,3318.023,3265.0,919800,3360.0,3225.0
255,2015/09/08,3225.0,3255.984,3310.0,623200,3340.0,3220.0
256,2015/09/09,3410.0,3361.484,3335.0,685500,3410.0,3280.0
257,2015/09/10,3375.0,3405.053,3340.0,1501700,3495.0,3320.0
258,2015/09/11,3315.0,3319.904,3305.0,1149000,3375.0,3270.0
259,2015/09/14,3325.0,3333.327,3325.0,853000,3380.0,3290.0
260,2015/09/15,3235.0,3267.548,3325.0,1024400,3340.0,3235.0
261,2015/09/16,3195.0,3200.963,3280.0,1119000,3285.0,3170.0
262,2015/09/17,3240.0,3212.455,3210.0,822200,3250.0,3155.0
263,2015/09/18,3005.0,3008.524,2902.0,3550300,3110.0,2900.0
264,2015/09/24,2854.0,2926.825,3015.0,2526000,3100.0,2848.0
265,2015/09/25,2912.0,2892.769,2900.0,1610600,2954.0,2851.0
266,2015/09/28,2939.0,2914.725,2920.0,1334500,2948.0,2837.0
267,2015/09/29,2767.0,2799.539,2886.0,1180800,2886.0,2763.0
268,2015/09/30,2838.0,2835.126,2847.0,1246200,2870.0,2805.0
269,2015/10/01,2924.0,2913.949,2917.0,1358000,2950.0,2853.0
270,2015/10/02,2858.0,2866.318,2906.0,1290000,2906.0,2840.0
271,2015/10/05,2966.0,2940.606,2895.0,974700,2969.0,2874.0
272,2015/10/06,3015.0,3000.215,3035.0,1324100,3040.0,2961.0
273,2015/10/07,2968.0,2999.664,3080.0,1435800,3125.0,2946.0
274,2015/10/08,3070.0,3084.071,3065.0,1620300,3140.0,3040.0
275,2015/10/09,3135.0,3142.132,3130.0,1219100,3180.0,3090.0
276,2015/10/13,3140.0,3170.847,3175.0,1234900,3225.0,3135.0
277,2015/10/14,3095.0,3100.206,3105.0,837400,3135.0,3070.0
278,2015/10/15,3140.0,3134.412,3070.0,808300,3175.0,3065.0
279,2015/10/16,3155.0,3152.345,3150.0,783100,3170.0,3125.0
280,2015/10/19,3190.0,3200.376,3180.0,729600,3235.0,3155.0
281,2015/10/20,3210.0,3205.496,3215.0,532200,3220.0,3180.0
282,2015/10/21,3270.0,3251.88,3215.0,753000,3290.0,3195.0
283,2015/10/22,3205.0,3223.877,3250.0,381500,3265.0,3200.0
284,2015/10/23,3285.0,3285.622,3270.0,663600,3315.0,3240.0
285,2015/10/26,3335.0,3364.083,3350.0,955300,3400.0,3325.0
286,2015/10/27,3310.0,3330.007,3315.0,642500,3365.0,3290.0
287,2015/10/28,3320.0,3302.881,3300.0,670600,3345.0,3275.0
288,2015/10/29,3320.0,3323.815,3350.0,726100,3360.0,3295.0
289,2015/10/30,3365.0,3348.61,3295.0,864500,3390.0,3280.0
290,2015/11/02,3240.0,3251.597,3270.0,769800,3295.0,3215.0
291,2015/11/04,3250.0,3271.947,3300.0,919800,3325.0,3240.0
292,2015/11/05,3275.0,3264.124,3280.0,801100,3280.0,3235.0
293,2015/11/06,3320.0,3320.533,3300.0,780900,3365.0,3270.0
294,2015/11/09,2710.0,2744.316,2820.0,6712600,2854.0,2661.0
295,2015/11/10,2818.0,2780.493,2755.0,3867800,2841.0,2714.0
296,2015/11/11,2791.0,2770.722,2760.0,1797000,2796.0,2737.0
297,2015/11/12,2774.0,2758.347,2776.0,1387700,2789.0,2727.0
298,2015/11/13,2789.0,2782.577,2755.0,1023100,2797.0,2740.0
299,2015/11/16,2790.0,2775.986,2750.0,899600,2795.0,2742.0
300,2015/11/17,2739.0,2753.529,2799.0,1646800,2799.0,2734.0
301,2015/11/18,2766.0,2764.13,2757.0,978200,2779.0,2749.0
302,2015/11/19,2804.0,2807.068,2796.0,1268600,2842.0,2779.0
303,2015/11/20,2832.0,2829.921,2792.0,828000,2846.0,2782.0
304,2015/11/24,2835.0,2838.057,2820.0,929000,2859.0,2808.0
305,2015/11/25,2854.0,2846.922,2827.0,667400,2864.0,2811.0
306,2015/11/26,2860.0,2872.169,2845.0,636300,2898.0,2836.0
307,2015/11/27,2829.0,2833.6,2860.0,719900,2879.0,2813.0
308,2015/11/30,2812.0,2812.98,2805.0,805900,2844.0,2774.0
309,2015/12/01,2856.0,2845.587,2820.0,676600,2859.0,2806.0
310,2015/12/02,2794.0,2812.159,2851.0,1302200,2853.0,2793.0
311,2015/12/03,2783.0,2777.742,2790.0,1169800,2797.0,2740.0
312,2015/12/04,2700.0,2702.982,2727.0,1390000,2743.0,2678.0
313,2015/12/07,2716.0,2714.124,2716.0,1392000,2745.0,2696.0
314,2015/12/08,2702.0,2712.536,2715.0,864900,2744.0,2693.0
315,2015/12/09,2700.0,2709.946,2712.0,1193000,2757.0,2681.0
316,2015/12/10,2674.0,2677.687,2680.0,857400,2703.0,2651.0
317,2015/12/11,2615.0,2623.495,2628.0,2087500,2665.0,2604.0
318,2015/12/14,2566.0,2549.305,2570.0,1767900,2580.0,2510.0
319,2015/12/15,2510.0,2528.096,2572.0,862700,2572.0,2510.0
320,2015/12/16,2588.0,2576.084,2551.0,1611000,2603.0,2546.0
321,2015/12/17,2631.0,2638.563,2636.0,1354800,2671.0,2616.0
322,2015/12/18,2527.0,2568.593,2606.0,1874900,2641.0,2525.0
323,2015/12/21,2509.0,2498.303,2510.0,1108700,2530.0,2462.0
324,2015/12/22,2551.0,2541.89,2518.0,673800,2561.0,2508.0
325,2015/12/24,2505.0,2516.171,2550.0,654100,2552.0,2498.0
326,2015/12/25,2483.0,2488.203,2499.0,638800,2507.0,2474.0
327,2015/12/28,2480.0,2484.751,2465.0,532600,2513.0,2455.0
328,2015/12/29,2509.0,2503.947,2453.0,534300,2523.0,2452.0
329,2015/12/30,2524.0,2542.656,2517.0,940200,2567.0,2517.0
330,2016/01/04,2476.0,2486.631,2501.0,886800,2540.0,2463.0
331,2016/01/05,2428.0,2440.7,2455.0,1069500,2476.0,2420.0
332,2016/01/06,2450.0,2437.894,2437.0,1348600,2459.0,2422.0
333,2016/01/07,2429.0,2441.575,2449.0,1639200,2482.0,2422.0
334,2016/01/08,2386.0,2417.808,2409.0,1670300,2478.0,2383.0
335,2016/01/12,2234.0,2286.431,2351.0,2784400,2381.0,2225.0
336,2016/01/13,2270.0,2266.156,2265.0,1934600,2283.0,2237.0
337,2016/01/14,2199.0,2196.172,2220.0,1497300,2240.0,2164.0
338,2016/01/15,2210.0,2239.909,2234.0,1116000,2297.0,2196.0
339,2016/01/18,2184.0,2178.472,2162.0,1028100,2195.0,2148.0
340,2016/01/19,2165.0,2158.133,2152.0,1738600,2178.0,2136.0
341,2016/01/20,2014.0,2051.98,2125.0,1735700,2135.0,2006.0
342,2016/01/21,1955.0,2002.811,2007.0,1953400,2045.0,1955.0
343,2016/01/22,2060.0,2023.531,2026.0,1582100,2064.0,1982.0
344,2016/01/25,2122.0,2111.003,2109.0,1696100,2133.0,2081.0
345,2016/01/26,2078.0,2093.995,2093.0,1172800,2118.0,2075.0
346,2016/01/27,2139.0,2131.731,2121.0,869700,2145.0,2110.0
347,2016/01/28,2127.0,2146.88,2163.0,922200,2180.0,2127.0
348,2016/01/29,2211.0,2177.031,2162.0,1400700,2223.0,2117.0
349,2016/02/01,2275.0,2279.136,2250.0,1300100,2302.0,2247.0
350,2016/02/02,2282.0,2299.145,2281.0,1660600,2319.0,2277.0
351,2016/02/03,2176.0,2185.7,2238.0,1288800,2252.0,2161.0
352,2016/02/04,2132.0,2150.154,2146.0,1040600,2181.0,2132.0
353,2016/02/05,2066.0,2071.257,2050.0,1471400,2117.0,2046.0
354,2016/02/08,2055.0,2043.123,2016.0,1354000,2080.0,2005.0
355,2016/02/09,1925.0,1940.085,1988.0,1948300,2005.0,1904.0
356,2016/02/10,1906.0,1898.412,1934.0,1634400,1965.0,1864.0
357,2016/02/12,1781.0,1812.241,1830.0,1533100,1845.0,1774.0
358,2016/02/15,1809.0,1782.76,1808.0,2975300,1833.0,1734.0
359,2016/02/16,1841.0,1847.735,1790.0,1422100,1890.0,1790.0
360,2016/02/17,1862.0,1883.266,1886.0,1973200,1938.0,1842.0
361,2016/02/18,2032.0,2021.565,1974.0,1996700,2058.0,1972.0
362,2016/02/19,2058.0,2043.724,2005.0,1908500,2072.0,2005.0
363,2016/02/22,2032.0,2040.281,2042.0,1398900,2073.0,2022.0
364,2016/02/23,2036.0,2049.17,2027.0,915800,2086.0,2025.0
365,2016/02/24,2006.0,2005.379,2005.0,789200,2030.0,1980.0
366,2016/02/25,2098.0,2088.317,2066.0,1417800,2123.0,2043.0
367,2016/02/26,2119.0,2131.367,2134.0,1356500,2163.0,2105.0
368,2016/02/29,2056.0,2104.645,2146.0,1650300,2160.0,2056.0
369,2016/03/01,2071.0,2057.2,2051.0,1035500,2087.0,2011.0
370,2016/03/02,2178.0,2167.581,2133.0,1142100,2188.0,2112.0
371,2016/03/03,2212.0,2207.237,2177.0,1123700,2242.0,2161.0
372,2016/03/04,2216.0,2202.869,2199.0,1197200,2223.0,2176.0
373,2016/03/07,2119.0,2135.018,2213.0,1419000,2216.0,2102.0
374,2016/03/08,2085.0,2077.836,2096.0,2242000,2123.0,2037.0
375,2016/03/09,2044.0,2047.861,2084.0,1068200,2106.0,2022.0
376,2016/03/10,1980.0,1986.064,2046.0,2817800,2066.0,1955.0
377,2016/03/11,1986.0,1969.736,1963.0,1967500,2003.0,1922.0
378,2016/03/14,2037.0,2032.566,2011.0,1243700,2048.0,2011.0
379,2016/03/15,2033.0,2036.574,2027.0,1279200,2059.0,2018.0
380,2016/03/16,2046.0,2050.23,2012.0,1235100,2088.0,1993.0
381,2016/03/17,2028.0,2039.903,2057.0,1386600,2086.0,2012.0
382,2016/03/18,2058.0,2063.045,2030.0,2170400,2094.0,2030.0
383,2016/03/22,2123.0,2127.613,2084.0,2642200,2165.0,2081.0
384,2016/03/23,2094.0,2109.193,2121.0,1590600,2144.0,2084.0
385,2016/03/24,2009.0,2028.008,2087.0,1501800,2092.0,2007.0
386,2016/03/25,2043.0,2036.651,2024.0,1172600,2059.0,2014.0
387,2016/03/28,2084.0,2067.173,2054.0,789900,2084.0,2046.0
388,2016/03/29,2112.0,2110.671,2109.0,1428000,2133.0,2083.0
389,2016/03/30,2038.0,2062.161,2101.0,924300,2106.0,2038.0
390,2016/03/31,2005.0,2028.143,2049.0,829200,2076.0,2001.0
391,2016/04/01,1921.0,1947.654,2010.0,943900,2018.0,1913.0
392,2016/04/04,1900.0,1909.595,1931.0,1183300,1940.0,1889.0
393,2016/04/05,1865.0,1881.664,1888.0,812200,1908.0,1863.0
394,2016/04/06,1886.0,1882.448,1880.0,1088200,1902.0,1860.0
395,2016/04/07,1895.0,1894.23,1886.0,634600,1910.0,1868.0
396,2016/04/08,1924.0,1908.275,1855.0,870500,1951.0,1847.0
397,2016/04/11,1903.0,1895.719,1909.0,884100,1926.0,1870.0
398,2016/04/12,1945.0,1942.962,1895.0,1115300,1959.0,1895.0
399,2016/04/13,2047.0,2031.121,1978.0,1451800,2060.0,1968.0
400,2016/04/14,2111.0,2087.661,2076.0,1154600,2111.0,2038.0
401,2016/04/15,2096.0,2103.225,2073.0,938500,2133.0,2069.0
402,2016/04/18,2117.0,2099.416,2064.0,1798600,2125.0,2056.0
403,2016/04/19,2172.0,2172.689,2182.0,1088500,2200.0,2149.0
404,2016/04/20,2270.0,2296.77,2250.0,2681900,2362.0,2235.0
405,2016/04/21,2317.0,2308.649,2305.0,1039400,2336.0,2289.0
406,2016/04/22,2320.0,2302.26,2300.0,872800,2320.0,2281.0
407,2016/04/25,2299.0,2301.758,2329.0,761200,2339.0,2276.0
408,2016/04/26,2266.0,2279.312,2309.0,914900,2335.0,2256.0
409,2016/04/27,2297.0,2292.546,2315.0,968000,2322.0,2275.0
410,2016/04/28,2211.0,2256.237,2311.0,929400,2334.0,2203.0
411,2016/05/02,2158.0,2149.886,2143.0,1277300,2184.0,2131.0
412,2016/05/06,2160.0,2153.599,2158.0,861000,2175.0,2137.0
413,2016/05/09,2133.0,2139.001,2176.0,795400,2182.0,2119.0
414,2016/05/10,2362.0,2413.495,2533.0,4178300,2547.0,2328.0
415,2016/05/11,2317.0,2343.1,2362.0,1765000,2384.0,2314.0
416,2016/05/12,2312.0,2304.707,2308.0,1282900,2328.0,2284.0
417,2016/05/13,2341.0,2355.992,2350.0,1143800,2410.0,2329.0
418,2016/05/16,2382.0,2380.754,2350.0,1059200,2406.0,2343.0
419,2016/05/17,2375.0,2375.399,2392.0,692400,2408.0,2355.0
420,2016/05/18,2370.0,2380.75,2378.0,1105800,2430.0,2342.0
421,2016/05/19,2388.0,2383.897,2399.0,794300,2403.0,2363.0
422,2016/05/20,2459.0,2445.878,2403.0,1203900,2470.0,2403.0
423,2016/05/23,2479.0,2464.938,2449.0,1036300,2482.0,2436.0
424,2016/05/24,2425.0,2435.549,2465.0,761500,2470.0,2417.0
425,2016/05/25,2462.0,2469.944,2462.0,665600,2490.0,2455.0
426,2016/05/26,2498.0,2507.924,2500.0,1021000,2533.0,2483.0
427,2016/05/27,2493.0,2507.838,2512.0,1032000,2545.0,2484.0
428,2016/05/30,2490.0,2481.385,2486.0,587200,2500.0,2462.0
429,2016/05/31,2521.0,2520.204,2481.0,610300,2536.0,2480.0
430,2016/06/01,2521.0,2533.42,2503.0,1055800,2562.0,2502.0
431,2016/06/02,2372.0,2393.189,2493.0,1844500,2508.0,2330.0
432,2016/06/03,2408.0,2406.822,2387.0,816200,2440.0,2380.0
433,2016/06/06,2420.0,2406.24,2376.0,766000,2426.0,2353.0
434,2016/06/07,2418.0,2412.173,2409.0,670900,2423.0,2388.0
435,2016/06/08,2353.0,2358.025,2423.0,1530800,2423.0,2336.0
436,2016/06/09,2325.0,2328.804,2334.0,1032100,2353.0,2307.0
437,2016/06/10,2261.0,2271.283,2317.0,1764400,2330.0,2252.0
438,2016/06/13,2186.0,2192.09,2225.0,1197400,2227.0,2166.0
439,2016/06/14,2155.0,2162.209,2185.0,969800,2200.0,2145.0
440,2016/06/15,2159.0,2160.611,2164.0,716600,2181.0,2137.0
441,2016/06/16,2090.0,2107.219,2163.0,862000,2175.0,2080.0
442,2016/06/17,2093.0,2098.127,2120.0,924400,2120.0,2079.0
443,2016/06/20,1910.0,1919.233,1884.0,3138200,1972.0,1870.0
444,2016/06/21,1907.0,1899.896,1910.0,1095500,1911.0,1890.0
445,2016/06/22,1871.0,1884.163,1910.0,1381000,1913.0,1866.0
446,2016/06/23,1911.0,1905.816,1877.0,1062400,1925.0,1872.0
447,2016/06/24,1757.0,1799.436,1911.0,2238300,1923.0,1745.0
448,2016/06/27,1686.0,1702.404,1757.0,2900500,1771.0,1662.0
449,2016/06/28,1652.0,1641.996,1664.0,2199500,1672.0,1613.0
450,2016/06/29,1722.0,1698.271,1660.0,1839800,1737.0,1622.0
451,2016/06/30,1716.0,1725.961,1724.0,1149900,1758.0,1709.0
452,2016/07/01,1726.0,1714.262,1700.0,1301400,1733.0,1683.0
453,2016/07/04,1743.0,1728.124,1720.0,1212800,1748.0,1686.0
454,2016/07/05,1723.0,1716.383,1729.0,936800,1729.0,1697.0
455,2016/07/06,1611.0,1609.424,1663.0,2234900,1664.0,1581.0
456,2016/07/07,1593.0,1606.255,1631.0,1413600,1635.0,1584.0
457,2016/07/08,1584.0,1597.085,1601.0,990400,1630.0,1578.0
458,2016/07/11,1694.0,1673.981,1600.0,1383400,1709.0,1596.0
459,2016/07/12,1749.0,1745.492,1734.0,2111400,1758.0,1727.0
460,2016/07/13,1791.0,1792.322,1799.0,1138900,1805.0,1770.0
461,2016/07/14,1827.0,1818.207,1801.0,1261400,1836.0,1793.0
462,2016/07/15,1889.0,1890.782,1849.0,1439900,1929.0,1847.0
463,2016/07/19,1900.0,1882.278,1872.0,1580000,1900.0,1840.0
464,2016/07/20,1909.0,1891.373,1895.0,733200,1909.0,1867.0
465,2016/07/21,1934.0,1939.473,1937.0,771400,1969.0,1918.0
466,2016/07/22,1903.0,1908.914,1896.0,734400,1935.0,1883.0
467,2016/07/25,1917.0,1920.925,1917.0,762800,1938.0,1906.0
468,2016/07/26,1861.0,1863.193,1900.0,1034400,1910.0,1835.0
469,2016/07/27,1920.0,1914.205,1899.0,869300,1931.0,1870.0
470,2016/07/28,1885.0,1882.024,1880.0,1777500,1899.0,1847.0
471,2016/07/29,1903.0,1872.757,1877.0,1571100,1906.0,1837.0
472,2016/08/01,1853.0,1856.083,1870.0,723100,1876.0,1835.0
473,2016/08/02,1829.0,1840.951,1840.0,768500,1863.0,1829.0
474,2016/08/03,1780.0,1792.575,1796.0,704400,1818.0,1771.0
475,2016/08/04,1879.0,1841.182,1780.0,1316400,1885.0,1775.0
476,2016/08/05,1872.0,1877.155,1880.0,948000,1900.0,1857.0
477,2016/08/08,2014.0,2012.384,2000.0,2334500,2060.0,1967.0
478,2016/08/09,2031.0,2020.959,2008.0,1296000,2039.0,1993.0
479,2016/08/10,2012.0,2009.4,2014.0,683900,2023.0,1989.0
480,2016/08/12,2113.0,2075.02,2020.0,1177800,2122.0,2001.0
481,2016/08/15,2168.0,2173.236,2144.0,1408200,2205.0,2133.0
482,2016/08/16,2120.0,2139.343,2158.0,988700,2192.0,2101.0
483,2016/08/17,2105.0,2109.395,2116.0,713200,2148.0,2089.0
484,2016/08/18,2058.0,2087.161,2105.0,1021900,2143.0,2057.0
485,2016/08/19,2108.0,2100.401,2062.0,916100,2116.0,2061.0
486,2016/08/22,2123.0,2116.979,2116.0,450600,2130.0,2092.0
487,2016/08/23,2055.0,2066.67,2100.0,606600,2104.0,2048.0
488,2016/08/24,2085.0,2085.522,2077.0,501200,2111.0,2072.0
489,2016/08/25,2080.0,2086.503,2068.0,563100,2109.0,2068.0
490,2016/08/26,2042.0,2048.727,2061.0,490900,2071.0,2033.0
491,2016/08/29,2115.0,2116.91,2092.0,666200,2140.0,2080.0
492,2016/08/30,2069.0,2076.795,2089.0,599900,2113.0,2064.0
493,2016/08/31,2097.0,2092.671,2067.0,669300,2112.0,2066.0
494,2016/09/01,2125.0,2118.789,2120.0,446800,2142.0,2103.0
495,2016/09/02,2124.0,2116.796,2106.0,506200,2128.0,2103.0
496,2016/09/05,2140.0,2133.096,2116.0,1046900,2155.0,2093.0
497,2016/09/06,2160.0,2153.696,2147.0,768600,2165.0,2132.0
498,2016/09/07,2142.0,2137.771,2134.0,838800,2155.0,2124.0
499,2016/09/08,2143.0,2139.023,2141.0,578000,2158.0,2113.0
500,2016/09/09,2144.0,2146.205,2141.0,955100,2159.0,2130.0
501,2016/09/12,2111.0,2103.941,2110.0,736500,2124.0,2091.0
502,2016/09/13,2104.0,2122.927,2148.0,556300,2165.0,2094.0
503,2016/09/14,2079.0,2081.268,2087.0,426200,2094.0,2059.0
504,2016/09/15,2053.0,2045.075,2050.0,685000,2064.0,2017.0
505,2016/09/16,2081.0,2063.495,2042.0,717500,2083.0,2022.0
506,2016/09/20,2094.0,2088.05,2058.0,731400,2102.0,2056.0
507,2016/09/21,2114.0,2073.576,2051.0,1223800,2116.0,2012.0
508,2016/09/23,2099.0,2092.21,2097.0,735200,2112.0,2059.0
509,2016/09/26,2059.0,2069.818,2078.0,445100,2101.0,2054.0
510,2016/09/27,2106.0,2079.965,2034.0,886200,2107.0,2019.0
511,2016/09/28,2067.0,2076.305,2100.0,513400,2125.0,2052.0
512,2016/09/29,2080.0,2076.318,2079.0,490600,2091.0,2049.0
513,2016/09/30,2023.0,2020.523,2023.0,666700,2033.0,1997.0
514,2016/10/03,2037.0,2042.825,2050.0,419200,2059.0,2030.0
515,2016/10/04,2074.0,2070.44,2053.0,418300,2083.0,2053.0
516,2016/10/05,2088.0,2087.773,2086.0,496100,2107.0,2058.0
517,2016/10/06,2141.0,2149.66,2120.0,902000,2186.0,2117.0
518,2016/10/07,2143.0,2135.47,2125.0,513200,2146.0,2116.0
519,2016/10/11,2130.0,2132.86,2127.0,443300,2147.0,2112.0
520,2016/10/12,2109.0,2117.366,2103.0,426900,2140.0,2096.0
521,2016/10/13,2138.0,2137.329,2135.0,525600,2157.0,2113.0
522,2016/10/14,2111.0,2116.276,2126.0,685900,2145.0,2101.0
523,2016/10/17,2136.0,2133.482,2086.0,533600,2159.0,2086.0
524,2016/10/18,2104.0,2103.772,2118.0,719700,2124.0,2088.0
525,2016/10/19,2108.0,2113.669,2103.0,690400,2133.0,2095.0
526,2016/10/20,2170.0,2168.3,2125.0,941700,2193.0,2124.0
527,2016/10/21,2153.0,2170.678,2200.0,685000,2203.0,2150.0
528,2016/10/24,2121.0,2115.296,2141.0,859000,2141.0,2090.0
529,2016/10/25,2198.0,2183.298,2139.0,660100,2201.0,2139.0
530,2016/10/26,2199.0,2182.647,2166.0,519600,2200.0,2146.0
531,2016/10/27,2273.0,2254.316,2200.0,1030700,2275.0,2199.0
532,2016/10/28,2265.0,2267.39,2289.0,1038400,2302.0,2239.0
533,2016/10/31,2242.0,2236.279,2250.0,737600,2259.0,2221.0
534,2016/11/01,2254.0,2242.211,2239.0,418100,2256.0,2218.0
535,2016/11/02,2185.0,2184.993,2213.0,638100,2213.0,2170.0
536,2016/11/04,2168.0,2152.329,2139.0,860100,2174.0,2127.0
537,2016/11/07,2318.0,2315.933,2264.0,1489600,2342.0,2260.0
538,2016/11/08,2281.0,2289.575,2340.0,924400,2348.0,2262.0
539,2016/11/09,2120.0,2158.099,2240.0,2219500,2289.0,2088.0
540,2016/11/10,2289.0,2247.047,2220.0,1429400,2297.0,2198.0
541,2016/11/11,2291.0,2300.941,2322.0,821800,2347.0,2258.0
542,2016/11/14,2381.0,2368.005,2316.0,764000,2393.0,2306.0
543,2016/11/15,2407.0,2396.747,2383.0,679500,2415.0,2365.0
544,2016/11/16,2424.0,2418.85,2436.0,744600,2436.0,2393.0
545,2016/11/17,2429.0,2417.91,2404.0,429900,2429.0,2395.0
546,2016/11/18,2393.0,2397.525,2450.0,852900,2450.0,2377.0
547,2016/11/21,2382.0,2387.867,2400.0,643600,2418.0,2371.0
548,2016/11/22,2388.0,2378.404,2373.0,648300,2391.0,2357.0
549,2016/11/24,2402.0,2393.883,2390.0,826800,2413.0,2355.0
550,2016/11/25,2472.0,2455.379,2410.0,798600,2474.0,2405.0
551,2016/11/28,2448.0,2453.0,2459.0,1030300,2496.0,2430.0
552,2016/11/29,2434.0,2427.411,2415.0,633900,2442.0,2408.0
553,2016/11/30,2408.0,2412.453,2434.0,861000,2442.0,2397.0
554,2016/12/01,2489.0,2486.794,2469.0,1237600,2511.0,2460.0
555,2016/12/02,2457.0,2460.536,2466.0,816700,2486.0,2443.0
556,2016/12/05,2394.0,2401.222,2412.0,1136500,2431.0,2376.0
557,2016/12/06,2421.0,2430.866,2434.0,904700,2467.0,2408.0
558,2016/12/07,2497.0,2490.925,2462.0,799500,2507.0,2461.0
559,2016/12/08,2489.0,2492.104,2535.0,743200,2540.0,2472.0
560,2016/12/09,2503.0,2497.377,2499.0,872000,2516.0,2482.0
561,2016/12/12,2484.0,2488.362,2514.0,637400,2522.0,2453.0
562,2016/12/13,2493.0,2470.775,2460.0,498400,2493.0,2426.0
563,2016/12/14,2446.0,2449.248,2475.0,634300,2475.0,2440.0
564,2016/12/15,2457.0,2463.665,2439.0,746700,2487.0,2433.0
565,2016/12/16,2415.0,2422.61,2450.0,948300,2460.0,2391.0
566,2016/12/19,2450.0,2440.736,2423.0,964300,2460.0,2414.0
567,2016/12/20,2440.0,2430.949,2435.0,613700,2449.0,2412.0
568,2016/12/21,2394.0,2411.158,2450.0,696300,2453.0,2384.0
569,2016/12/22,2383.0,2377.786,2395.0,715600,2404.0,2360.0
570,2016/12/26,2366.0,2378.283,2387.0,393200,2399.0,2365.0
571,2016/12/27,2351.0,2361.228,2376.0,510700,2390.0,2344.0
572,2016/12/28,2347.0,2342.816,2340.0,469800,2360.0,2324.0
573,2016/12/29,2349.0,2348.444,2350.0,524300,2365.0,2329.0
574,2016/12/30,2335.0,2330.72,2327.0,389900,2347.0,2312.0
575,2017/01/04,2409.0,2392.545,2339.0,604500,2409.0,2339.0
576,2017/01/05,2377.0,2384.962,2400.0,589800,2416.0,2366.0
577,2017/01/06,2362.0,2361.656,2350.0,380600,2370.0,2347.0
578,2017/01/10,2332.0,2339.863,2354.0,893600,2372.0,2307.0
579,2017/01/11,2357.0,2352.762,2351.0,389400,2368.0,2342.0
580,2017/01/12,2344.0,2350.993,2379.0,586200,2395.0,2327.0
581,2017/01/13,2353.0,2348.715,2341.0,357200,2359.0,2330.0
582,2017/01/16,2283.0,2295.545,2316.0,636100,2339.0,2277.0
583,2017/01/17,2253.0,2264.89,2290.0,471400,2290.0,2251.0
584,2017/01/18,2249.0,2236.309,2247.0,631300,2257.0,2213.0
585,2017/01/19,2280.0,2282.161,2281.0,494600,2298.0,2268.0
586,2017/01/20,2273.0,2276.084,2269.0,572500,2291.0,2265.0
587,2017/01/23,2213.0,2228.101,2250.0,656200,2252.0,2213.0
588,2017/01/24,2212.0,2214.447,2213.0,510900,2233.0,2200.0
589,2017/01/25,2215.0,2227.98,2250.0,688100,2268.0,2211.0
590,2017/01/26,2233.0,2234.835,2223.0,625500,2250.0,2212.0
591,2017/01/27,2284.0,2285.714,2256.0,1021500,2309.0,2248.0
592,2017/01/30,2258.0,2253.789,2270.0,427800,2272.0,2238.0
593,2017/01/31,2201.0,2210.432,2225.0,1007900,2232.0,2195.0
594,2017/02/01,2150.0,2142.64,2167.0,1304300,2182.0,2120.0
595,2017/02/02,2097.0,2109.922,2146.0,1079000,2148.0,2090.0
596,2017/02/03,2094.0,2097.987,2103.0,748200,2114.0,2084.0
597,2017/02/06,2076.0,2080.66,2101.0,679000,2112.0,2073.0
598,2017/02/07,2053.0,2059.312,2064.0,681600,2084.0,2046.0
599,2017/02/08,2074.0,2080.446,2080.0,867100,2107.0,2067.0
600,2017/02/09,2074.0,2071.605,2080.0,932700,2087.0,2050.0
601,2017/02/10,2148.0,2129.625,2113.0,1144900,2156.0,2086.0
602,2017/02/13,2176.0,2183.478,2186.0,974700,2209.0,2168.0
603,2017/02/14,1950.0,1972.078,1986.0,3306100,2039.0,1943.0
604,2017/02/15,1958.0,1954.113,1948.0,1379000,1961.0,1940.0
605,2017/02/16,1959.0,1957.165,1958.0,606500,1965.0,1948.0
606,2017/02/17,1950.0,1948.973,1949.0,666100,1957.0,1943.0
607,2017/02/20,1956.0,1952.905,1960.0,1000200,1962.0,1944.0
608,2017/02/21,1978.0,1971.241,1954.0,712800,1980.0,1952.0
609,2017/02/22,1989.0,1986.232,1990.0,1014400,1993.0,1976.0
610,2017/02/23,1986.0,1986.939,2000.0,442400,2005.0,1974.0
611,2017/02/24,1994.0,1996.382,1989.0,567400,2006.0,1983.0
612,2017/02/27,1970.0,1975.712,1976.0,832100,1990.0,1961.0
613,2017/02/28,1981.0,1988.056,1982.0,1249300,2001.0,1975.0
614,2017/03/01,1989.0,1991.565,2000.0,1249800,2002.0,1973.0
615,2017/03/02,1995.0,1999.67,2001.0,1262600,2008.0,1991.0
616,2017/03/03,1995.0,1992.278,1999.0,1294200,2002.0,1983.0
617,2017/03/06,1946.0,1954.855,1970.0,1291800,1978.0,1942.0
618,2017/03/07,1950.0,1950.149,1947.0,720700,1957.0,1944.0
619,2017/03/08,1955.0,1950.926,1945.0,1056300,1956.0,1945.0
620,2017/03/09,1945.0,1949.685,1961.0,1155000,1974.0,1943.0
621,2017/03/10,1981.0,1958.898,1950.0,1511700,1983.0,1934.0
622,2017/03/13,1991.0,1990.561,1995.0,798400,1995.0,1983.0
623,2017/03/14,1934.0,1948.822,1975.0,1101000,1975.0,1933.0
624,2017/03/15,1929.0,1922.293,1910.0,1556000,1936.0,1891.0
625,2017/03/16,1897.0,1902.096,1911.0,1314900,1921.0,1893.0
626,2017/03/17,1895.0,1900.062,1899.0,1299100,1917.0,1893.0
627,2017/03/21,1882.0,1881.67,1880.0,1028900,1890.0,1868.0
628,2017/03/22,1848.0,1854.654,1860.0,789300,1869.0,1845.0
629,2017/03/23,1845.0,1841.263,1846.0,973300,1855.0,1826.0
630,2017/03/24,1836.0,1838.647,1844.0,1120700,1846.0,1829.0
631,2017/03/27,1793.0,1797.168,1815.0,1081000,1819.0,1785.0
632,2017/03/28,1815.0,1808.478,1813.0,1200300,1820.0,1799.0
633,2017/03/29,1827.0,1826.354,1825.0,700100,1841.0,1814.0
634,2017/03/30,1795.0,1805.47,1822.0,1012300,1835.0,1790.0
635,2017/03/31,1788.0,1816.282,1819.0,1122900,1851.0,1788.0
636,2017/04/03,1827.0,1825.67,1820.0,963000,1838.0,1811.0
637,2017/04/04,1810.0,1812.705,1827.0,1010200,1830.0,1795.0
638,2017/04/05,1796.0,1803.459,1821.0,830600,1831.0,1791.0
639,2017/04/06,1790.0,1793.969,1800.0,1484800,1811.0,1783.0
640,2017/04/07,1828.0,1823.389,1810.0,1242800,1842.0,1795.0
641,2017/04/10,1856.0,1857.401,1863.0,938400,1868.0,1845.0
642,2017/04/11,1857.0,1855.586,1850.0,645800,1863.0,1849.0
643,2017/04/12,1854.0,1849.476,1837.0,1049300,1858.0,1832.0
644,2017/04/13,1823.0,1822.166,1834.0,986800,1840.0,1811.0
645,2017/04/14,1801.0,1805.907,1809.0,487300,1817.0,1797.0
646,2017/04/17,1832.0,1816.104,1793.0,671000,1832.0,1793.0
647,2017/04/18,1880.0,1870.481,1854.0,982200,1882.0,1850.0
648,2017/04/19,1875.0,1876.681,1881.0,1021200,1894.0,1861.0
649,2017/04/20,1883.0,1881.121,1874.0,723600,1890.0,1865.0
650,2017/04/21,1890.0,1889.712,1900.0,952500,1907.0,1880.0
651,2017/04/24,1926.0,1926.292,1930.0,857400,1938.0,1912.0
652,2017/04/25,1948.0,1947.864,1944.0,1118000,1954.0,1931.0
653,2017/04/26,1992.0,1982.016,1971.0,1169300,1994.0,1958.0
654,2017/04/27,1991.0,1990.403,1995.0,708400,1996.0,1982.0
655,2017/04/28,1971.0,1975.56,1987.0,541200,1993.0,1963.0
656,2017/05/01,1975.0,1963.99,1957.0,525700,1975.0,1952.0
657,2017/05/02,1989.0,1990.144,1973.0,870700,2002.0,1970.0
658,2017/05/08,1996.0,2000.656,2010.0,1488400,2014.0,1989.0
659,2017/05/09,1988.0,1998.84,2015.0,763300,2017.0,1988.0
660,2017/05/10,1922.0,1957.117,2009.0,2347300,2009.0,1911.0
661,2017/05/11,1902.0,1902.058,1922.0,1580200,1925.0,1892.0
662,2017/05/12,1918.0,1913.718,1894.0,829500,1924.0,1892.0
663,2017/05/15,1908.0,1902.327,1894.0,791800,1912.0,1888.0
664,2017/05/16,1903.0,1913.636,1922.0,771100,1932.0,1900.0
665,2017/05/17,1873.0,1877.738,1900.0,860900,1904.0,1870.0
666,2017/05/18,1858.0,1855.243,1851.0,1007400,1863.0,1845.0
667,2017/05/19,1854.0,1849.288,1856.0,840600,1862.0,1837.0
668,2017/05/22,1873.0,1867.938,1860.0,589200,1874.0,1856.0
669,2017/05/23,1849.0,1852.468,1865.0,636400,1870.0,1847.0
670,2017/05/24,1888.0,1885.025,1877.0,597300,1896.0,1876.0
671,2017/05/25,1860.0,1870.309,1880.0,651400,1888.0,1859.0
672,2017/05/26,1878.0,1878.779,1870.0,568100,1884.0,1869.0
673,2017/05/29,1867.0,1870.53,1880.0,497000,1882.0,1862.0
674,2017/05/30,1859.0,1855.458,1867.0,449000,1872.0,1845.0
675,2017/05/31,1856.0,1851.967,1850.0,862800,1857.0,1838.0
676,2017/06/01,1919.0,1910.091,1867.0,1046700,1921.0,1867.0
677,2017/06/02,2005.0,1988.705,1942.0,1742400,2009.0,1931.0
678,2017/06/05,1964.0,1968.511,2000.0,761000,2000.0,1955.0
679,2017/06/06,1915.0,1923.196,1946.0,836000,1951.0,1912.0
680,2017/06/07,1934.0,1925.505,1912.0,713000,1935.0,1903.0
681,2017/06/08,1926.0,1930.48,1941.0,705900,1944.0,1920.0
682,2017/06/09,1916.0,1915.04,1908.0,604100,1931.0,1904.0
683,2017/06/12,1926.0,1921.319,1915.0,390400,1933.0,1904.0
684,2017/06/13,1965.0,1953.378,1932.0,727000,1969.0,1927.0
685,2017/06/14,1959.0,1969.536,1979.0,821000,1979.0,1959.0
686,2017/06/15,1970.0,1969.604,1977.0,1089500,1986.0,1956.0
687,2017/06/16,1990.0,1988.419,1976.0,953300,1997.0,1974.0
688,2017/06/19,2004.0,2004.842,2000.0,854100,2014.0,2000.0
689,2017/06/20,2044.0,2037.054,2014.0,1469000,2051.0,2013.0
690,2017/06/21,1992.0,2003.755,2020.0,726700,2024.0,1988.0
691,2017/06/22,1996.0,1995.983,1998.0,736500,2004.0,1989.0
692,2017/06/23,1990.0,1990.473,1986.0,848900,2000.0,1982.0
693,2017/06/26,1951.0,1963.033,1976.0,848700,1988.0,1950.0
694,2017/06/27,1955.0,1957.368,1964.0,916200,1967.0,1951.0
695,2017/06/28,1971.0,1969.657,1956.0,903800,1979.0,1946.0
696,2017/06/29,2000.0,2002.774,1991.0,1847600,2011.0,1985.0
697,2017/06/30,2082.0,2050.234,2000.0,2360900,2084.0,1998.0
698,2017/07/03,2142.0,2134.84,2110.0,2285700,2155.0,2103.0
699,2017/07/04,2123.0,2137.614,2154.0,1468200,2159.0,2111.0
700,2017/07/05,2152.0,2152.764,2140.0,1175700,2172.0,2140.0
701,2017/07/06,2141.0,2144.456,2150.0,1196500,2165.0,2133.0
702,2017/07/07,2032.0,2053.664,2096.0,2159600,2096.0,2027.0
703,2017/07/10,2017.0,2027.297,2031.0,1582100,2052.0,2010.0
704,2017/07/11,2061.0,2044.156,2015.0,1377700,2066.0,2002.0
705,2017/07/12,2062.0,2053.314,2050.0,1397200,2068.0,2032.0
706,2017/07/13,2006.0,2017.423,2064.0,1380400,2065.0,2000.0
707,2017/07/14,2038.0,2034.769,2016.0,849300,2046.0,2015.0
708,2017/07/18,2042.0,2031.088,2038.0,877200,2047.0,2012.0
709,2017/07/19,1987.0,1993.232,2019.0,1138400,2023.0,1978.0
710,2017/07/20,2015.0,2006.769,1997.0,959500,2017.0,1988.0
711,2017/07/21,2009.0,2006.413,2004.0,498500,2015.0,1997.0
712,2017/07/24,2012.0,2004.238,1988.0,548300,2015.0,1985.0
713,2017/07/25,1991.0,1998.688,2012.0,493300,2021.0,1988.0
714,2017/07/26,2009.0,2007.768,2009.0,695700,2019.0,1999.0
715,2017/07/27,2002.0,2006.434,2005.0,444000,2017.0,2001.0
716,2017/07/28,2012.0,2007.169,2013.0,544700,2018.0,1996.0
717,2017/07/31,2007.0,2010.01,2011.0,428100,2019.0,1996.0
718,2017/08/01,2018.0,2011.617,2003.0,560500,2021.0,1996.0
719,2017/08/02,1930.0,1943.706,1983.0,1713900,1988.0,1925.0
720,2017/08/03,1900.0,1896.534,1917.0,1704100,1917.0,1877.0
721,2017/08/04,1941.0,1929.976,1901.0,1279200,1952.0,1888.0
722,2017/08/07,1833.0,1838.156,1860.0,1684800,1860.0,1810.0
723,2017/08/08,1830.0,1818.074,1839.0,1617400,1845.0,1801.0
724,2017/08/09,1794.0,1795.517,1830.0,1369000,1835.0,1784.0
725,2017/08/10,1763.0,1768.809,1796.0,1323500,1798.0,1757.0
726,2017/08/14,1741.0,1733.532,1739.0,1205000,1743.0,1717.0
727,2017/08/15,1761.0,1763.936,1758.0,1244700,1771.0,1752.0
728,2017/08/16,1765.0,1759.406,1756.0,1109300,1767.0,1738.0
729,2017/08/17,1788.0,1779.55,1779.0,1165400,1791.0,1764.0
730,2017/08/18,1730.0,1732.035,1760.0,1501400,1760.0,1721.0
731,2017/08/21,1700.0,1708.741,1733.0,1534100,1734.0,1697.0
732,2017/08/22,1703.0,1700.223,1698.0,1099200,1708.0,1693.0
733,2017/08/23,1688.0,1695.347,1716.0,1001600,1720.0,1686.0
734,2017/08/24,1679.0,1683.345,1686.0,798300,1693.0,1678.0
735,2017/08/25,1647.0,1656.766,1670.0,1857100,1673.0,1645.0
736,2017/08/28,1643.0,1642.193,1661.0,1395900,1661.0,1635.0
737,2017/08/29,1651.0,1641.885,1635.0,1014300,1653.0,1627.0
738,2017/08/30,1650.0,1649.96,1649.0,1463800,1659.0,1638.0
739,2017/08/31,1657.0,1657.034,1662.0,1433200,1676.0,1647.0
740,2017/09/01,1661.0,1665.546,1677.0,878300,1685.0,1655.0
741,2017/09/04,1634.0,1638.924,1658.0,681800,1661.0,1632.0
742,2017/09/05,1611.0,1624.877,1652.0,1055800,1656.0,1609.0
743,2017/09/06,1624.0,1616.934,1602.0,700600,1628.0,1600.0
744,2017/09/07,1622.0,1631.866,1635.0,756400,1645.0,1621.0
745,2017/09/08,1602.0,1610.315,1613.0,865700,1620.0,1601.0
746,2017/09/11,1612.0,1623.178,1630.0,881400,1641.0,1611.0
747,2017/09/12,1640.0,1636.081,1630.0,817900,1643.0,1626.0
748,2017/09/13,1653.0,1657.469,1658.0,851200,1667.0,1650.0
749,2017/09/14,1648.0,1651.166,1663.0,675900,1664.0,1645.0
750,2017/09/15,1653.0,1651.132,1646.0,755500,1657.0,1641.0
751,2017/09/19,1679.0,1679.559,1670.0,1247100,1692.0,1658.0
752,2017/09/20,1690.0,1682.726,1684.0,747600,1694.0,1671.0
753,2017/09/21,1742.0,1743.216,1708.0,1676400,1764.0,1708.0
754,2017/09/22,1712.0,1717.793,1742.0,1135800,1744.0,1695.0
755,2017/09/25,1713.0,1717.05,1729.0,716400,1737.0,1707.0
756,2017/09/26,1700.0,1702.541,1715.0,693600,1718.0,1696.0
757,2017/09/27,1698.0,1699.521,1701.0,650100,1707.0,1693.0
758,2017/09/28,1676.0,1678.708,1711.0,1233700,1711.0,1668.0
759,2017/09/29,1676.0,1678.969,1678.0,780600,1693.0,1672.0
760,2017/10/02,1686.0,1685.54,1686.0,823500,1695.0,1675.0
761,2017/10/03,1696.0,1694.815,1692.0,1517200,1702.0,1682.0
762,2017/10/04,1685.0,1691.636,1698.0,764600,1703.0,1683.0
763,2017/10/05,1712.0,1719.282,1701.0,2057900,1743.0,1696.0
764,2017/10/06,1715.0,1715.218,1725.0,911600,1726.0,1706.0
765,2017/10/10,1716.0,1709.386,1715.0,921300,1719.0,1697.0
766,2017/10/11,1708.0,1705.784,1713.0,671100,1715.0,1697.0
767,2017/10/12,1709.0,1709.713,1709.0,504800,1717.0,1703.0
768,2017/10/13,1709.0,1703.074,1706.0,789600,1713.0,1693.0
769,2017/10/16,1698.0,1703.362,1710.0,998000,1718.0,1696.0
770,2017/10/17,1684.0,1687.631,1699.0,867300,1706.0,1681.0
771,2017/10/18,1688.0,1685.034,1687.0,678400,1691.0,1678.0
772,2017/10/19,1718.0,1708.074,1694.0,852100,1718.0,1691.0
773,2017/10/20,1724.0,1722.714,1721.0,719500,1731.0,1713.0
774,2017/10/23,1782.0,1771.618,1749.0,1660800,1787.0,1742.0
775,2017/10/24,1791.0,1786.477,1782.0,1220200,1797.0,1775.0
776,2017/10/25,1753.0,1767.361,1798.0,941700,1798.0,1746.0
777,2017/10/26,1739.0,1740.96,1756.0,504400,1756.0,1735.0
778,2017/10/27,1754.0,1752.564,1748.0,722400,1762.0,1741.0
779,2017/10/30,1744.0,1748.112,1759.0,930500,1764.0,1737.0
780,2017/10/31,1727.0,1727.274,1738.0,965800,1738.0,1717.0
781,2017/11/01,1725.0,1731.863,1748.0,910300,1749.0,1722.0
782,2017/11/02,1722.0,1718.06,1725.0,961600,1727.0,1707.0
783,2017/11/06,1600.0,1615.656,1648.0,4156200,1653.0,1595.0
784,2017/11/07,1617.0,1609.803,1606.0,2504000,1622.0,1597.0
785,2017/11/08,1605.0,1603.511,1621.0,2014700,1621.0,1597.0
786,2017/11/09,1621.0,1644.532,1617.0,4523000,1678.0,1615.0
787,2017/11/10,1600.0,1598.395,1608.0,2278900,1620.0,1591.0
788,2017/11/13,1565.0,1577.065,1600.0,1869700,1604.0,1565.0
789,2017/11/14,1599.0,1586.343,1562.0,1694500,1601.0,1560.0
790,2017/11/15,1496.0,1521.589,1560.0,4472200,1572.0,1490.0
791,2017/11/16,1531.0,1519.378,1500.0,2277700,1535.0,1495.0
792,2017/11/17,1529.0,1539.665,1552.0,1735100,1560.0,1524.0
793,2017/11/20,1576.0,1573.131,1558.0,1708900,1586.0,1549.0
794,2017/11/21,1580.0,1592.162,1585.0,1695600,1606.0,1580.0
795,2017/11/22,1576.0,1589.017,1593.0,906400,1602.0,1576.0
796,2017/11/24,1574.0,1570.47,1573.0,988300,1581.0,1552.0
797,2017/11/27,1598.0,1596.175,1589.0,1175700,1602.0,1580.0
798,2017/11/28,1600.0,1597.482,1583.0,1384000,1605.0,1573.0
799,2017/11/29,1600.0,1606.493,1617.0,1919400,1621.0,1597.0
800,2017/11/30,1656.0,1642.242,1613.0,2171100,1659.0,1608.0
801,2017/12/01,1654.0,1658.058,1661.0,1186200,1672.0,1650.0
802,2017/12/04,1618.0,1630.656,1656.0,741200,1656.0,1616.0
803,2017/12/05,1618.0,1616.78,1610.0,1282800,1626.0,1604.0
804,2017/12/06,1597.0,1598.535,1609.0,956600,1613.0,1590.0
805,2017/12/07,1597.0,1598.098,1602.0,1025700,1606.0,1588.0
806,2017/12/08,1628.0,1628.723,1609.0,2015200,1646.0,1609.0
807,2017/12/11,1650.0,1642.662,1629.0,966000,1650.0,1619.0
808,2017/12/12,1702.0,1692.665,1667.0,1573200,1707.0,1667.0
809,2017/12/13,1723.0,1718.208,1709.0,1693600,1727.0,1707.0
810,2017/12/14,1729.0,1725.555,1729.0,1199900,1739.0,1714.0
811,2017/12/15,1730.0,1733.513,1729.0,1652400,1747.0,1725.0
812,2017/12/18,1756.0,1747.065,1743.0,1143800,1763.0,1732.0
813,2017/12/19,1769.0,1777.905,1760.0,1672800,1805.0,1755.0
814,2017/12/20,1801.0,1791.896,1771.0,1480200,1807.0,1762.0
815,2017/12/21,1813.0,1802.642,1799.0,942600,1814.0,1789.0
816,2017/12/22,1800.0,1803.382,1820.0,862000,1828.0,1793.0
817,2017/12/25,1760.0,1764.216,1798.0,1006400,1798.0,1750.0
818,2017/12/26,1758.0,1762.575,1760.0,891000,1774.0,1754.0
819,2017/12/27,1777.0,1771.546,1735.0,1063200,1788.0,1727.0
820,2017/12/28,1784.0,1786.989,1782.0,869600,1797.0,1775.0
821,2017/12/29,1796.0,1792.388,1786.0,494700,1798.0,1781.0
822,2018/01/04,1821.0,1818.637,1824.0,1469800,1829.0,1803.0
823,2018/01/05,1824.0,1824.57,1825.0,816900,1829.0,1819.0
824,2018/01/09,1830.0,1823.665,1830.0,1090700,1837.0,1811.0
825,2018/01/10,1839.0,1836.676,1824.0,942100,1846.0,1821.0
826,2018/01/11,1821.0,1817.584,1821.0,756800,1835.0,1796.0
827,2018/01/12,1810.0,1819.576,1825.0,819300,1836.0,1808.0
828,2018/01/15,1828.0,1822.158,1820.0,1056200,1831.0,1806.0
829,2018/01/16,1793.0,1800.995,1822.0,1195000,1827.0,1790.0
830,2018/01/17,1777.0,1774.782,1771.0,1083000,1787.0,1761.0
831,2018/01/18,1778.0,1790.674,1803.0,880300,1815.0,1777.0
832,2018/01/19,1781.0,1782.449,1790.0,566500,1795.0,1776.0
833,2018/01/22,1822.0,1823.811,1794.0,908500,1838.0,1790.0
834,2018/01/23,1850.0,1835.414,1825.0,1098500,1852.0,1801.0
835,2018/01/24,1866.0,1875.555,1863.0,1121700,1893.0,1860.0
836,2018/01/25,1843.0,1856.67,1860.0,1105700,1880.0,1841.0
837,2018/01/26,1840.0,1842.292,1841.0,991300,1858.0,1832.0
838,2018/01/29,1860.0,1862.431,1845.0,793100,1876.0,1835.0
839,2018/01/30,1830.0,1837.176,1869.0,796400,1870.0,1821.0
840,2018/01/31,1796.0,1815.086,1808.0,901800,1842.0,1796.0
841,2018/02/01,1820.0,1803.815,1787.0,767400,1822.0,1773.0
842,2018/02/02,1819.0,1810.58,1798.0,727000,1822.0,1792.0
843,2018/02/05,1777.0,1776.798,1790.0,648300,1794.0,1766.0
844,2018/02/06,1722.0,1702.349,1700.0,1441900,1723.0,1677.0
845,2018/02/07,1728.0,1757.98,1753.0,985700,1796.0,1727.0
846,2018/02/08,1747.0,1746.202,1737.0,704300,1761.0,1735.0
847,2018/02/09,1724.0,1714.93,1691.0,805400,1734.0,1690.0
848,2018/02/13,1734.0,1745.75,1735.0,1299800,1778.0,1710.0
849,2018/02/14,1730.0,1731.035,1719.0,838500,1747.0,1710.0
850,2018/02/15,1558.0,1562.982,1600.0,3580900,1602.0,1539.0
851,2018/02/16,1601.0,1600.699,1565.0,1940000,1619.0,1565.0
852,2018/02/19,1682.0,1684.465,1643.0,1898100,1713.0,1641.0
853,2018/02/20,1687.0,1691.506,1681.0,867400,1707.0,1673.0
854,2018/02/21,1658.0,1657.397,1667.0,1110800,1667.0,1648.0
855,2018/02/22,1644.0,1644.704,1645.0,1116400,1654.0,1637.0
856,2018/02/23,1683.0,1673.045,1651.0,773900,1692.0,1648.0
857,2018/02/26,1738.0,1738.367,1700.0,1324800,1760.0,1695.0
858,2018/02/27,1735.0,1752.298,1765.0,1208000,1777.0,1727.0
859,2018/02/28,1709.0,1742.05,1734.0,1511400,1787.0,1709.0
860,2018/03/01,1701.0,1707.564,1685.0,1098500,1729.0,1681.0
861,2018/03/02,1717.0,1710.832,1670.0,2028900,1730.0,1662.0
862,2018/03/05,1722.0,1717.14,1700.0,1367600,1742.0,1688.0
863,2018/03/06,1766.0,1767.357,1745.0,897800,1781.0,1740.0
864,2018/03/07,1764.0,1772.222,1752.0,1115200,1800.0,1743.0
865,2018/03/08,1844.0,1851.027,1804.0,2875300,1900.0,1803.0
866,2018/03/09,1858.0,1861.234,1869.0,1702400,1885.0,1837.0
867,2018/03/12,1919.0,1916.663,1900.0,1822900,1933.0,1899.0
868,2018/03/13,1949.0,1935.276,1913.0,998400,1950.0,1912.0
869,2018/03/14,1969.0,1958.807,1935.0,1354500,1976.0,1928.0
870,2018/03/15,1951.0,1931.305,1966.0,1717500,1972.0,1903.0
871,2018/03/16,1914.0,1913.224,1900.0,1620600,1926.0,1899.0
872,2018/03/19,1918.0,1910.893,1911.0,880800,1925.0,1889.0
873,2018/03/20,1965.0,1954.381,1908.0,1163600,1972.0,1908.0
874,2018/03/22,1973.0,1942.883,1940.0,1644200,1979.0,1892.0
875,2018/03/23,1902.0,1919.645,1933.0,1414200,1952.0,1896.0
876,2018/03/26,1868.0,1864.874,1875.0,1440600,1887.0,1850.0
877,2018/03/27,1904.0,1903.687,1908.0,1790600,1972.0,1881.0
878,2018/03/28,1918.0,1902.307,1885.0,1198100,1919.0,1881.0
879,2018/03/29,1961.0,1962.059,1945.0,1221300,1981.0,1942.0
880,2018/03/30,1969.0,1967.843,1982.0,639400,1988.0,1952.0
881,2018/04/02,2001.0,2002.248,1957.0,1157700,2016.0,1954.0
882,2018/04/03,1982.0,1984.898,1970.0,772600,1995.0,1964.0
883,2018/04/04,2059.0,2041.238,2000.0,1779900,2067.0,1982.0
884,2018/04/05,2108.0,2095.886,2086.0,1835300,2117.0,2057.0
885,2018/04/06,2067.0,2075.12,2081.0,1180000,2094.0,2046.0
886,2018/04/09,2062.0,2070.757,2067.0,880000,2086.0,2058.0
887,2018/04/10,2040.0,2055.138,2062.0,1028800,2084.0,2035.0
888,2018/04/11,2017.0,2018.952,2034.0,787700,2035.0,2006.0
889,2018/04/12,2016.0,2014.146,2005.0,893500,2026.0,1990.0
890,2018/04/13,2030.0,2019.946,2034.0,798800,2042.0,1998.0
891,2018/04/16,2022.0,2012.074,2031.0,873500,2038.0,1996.0
892,2018/04/17,2034.0,2039.686,2030.0,646100,2057.0,2030.0
893,2018/04/18,2079.0,2069.529,2054.0,1178400,2092.0,2037.0
894,2018/04/19,2047.0,2054.144,2087.0,789200,2087.0,2043.0
895,2018/04/20,2070.0,2063.605,2021.0,723900,2077.0,2021.0
896,2018/04/23,2071.0,2075.72,2074.0,601900,2094.0,2063.0
897,2018/04/24,2070.0,2073.328,2085.0,604800,2097.0,2064.0
898,2018/04/25,2063.0,2064.109,2061.0,669000,2077.0,2055.0
899,2018/04/26,2055.0,2056.568,2070.0,531800,2073.0,2047.0
900,2018/04/27,2072.0,2069.989,2057.0,970400,2084.0,2046.0
901,2018/05/01,2104.0,2102.889,2072.0,904700,2122.0,2072.0
902,2018/05/02,2060.0,2076.425,2099.0,565800,2104.0,2058.0
903,2018/05/07,2051.0,2053.379,2067.0,689000,2080.0,2037.0
904,2018/05/08,2073.0,2055.794,2025.0,808400,2075.0,2011.0
905,2018/05/09,1849.0,1833.656,1866.0,3217500,1874.0,1808.0
906,2018/05/10,1788.0,1787.99,1850.0,2145900,1851.0,1761.0
907,2018/05/11,1819.0,1812.862,1784.0,1451800,1838.0,1773.0
908,2018/05/14,1851.0,1847.677,1829.0,1332000,1862.0,1822.0
909,2018/05/15,1881.0,1892.483,1874.0,1606500,1910.0,1874.0
910,2018/05/16,1875.0,1877.085,1880.0,995800,1893.0,1867.0
911,2018/05/17,1895.0,1892.131,1879.0,687800,1897.0,1876.0
912,2018/05/18,1943.0,1940.902,1905.0,1318300,1963.0,1905.0
913,2018/05/21,1907.0,1918.585,1922.0,710400,1945.0,1902.0
914,2018/05/22,1879.0,1888.708,1905.0,681600,1915.0,1874.0
915,2018/05/23,1868.0,1865.695,1853.0,894000,1885.0,1833.0
916,2018/05/24,1831.0,1838.72,1856.0,758400,1875.0,1827.0
917,2018/05/25,1821.0,1823.491,1823.0,732200,1840.0,1811.0
918,2018/05/28,1807.0,1809.945,1821.0,661300,1834.0,1792.0
919,2018/05/29,1795.0,1800.368,1811.0,436000,1821.0,1791.0
920,2018/05/30,1788.0,1775.33,1766.0,987200,1791.0,1739.0
921,2018/05/31,1816.0,1815.549,1805.0,942600,1842.0,1801.0
922,2018/06/01,1804.0,1810.881,1810.0,600800,1827.0,1802.0
923,2018/06/04,1813.0,1815.563,1828.0,649600,1831.0,1789.0
924,2018/06/05,1768.0,1777.318,1813.0,900200,1818.0,1764.0
925,2018/06/06,1773.0,1770.602,1763.0,972900,1784.0,1755.0
926,2018/06/07,1789.0,1790.383,1780.0,758000,1807.0,1778.0
927,2018/06/08,1758.0,1773.553,1778.0,760000,1802.0,1757.0
928,2018/06/11,1751.0,1743.137,1757.0,672100,1760.0,1713.0
929,2018/06/12,1781.0,1783.256,1789.0,785600,1801.0,1760.0
930,2018/06/13,1782.0,1783.049,1795.0,390800,1797.0,1771.0
931,2018/06/14,1759.0,1769.227,1774.0,724500,1787.0,1759.0
932,2018/06/15,1763.0,1764.204,1772.0,745300,1779.0,1756.0
933,2018/06/18,1748.0,1762.661,1775.0,654700,1795.0,1746.0
934,2018/06/19,1776.0,1782.743,1748.0,1161600,1806.0,1746.0
935,2018/06/20,1780.0,1773.248,1784.0,831400,1795.0,1752.0
936,2018/06/21,1785.0,1788.163,1778.0,524500,1801.0,1776.0
937,2018/06/22,1808.0,1803.819,1774.0,1343900,1817.0,1771.0
938,2018/06/25,1815.0,1824.379,1817.0,1274600,1842.0,1812.0
939,2018/06/26,1843.0,1830.166,1815.0,1275000,1854.0,1802.0
940,2018/06/27,1858.0,1841.28,1840.0,1018800,1864.0,1807.0
941,2018/06/28,1842.0,1835.441,1818.0,1174300,1849.0,1815.0
942,2018/06/29,1873.0,1872.987,1855.0,1117200,1882.0,1846.0
943,2018/07/02,1788.0,1810.944,1869.0,1360800,1869.0,1785.0
944,2018/07/03,1750.0,1758.439,1769.0,1029200,1787.0,1740.0
945,2018/07/04,1783.0,1775.378,1747.0,505900,1791.0,1746.0
946,2018/07/05,1800.0,1795.319,1782.0,699100,1805.0,1770.0
947,2018/07/06,1813.0,1809.563,1796.0,848400,1821.0,1790.0
948,2018/07/09,1811.0,1814.764,1803.0,529500,1840.0,1799.0
949,2018/07/10,1776.0,1780.311,1806.0,906300,1810.0,1768.0
950,2018/07/11,1793.0,1786.243,1767.0,453400,1801.0,1758.0
951,2018/07/12,1807.0,1818.962,1814.0,489500,1844.0,1807.0
952,2018/07/13,1827.0,1811.383,1818.0,591300,1830.0,1793.0
953,2018/07/17,1845.0,1834.862,1825.0,804400,1855.0,1804.0
954,2018/07/18,1830.0,1824.927,1863.0,1059000,1865.0,1797.0
955,2018/07/19,1836.0,1832.336,1829.0,1049100,1850.0,1810.0
956,2018/07/20,1824.0,1820.609,1826.0,667100,1830.0,1810.0
957,2018/07/23,1849.0,1845.068,1815.0,626600,1855.0,1815.0
958,2018/07/24,1842.0,1853.584,1869.0,409300,1870.0,1840.0
959,2018/07/25,1807.0,1822.523,1852.0,808900,1864.0,1797.0
960,2018/07/26,1810.0,1816.313,1819.0,684800,1843.0,1799.0
961,2018/07/27,1828.0,1825.846,1817.0,470900,1835.0,1810.0
962,2018/07/30,1818.0,1817.775,1828.0,488600,1835.0,1805.0
963,2018/07/31,1813.0,1804.831,1799.0,844000,1826.0,1781.0
964,2018/08/01,1846.0,1844.98,1825.0,734400,1857.0,1825.0
965,2018/08/02,1800.0,1819.802,1853.0,860300,1865.0,1794.0
966,2018/08/03,1770.0,1775.547,1778.0,957100,1806.0,1758.0
967,2018/08/06,1577.0,1612.793,1632.0,3280900,1691.0,1570.0
968,2018/08/07,1597.0,1587.061,1580.0,1799300,1603.0,1576.0
969,2018/08/08,1599.0,1603.692,1597.0,1167300,1626.0,1579.0
970,2018/08/09,1640.0,1624.583,1602.0,1205500,1648.0,1592.0
971,2018/08/10,1635.0,1638.755,1650.0,1209900,1658.0,1617.0
972,2018/08/13,1613.0,1620.048,1620.0,1134900,1635.0,1609.0
973,2018/08/14,1627.0,1621.767,1611.0,826400,1632.0,1603.0
974,2018/08/15,1612.0,1619.879,1627.0,814400,1632.0,1606.0
975,2018/08/16,1606.0,1604.964,1600.0,729600,1623.0,1579.0
976,2018/08/17,1604.0,1602.14,1600.0,1146600,1609.0,1592.0
977,2018/08/20,1599.0,1599.636,1599.0,842000,1618.0,1592.0
978,2018/08/21,1597.0,1594.771,1588.0,957400,1605.0,1578.0
979,2018/08/22,1621.0,1612.456,1597.0,576100,1623.0,1589.0
980,2018/08/23,1637.0,1634.542,1616.0,487500,1644.0,1605.0
981,2018/08/24,1638.0,1649.818,1660.0,765200,1668.0,1634.0
982,2018/08/27,1646.0,1644.777,1646.0,394400,1653.0,1631.0
983,2018/08/28,1642.0,1645.278,1635.0,477500,1657.0,1635.0
984,2018/08/29,1668.0,1666.921,1659.0,598900,1677.0,1650.0
985,2018/08/30,1683.0,1676.258,1684.0,705600,1686.0,1659.0
986,2018/08/31,1662.0,1671.545,1667.0,848300,1692.0,1659.0
987,2018/09/03,1607.0,1616.002,1653.0,593100,1653.0,1599.0
988,2018/09/04,1582.0,1589.02,1600.0,724000,1611.0,1581.0
989,2018/09/05,1592.0,1587.204,1589.0,820300,1599.0,1571.0
990,2018/09/06,1564.0,1570.695,1581.0,562800,1588.0,1562.0
991,2018/09/07,1568.0,1567.424,1560.0,519500,1574.0,1559.0
992,2018/09/10,1571.0,1577.791,1585.0,521700,1595.0,1569.0
993,2018/09/11,1544.0,1544.721,1560.0,714400,1563.0,1533.0
994,2018/09/12,1537.0,1532.841,1543.0,670300,1544.0,1518.0
995,2018/09/13,1555.0,1556.454,1548.0,717500,1572.0,1544.0
996,2018/09/14,1586.0,1580.879,1568.0,814400,1594.0,1565.0
997,2018/09/18,1633.0,1621.72,1579.0,830100,1646.0,1573.0
998,2018/09/19,1645.0,1644.641,1652.0,708300,1657.0,1634.0
999,2018/09/20,1649.0,1647.584,1665.0,742600,1665.0,1637.0
1000,2018/09/21,1632.0,1634.54,1641.0,1020900,1647.0,1627.0
1001,2018/09/25,1627.0,1620.423,1609.0,1166000,1632.0,1602.0
1002,2018/09/26,1610.0,1600.511,1612.0,1294400,1616.0,1585.0
1003,2018/09/27,1637.0,1638.298,1614.0,887800,1656.0,1613.0
1004,2018/09/28,1694.0,1686.081,1650.0,1129800,1697.0,1648.0
1005,2018/10/01,1669.0,1670.435,1709.0,1306700,1715.0,1645.0
1006,2018/10/02,1681.0,1684.136,1681.0,822500,1702.0,1673.0
1007,2018/10/03,1660.0,1671.501,1678.0,675300,1696.0,1653.0
1008,2018/10/04,1709.0,1697.636,1700.0,1231000,1710.0,1675.0
1009,2018/10/05,1713.0,1713.445,1710.0,883500,1733.0,1692.0
1010,2018/10/09,1644.0,1648.386,1680.0,998400,1681.0,1632.0
1011,2018/10/10,1668.0,1664.043,1660.0,505200,1671.0,1650.0
1012,2018/10/11,1586.0,1589.775,1608.0,1195800,1616.0,1574.0
1013,2018/10/12,1594.0,1588.1,1575.0,513500,1595.0,1574.0
1014,2018/10/15,1597.0,1600.316,1589.0,1329500,1618.0,1574.0
1015,2018/10/16,1644.0,1632.087,1606.0,714100,1646.0,1606.0
1016,2018/10/17,1708.0,1700.052,1676.0,913000,1712.0,1673.0
1017,2018/10/18,1746.0,1751.234,1735.0,1277600,1765.0,1733.0
1018,2018/10/19,1757.0,1742.682,1713.0,1330200,1760.0,1713.0
1019,2018/10/22,1711.0,1716.133,1749.0,1019600,1749.0,1696.0
1020,2018/10/23,1676.0,1683.601,1706.0,787100,1708.0,1671.0
1021,2018/10/24,1709.0,1706.808,1705.0,1163300,1719.0,1684.0
1022,2018/10/25,1637.0,1646.219,1670.0,1033600,1682.0,1631.0
1023,2018/10/26,1624.0,1636.541,1667.0,1036800,1675.0,1616.0
1024,2018/10/29,1637.0,1645.734,1640.0,658100,1662.0,1636.0
1025,2018/10/30,1630.0,1629.012,1639.0,1294400,1651.0,1611.0
1026,2018/10/31,1640.0,1641.484,1650.0,1042200,1659.0,1627.0
1027,2018/11/01,1661.0,1663.147,1641.0,1177200,1694.0,1637.0
1028,2018/11/02,1688.0,1681.856,1668.0,906700,1696.0,1645.0
1029,2018/11/05,1453.0,1481.947,1520.0,4579100,1556.0,1442.0
1030,2018/11/06,1485.0,1464.105,1441.0,2169400,1486.0,1440.0
1031,2018/11/07,1473.0,1475.689,1460.0,1602400,1493.0,1453.0
1032,2018/11/08,1526.0,1518.11,1497.0,1102800,1535.0,1482.0
1033,2018/11/09,1536.0,1550.031,1545.0,858800,1573.0,1535.0
1034,2018/11/12,1544.0,1541.827,1520.0,545200,1555.0,1518.0
1035,2018/11/13,1521.0,1514.144,1508.0,961900,1525.0,1496.0
1036,2018/11/14,1549.0,1556.405,1542.0,947400,1574.0,1542.0
1037,2018/11/15,1585.0,1578.329,1561.0,1049800,1587.0,1552.0
1038,2018/11/16,1588.0,1582.609,1580.0,911500,1598.0,1564.0
1039,2018/11/19,1584.0,1577.053,1588.0,928000,1599.0,1562.0
1040,2018/11/20,1520.0,1525.266,1534.0,1181400,1538.0,1514.0
1041,2018/11/21,1500.0,1506.119,1500.0,995800,1530.0,1497.0
1042,2018/11/22,1557.0,1545.817,1520.0,1049500,1563.0,1520.0
1043,2018/11/26,1590.0,1584.691,1568.0,583800,1594.0,1565.0
1044,2018/11/27,1598.0,1598.582,1617.0,728900,1618.0,1581.0
1045,2018/11/28,1615.0,1611.669,1612.0,426100,1620.0,1598.0
1046,2018/11/29,1631.0,1629.031,1630.0,408700,1638.0,1617.0
1047,2018/11/30,1636.0,1629.815,1637.0,1101300,1638.0,1608.0
1048,2018/12/03,1676.0,1661.108,1646.0,1354000,1688.0,1625.0
1049,2018/12/04,1670.0,1672.722,1677.0,842000,1687.0,1662.0
1050,2018/12/05,1690.0,1677.878,1630.0,920900,1690.0,1628.0
1051,2018/12/06,1685.0,1675.205,1676.0,1076100,1687.0,1657.0
1052,2018/12/07,1663.0,1661.886,1678.0,832600,1686.0,1638.0
1053,2018/12/10,1618.0,1621.629,1636.0,653000,1648.0,1610.0
1054,2018/12/11,1632.0,1626.047,1630.0,559300,1644.0,1610.0
1055,2018/12/12,1603.0,1603.609,1613.0,1098300,1621.0,1588.0
1056,2018/12/13,1629.0,1631.148,1626.0,585600,1639.0,1618.0
1057,2018/12/14,1610.0,1613.957,1621.0,811100,1642.0,1593.0
1058,2018/12/17,1583.0,1587.182,1606.0,654200,1608.0,1578.0
1059,2018/12/18,1503.0,1513.562,1560.0,1091900,1562.0,1493.0
1060,2018/12/19,1491.0,1487.711,1503.0,632100,1507.0,1474.0
1061,2018/12/20,1454.0,1466.486,1477.0,679900,1509.0,1447.0
1062,2018/12/21,1421.0,1418.508,1437.0,1083300,1446.0,1403.0
1063,2018/12/25,1315.0,1324.491,1361.0,791500,1365.0,1302.0
1064,2018/12/26,1316.0,1318.913,1329.0,534300,1344.0,1300.0
1065,2018/12/27,1427.0,1411.951,1384.0,1100000,1435.0,1377.0
1066,2018/12/28,1405.0,1400.561,1398.0,1104600,1413.0,1381.0
1067,2019/01/04,1398.0,1382.99,1391.0,1159000,1409.0,1352.0
1068,2019/01/07,1454.0,1450.772,1450.0,825300,1462.0,1442.0
1069,2019/01/08,1447.0,1447.569,1455.0,602100,1459.0,1431.0
1070,2019/01/09,1485.0,1494.087,1486.0,953900,1514.0,1482.0
1071,2019/01/10,1456.0,1453.148,1455.0,630200,1461.0,1440.0
1072,2019/01/11,1468.0,1472.036,1483.0,644400,1493.0,1462.0
1073,2019/01/15,1455.0,1459.754,1449.0,736100,1477.0,1444.0
1074,2019/01/16,1477.0,1482.798,1479.0,812100,1499.0,1473.0
1075,2019/01/17,1501.0,1503.354,1493.0,799200,1519.0,1489.0
1076,2019/01/18,1525.0,1534.514,1548.0,777200,1553.0,1519.0
1077,2019/01/21,1561.0,1566.548,1557.0,665000,1579.0,1557.0
1078,2019/01/22,1564.0,1561.811,1562.0,519500,1574.0,1551.0
1079,2019/01/23,1541.0,1543.735,1545.0,563700,1552.0,1533.0
1080,2019/01/24,1534.0,1531.714,1526.0,834700,1542.0,1517.0
1081,2019/01/25,1546.0,1548.643,1537.0,684400,1562.0,1535.0
1082,2019/01/28,1562.0,1563.005,1540.0,634100,1576.0,1537.0
1083,2019/01/29,1574.0,1570.391,1563.0,692200,1581.0,1551.0
1084,2019/01/30,1526.0,1528.138,1558.0,1122700,1567.0,1510.0
1085,2019/01/31,1570.0,1567.355,1580.0,747000,1586.0,1548.0
1086,2019/02/01,1566.0,1570.143,1580.0,661500,1594.0,1556.0
1087,2019/02/04,1595.0,1596.391,1578.0,663900,1612.0,1576.0
1088,2019/02/05,1673.0,1647.172,1596.0,1323200,1676.0,1596.0
1089,2019/02/06,1654.0,1657.28,1670.0,619400,1676.0,1643.0
1090,2019/02/07,1648.0,1640.319,1652.0,496100,1662.0,1629.0
1091,2019/02/08,1605.0,1609.708,1625.0,498300,1635.0,1595.0
1092,2019/02/12,1621.0,1617.193,1608.0,796500,1632.0,1591.0
1093,2019/02/13,1652.0,1652.695,1642.0,821800,1663.0,1630.0
1094,2019/02/14,1569.0,1547.756,1492.0,2285500,1590.0,1492.0
1095,2019/02/15,1568.0,1580.558,1590.0,1168900,1624.0,1551.0
1096,2019/02/18,1519.0,1518.694,1596.0,1563200,1597.0,1483.0
1097,2019/02/19,1492.0,1493.055,1507.0,1160600,1511.0,1482.0
1098,2019/02/20,1487.0,1485.87,1477.0,857100,1493.0,1473.0
1099,2019/02/21,1460.0,1455.794,1480.0,1456900,1485.0,1437.0
1100,2019/02/22,1454.0,1448.375,1447.0,980500,1461.0,1434.0
1101,2019/02/25,1465.0,1461.195,1464.0,732300,1469.0,1448.0
1102,2019/02/26,1485.0,1483.245,1472.0,893900,1494.0,1470.0
1103,2019/02/27,1478.0,1480.344,1493.0,1009900,1504.0,1466.0
1104,2019/02/28,1482.0,1480.648,1490.0,802000,1490.0,1465.0
1105,2019/03/01,1487.0,1483.666,1474.0,601500,1491.0,1473.0
1106,2019/03/04,1494.0,1491.173,1496.0,965900,1500.0,1478.0
1107,2019/03/05,1503.0,1492.274,1487.0,680000,1503.0,1473.0
1108,2019/03/06,1461.0,1467.165,1498.0,935500,1500.0,1456.0
1109,2019/03/07,1447.0,1447.212,1448.0,1451500,1461.0,1438.0
1110,2019/03/08,1366.0,1378.618,1400.0,1717200,1415.0,1357.0
1111,2019/03/11,1340.0,1344.862,1376.0,1177700,1381.0,1330.0
1112,2019/03/12,1388.0,1387.455,1363.0,1269800,1407.0,1356.0
1113,2019/03/13,1397.0,1399.617,1386.0,1111100,1418.0,1380.0
1114,2019/03/14,1386.0,1390.08,1406.0,989800,1415.0,1374.0
1115,2019/03/15,1413.0,1410.16,1405.0,1150800,1418.0,1387.0
1116,2019/03/18,1421.0,1415.423,1425.0,629500,1428.0,1405.0
1117,2019/03/19,1419.0,1421.661,1420.0,718600,1443.0,1397.0
1118,2019/03/20,1432.0,1423.977,1416.0,633500,1435.0,1406.0
1119,2019/03/22,1427.0,1427.797,1436.0,701500,1442.0,1420.0
1120,2019/03/25,1396.0,1384.091,1392.0,802200,1398.0,1362.0
1121,2019/03/26,1449.0,1449.777,1433.0,1242600,1464.0,1425.0
1122,2019/03/27,1479.0,1475.974,1477.0,990100,1484.0,1464.0
1123,2019/03/28,1465.0,1461.626,1461.0,1414000,1473.0,1439.0
1124,2019/03/29,1485.0,1482.813,1497.0,1174700,1500.0,1470.0
1125,2019/04/01,1512.0,1509.759,1501.0,1003500,1523.0,1491.0
1126,2019/04/02,1511.0,1514.962,1531.0,838700,1535.0,1503.0
1127,2019/04/03,1522.0,1528.12,1531.0,641300,1545.0,1518.0
1128,2019/04/04,1534.0,1532.792,1534.0,483700,1539.0,1523.0
1129,2019/04/05,1529.0,1529.652,1531.0,403900,1539.0,1521.0
1130,2019/04/08,1513.0,1517.661,1533.0,481700,1543.0,1506.0
1131,2019/04/09,1483.0,1483.921,1494.0,715800,1498.0,1471.0
1132,2019/04/10,1448.0,1449.14,1454.0,924700,1465.0,1434.0
1133,2019/04/11,1429.0,1429.852,1452.0,994400,1453.0,1413.0
1134,2019/04/12,1416.0,1417.458,1440.0,757100,1441.0,1407.0
1135,2019/04/15,1439.0,1445.393,1452.0,571700,1472.0,1437.0
1136,2019/04/16,1413.0,1417.967,1427.0,678900,1435.0,1411.0
1137,2019/04/17,1395.0,1401.904,1413.0,1203200,1419.0,1393.0
1138,2019/04/18,1354.0,1365.163,1394.0,943100,1396.0,1350.0
1139,2019/04/19,1320.0,1333.906,1360.0,1077500,1373.0,1320.0
1140,2019/04/22,1303.0,1304.883,1318.0,987100,1319.0,1297.0
1141,2019/04/23,1307.0,1305.733,1303.0,898200,1316.0,1294.0
1142,2019/04/24,1317.0,1312.784,1307.0,1115800,1321.0,1300.0
1143,2019/04/25,1344.0,1341.154,1330.0,1254000,1351.0,1327.0
1144,2019/04/26,1365.0,1353.253,1330.0,1409300,1370.0,1328.0
1145,2019/05/07,1310.0,1322.374,1359.0,2203100,1365.0,1303.0
1146,2019/05/08,1307.0,1305.137,1308.0,2264600,1321.0,1294.0
1147,2019/05/09,1343.0,1331.754,1297.0,2551000,1360.0,1288.0
1148,2019/05/10,1345.0,1357.207,1355.0,1994500,1389.0,1339.0
1149,2019/05/13,1336.0,1344.105,1346.0,1400700,1366.0,1330.0
1150,2019/05/14,1288.0,1284.318,1276.0,2440500,1298.0,1269.0
1151,2019/05/15,1317.0,1315.11,1301.0,1338300,1329.0,1295.0
1152,2019/05/16,1300.0,1311.919,1332.0,1371500,1350.0,1297.0
1153,2019/05/17,1293.0,1285.257,1287.0,1796100,1299.0,1267.0
1154,2019/05/20,1288.0,1294.148,1311.0,1312100,1316.0,1281.0
1155,2019/05/21,1302.0,1292.387,1287.0,1364900,1302.0,1270.0
1156,2019/05/22,1304.0,1292.573,1302.0,1420500,1306.0,1276.0
1157,2019/05/23,1330.0,1325.368,1309.0,1146400,1334.0,1308.0
1158,2019/05/24,1333.0,1331.675,1329.0,1170100,1341.0,1313.0
1159,2019/05/27,1334.0,1336.21,1342.0,984700,1348.0,1329.0
1160,2019/05/28,1290.0,1294.845,1338.0,11448600,1342.0,1290.0
1161,2019/05/29,1293.0,1293.525,1279.0,1707900,1305.0,1279.0
1162,2019/05/30,1223.0,1235.6,1272.0,1646200,1287.0,1212.0
1163,2019/05/31,1198.0,1209.7,1212.0,1869800,1231.0,1198.0
1164,2019/06/03,1194.0,1189.564,1182.0,1369500,1201.0,1171.0
1165,2019/06/04,1203.0,1208.765,1208.0,1296600,1222.0,1202.0
1166,2019/06/05,1231.0,1224.361,1220.0,1613600,1237.0,1204.0
1167,2019/06/06,1233.0,1233.017,1230.0,881300,1244.0,1223.0
1168,2019/06/07,1241.0,1241.072,1231.0,954700,1251.0,1225.0
1169,2019/06/10,1255.0,1259.728,1260.0,884200,1267.0,1254.0
1170,2019/06/11,1259.0,1258.373,1254.0,819400,1271.0,1242.0
1171,2019/06/12,1224.0,1228.551,1235.0,1313300,1249.0,1220.0
1172,2019/06/13,1212.0,1208.351,1207.0,1220100,1223.0,1198.0
1173,2019/06/14,1220.0,1219.386,1212.0,995000,1231.0,1203.0
1174,2019/06/17,1214.0,1215.666,1220.0,679500,1227.0,1209.0
1175,2019/06/18,1195.0,1202.213,1203.0,942500,1227.0,1188.0
1176,2019/06/19,1208.0,1215.035,1209.0,1207400,1228.0,1204.0
1177,2019/06/20,1196.0,1196.925,1212.0,1055800,1212.0,1188.0
1178,2019/06/21,1158.0,1169.409,1198.0,1610900,1199.0,1156.0
1179,2019/06/24,1202.0,1189.238,1155.0,1497200,1203.0,1151.0
1180,2019/06/25,1171.0,1171.967,1181.0,1369200,1188.0,1163.0
1181,2019/06/26,1146.0,1151.48,1160.0,1561700,1168.0,1139.0
1182,2019/06/27,1155.0,1150.716,1146.0,924800,1157.0,1137.0
1183,2019/06/28,1167.0,1165.611,1151.0,1090100,1176.0,1151.0
1184,2019/07/01,1198.0,1192.164,1190.0,985000,1198.0,1185.0
1185,2019/07/02,1205.0,1207.401,1198.0,989100,1216.0,1198.0
1186,2019/07/03,1183.0,1191.261,1203.0,799600,1210.0,1181.0
1187,2019/07/04,1206.0,1204.336,1201.0,735100,1211.0,1197.0
1188,2019/07/05,1206.0,1204.442,1202.0,680400,1214.0,1189.0
1189,2019/07/08,1194.0,1201.027,1200.0,795100,1213.0,1192.0
1190,2019/07/09,1186.0,1188.481,1192.0,688600,1199.0,1181.0
1191,2019/07/10,1170.0,1168.924,1166.0,856600,1175.0,1160.0
1192,2019/07/11,1186.0,1181.378,1178.0,655600,1187.0,1173.0
1193,2019/07/12,1158.0,1167.706,1184.0,697000,1187.0,1157.0
1194,2019/07/16,1154.0,1155.556,1157.0,759600,1165.0,1146.0
1195,2019/07/17,1165.0,1162.823,1156.0,772000,1168.0,1153.0
1196,2019/07/18,1131.0,1135.737,1152.0,1057300,1154.0,1122.0
1197,2019/07/19,1159.0,1155.768,1134.0,837300,1167.0,1132.0
1198,2019/07/22,1157.0,1157.747,1154.0,515900,1167.0,1149.0
1199,2019/07/23,1177.0,1173.091,1161.0,560400,1178.0,1160.0
1200,2019/07/24,1172.0,1177.579,1202.0,820600,1204.0,1164.0
1201,2019/07/25,1177.0,1173.238,1168.0,703300,1178.0,1164.0
1202,2019/07/26,1184.0,1184.581,1185.0,765300,1190.0,1177.0
1203,2019/07/29,1188.0,1185.225,1188.0,724400,1191.0,1177.0
1204,2019/07/30,1190.0,1190.743,1195.0,2228400,1199.0,1181.0
1205,2019/07/31,1174.0,1178.828,1190.0,776900,1191.0,1172.0
1206,2019/08/01,1145.0,1142.139,1153.0,1083800,1156.0,1133.0
1207,2019/08/02,1126.0,1132.914,1131.0,1342700,1151.0,1118.0
1208,2019/08/05,1395.0,1382.744,1426.0,8440500,1426.0,1322.0
1209,2019/08/06,1463.0,1410.806,1347.0,5055300,1472.0,1316.0
1210,2019/08/07,1504.0,1502.259,1511.0,4976300,1534.0,1463.0
1211,2019/08/08,1563.0,1524.832,1496.0,3869100,1577.0,1465.0
1212,2019/08/09,1541.0,1557.027,1546.0,2506600,1589.0,1537.0
1213,2019/08/13,1549.0,1541.212,1519.0,2238900,1558.0,1514.0
1214,2019/08/14,1504.0,1517.323,1549.0,2328900,1562.0,1485.0
1215,2019/08/15,1500.0,1485.532,1475.0,1920100,1507.0,1460.0
1216,2019/08/16,1455.0,1460.243,1487.0,2049700,1492.0,1443.0
1217,2019/08/19,1459.0,1459.304,1469.0,1317000,1482.0,1443.0
1218,2019/08/20,1384.0,1399.139,1456.0,2667200,1458.0,1374.0
1219,2019/08/21,1390.0,1376.621,1384.0,2341000,1396.0,1347.0
1220,2019/08/22,1372.0,1369.292,1378.0,1602500,1382.0,1343.0
1221,2019/08/23,1374.0,1381.909,1390.0,1672300,1411.0,1366.0
