,Date,Close,VWAP,Open,Volume,High,Low
0,2014/08/25,17945.0,17963.77,18015.0,512600,18020.0,17915.0
1,2014/08/26,17800.0,17853.73,17945.0,552000,17945.0,17800.0
2,2014/08/27,17880.0,17843.255,17780.0,493900,17915.0,17750.0
3,2014/08/28,17710.0,17739.637,17775.0,489200,17815.0,17695.0
4,2014/08/29,17400.0,17443.733,17570.0,1210500,17620.0,17370.0
5,2014/09/01,17340.0,17357.478,17395.0,503000,17425.0,17335.0
6,2014/09/02,17640.0,17622.596,17470.0,1089200,17760.0,17435.0
7,2014/09/03,17965.0,18016.465,17945.0,1216500,18125.0,17895.0
8,2014/09/04,18050.0,18105.205,18055.0,1281500,18230.0,17980.0
9,2014/09/05,18430.0,18372.833,18200.0,1808300,18480.0,18140.0
10,2014/09/08,18660.0,18597.2,18500.0,1267500,18720.0,18425.0
11,2014/09/09,18735.0,18657.993,18670.0,1266400,18770.0,18485.0
12,2014/09/10,18765.0,18820.669,18725.0,1076300,19015.0,18665.0
13,2014/09/11,18795.0,18781.614,18900.0,799400,18900.0,18660.0
14,2014/09/12,18655.0,18748.804,18775.0,2457000,18880.0,18550.0
15,2014/09/16,18500.0,18527.161,18500.0,855200,18630.0,18460.0
16,2014/09/17,18430.0,18475.931,18530.0,780800,18625.0,18420.0
17,2014/09/18,18845.0,18800.839,18735.0,989400,18910.0,18590.0
18,2014/09/19,19320.0,19246.914,19115.0,1455400,19465.0,18930.0
19,2014/09/22,19265.0,19200.422,19205.0,905600,19300.0,19120.0
20,2014/09/24,19420.0,19397.5,19185.0,1004600,19535.0,19170.0
21,2014/09/25,19505.0,19562.901,19600.0,1252700,19950.0,19305.0
22,2014/09/26,20310.0,20311.546,20500.0,2285700,20590.0,20060.0
23,2014/09/29,20040.0,20073.122,20315.0,1451800,20400.0,19870.0
24,2014/09/30,19810.0,19762.26,19960.0,1279000,19980.0,19580.0
25,2014/10/01,19785.0,19773.715,19930.0,1009400,19965.0,19610.0
26,2014/10/02,19195.0,19365.578,19600.0,1426700,19695.0,19150.0
27,2014/10/03,19235.0,19076.913,19000.0,1406500,19235.0,18915.0
28,2014/10/06,19450.0,19446.66,19580.0,1128800,19580.0,19270.0
29,2014/10/07,19230.0,19288.271,19245.0,828900,19385.0,19190.0
30,2014/10/08,18830.0,18854.907,18935.0,1105300,18955.0,18770.0
31,2014/10/09,18665.0,18837.753,18960.0,1045700,19140.0,18625.0
32,2014/10/10,18175.0,18216.55,18345.0,2288600,18540.0,18010.0
33,2014/10/14,18005.0,18018.236,17895.0,1741800,18170.0,17850.0
34,2014/10/15,18150.0,18008.967,18000.0,1501100,18185.0,17820.0
35,2014/10/16,17955.0,17881.286,17800.0,2070800,18080.0,17665.0
36,2014/10/17,17695.0,17839.903,17900.0,1363600,18095.0,17670.0
37,2014/10/20,18695.0,18468.535,18100.0,1800200,18695.0,18100.0
38,2014/10/21,18125.0,18325.098,18790.0,1414900,18800.0,18035.0
39,2014/10/22,18465.0,18361.365,18465.0,1248000,18515.0,18165.0
40,2014/10/23,18525.0,18536.052,18340.0,1130300,18665.0,18300.0
41,2014/10/24,18715.0,18761.12,18820.0,1119700,18940.0,18630.0
42,2014/10/27,17910.0,18047.687,18250.0,1874200,18330.0,17890.0
43,2014/10/28,17720.0,17739.041,17910.0,1527300,17925.0,17635.0
44,2014/10/29,18050.0,18018.283,17865.0,1285900,18140.0,17810.0
45,2014/10/30,17790.0,17853.129,17925.0,2846100,18040.0,17770.0
46,2014/10/31,19120.0,18754.134,18190.0,3276600,19430.0,18125.0
47,2014/11/04,19660.0,19845.281,20100.0,2774300,20140.0,19605.0
48,2014/11/05,19605.0,19608.725,19685.0,1601700,19825.0,19440.0
49,2014/11/06,19690.0,19800.046,19770.0,1676500,20060.0,19565.0
50,2014/11/07,19965.0,19917.797,19940.0,1037200,19965.0,19775.0
51,2014/11/10,19660.0,19682.475,19680.0,822500,19825.0,19595.0
52,2014/11/11,20090.0,19956.067,19800.0,1230000,20115.0,19770.0
53,2014/11/12,20310.0,20466.17,20345.0,1946600,20645.0,20300.0
54,2014/11/13,20550.0,20397.574,20310.0,1006500,20585.0,20085.0
55,2014/11/14,20590.0,20570.188,20705.0,2038400,20710.0,20275.0
56,2014/11/17,19760.0,19990.355,20380.0,1609800,20520.0,19660.0
57,2014/11/18,20170.0,20149.127,20000.0,868300,20245.0,19995.0
58,2014/11/19,19900.0,20052.743,20235.0,1108700,20370.0,19870.0
59,2014/11/20,19900.0,19928.779,19960.0,728100,20040.0,19765.0
60,2014/11/21,20160.0,20010.389,20100.0,1090900,20210.0,19735.0
61,2014/11/25,19985.0,20019.862,20295.0,1171300,20300.0,19850.0
62,2014/11/26,19910.0,19934.048,19985.0,735400,20025.0,19870.0
63,2014/11/27,19875.0,19888.5,19855.0,644400,19995.0,19805.0
64,2014/11/28,20020.0,20015.398,19835.0,706800,20100.0,19810.0
65,2014/12/01,20260.0,20256.682,20080.0,753300,20450.0,19960.0
66,2014/12/02,20280.0,20188.774,19990.0,653400,20340.0,19965.0
67,2014/12/03,20410.0,20428.961,20200.0,1056000,20565.0,20160.0
68,2014/12/04,20865.0,20866.805,20595.0,1203900,21040.0,20555.0
69,2014/12/05,21120.0,21080.567,20905.0,1043400,21230.0,20805.0
70,2014/12/08,20980.0,21060.65,21370.0,1151700,21440.0,20900.0
71,2014/12/09,20795.0,20775.667,20800.0,804600,20875.0,20715.0
72,2014/12/10,20115.0,20254.895,20545.0,1475900,20595.0,20065.0
73,2014/12/11,19850.0,19850.71,19815.0,1116100,20150.0,19720.0
74,2014/12/12,19990.0,19908.69,19850.0,2541000,20155.0,19850.0
75,2014/12/15,19780.0,19765.57,19600.0,1085300,20000.0,19570.0
76,2014/12/16,19190.0,19285.363,19525.0,1686300,19630.0,19135.0
77,2014/12/17,19390.0,19298.466,19000.0,1465500,19435.0,18980.0
78,2014/12/18,19790.0,19731.826,19780.0,1399200,19880.0,19585.0
79,2014/12/19,20395.0,20269.058,20190.0,1312300,20395.0,19920.0
80,2014/12/22,20100.0,20129.711,20395.0,971700,20400.0,20005.0
81,2014/12/24,20245.0,20247.132,20280.0,768000,20350.0,20160.0
82,2014/12/25,20145.0,20152.165,20150.0,446300,20235.0,20110.0
83,2014/12/26,20225.0,20224.979,20215.0,474200,20295.0,20150.0
84,2014/12/29,20240.0,20203.941,20375.0,884800,20375.0,19940.0
85,2014/12/30,19945.0,20114.093,20210.0,813200,20345.0,19945.0
86,2015/01/05,19730.0,19778.357,19750.0,936300,19970.0,19665.0
87,2015/01/06,19175.0,19227.23,19330.0,1476100,19390.0,19140.0
88,2015/01/07,19020.0,19011.592,19050.0,1394200,19105.0,18900.0
89,2015/01/08,19260.0,19236.188,19115.0,1121300,19370.0,19060.0
90,2015/01/09,19375.0,19424.76,19410.0,1362200,19525.0,19320.0
91,2015/01/13,19225.0,19022.609,18875.0,1171600,19250.0,18825.0
92,2015/01/14,18895.0,19000.35,19125.0,1029100,19275.0,18850.0
93,2015/01/15,19085.0,19019.226,18925.0,825500,19145.0,18870.0
94,2015/01/16,19035.0,18872.896,18780.0,1594600,19040.0,18705.0
95,2015/01/19,19200.0,19201.336,19200.0,1090400,19410.0,19095.0
96,2015/01/20,19910.0,19753.351,19450.0,1585000,19925.0,19430.0
97,2015/01/21,20085.0,20006.794,19895.0,1635900,20115.0,19815.0
98,2015/01/22,20130.0,20130.105,20150.0,1434600,20285.0,19955.0
99,2015/01/23,20730.0,20596.349,20400.0,1790200,20760.0,20400.0
100,2015/01/26,20665.0,20586.034,20395.0,1069400,20685.0,20350.0
101,2015/01/27,20940.0,20919.201,20850.0,1366300,21010.0,20615.0
102,2015/01/28,20835.0,20817.053,20800.0,1001200,20930.0,20690.0
103,2015/01/29,20130.0,20410.574,21000.0,1851400,21000.0,20035.0
104,2015/01/30,19890.0,20069.521,20510.0,1735100,20530.0,19865.0
105,2015/02/02,19920.0,19875.02,19730.0,968000,19995.0,19715.0
106,2015/02/03,19700.0,19852.115,20170.0,908800,20195.0,19660.0
107,2015/02/04,20295.0,20283.455,20135.0,1143100,20415.0,20065.0
108,2015/02/05,19780.0,19849.356,20115.0,1101400,20165.0,19720.0
109,2015/02/06,20020.0,20024.307,20115.0,728600,20130.0,19935.0
110,2015/02/09,20035.0,20035.302,20150.0,832100,20150.0,19910.0
111,2015/02/10,20755.0,20480.075,20025.0,1711000,20785.0,19935.0
112,2015/02/12,22045.0,21745.805,21470.0,3022400,22245.0,21080.0
113,2015/02/13,21650.0,21771.048,21820.0,1716200,22045.0,21570.0
114,2015/02/16,22390.0,22387.785,22110.0,1526100,22640.0,21905.0
115,2015/02/17,22605.0,22530.83,22400.0,904600,22750.0,22220.0
116,2015/02/18,22950.0,22934.491,22990.0,1279400,23050.0,22715.0
117,2015/02/19,23010.0,23091.479,22985.0,971100,23230.0,22930.0
118,2015/02/20,23285.0,23276.769,23100.0,858500,23390.0,23090.0
119,2015/02/23,22630.0,22870.126,23320.0,1833200,23490.0,22490.0
120,2015/02/24,22945.0,22775.341,22505.0,1155300,23010.0,22315.0
121,2015/02/25,22905.0,22898.452,23065.0,690200,23100.0,22790.0
122,2015/02/26,22930.0,22882.911,23045.0,981300,23065.0,22610.0
123,2015/02/27,22945.0,23009.651,23065.0,1142600,23195.0,22820.0
124,2015/03/02,22860.0,22854.334,23000.0,804900,23190.0,22660.0
125,2015/03/03,22890.0,22947.459,23000.0,831100,23120.0,22840.0
126,2015/03/04,22955.0,22884.104,22890.0,668000,23040.0,22635.0
127,2015/03/05,23130.0,23101.868,22905.0,812000,23325.0,22750.0
128,2015/03/06,23175.0,23191.485,23240.0,727400,23385.0,23025.0
129,2015/03/09,22965.0,22969.005,23100.0,832800,23120.0,22815.0
130,2015/03/10,22730.0,22869.267,23055.0,875700,23145.0,22615.0
131,2015/03/11,23195.0,23100.955,22950.0,1011500,23310.0,22815.0
132,2015/03/12,23735.0,23590.694,23330.0,1322400,23890.0,23140.0
133,2015/03/13,26870.0,26271.522,25570.0,5582200,27250.0,25415.0
134,2015/03/16,26705.0,26869.529,26770.0,2561900,27480.0,26615.0
135,2015/03/17,27270.0,27278.149,27300.0,1496200,27430.0,27130.0
136,2015/03/18,27430.0,27357.688,27160.0,1716300,27550.0,26900.0
137,2015/03/19,27795.0,27690.627,27620.0,1895100,28035.0,27175.0
138,2015/03/20,27340.0,27415.205,27535.0,1473700,27800.0,27235.0
139,2015/03/23,27185.0,27212.749,27060.0,1229200,27490.0,26960.0
140,2015/03/24,27155.0,27226.169,27000.0,925000,27430.0,27000.0
141,2015/03/25,26960.0,26877.454,27050.0,1232900,27085.0,26600.0
142,2015/03/26,26540.0,26521.074,26820.0,1320900,26850.0,26370.0
143,2015/03/27,26180.0,26181.619,25945.0,1506600,26725.0,25715.0
144,2015/03/30,26475.0,26222.106,25825.0,1135100,26620.0,25615.0
145,2015/03/31,26250.0,26604.613,27050.0,1347600,27105.0,26250.0
146,2015/04/01,26200.0,26226.728,26105.0,1206500,26450.0,25950.0
147,2015/04/02,26675.0,26722.16,26580.0,1185300,26980.0,26485.0
148,2015/04/03,26665.0,26728.406,26870.0,727300,26975.0,26535.0
149,2015/04/06,26430.0,26485.107,26455.0,522500,26645.0,26300.0
150,2015/04/07,27225.0,27182.125,27270.0,1454300,27380.0,26815.0
151,2015/04/08,27115.0,27149.199,27320.0,1076100,27480.0,26960.0
152,2015/04/09,27425.0,27325.235,27240.0,844200,27450.0,27020.0
153,2015/04/10,27235.0,27295.697,27400.0,1548700,27425.0,27060.0
154,2015/04/13,26970.0,27096.586,27450.0,901400,27450.0,26960.0
155,2015/04/14,26530.0,26553.698,26470.0,875100,26865.0,26450.0
156,2015/04/15,26610.0,26546.117,26420.0,942800,26750.0,26285.0
157,2015/04/16,26250.0,26244.037,26580.0,939300,26580.0,26110.0
158,2015/04/17,25740.0,25878.264,26050.0,1014900,26245.0,25715.0
159,2015/04/20,25625.0,25855.873,25735.0,1184500,26200.0,25565.0
160,2015/04/21,26305.0,26068.065,25710.0,928500,26325.0,25600.0
161,2015/04/22,26685.0,26652.749,26650.0,916800,26890.0,26515.0
162,2015/04/23,26695.0,26753.09,26950.0,757900,26950.0,26620.0
163,2015/04/24,26500.0,26598.033,26750.0,639600,26875.0,26500.0
164,2015/04/27,26800.0,26785.707,26740.0,1022700,27045.0,26380.0
165,2015/04/28,27685.0,28228.522,28500.0,3465300,28575.0,27605.0
166,2015/04/30,26525.0,26625.241,27000.0,2194200,27100.0,26340.0
167,2015/05/01,26560.0,26568.846,26525.0,1091500,26830.0,26440.0
168,2015/05/07,25625.0,25894.184,26060.0,1803300,26180.0,25610.0
169,2015/05/08,25050.0,25190.64,25205.0,2304300,25490.0,24990.0
170,2015/05/11,25475.0,25466.835,25550.0,942300,25595.0,25290.0
171,2015/05/12,25800.0,25677.311,25500.0,935800,25815.0,25440.0
172,2015/05/13,26245.0,26030.291,25855.0,1116200,26300.0,25670.0
173,2015/05/14,25885.0,25981.013,26215.0,987700,26215.0,25750.0
174,2015/05/15,25970.0,25930.531,26145.0,821700,26220.0,25785.0
175,2015/05/18,25450.0,25411.038,25625.0,1614600,25700.0,25160.0
176,2015/05/19,25665.0,25700.122,25710.0,1198300,25850.0,25570.0
177,2015/05/20,25805.0,25799.722,25890.0,1086000,25950.0,25630.0
178,2015/05/21,26055.0,26114.349,25940.0,987900,26340.0,25835.0
179,2015/05/22,25935.0,25931.694,26000.0,745500,26040.0,25810.0
180,2015/05/25,26040.0,26007.387,26020.0,649700,26080.0,25890.0
181,2015/05/26,26105.0,26109.162,26145.0,776700,26195.0,25965.0
182,2015/05/27,26690.0,26570.287,26190.0,1177200,26775.0,26130.0
183,2015/05/28,27020.0,26926.624,26900.0,1429600,27130.0,26675.0
184,2015/05/29,27540.0,27304.686,27100.0,2241900,27570.0,26705.0
185,2015/06/01,27650.0,27715.372,28005.0,1462200,28200.0,27485.0
186,2015/06/02,27700.0,27666.18,27700.0,1023400,27770.0,27520.0
187,2015/06/03,27415.0,27372.774,27260.0,958700,27500.0,27220.0
188,2015/06/04,27555.0,27585.68,27500.0,875900,27685.0,27465.0
189,2015/06/05,27515.0,27472.462,27450.0,770200,27615.0,27340.0
190,2015/06/08,26915.0,27025.753,27460.0,1089700,27525.0,26835.0
191,2015/06/09,26515.0,26610.88,26565.0,972700,26800.0,26465.0
192,2015/06/10,26400.0,26479.323,26515.0,905100,26725.0,26285.0
193,2015/06/11,26110.0,25938.975,26200.0,1678900,26200.0,25705.0
194,2015/06/12,26330.0,26146.281,26090.0,2029200,26540.0,25810.0
195,2015/06/15,26215.0,26087.559,25970.0,798300,26230.0,25870.0
196,2015/06/16,25740.0,25805.841,25950.0,870300,26010.0,25700.0
197,2015/06/17,25810.0,25716.423,25850.0,905200,25930.0,25470.0
198,2015/06/18,25380.0,25472.124,25595.0,919000,25675.0,25370.0
199,2015/06/19,26200.0,26018.091,25430.0,2991400,26240.0,25345.0
200,2015/06/22,26225.0,26124.167,26140.0,1040800,26460.0,25900.0
201,2015/06/23,26425.0,26290.616,26285.0,1000100,26425.0,26060.0
202,2015/06/24,26365.0,26379.038,26430.0,853900,26505.0,26220.0
203,2015/06/25,25645.0,25725.653,25865.0,1235100,25905.0,25605.0
204,2015/06/26,25700.0,25772.13,25885.0,890500,25885.0,25695.0
205,2015/06/29,25005.0,25123.809,24980.0,1019000,25390.0,24970.0
206,2015/06/30,25080.0,24951.818,24915.0,1259600,25190.0,24610.0
207,2015/07/01,25245.0,25187.207,25250.0,594300,25310.0,25005.0
208,2015/07/02,25200.0,25298.944,25335.0,729000,25475.0,25120.0
209,2015/07/03,25545.0,25427.543,25295.0,727300,25620.0,25260.0
210,2015/07/06,24965.0,24952.336,25000.0,1107800,25125.0,24715.0
211,2015/07/07,25065.0,25108.511,25290.0,714800,25300.0,25020.0
212,2015/07/08,23930.0,24351.736,25000.0,1734100,25070.0,23920.0
213,2015/07/09,24085.0,23601.25,23130.0,2018600,24085.0,23005.0
214,2015/07/10,23765.0,23873.304,23955.0,1450100,24175.0,23625.0
215,2015/07/13,23995.0,24046.287,24265.0,938200,24280.0,23820.0
216,2015/07/14,24275.0,24338.771,24430.0,972400,24480.0,24190.0
217,2015/07/15,24280.0,24349.426,24470.0,813100,24540.0,24210.0
218,2015/07/16,24215.0,24184.394,24450.0,799900,24455.0,24025.0
219,2015/07/17,24070.0,24086.17,24090.0,650300,24250.0,24030.0
220,2015/07/21,24305.0,24243.673,24050.0,799200,24380.0,23950.0
221,2015/07/22,23845.0,23841.491,23820.0,792600,23940.0,23760.0
222,2015/07/23,23720.0,23805.526,24080.0,708100,24165.0,23650.0
223,2015/07/24,23300.0,23353.141,23415.0,822100,23575.0,23210.0
224,2015/07/27,23360.0,23330.841,23140.0,975400,23570.0,23120.0
225,2015/07/28,23170.0,23144.323,23160.0,1042300,23395.0,22980.0
226,2015/07/29,20700.0,20533.506,20855.0,4398200,20860.0,19985.0
227,2015/07/30,20745.0,20793.147,20980.0,2095700,20980.0,20600.0
228,2015/07/31,20680.0,20456.98,20500.0,1600900,20685.0,20105.0
229,2015/08/03,20490.0,20487.639,20525.0,956100,20720.0,20350.0
230,2015/08/04,20410.0,20358.338,20490.0,1060600,20495.0,20225.0
231,2015/08/05,21245.0,21079.26,20510.0,1811200,21435.0,20485.0
232,2015/08/06,21895.0,21949.35,21680.0,1890900,22155.0,21550.0
233,2015/08/07,22005.0,21909.864,21965.0,1242000,22080.0,21670.0
234,2015/08/10,21600.0,21593.839,21755.0,1119100,21835.0,21425.0
235,2015/08/11,21525.0,21576.14,21800.0,1012200,21870.0,21350.0
236,2015/08/12,20990.0,21142.131,21630.0,1216800,21630.0,20875.0
237,2015/08/13,21140.0,21020.493,20715.0,1153800,21195.0,20695.0
238,2015/08/14,20825.0,20840.155,20925.0,951700,21035.0,20675.0
239,2015/08/17,20900.0,20884.763,20905.0,546200,21075.0,20735.0
240,2015/08/18,21225.0,21187.941,20995.0,614100,21335.0,20885.0
241,2015/08/19,20380.0,20615.483,20960.0,1332500,21110.0,20330.0
242,2015/08/20,20055.0,20113.908,20300.0,1262200,20365.0,20000.0
243,2015/08/21,19745.0,19791.37,19555.0,1405300,19970.0,19545.0
244,2015/08/24,19405.0,19466.169,19400.0,1895800,19740.0,19290.0
245,2015/08/25,18750.0,19187.447,19005.0,2229900,19885.0,18575.0
246,2015/08/26,19665.0,18997.081,18610.0,2516400,19745.0,18220.0
247,2015/08/27,19320.0,19503.947,20065.0,1218100,20080.0,19100.0
248,2015/08/28,20370.0,20150.797,19720.0,1328000,20385.0,19705.0
249,2015/08/31,19715.0,19801.821,20250.0,1469100,20290.0,19515.0
250,2015/09/01,19290.0,19506.561,19525.0,1400500,19850.0,19280.0
251,2015/09/02,19635.0,19790.768,19005.0,1836600,20210.0,19005.0
252,2015/09/03,19885.0,19982.028,20185.0,1019000,20340.0,19770.0
253,2015/09/04,19495.0,19684.366,20255.0,1334900,20260.0,19235.0
254,2015/09/07,19730.0,19614.035,19315.0,977900,19960.0,19100.0
255,2015/09/08,18970.0,19195.441,19725.0,1129500,19730.0,18950.0
256,2015/09/09,20570.0,20055.42,19725.0,1811800,20570.0,19250.0
257,2015/09/10,20440.0,20190.954,19970.0,1495800,20490.0,19800.0
258,2015/09/11,19870.0,20029.755,20050.0,2653800,20450.0,19815.0
259,2015/09/14,19045.0,19203.825,19715.0,1338500,19785.0,18930.0
260,2015/09/15,19480.0,19598.645,19370.0,1190800,19875.0,19300.0
261,2015/09/16,20110.0,20108.822,19760.0,1124200,20290.0,19740.0
262,2015/09/17,20785.0,20794.959,20620.0,1175400,21000.0,20600.0
263,2015/09/18,20200.0,20233.991,20420.0,962000,20570.0,20070.0
264,2015/09/24,19635.0,19606.878,19780.0,1524600,19900.0,19355.0
265,2015/09/25,19385.0,19103.687,19240.0,1807700,19460.0,18710.0
266,2015/09/28,18675.0,18817.653,19240.0,1315800,19370.0,18600.0
267,2015/09/29,17965.0,18127.074,18345.0,1753800,18420.0,17930.0
268,2015/09/30,18315.0,18387.092,18280.0,1178200,18745.0,18185.0
269,2015/10/01,19035.0,18921.885,18600.0,1247800,19215.0,18480.0
270,2015/10/02,18795.0,18670.709,18560.0,989000,18940.0,18320.0
271,2015/10/05,19190.0,19177.828,19195.0,711900,19310.0,18985.0
272,2015/10/06,19625.0,19803.891,19800.0,1360600,20150.0,19525.0
273,2015/10/07,19875.0,19848.447,19825.0,1060700,20020.0,19575.0
274,2015/10/08,19935.0,20032.182,19990.0,885500,20235.0,19820.0
275,2015/10/09,20775.0,20561.267,20250.0,1872400,20875.0,20240.0
276,2015/10/13,20095.0,20200.946,20600.0,1168800,20615.0,19980.0
277,2015/10/14,19395.0,19419.225,19920.0,1228200,19995.0,19235.0
278,2015/10/15,19635.0,19516.432,19295.0,908100,19750.0,19045.0
279,2015/10/16,19725.0,19690.041,19910.0,1032100,19990.0,19515.0
280,2015/10/19,19160.0,19275.763,19850.0,1073200,19890.0,19115.0
281,2015/10/20,19195.0,19181.189,19405.0,837800,19410.0,19005.0
282,2015/10/21,19910.0,19773.613,19245.0,1632400,20005.0,19170.0
283,2015/10/22,19900.0,19998.075,19700.0,926600,20300.0,19650.0
284,2015/10/23,20460.0,20519.358,20800.0,1356200,20800.0,20330.0
285,2015/10/26,20400.0,20538.224,20465.0,1163300,20710.0,20355.0
286,2015/10/27,19930.0,20047.465,20400.0,1103800,20465.0,19835.0
287,2015/10/28,20865.0,20775.844,20440.0,1993800,20965.0,20285.0
288,2015/10/29,21380.0,21372.803,21250.0,1883800,21675.0,21130.0
289,2015/10/30,21555.0,21459.471,21535.0,1656400,21700.0,21060.0
290,2015/11/02,21115.0,21075.932,21060.0,1020600,21280.0,20905.0
291,2015/11/04,21545.0,21647.566,21535.0,1206300,21865.0,21415.0
292,2015/11/05,21565.0,21595.09,21630.0,980500,21945.0,21350.0
293,2015/11/06,21670.0,21701.437,21710.0,1036300,21900.0,21570.0
294,2015/11/09,22035.0,21988.549,21920.0,1588100,22180.0,21755.0
295,2015/11/10,22010.0,21822.257,21505.0,924000,22035.0,21490.0
296,2015/11/11,21880.0,21888.571,22015.0,694200,22075.0,21720.0
297,2015/11/12,21920.0,21803.671,21755.0,878700,21950.0,21510.0
298,2015/11/13,21650.0,21591.308,21700.0,1219300,21775.0,21375.0
299,2015/11/16,21390.0,21340.375,21190.0,770400,21485.0,21145.0
300,2015/11/17,22015.0,22021.503,21810.0,1530600,22250.0,21565.0
301,2015/11/18,21755.0,21868.049,22020.0,1171700,22210.0,21700.0
302,2015/11/19,22055.0,22021.647,22070.0,1123100,22130.0,21835.0
303,2015/11/20,22200.0,22032.869,21810.0,1043500,22200.0,21810.0
304,2015/11/24,22000.0,21997.127,22220.0,1006500,22250.0,21815.0
305,2015/11/25,21880.0,21835.474,21860.0,760500,21975.0,21665.0
306,2015/11/26,22050.0,22033.635,22050.0,719300,22140.0,21960.0
307,2015/11/27,21890.0,21958.906,22100.0,635500,22130.0,21850.0
308,2015/11/30,21920.0,21910.195,21890.0,1703800,22020.0,21765.0
309,2015/12/01,22420.0,22284.766,22050.0,1228700,22420.0,21985.0
310,2015/12/02,22445.0,22535.023,22645.0,1078300,22770.0,22355.0
311,2015/12/03,22555.0,22642.536,22560.0,1053600,22790.0,22535.0
312,2015/12/04,22095.0,22170.039,22230.0,1004300,22350.0,22050.0
313,2015/12/07,22275.0,22324.666,22390.0,611600,22460.0,22235.0
314,2015/12/08,21920.0,22018.535,22405.0,883600,22430.0,21810.0
315,2015/12/09,21680.0,21701.577,21590.0,1072400,21900.0,21460.0
316,2015/12/10,21130.0,21128.752,21285.0,1108500,21325.0,20950.0
317,2015/12/11,21475.0,21222.745,21100.0,2055200,21555.0,21065.0
318,2015/12/14,20875.0,20804.209,20850.0,1040900,20955.0,20550.0
319,2015/12/15,20455.0,20577.749,20745.0,1078100,20910.0,20455.0
320,2015/12/16,21005.0,20911.234,20935.0,1104900,21060.0,20625.0
321,2015/12/17,21465.0,21627.338,21900.0,1708100,21920.0,21380.0
322,2015/12/18,21085.0,21395.583,21490.0,1548100,22080.0,21035.0
323,2015/12/21,20945.0,20897.714,20890.0,1161700,21140.0,20710.0
324,2015/12/22,20945.0,20912.798,20820.0,642900,21030.0,20680.0
325,2015/12/24,21110.0,21326.505,21565.0,856200,21595.0,21010.0
326,2015/12/25,21045.0,21064.996,21100.0,473700,21170.0,20935.0
327,2015/12/28,21200.0,21154.78,21170.0,426800,21255.0,21025.0
328,2015/12/29,21085.0,21047.706,21225.0,533600,21225.0,20905.0
329,2015/12/30,21080.0,21230.478,21285.0,700800,21480.0,21055.0
330,2016/01/04,20405.0,20537.876,20900.0,1230900,21050.0,20305.0
331,2016/01/05,20140.0,20261.756,20320.0,1046900,20545.0,20080.0
332,2016/01/06,19615.0,19736.025,20140.0,1441200,20215.0,19470.0
333,2016/01/07,18940.0,19118.467,19490.0,1869600,19540.0,18900.0
334,2016/01/08,19125.0,19038.412,18595.0,2173200,19580.0,18585.0
335,2016/01/12,18800.0,18819.482,18650.0,1621400,19080.0,18560.0
336,2016/01/13,19400.0,19285.802,19125.0,1117000,19425.0,18950.0
337,2016/01/14,18715.0,18577.526,18615.0,1344800,18780.0,18325.0
338,2016/01/15,18515.0,18689.937,19085.0,1221700,19210.0,18420.0
339,2016/01/18,18310.0,18168.574,18010.0,1527600,18480.0,17855.0
340,2016/01/19,18650.0,18493.047,18305.0,1348300,18695.0,18175.0
341,2016/01/20,18090.0,18289.553,18555.0,1519400,18690.0,18055.0
342,2016/01/21,17720.0,18169.887,18140.0,1505400,18555.0,17710.0
343,2016/01/22,18775.0,18503.163,18445.0,1586100,18840.0,18160.0
344,2016/01/25,18550.0,18688.367,19020.0,1237500,19100.0,18475.0
345,2016/01/26,18065.0,18128.63,18245.0,1096400,18360.0,17980.0
346,2016/01/27,18435.0,18394.956,18275.0,1047300,18595.0,18185.0
347,2016/01/28,18115.0,18230.721,18355.0,1039100,18490.0,18065.0
348,2016/01/29,15810.0,15924.61,16000.0,4738900,16915.0,15625.0
349,2016/02/01,15915.0,15908.618,15880.0,2490500,16005.0,15805.0
350,2016/02/02,16130.0,16198.896,16420.0,1834300,16460.0,16060.0
351,2016/02/03,15750.0,15776.997,15900.0,2110300,15980.0,15600.0
352,2016/02/04,15990.0,16025.245,15700.0,1298000,16225.0,15695.0
353,2016/02/05,15850.0,15884.891,15820.0,1527800,16045.0,15690.0
354,2016/02/08,16380.0,15978.902,15600.0,1840800,16455.0,15420.0
355,2016/02/09,15850.0,15924.53,15960.0,2057400,16130.0,15800.0
356,2016/02/10,16185.0,16069.611,16165.0,2573800,16250.0,15810.0
357,2016/02/12,15410.0,15613.4,15780.0,3078100,15825.0,15300.0
358,2016/02/15,16545.0,16360.809,16090.0,1973900,16660.0,15885.0
359,2016/02/16,16310.0,16299.224,16155.0,2026700,16660.0,15930.0
360,2016/02/17,16120.0,16135.213,16300.0,1785400,16435.0,15830.0
361,2016/02/18,16900.0,16856.71,16650.0,1753100,17045.0,16555.0
362,2016/02/19,16700.0,16649.826,16890.0,1475300,16970.0,16370.0
363,2016/02/22,17040.0,17014.898,16695.0,1346600,17260.0,16645.0
364,2016/02/23,17155.0,17252.418,17120.0,1694400,17640.0,17075.0
365,2016/02/24,16970.0,16822.759,16705.0,1526800,17035.0,16530.0
366,2016/02/25,16755.0,16744.619,16890.0,1236200,16970.0,16535.0
367,2016/02/26,16895.0,17005.023,16980.0,1320700,17190.0,16885.0
368,2016/02/29,16600.0,16831.122,16960.0,1141700,17250.0,16600.0
369,2016/03/01,16445.0,16458.453,16600.0,1170400,16770.0,16235.0
370,2016/03/02,17385.0,17261.54,16935.0,1312000,17460.0,16875.0
371,2016/03/03,17700.0,17677.236,17500.0,1049800,17850.0,17490.0
372,2016/03/04,17590.0,17557.336,17450.0,1083400,17685.0,17355.0
373,2016/03/07,17830.0,17785.332,17520.0,1305000,17930.0,17445.0
374,2016/03/08,18195.0,18105.254,18230.0,1900100,18295.0,17725.0
375,2016/03/09,17935.0,17850.564,17865.0,1265300,17990.0,17675.0
376,2016/03/10,18330.0,18277.497,18160.0,1033800,18400.0,18065.0
377,2016/03/11,18095.0,17982.777,17935.0,2397700,18225.0,17835.0
378,2016/03/14,18425.0,18471.432,18445.0,885300,18595.0,18400.0
379,2016/03/15,17975.0,18061.92,18100.0,1102600,18260.0,17905.0
380,2016/03/16,17630.0,17631.485,17825.0,980400,17870.0,17465.0
381,2016/03/17,17560.0,17672.994,17825.0,1170200,17930.0,17375.0
382,2016/03/18,17350.0,17299.84,17500.0,1037500,17535.0,17120.0
383,2016/03/22,17745.0,17659.772,17410.0,1033900,17810.0,17405.0
384,2016/03/23,17615.0,17660.495,17700.0,769300,17850.0,17525.0
385,2016/03/24,17225.0,17288.931,17575.0,1013000,17575.0,17160.0
386,2016/03/25,17585.0,17443.515,17315.0,669900,17610.0,17200.0
387,2016/03/28,17600.0,17590.654,17745.0,693700,17765.0,17410.0
388,2016/03/29,17465.0,17420.99,17335.0,708900,17550.0,17220.0
389,2016/03/30,17400.0,17473.108,17395.0,768700,17630.0,17320.0
390,2016/03/31,17485.0,17593.583,17570.0,945300,17750.0,17480.0
391,2016/04/01,16860.0,17004.958,17495.0,1402900,17570.0,16720.0
392,2016/04/04,16875.0,16890.757,16840.0,1120300,17125.0,16665.0
393,2016/04/05,16350.0,16478.89,16770.0,1009100,16795.0,16305.0
394,2016/04/06,16375.0,16406.327,16335.0,692000,16605.0,16275.0
395,2016/04/07,16500.0,16456.168,16435.0,1009200,16675.0,16195.0
396,2016/04/08,17105.0,16869.099,16420.0,1589900,17315.0,16390.0
397,2016/04/11,17135.0,16977.116,17000.0,1016200,17190.0,16690.0
398,2016/04/12,17895.0,17814.322,17480.0,1447900,18030.0,17280.0
399,2016/04/13,18235.0,18188.79,18225.0,1139200,18385.0,17920.0
400,2016/04/14,19005.0,18913.522,18750.0,1408900,19035.0,18635.0
401,2016/04/15,18505.0,18577.944,18560.0,1307500,18880.0,18415.0
402,2016/04/18,17685.0,17798.46,17845.0,1357400,17990.0,17675.0
403,2016/04/19,18360.0,18402.735,18485.0,1246800,18610.0,18175.0
404,2016/04/20,18505.0,18541.685,18690.0,924600,18800.0,18415.0
405,2016/04/21,18650.0,18624.156,18905.0,1278000,18910.0,18300.0
406,2016/04/22,18905.0,18676.046,18400.0,1124700,18905.0,18390.0
407,2016/04/25,18975.0,18953.784,19000.0,876400,19120.0,18810.0
408,2016/04/26,18930.0,18932.631,19005.0,820400,19060.0,18790.0
409,2016/04/27,18325.0,18406.135,18785.0,1365000,18800.0,18225.0
410,2016/04/28,16505.0,16979.841,17600.0,3608600,17695.0,16055.0
411,2016/05/02,16045.0,16019.344,16050.0,1741500,16140.0,15900.0
412,2016/05/06,15845.0,15899.317,16035.0,1713300,16210.0,15775.0
413,2016/05/09,16000.0,16029.837,16095.0,668300,16190.0,15950.0
414,2016/05/10,16200.0,16066.793,16000.0,1451400,16200.0,15825.0
415,2016/05/11,16205.0,16322.303,16300.0,928600,16540.0,16150.0
416,2016/05/12,16275.0,16105.68,15965.0,777000,16310.0,15810.0
417,2016/05/13,15965.0,16138.155,16520.0,1415200,16525.0,15920.0
418,2016/05/16,16215.0,16266.998,15950.0,893200,16475.0,15920.0
419,2016/05/17,16385.0,16335.983,16515.0,799800,16520.0,16230.0
420,2016/05/18,16265.0,16287.731,16215.0,866300,16440.0,16140.0
421,2016/05/19,16265.0,16368.514,16530.0,746200,16635.0,16165.0
422,2016/05/20,16070.0,16095.514,16105.0,821000,16220.0,15950.0
423,2016/05/23,16000.0,15865.028,15840.0,825000,16035.0,15690.0
424,2016/05/24,15830.0,15838.294,15870.0,709800,15935.0,15770.0
425,2016/05/25,16315.0,16211.739,16200.0,1004700,16345.0,15990.0
426,2016/05/26,16365.0,16511.932,16585.0,905500,16675.0,16325.0
427,2016/05/27,16350.0,16391.177,16395.0,531300,16545.0,16310.0
428,2016/05/30,16735.0,16654.535,16630.0,594200,16735.0,16510.0
429,2016/05/31,16980.0,16950.593,16750.0,912200,17050.0,16750.0
430,2016/06/01,16675.0,16760.694,16825.0,591400,16910.0,16660.0
431,2016/06/02,16200.0,16326.952,16515.0,1093000,16565.0,16165.0
432,2016/06/03,16180.0,16191.65,16180.0,628500,16330.0,16110.0
433,2016/06/06,16090.0,15968.346,15850.0,799100,16115.0,15800.0
434,2016/06/07,16560.0,16449.904,16150.0,1096000,16565.0,16150.0
435,2016/06/08,16995.0,16818.059,16710.0,1044100,16995.0,16525.0
436,2016/06/09,16810.0,16898.142,16865.0,896300,17055.0,16795.0
437,2016/06/10,16730.0,16738.804,16790.0,1666400,16825.0,16545.0
438,2016/06/13,16155.0,16304.853,16400.0,862300,16570.0,16155.0
439,2016/06/14,16060.0,16105.108,16225.0,817600,16340.0,16010.0
440,2016/06/15,16070.0,16078.006,16000.0,830900,16160.0,15985.0
441,2016/06/16,15775.0,15890.303,15985.0,1342200,16115.0,15720.0
442,2016/06/17,15870.0,15875.941,15800.0,1851100,15980.0,15740.0
443,2016/06/20,16145.0,16182.731,16050.0,1132000,16370.0,16045.0
444,2016/06/21,16285.0,16164.59,16000.0,688500,16310.0,15935.0
445,2016/06/22,16000.0,16023.005,16130.0,740300,16135.0,15960.0
446,2016/06/23,16605.0,16394.599,16100.0,788800,16620.0,16015.0
447,2016/06/24,15500.0,15773.929,16580.0,2466900,16700.0,15445.0
448,2016/06/27,15675.0,15814.244,15785.0,1979300,16020.0,15580.0
449,2016/06/28,15915.0,15803.869,15590.0,983700,15995.0,15490.0
450,2016/06/29,16300.0,16323.566,16315.0,1070600,16445.0,16150.0
451,2016/06/30,16535.0,16635.235,16605.0,1331500,16800.0,16535.0
452,2016/07/01,16390.0,16536.86,16655.0,760400,16780.0,16340.0
453,2016/07/04,16340.0,16263.047,16180.0,652100,16415.0,16035.0
454,2016/07/05,16050.0,16105.888,16330.0,717500,16330.0,16010.0
455,2016/07/06,15600.0,15598.914,15845.0,1455500,15845.0,15480.0
456,2016/07/07,15500.0,15550.107,15640.0,1181100,15685.0,15465.0
457,2016/07/08,15500.0,15583.367,15600.0,1520400,15850.0,15475.0
458,2016/07/11,16160.0,16051.911,15845.0,882500,16275.0,15755.0
459,2016/07/12,16795.0,16750.831,16595.0,1273600,16820.0,16565.0
460,2016/07/13,17180.0,17208.273,17350.0,1146500,17360.0,17035.0
461,2016/07/14,17435.0,17296.069,17265.0,865300,17445.0,17035.0
462,2016/07/15,17005.0,17116.81,17250.0,1387600,17290.0,17005.0
463,2016/07/19,17290.0,17267.053,17355.0,1079500,17390.0,17105.0
464,2016/07/20,17295.0,17240.617,17160.0,751200,17315.0,17105.0
465,2016/07/21,17665.0,17717.184,17645.0,991500,17945.0,17565.0
466,2016/07/22,17345.0,17332.529,17315.0,668000,17465.0,17220.0
467,2016/07/25,17615.0,17573.123,17410.0,656500,17670.0,17410.0
468,2016/07/26,17385.0,17424.76,17690.0,864100,17690.0,17245.0
469,2016/07/27,17660.0,17630.817,17300.0,897700,17820.0,17300.0
470,2016/07/28,17690.0,17812.861,18005.0,1615000,18050.0,17665.0
471,2016/07/29,17325.0,17394.121,17690.0,1595100,17805.0,17005.0
472,2016/08/01,17505.0,17392.676,17320.0,1034400,17565.0,17045.0
473,2016/08/02,17150.0,17254.982,17250.0,776800,17440.0,17150.0
474,2016/08/03,16715.0,16806.505,16860.0,1045900,16965.0,16670.0
475,2016/08/04,16905.0,16793.856,16750.0,1069600,16965.0,16520.0
476,2016/08/05,16600.0,16706.29,16945.0,964100,17030.0,16600.0
477,2016/08/08,17225.0,17181.386,17095.0,933800,17325.0,16920.0
478,2016/08/09,17420.0,17361.148,17270.0,646600,17470.0,17140.0
479,2016/08/10,17315.0,17359.819,17400.0,604200,17480.0,17300.0
480,2016/08/12,17145.0,17193.265,17330.0,1204900,17365.0,17105.0
481,2016/08/15,17375.0,17388.115,17145.0,585500,17530.0,17145.0
482,2016/08/16,17165.0,17365.645,17500.0,973400,17725.0,17165.0
483,2016/08/17,17325.0,17305.744,17220.0,816800,17445.0,17220.0
484,2016/08/18,17120.0,17292.964,17325.0,1002400,17595.0,17055.0
485,2016/08/19,17335.0,17282.886,17170.0,685500,17360.0,17145.0
486,2016/08/22,17150.0,17156.853,17235.0,556200,17280.0,17085.0
487,2016/08/23,16950.0,17021.203,17145.0,802000,17180.0,16885.0
488,2016/08/24,17095.0,17059.574,16900.0,698700,17165.0,16900.0
489,2016/08/25,17160.0,17182.889,16980.0,1154900,17275.0,16945.0
490,2016/08/26,16705.0,16752.135,17070.0,1287700,17115.0,16525.0
491,2016/08/29,17215.0,17255.348,17105.0,1026100,17360.0,17035.0
492,2016/08/30,17065.0,17085.841,17040.0,617600,17165.0,17040.0
493,2016/08/31,17630.0,17544.683,17355.0,1057900,17700.0,17305.0
494,2016/09/01,17415.0,17453.797,17680.0,820400,17680.0,17365.0
495,2016/09/02,17325.0,17300.14,17390.0,806600,17390.0,17220.0
496,2016/09/05,17435.0,17510.981,17610.0,476100,17665.0,17400.0
497,2016/09/06,17355.0,17380.761,17430.0,532000,17480.0,17345.0
498,2016/09/07,17310.0,17252.88,17235.0,668500,17330.0,17115.0
499,2016/09/08,17135.0,17142.207,17250.0,712900,17275.0,17000.0
500,2016/09/09,17250.0,17252.042,17260.0,1200200,17340.0,17140.0
501,2016/09/12,16735.0,16786.966,16995.0,849400,17060.0,16600.0
502,2016/09/13,16965.0,16962.603,17035.0,585600,17050.0,16835.0
503,2016/09/14,16910.0,16931.78,16895.0,526500,17040.0,16840.0
504,2016/09/15,16805.0,16781.007,16810.0,745100,16920.0,16655.0
505,2016/09/16,16960.0,16892.932,16790.0,815200,16970.0,16780.0
506,2016/09/20,16915.0,16982.545,16880.0,797300,17220.0,16850.0
507,2016/09/21,17285.0,17090.717,16880.0,1197200,17365.0,16755.0
508,2016/09/23,17170.0,17236.643,17390.0,662100,17390.0,17155.0
509,2016/09/26,16900.0,16970.523,17190.0,735600,17205.0,16860.0
510,2016/09/27,16915.0,16839.22,16765.0,793800,16955.0,16620.0
511,2016/09/28,16940.0,16918.532,16810.0,752400,17050.0,16810.0
512,2016/09/29,17290.0,17273.472,17185.0,722400,17380.0,17085.0
513,2016/09/30,17010.0,17018.002,17295.0,915600,17295.0,16935.0
514,2016/10/03,17265.0,17271.381,17270.0,574800,17350.0,17120.0
515,2016/10/04,17435.0,17413.268,17360.0,924300,17500.0,17255.0
516,2016/10/05,17530.0,17470.116,17420.0,592700,17550.0,17265.0
517,2016/10/06,18025.0,17984.412,17750.0,1027800,18065.0,17750.0
518,2016/10/07,18410.0,18361.846,18300.0,1187900,18470.0,18175.0
519,2016/10/11,18975.0,18884.427,18635.0,1396000,19030.0,18550.0
520,2016/10/12,19070.0,19089.427,19085.0,1430100,19295.0,18925.0
521,2016/10/13,18930.0,18972.397,19105.0,1160200,19230.0,18770.0
522,2016/10/14,18995.0,18884.226,18880.0,1332000,19015.0,18710.0
523,2016/10/17,19030.0,19018.448,18960.0,734900,19095.0,18890.0
524,2016/10/18,19005.0,18985.165,19055.0,607600,19055.0,18915.0
525,2016/10/19,19425.0,19299.589,19080.0,846000,19450.0,19075.0
526,2016/10/20,19670.0,19647.854,19570.0,1073400,19765.0,19505.0
527,2016/10/21,19430.0,19583.748,19800.0,1036000,19930.0,19425.0
528,2016/10/24,19420.0,19409.955,19400.0,623400,19495.0,19340.0
529,2016/10/25,19620.0,19614.732,19450.0,784900,19695.0,19450.0
530,2016/10/26,19720.0,19632.911,19450.0,694500,19720.0,19440.0
531,2016/10/27,19570.0,19542.632,19560.0,636900,19640.0,19470.0
532,2016/10/28,19535.0,19572.975,19645.0,1023700,19670.0,19465.0
533,2016/10/31,19680.0,19642.497,19535.0,802800,19730.0,19485.0
534,2016/11/01,18840.0,18876.293,19280.0,1638100,19280.0,18690.0
535,2016/11/02,18720.0,18731.819,18610.0,797900,18880.0,18555.0
536,2016/11/04,18540.0,18496.102,18580.0,904500,18585.0,18385.0
537,2016/11/07,18840.0,18814.214,18940.0,885300,18945.0,18630.0
538,2016/11/08,18855.0,18870.108,19000.0,542400,19000.0,18790.0
539,2016/11/09,18045.0,18352.109,19180.0,2286300,19415.0,17790.0
540,2016/11/10,19350.0,19290.81,19400.0,1396400,19445.0,19010.0
541,2016/11/11,19490.0,19456.59,19395.0,1664000,19675.0,19265.0
542,2016/11/14,19770.0,19776.432,19700.0,1080200,19890.0,19530.0
543,2016/11/15,19640.0,19683.722,19885.0,777900,19885.0,19600.0
544,2016/11/16,19660.0,19710.404,19810.0,916400,19810.0,19645.0
545,2016/11/17,19550.0,19520.712,19505.0,730100,19585.0,19395.0
546,2016/11/18,19595.0,19691.253,19745.0,1028700,19820.0,19590.0
547,2016/11/21,19620.0,19518.458,19560.0,1003700,19640.0,19255.0
548,2016/11/22,19410.0,19443.006,19590.0,764300,19665.0,19380.0
549,2016/11/24,19450.0,19518.523,19645.0,810900,19645.0,19450.0
550,2016/11/25,19535.0,19622.867,19610.0,1038600,19800.0,19485.0
551,2016/11/28,19300.0,19251.502,19335.0,1022700,19380.0,19150.0
552,2016/11/29,19420.0,19341.443,19165.0,1168000,19455.0,19150.0
553,2016/11/30,19305.0,19347.442,19500.0,1623600,19555.0,19280.0
554,2016/12/01,19515.0,19633.012,19600.0,1322900,19805.0,19455.0
555,2016/12/02,19450.0,19403.338,19555.0,820800,19560.0,19265.0
556,2016/12/05,19370.0,19398.91,19495.0,691000,19520.0,19315.0
557,2016/12/06,19465.0,19464.357,19375.0,988900,19565.0,19365.0
558,2016/12/07,19540.0,19568.589,19530.0,870300,19700.0,19500.0
559,2016/12/08,20230.0,20097.271,20000.0,1365800,20250.0,19900.0
560,2016/12/09,20770.0,20591.816,20300.0,2854700,21140.0,20265.0
561,2016/12/12,20465.0,20587.202,20895.0,1329900,20900.0,20420.0
562,2016/12/13,20545.0,20449.65,20540.0,810700,20580.0,20190.0
563,2016/12/14,20485.0,20484.693,20420.0,832800,20590.0,20350.0
564,2016/12/15,20275.0,20353.781,20390.0,974800,20535.0,20230.0
565,2016/12/16,20275.0,20348.562,20500.0,904100,20500.0,20260.0
566,2016/12/19,20340.0,20339.972,20220.0,578900,20425.0,20200.0
567,2016/12/20,20265.0,20270.234,20430.0,647300,20435.0,20155.0
568,2016/12/21,20180.0,20241.809,20265.0,740300,20370.0,20130.0
569,2016/12/22,20115.0,20079.246,20130.0,630000,20150.0,19980.0
570,2016/12/26,20165.0,20192.701,20150.0,484600,20295.0,20115.0
571,2016/12/27,20185.0,20170.118,20070.0,433900,20245.0,20020.0
572,2016/12/28,20415.0,20366.019,20250.0,472600,20455.0,20110.0
573,2016/12/29,19905.0,20046.792,20385.0,696000,20385.0,19905.0
574,2016/12/30,19815.0,19796.046,19710.0,512300,19900.0,19630.0
575,2017/01/04,20210.0,20062.377,19700.0,1034900,20220.0,19655.0
576,2017/01/05,20115.0,20151.984,20220.0,603200,20270.0,20045.0
577,2017/01/06,20250.0,20218.031,20140.0,532300,20285.0,20065.0
578,2017/01/10,20070.0,20145.504,20255.0,620400,20295.0,20050.0
579,2017/01/11,20275.0,20263.393,20160.0,632000,20350.0,20140.0
580,2017/01/12,20145.0,20143.197,20080.0,817200,20230.0,20045.0
581,2017/01/13,20545.0,20335.741,20105.0,1094600,20550.0,20080.0
582,2017/01/16,20575.0,20653.989,20720.0,833900,20840.0,20535.0
583,2017/01/17,20430.0,20552.799,20500.0,885800,20760.0,20380.0
584,2017/01/18,20590.0,20442.565,20430.0,924000,20660.0,20185.0
585,2017/01/19,21345.0,21177.253,20910.0,1468700,21390.0,20745.0
586,2017/01/20,21355.0,21432.661,21400.0,1091600,21665.0,21305.0
587,2017/01/23,21350.0,21381.753,21230.0,1222600,21500.0,21125.0
588,2017/01/24,21315.0,21362.122,21450.0,966600,21495.0,21240.0
589,2017/01/25,21920.0,21867.52,21750.0,1104200,22085.0,21715.0
590,2017/01/26,22650.0,22531.354,22200.0,1959400,22765.0,22190.0
591,2017/01/27,22690.0,22538.58,22440.0,1482000,22765.0,22270.0
592,2017/01/30,22470.0,22482.004,22565.0,714300,22665.0,22400.0
593,2017/01/31,22165.0,22205.13,22155.0,887400,22390.0,22080.0
594,2017/02/01,22155.0,22072.64,21950.0,872300,22240.0,21820.0
595,2017/02/02,21825.0,21931.866,22255.0,1018300,22270.0,21760.0
596,2017/02/03,21815.0,21828.97,21830.0,658700,21965.0,21615.0
597,2017/02/06,21660.0,21727.303,21975.0,601400,21990.0,21600.0
598,2017/02/07,21565.0,21525.064,21500.0,784800,21655.0,21360.0
599,2017/02/08,22010.0,21904.5,21770.0,700100,22015.0,21765.0
600,2017/02/09,21840.0,21852.818,21825.0,503700,21950.0,21730.0
601,2017/02/10,22750.0,22588.933,22445.0,1314500,22795.0,22275.0
602,2017/02/13,22705.0,22723.199,22790.0,687200,22920.0,22620.0
603,2017/02/14,22280.0,22445.021,22700.0,865400,22735.0,22265.0
604,2017/02/15,22560.0,22571.891,22665.0,630600,22710.0,22485.0
605,2017/02/16,22595.0,22541.475,22550.0,707500,22690.0,22360.0
606,2017/02/17,22455.0,22487.858,22485.0,514500,22615.0,22420.0
607,2017/02/20,22345.0,22280.822,22400.0,628900,22415.0,22100.0
608,2017/02/21,22475.0,22418.68,22290.0,446300,22510.0,22225.0
609,2017/02/22,22180.0,22219.53,22430.0,704100,22435.0,22135.0
610,2017/02/23,22160.0,22121.822,22100.0,494000,22195.0,22025.0
611,2017/02/24,22160.0,22136.974,22085.0,489800,22280.0,22035.0
612,2017/02/27,21965.0,21901.96,21935.0,637200,22040.0,21680.0
613,2017/02/28,22125.0,22144.159,22180.0,678800,22270.0,22035.0
614,2017/03/01,22560.0,22432.597,22150.0,831500,22620.0,22110.0
615,2017/03/02,22625.0,22671.751,22765.0,985700,22825.0,22535.0
616,2017/03/03,22440.0,22450.655,22540.0,672900,22570.0,22320.0
617,2017/03/06,22305.0,22316.722,22410.0,322900,22420.0,22225.0
618,2017/03/07,22065.0,22121.224,22165.0,783800,22235.0,22065.0
619,2017/03/08,22095.0,22099.214,22190.0,483000,22255.0,22020.0
620,2017/03/09,21940.0,21966.128,22155.0,635900,22160.0,21880.0
621,2017/03/10,22320.0,22063.787,21855.0,1555600,22450.0,21780.0
622,2017/03/13,22320.0,22339.555,22320.0,634800,22480.0,22230.0
623,2017/03/14,22360.0,22393.048,22500.0,647500,22555.0,22285.0
624,2017/03/15,22260.0,22212.599,22265.0,450800,22265.0,22150.0
625,2017/03/16,22470.0,22424.069,22150.0,717900,22525.0,22140.0
626,2017/03/17,23075.0,22924.402,22540.0,1505700,23120.0,22505.0
627,2017/03/21,23005.0,23109.062,23345.0,837900,23370.0,22960.0
628,2017/03/22,22615.0,22660.102,22505.0,1073700,22855.0,22380.0
629,2017/03/23,22680.0,22630.211,22600.0,922900,22755.0,22355.0
630,2017/03/24,23065.0,23026.056,22695.0,1158800,23200.0,22675.0
631,2017/03/27,22740.0,22731.416,22715.0,835600,22840.0,22605.0
632,2017/03/28,22955.0,22987.531,23015.0,897400,23130.0,22890.0
633,2017/03/29,23235.0,23200.372,23150.0,980700,23325.0,23075.0
634,2017/03/30,23185.0,23250.073,23255.0,716200,23410.0,23130.0
635,2017/03/31,22820.0,22983.892,23365.0,988300,23370.0,22820.0
636,2017/04/03,22875.0,22833.004,22845.0,689500,22980.0,22690.0
637,2017/04/04,22530.0,22649.599,22850.0,1102100,22910.0,22450.0
638,2017/04/05,23185.0,23160.91,23010.0,1205400,23310.0,22970.0
639,2017/04/06,22815.0,22873.693,23100.0,1330000,23175.0,22735.0
640,2017/04/07,22650.0,22718.898,23050.0,1172100,23055.0,22480.0
641,2017/04/10,22605.0,22626.924,22730.0,588100,22785.0,22520.0
642,2017/04/11,22315.0,22363.072,22610.0,748500,22620.0,22225.0
643,2017/04/12,22275.0,22282.312,22180.0,1050900,22475.0,22125.0
644,2017/04/13,21975.0,21931.417,22055.0,820600,22055.0,21820.0
645,2017/04/14,21945.0,22098.736,22300.0,1163900,22305.0,21720.0
646,2017/04/17,21950.0,21938.519,21790.0,542000,22075.0,21750.0
647,2017/04/18,21970.0,21978.216,22090.0,690500,22190.0,21855.0
648,2017/04/19,22290.0,22226.687,21895.0,897200,22340.0,21880.0
649,2017/04/20,22190.0,22293.069,22455.0,874000,22555.0,22190.0
650,2017/04/21,22385.0,22396.73,22535.0,1087700,22610.0,22255.0
651,2017/04/24,22790.0,22739.967,22735.0,980800,22830.0,22585.0
652,2017/04/25,22835.0,22781.694,22605.0,780200,22895.0,22600.0
653,2017/04/26,23265.0,23094.358,23000.0,1053200,23265.0,22885.0
654,2017/04/27,22780.0,22808.679,23100.0,1223100,23100.0,22675.0
655,2017/04/28,22655.0,22634.943,22590.0,1243200,22870.0,22300.0
656,2017/05/01,22295.0,22332.521,22530.0,903700,22535.0,22215.0
657,2017/05/02,22520.0,22447.392,22230.0,903200,22565.0,22170.0
658,2017/05/08,23260.0,23179.78,22990.0,1640100,23330.0,22930.0
659,2017/05/09,23095.0,23154.126,23145.0,849000,23280.0,23075.0
660,2017/05/10,22895.0,22920.036,23050.0,1045800,23065.0,22820.0
661,2017/05/11,22890.0,22899.056,23000.0,679300,23045.0,22785.0
662,2017/05/12,22715.0,22797.925,22915.0,1374800,23010.0,22530.0
663,2017/05/15,22595.0,22543.517,22525.0,554600,22625.0,22320.0
664,2017/05/16,22590.0,22689.564,22800.0,614600,22830.0,22585.0
665,2017/05/17,22505.0,22426.918,22420.0,843300,22515.0,22260.0
666,2017/05/18,21835.0,21924.539,22100.0,1403400,22150.0,21820.0
667,2017/05/19,21875.0,21898.779,21960.0,923800,22040.0,21810.0
668,2017/05/22,21940.0,21958.613,22095.0,519700,22120.0,21850.0
669,2017/05/23,21840.0,21866.422,21925.0,603500,22020.0,21765.0
670,2017/05/24,21770.0,21782.145,21910.0,946900,21965.0,21690.0
671,2017/05/25,22125.0,22057.318,21725.0,1026800,22210.0,21720.0
672,2017/05/26,21750.0,21877.817,22180.0,779300,22185.0,21745.0
673,2017/05/29,21775.0,21762.714,21720.0,395600,21845.0,21625.0
674,2017/05/30,21780.0,21776.157,21850.0,567200,21895.0,21640.0
675,2017/05/31,21770.0,21758.181,21700.0,695200,21830.0,21660.0
676,2017/06/01,21680.0,21682.241,21770.0,981900,21800.0,21580.0
677,2017/06/02,22225.0,22142.999,21790.0,1456900,22340.0,21740.0
678,2017/06/05,22345.0,22377.198,22340.0,728800,22445.0,22285.0
679,2017/06/06,21945.0,22092.866,22150.0,1004600,22460.0,21915.0
680,2017/06/07,21895.0,21913.115,21910.0,679700,22000.0,21850.0
681,2017/06/08,21880.0,21954.46,22070.0,659600,22175.0,21845.0
682,2017/06/09,22055.0,22038.962,21990.0,1509800,22230.0,21865.0
683,2017/06/12,21615.0,21674.376,21905.0,866100,21930.0,21560.0
684,2017/06/13,21425.0,21361.251,21505.0,971500,21505.0,21040.0
685,2017/06/14,21565.0,21701.86,21780.0,821200,21845.0,21550.0
686,2017/06/15,21385.0,21439.169,21390.0,683800,21675.0,21305.0
687,2017/06/16,21290.0,21325.834,21450.0,1375700,21455.0,21260.0
688,2017/06/19,21560.0,21541.477,21370.0,715100,21640.0,21275.0
689,2017/06/20,21725.0,21743.853,21850.0,846800,21850.0,21605.0
690,2017/06/21,21705.0,21698.624,21745.0,658200,21815.0,21580.0
691,2017/06/22,21650.0,21671.922,21710.0,707900,21785.0,21590.0
692,2017/06/23,21715.0,21720.521,21710.0,552900,21805.0,21615.0
693,2017/06/26,21845.0,21813.567,21690.0,580500,21865.0,21690.0
694,2017/06/27,21955.0,21958.589,21875.0,595000,22075.0,21850.0
695,2017/06/28,21785.0,21813.083,21920.0,605200,21995.0,21690.0
696,2017/06/29,21915.0,21980.407,21945.0,569000,22170.0,21885.0
697,2017/06/30,21655.0,21592.801,21650.0,819200,21725.0,21495.0
698,2017/07/03,21675.0,21682.136,21550.0,577600,21790.0,21530.0
699,2017/07/04,21910.0,21881.805,21800.0,768900,21975.0,21755.0
700,2017/07/05,21925.0,21862.013,21985.0,692900,21990.0,21690.0
701,2017/07/06,21835.0,21886.012,22000.0,572400,22045.0,21800.0
702,2017/07/07,21725.0,21710.779,21675.0,581900,21795.0,21630.0
703,2017/07/10,22060.0,22029.24,21920.0,717400,22110.0,21850.0
704,2017/07/11,22400.0,22321.168,22185.0,838000,22410.0,22160.0
705,2017/07/12,22160.0,22249.917,22320.0,643800,22385.0,22145.0
706,2017/07/13,22030.0,22083.498,22220.0,481600,22240.0,22000.0
707,2017/07/14,22435.0,22392.777,22190.0,1137800,22530.0,22180.0
708,2017/07/18,22275.0,22320.754,22430.0,694600,22445.0,22235.0
709,2017/07/19,22085.0,22060.215,22180.0,554100,22210.0,21985.0
710,2017/07/20,22205.0,22136.587,22160.0,685300,22245.0,21980.0
711,2017/07/21,22665.0,22858.469,23100.0,1445200,23160.0,22565.0
712,2017/07/24,22490.0,22477.271,22635.0,769100,22635.0,22360.0
713,2017/07/25,22585.0,22540.957,22520.0,716500,22645.0,22385.0
714,2017/07/26,23125.0,23068.441,23085.0,1134700,23140.0,22970.0
715,2017/07/27,23270.0,23246.917,23195.0,943300,23360.0,23100.0
716,2017/07/28,23295.0,23350.959,23450.0,1225500,23670.0,23165.0
717,2017/07/31,22565.0,22676.101,23260.0,1485900,23270.0,22480.0
718,2017/08/01,22585.0,22613.357,22505.0,889000,22770.0,22420.0
719,2017/08/02,22890.0,22838.514,22740.0,719800,22935.0,22695.0
720,2017/08/03,22690.0,22729.763,22840.0,557400,22845.0,22665.0
721,2017/08/04,22565.0,22532.472,22490.0,562900,22640.0,22445.0
722,2017/08/07,22400.0,22487.601,22670.0,449900,22720.0,22385.0
723,2017/08/08,22350.0,22374.415,22425.0,443400,22500.0,22320.0
724,2017/08/09,22030.0,22012.869,22195.0,891700,22240.0,21885.0
725,2017/08/10,21940.0,21973.217,22120.0,711800,22120.0,21840.0
726,2017/08/14,21765.0,21694.593,21650.0,774600,21775.0,21530.0
727,2017/08/15,21995.0,22004.546,21990.0,613800,22060.0,21925.0
728,2017/08/16,21745.0,21852.797,22095.0,595300,22095.0,21745.0
729,2017/08/17,21710.0,21731.543,21750.0,504000,21825.0,21670.0
730,2017/08/18,21415.0,21410.821,21500.0,767600,21500.0,21300.0
731,2017/08/21,21305.0,21294.206,21405.0,526300,21405.0,21200.0
732,2017/08/22,21290.0,21340.502,21385.0,523600,21515.0,21265.0
733,2017/08/23,21220.0,21324.826,21500.0,692800,21535.0,21205.0
734,2017/08/24,21030.0,21108.109,21235.0,714300,21235.0,21025.0
735,2017/08/25,21085.0,21069.354,21060.0,826900,21155.0,20935.0
736,2017/08/28,20950.0,20975.299,21080.0,693100,21125.0,20855.0
737,2017/08/29,21050.0,20987.56,20865.0,688900,21125.0,20805.0
738,2017/08/30,21100.0,21120.14,21225.0,515300,21270.0,21060.0
739,2017/08/31,21340.0,21348.11,21305.0,682700,21435.0,21240.0
740,2017/09/01,21345.0,21346.133,21380.0,593000,21505.0,21265.0
741,2017/09/04,21180.0,21200.63,21355.0,535900,21370.0,21120.0
742,2017/09/05,21015.0,21090.076,21255.0,456700,21255.0,21000.0
743,2017/09/06,21145.0,21095.478,20975.0,834500,21160.0,20925.0
744,2017/09/07,21100.0,21146.029,21195.0,613800,21265.0,21060.0
745,2017/09/08,21015.0,21005.595,21000.0,1462200,21100.0,20975.0
746,2017/09/11,21220.0,21237.968,21155.0,629700,21360.0,21105.0
747,2017/09/12,21720.0,21629.639,21395.0,954500,21775.0,21330.0
748,2017/09/13,21650.0,21719.581,21905.0,532600,21920.0,21635.0
749,2017/09/14,21675.0,21661.19,21620.0,601200,21730.0,21550.0
750,2017/09/15,22080.0,22022.8,21675.0,1384500,22165.0,21670.0
751,2017/09/19,22755.0,22661.353,22580.0,1236900,22790.0,22445.0
752,2017/09/20,22785.0,22744.721,22800.0,977700,22830.0,22570.0
753,2017/09/21,22845.0,22990.174,22980.0,1038500,23225.0,22825.0
754,2017/09/22,22855.0,22870.842,23060.0,708300,23065.0,22710.0
755,2017/09/25,22995.0,23016.064,23065.0,557700,23140.0,22910.0
756,2017/09/26,22690.0,22726.59,22765.0,729400,22950.0,22665.0
757,2017/09/27,22700.0,22777.949,22800.0,608700,22920.0,22685.0
758,2017/09/28,22825.0,22915.534,22970.0,994400,23140.0,22770.0
759,2017/09/29,22790.0,22801.427,22940.0,1112500,22940.0,22640.0
760,2017/10/02,23280.0,23149.285,22960.0,1021900,23280.0,22855.0
761,2017/10/03,23695.0,23617.037,23500.0,1242600,23740.0,23330.0
762,2017/10/04,23710.0,23793.552,23700.0,1108900,23995.0,23660.0
763,2017/10/05,23640.0,23694.198,23780.0,607500,23790.0,23620.0
764,2017/10/06,23900.0,23860.064,23755.0,903400,24000.0,23700.0
765,2017/10/10,23875.0,23855.1,24100.0,1007100,24120.0,23620.0
766,2017/10/11,24310.0,24176.858,23980.0,1002700,24315.0,23920.0
767,2017/10/12,24525.0,24530.151,24500.0,956400,24690.0,24390.0
768,2017/10/13,24795.0,24638.489,24550.0,1631900,24890.0,24390.0
769,2017/10/16,24975.0,24970.458,24925.0,1006100,25110.0,24830.0
770,2017/10/17,25210.0,25169.758,25185.0,1069700,25295.0,25025.0
771,2017/10/18,25080.0,25139.895,25280.0,872600,25340.0,25045.0
772,2017/10/19,25035.0,25054.509,25350.0,892700,25360.0,24870.0
773,2017/10/20,25000.0,24953.237,24910.0,858400,25060.0,24835.0
774,2017/10/23,25585.0,25480.275,25410.0,1049100,25615.0,25245.0
775,2017/10/24,25395.0,25357.951,25530.0,974800,25530.0,25250.0
776,2017/10/25,25105.0,25346.777,25650.0,1296500,25695.0,25070.0
777,2017/10/26,25075.0,25885.592,26105.0,3695400,26760.0,25040.0
778,2017/10/27,25915.0,25512.693,25575.0,2139200,25940.0,24775.0
779,2017/10/30,26055.0,26101.702,25970.0,1774500,26365.0,25890.0
780,2017/10/31,26370.0,26235.258,25870.0,1145300,26400.0,25825.0
781,2017/11/01,26840.0,26695.865,26590.0,1078800,26860.0,26435.0
782,2017/11/02,26970.0,26976.182,27025.0,1155100,27225.0,26760.0
783,2017/11/06,27315.0,27312.987,27400.0,1039900,27520.0,27070.0
784,2017/11/07,28170.0,27873.931,27400.0,1503800,28195.0,27400.0
785,2017/11/08,28365.0,28256.063,28100.0,1074500,28425.0,27955.0
786,2017/11/09,28350.0,28547.222,28365.0,2330900,29205.0,27605.0
787,2017/11/10,27800.0,27824.304,27845.0,2067900,28055.0,27650.0
788,2017/11/13,27430.0,27585.557,27660.0,932000,27755.0,27430.0
789,2017/11/14,27435.0,27387.468,27000.0,1244600,27655.0,26870.0
790,2017/11/15,27095.0,27239.836,27125.0,1204700,27520.0,27095.0
791,2017/11/16,27480.0,27271.149,26920.0,1175200,27565.0,26875.0
792,2017/11/17,27560.0,27791.065,27865.0,1529500,28235.0,27440.0
793,2017/11/20,27225.0,27328.055,27335.0,734800,27695.0,27200.0
794,2017/11/21,27725.0,27679.6,27490.0,772500,27855.0,27400.0
795,2017/11/22,28155.0,28094.387,28025.0,974500,28265.0,27905.0
796,2017/11/24,28170.0,28039.267,27980.0,723500,28185.0,27755.0
797,2017/11/27,28355.0,28304.322,28370.0,738700,28610.0,28070.0
798,2017/11/28,28290.0,28286.248,28245.0,846600,28540.0,28135.0
799,2017/11/29,28225.0,28345.931,28505.0,891300,28590.0,28170.0
800,2017/11/30,27945.0,27760.887,28000.0,1566300,28000.0,27340.0
801,2017/12/01,28420.0,28317.976,28285.0,959400,28520.0,28060.0
802,2017/12/04,27865.0,27988.019,28250.0,835400,28275.0,27825.0
803,2017/12/05,27345.0,27538.194,27450.0,1028400,27815.0,27340.0
804,2017/12/06,26665.0,26891.94,27160.0,1385900,27440.0,26570.0
805,2017/12/07,27005.0,26864.096,26780.0,1373300,27130.0,26520.0
806,2017/12/08,26895.0,26828.214,26760.0,2264500,26995.0,26710.0
807,2017/12/11,27060.0,27049.68,27110.0,674100,27140.0,26925.0
808,2017/12/12,26775.0,26911.048,27080.0,783300,27265.0,26740.0
809,2017/12/13,26440.0,26526.441,26760.0,892900,26775.0,26390.0
810,2017/12/14,26255.0,26339.508,26260.0,712500,26490.0,26210.0
811,2017/12/15,26170.0,26215.42,26220.0,921200,26525.0,26035.0
812,2017/12/18,26890.0,26779.847,26495.0,805100,26980.0,26385.0
813,2017/12/19,27050.0,27075.86,26980.0,601100,27230.0,26950.0
814,2017/12/20,27190.0,27196.406,27010.0,535200,27350.0,26950.0
815,2017/12/21,27165.0,27169.701,27180.0,461900,27295.0,26990.0
816,2017/12/22,27470.0,27381.303,27200.0,600900,27515.0,27115.0
817,2017/12/25,27740.0,27657.783,27690.0,453000,27785.0,27490.0
818,2017/12/26,27430.0,27499.114,27640.0,369000,27720.0,27410.0
819,2017/12/27,27390.0,27383.55,27425.0,316200,27445.0,27285.0
820,2017/12/28,27145.0,27286.651,27490.0,333400,27530.0,27060.0
821,2017/12/29,27060.0,27177.025,27310.0,387100,27470.0,27045.0
822,2018/01/04,28795.0,28352.26,27520.0,1489900,28810.0,27465.0
823,2018/01/05,29680.0,29454.171,29200.0,1423900,29775.0,29005.0
824,2018/01/09,29875.0,29943.907,30180.0,898300,30200.0,29735.0
825,2018/01/10,30350.0,30311.496,30100.0,1414300,30540.0,29985.0
826,2018/01/11,30740.0,30534.857,30080.0,1119700,30740.0,30020.0
827,2018/01/12,31650.0,31392.333,31050.0,1696200,31750.0,31010.0
828,2018/01/15,31920.0,31949.688,32350.0,1270400,32520.0,31580.0
829,2018/01/16,33450.0,32831.04,32090.0,1252500,33450.0,32030.0
830,2018/01/17,32300.0,32463.414,32780.0,2416200,32940.0,32210.0
831,2018/01/18,31870.0,32003.14,32130.0,2610600,32600.0,31440.0
832,2018/01/19,31710.0,31736.185,32100.0,1121200,32100.0,31460.0
833,2018/01/22,31990.0,31783.005,31850.0,908800,31990.0,31520.0
834,2018/01/23,31900.0,31872.701,31990.0,1083700,32090.0,31620.0
835,2018/01/24,30730.0,31039.666,31400.0,1558000,31430.0,30720.0
836,2018/01/25,30470.0,30326.449,29800.0,1898400,30690.0,29510.0
837,2018/01/26,30560.0,30506.321,30450.0,1224200,30820.0,30260.0
838,2018/01/29,30630.0,31052.764,31960.0,1993100,31960.0,30400.0
839,2018/01/30,29670.0,30050.657,30920.0,1921000,30960.0,29605.0
840,2018/01/31,29475.0,29539.297,29170.0,1613200,29980.0,29060.0
841,2018/02/01,30050.0,29942.514,29850.0,1028600,30170.0,29680.0
842,2018/02/02,29660.0,29813.614,30240.0,959700,30290.0,29590.0
843,2018/02/05,29025.0,28987.564,28900.0,1823100,29250.0,28680.0
844,2018/02/06,27705.0,27397.908,27800.0,3441000,28300.0,26515.0
845,2018/02/07,27150.0,27748.022,28700.0,2573400,28715.0,27130.0
846,2018/02/08,28120.0,27888.339,27500.0,1891300,28235.0,27490.0
847,2018/02/09,27000.0,26964.189,27155.0,2550900,27360.0,26650.0
848,2018/02/13,26815.0,27324.93,28000.0,1734600,28000.0,26780.0
849,2018/02/14,26445.0,26563.201,27050.0,1514300,27215.0,26120.0
850,2018/02/15,27000.0,26987.449,27100.0,1169500,27210.0,26710.0
851,2018/02/16,27160.0,27227.151,27395.0,1135900,27505.0,26930.0
852,2018/02/19,28160.0,27903.005,27615.0,1059800,28190.0,27415.0
853,2018/02/20,27465.0,27505.86,27850.0,1048500,27860.0,27340.0
854,2018/02/21,27575.0,27595.272,27600.0,1182200,27875.0,27300.0
855,2018/02/22,27060.0,27235.27,27450.0,1405500,27645.0,26995.0
856,2018/02/23,27125.0,27121.251,27280.0,916900,27320.0,26955.0
857,2018/02/26,27380.0,27481.16,27550.0,982500,27830.0,27210.0
858,2018/02/27,27875.0,27921.625,27860.0,1282900,28110.0,27770.0
859,2018/02/28,27310.0,27444.68,27500.0,1147500,27785.0,27270.0
860,2018/03/01,27000.0,26908.59,27150.0,1409800,27175.0,26645.0
861,2018/03/02,26395.0,26293.056,26310.0,1523300,26575.0,26085.0
862,2018/03/05,25655.0,25807.938,26005.0,1317900,26120.0,25585.0
863,2018/03/06,26235.0,26325.564,26085.0,1053300,26515.0,26085.0
864,2018/03/07,25760.0,25867.637,26000.0,1135800,26225.0,25685.0
865,2018/03/08,26140.0,26201.096,26100.0,1170700,26450.0,26020.0
866,2018/03/09,26185.0,26439.879,26570.0,1907000,26860.0,25975.0
867,2018/03/12,27255.0,27133.315,27150.0,1320200,27350.0,26865.0
868,2018/03/13,27490.0,27305.947,27435.0,999700,27510.0,27050.0
869,2018/03/14,27230.0,27226.02,27290.0,1002900,27400.0,27090.0
870,2018/03/15,27070.0,26975.695,27200.0,928600,27210.0,26725.0
871,2018/03/16,26630.0,26735.927,27200.0,1225900,27205.0,26545.0
872,2018/03/19,26800.0,26761.32,26560.0,895000,27055.0,26530.0
873,2018/03/20,25920.0,26002.949,26500.0,1230400,26500.0,25830.0
874,2018/03/22,26865.0,26665.831,26220.0,1357200,26865.0,26130.0
875,2018/03/23,25695.0,25629.965,25690.0,2760700,26035.0,25310.0
876,2018/03/26,26265.0,25794.895,25210.0,1498400,26270.0,25145.0
877,2018/03/27,26740.0,26556.621,26450.0,1680600,26740.0,26150.0
878,2018/03/28,26675.0,26311.746,26030.0,1691800,26760.0,25985.0
879,2018/03/29,26570.0,26624.244,26865.0,1244100,26900.0,26360.0
880,2018/03/30,26960.0,26907.174,27070.0,1058400,27075.0,26730.0
881,2018/04/02,26725.0,26938.89,27000.0,706000,27160.0,26725.0
882,2018/04/03,26040.0,25950.877,26050.0,1432400,26145.0,25685.0
883,2018/04/04,25710.0,25915.75,26390.0,964600,26390.0,25705.0
884,2018/04/05,26055.0,26038.531,26150.0,921100,26195.0,25755.0
885,2018/04/06,25810.0,26187.087,26350.0,1657700,26880.0,25800.0
886,2018/04/09,25600.0,25561.783,25800.0,1113700,25905.0,25320.0
887,2018/04/10,26445.0,26123.803,25555.0,1464600,26585.0,25375.0
888,2018/04/11,26985.0,26922.585,26610.0,1066500,27120.0,26565.0
889,2018/04/12,26445.0,26517.84,26865.0,1008500,26880.0,26370.0
890,2018/04/13,26675.0,26815.97,26745.0,1029600,27030.0,26650.0
891,2018/04/16,26315.0,26443.224,26695.0,740200,26805.0,26255.0
892,2018/04/17,26455.0,26398.838,26255.0,877600,26520.0,26175.0
893,2018/04/18,27215.0,27096.517,26640.0,1198900,27345.0,26525.0
894,2018/04/19,26880.0,27072.935,27220.0,1045900,27385.0,26845.0
895,2018/04/20,26250.0,26313.37,26550.0,1272800,26590.0,26140.0
896,2018/04/23,26235.0,26278.205,26250.0,790200,26430.0,26190.0
897,2018/04/24,26515.0,26499.845,26475.0,970800,26650.0,26275.0
898,2018/04/25,26105.0,26009.818,26125.0,1048900,26175.0,25775.0
899,2018/04/26,25985.0,26035.23,26285.0,1195300,26380.0,25815.0
900,2018/04/27,23560.0,23329.929,22485.0,4239700,24005.0,22390.0
901,2018/05/01,23990.0,23824.27,24025.0,1528000,24085.0,23570.0
902,2018/05/02,23650.0,23680.325,24020.0,1266400,24020.0,23585.0
903,2018/05/07,23685.0,23639.769,23600.0,1021200,23720.0,23550.0
904,2018/05/08,23700.0,23702.781,23700.0,846500,23785.0,23610.0
905,2018/05/09,23415.0,23528.564,23600.0,922400,23690.0,23385.0
906,2018/05/10,23030.0,23154.215,23500.0,1003000,23515.0,23015.0
907,2018/05/11,23600.0,23401.089,23105.0,1127500,23700.0,22900.0
908,2018/05/14,24020.0,23932.457,23600.0,991200,24115.0,23580.0
909,2018/05/15,23820.0,23893.565,24150.0,900100,24165.0,23760.0
910,2018/05/16,23740.0,23777.203,23735.0,822800,23895.0,23700.0
911,2018/05/17,23685.0,23773.472,23840.0,775900,23925.0,23685.0
912,2018/05/18,23980.0,23994.875,23995.0,814400,24100.0,23905.0
913,2018/05/21,24380.0,24267.852,24055.0,798400,24405.0,24030.0
914,2018/05/22,24595.0,24672.917,24610.0,906200,25005.0,24475.0
915,2018/05/23,24200.0,24306.999,24580.0,972500,24595.0,24200.0
916,2018/05/24,23665.0,23752.817,24150.0,948800,24190.0,23565.0
917,2018/05/25,23690.0,23691.391,23500.0,723300,23865.0,23435.0
918,2018/05/28,23880.0,23959.196,23855.0,558900,24200.0,23840.0
919,2018/05/29,23735.0,23686.304,23800.0,542400,23875.0,23530.0
920,2018/05/30,23155.0,23176.393,23300.0,1082600,23360.0,23080.0
921,2018/05/31,23270.0,23241.696,23400.0,1091000,23485.0,23085.0
922,2018/06/01,23115.0,23107.941,23000.0,809200,23255.0,22905.0
923,2018/06/04,22905.0,22847.647,22900.0,1120500,22975.0,22620.0
924,2018/06/05,23130.0,23113.72,23100.0,690400,23225.0,22945.0
925,2018/06/06,22465.0,22457.012,22560.0,1205300,22630.0,22280.0
926,2018/06/07,22705.0,22656.525,22500.0,982900,22780.0,22410.0
927,2018/06/08,22400.0,22500.703,22505.0,1478200,22740.0,22395.0
928,2018/06/11,22790.0,22702.645,22405.0,609400,22865.0,22360.0
929,2018/06/12,22800.0,22941.129,23060.0,879300,23235.0,22800.0
930,2018/06/13,22945.0,22932.918,22905.0,481800,23030.0,22840.0
931,2018/06/14,22710.0,22841.972,22945.0,708500,23175.0,22710.0
932,2018/06/15,22630.0,22635.049,22860.0,895800,22985.0,22475.0
933,2018/06/18,22230.0,22199.022,22500.0,937100,22500.0,21960.0
934,2018/06/19,21895.0,22016.33,22025.0,983200,22395.0,21805.0
935,2018/06/20,22260.0,21971.766,21880.0,888800,22310.0,21635.0
936,2018/06/21,22550.0,22497.547,22385.0,861700,22660.0,22200.0
937,2018/06/22,22230.0,22134.617,22165.0,1149900,22315.0,21840.0
938,2018/06/25,22180.0,22288.582,22445.0,700900,22520.0,22150.0
939,2018/06/26,22335.0,22294.76,22175.0,820800,22530.0,22020.0
940,2018/06/27,21885.0,21998.608,22360.0,791500,22535.0,21830.0
941,2018/06/28,21915.0,21728.659,21825.0,1188100,22005.0,21370.0
942,2018/06/29,22005.0,21883.29,22000.0,1006700,22050.0,21625.0
943,2018/07/02,21635.0,21917.117,22105.0,788700,22375.0,21565.0
944,2018/07/03,21485.0,21445.43,21670.0,1133100,21780.0,21165.0
945,2018/07/04,21020.0,21077.028,21295.0,917000,21395.0,20935.0
946,2018/07/05,20895.0,20956.355,21045.0,944100,21330.0,20800.0
947,2018/07/06,21300.0,21198.823,21190.0,1313400,21340.0,20915.0
948,2018/07/09,21415.0,21294.754,21345.0,696200,21435.0,21095.0
949,2018/07/10,21735.0,21830.648,21795.0,1188100,22055.0,21700.0
950,2018/07/11,21455.0,21444.246,21570.0,1029300,21655.0,21155.0
951,2018/07/12,21645.0,21591.862,21545.0,850500,21825.0,21255.0
952,2018/07/13,22065.0,22110.589,22145.0,1460900,22375.0,21825.0
953,2018/07/17,21170.0,21375.324,21600.0,1405200,21730.0,21170.0
954,2018/07/18,21265.0,21366.809,21375.0,785600,21555.0,21260.0
955,2018/07/19,21360.0,21381.813,21385.0,861100,21540.0,21270.0
956,2018/07/20,21155.0,21191.892,21425.0,1109100,21445.0,20925.0
957,2018/07/23,20660.0,20622.203,20800.0,1303000,20810.0,20420.0
958,2018/07/24,21440.0,21187.633,20900.0,1259100,21480.0,20745.0
959,2018/07/25,21915.0,21851.373,22020.0,1352700,22280.0,21615.0
960,2018/07/26,21115.0,21163.185,20915.0,2530800,21560.0,20695.0
961,2018/07/27,21465.0,21403.908,21115.0,937900,21565.0,21090.0
962,2018/07/30,21575.0,21526.257,21400.0,662800,21635.0,21355.0
963,2018/07/31,21920.0,21900.087,21705.0,1056100,22190.0,21535.0
964,2018/08/01,22375.0,22438.927,22355.0,1575100,22715.0,22225.0
965,2018/08/02,21665.0,21798.06,22120.0,1414600,22220.0,21565.0
966,2018/08/03,21915.0,21889.442,21730.0,859500,22025.0,21675.0
967,2018/08/06,22140.0,22144.828,22015.0,902300,22260.0,22005.0
968,2018/08/07,21940.0,21898.585,22045.0,804800,22100.0,21675.0
969,2018/08/08,22245.0,22148.417,21980.0,920800,22285.0,21745.0
970,2018/08/09,22250.0,22065.483,22055.0,909400,22320.0,21815.0
971,2018/08/10,21710.0,21897.245,22065.0,1432400,22180.0,21710.0
972,2018/08/13,21370.0,21380.464,21460.0,1358800,21575.0,21250.0
973,2018/08/14,21725.0,21547.01,21360.0,1077100,21730.0,21340.0
974,2018/08/15,21330.0,21397.749,21765.0,769500,21765.0,21235.0
975,2018/08/16,21545.0,21463.272,21300.0,1299200,21805.0,21110.0
976,2018/08/17,21855.0,21838.796,21675.0,732200,22015.0,21665.0
977,2018/08/20,21745.0,21717.358,21770.0,638400,21840.0,21565.0
978,2018/08/21,21850.0,21765.636,21745.0,762800,21940.0,21575.0
979,2018/08/22,21925.0,21889.641,21850.0,516900,21970.0,21765.0
980,2018/08/23,21635.0,21750.487,22130.0,794300,22140.0,21595.0
981,2018/08/24,21390.0,21414.755,21485.0,688800,21540.0,21335.0
982,2018/08/27,21825.0,21786.838,21530.0,698200,21950.0,21480.0
983,2018/08/28,22300.0,22373.369,22165.0,1134600,22580.0,22125.0
984,2018/08/29,22165.0,22167.007,22125.0,813300,22310.0,22020.0
985,2018/08/30,22215.0,22341.133,22515.0,822100,22590.0,22215.0
986,2018/08/31,21775.0,21827.278,21880.0,1155800,21940.0,21750.0
987,2018/09/03,21345.0,21520.789,21860.0,838000,21860.0,21330.0
988,2018/09/04,21395.0,21382.003,21415.0,829000,21475.0,21280.0
989,2018/09/05,21255.0,21230.658,21325.0,1049500,21345.0,21095.0
990,2018/09/06,21155.0,21097.076,21005.0,923500,21225.0,20940.0
991,2018/09/07,20690.0,20734.781,20930.0,1504400,20950.0,20465.0
992,2018/09/10,20845.0,20932.736,20805.0,951900,21100.0,20730.0
993,2018/09/11,21020.0,20965.575,20850.0,777800,21090.0,20725.0
994,2018/09/12,20890.0,20940.207,21230.0,723800,21265.0,20780.0
995,2018/09/13,21100.0,21170.424,20870.0,949700,21410.0,20850.0
996,2018/09/14,21690.0,21626.704,21495.0,1913100,21910.0,21415.0
997,2018/09/18,21775.0,21606.575,21275.0,1384900,21915.0,21185.0
998,2018/09/19,22170.0,22236.674,22145.0,1320500,22535.0,21965.0
999,2018/09/20,22330.0,22464.279,22440.0,1612400,22760.0,22235.0
1000,2018/09/21,22570.0,22630.715,22675.0,1540200,22800.0,22525.0
1001,2018/09/25,22495.0,22492.069,22785.0,1084700,22795.0,22220.0
1002,2018/09/26,22200.0,22253.81,22520.0,948600,22545.0,22125.0
1003,2018/09/27,21385.0,21468.852,21910.0,1750600,21925.0,21320.0
1004,2018/09/28,21420.0,21541.83,21760.0,1378500,21760.0,21420.0
1005,2018/10/01,21725.0,21661.403,21400.0,1014500,21865.0,21250.0
1006,2018/10/02,22265.0,22293.947,22050.0,1828800,22510.0,22020.0
1007,2018/10/03,21855.0,21954.963,22290.0,1049100,22300.0,21760.0
1008,2018/10/04,21690.0,21801.038,22120.0,1240900,22245.0,21570.0
1009,2018/10/05,21345.0,21373.849,21335.0,1049400,21600.0,21225.0
1010,2018/10/09,20820.0,20819.673,21070.0,1333200,21130.0,20570.0
1011,2018/10/10,20400.0,20488.412,20700.0,1576600,20740.0,20370.0
1012,2018/10/11,19005.0,19086.066,19125.0,3241600,19550.0,18740.0
1013,2018/10/12,19450.0,19224.011,19000.0,2218300,19450.0,19000.0
1014,2018/10/15,19355.0,19363.728,19425.0,1075500,19570.0,19160.0
1015,2018/10/16,19880.0,19677.469,19350.0,975200,19890.0,19310.0
1016,2018/10/17,19990.0,20085.385,20250.0,1151400,20335.0,19905.0
1017,2018/10/18,19175.0,19306.147,19990.0,1591000,19990.0,19050.0
1018,2018/10/19,19175.0,18970.065,18775.0,1650400,19205.0,18740.0
1019,2018/10/22,19265.0,19145.123,18895.0,814800,19380.0,18820.0
1020,2018/10/23,18860.0,18898.719,19075.0,1297300,19235.0,18705.0
1021,2018/10/24,18860.0,18910.432,18870.0,1258100,19130.0,18815.0
1022,2018/10/25,18080.0,18093.831,18000.0,1970100,18450.0,17925.0
1023,2018/10/26,17690.0,17751.893,18065.0,1610300,18135.0,17375.0
1024,2018/10/29,17915.0,17948.848,18115.0,1203500,18265.0,17675.0
1025,2018/10/30,18520.0,18427.331,17805.0,2140600,18895.0,17805.0
1026,2018/10/31,19735.0,19384.778,19310.0,2176500,19735.0,18560.0
1027,2018/11/01,19920.0,19885.11,20200.0,1353500,20270.0,19485.0
1028,2018/11/02,21095.0,20748.025,19765.0,2944400,21980.0,19645.0
1029,2018/11/05,20920.0,20932.769,20595.0,1339900,21195.0,20505.0
1030,2018/11/06,21205.0,21156.767,21015.0,912100,21300.0,20810.0
1031,2018/11/07,20875.0,21208.387,21210.0,1559900,21645.0,20735.0
1032,2018/11/08,20565.0,20914.325,21420.0,1644700,21465.0,20550.0
1033,2018/11/09,19580.0,19826.071,20375.0,1947300,20375.0,19580.0
1034,2018/11/12,20085.0,19933.256,19500.0,1075200,20215.0,19145.0
1035,2018/11/13,19225.0,19028.174,19000.0,2128600,19355.0,18550.0
1036,2018/11/14,19385.0,19331.189,19225.0,1083600,19475.0,19010.0
1037,2018/11/15,19010.0,18997.774,19135.0,1270300,19290.0,18810.0
1038,2018/11/16,18640.0,18822.831,18880.0,1806600,19140.0,18575.0
1039,2018/11/19,19000.0,19051.736,18705.0,981200,19335.0,18700.0
1040,2018/11/20,18595.0,18463.741,18500.0,1277000,18650.0,18230.0
1041,2018/11/21,18575.0,18417.463,18035.0,1252800,18640.0,18005.0
1042,2018/11/22,18560.0,18611.31,18600.0,862600,18875.0,18480.0
1043,2018/11/26,19115.0,19011.69,18795.0,1082600,19170.0,18370.0
1044,2018/11/27,19255.0,19214.574,19315.0,995200,19400.0,18885.0
1045,2018/11/28,19530.0,19480.763,19205.0,1070700,19585.0,19170.0
1046,2018/11/29,19525.0,19531.77,19700.0,1064600,19875.0,19215.0
1047,2018/11/30,19390.0,19349.856,19315.0,1497000,19495.0,19125.0
1048,2018/12/03,19595.0,19767.159,19755.0,1215000,20075.0,19595.0
1049,2018/12/04,18590.0,18816.456,19100.0,1700800,19220.0,18560.0
1050,2018/12/05,17955.0,18020.411,17995.0,1789500,18280.0,17780.0
1051,2018/12/06,17750.0,17700.021,17820.0,1467300,17935.0,17480.0
1052,2018/12/07,17730.0,17693.602,17785.0,1033100,18015.0,17440.0
1053,2018/12/10,17390.0,17271.593,17000.0,1326400,17465.0,16950.0
1054,2018/12/11,17020.0,17105.482,17400.0,1329000,17420.0,16985.0
1055,2018/12/12,17225.0,17257.744,17150.0,1605100,17555.0,16990.0
1056,2018/12/13,17470.0,17427.101,17415.0,1265200,17665.0,17175.0
1057,2018/12/14,16905.0,17069.629,17250.0,2178700,17310.0,16845.0
1058,2018/12/17,16910.0,17002.399,16940.0,1038300,17260.0,16860.0
1059,2018/12/18,16850.0,16885.573,16770.0,1458900,17110.0,16610.0
1060,2018/12/19,16950.0,16980.143,16900.0,1211500,17195.0,16830.0
1061,2018/12/20,16340.0,16462.719,16760.0,1684600,16810.0,16215.0
1062,2018/12/21,16500.0,16425.443,16250.0,1794000,16555.0,16210.0
1063,2018/12/25,15790.0,15954.985,15945.0,1626200,16235.0,15760.0
1064,2018/12/26,16175.0,16014.42,15945.0,1332000,16220.0,15790.0
1065,2018/12/27,16415.0,16475.768,16720.0,1328400,16750.0,16320.0
1066,2018/12/28,16670.0,16604.096,16135.0,1346900,16760.0,16125.0
1067,2019/01/04,15935.0,15826.052,16075.0,1828600,16320.0,15570.0
1068,2019/01/07,16630.0,16760.34,16650.0,1843700,17125.0,16585.0
1069,2019/01/08,17190.0,17210.561,17210.0,1626700,17340.0,16975.0
1070,2019/01/09,17515.0,17519.225,17460.0,1331500,17665.0,17260.0
1071,2019/01/10,17090.0,17063.518,17340.0,1343800,17340.0,16830.0
1072,2019/01/11,17185.0,17319.867,17430.0,1659800,17525.0,17050.0
1073,2019/01/15,18000.0,17742.491,17200.0,1635400,18115.0,17110.0
1074,2019/01/16,17920.0,17913.807,18000.0,1012500,18050.0,17685.0
1075,2019/01/17,18010.0,18097.902,18205.0,890400,18260.0,17965.0
1076,2019/01/18,18450.0,18304.139,18135.0,1570000,18450.0,18065.0
1077,2019/01/21,18575.0,18568.224,18755.0,1021900,18795.0,18350.0
1078,2019/01/22,18185.0,18243.281,18570.0,952800,18610.0,18065.0
1079,2019/01/23,18075.0,18029.673,17820.0,985800,18200.0,17780.0
1080,2019/01/24,18190.0,18120.759,18020.0,660300,18235.0,17945.0
1081,2019/01/25,18645.0,18585.407,18185.0,920600,18760.0,18185.0
1082,2019/01/28,18675.0,18741.128,18740.0,948700,19070.0,18570.0
1083,2019/01/29,18145.0,18102.74,18275.0,1343000,18345.0,17905.0
1084,2019/01/30,18180.0,18274.206,18440.0,915100,18510.0,18170.0
1085,2019/01/31,18360.0,18388.636,18545.0,967500,18615.0,18215.0
1086,2019/02/01,18725.0,18868.159,19000.0,1472900,19140.0,18665.0
1087,2019/02/04,18615.0,18660.973,18800.0,797300,18895.0,18535.0
1088,2019/02/05,18930.0,18915.305,18790.0,881200,19055.0,18745.0
1089,2019/02/06,18890.0,18897.851,18955.0,724700,19050.0,18720.0
1090,2019/02/07,18795.0,18780.643,18845.0,622700,18950.0,18610.0
1091,2019/02/08,18045.0,18188.407,18495.0,1340800,18630.0,17960.0
1092,2019/02/12,18835.0,18649.364,18300.0,1452300,18915.0,18240.0
1093,2019/02/13,19295.0,19304.414,19210.0,1186900,19565.0,18930.0
1094,2019/02/14,18955.0,19071.133,19145.0,969300,19320.0,18930.0
1095,2019/02/15,18840.0,18865.57,18955.0,999700,19020.0,18690.0
1096,2019/02/18,19400.0,19313.867,19200.0,930700,19445.0,19130.0
1097,2019/02/19,19350.0,19305.935,19270.0,608100,19400.0,19125.0
1098,2019/02/20,19410.0,19430.064,19445.0,667400,19545.0,19355.0
1099,2019/02/21,19415.0,19394.57,19400.0,879300,19510.0,19115.0
1100,2019/02/22,19455.0,19278.454,19200.0,698400,19480.0,19005.0
1101,2019/02/25,19330.0,19386.366,19330.0,802500,19510.0,19310.0
1102,2019/02/26,19080.0,19177.13,19245.0,789500,19470.0,19000.0
1103,2019/02/27,18840.0,18872.521,19100.0,972000,19110.0,18730.0
1104,2019/02/28,18440.0,18499.845,18770.0,910700,18770.0,18360.0
1105,2019/03/01,18795.0,18755.108,18615.0,780300,18920.0,18570.0
1106,2019/03/04,19450.0,19361.258,19000.0,1037000,19525.0,19000.0
1107,2019/03/05,19200.0,19178.233,19180.0,914800,19375.0,19040.0
1108,2019/03/06,19095.0,19117.577,19140.0,659300,19215.0,19060.0
1109,2019/03/07,18560.0,18536.113,18850.0,1282100,18895.0,18350.0
1110,2019/03/08,18315.0,18390.263,18490.0,1700700,18505.0,18170.0
1111,2019/03/11,18270.0,18214.632,18245.0,701300,18340.0,18005.0
1112,2019/03/12,18690.0,18706.73,18620.0,961300,18830.0,18505.0
1113,2019/03/13,18365.0,18465.433,18655.0,871000,18800.0,18315.0
1114,2019/03/14,18630.0,18695.739,18625.0,925200,18850.0,18605.0
1115,2019/03/15,18895.0,18876.594,18635.0,1201800,19000.0,18605.0
1116,2019/03/18,19200.0,19129.418,19005.0,725700,19205.0,18990.0
1117,2019/03/19,19355.0,19280.767,19205.0,667900,19355.0,19060.0
1118,2019/03/20,19280.0,19251.161,19260.0,777600,19380.0,19155.0
1119,2019/03/22,19550.0,19494.45,19435.0,1084200,19720.0,19330.0
1120,2019/03/25,18800.0,18808.639,19000.0,1369000,19080.0,18655.0
1121,2019/03/26,19120.0,19033.416,18950.0,1061100,19140.0,18805.0
1122,2019/03/27,18965.0,18917.233,18915.0,989800,18980.0,18755.0
1123,2019/03/28,18715.0,18688.481,18670.0,957100,18800.0,18535.0
1124,2019/03/29,18880.0,18878.96,18950.0,688900,18980.0,18775.0
1125,2019/04/01,19335.0,19414.208,19280.0,1342800,19635.0,19210.0
1126,2019/04/02,20195.0,20029.623,19700.0,1775200,20230.0,19630.0
1127,2019/04/03,20745.0,20717.512,20300.0,1937700,21070.0,20300.0
1128,2019/04/04,20735.0,20888.099,21110.0,1171500,21160.0,20685.0
1129,2019/04/05,20985.0,20940.386,20730.0,800000,21075.0,20675.0
1130,2019/04/08,20830.0,20847.215,21080.0,891400,21145.0,20665.0
1131,2019/04/09,21300.0,21207.766,21005.0,1245600,21330.0,20995.0
1132,2019/04/10,21290.0,21161.357,21000.0,1040300,21290.0,20915.0
1133,2019/04/11,21230.0,21232.335,21300.0,918200,21350.0,21090.0
1134,2019/04/12,21040.0,21025.738,21185.0,1317000,21185.0,20750.0
1135,2019/04/15,21580.0,21469.189,21410.0,1189200,21595.0,21265.0
1136,2019/04/16,21520.0,21460.38,21400.0,1098200,21600.0,21310.0
1137,2019/04/17,21610.0,21734.928,21730.0,1144800,21970.0,21555.0
1138,2019/04/18,21645.0,21791.626,21780.0,1123300,22060.0,21600.0
1139,2019/04/19,21955.0,21904.099,21885.0,583500,22000.0,21760.0
1140,2019/04/22,21645.0,21732.513,21935.0,641000,21935.0,21605.0
1141,2019/04/23,21555.0,21520.204,21595.0,744000,21680.0,21355.0
1142,2019/04/24,21415.0,21566.931,21690.0,1033200,21835.0,21340.0
1143,2019/04/25,21350.0,21272.296,20915.0,1988100,21530.0,20760.0
1144,2019/04/26,20775.0,20795.972,20915.0,1430600,21000.0,20670.0
1145,2019/05/07,20105.0,20161.329,20270.0,1915800,20355.0,20050.0
1146,2019/05/08,19655.0,19671.218,19530.0,1329300,19875.0,19435.0
1147,2019/05/09,19000.0,19131.132,19440.0,1646400,19580.0,18975.0
1148,2019/05/10,19150.0,19163.78,19060.0,1515000,19505.0,18985.0
1149,2019/05/13,19045.0,19066.85,19000.0,922500,19175.0,18985.0
1150,2019/05/14,19060.0,18964.533,18600.0,2059400,19300.0,18500.0
1151,2019/05/15,19250.0,19171.98,19235.0,1229500,19290.0,19000.0
1152,2019/05/16,19000.0,18995.86,19250.0,1040000,19280.0,18900.0
1153,2019/05/17,18925.0,19039.76,19155.0,814600,19240.0,18895.0
1154,2019/05/20,18655.0,18733.288,18890.0,813200,19050.0,18620.0
1155,2019/05/21,18705.0,18530.132,18400.0,1098800,18840.0,18275.0
1156,2019/05/22,18630.0,18710.82,18935.0,660600,18955.0,18595.0
1157,2019/05/23,18635.0,18604.038,18500.0,844400,18675.0,18425.0
1158,2019/05/24,18450.0,18389.652,18340.0,1278400,18510.0,18265.0
1159,2019/05/27,18280.0,18287.466,18400.0,740900,18450.0,18150.0
1160,2019/05/28,18335.0,18373.689,18300.0,1041100,18475.0,18230.0
1161,2019/05/29,18335.0,18203.842,18045.0,1005700,18385.0,17965.0
1162,2019/05/30,18650.0,18467.586,18210.0,883200,18670.0,18185.0
1163,2019/05/31,18475.0,18540.136,18515.0,1190900,18715.0,18340.0
1164,2019/06/03,17865.0,17956.88,18100.0,1264900,18205.0,17830.0
1165,2019/06/04,18255.0,18143.996,17800.0,1418700,18295.0,17615.0
1166,2019/06/05,18800.0,18819.348,18655.0,1039400,19025.0,18620.0
1167,2019/06/06,18720.0,18760.836,18800.0,632000,18960.0,18645.0
1168,2019/06/07,18905.0,18918.519,18875.0,659200,19025.0,18720.0
1169,2019/06/10,19260.0,19242.573,19375.0,914300,19450.0,19105.0
1170,2019/06/11,19380.0,19341.723,19130.0,481100,19470.0,19110.0
1171,2019/06/12,19345.0,19483.298,19380.0,905000,19735.0,19235.0
1172,2019/06/13,19305.0,19266.352,19215.0,611100,19345.0,19160.0
1173,2019/06/14,19325.0,19320.288,19330.0,885000,19375.0,19205.0
1174,2019/06/17,19280.0,19241.588,19265.0,539600,19340.0,19110.0
1175,2019/06/18,19110.0,19176.278,19250.0,766600,19360.0,19075.0
1176,2019/06/19,19570.0,19559.432,19475.0,824100,19705.0,19345.0
1177,2019/06/20,19860.0,19760.161,19695.0,782800,19870.0,19555.0
1178,2019/06/21,19960.0,20008.505,20000.0,1165900,20200.0,19875.0
1179,2019/06/24,20040.0,19968.214,19755.0,587600,20095.0,19755.0
1180,2019/06/25,19725.0,19760.377,19815.0,782900,20020.0,19610.0
1181,2019/06/26,19710.0,19747.591,19645.0,518900,19935.0,19620.0
1182,2019/06/27,20035.0,20000.895,19930.0,653200,20090.0,19860.0
1183,2019/06/28,19930.0,19883.414,19950.0,892700,20060.0,19725.0
1184,2019/07/01,20540.0,20465.992,20430.0,866400,20585.0,20220.0
1185,2019/07/02,20400.0,20432.205,20490.0,932700,20515.0,20325.0
1186,2019/07/03,19900.0,19947.332,20220.0,762800,20240.0,19805.0
1187,2019/07/04,19920.0,19899.004,19970.0,570800,19985.0,19755.0
1188,2019/07/05,20180.0,20135.493,20000.0,617300,20215.0,19940.0
1189,2019/07/08,19990.0,19975.129,20000.0,653800,20090.0,19900.0
1190,2019/07/09,20010.0,19972.779,19985.0,690000,20030.0,19900.0
1191,2019/07/10,19595.0,19670.087,19840.0,968900,19855.0,19595.0
1192,2019/07/11,19605.0,19563.325,19500.0,675300,19650.0,19415.0
1193,2019/07/12,19215.0,19256.31,19410.0,886600,19435.0,19105.0
1194,2019/07/16,18925.0,19010.837,19070.0,852200,19255.0,18925.0
1195,2019/07/17,18820.0,18917.064,18990.0,679300,19080.0,18810.0
1196,2019/07/18,18450.0,18488.758,18735.0,966600,18740.0,18370.0
1197,2019/07/19,18875.0,18824.805,18635.0,662800,18930.0,18615.0
1198,2019/07/22,19030.0,18927.745,18840.0,673300,19030.0,18715.0
1199,2019/07/23,19485.0,19334.76,18990.0,759100,19495.0,18935.0
1200,2019/07/24,19875.0,19854.109,19740.0,878400,19965.0,19705.0
1201,2019/07/25,19900.0,19923.685,19835.0,627900,20045.0,19795.0
1202,2019/07/26,19585.0,19610.477,19880.0,687800,19890.0,19470.0
1203,2019/07/29,19265.0,19310.246,19565.0,750400,19565.0,19205.0
1204,2019/07/30,19870.0,19902.996,19800.0,1311100,20085.0,19665.0
1205,2019/07/31,19530.0,19620.75,19630.0,1051000,19900.0,19530.0
1206,2019/08/01,19615.0,19555.906,19350.0,795400,19705.0,19300.0
1207,2019/08/02,18875.0,18907.726,19025.0,1410500,19135.0,18795.0
1208,2019/08/05,18405.0,18464.486,18645.0,1108500,18820.0,18280.0
1209,2019/08/06,18305.0,18006.641,17775.0,1393800,18340.0,17580.0
1210,2019/08/07,18020.0,18030.871,18230.0,924800,18275.0,17850.0
1211,2019/08/08,18205.0,18191.854,18035.0,702700,18325.0,17975.0
1212,2019/08/09,17925.0,18081.223,18310.0,1114500,18310.0,17920.0
1213,2019/08/13,17825.0,17759.645,17630.0,1081600,17880.0,17610.0
1214,2019/08/14,18180.0,18191.811,18225.0,869300,18430.0,18060.0
1215,2019/08/15,18065.0,17924.195,17675.0,817600,18075.0,17640.0
1216,2019/08/16,17925.0,17885.317,17850.0,914100,17985.0,17745.0
1217,2019/08/19,18010.0,18020.399,18150.0,792800,18160.0,17935.0
1218,2019/08/20,18180.0,18171.252,18095.0,852000,18240.0,18020.0
1219,2019/08/21,18315.0,18261.951,18080.0,1071200,18425.0,18075.0
1220,2019/08/22,18375.0,18459.554,18480.0,1104100,18640.0,18320.0
1221,2019/08/23,18455.0,18457.016,18170.0,776700,18600.0,18170.0
