ds,yhat
2019-08-09,980.0844219430412
2019-08-13,890.9901969276522
2019-08-14,882.8041441574189
2019-08-15,879.7545304681454
2019-08-16,877.6680176796483
2019-08-19,847.5157063379462
2019-08-20,837.9322655362242
2019-08-21,837.4042106801571
2019-08-22,845.0827284013203
2019-08-23,853.5617665776001
2019-08-26,824.604768969704
2019-08-27,811.2241474014072
2019-08-28,810.3711781093739
2019-08-29,821.2433091020822
2019-08-30,834.7578496317178
2019-09-02,824.2779694112975
2019-09-03,817.5368878152813
2019-09-04,821.851252006258
2019-09-05,836.028158609912
2019-09-06,852.3224551361874
