,DateTime,Open,High,Low,Close,VWAP,Trades,Volume,DS
0,2019/11/19 9:00:00,2070.0,2110.0,2070.0,2110.0,2081.857,8,1400.0,2019-11-19 09:00:00
1,2019/11/19 9:02:00,2110.0,2110.0,2110.0,2110.0,2110.0,1,100.0,2019-11-19 09:02:00
2,2019/11/19 9:04:00,2102.0,2102.0,2102.0,2102.0,2102.0,1,100.0,2019-11-19 09:04:00
3,2019/11/19 9:09:00,2106.0,2111.0,2106.0,2111.0,2107.667,2,300.0,2019-11-19 09:09:00
4,2019/11/19 9:10:00,2115.0,2120.0,2115.0,2120.0,2116.75,4,400.0,2019-11-19 09:10:00
5,2019/11/19 9:12:00,2107.0,2107.0,2107.0,2107.0,2107.0,1,100.0,2019-11-19 09:12:00
6,2019/11/19 9:13:00,2106.0,2106.0,2106.0,2106.0,2106.0,1,100.0,2019-11-19 09:13:00
7,2019/11/19 9:14:00,2099.0,2113.0,2099.0,2113.0,2108.333,3,300.0,2019-11-19 09:14:00
8,2019/11/19 9:17:00,2109.0,2109.0,2109.0,2109.0,2109.0,1,100.0,2019-11-19 09:17:00
9,2019/11/19 9:26:00,2109.0,2116.0,2088.0,2116.0,2099.64,10,2500.0,2019-11-19 09:26:00
10,2019/11/19 9:27:00,2110.0,2116.0,2110.0,2116.0,2113.0,2,200.0,2019-11-19 09:27:00
11,2019/11/19 9:38:00,2108.0,2108.0,2108.0,2108.0,2108.0,1,100.0,2019-11-19 09:38:00
12,2019/11/19 9:40:00,2110.0,2120.0,2110.0,2120.0,2116.5,3,400.0,2019-11-19 09:40:00
13,2019/11/19 9:46:00,2123.0,2124.0,2123.0,2124.0,2123.5,2,200.0,2019-11-19 09:46:00
14,2019/11/19 9:49:00,2125.0,2128.0,2125.0,2128.0,2126.5,2,200.0,2019-11-19 09:49:00
15,2019/11/19 9:52:00,2129.0,2129.0,2129.0,2129.0,2129.0,1,100.0,2019-11-19 09:52:00
16,2019/11/19 9:54:00,2121.0,2121.0,2120.0,2120.0,2120.286,2,700.0,2019-11-19 09:54:00
17,2019/11/19 10:02:00,2120.0,2130.0,2120.0,2130.0,2126.9,4,1000.0,2019-11-19 10:02:00
18,2019/11/19 10:03:00,2133.0,2140.0,2133.0,2140.0,2135.727,7,1100.0,2019-11-19 10:03:00
19,2019/11/19 10:05:00,2150.0,2162.0,2150.0,2157.0,2155.125,5,800.0,2019-11-19 10:05:00
20,2019/11/19 10:06:00,2157.0,2157.0,2157.0,2157.0,2157.0,1,100.0,2019-11-19 10:06:00
21,2019/11/19 10:09:00,2157.0,2158.0,2157.0,2158.0,2157.5,2,200.0,2019-11-19 10:09:00
22,2019/11/19 10:14:00,2158.0,2158.0,2158.0,2158.0,2158.0,1,100.0,2019-11-19 10:14:00
23,2019/11/19 10:15:00,2165.0,2165.0,2165.0,2165.0,2165.0,1,100.0,2019-11-19 10:15:00
24,2019/11/19 10:16:00,2160.0,2160.0,2160.0,2160.0,2160.0,1,100.0,2019-11-19 10:16:00
25,2019/11/19 10:22:00,2174.0,2174.0,2174.0,2174.0,2174.0,1,100.0,2019-11-19 10:22:00
26,2019/11/19 10:23:00,2174.0,2174.0,2174.0,2174.0,2174.0,1,100.0,2019-11-19 10:23:00
27,2019/11/19 10:24:00,2174.0,2174.0,2174.0,2174.0,2174.0,1,100.0,2019-11-19 10:24:00
28,2019/11/19 10:26:00,2174.0,2174.0,2174.0,2174.0,2174.0,1,100.0,2019-11-19 10:26:00
29,2019/11/19 10:27:00,2165.0,2165.0,2165.0,2165.0,2165.0,1,100.0,2019-11-19 10:27:00
30,2019/11/19 10:31:00,2162.0,2162.0,2162.0,2162.0,2162.0,1,100.0,2019-11-19 10:31:00
31,2019/11/19 10:33:00,2160.0,2160.0,2160.0,2160.0,2160.0,1,100.0,2019-11-19 10:33:00
32,2019/11/19 10:37:00,2150.0,2150.0,2150.0,2150.0,2150.0,1,100.0,2019-11-19 10:37:00
33,2019/11/19 10:42:00,2150.0,2150.0,2150.0,2150.0,2150.0,1,100.0,2019-11-19 10:42:00
34,2019/11/19 10:51:00,2150.0,2150.0,2150.0,2150.0,2150.0,1,100.0,2019-11-19 10:51:00
35,2019/11/19 10:52:00,2150.0,2150.0,2150.0,2150.0,2150.0,1,100.0,2019-11-19 10:52:00
36,2019/11/19 10:53:00,2150.0,2150.0,2150.0,2150.0,2150.0,1,100.0,2019-11-19 10:53:00
37,2019/11/19 11:00:00,2145.0,2145.0,2145.0,2145.0,2145.0,1,100.0,2019-11-19 11:00:00
38,2019/11/19 11:13:00,2147.0,2147.0,2147.0,2147.0,2147.0,1,100.0,2019-11-19 11:13:00
39,2019/11/19 11:26:00,2163.0,2165.0,2163.0,2165.0,2164.4,4,500.0,2019-11-19 11:26:00
40,2019/11/19 12:30:00,2166.0,2166.0,2166.0,2166.0,2166.0,3,500.0,2019-11-19 12:30:00
41,2019/11/19 12:31:00,2170.0,2190.0,2170.0,2190.0,2182.714,6,1400.0,2019-11-19 12:31:00
42,2019/11/19 12:33:00,2199.0,2200.0,2199.0,2200.0,2199.75,4,400.0,2019-11-19 12:33:00
43,2019/11/19 12:34:00,2212.0,2212.0,2212.0,2212.0,2212.0,1,100.0,2019-11-19 12:34:00
44,2019/11/19 12:35:00,2215.0,2215.0,2215.0,2215.0,2215.0,1,100.0,2019-11-19 12:35:00
45,2019/11/19 12:36:00,2215.0,2219.0,2215.0,2219.0,2216.333,2,300.0,2019-11-19 12:36:00
46,2019/11/19 12:37:00,2217.0,2217.0,2214.0,2214.0,2215.5,2,200.0,2019-11-19 12:37:00
47,2019/11/19 12:38:00,2214.0,2214.0,2214.0,2214.0,2214.0,1,100.0,2019-11-19 12:38:00
48,2019/11/19 12:39:00,2207.0,2207.0,2200.0,2200.0,2203.5,2,200.0,2019-11-19 12:39:00
49,2019/11/19 12:43:00,2188.0,2188.0,2188.0,2188.0,2188.0,1,100.0,2019-11-19 12:43:00
50,2019/11/19 12:48:00,2180.0,2180.0,2180.0,2180.0,2180.0,1,100.0,2019-11-19 12:48:00
51,2019/11/19 13:00:00,2177.0,2177.0,2177.0,2177.0,2177.0,1,100.0,2019-11-19 13:00:00
52,2019/11/19 13:10:00,2180.0,2180.0,2180.0,2180.0,2180.0,1,100.0,2019-11-19 13:10:00
53,2019/11/19 13:17:00,2178.0,2178.0,2178.0,2178.0,2178.0,1,100.0,2019-11-19 13:17:00
54,2019/11/19 13:33:00,2175.0,2175.0,2175.0,2175.0,2175.0,1,100.0,2019-11-19 13:33:00
55,2019/11/19 13:34:00,2180.0,2180.0,2180.0,2180.0,2180.0,1,100.0,2019-11-19 13:34:00
56,2019/11/19 13:39:00,2190.0,2190.0,2190.0,2190.0,2190.0,1,100.0,2019-11-19 13:39:00
57,2019/11/19 13:52:00,2172.0,2172.0,2160.0,2160.0,2168.923,6,1300.0,2019-11-19 13:52:00
58,2019/11/19 13:57:00,2165.0,2170.0,2165.0,2169.0,2168.091,5,1100.0,2019-11-19 13:57:00
59,2019/11/19 14:29:00,2165.0,2165.0,2165.0,2165.0,2165.0,1,100.0,2019-11-19 14:29:00
60,2019/11/19 14:35:00,2162.0,2170.0,2162.0,2170.0,2166.0,2,200.0,2019-11-19 14:35:00
61,2019/11/19 14:48:00,2178.0,2180.0,2178.0,2180.0,2179.25,3,400.0,2019-11-19 14:48:00
62,2019/11/19 14:50:00,2180.0,2180.0,2180.0,2180.0,2180.0,2,200.0,2019-11-19 14:50:00
63,2019/11/19 14:53:00,2188.0,2188.0,2188.0,2188.0,2188.0,1,100.0,2019-11-19 14:53:00
64,2019/11/19 14:54:00,2188.0,2188.0,2188.0,2188.0,2188.0,1,100.0,2019-11-19 14:54:00
65,2019/11/19 14:55:00,2189.0,2190.0,2189.0,2190.0,2189.5,2,200.0,2019-11-19 14:55:00
66,2019/11/19 14:56:00,2190.0,2198.0,2190.0,2198.0,2191.6,2,500.0,2019-11-19 14:56:00
67,2019/11/19 14:59:00,2198.0,2198.0,2198.0,2198.0,2198.0,3,300.0,2019-11-19 14:59:00
68,2019/11/19 15:00:00,2200.0,2200.0,2200.0,2200.0,2200.0,1,200.0,2019-11-19 15:00:00
