ds,yhat
2019-08-08,2648.174493105995
2019-08-09,2739.856760561934
2019-08-13,2876.389211302127
2019-08-14,2996.573927870837
2019-08-15,3109.3280282581973
2019-08-16,3170.6436383664486
2019-08-19,3165.620774875905
2019-08-20,3209.0346141140935
2019-08-21,3273.576370884177
2019-08-22,3328.4026809185834
2019-08-23,3354.1773331811946
2019-08-26,3301.451713894774
2019-08-27,3261.4953247790418
2019-08-28,3218.6558193146475
2019-08-29,3189.55907080213
2019-08-30,3190.434439415827
2019-09-02,3243.0363465851997
2019-09-03,3195.7593528538255
2019-09-04,3132.6215564682543
2019-09-05,3099.246103678858
2019-09-06,3121.758781964664
