ds,yhat
2019-07-16,1334.1229625296805
2019-07-17,1372.1276330678415
2019-07-18,1403.5854448541195
2019-07-19,1425.6380312984797
2019-07-22,1475.253104611109
2019-07-23,1491.983737614797
2019-07-24,1499.3865158256706
2019-07-25,1492.9101898516312
2019-07-26,1476.3042468163783
2019-07-29,1455.340028271274
2019-07-30,1461.213816908157
2019-07-31,1459.6590083041563
2019-08-01,1444.6168665866896
2019-08-02,1417.178251626308
2019-08-05,1311.7317590863288
2019-08-06,1278.6701453378412
2019-08-07,1249.883099628479
2019-08-08,1228.3624824069386
2019-08-09,1215.1313916417191
