,Date,Close,VWAP,Open,Volume,High,Low
0,2014/08/25,6691.0,6654.709,6600.0,960900,6699.0,6576.0
1,2014/08/26,6668.0,6700.588,6691.0,641400,6748.0,6664.0
2,2014/08/27,6740.0,6736.945,6746.0,907300,6774.0,6685.0
3,2014/08/28,6736.0,6738.461,6699.0,888800,6770.0,6686.0
4,2014/08/29,6633.0,6671.093,6704.0,1114700,6761.0,6623.0
5,2014/09/01,6769.0,6756.22,6671.0,924100,6789.0,6652.0
6,2014/09/02,6853.0,6849.238,6789.0,1136200,6877.0,6784.0
7,2014/09/03,6974.0,6968.829,6900.0,1310300,7000.0,6899.0
8,2014/09/04,6850.0,6892.471,6980.0,1000100,6983.0,6841.0
9,2014/09/05,6867.0,6879.326,6899.0,689000,6909.0,6856.0
10,2014/09/08,6875.0,6892.392,6910.0,835600,6919.0,6856.0
11,2014/09/09,6921.0,6959.867,6913.0,1127400,7015.0,6910.0
12,2014/09/10,6958.0,6906.42,6885.0,976300,6960.0,6835.0
13,2014/09/11,6919.0,6960.054,7007.0,841000,7040.0,6911.0
14,2014/09/12,6928.0,6945.416,6968.0,1106000,6986.0,6906.0
15,2014/09/16,6912.0,6891.332,6920.0,1711500,6930.0,6831.0
16,2014/09/17,6824.0,6850.623,6902.0,950900,6902.0,6824.0
17,2014/09/18,6956.0,6939.318,6888.0,1312200,6974.0,6858.0
18,2014/09/19,7124.0,7076.188,7000.0,1916600,7135.0,6968.0
19,2014/09/22,7070.0,7091.073,7124.0,1146500,7145.0,7063.0
20,2014/09/24,7232.0,7181.585,7013.0,1740800,7257.0,7005.0
21,2014/09/25,7393.0,7355.871,7260.0,2055000,7404.0,7240.0
22,2014/09/26,7447.0,7400.44,7381.0,1782000,7482.0,7279.0
23,2014/09/29,7455.0,7437.778,7480.0,1284500,7499.0,7373.0
24,2014/09/30,7420.0,7403.308,7454.0,1243400,7454.0,7345.0
25,2014/10/01,7180.0,7255.717,7332.0,1747100,7353.0,7178.0
26,2014/10/02,6971.0,7025.811,7061.0,1866400,7120.0,6967.0
27,2014/10/03,7016.0,6939.049,6915.0,1957300,7023.0,6866.0
28,2014/10/06,7168.0,7168.288,7171.0,1345700,7206.0,7093.0
29,2014/10/07,7110.0,7147.942,7163.0,1243100,7193.0,7090.0
30,2014/10/08,7045.0,7027.443,7000.0,1220900,7065.0,6955.0
31,2014/10/09,6877.0,6953.338,7070.0,1270000,7078.0,6873.0
32,2014/10/10,6787.0,6797.804,6800.0,1702000,6870.0,6751.0
33,2014/10/14,6573.0,6602.257,6620.0,2081900,6662.0,6517.0
34,2014/10/15,6639.0,6617.378,6614.0,1217100,6666.0,6560.0
35,2014/10/16,6531.0,6535.498,6564.0,1791200,6580.0,6490.0
36,2014/10/17,6449.0,6500.118,6521.0,1392100,6573.0,6449.0
37,2014/10/20,6725.0,6693.938,6643.0,1910000,6736.0,6500.0
38,2014/10/21,6700.0,6717.137,6789.0,1452600,6790.0,6660.0
39,2014/10/22,7017.0,6953.711,6850.0,2088700,7025.0,6850.0
40,2014/10/23,6733.0,6739.88,6795.0,3385300,6863.0,6666.0
41,2014/10/24,6908.0,6922.974,6896.0,2950900,6996.0,6831.0
42,2014/10/27,6920.0,6927.088,7008.0,933700,7014.0,6885.0
43,2014/10/28,6895.0,6915.041,6953.0,943300,6970.0,6874.0
44,2014/10/29,6944.0,6954.659,6977.0,1053000,6989.0,6903.0
45,2014/10/30,6959.0,6974.33,6948.0,1319800,7009.0,6920.0
46,2014/10/31,7222.0,7140.967,7020.0,2227600,7233.0,7015.0
47,2014/11/04,7395.0,7435.51,7500.0,2343100,7540.0,7381.0
48,2014/11/05,7408.0,7380.223,7370.0,1854300,7420.0,7332.0
49,2014/11/06,7378.0,7384.491,7400.0,1345300,7427.0,7309.0
50,2014/11/07,7329.0,7331.78,7358.0,1024500,7388.0,7308.0
51,2014/11/10,7216.0,7227.46,7251.0,1078700,7278.0,7202.0
52,2014/11/11,7354.0,7310.699,7275.0,1347100,7364.0,7224.0
53,2014/11/12,7324.0,7417.654,7460.0,1356800,7491.0,7305.0
54,2014/11/13,7365.0,7346.397,7439.0,967800,7439.0,7280.0
55,2014/11/14,7486.0,7455.506,7472.0,1519900,7487.0,7403.0
56,2014/11/17,7349.0,7395.276,7483.0,1350500,7510.0,7335.0
57,2014/11/18,7457.0,7456.453,7425.0,906900,7500.0,7394.0
58,2014/11/19,7542.0,7535.08,7498.0,1138000,7558.0,7488.0
59,2014/11/20,7560.0,7574.082,7600.0,826800,7624.0,7543.0
60,2014/11/21,7545.0,7522.966,7590.0,911300,7592.0,7476.0
61,2014/11/25,7714.0,7689.395,7656.0,1460200,7735.0,7584.0
62,2014/11/26,7652.0,7676.17,7722.0,929100,7730.0,7652.0
63,2014/11/27,7695.0,7687.132,7645.0,981300,7749.0,7601.0
64,2014/11/28,7872.0,7820.093,7791.0,1196200,7872.0,7722.0
65,2014/12/01,7949.0,7937.723,7939.0,1171000,7995.0,7890.0
66,2014/12/02,7976.0,7930.825,7900.0,1052700,7987.0,7857.0
67,2014/12/03,7927.0,7939.629,7975.0,1030700,7984.0,7902.0
68,2014/12/04,8140.0,8098.552,8028.0,2205800,8213.0,7935.0
69,2014/12/05,8250.0,8219.871,8237.0,1197900,8267.0,8151.0
70,2014/12/08,8360.0,8384.346,8360.0,1541700,8485.0,8342.0
71,2014/12/09,8082.0,8164.32,8230.0,1870400,8282.0,8060.0
72,2014/12/10,7777.0,7811.223,7766.0,3446500,7916.0,7732.0
73,2014/12/11,7778.0,7729.806,7575.0,2311600,7876.0,7570.0
74,2014/12/12,8135.0,8057.234,7921.0,2931900,8230.0,7883.0
75,2014/12/15,7912.0,7910.362,8005.0,2209700,8047.0,7790.0
76,2014/12/16,7850.0,7845.781,7806.0,1407600,7928.0,7781.0
77,2014/12/17,7818.0,7828.041,7771.0,1382400,7897.0,7754.0
78,2014/12/18,7939.0,8005.224,8099.0,1796400,8100.0,7914.0
79,2014/12/19,8164.0,8116.556,8145.0,1740300,8164.0,8018.0
80,2014/12/22,8071.0,8106.138,8219.0,1342300,8225.0,8029.0
81,2014/12/24,8029.0,8050.416,8127.0,1353300,8130.0,8012.0
82,2014/12/25,8010.0,8032.543,8032.0,895300,8072.0,8002.0
83,2014/12/26,8018.0,8041.777,8011.0,752500,8079.0,8010.0
84,2014/12/29,7971.0,7983.803,8097.0,1152700,8097.0,7865.0
85,2014/12/30,7851.0,7871.879,7950.0,1093200,7953.0,7843.0
86,2015/01/05,7868.0,7944.532,8000.0,2107200,8026.0,7857.0
87,2015/01/06,7688.0,7739.863,7768.0,1591500,7810.0,7688.0
88,2015/01/07,7687.0,7710.068,7620.0,1254800,7788.0,7616.0
89,2015/01/08,7868.0,7856.339,7814.0,1349800,7911.0,7792.0
90,2015/01/09,7935.0,7923.091,7953.0,1326400,7977.0,7805.0
91,2015/01/13,7913.0,7845.502,7831.0,1355200,7926.0,7790.0
92,2015/01/14,7716.0,7764.797,7859.0,1608100,7863.0,7709.0
93,2015/01/15,7976.0,7907.635,7750.0,1843800,7993.0,7732.0
94,2015/01/16,7848.0,7842.66,7826.0,1826600,7959.0,7777.0
95,2015/01/19,7824.0,7830.455,7911.0,1230700,7925.0,7783.0
96,2015/01/20,7961.0,7880.28,7854.0,1776400,7964.0,7810.0
97,2015/01/21,8062.0,8034.269,7969.0,2535400,8111.0,7920.0
98,2015/01/22,7998.0,8030.25,8094.0,2048700,8132.0,7931.0
99,2015/01/23,8047.0,7962.243,7954.0,3860000,8079.0,7712.0
100,2015/01/26,7976.0,7949.826,7921.0,1780600,7994.0,7911.0
101,2015/01/27,8125.0,8092.997,8049.0,1937300,8125.0,8021.0
102,2015/01/28,8142.0,8116.941,8085.0,1357100,8163.0,8066.0
103,2015/01/29,8064.0,8117.465,8090.0,1447400,8174.0,8046.0
104,2015/01/30,8074.0,8132.62,8180.0,1529400,8192.0,8065.0
105,2015/02/02,8089.0,8069.416,8036.0,949200,8129.0,7977.0
106,2015/02/03,7856.0,7935.577,8171.0,2057800,8171.0,7815.0
107,2015/02/04,8010.0,8012.673,7999.0,1170900,8057.0,7957.0
108,2015/02/05,8089.0,8094.184,8086.0,1675800,8139.0,8056.0
109,2015/02/06,8113.0,8096.66,8133.0,1244800,8145.0,8000.0
110,2015/02/09,8218.0,8222.786,8180.0,1831400,8273.0,8173.0
111,2015/02/10,8233.0,8214.515,8217.0,1069600,8250.0,8174.0
112,2015/02/12,8210.0,8260.426,8300.0,2025500,8346.0,8192.0
113,2015/02/13,8268.0,8249.329,8210.0,1057600,8286.0,8201.0
114,2015/02/16,8207.0,8227.195,8310.0,1015300,8316.0,8168.0
115,2015/02/17,8171.0,8151.043,8147.0,1190700,8195.0,8081.0
116,2015/02/18,8176.0,8179.222,8225.0,1609900,8225.0,8131.0
117,2015/02/19,8152.0,8143.774,8180.0,1195100,8192.0,8110.0
118,2015/02/20,8186.0,8158.11,8158.0,983700,8189.0,8077.0
119,2015/02/23,8262.0,8253.353,8199.0,1128900,8296.0,8193.0
120,2015/02/24,8186.0,8176.556,8215.0,1264200,8221.0,8152.0
121,2015/02/25,8130.0,8142.015,8181.0,1223900,8192.0,8110.0
122,2015/02/26,8054.0,8042.459,8072.0,2056900,8086.0,8022.0
123,2015/02/27,8072.0,8079.66,8066.0,1855300,8140.0,8041.0
124,2015/03/02,8140.0,8136.458,8101.0,1374900,8150.0,8100.0
125,2015/03/03,8021.0,8043.117,8155.0,1696700,8155.0,8001.0
126,2015/03/04,7854.0,7871.024,7981.0,2400500,7981.0,7842.0
127,2015/03/05,7816.0,7800.196,7809.0,1537100,7850.0,7752.0
128,2015/03/06,7933.0,7915.514,7825.0,1508400,7970.0,7820.0
129,2015/03/09,7865.0,7870.042,7920.0,878200,7920.0,7811.0
130,2015/03/10,7806.0,7846.783,7920.0,1129100,7925.0,7800.0
131,2015/03/11,7730.0,7740.556,7726.0,1861300,7821.0,7634.0
132,2015/03/12,7760.0,7734.928,7730.0,1582900,7799.0,7700.0
133,2015/03/13,7715.0,7740.089,7790.0,2423100,7790.0,7700.0
134,2015/03/16,7695.0,7691.115,7701.0,1223600,7719.0,7675.0
135,2015/03/17,7837.0,7815.501,7770.0,1814200,7878.0,7743.0
136,2015/03/18,7935.0,7901.048,7837.0,2423000,7939.0,7819.0
137,2015/03/19,7943.0,7990.814,7985.0,2554800,8150.0,7868.0
138,2015/03/20,7930.0,7893.758,7910.0,1470000,7939.0,7821.0
139,2015/03/23,8005.0,7991.677,7901.0,1802300,8023.0,7901.0
140,2015/03/24,7993.0,7966.801,7903.0,1141400,8016.0,7885.0
141,2015/03/25,8078.0,8046.383,8012.0,1313500,8078.0,8006.0
142,2015/03/26,8034.0,8036.01,8005.0,1607500,8094.0,7961.0
143,2015/03/27,8120.0,8121.311,8045.0,2839000,8196.0,8011.0
144,2015/03/30,8062.0,8042.743,8120.0,1265100,8125.0,7951.0
145,2015/03/31,7987.0,8062.554,8189.0,1303800,8189.0,7987.0
146,2015/04/01,7900.0,7930.62,7999.0,1791400,8013.0,7854.0
147,2015/04/02,8028.0,8059.221,7995.0,2026200,8144.0,7925.0
148,2015/04/03,8194.0,8142.593,8060.0,1727900,8199.0,8059.0
149,2015/04/06,8116.0,8135.716,8147.0,986300,8193.0,8090.0
150,2015/04/07,8102.0,8116.883,8180.0,1226600,8180.0,8060.0
151,2015/04/08,8159.0,8149.965,8150.0,1184200,8187.0,8111.0
152,2015/04/09,8098.0,8089.944,8100.0,1489800,8130.0,8053.0
153,2015/04/10,8033.0,8047.402,8110.0,1373600,8110.0,8018.0
154,2015/04/13,8111.0,8089.851,8069.0,830100,8127.0,8032.0
155,2015/04/14,8087.0,8089.082,8125.0,719500,8127.0,8060.0
156,2015/04/15,8105.0,8085.126,8052.0,1036500,8120.0,8018.0
157,2015/04/16,8269.0,8193.651,8130.0,1929100,8269.0,8100.0
158,2015/04/17,8220.0,8301.668,8290.0,2568000,8370.0,8197.0
159,2015/04/20,8160.0,8201.426,8196.0,1216800,8255.0,8160.0
160,2015/04/21,8264.0,8257.496,8199.0,1374100,8296.0,8162.0
161,2015/04/22,8335.0,8302.651,8300.0,1639100,8346.0,8225.0
162,2015/04/23,8869.0,8635.198,8290.0,6609100,9075.0,8188.0
163,2015/04/24,8863.0,8832.997,8855.0,2501000,8972.0,8702.0
164,2015/04/27,9127.0,9044.893,8841.0,2621900,9171.0,8806.0
165,2015/04/28,9084.0,9083.405,9098.0,2095800,9200.0,8974.0
166,2015/04/30,8960.0,9072.487,9050.0,2644000,9180.0,8950.0
167,2015/05/01,9052.0,9017.583,8987.0,1561600,9128.0,8920.0
168,2015/05/07,9020.0,8974.049,9000.0,1772400,9047.0,8866.0
169,2015/05/08,8840.0,8864.243,9000.0,1835600,9000.0,8770.0
170,2015/05/11,8963.0,8961.651,8979.0,957000,8994.0,8904.0
171,2015/05/12,8888.0,8884.688,8960.0,975200,8960.0,8824.0
172,2015/05/13,8897.0,8918.103,8874.0,1029700,8975.0,8812.0
173,2015/05/14,9029.0,9035.438,8995.0,1330900,9120.0,8932.0
174,2015/05/15,9103.0,9090.843,9100.0,748300,9120.0,9032.0
175,2015/05/18,9049.0,9057.032,9120.0,794500,9128.0,9021.0
176,2015/05/19,9146.0,9141.376,9100.0,1046300,9189.0,9075.0
177,2015/05/20,9063.0,9119.302,9200.0,1374100,9200.0,9062.0
178,2015/05/21,9018.0,9093.356,9108.0,1098600,9179.0,9017.0
179,2015/05/22,9028.0,9003.398,9063.0,836100,9080.0,8945.0
180,2015/05/25,9043.0,9043.07,9050.0,763600,9092.0,8977.0
181,2015/05/26,9008.0,9019.481,9043.0,602000,9068.0,8994.0
182,2015/05/27,9019.0,9008.665,8950.0,1293700,9110.0,8900.0
183,2015/05/28,9288.0,9250.143,9125.0,2416500,9415.0,9060.0
184,2015/05/29,9085.0,9143.304,9211.0,1982800,9243.0,9066.0
185,2015/06/01,9060.0,9052.07,9045.0,1165000,9144.0,9012.0
186,2015/06/02,9162.0,9154.806,9121.0,1094500,9189.0,9072.0
187,2015/06/03,9157.0,9141.693,9162.0,857800,9176.0,9076.0
188,2015/06/04,9069.0,9070.647,9190.0,1139100,9190.0,9023.0
189,2015/06/05,9097.0,9042.09,9038.0,1258200,9111.0,8933.0
190,2015/06/08,9001.0,9009.102,9070.0,1044000,9085.0,8961.0
191,2015/06/09,8781.0,8862.057,8951.0,1216700,8985.0,8781.0
192,2015/06/10,8829.0,8859.063,8780.0,1020300,8938.0,8752.0
193,2015/06/11,8891.0,8892.48,8903.0,739000,8937.0,8858.0
194,2015/06/12,9106.0,9071.945,9060.0,1946700,9109.0,8979.0
195,2015/06/15,9229.0,9185.397,9098.0,1283300,9238.0,9086.0
196,2015/06/16,9193.0,9210.796,9226.0,867100,9279.0,9126.0
197,2015/06/17,9066.0,9081.759,9159.0,1123300,9188.0,9007.0
198,2015/06/18,9016.0,9070.504,9123.0,876700,9166.0,9011.0
199,2015/06/19,9134.0,9112.125,9050.0,1078600,9151.0,9038.0
200,2015/06/22,9128.0,9099.746,9100.0,708300,9142.0,9065.0
201,2015/06/23,9346.0,9314.873,9250.0,1675700,9376.0,9229.0
202,2015/06/24,9291.0,9344.92,9400.0,867900,9422.0,9287.0
203,2015/06/25,9145.0,9192.652,9203.0,1371800,9286.0,9125.0
204,2015/06/26,9137.0,9146.29,9130.0,836700,9227.0,9071.0
205,2015/06/29,9111.0,9098.514,8899.0,1594000,9251.0,8896.0
206,2015/06/30,9165.0,9159.147,9151.0,1051000,9221.0,9083.0
207,2015/07/01,9387.0,9349.499,9255.0,1329400,9409.0,9241.0
208,2015/07/02,9590.0,9632.375,9552.0,1860900,9725.0,9514.0
209,2015/07/03,9676.0,9664.781,9550.0,1201200,9756.0,9511.0
210,2015/07/06,9526.0,9567.892,9561.0,1042600,9666.0,9518.0
211,2015/07/07,9543.0,9585.924,9555.0,797200,9685.0,9529.0
212,2015/07/08,9182.0,9275.813,9498.0,1544500,9520.0,9172.0
213,2015/07/09,9311.0,9130.821,8999.0,1529000,9315.0,8975.0
214,2015/07/10,9220.0,9276.913,9340.0,1174200,9389.0,9191.0
215,2015/07/13,9414.0,9371.661,9302.0,819200,9450.0,9241.0
216,2015/07/14,9623.0,9612.281,9529.0,963900,9668.0,9517.0
217,2015/07/15,9660.0,9639.107,9676.0,994000,9685.0,9585.0
218,2015/07/16,9815.0,9767.445,9699.0,1100000,9829.0,9650.0
219,2015/07/17,9976.0,9911.547,9815.0,1345400,9978.0,9815.0
220,2015/07/21,9999.0,10009.453,10080.0,1067300,10135.0,9951.0
221,2015/07/22,9831.0,9799.553,9849.0,1644700,9905.0,9637.0
222,2015/07/23,10690.0,10567.83,10300.0,3890600,10850.0,10200.0
223,2015/07/24,10660.0,10624.863,10505.0,1342500,10780.0,10495.0
224,2015/07/27,10625.0,10711.451,10615.0,1832900,10915.0,10590.0
225,2015/07/28,10555.0,10625.738,10500.0,1381100,10740.0,10500.0
226,2015/07/29,10430.0,10501.144,10600.0,1161100,10670.0,10385.0
227,2015/07/30,10345.0,10457.448,10725.0,1283500,10745.0,10300.0
228,2015/07/31,11105.0,10915.655,10615.0,2340300,11105.0,10575.0
229,2015/08/03,11365.0,11263.654,10950.0,1697200,11415.0,10940.0
230,2015/08/04,11200.0,11240.318,11225.0,1268700,11350.0,11145.0
231,2015/08/05,11000.0,11027.224,11005.0,1842400,11170.0,10925.0
232,2015/08/06,11100.0,11167.981,11100.0,854200,11315.0,11020.0
233,2015/08/07,11020.0,11036.905,11140.0,1019700,11195.0,10950.0
234,2015/08/10,11020.0,11002.346,11000.0,732200,11035.0,10950.0
235,2015/08/11,10990.0,11052.397,11120.0,841500,11190.0,10960.0
236,2015/08/12,10535.0,10610.611,10865.0,1548800,10890.0,10435.0
237,2015/08/13,10235.0,10327.995,10500.0,2138100,10620.0,10175.0
238,2015/08/14,10075.0,10122.842,10230.0,1504200,10305.0,10035.0
239,2015/08/17,10175.0,10176.622,10100.0,924600,10310.0,10060.0
240,2015/08/18,10205.0,10181.147,10150.0,784100,10275.0,10070.0
241,2015/08/19,9837.0,9948.346,10140.0,1611100,10160.0,9832.0
242,2015/08/20,9703.0,9848.021,9846.0,1639600,10155.0,9703.0
243,2015/08/21,9232.0,9301.208,9400.0,2648300,9444.0,9194.0
244,2015/08/24,8727.0,8920.902,8932.0,2536000,9171.0,8716.0
245,2015/08/25,8680.0,8925.848,8500.0,3514900,9399.0,8453.0
246,2015/08/26,9377.0,9233.253,9130.0,3058200,9415.0,8958.0
247,2015/08/27,9482.0,9612.64,9800.0,2576200,9848.0,9378.0
248,2015/08/28,9584.0,9578.876,9690.0,1960200,9696.0,9425.0
249,2015/08/31,9506.0,9471.41,9553.0,1429000,9588.0,9364.0
250,2015/09/01,9200.0,9344.134,9500.0,1840200,9523.0,9200.0
251,2015/09/02,9226.0,9244.35,9016.0,1259100,9395.0,9010.0
252,2015/09/03,9381.0,9488.657,9500.0,1198500,9598.0,9377.0
253,2015/09/04,9182.0,9170.876,9333.0,1199500,9350.0,9059.0
254,2015/09/07,9037.0,9020.559,9061.0,1136700,9120.0,8904.0
255,2015/09/08,8693.0,8807.855,9001.0,1612000,9006.0,8649.0
256,2015/09/09,9127.0,9008.107,9050.0,1989900,9127.0,8884.0
257,2015/09/10,8915.0,8844.468,8900.0,1752700,8963.0,8697.0
258,2015/09/11,8853.0,8832.939,8765.0,1762000,8920.0,8741.0
259,2015/09/14,8964.0,9076.794,8970.0,1466800,9289.0,8939.0
260,2015/09/15,8772.0,8889.591,9062.0,1324500,9070.0,8760.0
261,2015/09/16,8829.0,8847.263,8843.0,854100,8926.0,8790.0
262,2015/09/17,9248.0,9183.902,9030.0,1386600,9270.0,9020.0
263,2015/09/18,9071.0,9056.687,9206.0,1622400,9230.0,8983.0
264,2015/09/24,9034.0,9019.535,8950.0,1636100,9127.0,8876.0
265,2015/09/25,8514.0,8523.254,8955.0,3377700,8980.0,8320.0
266,2015/09/28,8454.0,8461.128,8401.0,1523200,8569.0,8373.0
267,2015/09/29,7871.0,7965.697,8288.0,2630900,8294.0,7871.0
268,2015/09/30,8186.0,8109.256,8021.0,1855300,8236.0,7953.0
269,2015/10/01,8452.0,8396.252,8247.0,1683000,8519.0,8193.0
270,2015/10/02,8506.0,8496.679,8393.0,1295100,8607.0,8311.0
271,2015/10/05,8513.0,8512.267,8600.0,1363500,8603.0,8441.0
272,2015/10/06,8450.0,8544.722,8686.0,2220800,8698.0,8450.0
273,2015/10/07,8437.0,8382.538,8442.0,2625200,8462.0,8226.0
274,2015/10/08,8297.0,8375.658,8434.0,2229500,8487.0,8282.0
275,2015/10/09,8543.0,8474.001,8380.0,2167700,8608.0,8328.0
276,2015/10/13,8311.0,8349.098,8508.0,1819800,8536.0,8268.0
277,2015/10/14,8232.0,8210.215,8257.0,1511600,8278.0,8111.0
278,2015/10/15,8493.0,8378.735,8220.0,2226800,8497.0,8193.0
279,2015/10/16,8454.0,8480.377,8570.0,1063600,8595.0,8411.0
280,2015/10/19,8332.0,8341.736,8364.0,1203100,8432.0,8270.0
281,2015/10/20,8596.0,8540.066,8405.0,1686700,8615.0,8401.0
282,2015/10/21,8834.0,8733.271,8627.0,2538100,8850.0,8549.0
283,2015/10/22,8723.0,8944.108,8950.0,5482200,9298.0,8632.0
284,2015/10/23,9100.0,9089.365,9173.0,3731900,9214.0,8865.0
285,2015/10/26,9261.0,9287.104,9300.0,2103800,9383.0,9188.0
286,2015/10/27,8991.0,9033.927,9200.0,1938100,9228.0,8953.0
287,2015/10/28,9050.0,9080.386,9028.0,1725500,9211.0,8999.0
288,2015/10/29,9072.0,9079.888,9145.0,2867200,9159.0,8972.0
289,2015/10/30,9173.0,9160.17,9005.0,2202800,9240.0,9005.0
290,2015/11/02,9121.0,9152.011,9162.0,1541600,9273.0,9070.0
291,2015/11/04,9162.0,9239.022,9264.0,1185200,9312.0,9155.0
292,2015/11/05,9285.0,9268.555,9213.0,1210900,9350.0,9194.0
293,2015/11/06,9342.0,9310.439,9301.0,932700,9347.0,9237.0
294,2015/11/09,9582.0,9517.805,9400.0,1616800,9582.0,9399.0
295,2015/11/10,9669.0,9590.433,9471.0,1548100,9701.0,9450.0
296,2015/11/11,9657.0,9663.925,9613.0,1244000,9728.0,9606.0
297,2015/11/12,9694.0,9707.011,9602.0,1392700,9783.0,9602.0
298,2015/11/13,9733.0,9692.257,9700.0,1498600,9761.0,9585.0
299,2015/11/16,9491.0,9488.054,9495.0,1885800,9610.0,9426.0
300,2015/11/17,9692.0,9703.366,9670.0,1472800,9792.0,9641.0
301,2015/11/18,9575.0,9632.426,9729.0,1199100,9738.0,9566.0
302,2015/11/19,9645.0,9646.269,9700.0,1032500,9710.0,9602.0
303,2015/11/20,9815.0,9737.991,9678.0,1612800,9815.0,9650.0
304,2015/11/24,9864.0,9854.458,9840.0,1653500,9881.0,9818.0
305,2015/11/25,9597.0,9613.836,9752.0,1773700,9764.0,9539.0
306,2015/11/26,9564.0,9562.591,9580.0,1306300,9626.0,9510.0
307,2015/11/27,9419.0,9453.498,9568.0,1374400,9570.0,9380.0
308,2015/11/30,9518.0,9521.394,9440.0,1527500,9637.0,9423.0
309,2015/12/01,9607.0,9553.926,9567.0,1530900,9607.0,9480.0
310,2015/12/02,9405.0,9493.339,9611.0,2000000,9707.0,9392.0
311,2015/12/03,9361.0,9327.951,9380.0,1870500,9411.0,9248.0
312,2015/12/04,9326.0,9281.905,9225.0,1224900,9326.0,9168.0
313,2015/12/07,9348.0,9410.694,9400.0,1167200,9495.0,9342.0
314,2015/12/08,9255.0,9266.289,9351.0,973900,9354.0,9232.0
315,2015/12/09,9200.0,9198.208,9173.0,1095100,9258.0,9152.0
316,2015/12/10,9197.0,9187.249,9127.0,901700,9217.0,9120.0
317,2015/12/11,9251.0,9260.151,9200.0,1336600,9408.0,9180.0
318,2015/12/14,9169.0,9119.122,9100.0,1931000,9208.0,8983.0
319,2015/12/15,8958.0,8999.903,9101.0,1054200,9125.0,8958.0
320,2015/12/16,9109.0,9079.461,9104.0,1105100,9146.0,8981.0
321,2015/12/17,9066.0,9128.324,9245.0,1656600,9251.0,9041.0
322,2015/12/18,8772.0,8895.741,8973.0,2148500,9150.0,8755.0
323,2015/12/21,8664.0,8594.79,8650.0,2060900,8690.0,8430.0
324,2015/12/22,8521.0,8520.273,8632.0,1841000,8639.0,8442.0
325,2015/12/24,8558.0,8605.12,8658.0,1193600,8729.0,8521.0
326,2015/12/25,8622.0,8617.358,8530.0,858300,8677.0,8525.0
327,2015/12/28,8635.0,8661.709,8699.0,705300,8765.0,8603.0
328,2015/12/29,8738.0,8723.9,8637.0,826400,8779.0,8630.0
329,2015/12/30,8837.0,8908.683,8877.0,1377500,9044.0,8809.0
330,2016/01/04,8602.0,8631.747,8726.0,1418100,8744.0,8561.0
331,2016/01/05,8467.0,8514.346,8561.0,1273800,8625.0,8450.0
332,2016/01/06,8305.0,8312.624,8365.0,1920000,8406.0,8220.0
333,2016/01/07,8181.0,8232.093,8272.0,1948500,8397.0,8150.0
334,2016/01/08,8121.0,8131.987,8054.0,1927800,8284.0,7955.0
335,2016/01/12,7755.0,7847.348,7990.0,2651100,8010.0,7755.0
336,2016/01/13,8080.0,8094.317,8026.0,1963800,8218.0,8026.0
337,2016/01/14,7802.0,7740.524,7780.0,2915500,7840.0,7641.0
338,2016/01/15,7668.0,7757.417,7997.0,2104600,8028.0,7626.0
339,2016/01/18,7683.0,7547.08,7300.0,2754400,7738.0,7296.0
340,2016/01/19,8002.0,7929.081,7660.0,2825300,8050.0,7640.0
341,2016/01/20,7862.0,7940.341,7998.0,2691900,8104.0,7840.0
342,2016/01/21,7776.0,7952.876,7932.0,3171600,8133.0,7768.0
343,2016/01/22,7932.0,7838.468,8030.0,4731400,8085.0,7550.0
344,2016/01/25,7947.0,7998.124,7998.0,2377200,8093.0,7937.0
345,2016/01/26,7740.0,7798.333,7865.0,1580100,7876.0,7720.0
346,2016/01/27,7841.0,7820.204,7853.0,1511700,7883.0,7752.0
347,2016/01/28,7771.0,7814.733,7882.0,2147000,7918.0,7718.0
348,2016/01/29,8102.0,7940.813,7842.0,2224700,8140.0,7721.0
349,2016/02/01,8481.0,8424.101,8348.0,2254800,8512.0,8289.0
350,2016/02/02,8361.0,8374.498,8350.0,1431300,8450.0,8308.0
351,2016/02/03,8073.0,8113.996,8211.0,1634400,8284.0,8032.0
352,2016/02/04,8086.0,8127.495,7975.0,1869800,8283.0,7970.0
353,2016/02/05,7934.0,7873.453,7840.0,1554500,7970.0,7800.0
354,2016/02/08,7666.0,7609.624,7671.0,2812100,7736.0,7503.0
355,2016/02/09,7221.0,7276.948,7389.0,2014100,7399.0,7189.0
356,2016/02/10,6907.0,6993.008,7170.0,3766500,7245.0,6822.0
357,2016/02/12,6553.0,6562.009,6407.0,3333300,6716.0,6407.0
358,2016/02/15,7077.0,6994.205,7053.0,1777900,7138.0,6816.0
359,2016/02/16,7180.0,7173.726,7008.0,1217900,7268.0,7001.0
360,2016/02/17,7336.0,7331.811,7380.0,2622200,7434.0,7234.0
361,2016/02/18,7614.0,7603.041,7550.0,1913800,7672.0,7519.0
362,2016/02/19,7258.0,7284.188,7490.0,1894500,7490.0,7149.0
363,2016/02/22,7372.0,7319.068,7208.0,900000,7381.0,7138.0
364,2016/02/23,7315.0,7365.821,7385.0,973000,7493.0,7268.0
365,2016/02/24,7247.0,7178.158,7133.0,1431900,7256.0,7062.0
366,2016/02/25,7536.0,7470.086,7310.0,1949300,7565.0,7310.0
367,2016/02/26,7531.0,7582.386,7591.0,839100,7665.0,7526.0
368,2016/02/29,7567.0,7651.133,7658.0,1503800,7750.0,7567.0
369,2016/03/01,7522.0,7487.016,7502.0,899900,7584.0,7404.0
370,2016/03/02,8082.0,8006.791,7783.0,2165000,8097.0,7777.0
371,2016/03/03,8230.0,8184.445,8082.0,1567600,8265.0,7994.0
372,2016/03/04,8245.0,8235.184,8230.0,1339100,8333.0,8131.0
373,2016/03/07,8198.0,8189.844,8078.0,951300,8270.0,8073.0
374,2016/03/08,8227.0,8199.151,8140.0,1193100,8277.0,8092.0
375,2016/03/09,8018.0,8004.222,8065.0,1505600,8069.0,7926.0
376,2016/03/10,8181.0,8158.894,8118.0,793000,8198.0,8102.0
377,2016/03/11,8139.0,8071.242,8031.0,1673300,8186.0,7961.0
378,2016/03/14,8309.0,8277.9,8209.0,958500,8311.0,8182.0
379,2016/03/15,8250.0,8265.164,8261.0,1133500,8344.0,8203.0
380,2016/03/16,8125.0,8132.64,8051.0,1122000,8209.0,8035.0
381,2016/03/17,8145.0,8195.337,8168.0,1084600,8341.0,8043.0
382,2016/03/18,7966.0,7974.007,8097.0,1134000,8118.0,7882.0
383,2016/03/22,8138.0,8089.461,7913.0,1198400,8178.0,7904.0
384,2016/03/23,8054.0,8074.065,8106.0,725900,8147.0,8026.0
385,2016/03/24,7908.0,7908.144,7910.0,1072300,7985.0,7824.0
386,2016/03/25,8081.0,8023.343,7911.0,698000,8098.0,7911.0
387,2016/03/28,8149.0,8085.643,8083.0,789600,8149.0,8010.0
388,2016/03/29,8054.0,8031.464,8051.0,1085600,8098.0,7981.0
389,2016/03/30,7740.0,7826.258,7968.0,1608800,8006.0,7727.0
390,2016/03/31,7701.0,7746.874,7740.0,1312200,7855.0,7675.0
391,2016/04/01,7347.0,7401.196,7590.0,2003500,7602.0,7325.0
392,2016/04/04,7336.0,7348.55,7330.0,1233900,7465.0,7223.0
393,2016/04/05,7153.0,7230.885,7325.0,1526200,7375.0,7150.0
394,2016/04/06,7238.0,7224.581,7134.0,1200000,7339.0,7103.0
395,2016/04/07,7262.0,7244.443,7217.0,885600,7316.0,7166.0
396,2016/04/08,7331.0,7261.553,7112.0,1513800,7442.0,7112.0
397,2016/04/11,7221.0,7146.054,7312.0,1325200,7312.0,6988.0
398,2016/04/12,7303.0,7305.447,7113.0,1652800,7410.0,7102.0
399,2016/04/13,7437.0,7399.295,7395.0,1786900,7531.0,7276.0
400,2016/04/14,7657.0,7604.273,7525.0,1799200,7668.0,7511.0
401,2016/04/15,7407.0,7456.033,7428.0,2487700,7593.0,7367.0
402,2016/04/18,7091.0,7087.993,7000.0,2036800,7157.0,6985.0
403,2016/04/19,7456.0,7405.066,7355.0,1515500,7456.0,7317.0
404,2016/04/20,7762.0,7714.297,7550.0,3136900,7786.0,7540.0
405,2016/04/21,7864.0,7861.411,7850.0,1607900,7941.0,7811.0
406,2016/04/22,7875.0,7816.034,7714.0,1531000,7895.0,7692.0
407,2016/04/25,7850.0,7837.943,7939.0,1551800,7940.0,7787.0
408,2016/04/26,8164.0,8202.462,8280.0,3911200,8297.0,8090.0
409,2016/04/27,8246.0,8277.908,8166.0,2338600,8403.0,8092.0
410,2016/04/28,8185.0,8289.751,8335.0,2469300,8447.0,8027.0
411,2016/05/02,8063.0,7960.503,7862.0,2606200,8066.0,7790.0
412,2016/05/06,7838.0,7801.966,7955.0,2565700,7955.0,7680.0
413,2016/05/09,7930.0,7941.753,7927.0,1255000,7965.0,7867.0
414,2016/05/10,8180.0,8058.164,7936.0,1749800,8204.0,7850.0
415,2016/05/11,8303.0,8348.386,8330.0,1608700,8444.0,8245.0
416,2016/05/12,8300.0,8238.797,8161.0,1105500,8326.0,8114.0
417,2016/05/13,8196.0,8204.772,8200.0,1492200,8273.0,8105.0
418,2016/05/16,8266.0,8305.03,8160.0,1094400,8364.0,8160.0
419,2016/05/17,8360.0,8333.137,8343.0,1012400,8438.0,8258.0
420,2016/05/18,8371.0,8369.531,8360.0,1420600,8418.0,8284.0
421,2016/05/19,8392.0,8384.825,8438.0,986700,8438.0,8338.0
422,2016/05/20,8382.0,8361.485,8342.0,936200,8417.0,8272.0
423,2016/05/23,8387.0,8320.654,8340.0,1364000,8387.0,8225.0
424,2016/05/24,8352.0,8334.8,8282.0,899800,8379.0,8260.0
425,2016/05/25,8378.0,8422.98,8450.0,1071100,8511.0,8378.0
426,2016/05/26,8378.0,8394.458,8450.0,728000,8450.0,8352.0
427,2016/05/27,8364.0,8368.768,8394.0,727400,8415.0,8345.0
428,2016/05/30,8382.0,8356.747,8377.0,903000,8400.0,8315.0
429,2016/05/31,8557.0,8508.858,8362.0,2344000,8557.0,8278.0
430,2016/06/01,8467.0,8504.621,8508.0,1132900,8588.0,8426.0
431,2016/06/02,8163.0,8210.153,8363.0,1335500,8385.0,8102.0
432,2016/06/03,8146.0,8148.629,8176.0,947300,8288.0,8058.0
433,2016/06/06,8140.0,8048.366,7911.0,893200,8148.0,7907.0
434,2016/06/07,8226.0,8204.227,8200.0,780400,8249.0,8121.0
435,2016/06/08,8238.0,8190.512,8212.0,882600,8239.0,8106.0
436,2016/06/09,8201.0,8206.579,8178.0,543700,8250.0,8140.0
437,2016/06/10,8148.0,8142.14,8190.0,1004200,8201.0,8082.0
438,2016/06/13,7820.0,7876.249,7950.0,938500,7990.0,7820.0
439,2016/06/14,7733.0,7744.002,7750.0,981100,7858.0,7700.0
440,2016/06/15,7804.0,7786.647,7720.0,1265600,7851.0,7702.0
441,2016/06/16,7527.0,7570.307,7740.0,1162700,7740.0,7468.0
442,2016/06/17,7521.0,7544.497,7576.0,1372700,7644.0,7490.0
443,2016/06/20,7769.0,7755.063,7639.0,1140300,7807.0,7630.0
444,2016/06/21,7978.0,7887.56,7681.0,1105800,7999.0,7632.0
445,2016/06/22,7885.0,7898.449,7885.0,823400,7988.0,7820.0
446,2016/06/23,8050.0,7978.469,7877.0,672100,8065.0,7835.0
447,2016/06/24,7500.0,7620.749,8100.0,1907200,8165.0,7333.0
448,2016/06/27,7463.0,7445.387,7501.0,1240100,7589.0,7342.0
449,2016/06/28,7604.0,7557.288,7360.0,1228700,7646.0,7350.0
450,2016/06/29,7855.0,7784.04,7800.0,1558800,7865.0,7618.0
451,2016/06/30,7722.0,7796.637,7907.0,1468500,7939.0,7722.0
452,2016/07/01,7599.0,7644.489,7766.0,1332300,7790.0,7572.0
453,2016/07/04,7509.0,7494.247,7450.0,1360700,7537.0,7436.0
454,2016/07/05,7422.0,7435.133,7430.0,925100,7520.0,7408.0
455,2016/07/06,7210.0,7219.633,7370.0,1619000,7404.0,7137.0
456,2016/07/07,7190.0,7223.956,7219.0,1120500,7339.0,7172.0
457,2016/07/08,7131.0,7187.142,7227.0,1147200,7283.0,7119.0
458,2016/07/11,7438.0,7447.492,7330.0,1153200,7504.0,7308.0
459,2016/07/12,8030.0,7969.975,7730.0,2597700,8052.0,7714.0
460,2016/07/13,8234.0,8303.199,8432.0,2158000,8465.0,8203.0
461,2016/07/14,8278.0,8237.713,8113.0,1295300,8338.0,8113.0
462,2016/07/15,8395.0,8352.669,8297.0,1403600,8405.0,8265.0
463,2016/07/19,8550.0,8505.697,8488.0,1726100,8572.0,8426.0
464,2016/07/20,8614.0,8579.251,8475.0,1077700,8640.0,8452.0
465,2016/07/21,8684.0,8728.354,8680.0,1317400,8879.0,8636.0
466,2016/07/22,8560.0,8536.488,8400.0,1165900,8609.0,8400.0
467,2016/07/25,8917.0,8922.409,8860.0,2177400,9013.0,8801.0
468,2016/07/26,9025.0,8990.395,8800.0,2347800,9144.0,8792.0
469,2016/07/27,9198.0,9160.51,8938.0,2271200,9332.0,8918.0
470,2016/07/28,9210.0,9255.666,9160.0,1916400,9343.0,9115.0
471,2016/07/29,9435.0,9354.826,9251.0,2337400,9490.0,9139.0
472,2016/08/01,9299.0,9311.101,9185.0,1403100,9413.0,9170.0
473,2016/08/02,9171.0,9198.109,9179.0,1043100,9262.0,9151.0
474,2016/08/03,9329.0,9354.209,9252.0,2007500,9488.0,9177.0
475,2016/08/04,9412.0,9355.366,9299.0,1276800,9420.0,9266.0
476,2016/08/05,9355.0,9426.19,9450.0,1121300,9499.0,9331.0
477,2016/08/08,9537.0,9503.685,9500.0,1136400,9576.0,9440.0
478,2016/08/09,9526.0,9482.543,9470.0,935000,9541.0,9378.0
479,2016/08/10,9304.0,9318.282,9420.0,1668900,9464.0,9254.0
480,2016/08/12,9278.0,9230.259,9273.0,1490700,9299.0,9129.0
481,2016/08/15,9383.0,9392.302,9274.0,995700,9449.0,9273.0
482,2016/08/16,9267.0,9352.028,9352.0,896000,9460.0,9267.0
483,2016/08/17,9161.0,9160.872,9218.0,1247900,9266.0,9067.0
484,2016/08/18,9156.0,9169.189,9052.0,1276100,9267.0,9030.0
485,2016/08/19,9395.0,9380.826,9260.0,1230600,9452.0,9244.0
486,2016/08/22,9369.0,9358.057,9420.0,668000,9429.0,9283.0
487,2016/08/23,9208.0,9209.678,9299.0,819700,9312.0,9159.0
488,2016/08/24,9189.0,9198.558,9206.0,598600,9287.0,9120.0
489,2016/08/25,9174.0,9178.908,9180.0,557400,9227.0,9122.0
490,2016/08/26,9197.0,9189.659,9195.0,961300,9274.0,9054.0
491,2016/08/29,9246.0,9287.988,9350.0,982700,9393.0,9213.0
492,2016/08/30,9270.0,9263.801,9180.0,506700,9318.0,9180.0
493,2016/08/31,9322.0,9339.431,9370.0,824900,9373.0,9313.0
494,2016/09/01,9294.0,9285.586,9320.0,840500,9327.0,9239.0
495,2016/09/02,9180.0,9183.837,9255.0,755100,9293.0,9120.0
496,2016/09/05,9081.0,9142.312,9238.0,863800,9281.0,9080.0
497,2016/09/06,9009.0,9005.783,9080.0,1072600,9080.0,8942.0
498,2016/09/07,9112.0,9044.432,8910.0,965100,9135.0,8906.0
499,2016/09/08,9096.0,9157.058,9200.0,909400,9261.0,9046.0
500,2016/09/09,9118.0,9164.553,9196.0,727000,9226.0,9106.0
501,2016/09/12,8957.0,8965.416,8968.0,848300,9110.0,8910.0
502,2016/09/13,9028.0,8973.783,8933.0,626000,9055.0,8885.0
503,2016/09/14,8777.0,8805.896,8900.0,1471900,8948.0,8758.0
504,2016/09/15,8611.0,8649.02,8777.0,1441600,8814.0,8590.0
505,2016/09/16,8878.0,8833.433,8699.0,1215300,8891.0,8677.0
506,2016/09/20,8947.0,8950.173,8850.0,1000500,9017.0,8850.0
507,2016/09/21,9239.0,9108.484,8916.0,1169000,9250.0,8916.0
508,2016/09/23,9208.0,9207.703,9240.0,894200,9282.0,9131.0
509,2016/09/26,9024.0,9053.517,9143.0,691000,9150.0,9011.0
510,2016/09/27,9122.0,9052.23,8950.0,984000,9122.0,8903.0
511,2016/09/28,9293.0,9221.461,9032.0,997600,9303.0,9020.0
512,2016/09/29,9323.0,9325.494,9350.0,725200,9368.0,9240.0
513,2016/09/30,9262.0,9266.728,9220.0,972400,9336.0,9159.0
514,2016/10/03,9281.0,9312.162,9251.0,916400,9382.0,9226.0
515,2016/10/04,9405.0,9364.781,9300.0,723000,9405.0,9287.0
516,2016/10/05,9364.0,9390.72,9450.0,880400,9483.0,9343.0
517,2016/10/06,9353.0,9402.303,9440.0,881500,9488.0,9338.0
518,2016/10/07,9296.0,9281.088,9300.0,981600,9359.0,9239.0
519,2016/10/11,9607.0,9561.65,9399.0,1767500,9616.0,9355.0
520,2016/10/12,9484.0,9534.297,9515.0,1247200,9627.0,9479.0
521,2016/10/13,9514.0,9518.09,9520.0,774700,9584.0,9455.0
522,2016/10/14,9493.0,9486.52,9506.0,596200,9540.0,9438.0
523,2016/10/17,9655.0,9582.161,9500.0,1264200,9657.0,9428.0
524,2016/10/18,9448.0,9465.612,9535.0,1607000,9590.0,9433.0
525,2016/10/19,9441.0,9465.348,9479.0,807100,9518.0,9438.0
526,2016/10/20,9293.0,9317.684,9386.0,1730900,9413.0,9275.0
527,2016/10/21,9230.0,9262.61,9330.0,1277100,9332.0,9184.0
528,2016/10/24,9300.0,9306.339,9281.0,1013700,9339.0,9267.0
529,2016/10/25,9867.0,9763.6,9700.0,4893800,9884.0,9653.0
530,2016/10/26,10050.0,10008.609,9948.0,2441400,10120.0,9904.0
531,2016/10/27,10165.0,10112.595,10050.0,1895000,10245.0,9969.0
532,2016/10/28,10250.0,10267.58,10250.0,2617400,10380.0,10240.0
533,2016/10/31,10170.0,10140.263,10155.0,1274400,10235.0,10055.0
534,2016/11/01,10155.0,10157.125,10170.0,954500,10215.0,10095.0
535,2016/11/02,9870.0,9925.557,10000.0,1294200,10055.0,9836.0
536,2016/11/04,9939.0,9848.895,9752.0,1306500,9954.0,9716.0
537,2016/11/07,10150.0,10124.959,10225.0,1177600,10250.0,10040.0
538,2016/11/08,10130.0,10140.327,10150.0,659600,10175.0,10100.0
539,2016/11/09,9692.0,9815.448,10180.0,1586200,10195.0,9578.0
540,2016/11/10,10185.0,10164.407,10175.0,1342600,10230.0,10055.0
541,2016/11/11,10060.0,10188.807,10285.0,1236500,10375.0,10025.0
542,2016/11/14,10350.0,10323.969,10120.0,1066700,10425.0,10120.0
543,2016/11/15,10345.0,10347.058,10425.0,629000,10430.0,10265.0
544,2016/11/16,10340.0,10362.26,10500.0,1134900,10510.0,10280.0
545,2016/11/17,10460.0,10404.634,10335.0,863000,10480.0,10285.0
546,2016/11/18,10410.0,10424.22,10495.0,778900,10500.0,10380.0
547,2016/11/21,10320.0,10342.914,10420.0,925100,10445.0,10275.0
548,2016/11/22,10195.0,10232.19,10290.0,831800,10345.0,10190.0
549,2016/11/24,10270.0,10215.728,10200.0,1109900,10280.0,10095.0
550,2016/11/25,10215.0,10221.4,10305.0,1080600,10345.0,10160.0
551,2016/11/28,10200.0,10186.881,10175.0,853700,10230.0,10135.0
552,2016/11/29,10225.0,10260.248,10195.0,964400,10315.0,10185.0
553,2016/11/30,10240.0,10219.127,10215.0,1089600,10245.0,10165.0
554,2016/12/01,10470.0,10481.277,10400.0,1843500,10640.0,10360.0
555,2016/12/02,10200.0,10259.496,10410.0,1062400,10445.0,10175.0
556,2016/12/05,10195.0,10160.525,10095.0,704000,10210.0,10030.0
557,2016/12/06,10035.0,10085.619,10285.0,948700,10300.0,10015.0
558,2016/12/07,9989.0,9986.76,10030.0,1183500,10115.0,9888.0
559,2016/12/08,9941.0,9930.874,10090.0,1642300,10115.0,9859.0
560,2016/12/09,9859.0,9853.426,9880.0,1863200,9939.0,9807.0
561,2016/12/12,9888.0,9892.096,9893.0,1573600,10020.0,9826.0
562,2016/12/13,9880.0,9695.295,9833.0,5451800,9929.0,9301.0
563,2016/12/14,10100.0,10022.675,9800.0,3699100,10200.0,9765.0
564,2016/12/15,9987.0,10050.612,10170.0,1910200,10185.0,9961.0
565,2016/12/16,9977.0,9975.354,9962.0,1455900,10020.0,9916.0
566,2016/12/19,10025.0,10022.554,9990.0,1135300,10110.0,9981.0
567,2016/12/20,10160.0,10099.601,9992.0,901900,10180.0,9992.0
568,2016/12/21,10230.0,10288.862,10350.0,1354600,10385.0,10200.0
569,2016/12/22,10240.0,10214.574,10250.0,818700,10295.0,10155.0
570,2016/12/26,10140.0,10173.316,10240.0,569600,10245.0,10135.0
571,2016/12/27,10145.0,10180.807,10200.0,618000,10265.0,10130.0
572,2016/12/28,10195.0,10193.27,10150.0,548200,10230.0,10135.0
573,2016/12/29,10110.0,10093.498,10185.0,836300,10185.0,10030.0
574,2016/12/30,10085.0,10043.998,10080.0,678700,10125.0,9956.0
575,2017/01/04,10500.0,10430.189,10295.0,1779700,10500.0,10270.0
576,2017/01/05,10530.0,10501.016,10425.0,1138800,10560.0,10425.0
577,2017/01/06,10420.0,10415.506,10270.0,743000,10500.0,10270.0
578,2017/01/10,10365.0,10357.655,10205.0,1077600,10485.0,10205.0
579,2017/01/11,10445.0,10442.911,10440.0,777400,10515.0,10355.0
580,2017/01/12,10490.0,10445.04,10440.0,851000,10495.0,10325.0
581,2017/01/13,10495.0,10471.922,10490.0,900400,10515.0,10390.0
582,2017/01/16,10555.0,10522.882,10500.0,750600,10580.0,10455.0
583,2017/01/17,10495.0,10568.026,10625.0,1210300,10675.0,10470.0
584,2017/01/18,10510.0,10521.28,10495.0,1172600,10610.0,10415.0
585,2017/01/19,10765.0,10698.112,10590.0,1051800,10790.0,10565.0
586,2017/01/20,10780.0,10795.32,10795.0,1027300,10860.0,10750.0
587,2017/01/23,10800.0,10866.088,10975.0,1298400,10975.0,10790.0
588,2017/01/24,10850.0,10933.262,10940.0,1546000,11045.0,10820.0
589,2017/01/25,10720.0,10606.305,10550.0,3164600,10795.0,10480.0
590,2017/01/26,10640.0,10646.882,10810.0,2613300,10810.0,10500.0
591,2017/01/27,10680.0,10707.263,10710.0,1126900,10765.0,10630.0
592,2017/01/30,10610.0,10620.04,10675.0,626100,10690.0,10580.0
593,2017/01/31,10610.0,10638.861,10590.0,1032500,10730.0,10560.0
594,2017/02/01,10770.0,10707.298,10615.0,1038800,10770.0,10590.0
595,2017/02/02,10670.0,10725.598,10850.0,979600,10850.0,10655.0
596,2017/02/03,10725.0,10708.512,10720.0,688100,10790.0,10635.0
597,2017/02/06,10590.0,10638.702,10770.0,668900,10795.0,10580.0
598,2017/02/07,10405.0,10433.253,10480.0,988100,10490.0,10400.0
599,2017/02/08,10635.0,10568.864,10510.0,1048300,10640.0,10480.0
600,2017/02/09,10495.0,10533.756,10605.0,738200,10620.0,10490.0
601,2017/02/10,10530.0,10535.034,10635.0,930100,10645.0,10480.0
602,2017/02/13,10760.0,10719.963,10600.0,1007300,10795.0,10585.0
603,2017/02/14,10595.0,10655.21,10785.0,699900,10795.0,10590.0
604,2017/02/15,10680.0,10683.838,10710.0,517400,10735.0,10630.0
605,2017/02/16,10660.0,10624.42,10675.0,567600,10675.0,10560.0
606,2017/02/17,10640.0,10653.322,10680.0,635500,10735.0,10585.0
607,2017/02/20,10690.0,10679.586,10645.0,528500,10720.0,10605.0
608,2017/02/21,10705.0,10668.967,10675.0,505300,10705.0,10615.0
609,2017/02/22,10670.0,10677.887,10735.0,475800,10745.0,10650.0
610,2017/02/23,10595.0,10589.033,10650.0,553100,10660.0,10550.0
611,2017/02/24,10630.0,10637.336,10520.0,697700,10715.0,10515.0
612,2017/02/27,10480.0,10488.446,10530.0,664900,10550.0,10425.0
613,2017/02/28,10490.0,10556.299,10550.0,757300,10660.0,10475.0
614,2017/03/01,10645.0,10618.622,10530.0,696100,10660.0,10520.0
615,2017/03/02,10665.0,10701.929,10790.0,712700,10795.0,10615.0
616,2017/03/03,10655.0,10636.617,10670.0,495000,10690.0,10575.0
617,2017/03/06,10640.0,10635.291,10655.0,408700,10660.0,10595.0
618,2017/03/07,10600.0,10598.68,10600.0,507100,10630.0,10565.0
619,2017/03/08,10630.0,10603.341,10570.0,552800,10645.0,10530.0
620,2017/03/09,10610.0,10609.605,10650.0,524400,10675.0,10565.0
621,2017/03/10,10720.0,10693.744,10685.0,1028900,10735.0,10630.0
622,2017/03/13,10730.0,10740.13,10705.0,475300,10790.0,10655.0
623,2017/03/14,10760.0,10745.995,10710.0,535100,10790.0,10680.0
624,2017/03/15,10785.0,10789.072,10750.0,679200,10870.0,10730.0
625,2017/03/16,10875.0,10844.867,10745.0,686500,10900.0,10730.0
626,2017/03/17,10770.0,10783.266,10815.0,843800,10840.0,10740.0
627,2017/03/21,10735.0,10723.093,10705.0,598700,10770.0,10650.0
628,2017/03/22,10585.0,10599.636,10590.0,878200,10650.0,10535.0
629,2017/03/23,10455.0,10481.751,10535.0,960700,10540.0,10435.0
630,2017/03/24,10400.0,10401.072,10455.0,1183000,10470.0,10335.0
631,2017/03/27,10215.0,10235.417,10300.0,912500,10325.0,10185.0
632,2017/03/28,10530.0,10468.422,10360.0,1234500,10560.0,10325.0
633,2017/03/29,10575.0,10611.702,10700.0,903400,10725.0,10545.0
634,2017/03/30,10580.0,10613.074,10600.0,837900,10665.0,10555.0
635,2017/03/31,10595.0,10703.588,10665.0,1421300,10835.0,10595.0
636,2017/04/03,10680.0,10662.219,10630.0,886500,10735.0,10585.0
637,2017/04/04,10595.0,10621.492,10645.0,1080100,10775.0,10460.0
638,2017/04/05,10640.0,10633.165,10630.0,828500,10690.0,10580.0
639,2017/04/06,10490.0,10533.477,10570.0,914400,10665.0,10455.0
640,2017/04/07,10435.0,10472.484,10535.0,822800,10590.0,10365.0
641,2017/04/10,10375.0,10381.663,10465.0,679700,10475.0,10305.0
642,2017/04/11,10280.0,10275.476,10325.0,729500,10340.0,10220.0
643,2017/04/12,9903.0,9950.134,10100.0,2486000,10120.0,9882.0
644,2017/04/13,9843.0,9799.82,9756.0,2170300,9883.0,9713.0
645,2017/04/14,9773.0,9801.212,9840.0,1116600,9840.0,9754.0
646,2017/04/17,9925.0,9890.701,9773.0,1098200,9994.0,9755.0
647,2017/04/18,9960.0,9976.34,10000.0,920500,10105.0,9920.0
648,2017/04/19,10020.0,10024.514,9950.0,1054600,10080.0,9933.0
649,2017/04/20,9981.0,10033.489,10030.0,754300,10120.0,9981.0
650,2017/04/21,10135.0,10110.499,10050.0,641400,10155.0,10025.0
651,2017/04/24,10185.0,10159.948,10200.0,790300,10230.0,10075.0
652,2017/04/25,10340.0,10290.725,10240.0,1121400,10370.0,10195.0
653,2017/04/26,10270.0,10291.976,10590.0,2886000,10590.0,10170.0
654,2017/04/27,10205.0,10230.766,10295.0,1260800,10295.0,10195.0
655,2017/04/28,10220.0,10267.331,10320.0,1031100,10370.0,10200.0
656,2017/05/01,10080.0,10111.25,10200.0,1284700,10215.0,10040.0
657,2017/05/02,10260.0,10242.731,10130.0,1201600,10315.0,10115.0
658,2017/05/08,10580.0,10521.478,10380.0,1542000,10590.0,10375.0
659,2017/05/09,10500.0,10503.766,10580.0,766100,10600.0,10450.0
660,2017/05/10,10670.0,10629.518,10580.0,1163400,10680.0,10560.0
661,2017/05/11,10760.0,10756.447,10700.0,1012600,10825.0,10690.0
662,2017/05/12,10745.0,10711.29,10715.0,774200,10775.0,10650.0
663,2017/05/15,10640.0,10650.243,10700.0,617500,10730.0,10595.0
664,2017/05/16,10670.0,10671.715,10670.0,467000,10720.0,10630.0
665,2017/05/17,10590.0,10597.764,10610.0,545800,10665.0,10565.0
666,2017/05/18,10445.0,10445.625,10395.0,708700,10535.0,10395.0
667,2017/05/19,10310.0,10338.53,10460.0,967500,10480.0,10295.0
668,2017/05/22,10410.0,10394.913,10380.0,495700,10435.0,10330.0
669,2017/05/23,10435.0,10482.214,10485.0,584000,10575.0,10400.0
670,2017/05/24,10790.0,10710.006,10575.0,1364900,10795.0,10560.0
671,2017/05/25,10970.0,10956.89,10835.0,1774100,11035.0,10805.0
672,2017/05/26,10935.0,10949.634,10940.0,846100,10995.0,10920.0
673,2017/05/29,10855.0,10878.189,10920.0,498200,10935.0,10830.0
674,2017/05/30,10980.0,10948.314,10885.0,855400,10985.0,10870.0
675,2017/05/31,10975.0,10966.216,10955.0,1041200,11020.0,10930.0
676,2017/06/01,11255.0,11188.526,11050.0,1503000,11265.0,11050.0
677,2017/06/02,11550.0,11500.718,11420.0,1836800,11550.0,11400.0
678,2017/06/05,11785.0,11769.52,11650.0,1355200,11860.0,11650.0
679,2017/06/06,11770.0,11753.98,11785.0,1151500,11860.0,11660.0
680,2017/06/07,11725.0,11693.625,11720.0,1103500,11745.0,11625.0
681,2017/06/08,11860.0,11859.467,11800.0,1295900,11915.0,11800.0
682,2017/06/09,11875.0,11830.01,11875.0,1368400,11900.0,11720.0
683,2017/06/12,11720.0,11701.286,11735.0,910000,11765.0,11615.0
684,2017/06/13,11600.0,11607.758,11660.0,1017300,11660.0,11570.0
685,2017/06/14,11410.0,11495.958,11650.0,914200,11655.0,11405.0
686,2017/06/15,11370.0,11350.782,11230.0,859400,11445.0,11220.0
687,2017/06/16,11370.0,11392.607,11395.0,988700,11485.0,11355.0
688,2017/06/19,11475.0,11496.878,11465.0,608400,11570.0,11385.0
689,2017/06/20,11625.0,11646.618,11600.0,762700,11715.0,11590.0
690,2017/06/21,11675.0,11672.956,11645.0,1077600,11730.0,11605.0
691,2017/06/22,11785.0,11750.343,11715.0,601000,11805.0,11675.0
692,2017/06/23,11745.0,11763.21,11885.0,610100,11885.0,11700.0
693,2017/06/26,11760.0,11760.322,11695.0,335900,11795.0,11665.0
694,2017/06/27,11805.0,11786.058,11775.0,642000,11830.0,11705.0
695,2017/06/28,11680.0,11721.751,11735.0,681800,11805.0,11670.0
696,2017/06/29,11745.0,11796.739,11755.0,654000,11900.0,11725.0
697,2017/06/30,11510.0,11524.146,11600.0,777100,11610.0,11480.0
698,2017/07/03,11415.0,11468.646,11550.0,603600,11595.0,11405.0
699,2017/07/04,11315.0,11341.787,11460.0,585300,11475.0,11260.0
700,2017/07/05,11520.0,11435.381,11290.0,594000,11530.0,11260.0
701,2017/07/06,11535.0,11582.262,11720.0,662200,11755.0,11485.0
702,2017/07/07,11510.0,11489.141,11405.0,576300,11535.0,11400.0
703,2017/07/10,11445.0,11477.675,11555.0,668400,11575.0,11440.0
704,2017/07/11,11580.0,11601.453,11490.0,739900,11690.0,11490.0
705,2017/07/12,11535.0,11525.014,11535.0,592700,11570.0,11485.0
706,2017/07/13,11520.0,11516.406,11505.0,441000,11555.0,11475.0
707,2017/07/14,11550.0,11538.686,11535.0,477700,11585.0,11485.0
708,2017/07/18,11595.0,11585.149,11510.0,531800,11640.0,11510.0
709,2017/07/19,11505.0,11491.528,11525.0,659700,11530.0,11455.0
710,2017/07/20,11620.0,11572.336,11505.0,571300,11630.0,11485.0
711,2017/07/21,11750.0,11751.923,11650.0,858900,11825.0,11650.0
712,2017/07/24,11730.0,11714.062,11690.0,525400,11760.0,11645.0
713,2017/07/25,11795.0,11813.216,11795.0,805600,11880.0,11760.0
714,2017/07/26,11625.0,11719.284,11920.0,1297400,11950.0,11615.0
715,2017/07/27,12230.0,12078.74,11850.0,2571100,12340.0,11745.0
716,2017/07/28,12125.0,12230.42,12395.0,1301800,12440.0,12090.0
717,2017/07/31,12160.0,12172.466,12295.0,886800,12315.0,12040.0
718,2017/08/01,12195.0,12196.415,12150.0,654500,12255.0,12130.0
719,2017/08/02,12850.0,12720.01,12440.0,2211800,12865.0,12415.0
720,2017/08/03,12855.0,12817.395,12810.0,1073100,12935.0,12700.0
721,2017/08/04,12720.0,12734.677,12750.0,813300,12825.0,12695.0
722,2017/08/07,12780.0,12766.201,12745.0,631700,12795.0,12715.0
723,2017/08/08,12755.0,12801.74,12830.0,664200,12895.0,12740.0
724,2017/08/09,12550.0,12572.901,12720.0,937600,12785.0,12475.0
725,2017/08/10,12590.0,12620.868,12620.0,692100,12770.0,12550.0
726,2017/08/14,12375.0,12439.581,12460.0,757700,12515.0,12370.0
727,2017/08/15,12485.0,12536.016,12560.0,626100,12625.0,12480.0
728,2017/08/16,12440.0,12478.387,12490.0,430500,12555.0,12440.0
729,2017/08/17,12580.0,12549.324,12480.0,556400,12610.0,12460.0
730,2017/08/18,12410.0,12425.668,12325.0,668500,12495.0,12290.0
731,2017/08/21,12450.0,12424.774,12425.0,549300,12485.0,12350.0
732,2017/08/22,12485.0,12492.758,12415.0,528600,12545.0,12395.0
733,2017/08/23,12500.0,12532.214,12700.0,657300,12705.0,12440.0
734,2017/08/24,12510.0,12548.375,12500.0,596000,12630.0,12485.0
735,2017/08/25,12515.0,12521.411,12520.0,465800,12560.0,12485.0
736,2017/08/28,12580.0,12575.145,12560.0,554600,12635.0,12520.0
737,2017/08/29,12540.0,12480.889,12500.0,845800,12545.0,12400.0
738,2017/08/30,12455.0,12481.653,12565.0,737600,12580.0,12435.0
739,2017/08/31,12460.0,12476.77,12550.0,868200,12575.0,12440.0
740,2017/09/01,12345.0,12381.978,12460.0,778000,12475.0,12335.0
741,2017/09/04,12400.0,12337.115,12300.0,622800,12415.0,12240.0
742,2017/09/05,12185.0,12224.606,12350.0,515200,12355.0,12155.0
743,2017/09/06,12055.0,12067.004,12000.0,726400,12140.0,11955.0
744,2017/09/07,12190.0,12174.763,12090.0,531300,12240.0,12085.0
745,2017/09/08,12315.0,12296.786,12290.0,818000,12370.0,12220.0
746,2017/09/11,12835.0,12726.081,12630.0,1618200,12855.0,12545.0
747,2017/09/12,13195.0,13146.804,13000.0,1284400,13270.0,13000.0
748,2017/09/13,13660.0,13612.234,13415.0,1790600,13745.0,13415.0
749,2017/09/14,13490.0,13557.458,13550.0,1058700,13745.0,13440.0
750,2017/09/15,13425.0,13431.736,13400.0,1348800,13515.0,13345.0
751,2017/09/19,13740.0,13744.361,13845.0,994600,13845.0,13655.0
752,2017/09/20,13625.0,13656.14,13725.0,922600,13770.0,13555.0
753,2017/09/21,13745.0,13756.015,13740.0,1005600,13830.0,13690.0
754,2017/09/22,13740.0,13726.914,13800.0,676200,13840.0,13625.0
755,2017/09/25,13625.0,13649.919,13745.0,1071900,13765.0,13615.0
756,2017/09/26,13520.0,13521.82,13470.0,909000,13595.0,13415.0
757,2017/09/27,13740.0,13707.429,13535.0,887600,13770.0,13535.0
758,2017/09/28,13855.0,13867.145,13870.0,718700,13975.0,13795.0
759,2017/09/29,13820.0,13811.67,13815.0,690100,13910.0,13755.0
760,2017/10/02,13875.0,13887.304,13885.0,701800,13960.0,13830.0
761,2017/10/03,14080.0,14099.863,14000.0,1175300,14260.0,13955.0
762,2017/10/04,14055.0,14094.524,14080.0,1019800,14220.0,13990.0
763,2017/10/05,13945.0,13985.006,14080.0,642000,14100.0,13920.0
764,2017/10/06,13915.0,13846.729,13805.0,1035900,13945.0,13750.0
765,2017/10/10,13930.0,13890.11,13915.0,931300,13960.0,13795.0
766,2017/10/11,13905.0,13881.604,13885.0,564600,13960.0,13840.0
767,2017/10/12,13990.0,13946.324,14000.0,719600,14025.0,13855.0
768,2017/10/13,14080.0,14054.306,14025.0,814200,14150.0,13905.0
769,2017/10/16,14235.0,14227.835,14180.0,1065800,14305.0,14115.0
770,2017/10/17,14200.0,14214.899,14330.0,959100,14340.0,14125.0
771,2017/10/18,14155.0,14198.709,14300.0,644300,14300.0,14130.0
772,2017/10/19,14175.0,14180.64,14215.0,718300,14250.0,14115.0
773,2017/10/20,14180.0,14175.102,14115.0,681500,14230.0,14105.0
774,2017/10/23,14820.0,14710.085,14500.0,1830300,14850.0,14455.0
775,2017/10/24,14820.0,14768.422,14810.0,1300300,14880.0,14660.0
776,2017/10/25,14740.0,14940.475,15120.0,2242400,15275.0,14690.0
777,2017/10/26,14590.0,14650.804,14900.0,1206000,14900.0,14550.0
778,2017/10/27,14730.0,14691.161,14750.0,957300,14755.0,14565.0
779,2017/10/30,14740.0,14737.13,14745.0,1645700,14795.0,14665.0
780,2017/10/31,14995.0,14912.429,14705.0,1256200,15030.0,14670.0
781,2017/11/01,15495.0,15356.75,15200.0,1585300,15530.0,15090.0
782,2017/11/02,15465.0,15518.525,15690.0,1159900,15715.0,15385.0
783,2017/11/06,15355.0,15393.504,15560.0,1006800,15560.0,15330.0
784,2017/11/07,15675.0,15557.693,15430.0,991200,15675.0,15405.0
785,2017/11/08,15945.0,15857.568,15655.0,1300900,15960.0,15585.0
786,2017/11/09,16040.0,16190.342,16100.0,2374100,16550.0,15600.0
787,2017/11/10,16205.0,16145.766,15755.0,1384100,16350.0,15750.0
788,2017/11/13,15995.0,16075.454,16285.0,1042100,16285.0,15955.0
789,2017/11/14,15840.0,15950.389,15950.0,1251900,16090.0,15840.0
790,2017/11/15,15625.0,15712.822,15840.0,1598000,15920.0,15530.0
791,2017/11/16,15870.0,15720.982,15495.0,1265100,15925.0,15425.0
792,2017/11/17,15820.0,15973.883,16100.0,1362600,16175.0,15750.0
793,2017/11/20,15655.0,15673.331,15625.0,826400,15800.0,15600.0
794,2017/11/21,15835.0,15849.65,15820.0,747600,15970.0,15700.0
795,2017/11/22,15855.0,15880.318,16000.0,677900,16010.0,15790.0
796,2017/11/24,16045.0,15986.906,15880.0,912500,16060.0,15845.0
797,2017/11/27,15910.0,15959.636,16115.0,737900,16145.0,15870.0
798,2017/11/28,15720.0,15755.672,15840.0,875000,15895.0,15690.0
799,2017/11/29,15830.0,15805.011,15825.0,802000,15925.0,15745.0
800,2017/11/30,15270.0,15306.762,15660.0,1988800,15685.0,15150.0
801,2017/12/01,15100.0,15170.522,15425.0,1465300,15430.0,15005.0
802,2017/12/04,15120.0,15163.065,15200.0,671600,15260.0,15080.0
803,2017/12/05,15300.0,15282.754,15355.0,1097500,15455.0,15135.0
804,2017/12/06,15255.0,15292.769,15270.0,1071100,15485.0,15150.0
805,2017/12/07,15650.0,15565.169,15415.0,1027000,15685.0,15365.0
806,2017/12/08,15695.0,15537.649,15250.0,1080700,15730.0,15250.0
807,2017/12/11,15835.0,15743.119,15795.0,595400,15835.0,15605.0
808,2017/12/12,15675.0,15750.641,15860.0,663000,15925.0,15640.0
809,2017/12/13,15330.0,15426.339,15680.0,856800,15690.0,15290.0
810,2017/12/14,15435.0,15403.174,15295.0,645500,15480.0,15230.0
811,2017/12/15,15305.0,15344.792,15325.0,921000,15505.0,15220.0
812,2017/12/18,15720.0,15603.307,15475.0,793700,15735.0,15405.0
813,2017/12/19,15535.0,15599.555,15680.0,561600,15770.0,15510.0
814,2017/12/20,15520.0,15507.322,15500.0,586300,15590.0,15430.0
815,2017/12/21,15750.0,15673.824,15570.0,589800,15750.0,15515.0
816,2017/12/22,16000.0,15955.235,15815.0,790700,16055.0,15810.0
817,2017/12/25,16150.0,16146.646,16100.0,591500,16230.0,16060.0
818,2017/12/26,16020.0,16022.534,16075.0,439100,16095.0,15970.0
819,2017/12/27,16005.0,15997.741,16050.0,333800,16060.0,15940.0
820,2017/12/28,15950.0,15992.814,16000.0,440000,16095.0,15920.0
821,2017/12/29,15810.0,15894.867,15980.0,409600,16035.0,15790.0
822,2018/01/04,16325.0,16232.156,16125.0,995600,16325.0,16065.0
823,2018/01/05,16395.0,16348.931,16435.0,763900,16445.0,16255.0
824,2018/01/09,16775.0,16671.103,16500.0,1125000,16785.0,16435.0
825,2018/01/10,16865.0,16766.878,16795.0,935600,16865.0,16625.0
826,2018/01/11,16730.0,16717.998,16690.0,758400,16805.0,16570.0
827,2018/01/12,16845.0,16784.288,16695.0,778400,16890.0,16650.0
828,2018/01/15,17020.0,17068.871,17015.0,808300,17195.0,16970.0
829,2018/01/16,17440.0,17283.52,17100.0,940900,17440.0,17070.0
830,2018/01/17,17520.0,17455.192,17400.0,938300,17540.0,17255.0
831,2018/01/18,17800.0,17878.099,17900.0,1653400,18045.0,17780.0
832,2018/01/19,17930.0,17863.583,17935.0,857200,17940.0,17760.0
833,2018/01/22,17825.0,17808.203,17900.0,827400,17905.0,17730.0
834,2018/01/23,18210.0,18081.556,18000.0,1210900,18240.0,17880.0
835,2018/01/24,17730.0,17786.673,17970.0,2134700,18060.0,17535.0
836,2018/01/25,18035.0,18000.336,17500.0,3239000,18525.0,17435.0
837,2018/01/26,18190.0,18250.723,18235.0,1524500,18395.0,18105.0
838,2018/01/29,18370.0,18384.022,18400.0,1181100,18495.0,18250.0
839,2018/01/30,18025.0,18164.54,18500.0,1409000,18505.0,17880.0
840,2018/01/31,17450.0,17636.859,17650.0,1954300,17895.0,17445.0
841,2018/02/01,17475.0,17432.522,17600.0,1769100,17610.0,17265.0
842,2018/02/02,17385.0,17396.998,17425.0,854600,17525.0,17285.0
843,2018/02/05,16960.0,16975.593,16800.0,1593000,17195.0,16800.0
844,2018/02/06,16150.0,16008.703,15945.0,2637800,16495.0,15665.0
845,2018/02/07,16215.0,16615.187,16950.0,1693100,16970.0,16210.0
846,2018/02/08,16600.0,16623.397,16450.0,1450200,16845.0,16420.0
847,2018/02/09,16460.0,16277.666,15980.0,1551000,16460.0,15975.0
848,2018/02/13,16665.0,16773.714,16900.0,1509200,16960.0,16595.0
849,2018/02/14,16255.0,16364.563,16635.0,1118100,16740.0,16075.0
850,2018/02/15,16500.0,16520.827,16430.0,1034400,16675.0,16350.0
851,2018/02/16,15935.0,16100.892,16500.0,2634200,16520.0,15920.0
852,2018/02/19,16415.0,16267.085,16110.0,1186800,16430.0,16055.0
853,2018/02/20,16255.0,16198.646,16355.0,1078300,16425.0,16095.0
854,2018/02/21,16410.0,16352.018,16295.0,940000,16445.0,16205.0
855,2018/02/22,16410.0,16391.481,16365.0,1013700,16475.0,16290.0
856,2018/02/23,16830.0,16670.03,16490.0,1221900,16830.0,16485.0
857,2018/02/26,16755.0,16755.575,16830.0,1111100,16855.0,16655.0
858,2018/02/27,17550.0,17349.569,17145.0,1790000,17550.0,17065.0
859,2018/02/28,17260.0,17369.138,17380.0,1302400,17610.0,17245.0
860,2018/03/01,16975.0,17005.318,17130.0,1308800,17210.0,16915.0
861,2018/03/02,16810.0,16664.395,16575.0,1362100,16885.0,16465.0
862,2018/03/05,16365.0,16482.143,16660.0,1042700,16800.0,16330.0
863,2018/03/06,16845.0,16844.468,16765.0,1040300,16980.0,16670.0
864,2018/03/07,16625.0,16677.953,16700.0,788800,16820.0,16575.0
865,2018/03/08,17020.0,17006.136,16900.0,827300,17110.0,16850.0
866,2018/03/09,17045.0,17129.962,17340.0,1325400,17370.0,16835.0
867,2018/03/12,17195.0,17220.815,17385.0,839700,17385.0,17095.0
868,2018/03/13,17240.0,17162.113,17045.0,655400,17255.0,16990.0
869,2018/03/14,17205.0,17173.552,17055.0,730000,17250.0,17020.0
870,2018/03/15,17080.0,17012.134,17090.0,743100,17105.0,16870.0
871,2018/03/16,17005.0,17057.122,17170.0,661500,17180.0,16980.0
872,2018/03/19,16870.0,16844.302,16935.0,598700,16950.0,16695.0
873,2018/03/20,16415.0,16382.456,16500.0,1077500,16555.0,16255.0
874,2018/03/22,16480.0,16372.674,16155.0,948000,16500.0,16115.0
875,2018/03/23,15770.0,15929.571,16005.0,1573200,16170.0,15760.0
876,2018/03/26,15860.0,15596.444,15500.0,1075200,15865.0,15330.0
877,2018/03/27,16510.0,16361.151,16130.0,1151000,16510.0,16030.0
878,2018/03/28,16240.0,16162.601,16260.0,1066700,16450.0,16025.0
879,2018/03/29,16100.0,16114.032,16320.0,824000,16345.0,16005.0
880,2018/03/30,16390.0,16329.271,16345.0,718300,16435.0,16140.0
881,2018/04/02,16410.0,16503.272,16390.0,538900,16600.0,16340.0
882,2018/04/03,16300.0,16272.953,16175.0,691000,16375.0,16140.0
883,2018/04/04,16055.0,16127.629,16400.0,790100,16415.0,16010.0
884,2018/04/05,16225.0,16183.23,16220.0,764400,16285.0,15970.0
885,2018/04/06,16060.0,16114.699,16250.0,840400,16265.0,16025.0
886,2018/04/09,16160.0,16133.523,16000.0,712700,16230.0,15975.0
887,2018/04/10,16305.0,16277.482,16160.0,741100,16450.0,16090.0
888,2018/04/11,16270.0,16261.055,16320.0,565400,16405.0,16160.0
889,2018/04/12,16400.0,16417.181,16295.0,556600,16565.0,16260.0
890,2018/04/13,16620.0,16602.835,16525.0,640900,16680.0,16495.0
891,2018/04/16,16690.0,16672.626,16670.0,425700,16740.0,16585.0
892,2018/04/17,16490.0,16536.954,16700.0,692100,16785.0,16405.0
893,2018/04/18,16790.0,16736.441,16345.0,1191800,16890.0,16330.0
894,2018/04/19,16740.0,16824.268,16895.0,779400,16945.0,16710.0
895,2018/04/20,16785.0,16738.31,16710.0,504700,16820.0,16570.0
896,2018/04/23,16660.0,16671.476,16810.0,670300,16820.0,16605.0
897,2018/04/24,16770.0,16665.339,16700.0,908600,16780.0,16570.0
898,2018/04/25,16475.0,16638.22,16710.0,2059100,17030.0,16300.0
899,2018/04/26,17170.0,16987.694,16515.0,1947100,17210.0,16510.0
900,2018/04/27,17140.0,17076.478,17250.0,1285100,17285.0,16860.0
901,2018/05/01,17145.0,17134.798,17060.0,602200,17200.0,17005.0
902,2018/05/02,16990.0,17059.481,17235.0,759800,17285.0,16900.0
903,2018/05/07,17060.0,17013.163,17040.0,506800,17085.0,16900.0
904,2018/05/08,16745.0,16787.26,17000.0,1037500,17000.0,16560.0
905,2018/05/09,16785.0,16810.458,16820.0,563000,16915.0,16725.0
906,2018/05/10,16930.0,16868.993,16825.0,426300,16940.0,16760.0
907,2018/05/11,17340.0,17241.634,17000.0,1077400,17375.0,17000.0
908,2018/05/14,17575.0,17448.382,17220.0,751300,17590.0,17190.0
909,2018/05/15,17605.0,17621.638,17610.0,778200,17720.0,17535.0
910,2018/05/16,17570.0,17606.979,17500.0,519900,17695.0,17475.0
911,2018/05/17,17570.0,17588.638,17650.0,459400,17655.0,17535.0
912,2018/05/18,17415.0,17428.523,17475.0,574600,17585.0,17355.0
913,2018/05/21,17445.0,17448.276,17415.0,567500,17515.0,17370.0
914,2018/05/22,17500.0,17485.732,17470.0,463800,17520.0,17420.0
915,2018/05/23,17250.0,17306.351,17415.0,815000,17575.0,17100.0
916,2018/05/24,17070.0,17103.144,17210.0,639900,17270.0,17015.0
917,2018/05/25,17100.0,17082.489,17025.0,497800,17185.0,16990.0
918,2018/05/28,17300.0,17259.715,17180.0,514300,17355.0,17145.0
919,2018/05/29,17130.0,17133.365,17300.0,469600,17300.0,17040.0
920,2018/05/30,16700.0,16723.412,16750.0,794800,16815.0,16655.0
921,2018/05/31,16885.0,16885.722,16930.0,1723800,16970.0,16790.0
922,2018/06/01,17210.0,17159.022,16870.0,763400,17270.0,16805.0
923,2018/06/04,17215.0,17268.725,17360.0,509300,17370.0,17205.0
924,2018/06/05,17100.0,17133.786,17295.0,704100,17310.0,17030.0
925,2018/06/06,17000.0,17032.685,17195.0,718000,17200.0,16955.0
926,2018/06/07,17040.0,16994.559,17100.0,869200,17145.0,16860.0
927,2018/06/08,17080.0,17062.696,16955.0,830100,17190.0,16950.0
928,2018/06/11,16940.0,16975.478,17060.0,514000,17090.0,16920.0
929,2018/06/12,17465.0,17408.539,17250.0,1574900,17525.0,17210.0
930,2018/06/13,17610.0,17589.643,17550.0,1094000,17640.0,17505.0
931,2018/06/14,17205.0,17350.211,17610.0,1033000,17625.0,17205.0
932,2018/06/15,17370.0,17420.813,17395.0,1620800,17550.0,17260.0
933,2018/06/18,17290.0,17317.208,17370.0,646100,17470.0,17200.0
934,2018/06/19,17070.0,17274.955,17250.0,762900,17550.0,17060.0
935,2018/06/20,16960.0,16849.858,17135.0,1073800,17215.0,16655.0
936,2018/06/21,16890.0,16870.15,16955.0,861300,17095.0,16695.0
937,2018/06/22,16935.0,16870.537,16755.0,800400,16985.0,16705.0
938,2018/06/25,16605.0,16705.095,16935.0,586400,16935.0,16595.0
939,2018/06/26,16335.0,16321.661,16360.0,928100,16415.0,16190.0
940,2018/06/27,16665.0,16707.081,16400.0,983800,16895.0,16400.0
941,2018/06/28,16645.0,16574.634,16515.0,707600,16695.0,16415.0
942,2018/06/29,16625.0,16589.757,16700.0,623900,16765.0,16440.0
943,2018/07/02,16405.0,16576.846,16615.0,609000,16795.0,16390.0
944,2018/07/03,16475.0,16467.025,16485.0,604600,16670.0,16310.0
945,2018/07/04,16235.0,16246.474,16500.0,557600,16500.0,16130.0
946,2018/07/05,15865.0,15988.125,16260.0,845100,16285.0,15835.0
947,2018/07/06,16265.0,16199.739,16080.0,705800,16340.0,16025.0
948,2018/07/09,16490.0,16413.248,16300.0,518200,16495.0,16260.0
949,2018/07/10,16720.0,16752.256,16590.0,780800,16950.0,16540.0
950,2018/07/11,16655.0,16594.021,16560.0,549300,16730.0,16380.0
951,2018/07/12,16585.0,16570.846,16680.0,579700,16680.0,16410.0
952,2018/07/13,17035.0,16971.313,16690.0,818100,17140.0,16690.0
953,2018/07/17,16895.0,16925.375,17030.0,643700,17040.0,16785.0
954,2018/07/18,17230.0,17230.521,17145.0,802100,17310.0,17115.0
955,2018/07/19,17200.0,17185.761,17200.0,562100,17260.0,17105.0
956,2018/07/20,17060.0,17102.171,17215.0,640500,17240.0,17000.0
957,2018/07/23,16930.0,16903.218,16845.0,555200,17000.0,16785.0
958,2018/07/24,16870.0,16911.191,17035.0,613100,17035.0,16850.0
959,2018/07/25,17115.0,17083.102,16970.0,710100,17185.0,16970.0
960,2018/07/26,16805.0,16962.963,17400.0,1494500,17405.0,16740.0
961,2018/07/27,16780.0,16877.198,17000.0,926200,17140.0,16765.0
962,2018/07/30,16445.0,16481.42,16620.0,803100,16635.0,16420.0
963,2018/07/31,16180.0,16213.71,16400.0,1121500,16400.0,16105.0
964,2018/08/01,16310.0,16372.91,16440.0,798000,16490.0,16305.0
965,2018/08/02,16085.0,16182.016,16475.0,964600,16475.0,16080.0
966,2018/08/03,16095.0,16138.351,16175.0,617200,16230.0,16085.0
967,2018/08/06,15930.0,15993.001,16095.0,729000,16110.0,15925.0
968,2018/08/07,16140.0,16040.439,15990.0,586200,16145.0,15900.0
969,2018/08/08,16260.0,16321.01,16245.0,754700,16450.0,16140.0
970,2018/08/09,16200.0,16219.53,16210.0,434300,16310.0,16120.0
971,2018/08/10,15800.0,15895.193,16100.0,1066600,16120.0,15800.0
972,2018/08/13,15330.0,15458.893,15700.0,982700,15750.0,15330.0
973,2018/08/14,15545.0,15509.701,15490.0,696500,15570.0,15415.0
974,2018/08/15,15370.0,15436.132,15520.0,698600,15570.0,15335.0
975,2018/08/16,15180.0,15158.212,15210.0,844700,15295.0,15000.0
976,2018/08/17,15075.0,15145.853,15330.0,763400,15370.0,15065.0
977,2018/08/20,15000.0,14954.742,14955.0,807500,15040.0,14875.0
978,2018/08/21,15035.0,15040.172,14995.0,800700,15120.0,14890.0
979,2018/08/22,15170.0,15127.056,14980.0,540500,15220.0,14980.0
980,2018/08/23,15250.0,15244.92,15275.0,509100,15310.0,15190.0
981,2018/08/24,15365.0,15315.386,15330.0,445400,15385.0,15215.0
982,2018/08/27,15815.0,15720.985,15435.0,725700,15825.0,15385.0
983,2018/08/28,15890.0,15971.817,16010.0,961500,16110.0,15875.0
984,2018/08/29,16030.0,16014.936,15950.0,595500,16070.0,15925.0
985,2018/08/30,16150.0,16160.374,16250.0,842600,16345.0,16030.0
986,2018/08/31,16105.0,16129.649,16000.0,794800,16255.0,15985.0
987,2018/09/03,15880.0,15950.293,16095.0,523600,16165.0,15825.0
988,2018/09/04,15885.0,15907.618,15970.0,425600,16020.0,15840.0
989,2018/09/05,15975.0,15931.259,15995.0,769800,16025.0,15785.0
990,2018/09/06,15825.0,15801.2,15815.0,531600,15880.0,15640.0
991,2018/09/07,15670.0,15618.488,15680.0,539400,15710.0,15470.0
992,2018/09/10,15735.0,15730.46,15610.0,408300,15840.0,15540.0
993,2018/09/11,15785.0,15778.018,15800.0,571500,15865.0,15655.0
994,2018/09/12,15300.0,15407.554,15930.0,977200,15935.0,15265.0
995,2018/09/13,15485.0,15479.725,15235.0,751400,15610.0,15170.0
996,2018/09/14,16050.0,15908.902,15720.0,1172900,16120.0,15705.0
997,2018/09/18,16015.0,15869.977,15865.0,810200,16055.0,15630.0
998,2018/09/19,16500.0,16409.571,16230.0,1108000,16555.0,16195.0
999,2018/09/20,16370.0,16406.924,16565.0,783200,16630.0,16255.0
1000,2018/09/21,16500.0,16478.845,16560.0,1139400,16575.0,16300.0
1001,2018/09/25,16500.0,16472.059,16550.0,894700,16600.0,16360.0
1002,2018/09/26,16930.0,16800.049,16645.0,1162900,16930.0,16630.0
1003,2018/09/27,16270.0,16500.904,16895.0,1049000,16895.0,16265.0
1004,2018/09/28,16345.0,16386.031,16550.0,958200,16620.0,16285.0
1005,2018/10/01,16320.0,16278.094,16230.0,614200,16350.0,16110.0
1006,2018/10/02,16510.0,16519.792,16475.0,821200,16685.0,16415.0
1007,2018/10/03,16375.0,16455.528,16540.0,641600,16565.0,16330.0
1008,2018/10/04,15915.0,16086.375,16350.0,1499800,16380.0,15915.0
1009,2018/10/05,15640.0,15772.95,15915.0,1229700,15995.0,15625.0
1010,2018/10/09,15270.0,15283.899,15490.0,1055100,15520.0,15170.0
1011,2018/10/10,15240.0,15255.462,15420.0,765700,15465.0,15125.0
1012,2018/10/11,14510.0,14577.435,14500.0,1403400,14845.0,14450.0
1013,2018/10/12,14730.0,14636.628,14500.0,1147600,14780.0,14355.0
1014,2018/10/15,14710.0,14804.937,14730.0,1065000,15070.0,14615.0
1015,2018/10/16,14720.0,14646.407,14560.0,601400,14770.0,14530.0
1016,2018/10/17,15035.0,15070.708,15110.0,946300,15235.0,14915.0
1017,2018/10/18,14770.0,14850.527,15090.0,605400,15110.0,14750.0
1018,2018/10/19,14565.0,14465.98,14415.0,850600,14585.0,14345.0
1019,2018/10/22,14450.0,14439.493,14410.0,970800,14570.0,14275.0
1020,2018/10/23,14065.0,14222.095,14580.0,1282000,14620.0,14040.0
1021,2018/10/24,14290.0,14440.504,14650.0,2152800,14870.0,14130.0
1022,2018/10/25,13600.0,13673.008,13750.0,1657400,13895.0,13510.0
1023,2018/10/26,13720.0,13783.666,14055.0,1820100,14100.0,13455.0
1024,2018/10/29,13555.0,13690.812,13760.0,1061600,13830.0,13510.0
1025,2018/10/30,14020.0,13885.922,13440.0,1484900,14195.0,13370.0
1026,2018/10/31,14490.0,14295.598,14255.0,1381200,14490.0,13890.0
1027,2018/11/01,14395.0,14455.101,14620.0,1175500,14640.0,14245.0
1028,2018/11/02,14705.0,14587.85,14410.0,1356200,14760.0,14355.0
1029,2018/11/05,14305.0,14361.865,14520.0,985700,14550.0,14275.0
1030,2018/11/06,14405.0,14445.585,14275.0,849200,14625.0,14270.0
1031,2018/11/07,14255.0,14413.463,14410.0,981200,14635.0,14180.0
1032,2018/11/08,14610.0,14673.021,14625.0,1308900,14835.0,14595.0
1033,2018/11/09,14770.0,14695.523,14605.0,1082900,14845.0,14415.0
1034,2018/11/12,14530.0,14471.375,14545.0,795100,14560.0,14330.0
1035,2018/11/13,14275.0,14165.75,14115.0,947600,14355.0,13925.0
1036,2018/11/14,14380.0,14401.103,14380.0,777400,14570.0,14290.0
1037,2018/11/15,14380.0,14356.317,14280.0,652300,14445.0,14205.0
1038,2018/11/16,14355.0,14436.019,14420.0,908900,14585.0,14345.0
1039,2018/11/19,14345.0,14371.181,14300.0,634600,14540.0,14280.0
1040,2018/11/20,13855.0,13935.575,14060.0,775900,14070.0,13850.0
1041,2018/11/21,13805.0,13711.654,13500.0,1001000,13850.0,13440.0
1042,2018/11/22,13990.0,13943.268,13895.0,716100,14095.0,13795.0
1043,2018/11/26,14050.0,13985.485,13900.0,503200,14090.0,13830.0
1044,2018/11/27,14100.0,14100.826,14180.0,553000,14200.0,14000.0
1045,2018/11/28,14760.0,14525.036,14200.0,1150100,14765.0,14180.0
1046,2018/11/29,14960.0,14989.937,15020.0,1032600,15210.0,14855.0
1047,2018/11/30,15120.0,15132.384,14900.0,1273500,15235.0,14860.0
1048,2018/12/03,15275.0,15296.719,15400.0,800000,15470.0,15190.0
1049,2018/12/04,15060.0,15261.554,15275.0,1022300,15530.0,15040.0
1050,2018/12/05,14615.0,14622.949,14600.0,1157000,14800.0,14480.0
1051,2018/12/06,14170.0,14230.733,14475.0,991300,14535.0,14010.0
1052,2018/12/07,14130.0,14193.249,14200.0,813100,14380.0,14105.0
1053,2018/12/10,13760.0,13750.567,13750.0,678500,13840.0,13670.0
1054,2018/12/11,13670.0,13756.402,13910.0,721000,13930.0,13630.0
1055,2018/12/12,14030.0,13935.583,13740.0,790300,14045.0,13630.0
1056,2018/12/13,14080.0,14122.893,14195.0,619500,14250.0,14030.0
1057,2018/12/14,13800.0,13938.474,14115.0,823500,14115.0,13715.0
1058,2018/12/17,13820.0,13909.784,13815.0,632800,14145.0,13805.0
1059,2018/12/18,13490.0,13569.342,13590.0,746600,13795.0,13485.0
1060,2018/12/19,13225.0,13263.672,13355.0,1147900,13400.0,13130.0
1061,2018/12/20,13020.0,13079.469,13100.0,1454000,13300.0,12945.0
1062,2018/12/21,12835.0,12820.821,12830.0,1619600,13015.0,12625.0
1063,2018/12/25,11800.0,11823.108,11635.0,1695600,12075.0,11605.0
1064,2018/12/26,12025.0,11933.271,11900.0,1245700,12080.0,11795.0
1065,2018/12/27,12675.0,12671.441,12795.0,1220700,12820.0,12550.0
1066,2018/12/28,12475.0,12469.959,12465.0,809800,12590.0,12335.0
1067,2019/01/04,11980.0,11846.556,11875.0,1288700,11980.0,11565.0
1068,2019/01/07,12585.0,12544.216,12490.0,1015300,12640.0,12355.0
1069,2019/01/08,12330.0,12463.185,12695.0,1239800,12785.0,12330.0
1070,2019/01/09,12205.0,12193.615,12465.0,1695400,12490.0,12015.0
1071,2019/01/10,12070.0,12125.426,12205.0,934500,12285.0,12040.0
1072,2019/01/11,12290.0,12281.176,12220.0,887000,12365.0,12170.0
1073,2019/01/15,12240.0,12168.704,12145.0,1346900,12270.0,12040.0
1074,2019/01/16,12335.0,12244.064,12165.0,1204600,12350.0,12055.0
1075,2019/01/17,12395.0,12388.531,12395.0,784800,12470.0,12325.0
1076,2019/01/18,12255.0,11943.369,11495.0,6662300,12350.0,11405.0
1077,2019/01/21,12680.0,12674.29,12555.0,2183100,12905.0,12465.0
1078,2019/01/22,12420.0,12518.379,12750.0,1406400,12825.0,12330.0
1079,2019/01/23,12215.0,12174.115,12070.0,1535800,12310.0,12050.0
1080,2019/01/24,12350.0,12375.971,12280.0,1684500,12595.0,12205.0
1081,2019/01/25,13055.0,12864.249,12560.0,2379300,13070.0,12505.0
1082,2019/01/28,12920.0,12947.159,13055.0,1700700,13140.0,12835.0
1083,2019/01/29,12555.0,12530.364,12785.0,1526200,12785.0,12380.0
1084,2019/01/30,12510.0,12523.584,12675.0,1147200,12675.0,12410.0
1085,2019/01/31,13030.0,12990.894,12885.0,1730700,13125.0,12805.0
1086,2019/02/01,13070.0,13099.664,12980.0,960400,13190.0,12945.0
1087,2019/02/04,13025.0,13061.387,13050.0,767000,13165.0,12970.0
1088,2019/02/05,13220.0,13264.349,13200.0,864900,13370.0,13180.0
1089,2019/02/06,13205.0,13216.529,13290.0,706100,13340.0,13140.0
1090,2019/02/07,13145.0,13126.285,13190.0,728500,13235.0,13015.0
1091,2019/02/08,12605.0,12687.393,12855.0,1030800,12895.0,12560.0
1092,2019/02/12,13305.0,13125.021,12710.0,1553100,13315.0,12600.0
1093,2019/02/13,13335.0,13384.105,13460.0,953900,13520.0,13230.0
1094,2019/02/14,13340.0,13318.814,13395.0,610200,13415.0,13220.0
1095,2019/02/15,13175.0,13192.791,13110.0,579600,13345.0,13040.0
1096,2019/02/18,13540.0,13474.417,13475.0,726800,13555.0,13345.0
1097,2019/02/19,13430.0,13422.342,13455.0,598600,13540.0,13355.0
1098,2019/02/20,13400.0,13384.084,13495.0,648700,13520.0,13300.0
1099,2019/02/21,13480.0,13462.033,13500.0,899600,13620.0,13365.0
1100,2019/02/22,13635.0,13564.315,13370.0,916100,13640.0,13360.0
1101,2019/02/25,14115.0,14112.777,13950.0,1630300,14250.0,13935.0
1102,2019/02/26,14025.0,14079.476,14115.0,781200,14210.0,13960.0
1103,2019/02/27,13830.0,13842.292,13955.0,807100,14010.0,13760.0
1104,2019/02/28,13475.0,13525.76,13750.0,1004100,13780.0,13405.0
1105,2019/03/01,13490.0,13532.417,13500.0,552700,13630.0,13475.0
1106,2019/03/04,13835.0,13813.577,13745.0,711600,13880.0,13720.0
1107,2019/03/05,13690.0,13674.459,13670.0,798700,13795.0,13575.0
1108,2019/03/06,13690.0,13702.25,13735.0,726800,13795.0,13625.0
1109,2019/03/07,13390.0,13395.896,13460.0,1026900,13525.0,13295.0
1110,2019/03/08,13095.0,13112.23,13200.0,1116700,13265.0,12995.0
1111,2019/03/11,13110.0,13064.814,13025.0,937400,13170.0,12890.0
1112,2019/03/12,13470.0,13451.434,13365.0,958700,13535.0,13300.0
1113,2019/03/13,13225.0,13172.089,13340.0,1253600,13365.0,12995.0
1114,2019/03/14,13030.0,13115.535,13330.0,1100000,13350.0,13025.0
1115,2019/03/15,13165.0,13210.977,13135.0,1119800,13320.0,13125.0
1116,2019/03/18,13240.0,13241.833,13190.0,585700,13315.0,13165.0
1117,2019/03/19,13345.0,13289.39,13295.0,680400,13460.0,13085.0
1118,2019/03/20,13420.0,13401.619,13255.0,620100,13500.0,13230.0
1119,2019/03/22,13670.0,13662.708,13420.0,803500,13800.0,13420.0
1120,2019/03/25,13360.0,13270.276,13290.0,768900,13380.0,13145.0
1121,2019/03/26,13770.0,13745.653,13550.0,1255800,13850.0,13500.0
1122,2019/03/27,14200.0,14125.139,14080.0,1169400,14260.0,13955.0
1123,2019/03/28,14040.0,13945.587,13900.0,834100,14045.0,13785.0
1124,2019/03/29,14025.0,13984.408,14125.0,871300,14180.0,13850.0
1125,2019/04/01,14250.0,14282.754,14310.0,943100,14385.0,14170.0
1126,2019/04/02,14485.0,14487.963,14500.0,1011500,14595.0,14370.0
1127,2019/04/03,14840.0,14776.21,14670.0,1046900,14875.0,14605.0
1128,2019/04/04,14970.0,14972.612,14980.0,962100,15065.0,14820.0
1129,2019/04/05,15060.0,15024.116,14970.0,745900,15140.0,14955.0
1130,2019/04/08,15005.0,15024.431,15100.0,659000,15235.0,14915.0
1131,2019/04/09,15085.0,15012.297,14910.0,481700,15085.0,14910.0
1132,2019/04/10,15070.0,15019.221,14885.0,524700,15120.0,14845.0
1133,2019/04/11,15400.0,15414.523,15210.0,1731900,15585.0,15200.0
1134,2019/04/12,15405.0,15380.185,15405.0,868400,15490.0,15270.0
1135,2019/04/15,15840.0,15806.367,15850.0,1217400,15930.0,15645.0
1136,2019/04/16,15775.0,15774.951,15800.0,747800,15895.0,15675.0
1137,2019/04/17,15730.0,15742.649,15875.0,1063700,15890.0,15635.0
1138,2019/04/18,15755.0,15799.149,15850.0,838600,15895.0,15710.0
1139,2019/04/19,15775.0,15765.933,15755.0,674100,15810.0,15695.0
1140,2019/04/22,15820.0,15744.447,15775.0,599000,15820.0,15590.0
1141,2019/04/23,15750.0,15723.85,15880.0,958700,15895.0,15615.0
1142,2019/04/24,15870.0,15998.25,15900.0,2382200,16255.0,15675.0
1143,2019/04/25,15725.0,15788.246,15850.0,1049800,15960.0,15635.0
1144,2019/04/26,15785.0,15601.012,15600.0,1112200,15815.0,15385.0
1145,2019/05/07,15460.0,15512.345,15600.0,1182800,15670.0,15390.0
1146,2019/05/08,15215.0,15187.782,15060.0,964900,15270.0,15035.0
1147,2019/05/09,15000.0,15036.409,15005.0,910900,15205.0,14980.0
1148,2019/05/10,14900.0,14950.959,14895.0,1195700,15280.0,14790.0
1149,2019/05/13,14880.0,14887.824,14840.0,582000,14985.0,14720.0
1150,2019/05/14,14650.0,14547.798,14390.0,978000,14670.0,14340.0
1151,2019/05/15,14665.0,14600.341,14700.0,983600,14705.0,14445.0
1152,2019/05/16,14500.0,14520.704,14755.0,712200,14755.0,14390.0
1153,2019/05/17,14605.0,14614.878,14675.0,636600,14715.0,14465.0
1154,2019/05/20,14475.0,14446.514,14460.0,723300,14570.0,14345.0
1155,2019/05/21,14380.0,14293.899,14300.0,567400,14430.0,14160.0
1156,2019/05/22,14465.0,14541.459,14665.0,558100,14690.0,14435.0
1157,2019/05/23,14165.0,14229.684,14355.0,971600,14425.0,14155.0
1158,2019/05/24,13800.0,13837.928,13885.0,1245200,13940.0,13740.0
1159,2019/05/27,13730.0,13766.449,13845.0,634200,13880.0,13685.0
1160,2019/05/28,13925.0,13918.376,13825.0,574800,13990.0,13785.0
1161,2019/05/29,13690.0,13645.074,13735.0,869300,13750.0,13500.0
1162,2019/05/30,13750.0,13639.205,13565.0,612200,13770.0,13500.0
1163,2019/05/31,13590.0,13675.567,13675.0,807600,13850.0,13555.0
1164,2019/06/03,13315.0,13325.32,13290.0,710300,13435.0,13230.0
1165,2019/06/04,13340.0,13316.71,13275.0,737900,13385.0,13225.0
1166,2019/06/05,13665.0,13689.671,13780.0,780700,13780.0,13620.0
1167,2019/06/06,13580.0,13658.783,13625.0,586900,13765.0,13580.0
1168,2019/06/07,13760.0,13727.377,13680.0,535600,13805.0,13590.0
1169,2019/06/10,14255.0,14198.684,14015.0,885700,14365.0,14000.0
1170,2019/06/11,14560.0,14506.297,14250.0,797400,14645.0,14225.0
1171,2019/06/12,14430.0,14458.862,14340.0,567600,14560.0,14315.0
1172,2019/06/13,14155.0,14172.462,14305.0,585300,14325.0,14075.0
1173,2019/06/14,14230.0,14222.029,14200.0,560000,14295.0,14075.0
1174,2019/06/17,13915.0,13927.774,14080.0,696500,14130.0,13775.0
1175,2019/06/18,13735.0,13796.931,13910.0,526300,13980.0,13715.0
1176,2019/06/19,14230.0,14168.541,14155.0,716600,14235.0,14040.0
1177,2019/06/20,14345.0,14308.033,14395.0,465300,14435.0,14155.0
1178,2019/06/21,14330.0,14359.746,14395.0,1080500,14475.0,14280.0
1179,2019/06/24,14230.0,14278.669,14310.0,301000,14360.0,14210.0
1180,2019/06/25,14265.0,14295.395,14275.0,521500,14455.0,14170.0
1181,2019/06/26,14290.0,14304.699,14205.0,441800,14430.0,14190.0
1182,2019/06/27,14560.0,14525.396,14420.0,656200,14600.0,14375.0
1183,2019/06/28,14725.0,14643.511,14590.0,805800,14725.0,14505.0
1184,2019/07/01,15245.0,15134.471,15100.0,981500,15245.0,14935.0
1185,2019/07/02,15165.0,15149.962,15180.0,668500,15245.0,15070.0
1186,2019/07/03,14800.0,14839.478,15040.0,711000,15040.0,14735.0
1187,2019/07/04,14765.0,14766.142,14830.0,336400,14840.0,14720.0
1188,2019/07/05,14795.0,14759.053,14800.0,403500,14830.0,14695.0
1189,2019/07/08,14795.0,14796.084,14715.0,575100,14870.0,14705.0
1190,2019/07/09,14530.0,14613.001,14740.0,515800,14740.0,14530.0
1191,2019/07/10,14315.0,14333.108,14410.0,705900,14415.0,14260.0
1192,2019/07/11,14480.0,14431.634,14360.0,457400,14510.0,14310.0
1193,2019/07/12,14450.0,14416.188,14490.0,705000,14505.0,14330.0
1194,2019/07/16,14320.0,14364.306,14325.0,579900,14550.0,14310.0
1195,2019/07/17,14195.0,14219.338,14295.0,515100,14330.0,14155.0
1196,2019/07/18,13830.0,13911.399,14140.0,1168800,14200.0,13760.0
1197,2019/07/19,14100.0,14019.394,13790.0,751100,14150.0,13765.0
1198,2019/07/22,13970.0,13981.85,14045.0,872200,14125.0,13900.0
1199,2019/07/23,14100.0,14053.486,13955.0,1111400,14125.0,13880.0
1200,2019/07/24,14215.0,14110.044,14100.0,1085100,14235.0,13970.0
1201,2019/07/25,14865.0,14808.671,14585.0,2204800,15030.0,14510.0
1202,2019/07/26,14980.0,14964.332,14785.0,1415800,15140.0,14760.0
1203,2019/07/29,14410.0,14510.814,14720.0,941900,14755.0,14385.0
1204,2019/07/30,14735.0,14676.258,14505.0,778500,14785.0,14505.0
1205,2019/07/31,14715.0,14672.487,14550.0,667600,14750.0,14530.0
1206,2019/08/01,14930.0,14870.351,14545.0,1008700,15005.0,14535.0
1207,2019/08/02,14385.0,14397.183,14460.0,1079000,14520.0,14320.0
1208,2019/08/05,13975.0,13949.154,14130.0,965200,14225.0,13765.0
1209,2019/08/06,13725.0,13598.188,13400.0,1143900,13770.0,13350.0
1210,2019/08/07,13545.0,13530.051,13690.0,1232500,13690.0,13370.0
1211,2019/08/08,13475.0,13525.65,13540.0,754300,13665.0,13430.0
1212,2019/08/09,13805.0,13778.428,13655.0,757800,13840.0,13650.0
1213,2019/08/13,13705.0,13642.366,13625.0,647800,13745.0,13485.0
1214,2019/08/14,13945.0,13910.251,14005.0,576700,14045.0,13785.0
1215,2019/08/15,13745.0,13611.357,13425.0,633900,13750.0,13400.0
1216,2019/08/16,13720.0,13725.803,13745.0,369800,13790.0,13675.0
1217,2019/08/19,13740.0,13811.743,13970.0,353800,13970.0,13730.0
1218,2019/08/20,14030.0,13987.213,13910.0,499000,14060.0,13865.0
1219,2019/08/21,14065.0,14014.276,13855.0,389400,14090.0,13840.0
1220,2019/08/22,14080.0,14080.654,14190.0,460400,14195.0,13990.0
1221,2019/08/23,14045.0,14066.319,14110.0,304300,14125.0,14025.0
