,Date,Close,VWAP,Open,Volume,High,Low
0,2014/08/25,1960.0,1958.939,1975.0,82200,1984.0,1948.0
1,2014/08/26,1943.0,1948.278,1960.0,46400,1964.0,1940.0
2,2014/08/27,1947.0,1962.296,1943.0,106700,1976.0,1943.0
3,2014/08/28,1909.0,1898.598,1941.0,294000,1941.0,1870.0
4,2014/08/29,1927.0,1921.563,1909.0,66800,1945.0,1905.0
5,2014/09/01,1962.0,1957.95,1946.0,69700,1968.0,1943.0
6,2014/09/02,1955.0,1958.216,1978.0,163700,1978.0,1940.0
7,2014/09/03,1936.0,1946.568,1946.0,87800,1962.0,1931.0
8,2014/09/04,1960.0,1949.618,1920.0,96800,1977.0,1913.0
9,2014/09/05,1954.0,1957.109,1970.0,38600,1973.0,1946.0
10,2014/09/08,1921.0,1933.33,1954.0,100500,1966.0,1916.0
11,2014/09/09,1953.0,1964.303,1961.0,232500,2000.0,1925.0
12,2014/09/10,2009.0,1989.366,1953.0,194200,2013.0,1943.0
13,2014/09/11,2023.0,2012.058,2015.0,182200,2029.0,1989.0
14,2014/09/12,1950.0,1968.203,1997.0,284600,2001.0,1945.0
15,2014/09/16,1940.0,1940.606,1962.0,92200,1971.0,1921.0
16,2014/09/17,1967.0,1985.012,1999.0,101300,2006.0,1964.0
17,2014/09/18,1999.0,2001.938,2000.0,149400,2016.0,1993.0
18,2014/09/19,2053.0,2039.322,2006.0,205000,2055.0,2001.0
19,2014/09/22,2072.0,2061.683,2068.0,112900,2079.0,2039.0
20,2014/09/24,2019.0,2031.956,2080.0,193800,2086.0,2007.0
21,2014/09/25,2044.0,2043.277,2043.0,154400,2057.0,2026.0
22,2014/09/26,2027.0,2028.776,2030.0,67300,2046.0,2009.0
23,2014/09/29,2029.0,2027.996,2050.0,45400,2050.0,2013.0
24,2014/09/30,2037.0,2032.41,2044.0,93400,2044.0,2003.0
25,2014/10/01,2004.0,2019.412,2052.0,49500,2059.0,2004.0
26,2014/10/02,1940.0,1953.286,1975.0,69600,1977.0,1939.0
27,2014/10/03,1939.0,1934.261,1930.0,34500,1957.0,1921.0
28,2014/10/06,1979.0,1968.969,1960.0,79300,1985.0,1947.0
29,2014/10/07,1947.0,1966.713,1985.0,102300,1999.0,1946.0
30,2014/10/08,1930.0,1931.789,1930.0,140500,1946.0,1909.0
31,2014/10/09,1927.0,1931.835,1937.0,101700,1954.0,1919.0
32,2014/10/10,1868.0,1884.213,1910.0,190900,1930.0,1852.0
33,2014/10/14,1858.0,1854.537,1812.0,150500,1897.0,1806.0
34,2014/10/15,1913.0,1899.527,1870.0,87100,1918.0,1870.0
35,2014/10/16,1874.0,1888.63,1894.0,90100,1917.0,1870.0
36,2014/10/17,1921.0,1915.699,1900.0,204000,1952.0,1877.0
37,2014/10/20,1882.0,1906.167,1936.0,265700,1961.0,1868.0
38,2014/10/21,1713.0,1744.295,1884.0,810000,1895.0,1675.0
39,2014/10/22,1734.0,1724.428,1718.0,363800,1751.0,1707.0
40,2014/10/23,1807.0,1767.626,1722.0,415600,1810.0,1716.0
41,2014/10/24,1809.0,1838.121,1860.0,362500,1893.0,1789.0
42,2014/10/27,1855.0,1837.404,1800.0,184500,1860.0,1781.0
43,2014/10/28,1932.0,1912.089,1856.0,292800,1939.0,1851.0
44,2014/10/29,1928.0,1918.828,1912.0,190600,1944.0,1891.0
45,2014/10/30,1877.0,1910.62,1934.0,633000,2012.0,1821.0
46,2014/10/31,1832.0,1844.823,1859.0,481100,1902.0,1814.0
47,2014/11/04,1782.0,1773.389,1834.0,723400,1860.0,1737.0
48,2014/11/05,1805.0,1798.765,1780.0,222700,1815.0,1777.0
49,2014/11/06,1820.0,1820.674,1811.0,507200,1835.0,1798.0
50,2014/11/07,1837.0,1833.189,1820.0,179200,1844.0,1814.0
51,2014/11/10,1869.0,1861.134,1822.0,215700,1884.0,1822.0
52,2014/11/11,1879.0,1875.034,1885.0,235200,1891.0,1857.0
53,2014/11/12,1882.0,1883.043,1880.0,194400,1895.0,1867.0
54,2014/11/13,1887.0,1885.86,1880.0,105000,1899.0,1864.0
55,2014/11/14,1923.0,1916.141,1910.0,205700,1932.0,1900.0
56,2014/11/17,1861.0,1879.686,1923.0,149700,1924.0,1848.0
57,2014/11/18,1908.0,1901.882,1873.0,134800,1919.0,1870.0
58,2014/11/19,1895.0,1910.316,1920.0,54700,1930.0,1888.0
59,2014/11/20,1890.0,1898.913,1906.0,76800,1922.0,1884.0
60,2014/11/21,1916.0,1901.407,1893.0,58300,1920.0,1875.0
61,2014/11/25,1973.0,1963.991,1920.0,149800,1989.0,1920.0
62,2014/11/26,1956.0,1965.351,1963.0,71600,1980.0,1948.0
63,2014/11/27,1989.0,1993.483,1980.0,150400,2007.0,1967.0
64,2014/11/28,2000.0,1995.255,2000.0,109900,2009.0,1967.0
65,2014/12/01,2015.0,2024.062,2025.0,106100,2040.0,2001.0
66,2014/12/02,2036.0,2027.499,2014.0,97400,2048.0,1963.0
67,2014/12/03,2063.0,2065.979,2049.0,98600,2094.0,2019.0
68,2014/12/04,2093.0,2106.632,2100.0,114600,2137.0,2081.0
69,2014/12/05,2069.0,2075.731,2093.0,123600,2097.0,2051.0
70,2014/12/08,2108.0,2105.343,2100.0,94500,2125.0,2091.0
71,2014/12/09,2102.0,2099.326,2076.0,99700,2123.0,2047.0
72,2014/12/10,2043.0,2043.909,2060.0,105200,2072.0,2027.0
73,2014/12/11,1998.0,1990.881,1993.0,143300,2011.0,1971.0
74,2014/12/12,2001.0,2008.24,2000.0,105400,2031.0,2000.0
75,2014/12/15,1993.0,1995.987,1975.0,63400,2018.0,1956.0
76,2014/12/16,1959.0,1971.059,1981.0,59700,1984.0,1957.0
77,2014/12/17,2024.0,2008.953,1950.0,102200,2043.0,1950.0
78,2014/12/18,2093.0,2092.584,2121.0,257900,2127.0,2057.0
79,2014/12/19,2142.0,2134.859,2109.0,212300,2155.0,2109.0
80,2014/12/22,2163.0,2150.712,2149.0,136400,2169.0,2122.0
81,2014/12/24,2184.0,2165.325,2164.0,198500,2190.0,2139.0
82,2014/12/25,2107.0,2101.853,2155.0,190700,2158.0,2075.0
83,2014/12/26,2108.0,2092.303,2107.0,111600,2124.0,2067.0
84,2014/12/29,2118.0,2126.158,2122.0,91200,2160.0,2106.0
85,2014/12/30,2088.0,2098.275,2102.0,73400,2122.0,2082.0
86,2015/01/05,2132.0,2114.835,2074.0,113300,2150.0,2073.0
87,2015/01/06,2068.0,2066.122,2082.0,142200,2097.0,2036.0
88,2015/01/07,2065.0,2058.29,2036.0,85500,2077.0,2036.0
89,2015/01/08,2097.0,2100.296,2093.0,99000,2122.0,2079.0
90,2015/01/09,2100.0,2110.405,2111.0,119300,2145.0,2082.0
91,2015/01/13,2085.0,2079.857,2086.0,108600,2098.0,2059.0
92,2015/01/14,2053.0,2061.05,2085.0,74400,2093.0,2039.0
93,2015/01/15,2052.0,2052.765,2071.0,92200,2083.0,2027.0
94,2015/01/16,2005.0,2000.857,1998.0,146400,2026.0,1973.0
95,2015/01/19,2056.0,2054.955,2024.0,122600,2073.0,2024.0
96,2015/01/20,2055.0,2075.176,2041.0,359400,2098.0,2031.0
97,2015/01/21,2147.0,2145.67,2105.0,408500,2184.0,2098.0
98,2015/01/22,2133.0,2164.145,2212.0,114300,2215.0,2126.0
99,2015/01/23,2173.0,2176.49,2150.0,246600,2202.0,2140.0
100,2015/01/26,2148.0,2151.714,2140.0,91200,2179.0,2126.0
101,2015/01/27,2218.0,2213.333,2175.0,150500,2230.0,2175.0
102,2015/01/28,2243.0,2247.351,2229.0,162900,2260.0,2224.0
103,2015/01/29,2232.0,2250.675,2222.0,221500,2285.0,2202.0
104,2015/01/30,2199.0,2225.017,2218.0,200700,2286.0,2175.0
105,2015/02/02,2164.0,2179.298,2199.0,131000,2227.0,2140.0
106,2015/02/03,2122.0,2146.876,2174.0,124600,2181.0,2110.0
107,2015/02/04,2139.0,2144.259,2130.0,116800,2166.0,2130.0
108,2015/02/05,2108.0,2110.441,2130.0,78400,2134.0,2090.0
109,2015/02/06,2092.0,2101.255,2104.0,174400,2125.0,2086.0
110,2015/02/09,2088.0,2091.746,2092.0,157700,2111.0,2072.0
111,2015/02/10,2127.0,2115.609,2078.0,134100,2130.0,2078.0
112,2015/02/12,2137.0,2140.529,2137.0,148300,2170.0,2124.0
113,2015/02/13,2112.0,2116.963,2137.0,99900,2147.0,2106.0
114,2015/02/16,2028.0,2061.155,2113.0,371100,2125.0,2022.0
115,2015/02/17,2041.0,2020.797,2018.0,230400,2044.0,2000.0
116,2015/02/18,2057.0,2069.072,2046.0,175700,2090.0,2046.0
117,2015/02/19,2064.0,2064.378,2054.0,102200,2077.0,2052.0
118,2015/02/20,2071.0,2072.888,2074.0,113800,2083.0,2058.0
119,2015/02/23,2059.0,2064.093,2072.0,139200,2078.0,2053.0
120,2015/02/24,2064.0,2068.12,2072.0,81500,2083.0,2050.0
121,2015/02/25,2105.0,2109.284,2084.0,158600,2142.0,2068.0
122,2015/02/26,2111.0,2102.109,2101.0,85200,2112.0,2084.0
123,2015/02/27,2084.0,2088.131,2111.0,105300,2111.0,2072.0
124,2015/03/02,2091.0,2093.371,2098.0,83800,2111.0,2081.0
125,2015/03/03,2084.0,2080.419,2100.0,143800,2101.0,2057.0
126,2015/03/04,2042.0,2043.814,2075.0,97200,2075.0,2028.0
127,2015/03/05,2033.0,2032.82,2032.0,79900,2047.0,2024.0
128,2015/03/06,2020.0,2020.694,2034.0,99800,2043.0,2010.0
129,2015/03/09,2014.0,2008.944,2028.0,71800,2028.0,1996.0
130,2015/03/10,2016.0,2011.792,2005.0,96000,2026.0,1997.0
131,2015/03/11,2095.0,2061.712,2016.0,534200,2103.0,1961.0
132,2015/03/12,2140.0,2137.558,2118.0,226200,2168.0,2112.0
133,2015/03/13,2105.0,2115.255,2140.0,394900,2157.0,2087.0
134,2015/03/16,2109.0,2101.972,2109.0,178900,2125.0,2075.0
135,2015/03/17,2095.0,2101.523,2095.0,288300,2136.0,2072.0
136,2015/03/18,2088.0,2093.411,2119.0,55000,2125.0,2083.0
137,2015/03/19,2074.0,2078.717,2080.0,86900,2094.0,2070.0
138,2015/03/20,2035.0,2038.143,2076.0,129400,2076.0,2025.0
139,2015/03/23,2040.0,2042.387,2035.0,67200,2056.0,2032.0
140,2015/03/24,2034.0,2032.369,2030.0,100000,2050.0,2025.0
141,2015/03/25,2014.0,2019.399,2039.0,290000,2043.0,2002.0
142,2015/03/26,2015.0,2018.92,2004.0,507800,2069.0,1988.0
143,2015/03/27,2002.0,2031.818,2018.0,328300,2059.0,1992.0
144,2015/03/30,2025.0,2023.25,2023.0,367400,2043.0,2002.0
145,2015/03/31,2029.0,2034.759,2041.0,406300,2068.0,2012.0
146,2015/04/01,1994.0,2006.48,2031.0,317200,2038.0,1986.0
147,2015/04/02,1996.0,1991.901,1980.0,383000,2013.0,1970.0
148,2015/04/03,2058.0,2037.225,2000.0,437900,2066.0,1986.0
149,2015/04/06,2063.0,2053.325,2044.0,225800,2071.0,2032.0
150,2015/04/07,2120.0,2113.782,2074.0,293900,2135.0,2072.0
151,2015/04/08,2112.0,2125.817,2127.0,204800,2149.0,2108.0
152,2015/04/09,2076.0,2087.347,2134.0,354100,2134.0,2059.0
153,2015/04/10,2059.0,2070.731,2104.0,570400,2104.0,2055.0
154,2015/04/13,2005.0,2020.419,2052.0,402300,2060.0,1996.0
155,2015/04/14,2037.0,2030.239,2010.0,353900,2046.0,1988.0
156,2015/04/15,1998.0,2013.717,2022.0,249500,2039.0,1990.0
157,2015/04/16,2033.0,2028.119,2010.0,439500,2037.0,2010.0
158,2015/04/17,2068.0,2055.127,2030.0,404100,2073.0,2023.0
159,2015/04/20,2039.0,2056.651,2052.0,383700,2086.0,2032.0
160,2015/04/21,2012.0,2017.465,2045.0,291800,2053.0,2006.0
161,2015/04/22,1996.0,2000.16,2007.0,451200,2015.0,1985.0
162,2015/04/23,2011.0,2007.592,2002.0,211200,2020.0,2000.0
163,2015/04/24,2030.0,2026.616,2023.0,222600,2038.0,2001.0
164,2015/04/27,2009.0,2013.283,2030.0,98100,2030.0,2006.0
165,2015/04/28,2027.0,2018.257,2010.0,146000,2027.0,2005.0
166,2015/04/30,1950.0,1964.558,2020.0,727600,2037.0,1900.0
167,2015/05/01,1969.0,1951.511,1950.0,731700,1981.0,1922.0
168,2015/05/07,2010.0,2014.307,1986.0,447000,2062.0,1974.0
169,2015/05/08,2036.0,2031.182,2021.0,288200,2050.0,2013.0
170,2015/05/11,2093.0,2094.559,2070.0,260100,2110.0,2067.0
171,2015/05/12,2102.0,2102.381,2085.0,171500,2115.0,2078.0
172,2015/05/13,2097.0,2098.098,2102.0,176500,2104.0,2088.0
173,2015/05/14,2018.0,2019.147,2047.0,462800,2056.0,2006.0
174,2015/05/15,1987.0,1993.866,2018.0,318000,2020.0,1978.0
175,2015/05/18,2020.0,2011.292,1996.0,163500,2020.0,1988.0
176,2015/05/19,2018.0,2020.068,2002.0,222100,2032.0,2000.0
177,2015/05/20,2030.0,2026.172,2024.0,150800,2041.0,2006.0
178,2015/05/21,2053.0,2051.864,2033.0,140900,2062.0,2033.0
179,2015/05/22,2115.0,2094.771,2063.0,234000,2118.0,2054.0
180,2015/05/25,2100.0,2098.686,2110.0,137800,2117.0,2089.0
181,2015/05/26,2145.0,2137.497,2103.0,214600,2151.0,2099.0
182,2015/05/27,2157.0,2138.5,2138.0,396400,2163.0,2115.0
183,2015/05/28,2191.0,2183.982,2170.0,367700,2202.0,2170.0
184,2015/05/29,2244.0,2232.082,2171.0,479800,2268.0,2171.0
185,2015/06/01,2244.0,2234.743,2200.0,442800,2271.0,2200.0
186,2015/06/02,2198.0,2214.863,2240.0,353600,2244.0,2183.0
187,2015/06/03,2254.0,2237.897,2200.0,233100,2254.0,2196.0
188,2015/06/04,2300.0,2279.979,2253.0,370400,2305.0,2247.0
189,2015/06/05,2261.0,2250.466,2257.0,275100,2275.0,2232.0
190,2015/06/08,2275.0,2272.974,2298.0,101700,2305.0,2257.0
191,2015/06/09,2252.0,2254.08,2242.0,269500,2274.0,2232.0
192,2015/06/10,2337.0,2309.023,2281.0,400300,2367.0,2260.0
193,2015/06/11,2333.0,2315.099,2365.0,559500,2367.0,2258.0
194,2015/06/12,2349.0,2357.809,2352.0,391800,2385.0,2343.0
195,2015/06/15,2355.0,2344.179,2351.0,295400,2374.0,2325.0
196,2015/06/16,2320.0,2327.501,2356.0,158100,2374.0,2304.0
197,2015/06/17,2296.0,2303.936,2313.0,342700,2336.0,2271.0
198,2015/06/18,2277.0,2279.868,2301.0,278200,2301.0,2265.0
199,2015/06/19,2412.0,2402.173,2350.0,698400,2442.0,2350.0
200,2015/06/22,2362.0,2364.672,2382.0,284700,2391.0,2342.0
201,2015/06/23,2400.0,2389.368,2378.0,211700,2408.0,2360.0
202,2015/06/24,2436.0,2433.385,2430.0,149100,2455.0,2412.0
203,2015/06/25,2330.0,2368.141,2400.0,485300,2414.0,2327.0
204,2015/06/26,2283.0,2279.054,2292.0,385800,2308.0,2252.0
205,2015/06/29,2246.0,2239.624,2203.0,273500,2274.0,2203.0
206,2015/06/30,2265.0,2245.603,2253.0,422300,2280.0,2220.0
207,2015/07/01,2252.0,2249.545,2261.0,174600,2280.0,2229.0
208,2015/07/02,2233.0,2245.993,2267.0,271500,2292.0,2228.0
209,2015/07/03,2220.0,2218.932,2234.0,289400,2237.0,2203.0
210,2015/07/06,2185.0,2190.61,2196.0,198000,2227.0,2174.0
211,2015/07/07,2178.0,2201.686,2235.0,290200,2259.0,2176.0
212,2015/07/08,2079.0,2105.66,2170.0,247600,2171.0,2071.0
213,2015/07/09,2055.0,2023.089,2013.0,243000,2060.0,1975.0
214,2015/07/10,2034.0,2041.705,2061.0,246000,2061.0,2023.0
215,2015/07/13,2056.0,2060.657,2045.0,147800,2075.0,2045.0
216,2015/07/14,2089.0,2091.117,2067.0,208300,2113.0,2066.0
217,2015/07/15,2051.0,2065.845,2102.0,172400,2114.0,2040.0
218,2015/07/16,2047.0,2025.885,2046.0,223300,2047.0,2004.0
219,2015/07/17,2067.0,2064.848,2061.0,246700,2083.0,2050.0
220,2015/07/21,2055.0,2065.604,2085.0,112500,2097.0,2047.0
221,2015/07/22,2071.0,2059.831,2043.0,146900,2078.0,2038.0
222,2015/07/23,2061.0,2066.29,2090.0,154000,2095.0,2055.0
223,2015/07/24,2036.0,2035.796,2070.0,138600,2070.0,2017.0
224,2015/07/27,2053.0,2049.581,2036.0,108100,2066.0,2030.0
225,2015/07/28,2055.0,2062.272,2053.0,157500,2077.0,2036.0
226,2015/07/29,1966.0,1991.183,2055.0,292100,2055.0,1965.0
227,2015/07/30,2022.0,2015.416,1970.0,194600,2039.0,1969.0
228,2015/07/31,2149.0,2098.756,2045.0,269100,2199.0,2015.0
229,2015/08/03,2146.0,2156.683,2199.0,308000,2221.0,2115.0
230,2015/08/04,2177.0,2166.73,2150.0,236200,2192.0,2140.0
231,2015/08/05,2171.0,2179.406,2177.0,288000,2202.0,2150.0
232,2015/08/06,2207.0,2202.656,2186.0,238800,2229.0,2165.0
233,2015/08/07,2245.0,2249.375,2216.0,202400,2271.0,2215.0
234,2015/08/10,2229.0,2226.059,2223.0,276700,2252.0,2187.0
235,2015/08/11,2253.0,2263.711,2245.0,296400,2290.0,2244.0
236,2015/08/12,2249.0,2259.079,2251.0,328000,2291.0,2236.0
237,2015/08/13,2261.0,2275.853,2271.0,160100,2308.0,2256.0
238,2015/08/14,2257.0,2263.281,2289.0,284400,2295.0,2250.0
239,2015/08/17,2341.0,2349.189,2274.0,419500,2380.0,2258.0
240,2015/08/18,2317.0,2336.737,2324.0,201700,2367.0,2311.0
241,2015/08/19,2302.0,2311.008,2304.0,188500,2332.0,2283.0
242,2015/08/20,2260.0,2287.837,2308.0,280200,2339.0,2250.0
243,2015/08/21,2215.0,2240.725,2221.0,188000,2296.0,2212.0
244,2015/08/24,2104.0,2136.886,2154.0,183900,2177.0,2103.0
245,2015/08/25,2032.0,2058.737,2060.0,222300,2119.0,2000.0
246,2015/08/26,2060.0,2039.208,2058.0,203000,2079.0,1986.0
247,2015/08/27,2038.0,2047.871,2023.0,178500,2086.0,2023.0
248,2015/08/28,2157.0,2157.205,2091.0,301900,2187.0,2091.0
249,2015/08/31,2115.0,2124.528,2142.0,142000,2168.0,2104.0
250,2015/09/01,2095.0,2141.12,2152.0,264100,2181.0,2095.0
251,2015/09/02,2070.0,2077.523,2060.0,221700,2106.0,2044.0
252,2015/09/03,2064.0,2095.241,2088.0,170900,2129.0,2062.0
253,2015/09/04,2027.0,2050.987,2075.0,148900,2101.0,2016.0
254,2015/09/07,2025.0,2025.823,2005.0,74700,2050.0,1987.0
255,2015/09/08,2020.0,2047.97,2034.0,165300,2094.0,2016.0
256,2015/09/09,2112.0,2102.378,2070.0,157500,2124.0,2070.0
257,2015/09/10,2113.0,2093.387,2068.0,100700,2123.0,2035.0
258,2015/09/11,2118.0,2110.604,2090.0,157700,2143.0,2071.0
259,2015/09/14,2181.0,2183.517,2168.0,298900,2200.0,2161.0
260,2015/09/15,2071.0,2128.557,2205.0,349700,2242.0,2065.0
261,2015/09/16,2059.0,2043.41,2068.0,195900,2078.0,1993.0
262,2015/09/17,2078.0,2072.039,2088.0,99800,2088.0,2055.0
263,2015/09/18,2044.0,2058.904,2079.0,115000,2109.0,2044.0
264,2015/09/24,1994.0,1992.25,2001.0,150500,2024.0,1975.0
265,2015/09/25,1935.0,1934.0,1970.0,248600,1996.0,1909.0
266,2015/09/28,1933.0,1935.305,1959.0,179300,1972.0,1914.0
267,2015/09/29,1829.0,1834.883,1894.0,233900,1894.0,1808.0
268,2015/09/30,1874.0,1863.846,1853.0,233400,1884.0,1817.0
269,2015/10/01,1904.0,1909.35,1908.0,101400,1945.0,1889.0
270,2015/10/02,1879.0,1875.301,1886.0,107700,1903.0,1840.0
271,2015/10/05,1978.0,1983.148,1935.0,229900,2017.0,1929.0
272,2015/10/06,2010.0,2026.936,2010.0,138500,2057.0,2010.0
273,2015/10/07,2050.0,2055.11,2025.0,167800,2081.0,2006.0
274,2015/10/08,2073.0,2080.937,2060.0,145000,2123.0,2041.0
275,2015/10/09,2159.0,2143.853,2102.0,164600,2177.0,2102.0
276,2015/10/13,2171.0,2180.281,2153.0,227000,2218.0,2144.0
277,2015/10/14,2109.0,2134.921,2147.0,191100,2181.0,2105.0
278,2015/10/15,2140.0,2141.064,2104.0,68800,2158.0,2104.0
279,2015/10/16,2140.0,2159.325,2167.0,110800,2195.0,2140.0
280,2015/10/19,2136.0,2137.081,2141.0,90000,2180.0,2106.0
281,2015/10/20,2118.0,2117.575,2147.0,94500,2158.0,2095.0
282,2015/10/21,2183.0,2174.357,2129.0,265700,2197.0,2118.0
283,2015/10/22,2169.0,2188.297,2163.0,298400,2218.0,2154.0
284,2015/10/23,2222.0,2225.754,2213.0,201200,2249.0,2207.0
285,2015/10/26,2219.0,2221.562,2241.0,162400,2241.0,2199.0
286,2015/10/27,2122.0,2142.687,2200.0,230200,2213.0,2112.0
287,2015/10/28,2172.0,2153.499,2138.0,208900,2178.0,2123.0
288,2015/10/29,2149.0,2129.19,2185.0,360500,2185.0,2095.0
289,2015/10/30,2009.0,2065.536,2146.0,546300,2146.0,2009.0
290,2015/11/02,2035.0,2037.218,2053.0,398100,2075.0,1985.0
291,2015/11/04,2067.0,2073.484,2070.0,232700,2099.0,2053.0
292,2015/11/05,2063.0,2061.831,2050.0,181100,2091.0,2043.0
293,2015/11/06,2063.0,2067.372,2065.0,133800,2109.0,2056.0
294,2015/11/09,2069.0,2066.959,2064.0,158900,2084.0,2045.0
295,2015/11/10,2049.0,2054.913,2059.0,106200,2064.0,2041.0
296,2015/11/11,2047.0,2047.194,2042.0,144100,2058.0,2035.0
297,2015/11/12,2047.0,2040.691,2038.0,96100,2066.0,2021.0
298,2015/11/13,2023.0,2014.429,2015.0,164800,2044.0,1996.0
299,2015/11/16,2008.0,2006.127,2000.0,98900,2018.0,1992.0
300,2015/11/17,2035.0,2033.897,2015.0,110700,2050.0,2015.0
301,2015/11/18,2019.0,2012.863,2022.0,181600,2029.0,1990.0
302,2015/11/19,2052.0,2046.161,2048.0,149400,2060.0,2022.0
303,2015/11/20,2018.0,2015.535,2052.0,189600,2061.0,2004.0
304,2015/11/24,2082.0,2080.457,2040.0,285000,2109.0,2040.0
305,2015/11/25,2138.0,2142.208,2097.0,253900,2166.0,2084.0
306,2015/11/26,2106.0,2118.484,2141.0,114100,2145.0,2105.0
307,2015/11/27,2135.0,2138.054,2124.0,80200,2156.0,2121.0
308,2015/11/30,2162.0,2150.478,2160.0,154200,2165.0,2126.0
309,2015/12/01,2174.0,2174.648,2165.0,90200,2197.0,2148.0
310,2015/12/02,2158.0,2153.816,2175.0,92800,2180.0,2128.0
311,2015/12/03,2155.0,2152.178,2160.0,110900,2180.0,2128.0
312,2015/12/04,2120.0,2118.003,2108.0,105800,2134.0,2101.0
313,2015/12/07,2137.0,2141.319,2126.0,72000,2160.0,2126.0
314,2015/12/08,2106.0,2103.834,2121.0,78500,2133.0,2088.0
315,2015/12/09,2139.0,2127.714,2135.0,176700,2156.0,2093.0
316,2015/12/10,2100.0,2129.934,2140.0,158200,2186.0,2097.0
317,2015/12/11,2128.0,2120.297,2100.0,135600,2149.0,2100.0
318,2015/12/14,2083.0,2075.832,2078.0,131600,2097.0,2059.0
319,2015/12/15,2066.0,2072.447,2100.0,126800,2112.0,2056.0
320,2015/12/16,2166.0,2143.778,2088.0,227800,2169.0,2088.0
321,2015/12/17,2196.0,2198.174,2202.0,227400,2230.0,2173.0
322,2015/12/18,2183.0,2203.07,2200.0,210700,2260.0,2167.0
323,2015/12/21,2164.0,2151.94,2160.0,193800,2178.0,2125.0
324,2015/12/22,2206.0,2213.072,2214.0,147000,2238.0,2114.0
325,2015/12/24,2183.0,2195.558,2209.0,102200,2224.0,2177.0
326,2015/12/25,2152.0,2170.212,2182.0,123200,2201.0,2143.0
327,2015/12/28,2166.0,2163.477,2119.0,111900,2182.0,2110.0
328,2015/12/29,2202.0,2173.603,2165.0,125100,2204.0,2120.0
329,2015/12/30,2175.0,2185.237,2191.0,126900,2219.0,2167.0
330,2016/01/04,2151.0,2166.781,2172.0,107900,2208.0,2137.0
331,2016/01/05,2138.0,2133.17,2125.0,144500,2153.0,2108.0
332,2016/01/06,2084.0,2099.369,2138.0,98700,2155.0,2071.0
333,2016/01/07,2028.0,2050.89,2095.0,82700,2103.0,2028.0
334,2016/01/08,2012.0,2022.462,2014.0,107200,2050.0,2001.0
335,2016/01/12,1965.0,1971.155,1990.0,203300,2010.0,1927.0
336,2016/01/13,2001.0,1993.839,1980.0,133100,2024.0,1960.0
337,2016/01/14,1949.0,1938.827,1972.0,103100,1972.0,1917.0
338,2016/01/15,2017.0,2018.324,2003.0,201800,2042.0,1991.0
339,2016/01/18,2000.0,1980.47,1972.0,120900,2011.0,1947.0
340,2016/01/19,2045.0,2035.984,2000.0,164500,2066.0,2000.0
341,2016/01/20,2034.0,2043.832,2065.0,291600,2081.0,2025.0
342,2016/01/21,1975.0,2030.312,2021.0,180000,2079.0,1974.0
343,2016/01/22,2008.0,1997.68,2012.0,221100,2030.0,1975.0
344,2016/01/25,2107.0,2085.222,2035.0,163200,2122.0,2020.0
345,2016/01/26,2141.0,2122.953,2072.0,260100,2156.0,2056.0
346,2016/01/27,2169.0,2173.219,2174.0,261400,2200.0,2150.0
347,2016/01/28,2161.0,2155.937,2164.0,260800,2174.0,2123.0
348,2016/01/29,2080.0,2074.279,2145.0,525000,2160.0,1935.0
349,2016/02/01,2091.0,2079.161,2099.0,273600,2110.0,2046.0
350,2016/02/02,1984.0,1992.385,2049.0,407100,2061.0,1975.0
351,2016/02/03,1842.0,1860.623,1950.0,455600,1950.0,1825.0
352,2016/02/04,1937.0,1912.74,1850.0,311700,1948.0,1840.0
353,2016/02/05,1919.0,1922.694,1937.0,228100,1979.0,1883.0
354,2016/02/08,1891.0,1882.089,1862.0,297400,1917.0,1840.0
355,2016/02/09,1788.0,1796.439,1820.0,247400,1835.0,1771.0
356,2016/02/10,1740.0,1762.292,1800.0,214800,1818.0,1718.0
357,2016/02/12,1639.0,1657.816,1682.0,311200,1697.0,1631.0
358,2016/02/15,1708.0,1707.251,1727.0,213900,1729.0,1673.0
359,2016/02/16,1726.0,1728.829,1708.0,289600,1755.0,1680.0
360,2016/02/17,1741.0,1739.981,1742.0,378000,1787.0,1704.0
361,2016/02/18,1787.0,1792.424,1808.0,180600,1811.0,1771.0
362,2016/02/19,1797.0,1806.087,1827.0,356200,1846.0,1776.0
363,2016/02/22,1701.0,1725.215,1757.0,445400,1788.0,1689.0
364,2016/02/23,1754.0,1747.417,1730.0,185000,1770.0,1721.0
365,2016/02/24,1708.0,1704.375,1717.0,203100,1731.0,1679.0
366,2016/02/25,1722.0,1712.188,1693.0,280000,1730.0,1691.0
367,2016/02/26,1708.0,1718.677,1726.0,187900,1762.0,1701.0
368,2016/02/29,1727.0,1754.637,1725.0,176400,1781.0,1725.0
369,2016/03/01,1725.0,1720.157,1729.0,144600,1756.0,1697.0
370,2016/03/02,1801.0,1769.243,1742.0,227200,1809.0,1725.0
371,2016/03/03,1848.0,1839.156,1813.0,218300,1867.0,1812.0
372,2016/03/04,1892.0,1885.082,1851.0,236600,1910.0,1843.0
373,2016/03/07,1767.0,1774.23,1812.0,428700,1815.0,1744.0
374,2016/03/08,1701.0,1719.2,1751.0,365400,1778.0,1698.0
375,2016/03/09,1689.0,1690.738,1697.0,296800,1711.0,1670.0
376,2016/03/10,1624.0,1622.379,1674.0,490000,1685.0,1584.0
377,2016/03/11,1712.0,1681.119,1617.0,463000,1724.0,1616.0
378,2016/03/14,1722.0,1722.004,1726.0,252300,1745.0,1708.0
379,2016/03/15,1737.0,1732.03,1721.0,199600,1746.0,1715.0
380,2016/03/16,1697.0,1711.854,1730.0,138600,1731.0,1697.0
381,2016/03/17,1705.0,1706.369,1711.0,156600,1730.0,1681.0
382,2016/03/18,1745.0,1729.185,1706.0,338600,1753.0,1705.0
383,2016/03/22,1756.0,1744.679,1746.0,258200,1757.0,1718.0
384,2016/03/23,1785.0,1786.288,1781.0,268900,1804.0,1771.0
385,2016/03/24,1739.0,1737.738,1761.0,173500,1769.0,1710.0
386,2016/03/25,1763.0,1748.941,1744.0,110500,1769.0,1722.0
387,2016/03/28,1770.0,1764.103,1778.0,184000,1789.0,1747.0
388,2016/03/29,1752.0,1743.044,1738.0,144100,1764.0,1723.0
389,2016/03/30,1740.0,1741.541,1769.0,145100,1770.0,1722.0
390,2016/03/31,1692.0,1713.643,1720.0,172100,1753.0,1689.0
391,2016/04/01,1657.0,1670.918,1705.0,189400,1706.0,1651.0
392,2016/04/04,1712.0,1708.057,1657.0,211200,1737.0,1650.0
393,2016/04/05,1620.0,1635.059,1676.0,191500,1676.0,1618.0
394,2016/04/06,1620.0,1617.079,1625.0,146700,1642.0,1602.0
395,2016/04/07,1599.0,1599.718,1618.0,120900,1623.0,1587.0
396,2016/04/08,1622.0,1596.858,1571.0,118000,1636.0,1555.0
397,2016/04/11,1606.0,1602.886,1622.0,129300,1638.0,1590.0
398,2016/04/12,1654.0,1649.272,1602.0,115500,1670.0,1602.0
399,2016/04/13,1698.0,1690.522,1670.0,134400,1714.0,1664.0
400,2016/04/14,1742.0,1734.023,1729.0,144600,1745.0,1713.0
401,2016/04/15,1684.0,1682.649,1721.0,259300,1724.0,1658.0
402,2016/04/18,1668.0,1654.433,1640.0,169600,1673.0,1617.0
403,2016/04/19,1715.0,1711.661,1708.0,166200,1724.0,1700.0
404,2016/04/20,1700.0,1694.442,1726.0,235900,1749.0,1664.0
405,2016/04/21,1773.0,1755.306,1725.0,213100,1774.0,1716.0
406,2016/04/22,1816.0,1792.319,1770.0,234000,1817.0,1760.0
407,2016/04/25,1812.0,1819.004,1826.0,114000,1837.0,1801.0
408,2016/04/26,1762.0,1767.824,1790.0,74600,1795.0,1749.0
409,2016/04/27,1774.0,1778.003,1771.0,91400,1799.0,1764.0
410,2016/04/28,1691.0,1730.178,1770.0,266500,1789.0,1683.0
411,2016/05/02,1589.0,1604.955,1617.0,275300,1665.0,1581.0
412,2016/05/06,1601.0,1597.247,1629.0,234400,1637.0,1579.0
413,2016/05/09,1576.0,1575.022,1600.0,161400,1610.0,1557.0
414,2016/05/10,1598.0,1575.357,1570.0,158800,1603.0,1535.0
415,2016/05/11,1571.0,1584.345,1601.0,102800,1609.0,1566.0
416,2016/05/12,1559.0,1557.332,1571.0,151600,1572.0,1543.0
417,2016/05/13,1537.0,1534.344,1556.0,182200,1563.0,1517.0
418,2016/05/16,1539.0,1544.662,1552.0,79200,1563.0,1534.0
419,2016/05/17,1560.0,1552.569,1553.0,116000,1567.0,1541.0
420,2016/05/18,1578.0,1579.107,1569.0,172000,1594.0,1558.0
421,2016/05/19,1606.0,1603.378,1577.0,216900,1614.0,1575.0
422,2016/05/20,1671.0,1661.861,1596.0,320600,1684.0,1596.0
423,2016/05/23,1656.0,1654.536,1661.0,169500,1669.0,1632.0
424,2016/05/24,1694.0,1682.893,1656.0,269400,1704.0,1636.0
425,2016/05/25,1740.0,1729.332,1694.0,198800,1748.0,1694.0
426,2016/05/26,1706.0,1727.155,1756.0,119100,1765.0,1706.0
427,2016/05/27,1726.0,1732.627,1718.0,76100,1748.0,1718.0
428,2016/05/30,1694.0,1679.154,1648.0,266200,1700.0,1646.0
429,2016/05/31,1678.0,1670.943,1694.0,187800,1694.0,1648.0
430,2016/06/01,1689.0,1687.812,1678.0,159600,1706.0,1666.0
431,2016/06/02,1641.0,1646.707,1667.0,177000,1706.0,1635.0
432,2016/06/03,1644.0,1645.493,1654.0,118000,1667.0,1634.0
433,2016/06/06,1659.0,1648.213,1620.0,102700,1660.0,1608.0
434,2016/06/07,1639.0,1643.315,1649.0,178600,1669.0,1627.0
435,2016/06/08,1627.0,1616.838,1646.0,197800,1659.0,1601.0
436,2016/06/09,1616.0,1622.854,1622.0,75300,1636.0,1613.0
437,2016/06/10,1581.0,1585.744,1614.0,141200,1615.0,1567.0
438,2016/06/13,1528.0,1535.994,1554.0,141800,1555.0,1523.0
439,2016/06/14,1487.0,1483.176,1500.0,194100,1509.0,1464.0
440,2016/06/15,1501.0,1487.291,1465.0,175300,1514.0,1441.0
441,2016/06/16,1429.0,1454.019,1501.0,118000,1507.0,1425.0
442,2016/06/17,1437.0,1451.766,1451.0,120900,1470.0,1437.0
443,2016/06/20,1542.0,1539.385,1497.0,264900,1574.0,1468.0
444,2016/06/21,1537.0,1531.634,1531.0,116900,1546.0,1504.0
445,2016/06/22,1503.0,1504.06,1526.0,84500,1536.0,1492.0
446,2016/06/23,1541.0,1524.592,1493.0,80700,1546.0,1483.0
447,2016/06/24,1396.0,1448.853,1524.0,185800,1546.0,1387.0
448,2016/06/27,1509.0,1484.756,1420.0,242100,1512.0,1420.0
449,2016/06/28,1506.0,1525.949,1495.0,296600,1572.0,1483.0
450,2016/06/29,1491.0,1506.532,1511.0,223900,1547.0,1487.0
451,2016/06/30,1555.0,1556.074,1525.0,197900,1572.0,1525.0
452,2016/07/01,1595.0,1582.532,1547.0,192600,1598.0,1538.0
453,2016/07/04,1582.0,1597.745,1599.0,118600,1626.0,1577.0
454,2016/07/05,1559.0,1560.562,1581.0,54300,1581.0,1552.0
455,2016/07/06,1520.0,1513.662,1519.0,102000,1530.0,1497.0
456,2016/07/07,1529.0,1522.287,1511.0,131100,1534.0,1511.0
457,2016/07/08,1556.0,1554.005,1527.0,111400,1565.0,1527.0
458,2016/07/11,1643.0,1637.428,1610.0,136600,1660.0,1598.0
459,2016/07/12,1698.0,1709.282,1683.0,143100,1733.0,1683.0
460,2016/07/13,1750.0,1754.342,1740.0,169500,1774.0,1733.0
461,2016/07/14,1738.0,1724.106,1723.0,131900,1746.0,1703.0
462,2016/07/15,1755.0,1761.182,1752.0,153100,1780.0,1741.0
463,2016/07/19,1800.0,1807.327,1755.0,179800,1843.0,1752.0
464,2016/07/20,1817.0,1809.156,1813.0,225300,1829.0,1787.0
465,2016/07/21,1862.0,1854.74,1837.0,105900,1879.0,1832.0
466,2016/07/22,1859.0,1857.272,1847.0,123300,1874.0,1837.0
467,2016/07/25,1875.0,1864.46,1851.0,130800,1885.0,1831.0
468,2016/07/26,1830.0,1827.401,1851.0,83600,1863.0,1809.0
469,2016/07/27,1865.0,1856.682,1846.0,75100,1876.0,1836.0
470,2016/07/28,1847.0,1846.811,1840.0,77800,1858.0,1831.0
471,2016/07/29,1997.0,1940.887,1879.0,305500,2000.0,1841.0
472,2016/08/01,2012.0,1989.64,1957.0,220500,2034.0,1942.0
473,2016/08/02,1932.0,1943.42,1962.0,130700,1969.0,1912.0
474,2016/08/03,1934.0,1940.332,1914.0,181200,1960.0,1909.0
475,2016/08/04,1954.0,1937.006,1923.0,72000,1957.0,1916.0
476,2016/08/05,1944.0,1945.62,1947.0,81100,1962.0,1930.0
477,2016/08/08,1945.0,1934.519,1947.0,151000,1955.0,1913.0
478,2016/08/09,1964.0,1955.725,1945.0,128200,1978.0,1923.0
479,2016/08/10,1998.0,1988.951,1986.0,75400,2004.0,1965.0
480,2016/08/12,1946.0,1951.316,1997.0,171900,1997.0,1933.0
481,2016/08/15,1937.0,1936.508,1947.0,180700,1968.0,1919.0
482,2016/08/16,1888.0,1897.629,1937.0,241800,1950.0,1872.0
483,2016/08/17,1888.0,1883.834,1866.0,193900,1895.0,1863.0
484,2016/08/18,1899.0,1896.046,1877.0,122300,1915.0,1865.0
485,2016/08/19,1975.0,1963.902,1928.0,85900,1978.0,1928.0
486,2016/08/22,2020.0,2013.804,1978.0,110500,2029.0,1968.0
487,2016/08/23,1934.0,1949.721,2004.0,85600,2006.0,1925.0
488,2016/08/24,2009.0,1997.698,1951.0,106800,2014.0,1951.0
489,2016/08/25,1958.0,1959.028,1974.0,90200,1985.0,1944.0
490,2016/08/26,1970.0,1976.344,1974.0,69500,2000.0,1958.0
491,2016/08/29,1965.0,1981.247,2000.0,117900,2025.0,1955.0
492,2016/08/30,1960.0,1959.04,1961.0,73500,1964.0,1948.0
493,2016/08/31,2008.0,2006.519,1994.0,106100,2023.0,1986.0
494,2016/09/01,2063.0,2053.801,2039.0,90100,2064.0,2035.0
495,2016/09/02,2001.0,2003.365,2046.0,78700,2046.0,1979.0
496,2016/09/05,2000.0,2010.217,2005.0,29000,2025.0,1999.0
497,2016/09/06,1982.0,1977.182,1994.0,46600,2007.0,1966.0
498,2016/09/07,1973.0,1952.657,1948.0,93400,1977.0,1923.0
499,2016/09/08,1945.0,1945.243,1957.0,201400,1970.0,1913.0
500,2016/09/09,1971.0,1963.179,1949.0,105500,1979.0,1936.0
501,2016/09/12,1891.0,1899.152,1921.0,124300,1927.0,1883.0
502,2016/09/13,1893.0,1891.469,1901.0,148600,1922.0,1871.0
503,2016/09/14,1902.0,1895.514,1869.0,88000,1916.0,1857.0
504,2016/09/15,1891.0,1888.974,1890.0,99600,1901.0,1870.0
505,2016/09/16,1910.0,1917.012,1931.0,152700,1954.0,1897.0
506,2016/09/20,1873.0,1878.541,1870.0,79700,1904.0,1864.0
507,2016/09/21,1861.0,1840.961,1842.0,207800,1868.0,1803.0
508,2016/09/23,1843.0,1845.379,1901.0,198000,1902.0,1826.0
509,2016/09/26,1859.0,1867.078,1844.0,358000,1897.0,1837.0
510,2016/09/27,1910.0,1858.626,1842.0,333100,1913.0,1795.0
511,2016/09/28,1942.0,1942.616,1940.0,142600,1964.0,1928.0
512,2016/09/29,1968.0,1977.375,1955.0,162200,2000.0,1955.0
513,2016/09/30,1907.0,1911.335,1922.0,66600,1928.0,1903.0
514,2016/10/03,1927.0,1941.003,1923.0,61700,1963.0,1923.0
515,2016/10/04,1944.0,1934.356,1925.0,72200,1946.0,1909.0
516,2016/10/05,1947.0,1950.769,1936.0,69600,1966.0,1928.0
517,2016/10/06,1892.0,1907.838,1938.0,184900,1953.0,1880.0
518,2016/10/07,1912.0,1913.921,1925.0,145300,1938.0,1899.0
519,2016/10/11,1954.0,1946.789,1936.0,97500,1961.0,1924.0
520,2016/10/12,1910.0,1918.433,1932.0,68300,1940.0,1906.0
521,2016/10/13,1928.0,1917.986,1928.0,97000,1932.0,1898.0
522,2016/10/14,1959.0,1952.727,1932.0,143000,1964.0,1932.0
523,2016/10/17,2012.0,2013.591,1957.0,213900,2037.0,1957.0
524,2016/10/18,2051.0,2039.998,2012.0,135200,2057.0,2003.0
525,2016/10/19,2053.0,2054.451,2043.0,146900,2070.0,2035.0
526,2016/10/20,2036.0,2041.199,2064.0,124600,2071.0,2022.0
527,2016/10/21,2049.0,2050.726,2045.0,126800,2067.0,2037.0
528,2016/10/24,2039.0,2028.634,2033.0,76500,2053.0,2012.0
529,2016/10/25,1994.0,1993.764,2021.0,147600,2023.0,1980.0
530,2016/10/26,2013.0,2002.523,1985.0,92900,2017.0,1981.0
531,2016/10/27,1988.0,1994.719,2014.0,58700,2028.0,1977.0
532,2016/10/28,2011.0,2013.566,2014.0,74100,2023.0,2007.0
533,2016/10/31,2004.0,2001.206,1984.0,105300,2029.0,1984.0
534,2016/11/01,1892.0,1891.722,1984.0,295500,1990.0,1842.0
535,2016/11/02,1900.0,1896.603,1888.0,229100,1908.0,1870.0
536,2016/11/04,1878.0,1871.288,1866.0,126300,1889.0,1852.0
537,2016/11/07,1907.0,1910.561,1925.0,104600,1945.0,1899.0
538,2016/11/08,1925.0,1924.784,1907.0,68500,1935.0,1905.0
539,2016/11/09,1886.0,1913.929,1965.0,201500,1978.0,1861.0
540,2016/11/10,1967.0,1972.37,1973.0,116900,1993.0,1957.0
541,2016/11/11,1999.0,2003.233,2002.0,192500,2038.0,1990.0
542,2016/11/14,2047.0,2045.952,2032.0,94900,2058.0,2026.0
543,2016/11/15,2003.0,1999.839,2048.0,400500,2063.0,1919.0
544,2016/11/16,2020.0,2016.079,2030.0,108800,2034.0,2002.0
545,2016/11/17,1991.0,1978.816,1997.0,157900,1998.0,1956.0
546,2016/11/18,2071.0,2055.561,2024.0,187200,2086.0,2011.0
547,2016/11/21,2072.0,2077.443,2098.0,154500,2113.0,2058.0
548,2016/11/22,2070.0,2048.111,2082.0,210700,2084.0,2006.0
549,2016/11/24,2122.0,2129.302,2118.0,197700,2164.0,2103.0
550,2016/11/25,2151.0,2146.52,2119.0,139200,2165.0,2119.0
551,2016/11/28,2089.0,2070.868,2051.0,205100,2094.0,2042.0
552,2016/11/29,2074.0,2071.68,2055.0,105800,2086.0,2050.0
553,2016/11/30,2074.0,2076.411,2077.0,227500,2109.0,2061.0
554,2016/12/01,2092.0,2093.202,2099.0,213000,2129.0,2070.0
555,2016/12/02,2112.0,2113.571,2114.0,213300,2149.0,2090.0
556,2016/12/05,2090.0,2087.276,2090.0,112200,2099.0,2073.0
557,2016/12/06,2131.0,2120.796,2101.0,116400,2135.0,2097.0
558,2016/12/07,2093.0,2077.907,2067.0,190300,2097.0,2040.0
559,2016/12/08,2127.0,2107.572,2109.0,175700,2136.0,2073.0
560,2016/12/09,2142.0,2132.22,2130.0,160800,2149.0,2109.0
561,2016/12/12,2139.0,2141.623,2155.0,124100,2169.0,2113.0
562,2016/12/13,2174.0,2166.252,2167.0,150500,2180.0,2137.0
563,2016/12/14,2174.0,2174.769,2187.0,145200,2195.0,2160.0
564,2016/12/15,2172.0,2163.762,2164.0,129500,2177.0,2140.0
565,2016/12/16,2151.0,2156.971,2179.0,125900,2179.0,2147.0
566,2016/12/19,2123.0,2118.829,2136.0,135300,2136.0,2105.0
567,2016/12/20,2207.0,2188.086,2115.0,201600,2217.0,2114.0
568,2016/12/21,2216.0,2203.446,2183.0,215500,2229.0,2168.0
569,2016/12/22,2198.0,2195.988,2215.0,103800,2219.0,2172.0
570,2016/12/26,2182.0,2188.507,2194.0,48100,2215.0,2181.0
571,2016/12/27,2198.0,2200.278,2186.0,72000,2210.0,2186.0
572,2016/12/28,2258.0,2245.234,2209.0,88100,2260.0,2209.0
573,2016/12/29,2252.0,2248.402,2255.0,118600,2269.0,2237.0
574,2016/12/30,2227.0,2215.038,2202.0,122900,2232.0,2177.0
575,2017/01/04,2253.0,2239.994,2227.0,143000,2255.0,2211.0
576,2017/01/05,2244.0,2249.681,2269.0,179000,2279.0,2225.0
577,2017/01/06,2195.0,2192.598,2216.0,184600,2218.0,2179.0
578,2017/01/10,2179.0,2178.294,2173.0,191100,2203.0,2162.0
579,2017/01/11,2272.0,2261.058,2217.0,188500,2288.0,2214.0
580,2017/01/12,2253.0,2255.295,2260.0,106000,2273.0,2243.0
581,2017/01/13,2256.0,2252.693,2238.0,92600,2265.0,2237.0
582,2017/01/16,2199.0,2208.204,2246.0,91400,2246.0,2195.0
583,2017/01/17,2173.0,2182.553,2194.0,108200,2204.0,2171.0
584,2017/01/18,2212.0,2201.903,2191.0,105600,2229.0,2164.0
585,2017/01/19,2247.0,2249.831,2234.0,87200,2263.0,2234.0
586,2017/01/20,2265.0,2261.983,2230.0,80200,2278.0,2230.0
587,2017/01/23,2294.0,2292.978,2247.0,185500,2328.0,2233.0
588,2017/01/24,2276.0,2275.551,2277.0,159600,2308.0,2253.0
589,2017/01/25,2308.0,2309.811,2310.0,70300,2322.0,2296.0
590,2017/01/26,2321.0,2316.632,2325.0,67900,2333.0,2301.0
591,2017/01/27,2332.0,2335.446,2341.0,81400,2349.0,2316.0
592,2017/01/30,2318.0,2315.94,2314.0,76300,2325.0,2306.0
593,2017/01/31,2276.0,2282.814,2295.0,92900,2310.0,2267.0
594,2017/02/01,2310.0,2305.881,2276.0,67300,2321.0,2270.0
595,2017/02/02,2274.0,2289.008,2310.0,62600,2326.0,2270.0
596,2017/02/03,2275.0,2282.572,2274.0,75300,2312.0,2267.0
597,2017/02/06,2252.0,2254.171,2275.0,79400,2286.0,2245.0
598,2017/02/07,2246.0,2248.81,2246.0,123400,2263.0,2234.0
599,2017/02/08,2218.0,2219.139,2226.0,162100,2276.0,2203.0
600,2017/02/09,2206.0,2203.897,2207.0,82100,2218.0,2188.0
601,2017/02/10,2171.0,2173.714,2218.0,413700,2294.0,2070.0
602,2017/02/13,2175.0,2172.898,2175.0,201100,2218.0,2153.0
603,2017/02/14,2199.0,2206.241,2202.0,152600,2235.0,2193.0
604,2017/02/15,2192.0,2187.72,2204.0,169000,2224.0,2180.0
605,2017/02/16,2180.0,2181.572,2208.0,63100,2208.0,2160.0
606,2017/02/17,2152.0,2153.619,2173.0,68300,2180.0,2141.0
607,2017/02/20,2146.0,2138.541,2147.0,77500,2151.0,2125.0
608,2017/02/21,2139.0,2134.422,2137.0,42700,2142.0,2128.0
609,2017/02/22,2151.0,2156.202,2169.0,118600,2185.0,2140.0
610,2017/02/23,2140.0,2136.16,2151.0,102700,2151.0,2122.0
611,2017/02/24,2117.0,2112.412,2124.0,104000,2127.0,2105.0
612,2017/02/27,2113.0,2108.58,2100.0,123200,2128.0,2083.0
613,2017/02/28,2110.0,2118.475,2113.0,99000,2141.0,2107.0
614,2017/03/01,2138.0,2129.042,2105.0,168200,2147.0,2105.0
615,2017/03/02,2140.0,2145.957,2171.0,120200,2184.0,2125.0
616,2017/03/03,2136.0,2133.848,2129.0,79500,2147.0,2125.0
617,2017/03/06,2137.0,2142.645,2129.0,58800,2157.0,2129.0
618,2017/03/07,2152.0,2150.883,2145.0,112500,2158.0,2124.0
619,2017/03/08,2160.0,2168.141,2152.0,162300,2181.0,2143.0
620,2017/03/09,2173.0,2172.456,2177.0,95900,2181.0,2163.0
621,2017/03/10,2153.0,2164.853,2174.0,127500,2191.0,2148.0
622,2017/03/13,2138.0,2137.018,2147.0,100400,2147.0,2124.0
623,2017/03/14,2155.0,2164.137,2149.0,101100,2182.0,2148.0
624,2017/03/15,2144.0,2150.081,2168.0,93800,2169.0,2142.0
625,2017/03/16,2091.0,2097.795,2133.0,230200,2149.0,2082.0
626,2017/03/17,2088.0,2080.262,2079.0,216200,2096.0,2060.0
627,2017/03/21,2102.0,2119.562,2090.0,187700,2165.0,2080.0
628,2017/03/22,2064.0,2065.58,2063.0,167000,2081.0,2050.0
629,2017/03/23,2045.0,2052.715,2052.0,95400,2066.0,2044.0
630,2017/03/24,2046.0,2035.138,2036.0,123800,2048.0,2011.0
631,2017/03/27,1997.0,1999.911,2023.0,122800,2023.0,1992.0
632,2017/03/28,2022.0,2011.707,2004.0,131900,2022.0,2001.0
633,2017/03/29,2032.0,2027.596,2018.0,74700,2033.0,2018.0
634,2017/03/30,2031.0,2037.376,2036.0,80600,2051.0,2028.0
635,2017/03/31,1988.0,2002.22,2023.0,137400,2037.0,1983.0
636,2017/04/03,1963.0,1963.636,2000.0,116100,2000.0,1940.0
637,2017/04/04,1951.0,1954.81,1968.0,165400,1968.0,1943.0
638,2017/04/05,1958.0,1952.212,1951.0,73600,1963.0,1941.0
639,2017/04/06,1913.0,1919.349,1934.0,112300,1941.0,1911.0
640,2017/04/07,1921.0,1914.018,1920.0,142600,1923.0,1892.0
641,2017/04/10,1941.0,1942.474,1942.0,73700,1954.0,1934.0
642,2017/04/11,1936.0,1932.23,1931.0,51700,1942.0,1915.0
643,2017/04/12,1900.0,1902.828,1908.0,72800,1925.0,1892.0
644,2017/04/13,1870.0,1860.578,1871.0,98800,1875.0,1845.0
645,2017/04/14,1871.0,1867.455,1850.0,68300,1881.0,1847.0
646,2017/04/17,1878.0,1871.525,1871.0,91200,1880.0,1844.0
647,2017/04/18,1868.0,1874.314,1897.0,95200,1903.0,1859.0
648,2017/04/19,1853.0,1852.114,1851.0,111300,1863.0,1838.0
649,2017/04/20,1836.0,1843.745,1845.0,161300,1862.0,1823.0
650,2017/04/21,1877.0,1866.821,1867.0,134800,1880.0,1844.0
651,2017/04/24,1830.0,1849.619,1895.0,213800,1902.0,1818.0
652,2017/04/25,1847.0,1851.858,1835.0,247500,1865.0,1835.0
653,2017/04/26,1849.0,1858.135,1870.0,130300,1875.0,1847.0
654,2017/04/27,1863.0,1858.764,1854.0,150200,1869.0,1840.0
655,2017/04/28,1802.0,1845.561,1880.0,247600,1908.0,1797.0
656,2017/05/01,1738.0,1751.144,1783.0,251400,1800.0,1731.0
657,2017/05/02,1768.0,1784.496,1758.0,312100,1811.0,1758.0
658,2017/05/08,1785.0,1789.663,1798.0,236200,1805.0,1780.0
659,2017/05/09,1768.0,1774.745,1794.0,130400,1795.0,1768.0
660,2017/05/10,1835.0,1831.36,1785.0,223200,1852.0,1785.0
661,2017/05/11,1852.0,1844.832,1852.0,237700,1859.0,1817.0
662,2017/05/12,1859.0,1857.648,1861.0,185600,1869.0,1844.0
663,2017/05/15,1845.0,1848.561,1877.0,264300,1877.0,1833.0
664,2017/05/16,1832.0,1834.497,1838.0,227700,1844.0,1826.0
665,2017/05/17,1790.0,1792.387,1821.0,244900,1821.0,1783.0
666,2017/05/18,1733.0,1732.947,1718.0,185900,1746.0,1717.0
667,2017/05/19,1723.0,1712.763,1726.0,243400,1728.0,1697.0
668,2017/05/22,1751.0,1739.619,1719.0,243800,1759.0,1718.0
669,2017/05/23,1729.0,1740.075,1750.0,158400,1755.0,1728.0
670,2017/05/24,1746.0,1745.402,1735.0,97800,1760.0,1735.0
671,2017/05/25,1728.0,1733.6,1741.0,113400,1743.0,1721.0
672,2017/05/26,1704.0,1715.145,1693.0,179000,1738.0,1692.0
673,2017/05/29,1702.0,1722.704,1749.0,186700,1762.0,1702.0
674,2017/05/30,1701.0,1693.01,1701.0,125000,1707.0,1678.0
675,2017/05/31,1680.0,1682.355,1688.0,190400,1702.0,1672.0
676,2017/06/01,1682.0,1687.3,1680.0,106800,1701.0,1680.0
677,2017/06/02,1741.0,1730.243,1700.0,181800,1747.0,1697.0
678,2017/06/05,1701.0,1704.422,1731.0,110300,1731.0,1696.0
679,2017/06/06,1680.0,1686.66,1700.0,95800,1703.0,1680.0
680,2017/06/07,1708.0,1707.484,1698.0,115500,1718.0,1693.0
681,2017/06/08,1706.0,1706.496,1708.0,99800,1719.0,1697.0
682,2017/06/09,1714.0,1717.927,1707.0,151100,1730.0,1704.0
683,2017/06/12,1725.0,1731.514,1714.0,100000,1751.0,1714.0
684,2017/06/13,1719.0,1728.528,1730.0,91400,1743.0,1719.0
685,2017/06/14,1717.0,1723.981,1722.0,107600,1739.0,1714.0
686,2017/06/15,1690.0,1703.823,1713.0,106200,1722.0,1690.0
687,2017/06/16,1800.0,1780.273,1712.0,605200,1805.0,1712.0
688,2017/06/19,1822.0,1815.122,1793.0,365500,1836.0,1791.0
689,2017/06/20,1814.0,1822.928,1826.0,135600,1846.0,1814.0
690,2017/06/21,1781.0,1791.563,1821.0,63900,1821.0,1781.0
691,2017/06/22,1751.0,1758.181,1782.0,190900,1791.0,1744.0
692,2017/06/23,1764.0,1762.34,1774.0,134700,1774.0,1755.0
693,2017/06/26,1768.0,1768.123,1763.0,72400,1783.0,1758.0
694,2017/06/27,1807.0,1792.795,1763.0,121000,1808.0,1763.0
695,2017/06/28,1817.0,1826.71,1807.0,143300,1843.0,1807.0
696,2017/06/29,1856.0,1852.824,1840.0,93300,1864.0,1840.0
697,2017/06/30,1861.0,1864.011,1828.0,226500,1884.0,1818.0
698,2017/07/03,1905.0,1897.89,1869.0,163100,1908.0,1869.0
699,2017/07/04,1903.0,1912.37,1919.0,156500,1947.0,1890.0
700,2017/07/05,1929.0,1916.766,1901.0,167200,1933.0,1893.0
701,2017/07/06,1932.0,1925.475,1929.0,123300,1936.0,1906.0
702,2017/07/07,1907.0,1907.155,1905.0,156000,1923.0,1886.0
703,2017/07/10,1935.0,1933.24,1936.0,161000,1958.0,1917.0
704,2017/07/11,1918.0,1922.578,1934.0,108600,1940.0,1910.0
705,2017/07/12,1893.0,1888.455,1903.0,184000,1906.0,1874.0
706,2017/07/13,1878.0,1880.718,1889.0,134900,1894.0,1862.0
707,2017/07/14,1921.0,1911.582,1889.0,115700,1926.0,1887.0
708,2017/07/18,1902.0,1900.879,1920.0,61300,1922.0,1890.0
709,2017/07/19,1885.0,1883.775,1900.0,102200,1907.0,1870.0
710,2017/07/20,1886.0,1880.677,1880.0,63200,1890.0,1869.0
711,2017/07/21,1855.0,1848.685,1874.0,133800,1875.0,1834.0
712,2017/07/24,1858.0,1843.057,1831.0,192600,1858.0,1824.0
713,2017/07/25,1855.0,1850.434,1840.0,60600,1860.0,1838.0
714,2017/07/26,1851.0,1850.311,1860.0,86900,1868.0,1838.0
715,2017/07/27,1846.0,1856.384,1861.0,112800,1867.0,1846.0
716,2017/07/28,1849.0,1840.229,1844.0,174700,1852.0,1826.0
717,2017/07/31,1703.0,1779.525,1853.0,511400,1895.0,1703.0
718,2017/08/01,1712.0,1707.067,1720.0,440700,1740.0,1675.0
719,2017/08/02,1708.0,1709.829,1712.0,187800,1732.0,1693.0
720,2017/08/03,1716.0,1707.494,1710.0,174400,1722.0,1693.0
721,2017/08/04,1709.0,1709.559,1709.0,146600,1720.0,1698.0
722,2017/08/07,1740.0,1736.53,1716.0,141000,1747.0,1716.0
723,2017/08/08,1725.0,1732.765,1740.0,183700,1757.0,1721.0
724,2017/08/09,1707.0,1703.003,1705.0,147900,1719.0,1696.0
725,2017/08/10,1709.0,1719.786,1726.0,184700,1745.0,1706.0
726,2017/08/14,1640.0,1656.525,1676.0,258400,1677.0,1640.0
727,2017/08/15,1639.0,1641.865,1643.0,224700,1658.0,1626.0
728,2017/08/16,1668.0,1658.132,1632.0,201200,1675.0,1623.0
729,2017/08/17,1695.0,1687.363,1673.0,160800,1698.0,1661.0
730,2017/08/18,1675.0,1667.921,1670.0,212700,1679.0,1654.0
731,2017/08/21,1671.0,1669.518,1680.0,175300,1685.0,1658.0
732,2017/08/22,1687.0,1674.034,1668.0,128100,1688.0,1651.0
733,2017/08/23,1666.0,1678.325,1700.0,112200,1704.0,1661.0
734,2017/08/24,1700.0,1692.35,1670.0,245300,1712.0,1659.0
735,2017/08/25,1698.0,1697.637,1704.0,137400,1710.0,1687.0
736,2017/08/28,1625.0,1640.709,1670.0,354800,1685.0,1625.0
737,2017/08/29,1660.0,1657.262,1640.0,249800,1668.0,1638.0
738,2017/08/30,1652.0,1655.973,1648.0,140400,1676.0,1645.0
739,2017/08/31,1683.0,1676.578,1656.0,178800,1690.0,1655.0
740,2017/09/01,1655.0,1646.652,1671.0,225800,1681.0,1636.0
741,2017/09/04,1621.0,1622.618,1629.0,225800,1639.0,1613.0
742,2017/09/05,1617.0,1618.395,1623.0,140600,1632.0,1609.0
743,2017/09/06,1626.0,1612.821,1607.0,125800,1628.0,1594.0
744,2017/09/07,1636.0,1633.379,1633.0,138900,1643.0,1621.0
745,2017/09/08,1622.0,1627.89,1635.0,141400,1639.0,1618.0
746,2017/09/11,1637.0,1644.062,1635.0,122900,1653.0,1628.0
747,2017/09/12,1638.0,1636.952,1642.0,81800,1648.0,1630.0
748,2017/09/13,1633.0,1635.048,1638.0,114100,1649.0,1623.0
749,2017/09/14,1627.0,1627.274,1633.0,100300,1645.0,1621.0
750,2017/09/15,1637.0,1636.347,1624.0,143800,1648.0,1621.0
751,2017/09/19,1679.0,1673.665,1647.0,221400,1687.0,1640.0
752,2017/09/20,1679.0,1685.128,1694.0,100800,1698.0,1678.0
753,2017/09/21,1681.0,1692.782,1695.0,131600,1708.0,1681.0
754,2017/09/22,1692.0,1692.163,1680.0,192000,1702.0,1677.0
755,2017/09/25,1695.0,1709.498,1700.0,151100,1730.0,1695.0
756,2017/09/26,1721.0,1715.307,1690.0,152000,1722.0,1688.0
757,2017/09/27,1748.0,1746.339,1720.0,191800,1758.0,1717.0
758,2017/09/28,1762.0,1761.682,1765.0,174100,1777.0,1753.0
759,2017/09/29,1754.0,1761.239,1762.0,110100,1770.0,1754.0
760,2017/10/02,1768.0,1766.077,1756.0,101100,1773.0,1754.0
761,2017/10/03,1705.0,1704.828,1737.0,397800,1757.0,1687.0
762,2017/10/04,1711.0,1710.768,1720.0,137400,1729.0,1699.0
763,2017/10/05,1724.0,1725.408,1712.0,156300,1750.0,1690.0
764,2017/10/06,1711.0,1713.444,1707.0,70900,1730.0,1705.0
765,2017/10/10,1704.0,1706.444,1707.0,71900,1716.0,1698.0
766,2017/10/11,1695.0,1695.359,1698.0,109400,1708.0,1691.0
767,2017/10/12,1700.0,1699.942,1695.0,118000,1708.0,1689.0
768,2017/10/13,1727.0,1720.15,1711.0,137100,1731.0,1704.0
769,2017/10/16,1775.0,1768.306,1740.0,182900,1783.0,1740.0
770,2017/10/17,1776.0,1772.538,1775.0,191400,1783.0,1757.0
771,2017/10/18,1791.0,1786.604,1769.0,162500,1794.0,1760.0
772,2017/10/19,1800.0,1796.629,1791.0,104300,1802.0,1784.0
773,2017/10/20,1784.0,1790.873,1793.0,101200,1802.0,1782.0
774,2017/10/23,1789.0,1798.129,1804.0,110400,1814.0,1787.0
775,2017/10/24,1804.0,1802.201,1800.0,105900,1810.0,1791.0
776,2017/10/25,1792.0,1797.617,1815.0,167000,1815.0,1788.0
777,2017/10/26,1835.0,1825.746,1810.0,210000,1843.0,1805.0
778,2017/10/27,1878.0,1871.882,1855.0,206100,1884.0,1855.0
779,2017/10/30,1886.0,1887.283,1890.0,176800,1900.0,1877.0
780,2017/10/31,1981.0,1931.255,1900.0,389200,1985.0,1826.0
781,2017/11/01,1865.0,1889.34,1941.0,254800,1959.0,1858.0
782,2017/11/02,1815.0,1818.423,1835.0,233200,1839.0,1803.0
783,2017/11/06,1827.0,1827.766,1824.0,152800,1848.0,1813.0
784,2017/11/07,1881.0,1874.714,1855.0,192300,1887.0,1852.0
785,2017/11/08,1897.0,1886.761,1881.0,132700,1902.0,1871.0
786,2017/11/09,1944.0,1940.069,1930.0,290100,1957.0,1921.0
787,2017/11/10,1910.0,1911.901,1904.0,121200,1929.0,1900.0
788,2017/11/13,1889.0,1893.285,1914.0,80000,1914.0,1884.0
789,2017/11/14,1882.0,1880.574,1880.0,86300,1888.0,1856.0
790,2017/11/15,1810.0,1826.489,1870.0,152900,1877.0,1810.0
791,2017/11/16,1840.0,1830.917,1805.0,158100,1850.0,1803.0
792,2017/11/17,1806.0,1810.324,1837.0,217700,1837.0,1792.0
793,2017/11/20,1820.0,1821.328,1831.0,225900,1839.0,1793.0
794,2017/11/21,1861.0,1847.223,1820.0,136300,1862.0,1820.0
795,2017/11/22,1874.0,1866.457,1875.0,86000,1890.0,1854.0
796,2017/11/24,1887.0,1878.293,1865.0,87800,1893.0,1855.0
797,2017/11/27,1922.0,1911.299,1900.0,109900,1926.0,1891.0
798,2017/11/28,1912.0,1935.348,1920.0,227900,1965.0,1910.0
799,2017/11/29,1959.0,1951.73,1924.0,126000,1960.0,1924.0
800,2017/11/30,2004.0,1997.971,1980.0,188000,2020.0,1969.0
801,2017/12/01,2023.0,2018.902,1996.0,126100,2028.0,1996.0
802,2017/12/04,2044.0,2033.162,2046.0,114600,2047.0,2008.0
803,2017/12/05,2138.0,2161.191,2270.0,528700,2295.0,2080.0
804,2017/12/06,2126.0,2125.608,2104.0,245200,2157.0,2091.0
805,2017/12/07,2114.0,2120.16,2126.0,150000,2141.0,2101.0
806,2017/12/08,2129.0,2098.759,2064.0,138000,2129.0,2064.0
807,2017/12/11,2133.0,2130.711,2124.0,97800,2145.0,2116.0
808,2017/12/12,2163.0,2143.099,2128.0,205200,2164.0,2109.0
809,2017/12/13,2169.0,2174.787,2168.0,124100,2197.0,2161.0
810,2017/12/14,2163.0,2165.501,2164.0,95300,2181.0,2150.0
811,2017/12/15,2061.0,2088.945,2153.0,243700,2154.0,2059.0
812,2017/12/18,2053.0,2060.233,2070.0,219300,2083.0,2028.0
813,2017/12/19,2076.0,2082.465,2072.0,163500,2105.0,2067.0
814,2017/12/20,2076.0,2081.324,2052.0,127300,2100.0,2052.0
815,2017/12/21,2076.0,2075.922,2068.0,111200,2094.0,2056.0
816,2017/12/22,2109.0,2109.839,2075.0,87900,2131.0,2075.0
817,2017/12/25,2105.0,2106.377,2109.0,27600,2128.0,2099.0
818,2017/12/26,2121.0,2119.216,2106.0,60800,2131.0,2106.0
819,2017/12/27,2153.0,2153.736,2147.0,51200,2166.0,2134.0
820,2017/12/28,2142.0,2154.532,2155.0,62600,2173.0,2141.0
821,2017/12/29,2151.0,2153.259,2162.0,64600,2168.0,2138.0
822,2018/01/04,2200.0,2188.372,2158.0,107600,2200.0,2152.0
823,2018/01/05,2206.0,2207.084,2210.0,102500,2228.0,2189.0
824,2018/01/09,2237.0,2238.228,2226.0,124400,2249.0,2213.0
825,2018/01/10,2217.0,2219.265,2237.0,104000,2237.0,2207.0
826,2018/01/11,2213.0,2213.609,2204.0,89900,2227.0,2197.0
827,2018/01/12,2197.0,2205.439,2198.0,108700,2220.0,2191.0
828,2018/01/15,2155.0,2168.857,2211.0,51700,2211.0,2155.0
829,2018/01/16,2157.0,2158.094,2155.0,64700,2182.0,2145.0
830,2018/01/17,2122.0,2128.746,2159.0,66000,2159.0,2116.0
831,2018/01/18,2093.0,2106.065,2143.0,175900,2145.0,2088.0
832,2018/01/19,2098.0,2098.59,2088.0,72100,2115.0,2088.0
833,2018/01/22,2114.0,2099.846,2096.0,73800,2116.0,2076.0
834,2018/01/23,2161.0,2143.059,2117.0,106500,2164.0,2105.0
835,2018/01/24,2176.0,2182.021,2183.0,151400,2204.0,2165.0
836,2018/01/25,2147.0,2159.649,2208.0,89900,2209.0,2143.0
837,2018/01/26,2140.0,2145.44,2146.0,59800,2162.0,2123.0
838,2018/01/29,2123.0,2129.919,2137.0,65600,2148.0,2121.0
839,2018/01/30,2096.0,2106.227,2121.0,173100,2137.0,2089.0
840,2018/01/31,1990.0,2043.139,2092.0,381500,2181.0,1971.0
841,2018/02/01,2145.0,2118.619,2109.0,385800,2168.0,2050.0
842,2018/02/02,2156.0,2161.461,2133.0,130300,2187.0,2133.0
843,2018/02/05,2067.0,2082.616,2106.0,160900,2123.0,2065.0
844,2018/02/06,1979.0,1972.5,1977.0,182300,2009.0,1938.0
845,2018/02/07,2021.0,2048.506,2068.0,140200,2082.0,1984.0
846,2018/02/08,1998.0,2004.365,2020.0,189100,2040.0,1986.0
847,2018/02/09,1955.0,1944.111,1958.0,188600,1958.0,1928.0
848,2018/02/13,1926.0,1943.514,1957.0,142100,1973.0,1921.0
849,2018/02/14,1880.0,1896.937,1926.0,146800,1937.0,1879.0
850,2018/02/15,1913.0,1915.856,1910.0,94000,1931.0,1898.0
851,2018/02/16,1973.0,1958.83,1935.0,99800,1989.0,1921.0
852,2018/02/19,2008.0,1984.516,1973.0,99600,2009.0,1960.0
853,2018/02/20,1974.0,1973.167,1999.0,74700,1999.0,1961.0
854,2018/02/21,1922.0,1934.758,1974.0,138600,1979.0,1916.0
855,2018/02/22,1898.0,1910.635,1928.0,148100,1934.0,1892.0
856,2018/02/23,1860.0,1871.822,1890.0,409500,1904.0,1830.0
857,2018/02/26,1887.0,1893.364,1882.0,134100,1913.0,1879.0
858,2018/02/27,1913.0,1911.324,1908.0,130400,1930.0,1893.0
859,2018/02/28,1715.0,1746.373,1822.0,1103200,1835.0,1707.0
860,2018/03/01,1762.0,1744.087,1716.0,418000,1762.0,1714.0
861,2018/03/02,1711.0,1714.272,1722.0,389000,1737.0,1698.0
862,2018/03/05,1688.0,1683.87,1696.0,146200,1696.0,1675.0
863,2018/03/06,1703.0,1712.243,1720.0,103700,1735.0,1699.0
864,2018/03/07,1720.0,1713.81,1692.0,134500,1730.0,1684.0
865,2018/03/08,1749.0,1746.933,1730.0,191300,1756.0,1730.0
866,2018/03/09,1737.0,1740.34,1758.0,164300,1760.0,1721.0
867,2018/03/12,1770.0,1765.503,1760.0,165500,1774.0,1744.0
868,2018/03/13,1778.0,1771.676,1771.0,97500,1784.0,1758.0
869,2018/03/14,1794.0,1799.282,1782.0,140600,1817.0,1780.0
870,2018/03/15,1779.0,1775.586,1790.0,64200,1794.0,1755.0
871,2018/03/16,1755.0,1758.48,1785.0,97300,1785.0,1750.0
872,2018/03/19,1734.0,1743.903,1755.0,53400,1767.0,1733.0
873,2018/03/20,1771.0,1758.191,1725.0,77900,1773.0,1721.0
874,2018/03/22,1801.0,1782.739,1759.0,130900,1805.0,1754.0
875,2018/03/23,1775.0,1772.671,1761.0,249100,1791.0,1753.0
876,2018/03/26,1802.0,1787.767,1771.0,176300,1804.0,1763.0
877,2018/03/27,1832.0,1814.861,1818.0,154300,1832.0,1784.0
878,2018/03/28,1831.0,1822.64,1788.0,101200,1845.0,1765.0
879,2018/03/29,1796.0,1796.198,1842.0,81400,1842.0,1775.0
880,2018/03/30,1834.0,1826.232,1830.0,84100,1836.0,1802.0
881,2018/04/02,1856.0,1860.411,1857.0,91000,1872.0,1845.0
882,2018/04/03,1859.0,1853.66,1832.0,89100,1876.0,1823.0
883,2018/04/04,1909.0,1903.964,1872.0,156100,1920.0,1864.0
884,2018/04/05,1905.0,1916.251,1916.0,143000,1935.0,1903.0
885,2018/04/06,1872.0,1884.185,1916.0,64800,1916.0,1872.0
886,2018/04/09,1883.0,1879.982,1876.0,68200,1893.0,1864.0
887,2018/04/10,1920.0,1904.655,1883.0,48400,1925.0,1873.0
888,2018/04/11,1940.0,1937.907,1927.0,48300,1949.0,1920.0
889,2018/04/12,1960.0,1951.23,1940.0,46100,1962.0,1922.0
890,2018/04/13,2009.0,2002.153,1970.0,67800,2019.0,1968.0
891,2018/04/16,2024.0,2018.742,2013.0,53100,2034.0,2005.0
892,2018/04/17,2079.0,2080.274,2050.0,260700,2113.0,2046.0
893,2018/04/18,1993.0,2012.131,2025.0,141600,2039.0,1990.0
894,2018/04/19,2041.0,2034.18,2021.0,259100,2059.0,2011.0
895,2018/04/20,2078.0,2068.649,2041.0,145200,2087.0,2038.0
896,2018/04/23,2084.0,2082.794,2070.0,111700,2104.0,2056.0
897,2018/04/24,2053.0,2049.578,2084.0,134200,2084.0,2036.0
898,2018/04/25,2065.0,2063.926,2044.0,169700,2077.0,2036.0
899,2018/04/26,2079.0,2077.469,2065.0,163700,2098.0,2054.0
900,2018/04/27,2281.0,2298.143,2079.0,628300,2460.0,2048.0
901,2018/05/01,2343.0,2339.732,2281.0,389700,2425.0,2245.0
902,2018/05/02,2272.0,2294.324,2349.0,232600,2349.0,2259.0
903,2018/05/07,2248.0,2252.356,2255.0,92400,2295.0,2239.0
904,2018/05/08,2224.0,2234.777,2239.0,120800,2262.0,2212.0
905,2018/05/09,2180.0,2181.181,2202.0,81300,2219.0,2166.0
906,2018/05/10,2185.0,2187.641,2200.0,67400,2206.0,2176.0
907,2018/05/11,2213.0,2196.465,2193.0,192900,2215.0,2173.0
908,2018/05/14,2232.0,2211.317,2219.0,171700,2247.0,2181.0
909,2018/05/15,2242.0,2241.974,2234.0,115800,2261.0,2228.0
910,2018/05/16,2274.0,2257.936,2243.0,99200,2280.0,2218.0
911,2018/05/17,2311.0,2291.477,2290.0,118000,2312.0,2256.0
912,2018/05/18,2296.0,2304.182,2332.0,69700,2335.0,2286.0
913,2018/05/21,2318.0,2303.366,2299.0,85500,2326.0,2268.0
914,2018/05/22,2253.0,2265.523,2316.0,106100,2322.0,2245.0
915,2018/05/23,2312.0,2299.163,2246.0,178800,2324.0,2229.0
916,2018/05/24,2239.0,2250.883,2262.0,103000,2284.0,2233.0
917,2018/05/25,2166.0,2180.964,2218.0,126400,2218.0,2165.0
918,2018/05/28,2170.0,2154.816,2159.0,140900,2172.0,2128.0
919,2018/05/29,2111.0,2115.437,2167.0,87800,2167.0,2101.0
920,2018/05/30,2068.0,2064.923,2074.0,79000,2076.0,2053.0
921,2018/05/31,2079.0,2072.41,2083.0,215900,2109.0,2049.0
922,2018/06/01,2083.0,2078.372,2072.0,219900,2107.0,2054.0
923,2018/06/04,2121.0,2103.022,2114.0,174100,2134.0,2076.0
924,2018/06/05,2136.0,2114.585,2115.0,157200,2136.0,2080.0
925,2018/06/06,2105.0,2105.888,2131.0,96100,2136.0,2091.0
926,2018/06/07,2146.0,2142.08,2143.0,133400,2173.0,2125.0
927,2018/06/08,2112.0,2119.555,2137.0,109800,2152.0,2099.0
928,2018/06/11,2205.0,2204.411,2229.0,306200,2239.0,2176.0
929,2018/06/12,2283.0,2272.845,2231.0,215300,2300.0,2231.0
930,2018/06/13,2306.0,2300.463,2283.0,97600,2317.0,2278.0
931,2018/06/14,2286.0,2302.62,2302.0,122100,2343.0,2283.0
932,2018/06/15,2259.0,2262.188,2287.0,74600,2300.0,2245.0
933,2018/06/18,2246.0,2240.414,2260.0,64700,2265.0,2215.0
934,2018/06/19,2192.0,2211.023,2250.0,59800,2254.0,2190.0
935,2018/06/20,2176.0,2156.012,2179.0,89700,2179.0,2120.0
936,2018/06/21,2123.0,2137.543,2170.0,59700,2178.0,2120.0
937,2018/06/22,2169.0,2157.349,2112.0,202200,2184.0,2105.0
938,2018/06/25,2132.0,2139.708,2168.0,92200,2168.0,2123.0
939,2018/06/26,2165.0,2155.746,2167.0,88600,2193.0,2128.0
940,2018/06/27,2130.0,2135.379,2150.0,40900,2153.0,2119.0
941,2018/06/28,2120.0,2114.86,2125.0,56400,2130.0,2091.0
942,2018/06/29,2096.0,2091.741,2119.0,73700,2119.0,2069.0
943,2018/07/02,2046.0,2068.296,2094.0,113700,2115.0,2044.0
944,2018/07/03,2007.0,2007.444,2047.0,97200,2047.0,1992.0
945,2018/07/04,1977.0,1989.28,1983.0,117400,2017.0,1968.0
946,2018/07/05,1921.0,1934.904,1971.0,67400,1971.0,1915.0
947,2018/07/06,1933.0,1932.616,1934.0,65900,1946.0,1921.0
948,2018/07/09,1974.0,1957.287,1940.0,59300,1978.0,1931.0
949,2018/07/10,1950.0,1965.563,1969.0,67100,1984.0,1950.0
950,2018/07/11,1927.0,1924.76,1941.0,74900,1949.0,1907.0
951,2018/07/12,1915.0,1924.974,1950.0,53700,1967.0,1913.0
952,2018/07/13,1945.0,1942.665,1955.0,78900,2000.0,1918.0
953,2018/07/17,1977.0,1971.597,1969.0,85900,1997.0,1935.0
954,2018/07/18,2003.0,2002.516,1999.0,81200,2035.0,1978.0
955,2018/07/19,1996.0,2003.798,2016.0,71200,2020.0,1991.0
956,2018/07/20,1980.0,1983.766,2006.0,79000,2006.0,1970.0
957,2018/07/23,1927.0,1940.253,1958.0,99000,1960.0,1924.0
958,2018/07/24,1962.0,1954.54,1945.0,57000,1962.0,1942.0
959,2018/07/25,2012.0,2006.677,1979.0,47300,2020.0,1979.0
960,2018/07/26,2038.0,2033.728,2047.0,43400,2051.0,2019.0
961,2018/07/27,2089.0,2081.351,2059.0,85200,2096.0,2037.0
962,2018/07/30,2116.0,2116.144,2105.0,98500,2132.0,2098.0
963,2018/07/31,2184.0,2167.001,2066.0,264500,2300.0,2043.0
964,2018/08/01,2257.0,2223.112,2174.0,190100,2274.0,2130.0
965,2018/08/02,2178.0,2192.928,2231.0,87100,2231.0,2177.0
966,2018/08/03,2167.0,2163.382,2178.0,49800,2180.0,2145.0
967,2018/08/06,2184.0,2185.062,2150.0,48200,2199.0,2150.0
968,2018/08/07,2172.0,2169.113,2153.0,47900,2188.0,2153.0
969,2018/08/08,2114.0,2133.17,2151.0,111800,2164.0,2106.0
970,2018/08/09,2101.0,2101.034,2114.0,61400,2126.0,2088.0
971,2018/08/10,2056.0,2056.702,2092.0,81500,2099.0,2042.0
972,2018/08/13,2031.0,2019.314,2030.0,73800,2037.0,2000.0
973,2018/08/14,2017.0,2017.728,2031.0,61800,2034.0,2006.0
974,2018/08/15,1959.0,1974.359,2000.0,58000,2006.0,1958.0
975,2018/08/16,2015.0,1990.427,1917.0,136700,2018.0,1908.0
976,2018/08/17,2062.0,2047.992,2016.0,73700,2066.0,2002.0
977,2018/08/20,2114.0,2102.902,2062.0,95200,2126.0,2062.0
978,2018/08/21,2121.0,2115.459,2108.0,66500,2133.0,2089.0
979,2018/08/22,2176.0,2175.565,2118.0,91900,2196.0,2118.0
980,2018/08/23,2136.0,2154.797,2174.0,62600,2196.0,2134.0
981,2018/08/24,2090.0,2091.867,2136.0,57000,2137.0,2076.0
982,2018/08/27,2066.0,2075.185,2079.0,86600,2097.0,2063.0
983,2018/08/28,2031.0,2041.177,2071.0,108800,2074.0,2026.0
984,2018/08/29,2032.0,2035.046,2038.0,67000,2048.0,2023.0
985,2018/08/30,2073.0,2077.976,2058.0,78600,2093.0,2056.0
986,2018/08/31,2035.0,2036.046,2032.0,90700,2062.0,2023.0
987,2018/09/03,1976.0,1985.198,2021.0,72400,2021.0,1966.0
988,2018/09/04,1952.0,1950.722,1976.0,99800,1976.0,1932.0
989,2018/09/05,1942.0,1944.668,1952.0,63600,1957.0,1938.0
990,2018/09/06,1957.0,1953.94,1930.0,61400,1969.0,1928.0
991,2018/09/07,1966.0,1953.241,1936.0,51800,1968.0,1929.0
992,2018/09/10,1951.0,1957.063,1971.0,86000,1984.0,1939.0
993,2018/09/11,1937.0,1931.588,1956.0,70800,1956.0,1911.0
994,2018/09/12,1918.0,1916.775,1935.0,51900,1945.0,1907.0
995,2018/09/13,1940.0,1937.721,1919.0,56600,1957.0,1913.0
996,2018/09/14,1991.0,1989.148,1980.0,105800,2011.0,1977.0
997,2018/09/18,2066.0,2052.644,2005.0,64400,2076.0,2005.0
998,2018/09/19,2128.0,2117.05,2100.0,58400,2133.0,2084.0
999,2018/09/20,2121.0,2124.595,2141.0,42700,2142.0,2103.0
1000,2018/09/21,2200.0,2191.041,2147.0,83800,2210.0,2147.0
1001,2018/09/25,2220.0,2215.422,2236.0,76000,2238.0,2196.0
1002,2018/09/26,2239.0,2227.275,2210.0,50200,2242.0,2179.0
1003,2018/09/27,2202.0,2218.476,2239.0,61200,2252.0,2200.0
1004,2018/09/28,2216.0,2225.495,2200.0,96200,2254.0,2196.0
1005,2018/10/01,2245.0,2244.763,2226.0,50100,2267.0,2212.0
1006,2018/10/02,2262.0,2263.574,2270.0,50500,2276.0,2247.0
1007,2018/10/03,2230.0,2243.094,2264.0,50200,2269.0,2230.0
1008,2018/10/04,2247.0,2255.57,2251.0,55100,2274.0,2241.0
1009,2018/10/05,2246.0,2255.937,2226.0,70100,2278.0,2222.0
1010,2018/10/09,2156.0,2169.209,2240.0,53000,2241.0,2149.0
1011,2018/10/10,2149.0,2144.148,2153.0,39800,2164.0,2118.0
1012,2018/10/11,2088.0,2093.495,2099.0,55600,2124.0,2076.0
1013,2018/10/12,2080.0,2078.84,2088.0,54200,2094.0,2054.0
1014,2018/10/15,2091.0,2087.371,2080.0,63400,2110.0,2056.0
1015,2018/10/16,2072.0,2069.82,2080.0,74000,2094.0,2052.0
1016,2018/10/17,2061.0,2071.839,2115.0,47100,2129.0,2054.0
1017,2018/10/18,2014.0,2024.303,2062.0,52800,2075.0,2006.0
1018,2018/10/19,2050.0,2034.019,2000.0,56700,2058.0,1985.0
1019,2018/10/22,2028.0,2027.047,2030.0,40900,2045.0,2002.0
1020,2018/10/23,1967.0,1969.215,2003.0,76300,2003.0,1953.0
1021,2018/10/24,1973.0,1974.037,1967.0,61700,2008.0,1956.0
1022,2018/10/25,1909.0,1915.445,1944.0,82900,1944.0,1895.0
1023,2018/10/26,1893.0,1896.441,1923.0,49900,1926.0,1876.0
1024,2018/10/29,1875.0,1889.682,1900.0,79300,1926.0,1870.0
1025,2018/10/30,1893.0,1879.357,1848.0,84600,1899.0,1838.0
1026,2018/10/31,2048.0,2004.21,1884.0,167900,2055.0,1884.0
1027,2018/11/01,2242.0,2162.527,1918.0,217100,2245.0,1918.0
1028,2018/11/02,2310.0,2305.45,2247.0,156300,2342.0,2237.0
1029,2018/11/05,2278.0,2311.636,2305.0,84900,2348.0,2277.0
1030,2018/11/06,2293.0,2310.786,2330.0,109900,2355.0,2275.0
1031,2018/11/07,2365.0,2364.476,2343.0,132300,2387.0,2318.0
1032,2018/11/08,2462.0,2455.216,2402.0,121100,2472.0,2402.0
1033,2018/11/09,2451.0,2473.224,2464.0,82300,2510.0,2443.0
1034,2018/11/12,2354.0,2376.471,2406.0,126500,2426.0,2345.0
1035,2018/11/13,2295.0,2296.297,2296.0,97400,2314.0,2279.0
1036,2018/11/14,2245.0,2261.345,2298.0,81800,2318.0,2243.0
1037,2018/11/15,2269.0,2248.685,2244.0,99600,2306.0,2210.0
1038,2018/11/16,2246.0,2242.478,2266.0,109400,2292.0,2213.0
1039,2018/11/19,2334.0,2334.151,2296.0,114200,2404.0,2293.0
1040,2018/11/20,2401.0,2388.182,2334.0,149300,2427.0,2325.0
1041,2018/11/21,2337.0,2341.367,2351.0,75300,2371.0,2311.0
1042,2018/11/22,2322.0,2321.212,2346.0,82100,2366.0,2295.0
1043,2018/11/26,2269.0,2278.339,2287.0,97600,2296.0,2263.0
1044,2018/11/27,2218.0,2216.908,2264.0,91200,2268.0,2192.0
1045,2018/11/28,2221.0,2223.736,2238.0,106900,2251.0,2197.0
1046,2018/11/29,2215.0,2200.174,2225.0,106700,2257.0,2167.0
1047,2018/11/30,2200.0,2213.532,2232.0,110500,2255.0,2192.0
1048,2018/12/03,2225.0,2189.854,2200.0,140100,2236.0,2145.0
1049,2018/12/04,2132.0,2144.87,2183.0,123900,2200.0,2117.0
1050,2018/12/05,2087.0,2072.818,2113.0,163100,2121.0,2041.0
1051,2018/12/06,2041.0,2012.728,2056.0,136200,2066.0,1960.0
1052,2018/12/07,1990.0,1975.022,2000.0,205100,2025.0,1934.0
1053,2018/12/10,1956.0,1970.356,1950.0,112300,2001.0,1940.0
1054,2018/12/11,1914.0,1909.952,1969.0,132300,1970.0,1880.0
1055,2018/12/12,1892.0,1891.071,1912.0,147100,1918.0,1873.0
1056,2018/12/13,1923.0,1898.463,1891.0,232100,1928.0,1869.0
1057,2018/12/14,1857.0,1862.997,1885.0,199600,1890.0,1832.0
1058,2018/12/17,1817.0,1818.75,1839.0,155400,1841.0,1804.0
1059,2018/12/18,1726.0,1733.863,1789.0,194400,1789.0,1709.0
1060,2018/12/19,1720.0,1715.919,1715.0,119600,1728.0,1690.0
1061,2018/12/20,1666.0,1685.535,1728.0,106600,1736.0,1661.0
1062,2018/12/21,1601.0,1611.429,1639.0,109800,1644.0,1595.0
1063,2018/12/25,1481.0,1496.768,1521.0,119000,1532.0,1473.0
1064,2018/12/26,1528.0,1537.047,1513.0,156800,1577.0,1513.0
1065,2018/12/27,1629.0,1618.14,1628.0,198000,1645.0,1583.0
1066,2018/12/28,1660.0,1658.46,1610.0,137900,1683.0,1610.0
1067,2019/01/04,1615.0,1602.401,1611.0,130400,1622.0,1574.0
1068,2019/01/07,1681.0,1692.858,1695.0,90900,1709.0,1678.0
1069,2019/01/08,1633.0,1651.773,1683.0,114200,1700.0,1625.0
1070,2019/01/09,1707.0,1700.467,1683.0,131500,1718.0,1682.0
1071,2019/01/10,1720.0,1714.596,1701.0,76300,1736.0,1683.0
1072,2019/01/11,1769.0,1790.785,1800.0,215400,1835.0,1766.0
1073,2019/01/15,1783.0,1773.733,1732.0,150000,1796.0,1719.0
1074,2019/01/16,1740.0,1744.48,1747.0,111100,1756.0,1731.0
1075,2019/01/17,1738.0,1732.087,1750.0,156900,1761.0,1710.0
1076,2019/01/18,1752.0,1750.315,1737.0,84800,1764.0,1729.0
1077,2019/01/21,1788.0,1782.993,1771.0,98400,1802.0,1763.0
1078,2019/01/22,1770.0,1788.677,1808.0,90600,1823.0,1766.0
1079,2019/01/23,1761.0,1805.577,1780.0,306400,1854.0,1754.0
1080,2019/01/24,1801.0,1779.692,1747.0,110700,1806.0,1729.0
1081,2019/01/25,1807.0,1808.473,1800.0,77200,1836.0,1783.0
1082,2019/01/28,1781.0,1784.164,1807.0,81500,1818.0,1770.0
1083,2019/01/29,1747.0,1746.389,1770.0,64500,1770.0,1725.0
1084,2019/01/30,1683.0,1704.371,1747.0,107100,1768.0,1682.0
1085,2019/01/31,1776.0,1754.555,1723.0,285800,1820.0,1711.0
1086,2019/02/01,1652.0,1669.782,1807.0,332400,1810.0,1618.0
1087,2019/02/04,1703.0,1700.168,1670.0,137400,1725.0,1660.0
1088,2019/02/05,1667.0,1679.01,1718.0,77800,1719.0,1662.0
1089,2019/02/06,1634.0,1640.014,1670.0,125700,1673.0,1625.0
1090,2019/02/07,1603.0,1605.745,1628.0,119400,1633.0,1591.0
1091,2019/02/08,1591.0,1596.38,1597.0,118500,1624.0,1581.0
1092,2019/02/12,1624.0,1626.402,1591.0,78100,1645.0,1591.0
1093,2019/02/13,1634.0,1629.737,1627.0,59300,1640.0,1614.0
1094,2019/02/14,1640.0,1645.216,1639.0,46300,1662.0,1637.0
1095,2019/02/15,1662.0,1649.095,1641.0,56600,1662.0,1622.0
1096,2019/02/18,1661.0,1664.344,1697.0,78400,1708.0,1648.0
1097,2019/02/19,1704.0,1696.505,1680.0,68500,1708.0,1671.0
1098,2019/02/20,1716.0,1719.43,1720.0,52100,1732.0,1705.0
1099,2019/02/21,1756.0,1747.89,1729.0,102100,1766.0,1726.0
1100,2019/02/22,1750.0,1741.188,1750.0,48500,1750.0,1725.0
1101,2019/02/25,1758.0,1754.84,1757.0,49300,1768.0,1733.0
1102,2019/02/26,1731.0,1733.882,1767.0,70100,1767.0,1720.0
1103,2019/02/27,1725.0,1731.283,1735.0,53100,1759.0,1719.0
1104,2019/02/28,1718.0,1719.426,1733.0,55700,1733.0,1709.0
1105,2019/03/01,1707.0,1702.827,1706.0,80700,1716.0,1692.0
1106,2019/03/04,1704.0,1709.371,1732.0,36400,1736.0,1700.0
1107,2019/03/05,1722.0,1714.11,1699.0,57300,1728.0,1693.0
1108,2019/03/06,1703.0,1711.711,1730.0,44000,1731.0,1703.0
1109,2019/03/07,1671.0,1668.926,1693.0,59200,1693.0,1655.0
1110,2019/03/08,1645.0,1640.144,1644.0,76300,1655.0,1629.0
1111,2019/03/11,1646.0,1634.548,1645.0,57700,1653.0,1619.0
1112,2019/03/12,1655.0,1663.878,1664.0,68200,1679.0,1651.0
1113,2019/03/13,1651.0,1647.116,1644.0,60200,1663.0,1628.0
1114,2019/03/14,1624.0,1627.994,1669.0,89800,1677.0,1605.0
1115,2019/03/15,1614.0,1621.32,1625.0,125600,1646.0,1609.0
1116,2019/03/18,1642.0,1623.9,1634.0,117400,1642.0,1597.0
1117,2019/03/19,1629.0,1636.211,1647.0,61700,1652.0,1625.0
1118,2019/03/20,1635.0,1629.579,1629.0,48200,1637.0,1621.0
1119,2019/03/22,1628.0,1611.575,1629.0,202900,1635.0,1585.0
1120,2019/03/25,1593.0,1583.475,1592.0,126500,1600.0,1550.0
1121,2019/03/26,1650.0,1637.465,1612.0,222800,1652.0,1612.0
1122,2019/03/27,1634.0,1621.288,1612.0,91000,1635.0,1602.0
1123,2019/03/28,1591.0,1594.999,1611.0,105600,1614.0,1585.0
1124,2019/03/29,1578.0,1579.989,1608.0,64100,1611.0,1570.0
1125,2019/04/01,1628.0,1630.733,1598.0,125500,1648.0,1593.0
1126,2019/04/02,1664.0,1664.026,1660.0,96200,1674.0,1641.0
1127,2019/04/03,1693.0,1678.981,1665.0,78600,1693.0,1635.0
1128,2019/04/04,1662.0,1664.519,1683.0,93300,1686.0,1647.0
1129,2019/04/05,1680.0,1687.926,1680.0,98800,1706.0,1670.0
1130,2019/04/08,1679.0,1683.075,1700.0,48200,1705.0,1669.0
1131,2019/04/09,1687.0,1670.183,1662.0,98400,1689.0,1643.0
1132,2019/04/10,1684.0,1692.16,1676.0,114900,1707.0,1676.0
1133,2019/04/11,1649.0,1650.543,1683.0,48100,1683.0,1643.0
1134,2019/04/12,1673.0,1670.391,1666.0,59900,1677.0,1654.0
1135,2019/04/15,1710.0,1707.823,1687.0,69100,1719.0,1687.0
1136,2019/04/16,1684.0,1688.565,1710.0,57200,1711.0,1674.0
1137,2019/04/17,1716.0,1718.61,1693.0,84500,1728.0,1690.0
1138,2019/04/18,1695.0,1699.952,1710.0,52000,1716.0,1689.0
1139,2019/04/19,1702.0,1701.338,1699.0,33400,1714.0,1688.0
1140,2019/04/22,1700.0,1704.679,1699.0,29300,1719.0,1688.0
1141,2019/04/23,1697.0,1701.513,1694.0,67700,1727.0,1687.0
1142,2019/04/24,1712.0,1712.779,1723.0,63200,1729.0,1697.0
1143,2019/04/25,1718.0,1713.212,1708.0,53800,1724.0,1691.0
1144,2019/04/26,1843.0,1792.184,1742.0,275100,1873.0,1714.0
1145,2019/05/07,1891.0,1927.748,1858.0,214700,1986.0,1854.0
1146,2019/05/08,1909.0,1906.59,1879.0,140000,1939.0,1855.0
1147,2019/05/09,1822.0,1837.284,1878.0,147700,1892.0,1808.0
1148,2019/05/10,1788.0,1796.482,1828.0,53300,1830.0,1778.0
1149,2019/05/13,1745.0,1764.26,1781.0,73800,1795.0,1744.0
1150,2019/05/14,1743.0,1731.311,1708.0,52100,1750.0,1693.0
1151,2019/05/15,1750.0,1736.219,1741.0,62100,1753.0,1711.0
1152,2019/05/16,1696.0,1704.868,1748.0,64400,1756.0,1696.0
1153,2019/05/17,1737.0,1735.962,1730.0,49300,1754.0,1708.0
1154,2019/05/20,1725.0,1727.013,1757.0,39200,1772.0,1710.0
1155,2019/05/21,1818.0,1798.779,1805.0,117200,1820.0,1763.0
1156,2019/05/22,1879.0,1885.387,1830.0,164200,1929.0,1830.0
1157,2019/05/23,1860.0,1857.527,1868.0,52200,1869.0,1846.0
1158,2019/05/24,1875.0,1871.149,1900.0,115800,1905.0,1824.0
1159,2019/05/27,1852.0,1862.258,1895.0,65800,1900.0,1849.0
1160,2019/05/28,1869.0,1867.378,1872.0,59000,1886.0,1850.0
1161,2019/05/29,1849.0,1847.437,1866.0,44900,1868.0,1829.0
1162,2019/05/30,1846.0,1837.781,1826.0,27900,1849.0,1826.0
1163,2019/05/31,1798.0,1800.401,1824.0,90100,1826.0,1778.0
1164,2019/06/03,1754.0,1753.258,1765.0,53200,1778.0,1740.0
1165,2019/06/04,1799.0,1781.576,1762.0,47600,1800.0,1742.0
1166,2019/06/05,1851.0,1828.972,1837.0,57800,1853.0,1806.0
1167,2019/06/06,1811.0,1821.343,1845.0,50500,1845.0,1811.0
1168,2019/06/07,1784.0,1782.585,1804.0,66700,1804.0,1771.0
1169,2019/06/10,1847.0,1837.005,1819.0,61400,1854.0,1809.0
1170,2019/06/11,1804.0,1808.811,1830.0,119300,1830.0,1796.0
1171,2019/06/12,1829.0,1834.045,1822.0,80900,1858.0,1801.0
1172,2019/06/13,1830.0,1827.907,1811.0,61100,1850.0,1803.0
1173,2019/06/14,1801.0,1806.746,1819.0,73500,1821.0,1791.0
1174,2019/06/17,1796.0,1790.274,1786.0,57400,1804.0,1770.0
1175,2019/06/18,1778.0,1782.639,1796.0,56800,1807.0,1761.0
1176,2019/06/19,1829.0,1826.497,1805.0,86500,1841.0,1803.0
1177,2019/06/20,1830.0,1831.842,1830.0,43000,1850.0,1812.0
1178,2019/06/21,1868.0,1871.656,1849.0,233100,1893.0,1838.0
1179,2019/06/24,1854.0,1865.769,1903.0,78200,1910.0,1848.0
1180,2019/06/25,1843.0,1854.996,1850.0,69100,1876.0,1839.0
1181,2019/06/26,1881.0,1882.472,1878.0,100100,1899.0,1870.0
1182,2019/06/27,1919.0,1907.668,1891.0,56900,1919.0,1875.0
1183,2019/06/28,1904.0,1921.309,1940.0,143800,1959.0,1880.0
1184,2019/07/01,1899.0,1916.884,1933.0,125400,1948.0,1895.0
1185,2019/07/02,1913.0,1907.132,1902.0,111500,1920.0,1891.0
1186,2019/07/03,1912.0,1905.916,1904.0,85300,1925.0,1883.0
1187,2019/07/04,1926.0,1927.065,1926.0,80600,1937.0,1913.0
1188,2019/07/05,1917.0,1918.431,1927.0,50800,1929.0,1910.0
1189,2019/07/08,1886.0,1895.821,1917.0,70000,1917.0,1884.0
1190,2019/07/09,1886.0,1880.302,1887.0,58000,1887.0,1870.0
1191,2019/07/10,1864.0,1864.758,1872.0,45800,1872.0,1856.0
1192,2019/07/11,1880.0,1882.287,1869.0,38000,1891.0,1869.0
1193,2019/07/12,1909.0,1909.797,1893.0,56500,1920.0,1891.0
1194,2019/07/16,1894.0,1891.932,1900.0,39800,1905.0,1880.0
1195,2019/07/17,1870.0,1871.669,1885.0,43200,1890.0,1862.0
1196,2019/07/18,1804.0,1832.671,1859.0,85700,1867.0,1802.0
1197,2019/07/19,1844.0,1833.977,1811.0,74100,1851.0,1796.0
1198,2019/07/22,1816.0,1822.871,1847.0,59800,1847.0,1808.0
1199,2019/07/23,1836.0,1835.999,1814.0,73100,1849.0,1810.0
1200,2019/07/24,1816.0,1812.252,1836.0,85300,1837.0,1800.0
1201,2019/07/25,1806.0,1806.409,1813.0,53500,1819.0,1799.0
1202,2019/07/26,1789.0,1791.941,1834.0,94500,1837.0,1767.0
1203,2019/07/29,1773.0,1767.998,1773.0,55800,1779.0,1756.0
1204,2019/07/30,1786.0,1787.095,1773.0,50400,1803.0,1771.0
1205,2019/07/31,1851.0,1850.329,1786.0,297900,1915.0,1750.0
1206,2019/08/01,1951.0,1923.209,1891.0,248800,1955.0,1874.0
1207,2019/08/02,1835.0,1859.866,1898.0,230500,1916.0,1819.0
1208,2019/08/05,1781.0,1799.68,1812.0,116700,1848.0,1776.0
1209,2019/08/06,1735.0,1739.459,1716.0,100300,1765.0,1705.0
1210,2019/08/07,1727.0,1724.499,1741.0,77400,1741.0,1710.0
1211,2019/08/08,1738.0,1745.548,1718.0,120200,1766.0,1715.0
1212,2019/08/09,1784.0,1776.934,1763.0,60300,1788.0,1750.0
1213,2019/08/13,1747.0,1744.8,1749.0,82900,1756.0,1733.0
1214,2019/08/14,1844.0,1814.938,1784.0,181800,1846.0,1754.0
1215,2019/08/15,1802.0,1805.474,1807.0,110900,1827.0,1774.0
1216,2019/08/16,1791.0,1795.066,1785.0,85800,1812.0,1779.0
1217,2019/08/19,1802.0,1792.893,1806.0,54400,1806.0,1770.0
1218,2019/08/20,1828.0,1823.585,1809.0,47900,1837.0,1805.0
1219,2019/08/21,1779.0,1792.473,1812.0,69300,1814.0,1778.0
1220,2019/08/22,1740.0,1745.554,1778.0,87300,1778.0,1735.0
1221,2019/08/23,1743.0,1730.635,1736.0,87500,1747.0,1711.0
