,Date,Close,VWAP,Open,Volume,High,Low
0,2014/08/25,793.0,795.916,770.0,788100,805.0,760.0
1,2014/08/26,776.0,780.551,790.0,364900,791.0,771.0
2,2014/08/27,787.0,780.578,775.0,323900,789.0,770.0
3,2014/08/28,810.0,825.805,788.0,1587900,858.0,782.0
4,2014/08/29,825.0,814.319,804.0,548000,833.0,794.0
5,2014/09/01,891.0,872.72,855.0,1933000,895.0,846.0
6,2014/09/02,881.0,886.863,893.0,1043600,905.0,872.0
7,2014/09/03,876.0,925.197,925.0,3048700,990.0,871.0
8,2014/09/04,888.0,897.401,864.0,1413600,930.0,862.0
9,2014/09/05,874.0,874.14,880.0,852100,909.0,859.0
10,2014/09/08,925.0,913.63,900.0,1261800,929.0,885.0
11,2014/09/09,904.0,915.311,930.0,750400,945.0,898.0
12,2014/09/10,894.0,891.077,897.0,664600,913.0,874.0
13,2014/09/11,886.0,886.765,904.0,412400,905.0,878.0
14,2014/09/12,885.0,902.52,900.0,723900,928.0,880.0
15,2014/09/16,886.0,889.4,885.0,425500,910.0,878.0
16,2014/09/17,862.0,868.744,881.0,455600,891.0,859.0
17,2014/09/18,882.0,874.789,873.0,334100,884.0,861.0
18,2014/09/19,878.0,880.812,894.0,325000,897.0,874.0
19,2014/09/22,885.0,873.574,876.0,341200,888.0,859.0
20,2014/09/24,868.0,868.453,884.0,335700,884.0,863.0
21,2014/09/25,906.0,892.247,872.0,930900,908.0,868.0
22,2014/09/26,910.0,907.466,896.0,516900,924.0,886.0
23,2014/09/29,930.0,922.481,921.0,509700,931.0,911.0
24,2014/09/30,918.0,934.626,929.0,977400,970.0,895.0
25,2014/10/01,869.0,886.113,918.0,688400,919.0,866.0
26,2014/10/02,816.0,830.402,837.0,788400,849.0,815.0
27,2014/10/03,853.0,842.861,825.0,511300,860.0,825.0
28,2014/10/06,882.0,876.629,875.0,437900,888.0,853.0
29,2014/10/07,865.0,869.932,880.0,319200,885.0,862.0
30,2014/10/08,846.0,837.605,830.0,251100,853.0,828.0
31,2014/10/09,786.0,807.379,834.0,624100,844.0,781.0
32,2014/10/10,759.0,756.198,751.0,555600,780.0,740.0
33,2014/10/14,715.0,717.113,714.0,724600,735.0,691.0
34,2014/10/15,740.0,737.602,727.0,388200,750.0,725.0
35,2014/10/16,716.0,719.807,724.0,376900,734.0,699.0
36,2014/10/17,744.0,744.865,730.0,463900,766.0,725.0
37,2014/10/20,798.0,792.04,770.0,470700,810.0,770.0
38,2014/10/21,772.0,780.926,792.0,333100,798.0,762.0
39,2014/10/22,811.0,804.116,793.0,245400,814.0,793.0
40,2014/10/23,806.0,804.973,800.0,232700,818.0,791.0
41,2014/10/24,787.0,797.302,825.0,320600,826.0,775.0
42,2014/10/27,791.0,794.448,798.0,139900,804.0,786.0
43,2014/10/28,789.0,778.415,780.0,208900,791.0,769.0
44,2014/10/29,827.0,820.889,784.0,714400,850.0,784.0
45,2014/10/30,823.0,822.407,827.0,290300,833.0,812.0
46,2014/10/31,839.0,835.379,832.0,434500,848.0,820.0
47,2014/11/04,847.0,853.23,860.0,465700,866.0,835.0
48,2014/11/05,864.0,855.724,846.0,363400,867.0,842.0
49,2014/11/06,865.0,872.134,873.0,371100,888.0,852.0
50,2014/11/07,862.0,869.539,879.0,302100,885.0,858.0
51,2014/11/10,934.0,912.477,877.0,1539300,942.0,874.0
52,2014/11/11,931.0,933.144,945.0,647200,957.0,915.0
53,2014/11/12,875.0,895.959,930.0,825100,930.0,871.0
54,2014/11/13,873.0,876.949,885.0,318800,889.0,852.0
55,2014/11/14,885.0,878.152,875.0,280000,894.0,865.0
56,2014/11/17,867.0,875.301,890.0,286100,892.0,861.0
57,2014/11/18,890.0,888.191,871.0,357600,897.0,869.0
58,2014/11/19,870.0,875.381,887.0,457600,892.0,867.0
59,2014/11/20,858.0,867.84,882.0,171300,883.0,857.0
60,2014/11/21,880.0,873.413,860.0,348800,883.0,857.0
61,2014/11/25,878.0,882.9,883.0,305500,890.0,869.0
62,2014/11/26,854.0,858.225,868.0,441500,870.0,848.0
63,2014/11/27,824.0,837.04,846.0,554900,854.0,819.0
64,2014/11/28,841.0,831.314,820.0,239100,841.0,816.0
65,2014/12/01,809.0,820.481,844.0,611400,844.0,805.0
66,2014/12/02,800.0,800.724,805.0,502400,815.0,785.0
67,2014/12/03,795.0,797.434,806.0,327600,808.0,789.0
68,2014/12/04,799.0,796.114,796.0,358300,802.0,788.0
69,2014/12/05,790.0,792.174,797.0,263300,800.0,788.0
70,2014/12/08,834.0,821.29,803.0,483200,842.0,803.0
71,2014/12/09,816.0,823.181,824.0,353300,836.0,814.0
72,2014/12/10,819.0,815.449,806.0,236200,825.0,802.0
73,2014/12/11,817.0,806.657,803.0,279000,828.0,794.0
74,2014/12/12,828.0,829.899,816.0,315300,839.0,816.0
75,2014/12/15,802.0,814.94,825.0,225500,826.0,800.0
76,2014/12/16,761.0,774.517,795.0,388200,799.0,760.0
77,2014/12/17,763.0,760.85,755.0,356100,769.0,752.0
78,2014/12/18,773.0,779.791,782.0,309400,788.0,772.0
79,2014/12/19,760.0,769.63,783.0,363000,787.0,754.0
80,2014/12/22,757.0,754.029,775.0,247700,776.0,741.0
81,2014/12/24,752.0,752.195,766.0,290900,768.0,745.0
82,2014/12/25,743.0,744.618,743.0,377500,755.0,734.0
83,2014/12/26,791.0,775.085,740.0,349000,793.0,740.0
84,2014/12/29,825.0,816.592,802.0,491000,829.0,800.0
85,2014/12/30,840.0,831.643,829.0,397200,845.0,814.0
86,2015/01/05,861.0,855.863,840.0,477800,866.0,833.0
87,2015/01/06,823.0,831.826,837.0,253000,849.0,818.0
88,2015/01/07,826.0,831.181,813.0,225800,842.0,810.0
89,2015/01/08,836.0,847.14,841.0,268300,860.0,835.0
90,2015/01/09,811.0,815.598,831.0,329700,835.0,803.0
91,2015/01/13,821.0,807.423,801.0,257600,827.0,796.0
92,2015/01/14,796.0,801.308,817.0,157100,817.0,796.0
93,2015/01/15,803.0,802.279,809.0,150400,813.0,795.0
94,2015/01/16,791.0,783.227,790.0,202600,795.0,766.0
95,2015/01/19,794.0,794.252,805.0,118700,809.0,787.0
96,2015/01/20,791.0,790.675,790.0,101000,795.0,786.0
97,2015/01/21,782.0,784.927,795.0,96000,795.0,780.0
98,2015/01/22,775.0,773.887,780.0,87400,783.0,770.0
99,2015/01/23,788.0,789.47,789.0,144600,798.0,783.0
100,2015/01/26,816.0,808.384,782.0,189400,817.0,781.0
101,2015/01/27,820.0,817.044,818.0,160600,827.0,809.0
102,2015/01/28,826.0,817.893,819.0,112000,826.0,811.0
103,2015/01/29,814.0,814.171,812.0,149600,818.0,811.0
104,2015/01/30,827.0,822.847,822.0,176600,834.0,814.0
105,2015/02/02,837.0,831.559,822.0,230700,840.0,811.0
106,2015/02/03,798.0,806.462,843.0,487900,844.0,790.0
107,2015/02/04,823.0,818.914,810.0,214300,828.0,800.0
108,2015/02/05,832.0,825.57,820.0,275700,837.0,817.0
109,2015/02/06,857.0,847.09,841.0,727100,857.0,830.0
110,2015/02/09,813.0,823.12,856.0,1280600,859.0,782.0
111,2015/02/10,803.0,803.585,811.0,257300,819.0,797.0
112,2015/02/12,862.0,846.578,810.0,1171100,867.0,810.0
113,2015/02/13,859.0,864.887,854.0,431900,885.0,850.0
114,2015/02/16,843.0,850.852,852.0,191300,863.0,843.0
115,2015/02/17,853.0,850.329,836.0,181500,858.0,835.0
116,2015/02/18,846.0,852.389,850.0,161200,860.0,844.0
117,2015/02/19,862.0,860.867,846.0,264200,867.0,846.0
118,2015/02/20,886.0,881.538,870.0,490800,888.0,865.0
119,2015/02/23,909.0,902.682,889.0,604800,917.0,888.0
120,2015/02/24,926.0,923.915,912.0,500800,933.0,909.0
121,2015/02/25,919.0,932.29,934.0,437400,947.0,917.0
122,2015/02/26,916.0,915.311,905.0,213300,927.0,904.0
123,2015/02/27,929.0,925.19,919.0,333500,935.0,913.0
124,2015/03/02,928.0,925.599,934.0,277100,935.0,910.0
125,2015/03/03,939.0,941.289,930.0,527300,950.0,925.0
126,2015/03/04,909.0,909.191,925.0,339300,929.0,893.0
127,2015/03/05,884.0,893.415,902.0,275700,910.0,879.0
128,2015/03/06,872.0,879.291,882.0,294100,895.0,869.0
129,2015/03/09,857.0,861.445,863.0,261200,874.0,855.0
130,2015/03/10,875.0,878.546,854.0,355700,895.0,854.0
131,2015/03/11,877.0,885.817,862.0,495200,912.0,862.0
132,2015/03/12,904.0,897.5,880.0,381600,906.0,880.0
133,2015/03/13,911.0,913.373,914.0,419800,920.0,905.0
134,2015/03/16,924.0,920.853,910.0,244800,928.0,908.0
135,2015/03/17,926.0,927.097,929.0,234000,933.0,921.0
136,2015/03/18,955.0,947.071,925.0,653400,959.0,924.0
137,2015/03/19,957.0,961.403,951.0,339600,977.0,950.0
138,2015/03/20,1023.0,1019.478,985.0,1282500,1055.0,981.0
139,2015/03/23,1016.0,1009.137,1020.0,495300,1026.0,988.0
140,2015/03/24,1010.0,1016.209,998.0,277600,1037.0,998.0
141,2015/03/25,981.0,985.852,1008.0,352100,1012.0,972.0
142,2015/03/26,940.0,951.085,965.0,319700,969.0,936.0
143,2015/03/27,944.0,951.794,925.0,342400,978.0,925.0
144,2015/03/30,941.0,942.358,941.0,235800,963.0,931.0
145,2015/03/31,946.0,957.984,955.0,272700,975.0,945.0
146,2015/04/01,932.0,937.215,945.0,225600,969.0,927.0
147,2015/04/02,927.0,927.904,944.0,264700,947.0,917.0
148,2015/04/03,935.0,933.968,930.0,147900,940.0,928.0
149,2015/04/06,932.0,930.485,930.0,151000,939.0,925.0
150,2015/04/07,927.0,924.411,936.0,303200,936.0,918.0
151,2015/04/08,924.0,936.39,941.0,396900,958.0,923.0
152,2015/04/09,920.0,922.998,930.0,343400,934.0,916.0
153,2015/04/10,948.0,933.156,920.0,612800,951.0,904.0
154,2015/04/13,986.0,978.63,945.0,573000,989.0,945.0
155,2015/04/14,1015.0,1007.136,998.0,586800,1023.0,985.0
156,2015/04/15,992.0,1000.437,1011.0,259500,1014.0,987.0
157,2015/04/16,1007.0,998.886,1000.0,306800,1011.0,985.0
158,2015/04/17,974.0,988.015,1013.0,315600,1013.0,971.0
159,2015/04/20,948.0,954.194,955.0,217600,969.0,948.0
160,2015/04/21,952.0,951.218,951.0,171700,957.0,947.0
161,2015/04/22,943.0,946.029,957.0,167200,957.0,941.0
162,2015/04/23,945.0,946.524,944.0,219600,958.0,939.0
163,2015/04/24,930.0,930.95,942.0,207200,942.0,927.0
164,2015/04/27,925.0,929.893,930.0,101400,939.0,923.0
165,2015/04/28,920.0,920.133,920.0,153700,927.0,915.0
166,2015/04/30,912.0,914.223,915.0,139100,920.0,909.0
167,2015/05/01,901.0,898.946,907.0,220500,908.0,892.0
168,2015/05/07,903.0,900.594,901.0,163700,911.0,890.0
169,2015/05/08,913.0,905.143,899.0,184000,921.0,893.0
170,2015/05/11,905.0,908.378,922.0,185600,922.0,903.0
171,2015/05/12,915.0,905.365,901.0,143000,917.0,896.0
172,2015/05/13,900.0,903.079,910.0,228800,912.0,898.0
173,2015/05/14,924.0,910.381,909.0,393300,927.0,901.0
174,2015/05/15,893.0,908.182,915.0,483700,924.0,892.0
175,2015/05/18,937.0,929.438,902.0,464000,942.0,902.0
176,2015/05/19,967.0,959.337,942.0,620000,970.0,941.0
177,2015/05/20,996.0,992.415,961.0,614200,1002.0,961.0
178,2015/05/21,967.0,987.147,1005.0,418800,1013.0,964.0
179,2015/05/22,1031.0,1019.763,975.0,1096100,1036.0,975.0
180,2015/05/25,1092.0,1078.72,1053.0,925000,1095.0,1053.0
181,2015/05/26,1135.0,1109.212,1095.0,1001300,1141.0,1070.0
182,2015/05/27,1178.0,1165.696,1114.0,1006600,1192.0,1113.0
183,2015/05/28,1160.0,1183.525,1189.0,1066700,1217.0,1150.0
184,2015/05/29,1215.0,1204.905,1177.0,857400,1250.0,1161.0
185,2015/06/01,1194.0,1198.039,1227.0,436900,1239.0,1180.0
186,2015/06/02,1162.0,1175.362,1195.0,578100,1209.0,1157.0
187,2015/06/03,1181.0,1167.084,1157.0,493000,1195.0,1136.0
188,2015/06/04,1173.0,1176.246,1164.0,430500,1188.0,1164.0
189,2015/06/05,1226.0,1208.931,1155.0,744600,1235.0,1154.0
190,2015/06/08,1317.0,1295.195,1267.0,960800,1317.0,1267.0
191,2015/06/09,1319.0,1314.328,1316.0,888900,1332.0,1298.0
192,2015/06/10,1261.0,1286.64,1311.0,792000,1336.0,1252.0
193,2015/06/11,1275.0,1276.197,1268.0,520600,1300.0,1246.0
194,2015/06/12,1245.0,1260.348,1256.0,618100,1289.0,1237.0
195,2015/06/15,1236.0,1235.244,1237.0,509500,1260.0,1219.0
196,2015/06/16,1217.0,1233.926,1224.0,496500,1260.0,1211.0
197,2015/06/17,1194.0,1215.78,1215.0,496300,1253.0,1186.0
198,2015/06/18,1175.0,1187.573,1194.0,361800,1207.0,1172.0
199,2015/06/19,1186.0,1164.605,1183.0,574400,1189.0,1151.0
200,2015/06/22,1160.0,1160.985,1182.0,250800,1184.0,1145.0
201,2015/06/23,1235.0,1213.206,1168.0,365800,1236.0,1166.0
202,2015/06/24,1209.0,1223.697,1253.0,346900,1263.0,1206.0
203,2015/06/25,1201.0,1190.021,1200.0,229100,1203.0,1173.0
204,2015/06/26,1287.0,1259.044,1220.0,853500,1290.0,1205.0
205,2015/06/29,1292.0,1302.08,1251.0,832600,1341.0,1250.0
206,2015/06/30,1320.0,1340.356,1300.0,807600,1371.0,1299.0
207,2015/07/01,1302.0,1311.201,1333.0,398800,1348.0,1293.0
208,2015/07/02,1277.0,1278.496,1316.0,360100,1319.0,1254.0
209,2015/07/03,1264.0,1277.639,1297.0,232800,1308.0,1256.0
210,2015/07/06,1233.0,1242.672,1246.0,330000,1279.0,1224.0
211,2015/07/07,1270.0,1272.032,1253.0,266700,1289.0,1253.0
212,2015/07/08,1183.0,1210.161,1270.0,437600,1270.0,1178.0
213,2015/07/09,1202.0,1144.125,1123.0,468800,1207.0,1085.0
214,2015/07/10,1172.0,1184.157,1199.0,256300,1209.0,1166.0
215,2015/07/13,1184.0,1183.816,1176.0,140900,1207.0,1171.0
216,2015/07/14,1237.0,1240.605,1211.0,249200,1265.0,1207.0
217,2015/07/15,1228.0,1226.648,1250.0,175700,1265.0,1211.0
218,2015/07/16,1238.0,1239.337,1229.0,251000,1258.0,1210.0
219,2015/07/17,1246.0,1240.101,1239.0,127600,1250.0,1231.0
220,2015/07/21,1299.0,1297.582,1270.0,422300,1310.0,1254.0
221,2015/07/22,1251.0,1255.766,1289.0,330900,1289.0,1242.0
222,2015/07/23,1194.0,1204.612,1250.0,482600,1250.0,1186.0
223,2015/07/24,1194.0,1192.076,1194.0,271500,1217.0,1175.0
224,2015/07/27,1132.0,1136.972,1164.0,432500,1167.0,1122.0
225,2015/07/28,1132.0,1115.164,1109.0,301400,1135.0,1091.0
226,2015/07/29,1082.0,1093.873,1137.0,393800,1140.0,1066.0
227,2015/07/30,1128.0,1115.958,1120.0,349700,1135.0,1090.0
228,2015/07/31,1162.0,1149.021,1112.0,257800,1172.0,1112.0
229,2015/08/03,1118.0,1132.627,1140.0,289400,1166.0,1117.0
230,2015/08/04,1130.0,1114.004,1117.0,313000,1135.0,1093.0
231,2015/08/05,1104.0,1108.62,1128.0,225100,1132.0,1095.0
232,2015/08/06,1161.0,1151.047,1110.0,438000,1173.0,1104.0
233,2015/08/07,1216.0,1205.928,1174.0,604100,1235.0,1173.0
234,2015/08/10,1157.0,1186.99,1250.0,954800,1250.0,1148.0
235,2015/08/11,1121.0,1132.074,1159.0,521600,1160.0,1115.0
236,2015/08/12,1039.0,1069.321,1102.0,900400,1114.0,1037.0
237,2015/08/13,1064.0,1064.469,1043.0,506700,1087.0,1043.0
238,2015/08/14,1127.0,1101.246,1070.0,585500,1131.0,1054.0
239,2015/08/17,1105.0,1102.624,1127.0,394200,1130.0,1087.0
240,2015/08/18,1176.0,1156.588,1103.0,561000,1178.0,1103.0
241,2015/08/19,1126.0,1142.165,1179.0,531400,1179.0,1123.0
242,2015/08/20,1101.0,1110.434,1121.0,357800,1136.0,1099.0
243,2015/08/21,1048.0,1059.009,1050.0,587500,1088.0,1036.0
244,2015/08/24,903.0,949.44,985.0,818700,1014.0,899.0
245,2015/08/25,875.0,886.884,851.0,844200,958.0,804.0
246,2015/08/26,958.0,931.836,901.0,609300,960.0,890.0
247,2015/08/27,946.0,952.397,971.0,992600,994.0,932.0
248,2015/08/28,986.0,980.858,970.0,366600,999.0,961.0
249,2015/08/31,955.0,965.056,985.0,359300,994.0,944.0
250,2015/09/01,881.0,901.17,940.0,556100,940.0,880.0
251,2015/09/02,860.0,865.61,839.0,605900,894.0,839.0
252,2015/09/03,890.0,896.191,894.0,324700,911.0,884.0
253,2015/09/04,881.0,867.465,892.0,693500,894.0,843.0
254,2015/09/07,889.0,876.077,855.0,346400,902.0,846.0
255,2015/09/08,863.0,883.284,881.0,224600,904.0,861.0
256,2015/09/09,934.0,921.545,906.0,261200,936.0,896.0
257,2015/09/10,916.0,907.304,901.0,346100,926.0,890.0
258,2015/09/11,910.0,908.389,900.0,222500,920.0,900.0
259,2015/09/14,892.0,895.329,917.0,251400,917.0,882.0
260,2015/09/15,904.0,928.363,895.0,328800,958.0,895.0
261,2015/09/16,920.0,925.554,919.0,138200,945.0,911.0
262,2015/09/17,938.0,937.114,932.0,263500,947.0,919.0
263,2015/09/18,953.0,932.108,937.0,377600,955.0,909.0
264,2015/09/24,924.0,924.22,924.0,234300,937.0,916.0
265,2015/09/25,932.0,913.76,924.0,276200,932.0,892.0
266,2015/09/28,941.0,952.707,958.0,287700,979.0,932.0
267,2015/09/29,880.0,895.635,926.0,279700,927.0,876.0
268,2015/09/30,911.0,912.375,900.0,278700,928.0,886.0
269,2015/10/01,927.0,920.589,920.0,214500,937.0,903.0
270,2015/10/02,951.0,942.507,916.0,178800,957.0,916.0
271,2015/10/05,977.0,978.462,966.0,314900,990.0,960.0
272,2015/10/06,969.0,985.672,992.0,320000,1009.0,966.0
273,2015/10/07,974.0,970.948,976.0,239700,980.0,953.0
274,2015/10/08,934.0,942.973,974.0,365100,977.0,925.0
275,2015/10/09,995.0,976.181,935.0,332100,995.0,935.0
276,2015/10/13,1000.0,1010.398,1004.0,342200,1033.0,985.0
277,2015/10/14,977.0,985.558,988.0,224500,1001.0,969.0
278,2015/10/15,990.0,990.342,965.0,253500,1002.0,956.0
279,2015/10/16,997.0,999.27,1009.0,181400,1018.0,988.0
280,2015/10/19,975.0,982.068,1004.0,321700,1005.0,971.0
281,2015/10/20,998.0,993.475,982.0,180200,1001.0,979.0
282,2015/10/21,1007.0,1003.1,998.0,276600,1012.0,985.0
283,2015/10/22,1013.0,1018.743,1000.0,289800,1035.0,993.0
284,2015/10/23,1036.0,1034.93,1040.0,265300,1044.0,1024.0
285,2015/10/26,1078.0,1067.047,1050.0,355200,1082.0,1044.0
286,2015/10/27,1012.0,1027.175,1080.0,693400,1080.0,1009.0
287,2015/10/28,1023.0,1028.205,1016.0,327500,1044.0,1016.0
288,2015/10/29,1081.0,1072.51,1041.0,901600,1084.0,1035.0
289,2015/10/30,1078.0,1078.695,1073.0,433400,1094.0,1055.0
290,2015/11/02,1063.0,1065.329,1056.0,278900,1085.0,1043.0
291,2015/11/04,1058.0,1064.429,1089.0,257800,1089.0,1051.0
292,2015/11/05,1031.0,1037.768,1060.0,315300,1070.0,1026.0
293,2015/11/06,1019.0,996.051,1035.0,510800,1039.0,904.0
294,2015/11/09,895.0,900.286,910.0,1720200,920.0,884.0
295,2015/11/10,890.0,890.31,895.0,811100,898.0,886.0
296,2015/11/11,870.0,870.56,880.0,800800,888.0,860.0
297,2015/11/12,881.0,870.684,870.0,637400,885.0,855.0
298,2015/11/13,877.0,872.543,868.0,368100,878.0,864.0
299,2015/11/16,832.0,840.388,865.0,866600,865.0,830.0
300,2015/11/17,840.0,842.769,830.0,350000,861.0,830.0
301,2015/11/18,827.0,830.886,845.0,703500,848.0,824.0
302,2015/11/19,832.0,833.082,839.0,434200,842.0,827.0
303,2015/11/20,833.0,831.621,835.0,290900,839.0,828.0
304,2015/11/24,829.0,826.813,831.0,481200,837.0,821.0
305,2015/11/25,818.0,818.3,825.0,402200,827.0,815.0
306,2015/11/26,815.0,810.514,820.0,707000,821.0,804.0
307,2015/11/27,846.0,835.198,806.0,909300,852.0,803.0
308,2015/11/30,853.0,847.001,854.0,603200,857.0,841.0
309,2015/12/01,889.0,876.907,851.0,971300,891.0,851.0
310,2015/12/02,867.0,874.089,886.0,509200,886.0,867.0
311,2015/12/03,889.0,888.812,878.0,585700,896.0,877.0
312,2015/12/04,890.0,888.928,874.0,521600,895.0,872.0
313,2015/12/07,917.0,915.803,903.0,592500,924.0,903.0
314,2015/12/08,883.0,891.623,918.0,307200,921.0,878.0
315,2015/12/09,894.0,886.043,865.0,257900,897.0,865.0
316,2015/12/10,864.0,869.9,879.0,238700,883.0,860.0
317,2015/12/11,889.0,873.604,856.0,208100,889.0,856.0
318,2015/12/14,890.0,865.908,860.0,460500,892.0,848.0
319,2015/12/15,861.0,872.652,888.0,269300,895.0,861.0
320,2015/12/16,903.0,895.827,889.0,465700,909.0,873.0
321,2015/12/17,910.0,912.084,913.0,389500,919.0,906.0
322,2015/12/18,882.0,897.655,902.0,212500,915.0,882.0
323,2015/12/21,906.0,892.878,889.0,392400,907.0,868.0
324,2015/12/22,891.0,893.743,894.0,189200,902.0,887.0
325,2015/12/24,882.0,892.837,900.0,256500,900.0,880.0
326,2015/12/25,862.0,869.245,871.0,177600,882.0,861.0
327,2015/12/28,919.0,909.943,862.0,647800,922.0,862.0
328,2015/12/29,946.0,935.763,908.0,477000,950.0,904.0
329,2015/12/30,948.0,958.265,946.0,451300,976.0,936.0
330,2016/01/04,936.0,945.715,948.0,279100,967.0,931.0
331,2016/01/05,909.0,912.388,923.0,351600,934.0,899.0
332,2016/01/06,886.0,888.307,910.0,307100,914.0,876.0
333,2016/01/07,870.0,880.621,880.0,433400,901.0,865.0
334,2016/01/08,869.0,867.278,859.0,334300,883.0,851.0
335,2016/01/12,809.0,824.686,850.0,451800,858.0,803.0
336,2016/01/13,870.0,857.964,829.0,339100,874.0,829.0
337,2016/01/14,832.0,832.836,840.0,362500,848.0,818.0
338,2016/01/15,820.0,826.348,847.0,320400,855.0,812.0
339,2016/01/18,795.0,791.967,780.0,281800,804.0,775.0
340,2016/01/19,811.0,806.86,790.0,274400,826.0,788.0
341,2016/01/20,765.0,783.786,815.0,342800,819.0,761.0
342,2016/01/21,735.0,766.244,750.0,463700,804.0,732.0
343,2016/01/22,805.0,788.0,775.0,314700,805.0,771.0
344,2016/01/25,798.0,801.25,824.0,405500,827.0,785.0
345,2016/01/26,773.0,774.449,776.0,236000,788.0,764.0
346,2016/01/27,781.0,781.579,787.0,273100,798.0,767.0
347,2016/01/28,731.0,744.493,781.0,812100,781.0,720.0
348,2016/01/29,749.0,732.375,728.0,941600,760.0,707.0
349,2016/02/01,812.0,795.354,768.0,499000,816.0,765.0
350,2016/02/02,782.0,783.487,795.0,375400,796.0,777.0
351,2016/02/03,732.0,736.148,752.0,413100,754.0,726.0
352,2016/02/04,731.0,723.973,720.0,330900,738.0,709.0
353,2016/02/05,693.0,692.534,715.0,484200,725.0,681.0
354,2016/02/08,618.0,625.165,640.0,1167000,650.0,609.0
355,2016/02/09,541.0,559.303,590.0,940600,590.0,535.0
356,2016/02/10,562.0,566.299,591.0,809800,591.0,551.0
357,2016/02/12,503.0,516.971,530.0,505200,533.0,500.0
358,2016/02/15,536.0,534.922,541.0,483600,547.0,520.0
359,2016/02/16,565.0,563.165,535.0,464100,584.0,531.0
360,2016/02/17,537.0,551.725,557.0,441800,580.0,527.0
361,2016/02/18,587.0,579.279,567.0,524500,595.0,560.0
362,2016/02/19,576.0,576.089,574.0,336500,584.0,564.0
363,2016/02/22,572.0,576.409,576.0,388000,594.0,566.0
364,2016/02/23,562.0,566.584,582.0,370900,583.0,554.0
365,2016/02/24,564.0,558.232,552.0,247700,574.0,542.0
366,2016/02/25,563.0,563.394,559.0,216200,574.0,557.0
367,2016/02/26,559.0,565.114,572.0,183700,578.0,557.0
368,2016/02/29,627.0,625.263,613.0,1082300,643.0,611.0
369,2016/03/01,645.0,631.276,622.0,806200,648.0,610.0
370,2016/03/02,670.0,668.031,662.0,685500,678.0,651.0
371,2016/03/03,670.0,673.199,668.0,779200,690.0,661.0
372,2016/03/04,675.0,674.204,672.0,603300,681.0,665.0
373,2016/03/07,653.0,658.556,682.0,728300,682.0,651.0
374,2016/03/08,644.0,643.286,655.0,392100,662.0,622.0
375,2016/03/09,628.0,622.957,630.0,296400,632.0,612.0
376,2016/03/10,612.0,611.945,623.0,547400,630.0,605.0
377,2016/03/11,623.0,617.426,602.0,352900,627.0,602.0
378,2016/03/14,626.0,628.376,634.0,392500,641.0,621.0
379,2016/03/15,625.0,619.347,622.0,394400,627.0,612.0
380,2016/03/16,628.0,625.346,615.0,297500,633.0,614.0
381,2016/03/17,612.0,621.404,633.0,398400,636.0,605.0
382,2016/03/18,602.0,597.16,606.0,367000,613.0,590.0
383,2016/03/22,617.0,616.622,612.0,182700,628.0,606.0
384,2016/03/23,616.0,619.074,621.0,221900,630.0,611.0
385,2016/03/24,600.0,606.149,612.0,355600,618.0,598.0
386,2016/03/25,585.0,580.278,598.0,669800,600.0,572.0
387,2016/03/28,590.0,586.372,588.0,340700,595.0,580.0
388,2016/03/29,591.0,586.711,584.0,169600,592.0,575.0
389,2016/03/30,583.0,585.16,592.0,177500,594.0,580.0
390,2016/03/31,586.0,588.97,583.0,308900,595.0,582.0
391,2016/04/01,554.0,563.586,584.0,431300,585.0,553.0
392,2016/04/04,532.0,538.767,547.0,293100,558.0,527.0
393,2016/04/05,503.0,512.22,537.0,566100,541.0,498.0
394,2016/04/06,511.0,505.933,496.0,323000,516.0,493.0
395,2016/04/07,508.0,512.298,511.0,200900,529.0,504.0
396,2016/04/08,523.0,512.608,498.0,230300,529.0,493.0
397,2016/04/11,521.0,516.298,519.0,199100,525.0,505.0
398,2016/04/12,535.0,532.888,515.0,312200,542.0,511.0
399,2016/04/13,567.0,560.432,543.0,214600,571.0,543.0
400,2016/04/14,582.0,587.075,580.0,321200,598.0,578.0
401,2016/04/15,558.0,562.771,572.0,347100,575.0,555.0
402,2016/04/18,533.0,536.239,536.0,222900,543.0,533.0
403,2016/04/19,562.0,559.046,553.0,194400,564.0,551.0
404,2016/04/20,568.0,567.366,574.0,184800,574.0,561.0
405,2016/04/21,589.0,583.541,580.0,207500,589.0,573.0
406,2016/04/22,594.0,590.051,584.0,197400,597.0,581.0
407,2016/04/25,611.0,610.271,603.0,414400,618.0,600.0
408,2016/04/26,574.0,582.286,609.0,583300,609.0,570.0
409,2016/04/27,567.0,567.029,571.0,266500,577.0,559.0
410,2016/04/28,566.0,574.997,578.0,296200,590.0,560.0
411,2016/05/02,524.0,527.605,536.0,343700,542.0,521.0
412,2016/05/06,523.0,523.002,526.0,176500,533.0,518.0
413,2016/05/09,526.0,526.92,523.0,181400,531.0,520.0
414,2016/05/10,540.0,534.011,526.0,185400,543.0,519.0
415,2016/05/11,560.0,558.161,547.0,242300,565.0,546.0
416,2016/05/12,557.0,552.023,551.0,168100,560.0,541.0
417,2016/05/13,534.0,536.579,557.0,312500,558.0,527.0
418,2016/05/16,493.0,502.784,516.0,700000,521.0,490.0
419,2016/05/17,506.0,500.777,500.0,235500,513.0,494.0
420,2016/05/18,535.0,533.064,520.0,474100,547.0,518.0
421,2016/05/19,561.0,560.306,541.0,462500,573.0,541.0
422,2016/05/20,577.0,568.364,555.0,396800,578.0,549.0
423,2016/05/23,571.0,574.714,582.0,307700,590.0,562.0
424,2016/05/24,564.0,565.552,570.0,167500,570.0,561.0
425,2016/05/25,568.0,571.302,576.0,197800,577.0,566.0
426,2016/05/26,574.0,573.753,573.0,223900,577.0,568.0
427,2016/05/27,570.0,569.14,577.0,233000,577.0,563.0
428,2016/05/30,616.0,601.925,574.0,623300,620.0,573.0
429,2016/05/31,636.0,628.617,616.0,461600,641.0,608.0
430,2016/06/01,687.0,674.632,627.0,1251800,705.0,613.0
431,2016/06/02,670.0,670.626,673.0,548700,685.0,656.0
432,2016/06/03,687.0,686.07,679.0,429500,697.0,676.0
433,2016/06/06,644.0,648.421,665.0,450700,665.0,638.0
434,2016/06/07,654.0,652.48,653.0,319000,662.0,645.0
435,2016/06/08,658.0,657.338,652.0,200000,664.0,650.0
436,2016/06/09,641.0,645.467,651.0,219700,660.0,639.0
437,2016/06/10,680.0,666.246,649.0,559800,682.0,642.0
438,2016/06/13,634.0,645.341,662.0,380700,662.0,634.0
439,2016/06/14,588.0,595.257,611.0,507900,618.0,584.0
440,2016/06/15,598.0,596.403,582.0,206600,608.0,581.0
441,2016/06/16,540.0,561.031,597.0,693500,598.0,537.0
442,2016/06/17,566.0,556.636,551.0,472100,566.0,543.0
443,2016/06/20,591.0,584.572,575.0,420300,598.0,562.0
444,2016/06/21,583.0,582.92,590.0,219200,596.0,567.0
445,2016/06/22,590.0,582.765,581.0,313200,594.0,570.0
446,2016/06/23,607.0,593.722,591.0,388800,607.0,580.0
447,2016/06/24,571.0,575.961,618.0,795400,622.0,513.0
448,2016/06/27,548.0,547.413,551.0,441800,560.0,530.0
449,2016/06/28,523.0,523.992,534.0,408100,535.0,511.0
450,2016/06/29,584.0,581.012,573.0,877300,593.0,568.0
451,2016/06/30,607.0,602.12,590.0,533300,616.0,585.0
452,2016/07/01,657.0,649.989,620.0,1056300,664.0,617.0
453,2016/07/04,642.0,648.943,661.0,620200,665.0,636.0
454,2016/07/05,625.0,633.846,645.0,561600,653.0,621.0
455,2016/07/06,604.0,606.626,618.0,490100,618.0,596.0
456,2016/07/07,595.0,606.904,604.0,472200,625.0,594.0
457,2016/07/08,606.0,600.518,595.0,368500,614.0,591.0
458,2016/07/11,635.0,630.373,623.0,402800,640.0,615.0
459,2016/07/12,667.0,666.655,645.0,653400,684.0,645.0
460,2016/07/13,691.0,685.872,680.0,624400,697.0,670.0
461,2016/07/14,682.0,684.984,699.0,391400,703.0,670.0
462,2016/07/15,688.0,693.931,685.0,368100,703.0,683.0
463,2016/07/19,692.0,690.889,695.0,248500,699.0,683.0
464,2016/07/20,670.0,677.41,692.0,317400,692.0,663.0
465,2016/07/21,741.0,733.99,690.0,1076700,768.0,690.0
466,2016/07/22,773.0,758.944,738.0,725200,785.0,731.0
467,2016/07/25,751.0,767.277,770.0,341900,795.0,751.0
468,2016/07/26,690.0,702.956,736.0,590700,740.0,686.0
469,2016/07/27,730.0,722.85,706.0,454800,738.0,704.0
470,2016/07/28,736.0,739.748,731.0,338100,754.0,722.0
471,2016/07/29,782.0,762.828,735.0,498700,785.0,729.0
472,2016/08/01,760.0,764.642,758.0,220200,773.0,757.0
473,2016/08/02,759.0,758.353,750.0,176000,770.0,747.0
474,2016/08/03,723.0,736.249,744.0,272000,751.0,721.0
475,2016/08/04,760.0,755.698,736.0,460100,773.0,732.0
476,2016/08/05,744.0,746.033,757.0,464100,761.0,725.0
477,2016/08/08,717.0,713.256,729.0,549000,747.0,684.0
478,2016/08/09,738.0,724.358,710.0,219300,738.0,703.0
479,2016/08/10,719.0,718.765,733.0,225900,738.0,712.0
480,2016/08/12,692.0,694.159,720.0,348600,721.0,680.0
481,2016/08/15,710.0,707.45,702.0,131700,717.0,699.0
482,2016/08/16,728.0,724.197,710.0,259400,734.0,704.0
483,2016/08/17,735.0,732.186,730.0,196200,740.0,720.0
484,2016/08/18,723.0,733.638,734.0,161400,745.0,721.0
485,2016/08/19,748.0,746.228,730.0,274500,755.0,723.0
486,2016/08/22,773.0,761.139,750.0,323600,776.0,739.0
487,2016/08/23,748.0,753.535,764.0,184300,771.0,743.0
488,2016/08/24,749.0,747.305,754.0,99600,763.0,740.0
489,2016/08/25,770.0,765.874,754.0,195300,774.0,752.0
490,2016/08/26,758.0,769.072,774.0,196900,781.0,757.0
491,2016/08/29,812.0,802.712,775.0,660400,816.0,767.0
492,2016/08/30,817.0,812.506,805.0,164900,820.0,803.0
493,2016/08/31,836.0,841.353,830.0,305300,855.0,830.0
494,2016/09/01,818.0,824.157,831.0,174800,841.0,813.0
495,2016/09/02,814.0,808.147,815.0,161800,816.0,800.0
496,2016/09/05,822.0,826.185,834.0,226500,842.0,816.0
497,2016/09/06,814.0,813.027,824.0,179500,825.0,806.0
498,2016/09/07,812.0,806.992,800.0,178900,822.0,795.0
499,2016/09/08,804.0,805.609,813.0,197000,820.0,794.0
500,2016/09/09,827.0,823.308,812.0,256300,832.0,810.0
501,2016/09/12,820.0,828.716,818.0,241500,845.0,815.0
502,2016/09/13,825.0,824.952,828.0,188200,830.0,818.0
503,2016/09/14,813.0,820.126,821.0,156200,827.0,812.0
504,2016/09/15,807.0,812.372,810.0,169900,826.0,805.0
505,2016/09/16,816.0,818.785,817.0,177600,828.0,812.0
506,2016/09/20,812.0,816.329,818.0,178400,825.0,810.0
507,2016/09/21,828.0,820.837,821.0,180000,832.0,804.0
508,2016/09/23,833.0,832.186,831.0,178400,838.0,821.0
509,2016/09/26,810.0,819.268,835.0,119300,835.0,809.0
510,2016/09/27,812.0,801.828,809.0,141200,814.0,787.0
511,2016/09/28,826.0,823.043,822.0,107000,829.0,815.0
512,2016/09/29,859.0,849.65,833.0,367800,861.0,827.0
513,2016/09/30,850.0,855.118,853.0,141200,863.0,842.0
514,2016/10/03,841.0,850.439,858.0,141100,864.0,837.0
515,2016/10/04,849.0,851.081,850.0,138500,861.0,845.0
516,2016/10/05,858.0,866.05,856.0,237600,877.0,856.0
517,2016/10/06,868.0,874.491,870.0,228900,884.0,866.0
518,2016/10/07,850.0,859.543,868.0,233700,878.0,845.0
519,2016/10/11,843.0,845.595,852.0,233200,862.0,837.0
520,2016/10/12,855.0,850.838,838.0,223700,862.0,838.0
521,2016/10/13,846.0,847.174,855.0,129100,857.0,842.0
522,2016/10/14,841.0,838.822,840.0,156700,846.0,833.0
523,2016/10/17,841.0,839.558,837.0,170500,844.0,835.0
524,2016/10/18,839.0,836.934,834.0,230300,844.0,826.0
525,2016/10/19,835.0,833.471,838.0,210700,840.0,827.0
526,2016/10/20,847.0,845.347,833.0,150300,854.0,830.0
527,2016/10/21,849.0,855.161,847.0,266100,865.0,845.0
528,2016/10/24,817.0,822.975,843.0,395000,844.0,812.0
529,2016/10/25,827.0,821.402,814.0,118400,828.0,814.0
530,2016/10/26,821.0,818.555,817.0,148600,823.0,816.0
531,2016/10/27,807.0,807.03,818.0,210600,818.0,801.0
532,2016/10/28,823.0,821.41,816.0,252200,827.0,813.0
533,2016/10/31,833.0,827.547,821.0,201500,834.0,817.0
534,2016/11/01,830.0,827.374,835.0,145600,835.0,824.0
535,2016/11/02,801.0,805.125,820.0,256100,825.0,797.0
536,2016/11/04,802.0,795.998,786.0,189700,807.0,784.0
537,2016/11/07,875.0,867.339,829.0,703400,889.0,829.0
538,2016/11/08,864.0,866.823,879.0,378600,886.0,851.0
539,2016/11/09,782.0,810.761,860.0,500000,876.0,763.0
540,2016/11/10,891.0,878.094,857.0,600200,899.0,840.0
541,2016/11/11,896.0,907.291,911.0,376900,928.0,891.0
542,2016/11/14,938.0,941.024,911.0,526300,952.0,911.0
543,2016/11/15,958.0,963.9,960.0,364600,976.0,955.0
544,2016/11/16,1007.0,1000.902,980.0,521500,1015.0,975.0
545,2016/11/17,1072.0,1056.894,1003.0,615600,1083.0,1003.0
546,2016/11/18,1010.0,1048.47,1075.0,599700,1094.0,1000.0
547,2016/11/21,1075.0,1062.814,1043.0,383900,1081.0,1034.0
548,2016/11/22,1053.0,1047.806,1064.0,387200,1064.0,1035.0
549,2016/11/24,1086.0,1087.645,1091.0,340900,1104.0,1071.0
550,2016/11/25,1097.0,1107.461,1090.0,788100,1134.0,1080.0
551,2016/11/28,1106.0,1097.609,1100.0,294600,1110.0,1084.0
552,2016/11/29,1104.0,1092.648,1087.0,257000,1110.0,1071.0
553,2016/11/30,1079.0,1082.831,1100.0,221100,1109.0,1075.0
554,2016/12/01,1091.0,1104.575,1100.0,254000,1123.0,1089.0
555,2016/12/02,1061.0,1060.943,1074.0,262300,1080.0,1050.0
556,2016/12/05,1061.0,1053.563,1039.0,263600,1070.0,1031.0
557,2016/12/06,1081.0,1085.665,1080.0,338100,1106.0,1073.0
558,2016/12/07,1105.0,1098.087,1085.0,331900,1109.0,1083.0
559,2016/12/08,1115.0,1119.251,1106.0,501100,1135.0,1105.0
560,2016/12/09,1178.0,1158.762,1121.0,587900,1179.0,1118.0
561,2016/12/12,1156.0,1167.873,1200.0,353800,1210.0,1145.0
562,2016/12/13,1111.0,1104.633,1131.0,346900,1132.0,1087.0
563,2016/12/14,1103.0,1109.539,1130.0,190400,1130.0,1101.0
564,2016/12/15,1127.0,1121.909,1108.0,261500,1136.0,1105.0
565,2016/12/16,1151.0,1148.526,1137.0,258000,1170.0,1132.0
566,2016/12/19,1121.0,1127.201,1141.0,139000,1149.0,1116.0
567,2016/12/20,1134.0,1122.816,1113.0,178100,1140.0,1101.0
568,2016/12/21,1120.0,1134.159,1138.0,207700,1159.0,1115.0
569,2016/12/22,1128.0,1118.844,1105.0,161200,1128.0,1105.0
570,2016/12/26,1151.0,1139.402,1128.0,338700,1158.0,1119.0
571,2016/12/27,1179.0,1182.104,1155.0,323700,1198.0,1152.0
572,2016/12/28,1167.0,1171.966,1191.0,297700,1202.0,1152.0
573,2016/12/29,1138.0,1132.22,1150.0,280700,1153.0,1118.0
574,2016/12/30,1137.0,1128.601,1120.0,143000,1143.0,1113.0
575,2017/01/04,1177.0,1178.632,1167.0,255300,1189.0,1154.0
576,2017/01/05,1171.0,1185.652,1181.0,391100,1199.0,1163.0
577,2017/01/06,1139.0,1137.048,1145.0,323300,1154.0,1126.0
578,2017/01/10,1156.0,1151.246,1138.0,187900,1165.0,1129.0
579,2017/01/11,1177.0,1178.714,1169.0,181500,1187.0,1166.0
580,2017/01/12,1173.0,1185.377,1181.0,416300,1197.0,1171.0
581,2017/01/13,1185.0,1178.128,1174.0,230000,1189.0,1161.0
582,2017/01/16,1215.0,1213.852,1200.0,493000,1230.0,1197.0
583,2017/01/17,1211.0,1229.12,1205.0,419600,1254.0,1199.0
584,2017/01/18,1202.0,1200.06,1205.0,261000,1228.0,1173.0
585,2017/01/19,1275.0,1254.897,1210.0,531900,1279.0,1210.0
586,2017/01/20,1261.0,1260.553,1273.0,285400,1273.0,1243.0
587,2017/01/23,1259.0,1269.656,1261.0,205500,1289.0,1257.0
588,2017/01/24,1249.0,1254.207,1252.0,130700,1269.0,1245.0
589,2017/01/25,1281.0,1273.861,1279.0,357400,1285.0,1254.0
590,2017/01/26,1333.0,1326.518,1291.0,473900,1348.0,1290.0
591,2017/01/27,1301.0,1307.486,1330.0,279700,1332.0,1296.0
592,2017/01/30,1300.0,1295.806,1297.0,188300,1310.0,1284.0
593,2017/01/31,1302.0,1298.399,1284.0,283400,1313.0,1278.0
594,2017/02/01,1295.0,1296.846,1280.0,300000,1307.0,1266.0
595,2017/02/02,1288.0,1311.863,1304.0,362300,1344.0,1284.0
596,2017/02/03,1284.0,1302.242,1315.0,274800,1332.0,1283.0
597,2017/02/06,1277.0,1282.794,1314.0,560600,1314.0,1264.0
598,2017/02/07,1205.0,1221.658,1280.0,620600,1280.0,1196.0
599,2017/02/08,1287.0,1264.059,1206.0,661700,1297.0,1205.0
600,2017/02/09,1311.0,1312.524,1287.0,636800,1330.0,1284.0
601,2017/02/10,1309.0,1310.205,1327.0,338400,1334.0,1288.0
602,2017/02/13,1380.0,1368.079,1333.0,609200,1391.0,1321.0
603,2017/02/14,1366.0,1388.485,1392.0,411100,1420.0,1363.0
604,2017/02/15,1408.0,1410.975,1385.0,537700,1437.0,1385.0
605,2017/02/16,1465.0,1463.126,1420.0,510100,1485.0,1418.0
606,2017/02/17,1504.0,1512.082,1465.0,627000,1535.0,1465.0
607,2017/02/20,1543.0,1533.561,1520.0,529300,1553.0,1499.0
608,2017/02/21,1490.0,1497.067,1548.0,424300,1558.0,1465.0
609,2017/02/22,1473.0,1473.769,1510.0,383700,1512.0,1443.0
610,2017/02/23,1466.0,1472.262,1486.0,244100,1498.0,1460.0
611,2017/02/24,1499.0,1498.117,1451.0,390200,1519.0,1441.0
612,2017/02/27,1479.0,1492.497,1491.0,345200,1540.0,1467.0
613,2017/02/28,1462.0,1482.515,1498.0,286200,1509.0,1462.0
614,2017/03/01,1476.0,1451.21,1462.0,439800,1478.0,1424.0
615,2017/03/02,1452.0,1466.239,1501.0,338900,1505.0,1442.0
616,2017/03/03,1490.0,1478.27,1463.0,361300,1495.0,1457.0
617,2017/03/06,1508.0,1521.599,1497.0,429200,1546.0,1497.0
618,2017/03/07,1481.0,1489.829,1511.0,191200,1513.0,1476.0
619,2017/03/08,1488.0,1483.767,1490.0,238400,1503.0,1466.0
620,2017/03/09,1470.0,1475.512,1485.0,179200,1502.0,1460.0
621,2017/03/10,1505.0,1493.609,1497.0,206500,1510.0,1467.0
622,2017/03/13,1471.0,1474.432,1490.0,241500,1490.0,1462.0
623,2017/03/14,1475.0,1474.395,1469.0,153800,1481.0,1462.0
624,2017/03/15,1470.0,1482.883,1474.0,252300,1504.0,1466.0
625,2017/03/16,1491.0,1476.906,1465.0,239800,1494.0,1451.0
626,2017/03/17,1555.0,1534.482,1496.0,613300,1556.0,1488.0
627,2017/03/21,1564.0,1565.568,1580.0,434100,1589.0,1547.0
628,2017/03/22,1546.0,1534.498,1530.0,284500,1553.0,1507.0
629,2017/03/23,1512.0,1514.213,1523.0,197300,1545.0,1504.0
630,2017/03/24,1555.0,1541.075,1513.0,350300,1563.0,1486.0
631,2017/03/27,1554.0,1556.568,1550.0,183100,1575.0,1539.0
632,2017/03/28,1638.0,1611.044,1577.0,581400,1638.0,1571.0
633,2017/03/29,1632.0,1657.367,1639.0,394700,1694.0,1622.0
634,2017/03/30,1646.0,1661.805,1627.0,327800,1687.0,1627.0
635,2017/03/31,1647.0,1668.156,1663.0,301100,1694.0,1643.0
636,2017/04/03,1603.0,1605.435,1635.0,435100,1650.0,1586.0
637,2017/04/04,1569.0,1566.612,1580.0,664300,1617.0,1530.0
638,2017/04/05,1491.0,1502.552,1574.0,604200,1576.0,1471.0
639,2017/04/06,1431.0,1417.318,1461.0,994200,1468.0,1382.0
640,2017/04/07,1423.0,1418.573,1452.0,440300,1452.0,1385.0
641,2017/04/10,1432.0,1427.746,1425.0,319200,1445.0,1398.0
642,2017/04/11,1405.0,1410.317,1419.0,324100,1431.0,1397.0
643,2017/04/12,1345.0,1346.109,1375.0,589200,1386.0,1325.0
644,2017/04/13,1323.0,1308.373,1298.0,425800,1327.0,1287.0
645,2017/04/14,1282.0,1288.587,1305.0,316800,1308.0,1276.0
646,2017/04/17,1285.0,1273.578,1273.0,373700,1292.0,1257.0
647,2017/04/18,1314.0,1319.771,1325.0,380000,1352.0,1297.0
648,2017/04/19,1320.0,1322.853,1299.0,286200,1337.0,1299.0
649,2017/04/20,1344.0,1350.092,1320.0,424200,1372.0,1316.0
650,2017/04/21,1361.0,1353.962,1366.0,432800,1378.0,1334.0
651,2017/04/24,1364.0,1372.729,1391.0,364900,1399.0,1357.0
652,2017/04/25,1412.0,1397.757,1371.0,362200,1417.0,1363.0
653,2017/04/26,1462.0,1452.949,1431.0,455000,1477.0,1416.0
654,2017/04/27,1459.0,1458.483,1450.0,290300,1473.0,1442.0
655,2017/04/28,1449.0,1455.028,1460.0,258100,1469.0,1446.0
656,2017/05/01,1500.0,1494.376,1464.0,462000,1511.0,1458.0
657,2017/05/02,1520.0,1521.764,1517.0,488100,1540.0,1506.0
658,2017/05/08,1554.0,1557.132,1555.0,359500,1567.0,1542.0
659,2017/05/09,1534.0,1545.867,1557.0,293000,1567.0,1528.0
660,2017/05/10,1575.0,1567.69,1546.0,306900,1580.0,1544.0
661,2017/05/11,1573.0,1579.513,1582.0,427700,1598.0,1559.0
662,2017/05/12,1527.0,1528.247,1573.0,456500,1573.0,1506.0
663,2017/05/15,1485.0,1471.056,1485.0,496800,1486.0,1445.0
664,2017/05/16,1596.0,1578.556,1510.0,1391000,1629.0,1507.0
665,2017/05/17,1730.0,1719.965,1620.0,1711500,1768.0,1619.0
666,2017/05/18,1754.0,1740.554,1690.0,1066800,1771.0,1674.0
667,2017/05/19,1834.0,1791.94,1754.0,842300,1839.0,1750.0
668,2017/05/22,1775.0,1840.653,1900.0,1024000,1954.0,1756.0
669,2017/05/23,1770.0,1792.702,1799.0,717300,1837.0,1752.0
670,2017/05/24,1856.0,1833.195,1809.0,583400,1863.0,1784.0
671,2017/05/25,1866.0,1858.009,1870.0,432200,1874.0,1830.0
672,2017/05/26,1866.0,1839.246,1842.0,401100,1870.0,1808.0
673,2017/05/29,1879.0,1856.584,1856.0,373300,1891.0,1813.0
674,2017/05/30,1904.0,1893.699,1884.0,268800,1909.0,1873.0
675,2017/05/31,1930.0,1925.82,1904.0,412100,1941.0,1892.0
676,2017/06/01,1887.0,1914.134,1931.0,348200,1954.0,1883.0
677,2017/06/02,1914.0,1918.625,1914.0,418300,1945.0,1880.0
678,2017/06/05,1922.0,1921.075,1911.0,247700,1938.0,1902.0
679,2017/06/06,1931.0,1945.415,1932.0,426300,1966.0,1924.0
680,2017/06/07,1985.0,1970.357,1940.0,566600,1999.0,1924.0
681,2017/06/08,1953.0,1972.208,1986.0,364900,2009.0,1953.0
682,2017/06/09,1965.0,1970.224,1968.0,235700,1994.0,1951.0
683,2017/06/12,1879.0,1897.103,1930.0,470700,1947.0,1862.0
684,2017/06/13,1853.0,1852.938,1866.0,369400,1878.0,1834.0
685,2017/06/14,1856.0,1870.195,1871.0,288500,1895.0,1855.0
686,2017/06/15,1781.0,1794.926,1836.0,477800,1849.0,1772.0
687,2017/06/16,1762.0,1763.518,1783.0,257400,1798.0,1747.0
688,2017/06/19,1788.0,1789.316,1753.0,228300,1810.0,1745.0
689,2017/06/20,1849.0,1844.996,1828.0,455100,1867.0,1812.0
690,2017/06/21,1849.0,1850.547,1847.0,362500,1888.0,1809.0
691,2017/06/22,1833.0,1871.757,1857.0,407800,1910.0,1824.0
692,2017/06/23,1810.0,1815.458,1833.0,291000,1839.0,1786.0
693,2017/06/26,1843.0,1833.771,1802.0,250600,1847.0,1790.0
694,2017/06/27,1851.0,1848.735,1845.0,266100,1869.0,1834.0
695,2017/06/28,1727.0,1761.725,1830.0,768800,1830.0,1713.0
696,2017/06/29,1750.0,1736.686,1746.0,337700,1763.0,1706.0
697,2017/06/30,1726.0,1707.11,1706.0,293100,1726.0,1693.0
698,2017/07/03,1722.0,1732.134,1742.0,244200,1767.0,1713.0
699,2017/07/04,1665.0,1680.874,1744.0,416700,1752.0,1645.0
700,2017/07/05,1730.0,1708.486,1664.0,465000,1731.0,1664.0
701,2017/07/06,1715.0,1733.519,1733.0,254700,1772.0,1706.0
702,2017/07/07,1738.0,1738.984,1703.0,245200,1762.0,1700.0
703,2017/07/10,1758.0,1763.874,1765.0,265200,1779.0,1744.0
704,2017/07/11,1763.0,1760.397,1765.0,134300,1768.0,1742.0
705,2017/07/12,1745.0,1764.694,1764.0,225200,1791.0,1744.0
706,2017/07/13,1760.0,1758.174,1760.0,137100,1769.0,1745.0
707,2017/07/14,1780.0,1788.33,1772.0,273700,1809.0,1770.0
708,2017/07/18,1837.0,1817.689,1786.0,439100,1844.0,1771.0
709,2017/07/19,1917.0,1901.206,1850.0,589700,1923.0,1846.0
710,2017/07/20,1950.0,1958.361,1935.0,519400,1981.0,1932.0
711,2017/07/21,2152.0,2110.744,2029.0,1350200,2166.0,2026.0
712,2017/07/24,2195.0,2179.183,2136.0,620800,2203.0,2136.0
713,2017/07/25,2210.0,2200.73,2206.0,319400,2223.0,2162.0
714,2017/07/26,2117.0,2143.87,2200.0,564800,2200.0,2114.0
715,2017/07/27,2246.0,2204.428,2138.0,639800,2256.0,2113.0
716,2017/07/28,2163.0,2173.231,2245.0,531400,2246.0,2120.0
717,2017/07/31,2153.0,2150.119,2146.0,340100,2170.0,2116.0
718,2017/08/01,2027.0,2043.119,2136.0,608900,2147.0,1983.0
719,2017/08/02,2062.0,2045.867,2026.0,349200,2082.0,2014.0
720,2017/08/03,2029.0,2035.858,2061.0,349600,2069.0,2001.0
721,2017/08/04,2037.0,2046.051,2038.0,208800,2065.0,2023.0
722,2017/08/07,2037.0,2046.488,2063.0,333500,2075.0,2027.0
723,2017/08/08,2114.0,2138.792,2155.0,1014200,2195.0,2101.0
724,2017/08/09,1995.0,1955.693,2051.0,1144400,2064.0,1881.0
725,2017/08/10,1895.0,1910.701,1962.0,656000,1975.0,1888.0
726,2017/08/14,1869.0,1875.979,1860.0,500500,1903.0,1849.0
727,2017/08/15,1954.0,1942.478,1906.0,633100,1967.0,1906.0
728,2017/08/16,2014.0,2004.217,1958.0,581700,2035.0,1946.0
729,2017/08/17,2088.0,2050.582,2010.0,567200,2088.0,1991.0
730,2017/08/18,2110.0,2081.059,2027.0,587500,2110.0,2009.0
731,2017/08/21,2129.0,2140.928,2119.0,448600,2170.0,2119.0
732,2017/08/22,2092.0,2098.485,2100.0,398600,2153.0,2052.0
733,2017/08/23,2092.0,2093.923,2120.0,303800,2133.0,2077.0
734,2017/08/24,2117.0,2116.797,2099.0,287200,2140.0,2087.0
735,2017/08/25,2103.0,2109.261,2120.0,172600,2137.0,2097.0
736,2017/08/28,2046.0,2051.37,2094.0,305200,2099.0,2033.0
737,2017/08/29,2086.0,2060.184,2010.0,243400,2087.0,2004.0
738,2017/08/30,2063.0,2074.844,2097.0,242900,2111.0,2052.0
739,2017/08/31,2103.0,2088.553,2092.0,221000,2106.0,2062.0
740,2017/09/01,2068.0,2067.421,2101.0,224700,2107.0,2050.0
741,2017/09/04,1969.0,1968.479,2031.0,443400,2038.0,1935.0
742,2017/09/05,1904.0,1920.496,1979.0,533800,1988.0,1878.0
743,2017/09/06,1905.0,1890.47,1875.0,374900,1915.0,1836.0
744,2017/09/07,1889.0,1911.112,1926.0,298200,1951.0,1875.0
745,2017/09/08,1928.0,1930.877,1927.0,283800,1975.0,1891.0
746,2017/09/11,1937.0,1951.022,1954.0,249600,1987.0,1926.0
747,2017/09/12,1949.0,1948.692,1965.0,303600,1976.0,1930.0
748,2017/09/13,1933.0,1935.267,1961.0,358400,1968.0,1914.0
749,2017/09/14,1916.0,1914.17,1921.0,338900,1950.0,1894.0
750,2017/09/15,1992.0,1970.284,1920.0,376300,1995.0,1911.0
751,2017/09/19,1978.0,1985.674,1997.0,276600,2012.0,1964.0
752,2017/09/20,1950.0,1948.03,1975.0,315800,1982.0,1936.0
753,2017/09/21,1944.0,1942.261,1963.0,314200,1969.0,1929.0
754,2017/09/22,1939.0,1916.798,1939.0,723100,1949.0,1876.0
755,2017/09/25,2008.0,1988.963,1950.0,505100,2018.0,1923.0
756,2017/09/26,1954.0,1961.894,1999.0,446500,1999.0,1936.0
757,2017/09/27,1957.0,1957.213,1980.0,308900,1980.0,1929.0
758,2017/09/28,2095.0,2056.379,1986.0,689600,2098.0,1986.0
759,2017/09/29,2066.0,2080.296,2095.0,360800,2112.0,2059.0
760,2017/10/02,2075.0,2084.101,2085.0,310300,2101.0,2064.0
761,2017/10/03,2117.0,2101.076,2100.0,333500,2117.0,2083.0
762,2017/10/04,2125.0,2113.041,2117.0,337800,2131.0,2081.0
763,2017/10/05,2048.0,2073.363,2106.0,299800,2117.0,2045.0
764,2017/10/06,2030.0,2032.745,2040.0,272200,2066.0,2017.0
765,2017/10/10,2082.0,2054.956,2034.0,310400,2083.0,2009.0
766,2017/10/11,2024.0,2044.002,2100.0,316600,2100.0,2016.0
767,2017/10/12,2027.0,2015.192,2029.0,270900,2036.0,1988.0
768,2017/10/13,2024.0,2015.875,2009.0,183400,2043.0,2001.0
769,2017/10/16,2022.0,2028.567,2024.0,197100,2047.0,2007.0
770,2017/10/17,2004.0,2014.385,2025.0,159300,2044.0,2001.0
771,2017/10/18,2004.0,2000.111,2010.0,212700,2013.0,1985.0
772,2017/10/19,2035.0,2034.99,2021.0,247700,2057.0,2009.0
773,2017/10/20,2032.0,2018.305,2018.0,217100,2039.0,1998.0
774,2017/10/23,2107.0,2103.975,2067.0,566200,2158.0,2022.0
775,2017/10/24,2157.0,2135.412,2107.0,362900,2163.0,2095.0
776,2017/10/25,2186.0,2195.091,2171.0,458300,2218.0,2170.0
777,2017/10/26,2275.0,2260.808,2180.0,422000,2285.0,2180.0
778,2017/10/27,2240.0,2260.174,2287.0,310400,2308.0,2231.0
779,2017/10/30,2267.0,2266.848,2251.0,548600,2287.0,2226.0
780,2017/10/31,2333.0,2332.881,2253.0,487000,2358.0,2253.0
781,2017/11/01,2343.0,2333.854,2333.0,271800,2364.0,2309.0
782,2017/11/02,2347.0,2359.995,2360.0,207400,2398.0,2338.0
783,2017/11/06,2343.0,2357.864,2380.0,357400,2431.0,2310.0
784,2017/11/07,2380.0,2254.221,2245.0,1081100,2380.0,2105.0
785,2017/11/08,2507.0,2502.349,2375.0,853500,2580.0,2375.0
786,2017/11/09,2510.0,2498.276,2505.0,500000,2538.0,2452.0
787,2017/11/10,2474.0,2514.579,2495.0,400800,2578.0,2473.0
788,2017/11/13,2379.0,2397.244,2428.0,409400,2440.0,2366.0
789,2017/11/14,2323.0,2305.145,2349.0,572600,2349.0,2255.0
790,2017/11/15,2248.0,2247.423,2316.0,675300,2320.0,2193.0
791,2017/11/16,2229.0,2216.203,2230.0,892000,2264.0,2163.0
792,2017/11/17,2224.0,2215.979,2269.0,632800,2269.0,2186.0
793,2017/11/20,2228.0,2227.102,2226.0,346000,2253.0,2202.0
794,2017/11/21,2282.0,2286.241,2278.0,366600,2316.0,2261.0
795,2017/11/22,2298.0,2311.569,2322.0,287800,2333.0,2292.0
796,2017/11/24,2257.0,2267.061,2312.0,199200,2312.0,2247.0
797,2017/11/27,2367.0,2361.57,2350.0,590300,2383.0,2328.0
798,2017/11/28,2322.0,2353.436,2395.0,524400,2415.0,2313.0
799,2017/11/29,2139.0,2180.813,2320.0,1016300,2322.0,2122.0
800,2017/11/30,2130.0,2090.541,2126.0,905500,2130.0,2041.0
801,2017/12/01,2175.0,2156.067,2170.0,670500,2185.0,2116.0
802,2017/12/04,2116.0,2120.668,2176.0,470000,2177.0,2088.0
803,2017/12/05,2042.0,2032.293,2085.0,683300,2090.0,2002.0
804,2017/12/06,2039.0,2054.267,2040.0,387400,2097.0,2022.0
805,2017/12/07,2076.0,2068.917,2073.0,271400,2102.0,2045.0
806,2017/12/08,2096.0,2081.554,2070.0,245300,2099.0,2064.0
807,2017/12/11,2086.0,2078.515,2108.0,230400,2108.0,2056.0
808,2017/12/12,2068.0,2082.042,2102.0,238300,2110.0,2062.0
809,2017/12/13,2008.0,2004.087,2061.0,701200,2067.0,1971.0
810,2017/12/14,2028.0,2018.856,2000.0,295700,2040.0,1993.0
811,2017/12/15,2017.0,2018.162,2073.0,500600,2075.0,1998.0
812,2017/12/18,2056.0,2058.123,2060.0,428000,2077.0,2039.0
813,2017/12/19,2027.0,2042.715,2069.0,345500,2080.0,2018.0
814,2017/12/20,2034.0,2032.175,2027.0,287800,2044.0,2013.0
815,2017/12/21,2051.0,2045.303,2034.0,230100,2060.0,2026.0
816,2017/12/22,2042.0,2041.605,2045.0,301800,2053.0,2024.0
817,2017/12/25,2013.0,2022.739,2042.0,378300,2049.0,2003.0
818,2017/12/26,2019.0,2013.275,2000.0,375100,2027.0,1990.0
819,2017/12/27,2068.0,2053.749,2029.0,333300,2075.0,2025.0
820,2017/12/28,2051.0,2049.36,2072.0,268400,2073.0,2030.0
821,2017/12/29,2055.0,2052.045,2047.0,187900,2067.0,2041.0
822,2018/01/04,2091.0,2091.363,2094.0,307500,2105.0,2080.0
823,2018/01/05,2186.0,2165.097,2105.0,705200,2204.0,2103.0
824,2018/01/09,2194.0,2201.668,2232.0,664500,2233.0,2175.0
825,2018/01/10,2181.0,2175.665,2193.0,318900,2199.0,2161.0
826,2018/01/11,2194.0,2182.953,2165.0,377300,2206.0,2142.0
827,2018/01/12,2184.0,2190.753,2198.0,341300,2218.0,2176.0
828,2018/01/15,2233.0,2210.134,2208.0,440600,2234.0,2183.0
829,2018/01/16,2267.0,2247.737,2240.0,461800,2269.0,2224.0
830,2018/01/17,2288.0,2277.818,2253.0,494600,2297.0,2249.0
831,2018/01/18,2257.0,2297.079,2300.0,455900,2337.0,2253.0
832,2018/01/19,2283.0,2269.163,2270.0,235300,2285.0,2255.0
833,2018/01/22,2343.0,2312.521,2301.0,455600,2343.0,2278.0
834,2018/01/23,2351.0,2340.577,2343.0,383000,2360.0,2320.0
835,2018/01/24,2305.0,2323.939,2348.0,386400,2353.0,2291.0
836,2018/01/25,2268.0,2260.33,2270.0,423400,2297.0,2150.0
837,2018/01/26,2268.0,2283.52,2303.0,469800,2347.0,2245.0
838,2018/01/29,2301.0,2311.036,2290.0,416800,2336.0,2272.0
839,2018/01/30,2258.0,2272.913,2317.0,412200,2341.0,2246.0
840,2018/01/31,2265.0,2283.755,2235.0,412600,2307.0,2231.0
841,2018/02/01,2303.0,2296.121,2303.0,435500,2316.0,2273.0
842,2018/02/02,2314.0,2322.354,2332.0,517000,2350.0,2297.0
843,2018/02/05,2247.0,2232.397,2264.0,859200,2275.0,2204.0
844,2018/02/06,1861.0,1866.636,1877.0,1989400,1911.0,1820.0
845,2018/02/07,1859.0,1938.298,2050.0,904400,2050.0,1856.0
846,2018/02/08,1827.0,1833.693,1874.0,738400,1892.0,1796.0
847,2018/02/09,1775.0,1758.236,1717.0,719600,1790.0,1715.0
848,2018/02/13,1760.0,1789.397,1795.0,677900,1840.0,1760.0
849,2018/02/14,1667.0,1680.158,1729.0,805700,1736.0,1622.0
850,2018/02/15,1753.0,1740.519,1688.0,583100,1786.0,1666.0
851,2018/02/16,1811.0,1812.75,1770.0,725900,1843.0,1760.0
852,2018/02/19,1923.0,1890.528,1840.0,673400,1923.0,1835.0
853,2018/02/20,1854.0,1871.997,1885.0,693400,1909.0,1846.0
854,2018/02/21,1869.0,1849.578,1820.0,727600,1894.0,1784.0
855,2018/02/22,1831.0,1842.793,1829.0,463200,1877.0,1824.0
856,2018/02/23,1843.0,1839.286,1823.0,280300,1855.0,1817.0
857,2018/02/26,1875.0,1883.877,1900.0,560500,1909.0,1863.0
858,2018/02/27,1924.0,1921.871,1911.0,412800,1940.0,1900.0
859,2018/02/28,1917.0,1938.621,1916.0,389000,1965.0,1910.0
860,2018/03/01,1888.0,1888.575,1910.0,358200,1914.0,1866.0
861,2018/03/02,1856.0,1853.286,1829.0,309300,1875.0,1828.0
862,2018/03/05,1765.0,1799.132,1856.0,371100,1870.0,1756.0
863,2018/03/06,1836.0,1845.753,1818.0,268600,1879.0,1816.0
864,2018/03/07,1867.0,1855.332,1825.0,353000,1881.0,1802.0
865,2018/03/08,1923.0,1904.784,1888.0,419600,1928.0,1867.0
866,2018/03/09,1928.0,1968.047,1963.0,548400,2027.0,1906.0
867,2018/03/12,1959.0,1960.397,1968.0,223300,1992.0,1937.0
868,2018/03/13,1966.0,1950.083,1961.0,185600,1966.0,1935.0
869,2018/03/14,1964.0,1966.721,1930.0,187500,1988.0,1928.0
870,2018/03/15,1943.0,1936.879,1951.0,168200,1961.0,1910.0
871,2018/03/16,1921.0,1926.762,1950.0,137600,1959.0,1914.0
872,2018/03/19,1888.0,1884.203,1890.0,188900,1920.0,1865.0
873,2018/03/20,1865.0,1851.064,1850.0,145700,1867.0,1827.0
874,2018/03/22,1884.0,1894.585,1879.0,142400,1919.0,1865.0
875,2018/03/23,1765.0,1779.907,1795.0,310200,1813.0,1759.0
876,2018/03/26,1753.0,1711.336,1725.0,275000,1753.0,1671.0
877,2018/03/27,1825.0,1804.669,1800.0,224300,1825.0,1777.0
878,2018/03/28,1760.0,1754.577,1763.0,285500,1789.0,1740.0
879,2018/03/29,1801.0,1794.693,1800.0,245100,1808.0,1767.0
880,2018/03/30,1899.0,1875.824,1825.0,311600,1900.0,1816.0
881,2018/04/02,1915.0,1915.833,1901.0,181800,1927.0,1901.0
882,2018/04/03,1846.0,1860.131,1875.0,204900,1880.0,1846.0
883,2018/04/04,1860.0,1856.378,1865.0,248300,1880.0,1839.0
884,2018/04/05,1904.0,1892.448,1881.0,220200,1908.0,1859.0
885,2018/04/06,1916.0,1912.61,1902.0,258100,1930.0,1889.0
886,2018/04/09,1936.0,1914.478,1886.0,174800,1938.0,1875.0
887,2018/04/10,1945.0,1934.531,1916.0,189600,1955.0,1890.0
888,2018/04/11,1965.0,1975.193,1960.0,267500,1988.0,1958.0
889,2018/04/12,1939.0,1951.675,1958.0,126700,1972.0,1935.0
890,2018/04/13,1987.0,1979.105,1955.0,217900,1989.0,1950.0
891,2018/04/16,1989.0,1987.76,1998.0,131700,2009.0,1970.0
892,2018/04/17,1954.0,1967.933,1990.0,143200,2007.0,1943.0
893,2018/04/18,1989.0,1983.669,1974.0,123100,1998.0,1951.0
894,2018/04/19,1923.0,1958.595,1998.0,227300,2007.0,1922.0
895,2018/04/20,1892.0,1892.784,1906.0,236600,1919.0,1865.0
896,2018/04/23,1833.0,1844.83,1874.0,342000,1879.0,1827.0
897,2018/04/24,1875.0,1861.787,1812.0,208300,1889.0,1812.0
898,2018/04/25,1845.0,1850.59,1856.0,109700,1868.0,1836.0
899,2018/04/26,1908.0,1914.562,1859.0,257500,1943.0,1858.0
900,2018/04/27,1971.0,1947.189,1946.0,311100,1974.0,1908.0
901,2018/05/01,1891.0,1907.653,1932.0,174000,1932.0,1890.0
902,2018/05/02,1923.0,1919.052,1906.0,145100,1944.0,1892.0
903,2018/05/07,1920.0,1917.44,1940.0,65400,1940.0,1895.0
904,2018/05/08,1944.0,1931.655,1915.0,147500,1946.0,1892.0
905,2018/05/09,1960.0,1959.719,1924.0,176600,1981.0,1924.0
906,2018/05/10,1992.0,1991.692,1960.0,269700,2010.0,1939.0
907,2018/05/11,1975.0,1987.492,1973.0,235200,2014.0,1968.0
908,2018/05/14,1910.0,1884.739,1960.0,558000,1976.0,1841.0
909,2018/05/15,2084.0,2045.659,1840.0,1150600,2134.0,1838.0
910,2018/05/16,2098.0,2088.266,2065.0,570100,2125.0,2050.0
911,2018/05/17,2119.0,2130.563,2104.0,530100,2167.0,2095.0
912,2018/05/18,2118.0,2124.141,2120.0,174200,2150.0,2107.0
913,2018/05/21,2133.0,2127.251,2117.0,163900,2143.0,2085.0
914,2018/05/22,2036.0,2061.319,2130.0,342400,2130.0,2029.0
915,2018/05/23,1967.0,1976.261,2020.0,334800,2020.0,1957.0
916,2018/05/24,1884.0,1901.376,1950.0,389500,1952.0,1879.0
917,2018/05/25,1843.0,1856.56,1878.0,276600,1892.0,1842.0
918,2018/05/28,1859.0,1857.274,1888.0,325100,1915.0,1834.0
919,2018/05/29,1817.0,1810.834,1855.0,279900,1856.0,1787.0
920,2018/05/30,1766.0,1761.168,1769.0,367300,1784.0,1731.0
921,2018/05/31,1775.0,1777.992,1798.0,168600,1810.0,1765.0
922,2018/06/01,1781.0,1779.54,1770.0,122800,1792.0,1766.0
923,2018/06/04,1800.0,1805.98,1806.0,114100,1818.0,1793.0
924,2018/06/05,1818.0,1805.919,1814.0,145900,1819.0,1798.0
925,2018/06/06,1819.0,1818.947,1818.0,125400,1830.0,1807.0
926,2018/06/07,1799.0,1798.827,1809.0,184400,1813.0,1787.0
927,2018/06/08,1817.0,1808.724,1800.0,162100,1824.0,1797.0
928,2018/06/11,1796.0,1792.264,1800.0,130500,1801.0,1771.0
929,2018/06/12,1752.0,1759.252,1786.0,320700,1787.0,1748.0
930,2018/06/13,1729.0,1728.786,1751.0,175700,1753.0,1715.0
931,2018/06/14,1720.0,1727.673,1712.0,112700,1740.0,1710.0
932,2018/06/15,1667.0,1680.284,1718.0,248600,1723.0,1666.0
933,2018/06/18,1620.0,1620.253,1649.0,279300,1664.0,1595.0
934,2018/06/19,1587.0,1595.218,1600.0,258900,1626.0,1564.0
935,2018/06/20,1597.0,1567.445,1578.0,171800,1600.0,1540.0
936,2018/06/21,1609.0,1615.533,1603.0,127300,1635.0,1600.0
937,2018/06/22,1571.0,1565.469,1576.0,354000,1590.0,1539.0
938,2018/06/25,1512.0,1539.816,1571.0,176300,1581.0,1510.0
939,2018/06/26,1507.0,1491.318,1483.0,251800,1514.0,1460.0
940,2018/06/27,1496.0,1506.225,1510.0,170000,1528.0,1487.0
941,2018/06/28,1495.0,1482.759,1476.0,126700,1496.0,1459.0
942,2018/06/29,1517.0,1499.559,1500.0,139800,1517.0,1476.0
943,2018/07/02,1518.0,1557.263,1518.0,295100,1595.0,1517.0
944,2018/07/03,1434.0,1453.537,1520.0,347800,1520.0,1417.0
945,2018/07/04,1369.0,1372.779,1404.0,341900,1410.0,1352.0
946,2018/07/05,1308.0,1329.164,1364.0,424000,1369.0,1301.0
947,2018/07/06,1411.0,1384.667,1323.0,386600,1417.0,1323.0
948,2018/07/09,1429.0,1410.265,1400.0,176700,1429.0,1384.0
949,2018/07/10,1447.0,1453.742,1437.0,192700,1484.0,1432.0
950,2018/07/11,1417.0,1416.744,1430.0,143300,1437.0,1395.0
951,2018/07/12,1405.0,1404.879,1395.0,153700,1421.0,1392.0
952,2018/07/13,1426.0,1424.703,1407.0,91600,1436.0,1407.0
953,2018/07/17,1409.0,1410.354,1421.0,104900,1425.0,1391.0
954,2018/07/18,1403.0,1420.42,1436.0,165200,1448.0,1403.0
955,2018/07/19,1431.0,1423.171,1415.0,216200,1437.0,1401.0
956,2018/07/20,1361.0,1385.861,1401.0,408800,1419.0,1354.0
957,2018/07/23,1341.0,1352.012,1350.0,307400,1377.0,1335.0
958,2018/07/24,1348.0,1338.438,1340.0,311100,1356.0,1317.0
959,2018/07/25,1380.0,1358.702,1335.0,323300,1380.0,1332.0
960,2018/07/26,1429.0,1411.936,1398.0,317100,1433.0,1381.0
961,2018/07/27,1441.0,1441.698,1428.0,168800,1455.0,1425.0
962,2018/07/30,1387.0,1399.662,1431.0,199300,1443.0,1382.0
963,2018/07/31,1396.0,1386.911,1380.0,156100,1403.0,1370.0
964,2018/08/01,1409.0,1403.049,1399.0,208900,1416.0,1391.0
965,2018/08/02,1372.0,1390.035,1400.0,235400,1423.0,1363.0
966,2018/08/03,1357.0,1369.172,1365.0,158400,1407.0,1354.0
967,2018/08/06,1319.0,1324.058,1359.0,328300,1369.0,1305.0
968,2018/08/07,1570.0,1536.657,1499.0,1629100,1581.0,1480.0
969,2018/08/08,1587.0,1597.096,1577.0,866000,1641.0,1571.0
970,2018/08/09,1480.0,1517.947,1583.0,435600,1583.0,1472.0
971,2018/08/10,1414.0,1451.126,1458.0,455500,1516.0,1407.0
972,2018/08/13,1297.0,1309.635,1359.0,467400,1362.0,1288.0
973,2018/08/14,1342.0,1325.77,1312.0,254000,1342.0,1300.0
974,2018/08/15,1358.0,1353.347,1350.0,216500,1379.0,1330.0
975,2018/08/16,1352.0,1342.174,1320.0,242700,1362.0,1308.0
976,2018/08/17,1404.0,1387.209,1365.0,222800,1408.0,1353.0
977,2018/08/20,1354.0,1363.438,1380.0,144800,1396.0,1346.0
978,2018/08/21,1345.0,1311.789,1336.0,648300,1349.0,1277.0
979,2018/08/22,1475.0,1439.363,1347.0,582200,1485.0,1345.0
980,2018/08/23,1469.0,1460.438,1482.0,228800,1483.0,1433.0
981,2018/08/24,1473.0,1464.138,1476.0,143900,1483.0,1430.0
982,2018/08/27,1549.0,1542.813,1488.0,282700,1562.0,1488.0
983,2018/08/28,1543.0,1557.645,1565.0,180200,1589.0,1528.0
984,2018/08/29,1580.0,1575.523,1552.0,176000,1589.0,1552.0
985,2018/08/30,1624.0,1617.725,1597.0,311300,1633.0,1597.0
986,2018/08/31,1612.0,1610.554,1592.0,202000,1636.0,1573.0
987,2018/09/03,1565.0,1574.359,1610.0,144800,1610.0,1556.0
988,2018/09/04,1570.0,1581.357,1560.0,164200,1597.0,1560.0
989,2018/09/05,1563.0,1575.543,1576.0,144100,1620.0,1552.0
990,2018/09/06,1516.0,1512.024,1535.0,156300,1535.0,1484.0
991,2018/09/07,1520.0,1535.652,1620.0,526400,1623.0,1428.0
992,2018/09/10,1584.0,1570.256,1524.0,236500,1594.0,1517.0
993,2018/09/11,1600.0,1597.588,1600.0,272300,1615.0,1574.0
994,2018/09/12,1549.0,1555.772,1620.0,257500,1621.0,1525.0
995,2018/09/13,1537.0,1506.505,1503.0,349600,1540.0,1468.0
996,2018/09/14,1579.0,1571.456,1568.0,259700,1590.0,1555.0
997,2018/09/18,1577.0,1565.385,1547.0,170500,1593.0,1522.0
998,2018/09/19,1580.0,1593.745,1600.0,252800,1610.0,1575.0
999,2018/09/20,1574.0,1593.303,1610.0,170700,1623.0,1564.0
1000,2018/09/21,1634.0,1643.718,1601.0,307000,1684.0,1591.0
1001,2018/09/25,1600.0,1579.597,1623.0,317800,1623.0,1547.0
1002,2018/09/26,1597.0,1600.118,1573.0,187800,1616.0,1571.0
1003,2018/09/27,1559.0,1577.053,1608.0,185600,1608.0,1558.0
1004,2018/09/28,1571.0,1572.326,1590.0,143000,1608.0,1557.0
1005,2018/10/01,1594.0,1597.154,1580.0,180900,1614.0,1562.0
1006,2018/10/02,1557.0,1567.929,1605.0,216700,1612.0,1548.0
1007,2018/10/03,1502.0,1517.543,1553.0,192500,1553.0,1502.0
1008,2018/10/04,1511.0,1514.07,1513.0,200700,1538.0,1494.0
1009,2018/10/05,1439.0,1453.929,1496.0,277000,1496.0,1433.0
1010,2018/10/09,1406.0,1401.247,1420.0,183700,1423.0,1381.0
1011,2018/10/10,1413.0,1409.012,1405.0,139500,1426.0,1388.0
1012,2018/10/11,1355.0,1338.771,1323.0,254700,1358.0,1312.0
1013,2018/10/12,1401.0,1390.289,1365.0,162200,1407.0,1349.0
1014,2018/10/15,1373.0,1383.863,1389.0,113300,1405.0,1370.0
1015,2018/10/16,1352.0,1346.705,1358.0,253700,1369.0,1332.0
1016,2018/10/17,1408.0,1406.673,1401.0,169500,1423.0,1392.0
1017,2018/10/18,1412.0,1424.453,1423.0,232900,1449.0,1397.0
1018,2018/10/19,1386.0,1377.128,1373.0,184400,1395.0,1359.0
1019,2018/10/22,1364.0,1346.295,1356.0,324300,1375.0,1311.0
1020,2018/10/23,1279.0,1300.776,1349.0,359800,1351.0,1275.0
1021,2018/10/24,1272.0,1277.491,1296.0,154500,1300.0,1257.0
1022,2018/10/25,1168.0,1183.789,1215.0,324100,1220.0,1160.0
1023,2018/10/26,1139.0,1153.033,1201.0,283000,1206.0,1124.0
1024,2018/10/29,1093.0,1114.876,1130.0,327600,1151.0,1091.0
1025,2018/10/30,1133.0,1112.175,1081.0,388200,1137.0,1074.0
1026,2018/10/31,1245.0,1226.971,1178.0,367400,1255.0,1174.0
1027,2018/11/01,1266.0,1260.208,1231.0,304800,1278.0,1228.0
1028,2018/11/02,1315.0,1297.756,1274.0,310400,1315.0,1266.0
1029,2018/11/05,1239.0,1246.424,1289.0,385600,1289.0,1224.0
1030,2018/11/06,1243.0,1289.53,1299.0,652200,1356.0,1238.0
1031,2018/11/07,1323.0,1320.528,1273.0,525700,1350.0,1240.0
1032,2018/11/08,1349.0,1350.718,1358.0,368400,1375.0,1333.0
1033,2018/11/09,1337.0,1352.841,1355.0,313700,1372.0,1334.0
1034,2018/11/12,1304.0,1313.052,1313.0,236900,1336.0,1290.0
1035,2018/11/13,1263.0,1244.998,1234.0,329700,1275.0,1204.0
1036,2018/11/14,1306.0,1306.753,1275.0,230200,1322.0,1269.0
1037,2018/11/15,1337.0,1340.291,1309.0,187600,1361.0,1304.0
1038,2018/11/16,1297.0,1326.134,1339.0,250900,1365.0,1292.0
1039,2018/11/19,1332.0,1343.454,1302.0,168400,1363.0,1302.0
1040,2018/11/20,1291.0,1296.104,1299.0,190900,1314.0,1278.0
1041,2018/11/21,1342.0,1322.615,1252.0,309100,1350.0,1252.0
1042,2018/11/22,1339.0,1347.939,1351.0,414300,1392.0,1319.0
1043,2018/11/26,1378.0,1368.783,1334.0,177700,1380.0,1326.0
1044,2018/11/27,1401.0,1409.946,1398.0,216000,1426.0,1397.0
1045,2018/11/28,1466.0,1441.758,1410.0,250100,1469.0,1393.0
1046,2018/11/29,1502.0,1504.942,1486.0,284200,1518.0,1485.0
1047,2018/11/30,1535.0,1527.419,1486.0,311800,1554.0,1486.0
1048,2018/12/03,1571.0,1566.026,1530.0,202500,1586.0,1528.0
1049,2018/12/04,1550.0,1553.436,1571.0,201000,1584.0,1531.0
1050,2018/12/05,1525.0,1505.159,1510.0,457700,1539.0,1455.0
1051,2018/12/06,1459.0,1469.866,1508.0,288600,1509.0,1449.0
1052,2018/12/07,1343.0,1390.262,1484.0,522500,1487.0,1338.0
1053,2018/12/10,1249.0,1271.542,1300.0,377000,1330.0,1241.0
1054,2018/12/11,1172.0,1188.806,1239.0,460900,1245.0,1165.0
1055,2018/12/12,1223.0,1200.637,1172.0,394000,1230.0,1158.0
1056,2018/12/13,1268.0,1278.118,1230.0,364200,1316.0,1230.0
1057,2018/12/14,1231.0,1245.662,1260.0,255600,1282.0,1225.0
1058,2018/12/17,1250.0,1251.776,1231.0,282700,1281.0,1231.0
1059,2018/12/18,1220.0,1230.407,1211.0,216700,1260.0,1194.0
1060,2018/12/19,1232.0,1238.452,1227.0,383500,1278.0,1219.0
1061,2018/12/20,1166.0,1192.711,1205.0,372500,1219.0,1161.0
1062,2018/12/21,1119.0,1122.89,1150.0,315300,1158.0,1098.0
1063,2018/12/25,1056.0,1062.429,1059.0,409500,1091.0,1026.0
1064,2018/12/26,1058.0,1061.53,1080.0,254200,1098.0,1037.0
1065,2018/12/27,1150.0,1139.611,1145.0,253800,1154.0,1116.0
1066,2018/12/28,1173.0,1176.041,1139.0,177600,1195.0,1138.0
1067,2019/01/04,1083.0,1075.754,1113.0,285800,1115.0,1056.0
1068,2019/01/07,1192.0,1188.452,1156.0,289400,1208.0,1139.0
1069,2019/01/08,1194.0,1200.12,1193.0,200900,1223.0,1189.0
1070,2019/01/09,1193.0,1197.404,1194.0,121200,1212.0,1189.0
1071,2019/01/10,1192.0,1191.911,1187.0,156300,1206.0,1182.0
1072,2019/01/11,1194.0,1208.894,1200.0,175100,1233.0,1190.0
1073,2019/01/15,1223.0,1201.015,1170.0,136500,1225.0,1155.0
1074,2019/01/16,1180.0,1184.582,1225.0,170000,1225.0,1170.0
1075,2019/01/17,1175.0,1184.594,1185.0,124900,1212.0,1173.0
1076,2019/01/18,1195.0,1191.172,1176.0,152100,1205.0,1168.0
1077,2019/01/21,1216.0,1218.201,1219.0,111100,1230.0,1206.0
1078,2019/01/22,1177.0,1184.77,1216.0,126000,1223.0,1170.0
1079,2019/01/23,1189.0,1178.316,1166.0,98700,1195.0,1149.0
1080,2019/01/24,1200.0,1198.067,1189.0,192400,1203.0,1185.0
1081,2019/01/25,1269.0,1266.375,1211.0,470500,1288.0,1211.0
1082,2019/01/28,1298.0,1301.516,1299.0,197500,1319.0,1284.0
1083,2019/01/29,1251.0,1243.127,1270.0,210500,1274.0,1221.0
1084,2019/01/30,1220.0,1237.393,1255.0,188400,1264.0,1220.0
1085,2019/01/31,1292.0,1280.202,1249.0,242600,1307.0,1249.0
1086,2019/02/01,1215.0,1233.99,1273.0,406900,1291.0,1212.0
1087,2019/02/04,1228.0,1204.85,1222.0,396900,1229.0,1179.0
1088,2019/02/05,1289.0,1232.721,1150.0,792300,1295.0,1150.0
1089,2019/02/06,1295.0,1281.707,1288.0,276800,1302.0,1253.0
1090,2019/02/07,1312.0,1319.838,1308.0,356200,1342.0,1298.0
1091,2019/02/08,1168.0,1203.385,1278.0,392300,1280.0,1162.0
1092,2019/02/12,1252.0,1230.58,1168.0,205900,1254.0,1168.0
1093,2019/02/13,1279.0,1262.852,1268.0,260000,1279.0,1230.0
1094,2019/02/14,1262.0,1275.452,1267.0,108500,1299.0,1257.0
1095,2019/02/15,1207.0,1206.067,1232.0,193900,1238.0,1194.0
1096,2019/02/18,1218.0,1223.042,1246.0,239700,1246.0,1209.0
1097,2019/02/19,1220.0,1224.045,1208.0,77300,1236.0,1207.0
1098,2019/02/20,1209.0,1223.101,1220.0,138300,1248.0,1207.0
1099,2019/02/21,1187.0,1190.712,1202.0,164400,1214.0,1178.0
1100,2019/02/22,1159.0,1162.828,1180.0,203400,1182.0,1152.0
1101,2019/02/25,1170.0,1173.512,1176.0,206900,1188.0,1155.0
1102,2019/02/26,1139.0,1146.369,1175.0,270900,1178.0,1126.0
1103,2019/02/27,1115.0,1120.497,1143.0,238100,1148.0,1109.0
1104,2019/02/28,1088.0,1096.889,1123.0,302800,1128.0,1087.0
1105,2019/03/01,1100.0,1097.408,1094.0,160500,1108.0,1087.0
1106,2019/03/04,1135.0,1123.778,1117.0,229300,1137.0,1110.0
1107,2019/03/05,1137.0,1136.385,1141.0,177600,1155.0,1117.0
1108,2019/03/06,1133.0,1133.738,1133.0,72600,1144.0,1128.0
1109,2019/03/07,1095.0,1094.542,1117.0,224000,1117.0,1078.0
1110,2019/03/08,1047.0,1057.774,1078.0,254500,1087.0,1040.0
1111,2019/03/11,1044.0,1046.848,1051.0,141800,1065.0,1032.0
1112,2019/03/12,1074.0,1075.761,1070.0,92900,1084.0,1062.0
1113,2019/03/13,1049.0,1052.338,1064.0,83500,1069.0,1044.0
1114,2019/03/14,1038.0,1047.517,1057.0,127900,1078.0,1036.0
1115,2019/03/15,1028.0,1036.757,1030.0,130800,1054.0,1022.0
1116,2019/03/18,1069.0,1060.25,1043.0,159000,1071.0,1043.0
1117,2019/03/19,1067.0,1060.416,1069.0,201400,1075.0,1034.0
1118,2019/03/20,1067.0,1064.632,1058.0,137100,1074.0,1054.0
1119,2019/03/22,1106.0,1112.643,1080.0,270600,1131.0,1080.0
1120,2019/03/25,1070.0,1064.887,1063.0,168600,1079.0,1049.0
1121,2019/03/26,1083.0,1075.523,1079.0,147700,1085.0,1053.0
1122,2019/03/27,1099.0,1090.087,1076.0,123600,1103.0,1071.0
1123,2019/03/28,1060.0,1060.984,1080.0,129600,1081.0,1054.0
1124,2019/03/29,1088.0,1075.221,1075.0,182500,1098.0,1055.0
1125,2019/04/01,1118.0,1117.007,1118.0,129300,1130.0,1102.0
1126,2019/04/02,1103.0,1118.609,1130.0,242600,1152.0,1096.0
1127,2019/04/03,1146.0,1143.819,1104.0,203100,1156.0,1104.0
1128,2019/04/04,1194.0,1191.229,1164.0,285300,1206.0,1161.0
1129,2019/04/05,1234.0,1219.953,1199.0,263800,1234.0,1194.0
1130,2019/04/08,1207.0,1221.04,1244.0,217600,1255.0,1200.0
1131,2019/04/09,1219.0,1214.976,1206.0,117300,1226.0,1203.0
1132,2019/04/10,1211.0,1203.617,1200.0,169100,1218.0,1183.0
1133,2019/04/11,1201.0,1198.303,1197.0,163800,1208.0,1181.0
1134,2019/04/12,1222.0,1216.688,1212.0,104700,1227.0,1189.0
1135,2019/04/15,1263.0,1254.38,1229.0,174900,1263.0,1229.0
1136,2019/04/16,1251.0,1244.666,1249.0,124700,1256.0,1232.0
1137,2019/04/17,1304.0,1292.727,1257.0,333500,1314.0,1251.0
1138,2019/04/18,1247.0,1262.304,1302.0,262800,1305.0,1243.0
1139,2019/04/19,1343.0,1319.31,1277.0,294500,1343.0,1274.0
1140,2019/04/22,1305.0,1307.769,1323.0,275200,1327.0,1280.0
1141,2019/04/23,1291.0,1295.57,1310.0,159300,1312.0,1282.0
1142,2019/04/24,1245.0,1262.49,1290.0,119700,1299.0,1245.0
1143,2019/04/25,1277.0,1264.828,1245.0,161600,1281.0,1219.0
1144,2019/04/26,1255.0,1247.444,1260.0,107800,1260.0,1228.0
1145,2019/05/07,1183.0,1200.437,1254.0,195300,1254.0,1177.0
1146,2019/05/08,1125.0,1130.845,1153.0,295500,1165.0,1113.0
1147,2019/05/09,1101.0,1104.711,1120.0,210000,1124.0,1094.0
1148,2019/05/10,1124.0,1122.709,1100.0,204900,1152.0,1095.0
1149,2019/05/13,1080.0,1078.882,1107.0,232700,1107.0,1065.0
1150,2019/05/14,1042.0,1031.599,1026.0,319700,1052.0,1002.0
1151,2019/05/15,1090.0,1075.063,1061.0,217600,1094.0,1046.0
1152,2019/05/16,1075.0,1068.556,1070.0,424900,1104.0,1028.0
1153,2019/05/17,976.0,993.66,1066.0,716900,1069.0,970.0
1154,2019/05/20,928.0,933.906,974.0,413900,976.0,913.0
1155,2019/05/21,876.0,866.778,905.0,828000,906.0,840.0
1156,2019/05/22,930.0,920.12,887.0,475400,937.0,886.0
1157,2019/05/23,930.0,922.86,925.0,534700,939.0,904.0
1158,2019/05/24,941.0,940.063,906.0,369000,955.0,905.0
1159,2019/05/27,923.0,924.701,926.0,162700,939.0,911.0
1160,2019/05/28,916.0,916.294,929.0,202500,935.0,906.0
1161,2019/05/29,886.0,889.779,898.0,235000,905.0,881.0
1162,2019/05/30,927.0,907.225,880.0,310800,927.0,876.0
1163,2019/05/31,896.0,904.862,917.0,146600,921.0,892.0
1164,2019/06/03,866.0,873.293,889.0,285800,896.0,855.0
1165,2019/06/04,898.0,888.655,868.0,233600,898.0,862.0
1166,2019/06/05,941.0,941.825,943.0,285500,954.0,913.0
1167,2019/06/06,915.0,928.021,933.0,193900,946.0,915.0
1168,2019/06/07,911.0,915.363,920.0,265600,939.0,906.0
1169,2019/06/10,929.0,924.944,925.0,168800,932.0,916.0
1170,2019/06/11,942.0,941.072,926.0,126700,949.0,922.0
1171,2019/06/12,945.0,950.644,941.0,130200,962.0,935.0
1172,2019/06/13,920.0,913.11,930.0,227600,931.0,901.0
1173,2019/06/14,920.0,922.267,920.0,121000,931.0,915.0
1174,2019/06/17,893.0,889.564,905.0,218000,907.0,877.0
1175,2019/06/18,883.0,884.388,891.0,149600,903.0,874.0
1176,2019/06/19,937.0,928.746,909.0,215500,939.0,906.0
1177,2019/06/20,927.0,924.077,937.0,204900,944.0,910.0
1178,2019/06/21,945.0,940.765,940.0,214100,954.0,930.0
1179,2019/06/24,922.0,924.7,939.0,174000,939.0,914.0
1180,2019/06/25,909.0,915.833,920.0,123500,932.0,904.0
1181,2019/06/26,912.0,921.025,902.0,146200,937.0,898.0
1182,2019/06/27,957.0,954.722,934.0,242400,970.0,929.0
1183,2019/06/28,966.0,957.539,950.0,135000,966.0,940.0
1184,2019/07/01,1065.0,1043.22,1011.0,566800,1066.0,1009.0
1185,2019/07/02,1068.0,1067.394,1065.0,249800,1078.0,1052.0
1186,2019/07/03,1039.0,1042.416,1058.0,282200,1062.0,1028.0
1187,2019/07/04,1036.0,1031.119,1046.0,251200,1050.0,1022.0
1188,2019/07/05,1055.0,1054.728,1040.0,204600,1067.0,1039.0
1189,2019/07/08,1061.0,1050.44,1044.0,170400,1063.0,1038.0
1190,2019/07/09,1046.0,1047.642,1056.0,125200,1058.0,1040.0
1191,2019/07/10,1049.0,1049.521,1039.0,121800,1058.0,1038.0
1192,2019/07/11,1064.0,1060.843,1054.0,137300,1068.0,1046.0
1193,2019/07/12,1051.0,1051.17,1064.0,137000,1067.0,1043.0
1194,2019/07/16,1051.0,1049.08,1051.0,148400,1058.0,1039.0
1195,2019/07/17,1039.0,1041.342,1038.0,125100,1054.0,1029.0
1196,2019/07/18,999.0,1009.305,1030.0,170300,1030.0,994.0
1197,2019/07/19,1044.0,1039.622,1007.0,226400,1053.0,1007.0
1198,2019/07/22,1099.0,1101.536,1082.0,351100,1120.0,1082.0
1199,2019/07/23,1142.0,1149.391,1108.0,512200,1163.0,1105.0
1200,2019/07/24,1151.0,1148.489,1148.0,169300,1158.0,1133.0
1201,2019/07/25,1215.0,1209.719,1175.0,386300,1227.0,1166.0
1202,2019/07/26,1203.0,1194.587,1193.0,254800,1205.0,1177.0
1203,2019/07/29,1160.0,1172.713,1199.0,305000,1204.0,1150.0
1204,2019/07/30,1192.0,1187.285,1172.0,144400,1199.0,1172.0
1205,2019/07/31,1190.0,1186.63,1177.0,235900,1199.0,1162.0
1206,2019/08/01,1190.0,1187.843,1171.0,82000,1199.0,1171.0
1207,2019/08/02,1135.0,1136.019,1160.0,237300,1160.0,1112.0
1208,2019/08/05,1082.0,1085.5,1113.0,292500,1116.0,1064.0
1209,2019/08/06,1104.0,1045.493,997.0,736700,1120.0,988.0
1210,2019/08/07,1083.0,1086.017,1099.0,287000,1109.0,1066.0
1211,2019/08/08,1076.0,1079.888,1083.0,199200,1101.0,1059.0
1212,2019/08/09,1093.0,1095.325,1094.0,267700,1103.0,1072.0
1213,2019/08/13,1045.0,1052.295,1063.0,189900,1072.0,1045.0
1214,2019/08/14,1074.0,1082.914,1077.0,207100,1102.0,1070.0
1215,2019/08/15,1066.0,1051.169,1028.0,158700,1068.0,1021.0
1216,2019/08/16,1087.0,1085.208,1063.0,178700,1099.0,1059.0
1217,2019/08/19,1141.0,1156.135,1110.0,305200,1180.0,1110.0
1218,2019/08/20,1149.0,1138.771,1134.0,254100,1157.0,1106.0
1219,2019/08/21,1177.0,1167.292,1145.0,234000,1188.0,1139.0
1220,2019/08/22,1141.0,1160.666,1173.0,363700,1195.0,1137.0
1221,2019/08/23,1152.0,1153.478,1150.0,119700,1164.0,1125.0
