,Date,Close,VWAP,Open,Volume,High,Low
0,2014/08/25,1300.5,1300.06,1300.0,1228900,1305.5,1291.0
1,2014/08/26,1293.0,1298.292,1299.0,1149000,1312.0,1290.0
2,2014/08/27,1297.5,1294.855,1300.0,1626900,1305.0,1287.5
3,2014/08/28,1290.0,1290.883,1292.0,1253100,1303.0,1280.5
4,2014/08/29,1290.5,1294.452,1282.5,1641900,1304.5,1282.5
5,2014/09/01,1286.5,1291.911,1298.0,1203500,1308.0,1284.5
6,2014/09/02,1303.5,1300.756,1280.0,2580000,1312.0,1272.0
7,2014/09/03,1308.0,1314.783,1319.0,1936200,1330.0,1305.0
8,2014/09/04,1320.0,1317.461,1315.5,3087000,1328.0,1308.5
9,2014/09/05,1314.5,1321.433,1329.0,2562200,1334.5,1314.0
10,2014/09/08,1332.0,1329.955,1330.5,2714400,1339.5,1321.0
11,2014/09/09,1369.5,1371.797,1350.0,4242600,1390.5,1342.0
12,2014/09/10,1381.0,1379.841,1369.0,2704900,1385.0,1366.0
13,2014/09/11,1408.0,1407.618,1388.5,4724200,1419.0,1383.5
14,2014/09/12,1398.0,1396.971,1401.5,3618500,1402.0,1385.5
15,2014/09/16,1378.0,1381.22,1398.0,1643700,1398.0,1371.0
16,2014/09/17,1357.5,1365.213,1382.0,2502000,1386.0,1356.0
17,2014/09/18,1373.0,1373.434,1370.0,2559800,1381.5,1365.5
18,2014/09/19,1403.5,1398.738,1380.5,2942500,1415.5,1377.5
19,2014/09/22,1397.5,1398.242,1404.0,2222200,1413.5,1391.0
20,2014/09/24,1379.0,1377.507,1377.0,2574000,1384.5,1370.5
21,2014/09/25,1417.5,1413.791,1405.0,2781300,1418.5,1405.0
22,2014/09/26,1409.5,1407.381,1391.0,1753800,1417.0,1391.0
23,2014/09/29,1411.5,1416.38,1418.0,2475500,1430.5,1404.5
24,2014/09/30,1408.5,1404.815,1417.0,2876300,1422.0,1394.0
25,2014/10/01,1391.5,1401.399,1409.5,2061800,1413.5,1391.0
26,2014/10/02,1328.5,1339.181,1372.5,4029500,1375.0,1325.5
27,2014/10/03,1333.5,1329.549,1319.0,2227100,1335.5,1318.5
28,2014/10/06,1366.0,1369.496,1363.5,3092800,1378.5,1355.0
29,2014/10/07,1363.0,1368.209,1371.5,2265500,1379.5,1360.0
30,2014/10/08,1350.0,1348.6,1343.0,2635300,1358.0,1338.0
31,2014/10/09,1325.5,1334.823,1348.5,2179100,1353.5,1324.5
32,2014/10/10,1277.0,1276.129,1283.0,4970400,1295.0,1266.5
33,2014/10/14,1262.0,1262.009,1250.0,4063500,1271.5,1246.0
34,2014/10/15,1274.0,1265.308,1258.0,3129900,1279.0,1245.5
35,2014/10/16,1243.0,1236.836,1238.5,3478900,1246.5,1225.5
36,2014/10/17,1216.0,1223.809,1241.5,4771700,1244.5,1213.0
37,2014/10/20,1262.0,1262.261,1257.5,3249400,1274.5,1245.5
38,2014/10/21,1237.0,1247.019,1269.5,2134600,1275.0,1228.5
39,2014/10/22,1264.5,1260.99,1260.0,2303000,1268.5,1246.5
40,2014/10/23,1268.0,1265.433,1262.0,2054300,1278.5,1250.5
41,2014/10/24,1271.0,1272.431,1282.5,1739900,1284.0,1265.0
42,2014/10/27,1275.0,1273.513,1277.0,2470600,1282.5,1265.0
43,2014/10/28,1269.5,1271.824,1279.5,1284200,1282.5,1261.0
44,2014/10/29,1306.0,1306.945,1288.0,2785200,1319.0,1280.5
45,2014/10/30,1329.5,1326.906,1321.0,4130300,1334.0,1311.0
46,2014/10/31,1407.0,1385.257,1351.0,4901700,1417.0,1346.5
47,2014/11/04,1396.0,1424.846,1490.0,9390200,1490.0,1395.0
48,2014/11/05,1423.5,1411.686,1400.0,5494100,1428.0,1393.5
49,2014/11/06,1412.5,1418.219,1423.0,4065900,1433.5,1406.0
50,2014/11/07,1416.5,1420.39,1428.5,2242200,1428.5,1413.5
51,2014/11/10,1420.5,1414.27,1407.5,1901800,1421.0,1406.0
52,2014/11/11,1433.0,1431.753,1425.0,2109000,1443.5,1419.0
53,2014/11/12,1425.5,1439.667,1450.0,2746200,1456.5,1422.5
54,2014/11/13,1442.0,1434.6,1420.5,3006400,1445.0,1415.5
55,2014/11/14,1447.5,1442.947,1455.0,2942700,1455.0,1428.0
56,2014/11/17,1398.0,1407.826,1440.0,2694000,1440.0,1392.5
57,2014/11/18,1430.5,1420.366,1418.5,2847000,1431.5,1405.5
58,2014/11/19,1433.5,1437.768,1444.5,2492200,1452.5,1424.5
59,2014/11/20,1420.0,1424.493,1435.0,2118600,1438.0,1416.5
60,2014/11/21,1415.0,1410.653,1417.5,2604100,1424.5,1401.5
61,2014/11/25,1446.5,1441.904,1432.5,2093300,1448.0,1428.5
62,2014/11/26,1433.5,1436.97,1441.5,1672100,1447.0,1432.5
63,2014/11/27,1417.0,1420.846,1428.0,1978100,1430.5,1412.0
64,2014/11/28,1438.0,1433.521,1428.5,2693100,1440.5,1422.0
65,2014/12/01,1458.0,1450.367,1445.0,3347800,1461.0,1436.5
66,2014/12/02,1476.0,1467.993,1452.0,2663400,1479.5,1442.5
67,2014/12/03,1465.0,1480.616,1480.0,2621800,1505.5,1462.0
68,2014/12/04,1487.5,1488.005,1486.5,3287800,1508.0,1476.0
69,2014/12/05,1508.5,1500.873,1480.0,2078700,1510.0,1479.5
70,2014/12/08,1498.0,1509.548,1520.0,3285000,1535.0,1495.0
71,2014/12/09,1498.5,1497.996,1487.0,2623900,1507.5,1485.0
72,2014/12/10,1453.5,1466.59,1496.5,3954100,1515.0,1442.0
73,2014/12/11,1439.0,1431.165,1427.5,2620200,1442.5,1412.0
74,2014/12/12,1437.5,1437.021,1428.0,4133000,1455.0,1426.0
75,2014/12/15,1417.5,1420.567,1419.5,3150700,1445.0,1406.0
76,2014/12/16,1393.0,1389.204,1393.0,2759000,1399.5,1377.5
77,2014/12/17,1392.0,1397.311,1389.0,3192100,1415.5,1380.0
78,2014/12/18,1420.0,1429.534,1435.5,2174700,1443.0,1418.5
79,2014/12/19,1476.0,1466.842,1458.0,3223100,1480.5,1450.5
80,2014/12/22,1476.5,1477.706,1474.0,2749400,1489.0,1470.5
81,2014/12/24,1483.0,1491.054,1498.0,1809200,1504.5,1479.0
82,2014/12/25,1474.5,1474.899,1478.0,930100,1483.5,1468.5
83,2014/12/26,1485.5,1478.466,1476.0,1312600,1488.0,1470.0
84,2014/12/29,1468.0,1466.301,1486.0,3033600,1488.5,1447.0
85,2014/12/30,1458.0,1467.845,1475.0,1726800,1481.5,1457.5
86,2015/01/05,1429.5,1433.074,1448.5,2606900,1452.0,1418.5
87,2015/01/06,1371.5,1381.542,1397.0,2495200,1400.0,1371.0
88,2015/01/07,1366.5,1369.542,1367.5,1967500,1380.0,1358.5
89,2015/01/08,1376.5,1378.536,1377.0,1825700,1391.5,1370.5
90,2015/01/09,1387.0,1388.355,1390.5,2255000,1405.5,1378.0
91,2015/01/13,1353.0,1345.05,1369.0,2746800,1369.0,1332.5
92,2015/01/14,1313.0,1321.381,1334.0,2894700,1344.0,1310.5
93,2015/01/15,1313.0,1310.764,1312.5,3134600,1322.5,1303.5
94,2015/01/16,1299.5,1281.891,1254.5,4107400,1300.5,1254.5
95,2015/01/19,1318.0,1317.757,1319.0,2598000,1329.5,1305.0
96,2015/01/20,1330.0,1333.538,1323.5,4941100,1346.0,1322.0
97,2015/01/21,1308.5,1313.818,1335.0,3147600,1339.0,1301.5
98,2015/01/22,1308.5,1304.692,1300.0,2570800,1312.0,1297.5
99,2015/01/23,1362.5,1357.681,1330.0,3773400,1372.0,1324.5
100,2015/01/26,1341.0,1340.201,1342.0,2162600,1352.5,1330.0
101,2015/01/27,1363.5,1361.641,1369.0,2195900,1371.5,1353.0
102,2015/01/28,1367.5,1363.777,1349.0,2750900,1373.0,1343.0
103,2015/01/29,1340.5,1347.828,1350.0,2052400,1362.0,1336.0
104,2015/01/30,1339.5,1351.304,1361.0,3226600,1377.0,1338.5
105,2015/02/02,1308.5,1309.781,1312.0,2069000,1318.5,1303.0
106,2015/02/03,1321.0,1320.243,1317.5,2804700,1332.0,1313.5
107,2015/02/04,1401.0,1388.157,1346.0,6046200,1407.5,1346.0
108,2015/02/05,1403.5,1410.853,1412.0,4941900,1430.0,1394.5
109,2015/02/06,1390.0,1391.666,1406.5,2927900,1411.0,1384.5
110,2015/02/09,1438.0,1425.139,1416.5,3585300,1440.0,1402.0
111,2015/02/10,1455.0,1444.472,1444.0,3362200,1457.0,1427.5
112,2015/02/12,1467.5,1467.077,1455.0,3551400,1479.5,1447.5
113,2015/02/13,1476.0,1484.674,1494.5,2742400,1507.5,1469.5
114,2015/02/16,1535.5,1531.233,1510.5,4078600,1547.0,1506.0
115,2015/02/17,1497.5,1508.693,1532.0,4129400,1544.0,1494.0
116,2015/02/18,1509.0,1509.88,1510.0,3436100,1517.0,1497.0
117,2015/02/19,1537.5,1533.009,1511.5,2323500,1542.0,1511.5
118,2015/02/20,1587.0,1583.555,1550.0,4411300,1596.5,1550.0
119,2015/02/23,1521.5,1540.537,1586.5,4792800,1592.5,1502.0
120,2015/02/24,1522.5,1523.215,1524.5,2872500,1533.5,1513.0
121,2015/02/25,1521.5,1527.839,1540.5,2873900,1549.0,1516.5
122,2015/02/26,1544.5,1536.411,1515.5,2665400,1545.5,1509.0
123,2015/02/27,1553.5,1558.436,1559.5,3432100,1574.0,1548.5
124,2015/03/02,1575.5,1581.022,1573.0,2702100,1592.0,1572.5
125,2015/03/03,1580.0,1576.254,1596.0,2866700,1600.0,1562.0
126,2015/03/04,1591.0,1582.06,1579.5,3366100,1595.0,1556.5
127,2015/03/05,1610.5,1609.95,1595.0,3015200,1625.5,1591.0
128,2015/03/06,1641.0,1638.86,1620.5,3730400,1648.0,1617.5
129,2015/03/09,1627.0,1640.273,1641.0,4237200,1663.0,1621.5
130,2015/03/10,1610.0,1628.18,1643.0,4555000,1664.0,1602.5
131,2015/03/11,1598.5,1598.02,1605.5,3324700,1619.0,1577.5
132,2015/03/12,1654.5,1650.215,1613.0,4253900,1674.0,1601.0
133,2015/03/13,1653.5,1653.696,1655.0,4868200,1664.0,1641.5
134,2015/03/16,1637.0,1641.396,1650.0,1744500,1655.5,1635.5
135,2015/03/17,1642.0,1640.533,1646.0,2714200,1650.0,1626.0
136,2015/03/18,1648.0,1648.126,1644.5,2021300,1669.0,1632.0
137,2015/03/19,1609.0,1610.269,1643.5,3280800,1645.0,1593.5
138,2015/03/20,1613.5,1604.427,1606.5,2996600,1618.5,1591.0
139,2015/03/23,1626.5,1624.082,1608.0,2345800,1642.5,1596.0
140,2015/03/24,1642.0,1640.698,1626.0,3890400,1650.0,1626.0
141,2015/03/25,1663.5,1660.276,1648.0,3702800,1674.5,1646.5
142,2015/03/26,1628.0,1625.172,1649.5,2477300,1653.0,1608.0
143,2015/03/27,1647.0,1657.225,1617.5,4678700,1695.5,1612.5
144,2015/03/30,1654.0,1641.793,1645.5,4373700,1663.5,1602.0
145,2015/03/31,1654.5,1657.781,1668.5,3724800,1670.0,1647.0
146,2015/04/01,1632.0,1639.582,1654.5,2589000,1666.0,1624.5
147,2015/04/02,1671.0,1672.025,1649.5,2460100,1689.5,1643.0
148,2015/04/03,1714.5,1714.357,1697.0,3907700,1737.5,1683.5
149,2015/04/06,1694.5,1698.674,1695.5,1601600,1720.0,1684.5
150,2015/04/07,1738.0,1735.923,1721.0,2465200,1755.0,1715.0
151,2015/04/08,1720.5,1721.31,1754.5,3465000,1762.5,1699.0
152,2015/04/09,1720.0,1716.401,1724.5,2634900,1729.0,1706.5
153,2015/04/10,1713.0,1712.347,1723.0,1966500,1726.0,1696.5
154,2015/04/13,1668.5,1667.379,1701.5,3199100,1704.0,1641.0
155,2015/04/14,1684.5,1688.85,1672.5,2520100,1707.5,1670.5
156,2015/04/15,1709.0,1701.449,1678.0,3015700,1711.0,1678.0
157,2015/04/16,1735.5,1719.976,1703.5,2123200,1735.5,1692.0
158,2015/04/17,1704.0,1706.54,1723.5,3443400,1727.0,1695.5
159,2015/04/20,1697.5,1698.246,1680.0,1677700,1712.0,1675.5
160,2015/04/21,1767.5,1753.174,1718.5,3547100,1771.5,1706.5
161,2015/04/22,1782.0,1787.322,1777.0,2896300,1811.5,1767.0
162,2015/04/23,1770.0,1778.195,1800.0,2816300,1813.5,1753.0
163,2015/04/24,1775.5,1774.905,1769.5,1747900,1792.0,1761.5
164,2015/04/27,1744.0,1742.382,1740.0,1596800,1754.5,1730.0
165,2015/04/28,1791.0,1781.309,1759.5,2676500,1792.0,1751.5
166,2015/04/30,1734.5,1737.663,1729.0,2841500,1757.5,1723.0
167,2015/05/01,1747.5,1735.419,1760.0,2607800,1765.0,1712.5
168,2015/05/07,1773.0,1764.48,1723.0,3338500,1789.0,1723.0
169,2015/05/08,1795.0,1786.435,1771.5,1634200,1803.0,1753.0
170,2015/05/11,1771.0,1790.543,1824.0,1838600,1831.5,1766.0
171,2015/05/12,1809.0,1795.165,1785.0,2216300,1830.0,1763.0
172,2015/05/13,1781.0,1786.906,1796.5,1868900,1813.5,1771.0
173,2015/05/14,1766.0,1790.861,1810.0,1954300,1827.5,1755.5
174,2015/05/15,1683.5,1675.884,1646.0,8597300,1745.5,1637.0
175,2015/05/18,1777.5,1756.199,1710.5,7688900,1783.0,1704.0
176,2015/05/19,1847.0,1831.517,1798.5,5895600,1859.5,1794.5
177,2015/05/20,1808.5,1833.902,1856.5,3549400,1868.0,1805.0
178,2015/05/21,1830.5,1831.383,1827.5,5394200,1855.0,1798.0
179,2015/05/22,1796.5,1799.855,1824.0,3037300,1824.5,1786.5
180,2015/05/25,1842.0,1835.919,1828.0,2491100,1851.0,1807.5
181,2015/05/26,1850.0,1844.739,1840.0,1474800,1855.0,1830.5
182,2015/05/27,1826.5,1821.038,1837.5,2891400,1837.5,1805.5
183,2015/05/28,1869.5,1879.978,1847.5,4053200,1917.0,1832.0
184,2015/05/29,1861.0,1867.178,1865.0,3142600,1890.0,1850.5
185,2015/06/01,1903.0,1881.847,1849.0,2654600,1911.0,1840.5
186,2015/06/02,1858.0,1871.0,1905.0,3266200,1911.0,1850.5
187,2015/06/03,1879.5,1876.947,1846.0,2303300,1900.0,1830.0
188,2015/06/04,1958.5,1949.923,1901.5,3873100,1978.5,1900.0
189,2015/06/05,1915.5,1913.409,1931.5,3205300,1940.0,1902.0
190,2015/06/08,1935.5,1932.633,1930.0,3132800,1956.0,1910.0
191,2015/06/09,1856.0,1876.737,1897.5,3364300,1908.5,1852.5
192,2015/06/10,1837.5,1846.642,1850.5,4380400,1876.0,1823.0
193,2015/06/11,1880.5,1876.573,1864.5,3424600,1889.0,1853.0
194,2015/06/12,1898.0,1875.052,1865.0,4411100,1904.0,1855.0
195,2015/06/15,1921.0,1908.958,1870.0,2140500,1927.5,1860.0
196,2015/06/16,1893.0,1900.077,1908.5,2478800,1936.5,1886.0
197,2015/06/17,1883.0,1885.042,1900.0,2447000,1910.5,1870.0
198,2015/06/18,1835.0,1842.902,1875.0,4686600,1875.5,1823.0
199,2015/06/19,1839.5,1837.984,1860.5,3962000,1861.0,1818.0
200,2015/06/22,1858.5,1846.756,1830.0,3030700,1860.5,1815.5
201,2015/06/23,1909.5,1912.048,1878.5,3490600,1931.5,1874.0
202,2015/06/24,1887.5,1890.035,1918.0,2432600,1918.0,1878.5
203,2015/06/25,1893.5,1895.184,1874.0,2536400,1924.5,1868.0
204,2015/06/26,1904.0,1894.52,1890.5,1635800,1912.0,1868.0
205,2015/06/29,1837.0,1835.355,1816.0,3188900,1858.0,1805.0
206,2015/06/30,1825.0,1822.275,1837.5,3308400,1847.5,1800.5
207,2015/07/01,1840.0,1843.153,1832.5,2888300,1859.0,1822.0
208,2015/07/02,1889.0,1886.592,1868.5,2340500,1896.5,1856.5
209,2015/07/03,1865.0,1865.646,1876.0,2882300,1880.0,1855.0
210,2015/07/06,1795.0,1803.161,1825.0,3703600,1856.0,1782.5
211,2015/07/07,1808.0,1819.754,1825.0,2448500,1839.0,1807.0
212,2015/07/08,1716.5,1755.045,1791.0,3783600,1813.0,1716.5
213,2015/07/09,1724.0,1683.889,1664.0,5599800,1727.0,1645.0
214,2015/07/10,1746.5,1747.843,1730.0,3520100,1769.0,1720.0
215,2015/07/13,1792.0,1789.85,1762.0,2700900,1806.0,1760.0
216,2015/07/14,1835.0,1836.45,1838.0,2680700,1849.0,1815.5
217,2015/07/15,1842.5,1837.981,1847.5,2263600,1850.5,1824.0
218,2015/07/16,1857.0,1857.336,1852.5,3545400,1876.0,1847.5
219,2015/07/17,1895.5,1877.335,1853.5,2831900,1899.0,1838.0
220,2015/07/21,1890.0,1889.188,1900.0,2927800,1916.5,1865.0
221,2015/07/22,1873.0,1872.695,1861.0,2236700,1884.0,1850.5
222,2015/07/23,1906.5,1899.419,1913.0,2591700,1917.0,1880.5
223,2015/07/24,1868.5,1872.575,1889.5,2885800,1892.0,1860.0
224,2015/07/27,1869.0,1866.792,1859.0,1958400,1888.0,1852.5
225,2015/07/28,1832.5,1843.17,1842.5,3037300,1862.0,1832.5
226,2015/07/29,1856.0,1856.017,1838.5,1581300,1868.0,1837.0
227,2015/07/30,1890.5,1889.949,1867.5,1894600,1904.0,1865.5
228,2015/07/31,1889.5,1890.078,1883.5,1184000,1899.0,1872.0
229,2015/08/03,1857.5,1858.944,1906.0,1538100,1908.5,1843.5
230,2015/08/04,1849.0,1848.403,1848.0,2025900,1862.0,1834.0
231,2015/08/05,1838.0,1837.129,1827.0,2282500,1851.5,1820.5
232,2015/08/06,1893.5,1901.337,1885.0,2675300,1917.0,1884.0
233,2015/08/07,1909.5,1904.816,1893.5,2018300,1915.0,1887.5
234,2015/08/10,1932.5,1924.85,1929.5,2485600,1948.0,1898.0
235,2015/08/11,1938.5,1922.85,1877.0,3549200,1961.0,1877.0
236,2015/08/12,1889.5,1903.445,1936.5,2428600,1968.5,1875.0
237,2015/08/13,1893.5,1882.697,1866.5,3397700,1896.5,1859.5
238,2015/08/14,1841.0,1843.056,1879.0,2841300,1879.5,1824.5
239,2015/08/17,1844.5,1848.715,1831.0,2338600,1873.0,1824.0
240,2015/08/18,1859.0,1861.756,1850.5,1746200,1876.0,1843.0
241,2015/08/19,1811.5,1824.215,1844.5,2249000,1859.0,1800.5
242,2015/08/20,1743.5,1754.488,1800.0,3413500,1804.0,1736.5
243,2015/08/21,1658.0,1664.954,1682.0,4362100,1706.5,1645.5
244,2015/08/24,1529.0,1555.52,1593.0,4827900,1599.0,1522.0
245,2015/08/25,1511.5,1532.078,1481.0,5473200,1584.5,1461.5
246,2015/08/26,1563.0,1552.808,1530.5,5761100,1585.5,1518.5
247,2015/08/27,1593.0,1604.762,1599.0,4275100,1629.0,1586.5
248,2015/08/28,1647.0,1639.998,1646.0,3036400,1650.0,1624.5
249,2015/08/31,1634.5,1613.655,1607.0,3909400,1644.0,1590.0
250,2015/09/01,1551.5,1583.066,1614.0,5171400,1614.0,1551.0
251,2015/09/02,1539.0,1543.513,1524.0,2815200,1572.0,1517.0
252,2015/09/03,1558.0,1575.491,1585.0,2563800,1599.0,1554.5
253,2015/09/04,1515.0,1536.887,1585.5,2802600,1587.5,1503.5
254,2015/09/07,1509.5,1502.407,1506.0,1698300,1522.5,1482.5
255,2015/09/08,1475.5,1490.917,1513.0,2385200,1518.5,1472.5
256,2015/09/09,1613.0,1563.241,1519.0,4133700,1613.0,1508.0
257,2015/09/10,1557.5,1556.254,1545.0,2828100,1573.5,1533.0
258,2015/09/11,1532.0,1525.968,1522.5,4069600,1544.5,1511.5
259,2015/09/14,1500.5,1508.3,1544.0,1729300,1544.0,1498.0
260,2015/09/15,1498.5,1513.718,1508.0,2086400,1551.5,1497.0
261,2015/09/16,1502.0,1503.824,1510.5,1725100,1525.5,1490.5
262,2015/09/17,1508.5,1499.784,1514.0,2249200,1514.0,1478.5
263,2015/09/18,1433.0,1437.041,1475.0,5800700,1476.5,1411.0
264,2015/09/24,1409.5,1416.248,1403.5,4186800,1432.0,1400.0
265,2015/09/25,1445.0,1427.585,1419.5,2542600,1445.0,1395.0
266,2015/09/28,1419.5,1424.083,1445.0,1821300,1448.5,1402.5
267,2015/09/29,1366.5,1377.353,1388.0,2578300,1398.0,1364.0
268,2015/09/30,1404.5,1409.128,1392.0,3093300,1421.5,1390.5
269,2015/10/01,1415.0,1409.121,1404.5,2818700,1434.5,1376.5
270,2015/10/02,1420.0,1409.044,1400.0,2484000,1422.5,1388.0
271,2015/10/05,1446.0,1444.096,1444.0,2732600,1466.0,1422.5
272,2015/10/06,1449.0,1463.991,1476.0,2181500,1486.5,1445.5
273,2015/10/07,1481.5,1468.37,1447.0,2562500,1488.5,1430.0
274,2015/10/08,1477.0,1477.484,1481.0,3399000,1487.0,1461.0
275,2015/10/09,1550.5,1534.31,1500.0,3503200,1553.5,1498.5
276,2015/10/13,1512.5,1524.516,1521.0,2693500,1543.5,1511.5
277,2015/10/14,1476.5,1476.044,1503.5,3121400,1522.0,1456.0
278,2015/10/15,1493.0,1486.792,1483.0,3008400,1497.5,1464.0
279,2015/10/16,1550.0,1541.895,1513.0,4377700,1560.5,1500.0
280,2015/10/19,1517.5,1525.988,1550.0,2019800,1557.5,1510.5
281,2015/10/20,1550.0,1536.469,1518.5,2434200,1553.0,1514.5
282,2015/10/21,1599.0,1589.03,1550.0,2989200,1605.0,1546.0
283,2015/10/22,1581.0,1585.616,1574.0,1592100,1601.0,1561.5
284,2015/10/23,1629.0,1630.855,1630.0,2582300,1643.0,1618.0
285,2015/10/26,1636.0,1648.116,1669.0,1915400,1672.0,1632.5
286,2015/10/27,1597.5,1609.495,1628.0,2248400,1640.0,1594.0
287,2015/10/28,1589.0,1587.17,1598.5,1596800,1606.0,1576.0
288,2015/10/29,1595.5,1597.001,1609.5,1532600,1627.0,1581.5
289,2015/10/30,1602.0,1601.008,1600.0,2285000,1624.5,1578.0
290,2015/11/02,1567.0,1566.102,1580.0,1868200,1582.0,1556.0
291,2015/11/04,1644.0,1643.095,1623.0,3757000,1653.0,1618.5
292,2015/11/05,1699.0,1685.275,1671.0,6506400,1707.5,1649.0
293,2015/11/06,1735.5,1727.203,1714.0,4881400,1737.0,1709.0
294,2015/11/09,1795.0,1792.849,1775.0,4188300,1806.5,1763.5
295,2015/11/10,1782.5,1771.265,1767.0,3160100,1787.0,1743.5
296,2015/11/11,1781.5,1780.359,1777.5,2110000,1789.5,1767.5
297,2015/11/12,1798.0,1796.412,1796.0,2713300,1806.0,1774.0
298,2015/11/13,1786.5,1778.45,1786.5,3799600,1806.0,1750.0
299,2015/11/16,1749.5,1747.629,1735.0,2559200,1762.5,1726.0
300,2015/11/17,1747.0,1755.038,1778.0,2622200,1780.0,1747.0
301,2015/11/18,1738.5,1748.963,1762.0,3187500,1771.5,1732.0
302,2015/11/19,1799.0,1789.293,1768.5,4265400,1803.0,1757.0
303,2015/11/20,1800.0,1792.564,1793.0,3172100,1812.0,1780.5
304,2015/11/24,1784.0,1786.11,1800.0,3214500,1809.0,1776.0
305,2015/11/25,1766.0,1768.027,1778.0,1760500,1787.0,1757.5
306,2015/11/26,1778.5,1787.181,1783.0,2121700,1809.5,1775.5
307,2015/11/27,1775.0,1782.162,1781.5,1664500,1794.0,1770.5
308,2015/11/30,1725.0,1736.694,1768.5,2249500,1770.0,1725.0
309,2015/12/01,1753.5,1745.827,1730.0,2078700,1758.5,1719.5
310,2015/12/02,1743.5,1755.535,1755.0,2161800,1770.5,1742.5
311,2015/12/03,1763.5,1759.241,1748.5,2244900,1770.5,1747.0
312,2015/12/04,1737.5,1733.755,1725.0,2017800,1747.0,1723.0
313,2015/12/07,1735.0,1743.67,1758.0,1883700,1760.5,1734.0
314,2015/12/08,1725.5,1739.901,1754.0,2463700,1769.5,1720.5
315,2015/12/09,1681.5,1684.053,1704.0,3412100,1708.5,1667.5
316,2015/12/10,1660.0,1656.87,1656.5,3113000,1677.0,1633.5
317,2015/12/11,1648.0,1644.25,1633.0,3671200,1660.5,1632.0
318,2015/12/14,1618.5,1600.595,1590.0,2894800,1621.0,1580.5
319,2015/12/15,1604.0,1615.176,1636.5,2005100,1644.0,1603.0
320,2015/12/16,1630.5,1635.754,1635.5,4427400,1660.0,1617.0
321,2015/12/17,1663.5,1677.153,1682.5,2781200,1698.5,1658.5
322,2015/12/18,1598.0,1623.95,1651.0,4170200,1689.5,1589.0
323,2015/12/21,1577.0,1566.589,1571.0,3493800,1586.0,1554.0
324,2015/12/22,1595.5,1586.763,1574.0,2631300,1602.0,1571.0
325,2015/12/24,1582.0,1594.525,1618.5,2361500,1624.0,1580.5
326,2015/12/25,1592.5,1594.317,1595.5,1467600,1604.5,1579.5
327,2015/12/28,1603.0,1598.824,1600.5,1901300,1610.0,1583.0
328,2015/12/29,1622.5,1617.57,1599.5,1750500,1630.5,1594.0
329,2015/12/30,1609.0,1617.71,1620.0,2128800,1632.0,1608.5
330,2016/01/04,1574.5,1586.747,1592.0,1767800,1623.0,1565.5
331,2016/01/05,1553.5,1557.09,1560.0,2107200,1576.5,1542.0
332,2016/01/06,1526.0,1535.45,1570.0,2376300,1579.0,1510.5
333,2016/01/07,1488.0,1501.393,1529.5,3003400,1531.5,1481.5
334,2016/01/08,1472.5,1478.046,1465.0,2872200,1507.5,1450.5
335,2016/01/12,1426.0,1438.094,1443.0,3096000,1460.0,1425.5
336,2016/01/13,1454.0,1455.574,1455.0,2978900,1463.5,1443.0
337,2016/01/14,1433.5,1410.033,1418.5,4700900,1438.0,1389.0
338,2016/01/15,1397.0,1411.958,1462.0,4820000,1466.5,1390.0
339,2016/01/18,1393.5,1383.186,1362.0,2306800,1400.0,1356.5
340,2016/01/19,1399.5,1389.84,1384.0,1835000,1404.5,1370.5
341,2016/01/20,1337.5,1357.672,1397.5,2685200,1409.5,1335.5
342,2016/01/21,1307.5,1344.302,1339.0,3280600,1380.0,1307.5
343,2016/01/22,1393.5,1374.173,1377.5,3481100,1397.0,1351.0
344,2016/01/25,1398.5,1400.068,1410.0,2140700,1411.0,1388.0
345,2016/01/26,1362.5,1361.38,1378.5,2219000,1378.5,1344.5
346,2016/01/27,1421.5,1416.71,1392.0,3822800,1439.5,1387.0
347,2016/01/28,1388.5,1397.703,1418.0,1740800,1418.0,1387.0
348,2016/01/29,1357.5,1357.455,1414.0,9436300,1454.5,1299.0
349,2016/02/01,1259.0,1264.126,1327.5,10542600,1330.5,1235.0
350,2016/02/02,1261.5,1259.404,1248.5,8361400,1281.0,1235.5
351,2016/02/03,1225.5,1229.816,1236.0,4402200,1247.5,1212.0
352,2016/02/04,1179.0,1187.085,1200.0,7351100,1209.0,1177.0
353,2016/02/05,1143.0,1143.487,1160.0,5244700,1170.5,1121.5
354,2016/02/08,1144.0,1133.529,1121.5,6010100,1152.5,1098.0
355,2016/02/09,1098.0,1100.508,1093.5,5467800,1116.0,1090.5
356,2016/02/10,1073.0,1078.147,1104.5,5511300,1119.0,1051.5
357,2016/02/12,1022.0,1039.947,1050.0,6621400,1062.0,1018.0
358,2016/02/15,1152.0,1146.364,1172.0,8626700,1172.0,1108.0
359,2016/02/16,1163.0,1161.372,1126.5,5836900,1188.5,1110.5
360,2016/02/17,1130.0,1137.921,1155.0,4763700,1181.5,1111.5
361,2016/02/18,1152.0,1149.856,1160.0,3330500,1169.5,1132.0
362,2016/02/19,1122.0,1121.959,1138.0,2414300,1144.0,1111.5
363,2016/02/22,1116.5,1112.578,1111.0,3490700,1122.5,1100.5
364,2016/02/23,1118.0,1125.568,1122.5,3409300,1146.5,1112.0
365,2016/02/24,1102.5,1096.326,1096.0,2892100,1110.0,1077.0
366,2016/02/25,1128.0,1121.672,1111.0,2845900,1138.0,1097.0
367,2016/02/26,1125.0,1132.828,1150.0,3373100,1161.5,1119.5
368,2016/02/29,1113.5,1131.022,1140.0,3075200,1166.5,1112.0
369,2016/03/01,1108.5,1106.541,1113.5,2976100,1125.0,1092.0
370,2016/03/02,1152.0,1154.152,1146.5,3658600,1169.5,1138.0
371,2016/03/03,1205.0,1201.576,1157.0,3511100,1224.0,1152.0
372,2016/03/04,1195.0,1195.768,1205.0,3108800,1205.0,1184.0
373,2016/03/07,1159.5,1164.503,1188.0,2999200,1188.0,1154.5
374,2016/03/08,1157.5,1153.479,1150.0,4047700,1179.0,1131.5
375,2016/03/09,1109.5,1108.834,1136.5,4287400,1136.5,1096.5
376,2016/03/10,1105.5,1104.743,1120.0,3859700,1129.0,1089.5
377,2016/03/11,1119.5,1103.221,1086.5,4985600,1125.5,1081.0
378,2016/03/14,1173.5,1165.97,1142.0,5435800,1187.5,1120.5
379,2016/03/15,1141.5,1148.67,1172.5,3462200,1172.5,1132.5
380,2016/03/16,1104.5,1105.667,1126.5,3513300,1130.0,1092.0
381,2016/03/17,1101.5,1115.018,1114.5,3500200,1135.5,1093.0
382,2016/03/18,1070.0,1071.45,1091.0,3266100,1110.0,1053.5
383,2016/03/22,1064.0,1067.496,1066.0,4003100,1086.5,1054.0
384,2016/03/23,1058.5,1067.447,1073.5,2425100,1095.0,1057.0
385,2016/03/24,1054.0,1054.792,1056.5,3641300,1062.0,1040.5
386,2016/03/25,1101.0,1089.414,1076.0,3484300,1107.5,1057.5
387,2016/03/28,1110.5,1107.021,1117.0,4121000,1122.5,1086.5
388,2016/03/29,1088.0,1090.53,1098.5,2485300,1107.5,1077.0
389,2016/03/30,1035.0,1043.731,1075.0,5040700,1075.0,1034.0
390,2016/03/31,1049.5,1058.057,1045.5,3943900,1072.5,1045.0
391,2016/04/01,1007.0,1020.115,1044.0,4152700,1046.0,1006.0
392,2016/04/04,1011.5,1011.25,1001.0,3718200,1037.0,991.3
393,2016/04/05,979.6,986.301,1010.0,4489000,1019.5,976.1
394,2016/04/06,975.8,980.999,977.6,5725300,995.1,970.1
395,2016/04/07,982.7,985.066,971.6,5277200,1015.0,959.6
396,2016/04/08,992.9,984.862,967.7,3565300,1014.5,957.1
397,2016/04/11,989.8,983.516,989.1,2526200,996.5,967.9
398,2016/04/12,1022.0,1018.628,990.0,3682700,1033.0,986.6
399,2016/04/13,1059.5,1057.422,1071.0,5040000,1079.5,1028.5
400,2016/04/14,1124.5,1113.146,1086.0,7333800,1128.5,1074.0
401,2016/04/15,1132.0,1129.193,1112.5,5682700,1141.0,1111.0
402,2016/04/18,1078.5,1079.472,1072.5,3371200,1094.0,1070.5
403,2016/04/19,1132.0,1127.29,1115.0,3106400,1137.0,1112.5
404,2016/04/20,1115.0,1122.701,1148.5,3937300,1160.5,1105.0
405,2016/04/21,1144.0,1140.009,1154.0,4413400,1154.0,1120.5
406,2016/04/22,1143.0,1154.088,1128.0,5531800,1184.5,1128.0
407,2016/04/25,1189.0,1188.43,1169.0,4762700,1206.5,1160.5
408,2016/04/26,1160.5,1158.528,1177.5,3381300,1181.5,1143.5
409,2016/04/27,1161.5,1155.433,1157.5,3517700,1166.0,1134.5
410,2016/04/28,1081.5,1116.826,1187.0,5000700,1189.0,1078.5
411,2016/05/02,1033.5,1023.505,1018.5,4018400,1034.0,1006.0
412,2016/05/06,1016.5,1015.618,1031.0,3637300,1047.0,1005.5
413,2016/05/09,1012.5,1014.917,1025.0,2357900,1027.0,1008.5
414,2016/05/10,1039.5,1031.511,1012.5,3101200,1047.5,997.2
415,2016/05/11,1029.5,1040.129,1059.5,2600500,1070.0,1024.5
416,2016/05/12,1015.5,1015.995,1006.0,3836200,1025.5,998.6
417,2016/05/13,992.4,1005.079,1020.0,4319500,1027.0,990.6
418,2016/05/16,983.7,978.58,976.5,7949500,991.7,960.0
419,2016/05/17,1004.0,996.563,983.7,3647300,1006.5,981.0
420,2016/05/18,1014.5,1008.902,994.7,5031900,1026.0,987.1
421,2016/05/19,1034.0,1039.088,1061.0,5574000,1061.0,1028.5
422,2016/05/20,1032.5,1033.877,1025.0,5589100,1046.0,1017.5
423,2016/05/23,1027.0,1021.747,1029.0,2913000,1034.5,1006.0
424,2016/05/24,1016.5,1022.072,1025.5,3058100,1036.5,1015.0
425,2016/05/25,1052.0,1058.089,1038.5,4692100,1069.0,1036.5
426,2016/05/26,1061.5,1072.714,1065.0,4709800,1087.0,1061.5
427,2016/05/27,1095.5,1087.32,1076.5,5428100,1099.0,1070.0
428,2016/05/30,1094.0,1099.38,1108.5,4594000,1116.0,1090.5
429,2016/05/31,1106.5,1109.713,1094.5,6013900,1122.5,1089.5
430,2016/06/01,1089.5,1099.755,1095.0,4317900,1112.0,1085.5
431,2016/06/02,1037.0,1048.89,1077.5,6530700,1078.5,1035.5
432,2016/06/03,1035.0,1031.027,1035.0,3324600,1048.0,1022.0
433,2016/06/06,1018.0,1007.583,1007.5,3349100,1018.0,995.1
434,2016/06/07,1050.0,1044.174,1024.5,3663900,1053.5,1023.5
435,2016/06/08,1035.5,1029.447,1050.0,3777400,1050.0,1014.0
436,2016/06/09,1014.5,1013.017,1026.5,3426000,1030.0,1005.0
437,2016/06/10,1002.0,1001.752,1012.5,4021200,1013.5,990.5
438,2016/06/13,959.7,966.225,980.0,5163200,980.5,958.9
439,2016/06/14,956.6,955.06,954.2,5021300,962.3,946.1
440,2016/06/15,967.2,967.906,956.6,5441200,981.5,945.1
441,2016/06/16,936.2,943.048,953.1,4226100,959.7,930.6
442,2016/06/17,938.9,939.283,952.1,5553500,959.9,929.7
443,2016/06/20,954.2,956.466,959.5,4276400,966.1,946.4
444,2016/06/21,954.7,945.141,940.0,4744900,956.9,923.4
445,2016/06/22,936.4,937.934,948.5,3793900,949.2,931.5
446,2016/06/23,947.4,944.985,937.5,3920200,951.6,930.8
447,2016/06/24,854.8,877.406,960.0,7486800,968.2,845.0
448,2016/06/27,847.0,847.204,862.9,4130700,874.0,832.4
449,2016/06/28,832.5,824.572,819.3,5378100,838.2,805.6
450,2016/06/29,860.1,858.795,859.3,3780900,865.9,849.0
451,2016/06/30,858.9,864.175,875.1,4462900,881.6,855.5
452,2016/07/01,862.5,863.412,869.1,2619800,876.3,858.3
453,2016/07/04,857.2,857.146,854.8,2133500,865.7,846.1
454,2016/07/05,844.6,841.467,848.7,2583900,852.7,832.4
455,2016/07/06,825.1,822.42,832.9,3601700,836.3,812.0
456,2016/07/07,822.4,827.961,826.5,3323500,841.1,819.8
457,2016/07/08,813.0,820.818,829.9,3521300,835.0,812.0
458,2016/07/11,869.8,859.812,842.8,6031900,877.1,838.8
459,2016/07/12,910.0,907.698,893.3,5877700,916.7,890.8
460,2016/07/13,935.8,941.594,949.0,5275000,953.7,934.1
461,2016/07/14,941.0,938.592,940.3,3388600,946.8,924.0
462,2016/07/15,990.9,990.086,965.5,5756600,1015.5,964.2
463,2016/07/19,1006.5,999.675,1017.5,5760100,1029.0,985.8
464,2016/07/20,1003.0,997.292,1004.5,2266800,1008.5,987.6
465,2016/07/21,1018.5,1021.947,1029.5,3102200,1032.5,1010.5
466,2016/07/22,1008.0,1005.177,995.6,2360800,1016.5,988.6
467,2016/07/25,1017.0,1021.57,1021.0,2550300,1036.0,1012.5
468,2016/07/26,992.1,988.741,1003.5,2659400,1003.5,979.6
469,2016/07/27,1015.5,1007.453,989.9,4926900,1039.0,973.8
470,2016/07/28,983.4,986.23,1005.0,3317600,1005.0,977.5
471,2016/07/29,1066.5,1036.176,984.8,8461300,1133.5,980.3
472,2016/08/01,1081.0,1070.383,1096.5,5400200,1096.5,1033.5
473,2016/08/02,1064.0,1064.184,1049.0,5545200,1087.5,1041.0
474,2016/08/03,1024.5,1035.352,1041.0,3652700,1051.0,1020.5
475,2016/08/04,1085.0,1069.535,1025.5,4194200,1096.5,1025.5
476,2016/08/05,1061.0,1069.315,1083.0,3907600,1088.5,1058.5
477,2016/08/08,1144.0,1137.733,1087.0,5691800,1160.5,1079.5
478,2016/08/09,1113.5,1124.508,1150.0,5720500,1153.5,1104.5
479,2016/08/10,1116.5,1110.386,1103.0,4393800,1128.5,1083.5
480,2016/08/12,1104.0,1109.792,1129.0,3247000,1129.5,1094.5
481,2016/08/15,1094.0,1097.842,1095.0,2860700,1113.5,1089.5
482,2016/08/16,1054.0,1070.392,1087.5,3230800,1096.5,1052.5
483,2016/08/17,1136.0,1116.654,1070.0,5016300,1137.0,1070.0
484,2016/08/18,1120.0,1139.29,1128.0,5673800,1164.5,1113.0
485,2016/08/19,1136.5,1135.082,1115.5,4167400,1152.0,1106.0
486,2016/08/22,1127.0,1130.672,1156.0,4111400,1170.0,1115.5
487,2016/08/23,1087.0,1088.74,1113.5,4019600,1115.0,1074.0
488,2016/08/24,1114.5,1114.172,1100.0,2889200,1128.5,1099.5
489,2016/08/25,1126.5,1118.075,1114.0,2681700,1129.0,1097.0
490,2016/08/26,1113.5,1113.576,1114.5,2710100,1126.5,1095.0
491,2016/08/29,1176.0,1177.138,1143.0,3667000,1192.5,1137.5
492,2016/08/30,1173.5,1177.825,1170.0,2538500,1185.5,1165.5
493,2016/08/31,1180.5,1189.814,1198.0,4389700,1217.0,1180.5
494,2016/09/01,1185.0,1179.394,1176.5,2863000,1189.0,1161.5
495,2016/09/02,1218.5,1208.419,1181.0,4142100,1227.0,1170.0
496,2016/09/05,1217.0,1235.142,1243.5,3923300,1259.5,1213.0
497,2016/09/06,1238.0,1237.168,1222.0,2350600,1246.0,1213.0
498,2016/09/07,1176.5,1169.621,1202.5,5512900,1205.0,1144.5
499,2016/09/08,1171.0,1168.472,1176.0,2504600,1180.5,1156.5
500,2016/09/09,1188.0,1183.988,1171.5,3122200,1195.5,1162.0
501,2016/09/12,1212.5,1212.123,1169.0,5906000,1244.0,1169.0
502,2016/09/13,1164.0,1176.611,1212.0,3995600,1216.5,1158.0
503,2016/09/14,1246.0,1234.202,1224.0,10874500,1257.5,1193.0
504,2016/09/15,1217.5,1206.452,1223.5,6083200,1228.5,1176.5
505,2016/09/16,1254.5,1240.705,1207.0,7154900,1272.0,1195.0
506,2016/09/20,1222.0,1238.085,1245.5,6312500,1256.0,1216.5
507,2016/09/21,1317.0,1278.883,1219.0,12035300,1424.0,1187.5
508,2016/09/23,1255.5,1263.541,1260.0,7873700,1297.0,1248.0
509,2016/09/26,1183.0,1196.383,1233.0,5794200,1239.0,1179.0
510,2016/09/27,1167.5,1152.106,1154.5,8330000,1185.0,1112.0
511,2016/09/28,1136.0,1132.114,1138.5,3479500,1146.0,1120.0
512,2016/09/29,1151.5,1160.626,1153.0,3950600,1179.5,1147.5
513,2016/09/30,1129.5,1131.56,1117.5,5499600,1158.0,1103.0
514,2016/10/03,1128.5,1135.616,1145.5,2754200,1150.5,1125.5
515,2016/10/04,1116.0,1126.328,1124.5,4796700,1148.0,1112.5
516,2016/10/05,1163.5,1159.617,1127.5,6104700,1174.5,1127.5
517,2016/10/06,1187.0,1199.92,1177.0,5095700,1222.5,1176.5
518,2016/10/07,1204.5,1203.06,1195.0,4117000,1214.5,1191.5
519,2016/10/11,1197.5,1200.899,1195.0,2544000,1209.5,1194.0
520,2016/10/12,1180.5,1186.59,1176.0,3934200,1204.5,1170.5
521,2016/10/13,1183.5,1188.933,1187.5,3245300,1210.0,1173.0
522,2016/10/14,1208.0,1198.409,1187.5,3324000,1208.5,1181.5
523,2016/10/17,1216.0,1218.949,1212.0,2760100,1236.5,1209.0
524,2016/10/18,1224.0,1215.964,1215.0,2592900,1225.0,1198.0
525,2016/10/19,1212.0,1210.178,1211.5,2520600,1217.0,1201.0
526,2016/10/20,1237.0,1224.538,1217.5,3457200,1237.0,1201.0
527,2016/10/21,1222.0,1231.061,1250.0,3835400,1254.0,1219.0
528,2016/10/24,1220.0,1220.936,1228.0,1581800,1235.5,1211.5
529,2016/10/25,1228.0,1232.144,1231.0,2265600,1245.5,1223.0
530,2016/10/26,1214.5,1211.363,1221.5,3021000,1224.5,1198.5
531,2016/10/27,1213.5,1212.757,1213.5,2302400,1224.5,1202.0
532,2016/10/28,1242.0,1243.943,1229.5,3913900,1256.5,1226.5
533,2016/10/31,1271.0,1263.643,1231.0,4270300,1276.0,1228.5
534,2016/11/01,1287.5,1284.684,1294.0,2611400,1305.0,1268.0
535,2016/11/02,1243.0,1247.533,1262.0,2755300,1263.0,1236.5
536,2016/11/04,1207.5,1208.723,1222.5,2645100,1231.5,1197.0
537,2016/11/07,1234.5,1237.542,1236.0,2325000,1256.5,1231.5
538,2016/11/08,1255.5,1256.265,1247.0,2609900,1263.5,1234.5
539,2016/11/09,1167.0,1202.185,1264.0,7697000,1302.0,1134.5
540,2016/11/10,1319.5,1315.711,1287.0,6248300,1334.0,1283.0
541,2016/11/11,1394.0,1411.543,1439.5,7342100,1442.5,1382.0
542,2016/11/14,1436.0,1427.327,1401.0,5593500,1449.0,1387.0
543,2016/11/15,1397.0,1402.018,1412.0,7900800,1431.5,1392.0
544,2016/11/16,1430.0,1424.36,1424.0,4967500,1436.0,1406.0
545,2016/11/17,1385.0,1373.423,1385.0,8401000,1398.0,1342.5
546,2016/11/18,1393.5,1391.83,1410.0,5562300,1422.0,1371.5
547,2016/11/21,1439.0,1436.151,1418.0,4202600,1449.5,1408.0
548,2016/11/22,1439.0,1434.363,1428.0,2327800,1448.0,1419.5
549,2016/11/24,1444.0,1454.191,1474.0,3041200,1477.5,1440.0
550,2016/11/25,1431.0,1438.82,1450.0,3757600,1465.5,1415.5
551,2016/11/28,1446.0,1422.845,1415.0,3781500,1447.0,1396.0
552,2016/11/29,1435.0,1425.069,1422.5,4209100,1439.5,1403.5
553,2016/11/30,1429.0,1428.359,1442.5,3914200,1442.5,1418.0
554,2016/12/01,1485.0,1482.742,1464.0,4179900,1499.5,1458.0
555,2016/12/02,1491.0,1490.424,1473.0,3861200,1499.5,1473.0
556,2016/12/05,1450.0,1455.88,1470.5,4350900,1475.0,1443.0
557,2016/12/06,1481.5,1479.299,1474.0,3418100,1488.5,1466.5
558,2016/12/07,1493.5,1486.297,1477.5,2882600,1494.0,1474.5
559,2016/12/08,1538.0,1531.343,1532.5,3291100,1546.5,1514.5
560,2016/12/09,1569.5,1556.393,1534.5,4029900,1577.0,1529.0
561,2016/12/12,1557.5,1565.723,1578.0,4872900,1602.0,1537.5
562,2016/12/13,1551.0,1536.2,1548.0,4557900,1551.0,1517.0
563,2016/12/14,1542.5,1538.172,1551.5,2939500,1551.5,1524.0
564,2016/12/15,1578.0,1584.827,1595.0,4845300,1618.5,1563.0
565,2016/12/16,1619.0,1618.169,1617.0,4926500,1632.0,1599.0
566,2016/12/19,1590.0,1594.093,1603.0,3070100,1607.5,1586.0
567,2016/12/20,1559.0,1560.115,1584.0,2635500,1588.0,1547.5
568,2016/12/21,1566.0,1576.042,1575.0,3341200,1596.0,1564.5
569,2016/12/22,1547.0,1546.888,1576.5,2037100,1577.5,1538.0
570,2016/12/26,1540.5,1546.234,1568.0,1105600,1570.5,1538.0
571,2016/12/27,1547.0,1548.922,1539.0,1642400,1561.0,1523.5
572,2016/12/28,1552.0,1547.747,1545.5,1723400,1553.5,1535.5
573,2016/12/29,1540.0,1536.969,1550.5,1927300,1556.5,1526.0
574,2016/12/30,1545.5,1538.24,1528.0,1620100,1550.5,1513.0
575,2017/01/04,1624.0,1609.634,1580.0,3971000,1625.5,1580.0
576,2017/01/05,1642.0,1640.017,1610.0,3222300,1654.0,1610.0
577,2017/01/06,1604.0,1598.716,1594.5,3003300,1607.5,1586.5
578,2017/01/10,1567.5,1579.764,1593.0,2785400,1600.5,1567.0
579,2017/01/11,1589.0,1587.716,1586.5,1706400,1595.0,1578.5
580,2017/01/12,1566.5,1564.579,1570.0,2640600,1581.5,1551.0
581,2017/01/13,1577.5,1569.971,1565.5,1936100,1580.5,1555.5
582,2017/01/16,1553.5,1561.704,1574.0,1589600,1583.5,1548.5
583,2017/01/17,1544.5,1552.484,1561.0,2694900,1567.0,1537.0
584,2017/01/18,1559.5,1542.0,1529.0,2632500,1565.5,1516.5
585,2017/01/19,1596.5,1605.973,1601.0,2815200,1624.0,1592.5
586,2017/01/20,1636.5,1630.156,1602.0,2181300,1647.5,1599.0
587,2017/01/23,1608.0,1609.971,1600.0,2073100,1625.5,1600.0
588,2017/01/24,1575.5,1582.166,1588.5,2185900,1595.0,1573.0
589,2017/01/25,1622.0,1616.907,1615.5,2761800,1625.5,1600.0
590,2017/01/26,1705.0,1692.597,1650.5,4836200,1709.0,1650.0
591,2017/01/27,1721.0,1720.826,1720.0,4396700,1750.0,1706.5
592,2017/01/30,1706.0,1707.669,1702.0,3848400,1718.5,1684.5
593,2017/01/31,1683.5,1688.433,1682.0,4477500,1699.0,1678.0
594,2017/02/01,1697.5,1686.536,1663.0,3101000,1707.5,1642.5
595,2017/02/02,1694.5,1695.383,1708.0,3670600,1719.0,1677.0
596,2017/02/03,1727.0,1738.68,1699.5,5776300,1779.5,1698.0
597,2017/02/06,1743.5,1748.627,1758.5,2892100,1766.0,1732.5
598,2017/02/07,1702.5,1700.828,1715.0,4494700,1719.5,1685.5
599,2017/02/08,1721.5,1712.904,1712.0,2347500,1731.0,1699.0
600,2017/02/09,1720.5,1717.727,1704.0,2723300,1729.0,1691.5
601,2017/02/10,1778.5,1770.782,1770.5,2813600,1785.5,1750.5
602,2017/02/13,1768.0,1776.185,1800.0,2544900,1809.0,1763.5
603,2017/02/14,1731.0,1747.476,1786.0,3193700,1786.0,1727.0
604,2017/02/15,1823.5,1836.895,1841.5,5215800,1862.5,1807.0
605,2017/02/16,1827.5,1824.701,1805.0,2970700,1834.0,1805.0
606,2017/02/17,1808.5,1802.87,1820.0,3215600,1823.0,1793.5
607,2017/02/20,1808.0,1807.037,1793.0,2531700,1822.0,1783.0
608,2017/02/21,1839.5,1831.779,1808.0,1984700,1842.0,1804.0
609,2017/02/22,1832.5,1832.451,1840.5,2352100,1840.5,1821.0
610,2017/02/23,1834.0,1827.552,1848.0,3211600,1851.0,1811.5
611,2017/02/24,1792.0,1799.636,1780.5,5123800,1829.5,1772.0
612,2017/02/27,1733.0,1734.196,1760.5,4912900,1770.0,1707.5
613,2017/02/28,1723.5,1734.984,1747.0,3323800,1762.5,1719.0
614,2017/03/01,1769.0,1759.728,1742.5,3126400,1773.0,1731.0
615,2017/03/02,1809.0,1827.75,1846.5,3952500,1861.5,1806.0
616,2017/03/03,1809.5,1806.78,1816.0,2331700,1821.5,1793.5
617,2017/03/06,1797.5,1797.027,1799.5,1752200,1806.5,1780.5
618,2017/03/07,1800.5,1797.913,1802.5,2236400,1805.0,1786.5
619,2017/03/08,1817.5,1815.87,1825.0,3266800,1825.0,1800.5
620,2017/03/09,1832.0,1832.671,1837.0,2191200,1848.5,1823.5
621,2017/03/10,1924.0,1907.07,1896.5,5509000,1925.0,1882.5
622,2017/03/13,1882.5,1890.673,1915.0,3813000,1919.0,1874.0
623,2017/03/14,1886.5,1883.126,1882.0,2196600,1891.0,1872.5
624,2017/03/15,1883.5,1873.969,1870.0,2383800,1888.5,1858.0
625,2017/03/16,1825.0,1825.176,1815.5,5025700,1843.5,1804.0
626,2017/03/17,1825.0,1807.877,1794.0,5187500,1827.0,1785.0
627,2017/03/21,1772.0,1765.583,1790.0,4329100,1790.5,1749.0
628,2017/03/22,1644.5,1660.663,1657.0,8342700,1694.5,1642.5
629,2017/03/23,1665.0,1653.08,1626.0,4740600,1666.5,1626.0
630,2017/03/24,1689.5,1689.529,1661.5,4381900,1710.5,1661.5
631,2017/03/27,1649.0,1648.446,1649.5,4389200,1662.0,1636.5
632,2017/03/28,1673.0,1672.54,1672.5,3423700,1685.0,1658.5
633,2017/03/29,1651.0,1655.335,1680.0,2463800,1690.0,1636.0
634,2017/03/30,1638.5,1643.647,1642.0,1943800,1657.5,1632.0
635,2017/03/31,1616.0,1634.311,1655.5,2581600,1667.0,1616.0
636,2017/04/03,1605.5,1606.59,1619.0,3262200,1620.5,1592.5
637,2017/04/04,1580.5,1573.773,1586.0,4615300,1593.0,1556.5
638,2017/04/05,1572.0,1567.636,1586.5,3714400,1594.0,1551.5
639,2017/04/06,1555.0,1555.453,1557.5,3477000,1567.5,1545.5
640,2017/04/07,1541.0,1549.269,1574.5,5240700,1579.0,1527.0
641,2017/04/10,1568.0,1561.15,1561.0,2978200,1573.5,1547.0
642,2017/04/11,1570.0,1561.216,1540.5,3408700,1572.5,1537.5
643,2017/04/12,1553.5,1545.686,1544.0,3735900,1553.5,1528.5
644,2017/04/13,1531.5,1515.85,1514.0,4946900,1533.0,1499.0
645,2017/04/14,1542.5,1540.708,1529.5,3519700,1559.5,1510.5
646,2017/04/17,1531.5,1525.657,1514.5,2612500,1542.0,1502.5
647,2017/04/18,1527.5,1542.112,1553.0,3611700,1567.0,1526.0
648,2017/04/19,1531.5,1532.49,1515.0,5029700,1544.5,1510.0
649,2017/04/20,1534.0,1540.923,1536.5,2944700,1557.0,1520.0
650,2017/04/21,1579.0,1573.739,1566.0,3801800,1590.5,1559.0
651,2017/04/24,1576.5,1584.266,1614.0,2833200,1618.5,1570.0
652,2017/04/25,1625.0,1616.58,1583.0,3534700,1632.0,1581.0
653,2017/04/26,1669.0,1663.932,1650.0,4771800,1677.0,1641.5
654,2017/04/27,1675.5,1669.252,1657.0,3248500,1680.5,1653.5
655,2017/04/28,1653.5,1659.884,1684.5,2623100,1691.5,1641.5
656,2017/05/01,1662.0,1657.771,1655.5,1691700,1666.0,1645.5
657,2017/05/02,1667.0,1668.687,1654.5,1772900,1683.0,1647.5
658,2017/05/08,1722.0,1724.752,1730.0,4101500,1737.0,1706.5
659,2017/05/09,1718.0,1718.797,1722.0,2766600,1729.0,1710.5
660,2017/05/10,1732.5,1729.462,1720.0,3784300,1747.0,1712.5
661,2017/05/11,1723.5,1725.26,1731.0,2180000,1734.0,1715.0
662,2017/05/12,1715.5,1712.508,1721.5,1959400,1723.5,1702.0
663,2017/05/15,1680.5,1673.967,1681.0,3715600,1684.5,1630.0
664,2017/05/16,1627.5,1645.406,1696.0,6616400,1698.5,1616.0
665,2017/05/17,1569.0,1576.999,1598.0,5156200,1600.0,1565.0
666,2017/05/18,1507.0,1513.538,1530.5,7179900,1543.0,1500.5
667,2017/05/19,1552.5,1545.262,1528.5,4984400,1561.5,1515.5
668,2017/05/22,1560.0,1561.932,1560.5,3124700,1569.5,1556.5
669,2017/05/23,1549.5,1547.388,1550.5,3190900,1554.5,1539.0
670,2017/05/24,1574.0,1575.483,1575.0,3729800,1582.5,1569.0
671,2017/05/25,1566.5,1566.891,1567.5,2637300,1578.0,1551.5
672,2017/05/26,1564.0,1572.203,1571.0,2879400,1584.0,1560.0
673,2017/05/29,1560.5,1563.612,1564.0,1581500,1570.0,1551.5
674,2017/05/30,1564.5,1560.522,1561.0,2066400,1566.5,1551.0
675,2017/05/31,1567.0,1561.101,1539.5,4753300,1572.0,1534.0
676,2017/06/01,1595.5,1594.971,1570.0,4553700,1603.5,1569.0
677,2017/06/02,1661.0,1653.699,1612.5,4973800,1667.0,1610.0
678,2017/06/05,1608.5,1608.56,1630.0,5377600,1635.0,1596.5
679,2017/06/06,1596.0,1611.042,1596.5,2506400,1624.0,1593.0
680,2017/06/07,1597.0,1586.943,1573.5,3336300,1603.0,1567.0
681,2017/06/08,1635.0,1634.442,1612.5,4760300,1659.0,1612.5
682,2017/06/09,1663.0,1655.793,1635.0,5012000,1671.5,1626.5
683,2017/06/12,1711.5,1726.841,1709.0,6918300,1752.0,1706.5
684,2017/06/13,1713.0,1712.621,1698.0,2568100,1725.5,1692.5
685,2017/06/14,1701.0,1700.224,1705.0,3117700,1709.5,1687.5
686,2017/06/15,1663.5,1661.224,1690.0,4375200,1697.5,1637.0
687,2017/06/16,1678.5,1685.936,1703.5,3234200,1708.5,1672.5
688,2017/06/19,1670.0,1672.775,1679.5,1745100,1682.5,1667.5
689,2017/06/20,1659.5,1678.94,1700.5,3845600,1708.5,1657.0
690,2017/06/21,1657.0,1657.294,1658.5,2616100,1665.0,1648.5
691,2017/06/22,1642.5,1642.998,1657.5,1781600,1660.0,1635.5
692,2017/06/23,1643.5,1643.626,1641.0,1958100,1654.0,1633.0
693,2017/06/26,1628.0,1630.391,1646.5,1945600,1647.0,1624.5
694,2017/06/27,1640.5,1644.238,1636.5,2483700,1659.5,1635.0
695,2017/06/28,1661.0,1673.213,1693.0,4474400,1697.5,1658.5
696,2017/06/29,1686.0,1685.569,1689.5,4403900,1692.0,1671.0
697,2017/06/30,1709.5,1701.998,1678.5,5001000,1711.5,1675.0
698,2017/07/03,1706.0,1703.025,1714.5,2224800,1719.5,1688.0
699,2017/07/04,1719.5,1725.432,1739.5,3032000,1744.0,1710.0
700,2017/07/05,1738.5,1729.005,1719.0,2485800,1741.0,1712.0
701,2017/07/06,1715.5,1724.265,1734.5,3414900,1741.0,1713.5
702,2017/07/07,1740.0,1742.144,1705.0,3843700,1755.5,1705.0
703,2017/07/10,1755.0,1751.788,1750.0,3223200,1758.0,1733.0
704,2017/07/11,1731.5,1733.524,1753.5,2364700,1754.0,1724.5
705,2017/07/12,1724.0,1721.299,1717.0,1766900,1728.0,1712.5
706,2017/07/13,1696.0,1693.747,1721.5,3825900,1725.0,1677.0
707,2017/07/14,1701.5,1704.298,1704.5,2327200,1714.0,1692.5
708,2017/07/18,1674.5,1667.41,1686.5,3485100,1686.5,1655.5
709,2017/07/19,1661.0,1655.904,1661.5,2388200,1666.0,1644.5
710,2017/07/20,1668.0,1668.539,1658.0,1849600,1679.5,1650.5
711,2017/07/21,1659.5,1652.74,1658.0,2449600,1659.5,1636.5
712,2017/07/24,1631.5,1622.705,1642.0,3160100,1643.5,1615.0
713,2017/07/25,1628.5,1634.141,1636.5,1682900,1646.0,1625.5
714,2017/07/26,1648.5,1655.644,1658.0,2671500,1673.0,1644.5
715,2017/07/27,1639.5,1636.399,1638.0,2185000,1650.0,1623.0
716,2017/07/28,1636.5,1634.587,1631.0,2561200,1640.5,1626.0
717,2017/07/31,1632.0,1640.565,1635.0,2272800,1654.5,1625.0
718,2017/08/01,1668.0,1661.525,1640.5,2534400,1672.0,1640.0
719,2017/08/02,1673.5,1677.738,1678.5,1780800,1689.5,1667.0
720,2017/08/03,1688.0,1681.842,1676.5,2300700,1689.0,1670.0
721,2017/08/04,1669.5,1666.706,1673.0,2699800,1674.0,1657.5
722,2017/08/07,1698.5,1701.135,1687.0,2662000,1708.5,1686.5
723,2017/08/08,1684.5,1682.545,1693.5,1980600,1694.0,1674.0
724,2017/08/09,1664.0,1658.752,1680.0,2278700,1684.0,1644.0
725,2017/08/10,1627.0,1627.202,1672.5,3550500,1672.5,1605.0
726,2017/08/14,1582.5,1586.688,1604.0,4101700,1609.5,1575.0
727,2017/08/15,1587.0,1602.448,1600.0,2764800,1627.0,1587.0
728,2017/08/16,1592.0,1595.832,1583.5,1527400,1608.0,1580.0
729,2017/08/17,1584.0,1578.214,1584.5,2384700,1589.0,1558.5
730,2017/08/18,1543.5,1541.643,1556.0,3800200,1556.0,1533.0
731,2017/08/21,1526.0,1526.49,1543.0,2239400,1543.5,1518.0
732,2017/08/22,1529.5,1523.088,1514.0,2026800,1533.5,1503.0
733,2017/08/23,1519.5,1526.153,1548.5,1684300,1552.0,1515.5
734,2017/08/24,1512.0,1512.752,1509.0,1839700,1520.0,1505.0
735,2017/08/25,1522.5,1524.408,1518.5,1828300,1531.0,1511.0
736,2017/08/28,1510.5,1504.886,1525.0,2344200,1525.0,1494.5
737,2017/08/29,1492.5,1483.435,1487.0,3699900,1494.5,1470.0
738,2017/08/30,1495.0,1495.695,1499.0,2216500,1503.0,1488.0
739,2017/08/31,1508.5,1510.752,1506.0,2243600,1523.5,1500.5
740,2017/09/01,1511.0,1506.36,1510.0,2199600,1516.0,1495.5
741,2017/09/04,1500.5,1500.855,1503.5,2055800,1511.5,1494.5
742,2017/09/05,1490.0,1489.577,1502.5,2264300,1514.0,1480.0
743,2017/09/06,1481.0,1476.13,1473.0,2572100,1487.0,1461.0
744,2017/09/07,1484.0,1491.379,1501.5,2400400,1511.5,1482.0
745,2017/09/08,1471.5,1472.956,1477.0,3698600,1485.0,1463.5
746,2017/09/11,1467.5,1484.424,1486.0,3405700,1513.0,1464.0
747,2017/09/12,1521.0,1522.685,1505.5,4704400,1538.5,1504.5
748,2017/09/13,1513.5,1526.969,1535.5,4117100,1545.0,1510.0
749,2017/09/14,1516.0,1516.69,1511.5,3182100,1530.5,1499.0
750,2017/09/15,1521.5,1520.759,1509.0,3858400,1532.0,1499.5
751,2017/09/19,1567.5,1574.821,1553.5,5716000,1594.0,1551.0
752,2017/09/20,1564.0,1562.048,1561.5,3323300,1575.0,1546.5
753,2017/09/21,1569.5,1588.344,1597.0,4670300,1608.5,1566.5
754,2017/09/22,1569.0,1563.733,1573.0,3035000,1576.5,1551.0
755,2017/09/25,1549.0,1551.196,1578.5,4451900,1580.0,1540.5
756,2017/09/26,1535.5,1534.686,1539.0,3831800,1546.5,1526.0
757,2017/09/27,1562.5,1552.648,1531.0,3564800,1565.0,1525.5
758,2017/09/28,1597.0,1601.071,1600.0,7255900,1624.0,1592.0
759,2017/09/29,1633.5,1633.417,1601.0,7224700,1652.5,1597.5
760,2017/10/02,1655.5,1652.915,1648.5,6671100,1676.5,1636.0
761,2017/10/03,1642.5,1641.708,1655.5,3497400,1655.5,1629.5
762,2017/10/04,1649.5,1647.582,1655.0,3608900,1659.0,1637.0
763,2017/10/05,1630.0,1626.905,1641.5,2941900,1642.0,1614.0
764,2017/10/06,1647.5,1651.457,1664.5,3131100,1669.5,1639.5
765,2017/10/10,1660.5,1646.115,1639.0,4853300,1660.5,1621.5
766,2017/10/11,1657.0,1655.246,1653.5,2330700,1661.0,1643.0
767,2017/10/12,1642.0,1636.764,1652.5,3123900,1656.0,1622.0
768,2017/10/13,1633.5,1630.731,1635.0,2989700,1641.5,1620.0
769,2017/10/16,1661.5,1665.489,1651.0,3506400,1679.0,1645.0
770,2017/10/17,1685.5,1683.301,1681.0,3532800,1694.5,1666.0
771,2017/10/18,1674.5,1678.168,1687.5,2465500,1695.5,1671.0
772,2017/10/19,1701.5,1696.511,1681.0,3044100,1704.0,1679.5
773,2017/10/20,1708.5,1706.13,1686.5,3607000,1724.5,1675.0
774,2017/10/23,1734.5,1737.89,1739.0,3109600,1747.0,1726.0
775,2017/10/24,1733.5,1729.883,1732.5,2107400,1736.0,1720.5
776,2017/10/25,1751.5,1763.918,1750.0,4251500,1786.5,1745.0
777,2017/10/26,1766.5,1761.676,1757.0,3254200,1771.5,1743.0
778,2017/10/27,1783.5,1788.058,1787.0,5560000,1803.0,1769.5
779,2017/10/30,1764.0,1764.442,1768.0,8685600,1780.5,1746.5
780,2017/10/31,1748.5,1746.438,1724.0,4136900,1757.0,1722.5
781,2017/11/01,1759.0,1760.671,1753.0,4363700,1777.0,1740.5
782,2017/11/02,1783.0,1775.305,1764.0,2784400,1785.0,1753.5
783,2017/11/06,1759.5,1766.222,1782.5,2360400,1786.0,1756.0
784,2017/11/07,1777.5,1770.954,1743.5,2895700,1790.0,1735.0
785,2017/11/08,1741.0,1739.882,1761.0,4068200,1762.0,1724.0
786,2017/11/09,1753.0,1762.281,1748.0,4392600,1794.0,1732.5
787,2017/11/10,1733.5,1735.259,1726.0,2609600,1746.0,1721.0
788,2017/11/13,1722.5,1728.173,1740.5,2573400,1744.5,1718.5
789,2017/11/14,1710.5,1691.664,1682.5,6618500,1719.0,1650.5
790,2017/11/15,1689.5,1688.147,1713.0,4171300,1718.0,1667.0
791,2017/11/16,1704.0,1697.88,1687.5,2729000,1716.0,1675.5
792,2017/11/17,1720.0,1721.984,1725.0,4669700,1735.0,1711.0
793,2017/11/20,1716.5,1714.779,1719.0,3156000,1729.5,1705.0
794,2017/11/21,1725.0,1728.835,1721.5,2780500,1742.5,1719.0
795,2017/11/22,1730.0,1732.124,1729.5,2436000,1742.0,1716.5
796,2017/11/24,1730.0,1716.845,1709.5,2513800,1731.0,1697.0
797,2017/11/27,1733.0,1732.559,1737.5,2592000,1743.5,1724.5
798,2017/11/28,1753.0,1745.61,1733.0,4852800,1756.0,1724.0
799,2017/11/29,1806.0,1797.845,1780.0,5305700,1812.0,1778.0
800,2017/11/30,1845.5,1849.052,1824.5,8392000,1874.0,1821.5
801,2017/12/01,1842.0,1844.759,1854.5,3243900,1861.0,1830.5
802,2017/12/04,1852.5,1849.451,1850.0,3099900,1860.0,1835.0
803,2017/12/05,1856.0,1854.273,1838.5,3137600,1867.0,1836.5
804,2017/12/06,1852.0,1851.746,1868.5,4523500,1874.0,1829.5
805,2017/12/07,1874.5,1870.056,1864.0,3876800,1877.5,1858.5
806,2017/12/08,1897.5,1892.989,1895.5,5600600,1909.5,1872.0
807,2017/12/11,1922.0,1919.294,1904.5,3735500,1928.0,1901.0
808,2017/12/12,1958.0,1951.154,1930.0,4249900,1961.5,1919.0
809,2017/12/13,1942.5,1952.614,1974.0,5098900,1980.0,1933.5
810,2017/12/14,1904.0,1907.553,1922.0,3456300,1922.5,1894.5
811,2017/12/15,1888.0,1893.921,1907.0,4738500,1925.5,1885.0
812,2017/12/18,1944.5,1937.311,1909.5,3525400,1948.5,1902.0
813,2017/12/19,1939.5,1934.449,1926.0,2626300,1942.0,1922.0
814,2017/12/20,1994.0,1990.664,2000.0,3838100,2017.5,1977.0
815,2017/12/21,1970.5,1978.372,1997.0,2245300,2008.0,1968.5
816,2017/12/22,1965.5,1969.621,1970.0,1624000,1988.0,1961.5
817,2017/12/25,1964.5,1965.632,1967.5,782600,1976.0,1955.0
818,2017/12/26,1957.0,1960.337,1963.5,1046700,1975.0,1953.0
819,2017/12/27,1960.5,1961.522,1961.0,1188000,1974.5,1956.0
820,2017/12/28,1932.0,1938.748,1955.5,1761000,1960.0,1927.5
821,2017/12/29,1927.0,1928.214,1935.0,2128900,1940.0,1920.5
822,2018/01/04,1964.0,1963.727,1965.0,3215800,1974.5,1956.0
823,2018/01/05,1976.0,1975.997,1981.0,2820200,1993.0,1966.5
824,2018/01/09,1992.0,1992.676,1993.5,2749300,2007.0,1982.5
825,2018/01/10,2028.5,2026.637,2017.0,3217000,2040.5,2016.0
826,2018/01/11,2044.5,2035.215,2031.0,3451600,2053.5,2015.0
827,2018/01/12,2032.0,2038.425,2053.0,2688200,2059.0,2025.0
828,2018/01/15,2044.0,2045.045,2049.0,1425300,2066.0,2035.0
829,2018/01/16,2027.5,2030.78,2047.5,1743500,2049.5,2019.0
830,2018/01/17,2031.0,2023.64,2019.5,1952700,2031.5,2010.0
831,2018/01/18,2004.0,2015.698,2056.5,2226200,2060.5,1997.5
832,2018/01/19,2035.5,2023.593,2016.0,1974200,2035.5,2001.0
833,2018/01/22,2067.5,2065.771,2084.5,3795100,2088.0,2049.0
834,2018/01/23,2065.5,2067.404,2091.0,3387600,2095.0,2046.0
835,2018/01/24,2042.5,2058.0,2069.0,2463900,2099.5,2031.0
836,2018/01/25,1995.0,2006.186,2024.0,2625200,2026.5,1993.0
837,2018/01/26,1964.5,1974.446,2000.0,2907500,2000.5,1963.0
838,2018/01/29,1997.5,1997.107,1987.0,2637100,2011.5,1977.5
839,2018/01/30,1973.5,1974.788,1994.0,1895100,1998.0,1958.5
840,2018/01/31,1943.0,1956.157,1948.0,2820000,1978.0,1935.5
841,2018/02/01,1997.5,1980.827,1942.0,2534900,2000.0,1940.0
842,2018/02/02,2021.0,2007.582,1991.5,2301600,2026.0,1983.5
843,2018/02/05,2012.0,2000.508,1990.0,3165700,2017.0,1969.5
844,2018/02/06,1868.5,1859.484,1912.5,5711400,1921.0,1832.0
845,2018/02/07,1898.0,1924.669,1925.5,4178200,1976.5,1895.5
846,2018/02/08,1921.0,1916.824,1921.0,2851900,1929.5,1896.5
847,2018/02/09,1866.5,1855.963,1860.0,3147200,1878.0,1834.5
848,2018/02/13,1837.5,1853.529,1896.5,2862600,1898.0,1827.5
849,2018/02/14,1806.5,1820.78,1823.0,2975400,1861.0,1805.5
850,2018/02/15,1854.0,1854.381,1834.5,3554300,1879.0,1821.0
851,2018/02/16,1839.0,1849.106,1847.0,1866500,1869.5,1836.0
852,2018/02/19,1848.5,1844.984,1863.0,1700100,1864.0,1832.0
853,2018/02/20,1806.5,1807.398,1827.0,2694700,1834.5,1787.5
854,2018/02/21,1776.0,1777.007,1808.0,3330300,1815.5,1757.5
855,2018/02/22,1803.0,1795.073,1764.0,2737900,1810.0,1764.0
856,2018/02/23,1804.5,1798.227,1792.0,1431800,1807.5,1776.0
857,2018/02/26,1784.5,1796.964,1819.0,2012900,1825.0,1782.5
858,2018/02/27,1795.5,1797.073,1794.0,2226800,1809.0,1788.0
859,2018/02/28,1779.5,1789.322,1788.5,1932200,1806.0,1779.5
860,2018/03/01,1739.0,1741.816,1747.5,1930700,1763.0,1729.5
861,2018/03/02,1699.5,1696.148,1695.5,3116300,1707.0,1683.0
862,2018/03/05,1692.0,1691.662,1683.0,2220900,1701.0,1679.0
863,2018/03/06,1692.0,1707.039,1727.5,1864200,1733.0,1692.0
864,2018/03/07,1665.0,1668.405,1682.0,3268000,1692.5,1651.0
865,2018/03/08,1661.5,1664.886,1686.0,1674400,1688.5,1656.5
866,2018/03/09,1683.5,1690.114,1678.0,3391700,1716.0,1668.5
867,2018/03/12,1715.0,1711.686,1718.0,2015300,1721.5,1696.5
868,2018/03/13,1703.5,1695.181,1707.0,2066500,1710.5,1685.0
869,2018/03/14,1726.5,1721.395,1685.5,2975200,1758.5,1685.0
870,2018/03/15,1708.5,1703.111,1717.5,2081600,1720.0,1689.0
871,2018/03/16,1701.5,1703.6,1718.0,2548200,1718.0,1699.0
872,2018/03/19,1700.0,1696.936,1691.0,1794400,1705.5,1686.0
873,2018/03/20,1720.5,1717.811,1700.5,2121200,1725.5,1697.5
874,2018/03/22,1720.5,1709.691,1698.0,2464300,1725.5,1690.5
875,2018/03/23,1657.5,1657.997,1671.0,3489400,1701.5,1646.5
876,2018/03/26,1652.0,1641.044,1634.0,2844500,1656.0,1621.0
877,2018/03/27,1703.0,1697.875,1672.5,2692800,1716.0,1667.5
878,2018/03/28,1688.5,1670.059,1652.5,2826200,1690.5,1646.5
879,2018/03/29,1673.5,1673.17,1705.0,2962500,1717.0,1656.0
880,2018/03/30,1688.5,1680.699,1685.5,2348300,1690.5,1664.0
881,2018/04/02,1679.5,1688.326,1681.0,1634000,1702.0,1679.0
882,2018/04/03,1652.5,1646.629,1654.5,3095800,1659.5,1633.5
883,2018/04/04,1663.0,1658.208,1651.0,2423300,1670.5,1639.5
884,2018/04/05,1668.5,1671.083,1676.5,2107700,1688.5,1651.5
885,2018/04/06,1654.5,1657.723,1661.0,1890400,1669.5,1646.5
886,2018/04/09,1682.0,1678.827,1655.5,1511100,1687.5,1653.0
887,2018/04/10,1695.5,1689.746,1662.5,1588800,1706.0,1658.5
888,2018/04/11,1688.0,1696.593,1696.0,1570500,1711.0,1687.5
889,2018/04/12,1672.0,1673.723,1677.0,1200900,1682.0,1667.5
890,2018/04/13,1705.5,1705.164,1681.5,1585700,1714.5,1681.5
891,2018/04/16,1705.0,1702.281,1710.0,1109600,1713.0,1691.0
892,2018/04/17,1676.5,1681.703,1694.5,1218200,1701.5,1673.5
893,2018/04/18,1695.5,1691.312,1674.0,1757600,1703.0,1669.0
894,2018/04/19,1702.0,1708.334,1705.0,1229200,1721.5,1692.0
895,2018/04/20,1738.0,1732.626,1713.5,2252500,1743.0,1710.5
896,2018/04/23,1811.5,1824.789,1818.0,4094700,1847.5,1805.5
897,2018/04/24,1847.5,1848.81,1861.0,4344500,1869.0,1833.0
898,2018/04/25,1885.5,1872.442,1849.5,3968700,1886.5,1846.5
899,2018/04/26,1897.0,1895.095,1895.0,3885900,1916.0,1880.5
900,2018/04/27,1859.0,1873.536,1909.5,3691200,1915.0,1852.0
901,2018/05/01,1844.5,1850.721,1858.0,1763500,1878.5,1837.5
902,2018/05/02,1840.5,1833.72,1843.0,1915600,1845.5,1818.5
903,2018/05/07,1794.5,1791.601,1842.5,2618900,1843.0,1771.5
904,2018/05/08,1809.0,1810.667,1789.0,1525700,1825.5,1785.5
905,2018/05/09,1805.0,1802.869,1803.0,1027200,1808.5,1791.5
906,2018/05/10,1809.5,1810.358,1810.0,1313300,1826.0,1803.0
907,2018/05/11,1816.0,1810.778,1807.0,1831400,1824.5,1797.0
908,2018/05/14,1827.5,1824.741,1813.0,1094300,1841.0,1794.0
909,2018/05/15,1860.5,1863.14,1899.5,2049500,1899.5,1844.0
910,2018/05/16,1867.5,1881.027,1861.0,2901600,1933.5,1860.0
911,2018/05/17,1906.0,1894.909,1867.5,2936500,1916.5,1858.5
912,2018/05/18,1950.0,1939.644,1918.5,2975400,1956.5,1917.5
913,2018/05/21,1923.5,1932.392,1944.5,2446200,1948.5,1923.5
914,2018/05/22,1872.5,1876.984,1893.0,2763800,1899.5,1863.0
915,2018/05/23,1853.5,1860.622,1865.5,2772300,1887.5,1849.5
916,2018/05/24,1805.0,1811.676,1824.5,3398800,1838.5,1799.0
917,2018/05/25,1801.5,1798.296,1795.0,2357200,1806.0,1790.5
918,2018/05/28,1800.0,1786.576,1794.5,2283400,1802.5,1772.0
919,2018/05/29,1782.5,1778.831,1779.5,2500200,1786.0,1767.0
920,2018/05/30,1733.0,1730.613,1727.0,3824800,1738.0,1718.5
921,2018/05/31,1717.0,1719.949,1733.0,7999800,1735.5,1712.5
922,2018/06/01,1745.5,1733.629,1708.5,3715700,1753.5,1695.5
923,2018/06/04,1800.0,1787.457,1761.5,3173900,1803.0,1751.5
924,2018/06/05,1807.5,1802.066,1800.0,2057900,1808.5,1789.0
925,2018/06/06,1791.5,1795.276,1799.0,1938400,1803.0,1789.0
926,2018/06/07,1790.0,1803.376,1803.0,2459700,1823.0,1788.0
927,2018/06/08,1793.5,1794.715,1782.5,2800400,1807.5,1778.0
928,2018/06/11,1810.5,1807.843,1781.0,2385000,1824.5,1776.5
929,2018/06/12,1769.5,1786.029,1830.0,3225900,1839.0,1767.0
930,2018/06/13,1788.5,1791.149,1766.5,2406400,1801.0,1761.0
931,2018/06/14,1783.5,1785.714,1788.5,2217800,1797.0,1767.0
932,2018/06/15,1757.5,1761.884,1793.0,3077800,1793.0,1750.5
933,2018/06/18,1715.5,1713.102,1750.0,2984000,1750.5,1703.5
934,2018/06/19,1705.5,1705.689,1690.5,2636000,1721.5,1682.0
935,2018/06/20,1695.5,1685.551,1694.0,2651700,1698.5,1667.0
936,2018/06/21,1690.5,1686.483,1675.0,2605500,1697.0,1662.5
937,2018/06/22,1677.0,1672.645,1670.5,2954100,1679.0,1656.0
938,2018/06/25,1676.0,1680.431,1682.0,2018000,1694.5,1670.5
939,2018/06/26,1695.0,1684.847,1667.5,2290200,1702.5,1655.0
940,2018/06/27,1691.0,1682.195,1681.0,1577200,1697.5,1658.5
941,2018/06/28,1666.5,1668.699,1687.5,2184200,1693.5,1660.5
942,2018/06/29,1664.5,1658.741,1664.5,2470800,1670.0,1642.5
943,2018/07/02,1622.0,1633.183,1656.0,3138200,1660.5,1617.0
944,2018/07/03,1623.5,1618.589,1634.0,2680100,1639.5,1603.5
945,2018/07/04,1608.5,1614.905,1615.5,1467800,1626.0,1608.0
946,2018/07/05,1583.5,1586.158,1608.0,2438500,1617.5,1576.5
947,2018/07/06,1586.0,1588.997,1586.0,1832900,1596.0,1580.0
948,2018/07/09,1593.0,1592.471,1587.0,1771400,1603.0,1579.0
949,2018/07/10,1618.5,1619.916,1611.0,3351400,1631.5,1599.5
950,2018/07/11,1592.0,1587.234,1593.5,1570500,1596.0,1575.0
951,2018/07/12,1594.0,1593.651,1594.5,1520400,1600.5,1581.5
952,2018/07/13,1607.0,1606.981,1596.5,2105900,1617.0,1589.5
953,2018/07/17,1626.5,1624.86,1617.0,1858000,1638.5,1606.5
954,2018/07/18,1616.5,1622.942,1630.5,1720000,1637.5,1615.0
955,2018/07/19,1650.5,1644.404,1620.0,3105200,1655.0,1618.5
956,2018/07/20,1610.0,1609.57,1634.5,2490700,1634.5,1599.5
957,2018/07/23,1659.0,1672.475,1643.0,5256900,1700.5,1642.0
958,2018/07/24,1684.5,1699.894,1678.0,4022600,1724.5,1675.0
959,2018/07/25,1685.0,1682.145,1684.5,2698700,1704.5,1668.5
960,2018/07/26,1717.5,1715.971,1694.5,3261300,1729.0,1691.5
961,2018/07/27,1732.5,1729.103,1732.0,2233300,1741.5,1718.0
962,2018/07/30,1720.0,1723.562,1736.0,2077200,1745.5,1710.5
963,2018/07/31,1665.0,1695.113,1732.5,5486400,1752.0,1659.5
964,2018/08/01,1772.5,1735.121,1673.5,4261700,1781.5,1660.0
965,2018/08/02,1778.0,1792.138,1789.0,3552700,1816.5,1772.5
966,2018/08/03,1742.5,1751.294,1774.5,2329200,1781.5,1736.0
967,2018/08/06,1707.0,1710.652,1732.5,2244100,1736.0,1700.0
968,2018/08/07,1737.0,1723.297,1718.0,2465200,1741.5,1702.5
969,2018/08/08,1729.0,1730.966,1726.5,1603600,1746.0,1719.0
970,2018/08/09,1710.0,1709.54,1732.0,1822200,1732.0,1695.0
971,2018/08/10,1664.5,1670.8,1699.5,2755100,1705.0,1661.5
972,2018/08/13,1594.5,1597.772,1641.5,3722500,1642.5,1576.5
973,2018/08/14,1608.0,1601.472,1600.0,2514200,1612.5,1588.0
974,2018/08/15,1603.0,1606.094,1617.5,1567200,1631.5,1592.0
975,2018/08/16,1609.0,1593.956,1580.0,2529500,1609.0,1560.0
976,2018/08/17,1627.0,1625.836,1616.5,1961200,1635.5,1601.5
977,2018/08/20,1652.0,1645.81,1627.0,1959700,1656.0,1623.0
978,2018/08/21,1638.5,1635.729,1633.5,1096800,1641.5,1622.5
979,2018/08/22,1654.0,1656.105,1650.5,1442000,1664.0,1639.0
980,2018/08/23,1654.5,1652.647,1650.0,992600,1662.0,1645.0
981,2018/08/24,1663.5,1668.762,1672.0,1052300,1685.5,1660.5
982,2018/08/27,1678.0,1677.406,1669.5,1422800,1685.0,1663.5
983,2018/08/28,1680.0,1685.19,1690.0,1372500,1697.0,1679.5
984,2018/08/29,1718.0,1715.38,1682.0,2493800,1728.0,1682.0
985,2018/08/30,1696.0,1699.539,1726.0,1835500,1727.0,1690.0
986,2018/08/31,1689.5,1692.469,1695.5,1837700,1699.0,1677.0
987,2018/09/03,1655.0,1654.083,1677.5,2055100,1684.0,1641.0
988,2018/09/04,1653.0,1655.689,1661.0,1648700,1667.5,1647.5
989,2018/09/05,1643.0,1647.84,1655.0,2804200,1659.0,1639.0
990,2018/09/06,1619.0,1625.931,1642.0,2041000,1644.0,1617.5
991,2018/09/07,1614.0,1614.736,1618.5,3148900,1630.5,1600.5
992,2018/09/10,1649.5,1642.924,1610.5,2334400,1654.5,1603.5
993,2018/09/11,1641.0,1636.263,1647.0,1886100,1648.5,1621.0
994,2018/09/12,1623.5,1623.364,1632.5,1769200,1633.0,1613.0
995,2018/09/13,1632.5,1637.383,1623.0,1553700,1653.0,1615.5
996,2018/09/14,1647.5,1647.927,1650.0,2794100,1656.5,1640.5
997,2018/09/18,1727.0,1719.063,1659.0,3768600,1736.5,1658.5
998,2018/09/19,1787.0,1790.866,1773.5,3771500,1806.0,1773.0
999,2018/09/20,1799.5,1805.371,1816.5,2214700,1826.0,1793.0
1000,2018/09/21,1859.0,1853.762,1825.5,4297300,1872.5,1803.0
1001,2018/09/25,1889.0,1880.657,1873.5,3091800,1891.0,1852.0
1002,2018/09/26,1877.0,1875.978,1884.0,2514400,1888.5,1862.0
1003,2018/09/27,1854.0,1857.72,1857.0,2022400,1871.0,1843.5
1004,2018/09/28,1875.0,1881.65,1870.0,2756300,1905.0,1862.5
1005,2018/10/01,1912.0,1905.39,1872.0,2545800,1922.5,1865.5
1006,2018/10/02,1923.0,1933.533,1930.0,2571600,1950.0,1916.0
1007,2018/10/03,1894.0,1903.462,1900.5,1817800,1923.0,1894.0
1008,2018/10/04,1966.5,1967.929,1988.5,4189200,1999.5,1946.5
1009,2018/10/05,1995.5,1998.521,1978.5,3921100,2014.0,1978.5
1010,2018/10/09,1947.5,1954.325,1974.0,3099000,1978.5,1934.5
1011,2018/10/10,1986.5,1981.426,1947.5,2554500,1998.5,1942.0
1012,2018/10/11,1918.5,1921.307,1917.0,3499200,1953.5,1902.5
1013,2018/10/12,1886.0,1873.057,1879.0,2936000,1892.5,1847.5
1014,2018/10/15,1884.5,1879.831,1851.5,1884200,1893.5,1850.5
1015,2018/10/16,1901.5,1891.524,1863.5,1686600,1904.5,1856.0
1016,2018/10/17,1910.0,1910.088,1928.0,1933300,1937.0,1891.5
1017,2018/10/18,1924.0,1931.173,1931.0,1795700,1946.5,1919.5
1018,2018/10/19,1930.5,1927.807,1899.0,1772200,1939.0,1889.0
1019,2018/10/22,1930.0,1928.088,1914.0,1468800,1944.5,1908.0
1020,2018/10/23,1882.0,1888.261,1926.0,2682300,1932.5,1867.5
1021,2018/10/24,1846.5,1847.358,1887.5,3078800,1894.0,1822.0
1022,2018/10/25,1771.0,1780.393,1792.0,3455500,1800.0,1763.0
1023,2018/10/26,1770.0,1764.638,1771.5,2698300,1777.0,1741.5
1024,2018/10/29,1748.5,1750.688,1783.5,2355900,1791.5,1725.5
1025,2018/10/30,1779.0,1772.567,1739.0,2414200,1787.0,1736.5
1026,2018/10/31,1819.0,1808.819,1801.5,2007200,1819.0,1772.5
1027,2018/11/01,1844.0,1842.484,1811.0,2269800,1857.5,1802.0
1028,2018/11/02,1872.5,1857.006,1852.5,2560400,1873.5,1825.5
1029,2018/11/05,1864.0,1876.522,1870.0,1972200,1893.5,1859.5
1030,2018/11/06,1893.5,1889.673,1860.0,2241800,1906.0,1850.0
1031,2018/11/07,1848.0,1871.152,1900.5,3118400,1913.0,1836.5
1032,2018/11/08,1886.0,1894.351,1884.0,1749000,1908.0,1881.0
1033,2018/11/09,1881.0,1885.177,1886.5,1160400,1910.5,1870.5
1034,2018/11/12,1870.5,1871.391,1856.0,1487800,1881.0,1853.0
1035,2018/11/13,1820.5,1802.983,1813.5,2785800,1825.5,1769.5
1036,2018/11/14,1828.0,1835.376,1835.0,1892600,1855.5,1822.0
1037,2018/11/15,1763.0,1761.172,1788.0,3948300,1837.5,1730.5
1038,2018/11/16,1743.0,1751.589,1761.5,2640200,1784.0,1740.5
1039,2018/11/19,1682.5,1683.151,1730.0,4161900,1737.0,1668.5
1040,2018/11/20,1671.0,1666.221,1681.0,2646800,1691.5,1652.0
1041,2018/11/21,1636.5,1634.245,1641.5,2184600,1657.0,1624.5
1042,2018/11/22,1631.5,1620.864,1649.0,2304600,1651.0,1601.5
1043,2018/11/26,1629.5,1623.996,1633.0,1620300,1634.0,1606.0
1044,2018/11/27,1664.0,1662.459,1649.0,2606400,1675.0,1641.0
1045,2018/11/28,1660.0,1650.74,1664.0,2446300,1664.0,1633.0
1046,2018/11/29,1620.5,1627.506,1659.5,4163200,1660.0,1616.5
1047,2018/11/30,1613.0,1617.651,1624.5,3153300,1629.0,1610.0
1048,2018/12/03,1653.5,1652.182,1636.5,2530300,1666.5,1619.5
1049,2018/12/04,1596.5,1607.958,1654.0,3723500,1660.0,1588.0
1050,2018/12/05,1561.5,1554.845,1551.5,3469300,1566.0,1530.5
1051,2018/12/06,1532.0,1530.664,1554.0,2623100,1556.5,1517.5
1052,2018/12/07,1523.5,1522.263,1531.0,2804200,1543.5,1508.0
1053,2018/12/10,1494.0,1494.477,1500.0,2372700,1501.0,1481.5
1054,2018/12/11,1452.0,1454.299,1481.0,3216300,1486.0,1441.5
1055,2018/12/12,1473.5,1472.527,1470.0,3705100,1479.0,1454.0
1056,2018/12/13,1479.0,1477.884,1478.5,1838700,1487.5,1464.5
1057,2018/12/14,1446.5,1457.462,1472.5,3019500,1481.5,1438.5
1058,2018/12/17,1451.5,1459.915,1458.0,1901600,1480.0,1450.5
1059,2018/12/18,1420.0,1422.386,1429.5,2629100,1444.5,1411.5
1060,2018/12/19,1423.0,1410.82,1400.0,2791500,1424.0,1382.5
1061,2018/12/20,1372.5,1382.131,1401.5,2494500,1411.0,1365.0
1062,2018/12/21,1324.0,1328.069,1352.5,3953200,1360.0,1315.0
1063,2018/12/25,1250.0,1257.502,1271.5,2910500,1275.5,1245.0
1064,2018/12/26,1234.0,1231.725,1246.0,4085300,1268.0,1213.5
1065,2018/12/27,1282.0,1283.13,1293.5,4848200,1306.5,1266.0
1066,2018/12/28,1279.0,1278.021,1265.5,2666200,1289.0,1252.5
1067,2019/01/04,1247.5,1244.383,1255.0,3845900,1283.0,1226.5
1068,2019/01/07,1302.0,1305.168,1309.5,5338800,1325.0,1296.5
1069,2019/01/08,1320.0,1322.709,1311.5,3225000,1336.0,1302.0
1070,2019/01/09,1334.0,1331.442,1331.5,3017000,1340.5,1324.5
1071,2019/01/10,1330.5,1324.009,1306.0,3320000,1334.5,1301.0
1072,2019/01/11,1342.0,1340.534,1344.5,1850900,1352.0,1328.0
1073,2019/01/15,1367.5,1363.991,1334.0,2579200,1379.5,1334.0
1074,2019/01/16,1358.0,1355.091,1369.0,2388200,1373.5,1344.5
1075,2019/01/17,1371.0,1372.792,1381.5,1933400,1387.0,1362.5
1076,2019/01/18,1383.5,1384.297,1384.0,1459000,1394.0,1373.0
1077,2019/01/21,1401.5,1399.068,1403.5,1404000,1409.0,1383.5
1078,2019/01/22,1356.0,1363.44,1393.0,3536700,1395.0,1352.0
1079,2019/01/23,1353.0,1354.401,1339.5,2093900,1370.0,1333.5
1080,2019/01/24,1359.5,1357.526,1346.0,1637900,1369.0,1339.5
1081,2019/01/25,1366.5,1368.68,1360.5,1922300,1382.5,1360.5
1082,2019/01/28,1358.5,1355.561,1359.0,1693700,1364.0,1340.5
1083,2019/01/29,1340.0,1343.562,1347.5,2217500,1362.5,1339.5
1084,2019/01/30,1337.5,1338.525,1339.0,2595000,1351.0,1331.0
1085,2019/01/31,1346.5,1350.53,1359.0,1924400,1373.0,1341.5
1086,2019/02/01,1339.5,1335.731,1342.5,2255000,1349.0,1323.0
1087,2019/02/04,1386.5,1382.449,1358.0,3788200,1395.5,1357.0
1088,2019/02/05,1382.0,1385.025,1391.0,1960500,1398.0,1376.5
1089,2019/02/06,1374.0,1373.868,1378.0,1401500,1384.0,1360.5
1090,2019/02/07,1352.5,1352.764,1371.5,1555400,1375.0,1344.5
1091,2019/02/08,1308.0,1309.799,1323.0,2318300,1325.5,1301.5
1092,2019/02/12,1385.0,1379.571,1321.5,4330300,1402.0,1312.5
1093,2019/02/13,1385.5,1384.955,1384.0,2887900,1393.0,1360.5
1094,2019/02/14,1389.0,1384.392,1384.5,2022800,1391.5,1369.5
1095,2019/02/15,1340.0,1340.022,1365.5,3326200,1369.5,1322.0
1096,2019/02/18,1378.5,1383.507,1380.0,2965800,1405.0,1372.0
1097,2019/02/19,1369.0,1367.926,1372.0,1630300,1374.0,1359.0
1098,2019/02/20,1374.5,1373.995,1369.0,2376900,1381.5,1362.0
1099,2019/02/21,1375.5,1376.583,1375.5,2713700,1390.5,1365.5
1100,2019/02/22,1361.5,1361.291,1364.0,1349300,1372.5,1354.5
1101,2019/02/25,1392.0,1391.412,1362.0,2391700,1400.5,1362.0
1102,2019/02/26,1357.0,1357.002,1382.5,2354500,1383.0,1342.0
1103,2019/02/27,1350.0,1348.864,1351.0,2202900,1357.0,1332.5
1104,2019/02/28,1336.5,1343.42,1359.5,2261900,1362.5,1335.5
1105,2019/03/01,1342.0,1344.339,1337.5,2446200,1353.5,1334.0
1106,2019/03/04,1368.5,1369.605,1356.0,2744600,1387.0,1356.0
1107,2019/03/05,1335.5,1338.186,1354.5,2421900,1357.5,1330.0
1108,2019/03/06,1337.0,1333.819,1322.0,1821600,1339.0,1320.5
1109,2019/03/07,1299.5,1303.444,1322.5,2317800,1325.0,1294.0
1110,2019/03/08,1234.5,1246.69,1273.5,4354700,1284.0,1227.0
1111,2019/03/11,1232.5,1230.463,1238.0,2242100,1238.0,1219.5
1112,2019/03/12,1254.5,1256.593,1246.5,2901400,1266.5,1237.0
1113,2019/03/13,1202.5,1207.522,1224.5,5637700,1242.5,1191.0
1114,2019/03/14,1197.0,1200.163,1206.5,5080500,1222.0,1187.5
1115,2019/03/15,1173.0,1185.322,1198.5,5277100,1214.0,1172.0
1116,2019/03/18,1179.0,1174.794,1180.0,3347500,1188.0,1158.0
1117,2019/03/19,1176.5,1179.297,1174.0,3095100,1187.5,1167.0
1118,2019/03/20,1183.0,1182.827,1168.0,4496400,1192.0,1166.0
1119,2019/03/22,1171.0,1166.863,1178.0,6828700,1189.0,1154.0
1120,2019/03/25,1139.5,1130.162,1141.0,3635600,1143.0,1117.0
1121,2019/03/26,1166.0,1162.93,1141.0,4409200,1174.5,1140.5
1122,2019/03/27,1170.0,1159.898,1154.5,4580500,1170.5,1140.0
1123,2019/03/28,1162.0,1157.569,1162.0,2637900,1165.5,1145.0
1124,2019/03/29,1164.0,1160.278,1172.0,3329000,1176.0,1146.5
1125,2019/04/01,1176.5,1182.838,1177.5,3389200,1201.5,1169.0
1126,2019/04/02,1200.0,1203.574,1200.0,3992600,1212.0,1193.5
1127,2019/04/03,1200.5,1201.404,1214.5,3885600,1216.0,1191.0
1128,2019/04/04,1183.5,1186.507,1200.0,3726000,1201.0,1176.5
1129,2019/04/05,1211.0,1205.616,1180.0,3249000,1213.0,1180.0
1130,2019/04/08,1191.0,1191.045,1209.5,3648400,1217.0,1181.0
1131,2019/04/09,1208.5,1200.486,1195.5,3571500,1210.5,1187.0
1132,2019/04/10,1204.5,1203.855,1188.0,2420000,1211.5,1186.5
1133,2019/04/11,1172.0,1172.201,1190.5,3651300,1196.0,1155.5
1134,2019/04/12,1189.0,1195.492,1191.5,3643600,1214.5,1178.5
1135,2019/04/15,1233.0,1235.232,1216.5,3983200,1248.5,1215.0
1136,2019/04/16,1224.0,1224.466,1228.5,2752700,1235.5,1216.0
1137,2019/04/17,1248.5,1248.07,1230.5,3788000,1259.0,1224.5
1138,2019/04/18,1244.0,1252.161,1264.0,3825000,1272.0,1242.0
1139,2019/04/19,1228.0,1230.543,1249.5,2107600,1249.5,1223.5
1140,2019/04/22,1212.0,1214.921,1227.0,2090000,1228.5,1206.5
1141,2019/04/23,1225.0,1224.486,1214.5,1766400,1231.0,1214.0
1142,2019/04/24,1200.0,1204.032,1222.5,2176700,1225.5,1195.5
1143,2019/04/25,1218.0,1215.097,1214.0,2124600,1223.5,1198.0
1144,2019/04/26,1196.5,1193.236,1206.0,2614100,1209.5,1177.5
1145,2019/05/07,1195.5,1200.584,1220.5,3289200,1226.0,1183.5
1146,2019/05/08,1187.5,1186.454,1180.0,2935800,1196.5,1175.5
1147,2019/05/09,1191.5,1187.984,1177.0,2694100,1198.0,1164.5
1148,2019/05/10,1170.0,1174.637,1177.0,3306600,1190.0,1161.5
1149,2019/05/13,1167.0,1166.66,1156.5,2102400,1175.5,1151.0
1150,2019/05/14,1161.0,1150.577,1135.5,2205600,1162.5,1129.0
1151,2019/05/15,1182.0,1175.715,1172.0,2789700,1183.0,1161.0
1152,2019/05/16,1087.0,1087.884,1120.0,10776100,1120.0,1068.0
1153,2019/05/17,1136.5,1139.843,1098.0,5543500,1163.5,1092.0
1154,2019/05/20,1153.5,1147.029,1140.0,3778000,1160.0,1132.0
1155,2019/05/21,1164.5,1161.212,1147.0,3507400,1171.5,1145.5
1156,2019/05/22,1159.0,1162.489,1164.5,3845700,1172.0,1152.0
1157,2019/05/23,1164.0,1159.847,1157.0,3217800,1165.0,1145.5
1158,2019/05/24,1143.0,1142.804,1144.5,4349600,1151.5,1135.5
1159,2019/05/27,1159.0,1160.741,1154.0,2381600,1168.5,1151.0
1160,2019/05/28,1167.0,1166.738,1153.0,4370000,1173.5,1148.0
1161,2019/05/29,1149.5,1140.767,1142.0,4083800,1155.0,1116.0
1162,2019/05/30,1164.0,1161.688,1147.5,4573900,1172.0,1142.0
1163,2019/05/31,1135.5,1140.033,1142.5,5067000,1150.5,1129.5
1164,2019/06/03,1119.0,1115.681,1116.5,3572800,1125.5,1106.0
1165,2019/06/04,1091.5,1088.029,1115.0,6792100,1115.0,1073.5
1166,2019/06/05,1126.5,1125.959,1121.5,4141400,1134.0,1111.5
1167,2019/06/06,1115.0,1119.972,1118.0,2584800,1130.0,1113.5
1168,2019/06/07,1120.0,1116.033,1119.0,2323600,1124.5,1098.0
1169,2019/06/10,1115.5,1115.14,1130.5,2273800,1131.5,1104.5
1170,2019/06/11,1138.0,1135.56,1124.0,2021900,1143.5,1120.0
1171,2019/06/12,1130.0,1128.468,1115.0,2796600,1138.0,1113.5
1172,2019/06/13,1124.0,1120.867,1123.5,1669500,1128.0,1113.0
1173,2019/06/14,1130.0,1127.778,1116.5,2094000,1139.5,1113.0
1174,2019/06/17,1136.0,1135.815,1128.5,1879600,1142.5,1122.0
1175,2019/06/18,1123.0,1122.37,1123.0,1918600,1133.0,1115.5
1176,2019/06/19,1140.0,1145.142,1145.0,2879300,1170.0,1136.5
1177,2019/06/20,1143.5,1140.684,1132.0,1935000,1149.0,1131.0
1178,2019/06/21,1131.0,1133.049,1146.0,2960700,1149.0,1125.5
1179,2019/06/24,1132.5,1128.906,1120.0,1549600,1134.5,1116.5
1180,2019/06/25,1142.0,1139.584,1135.5,2664500,1146.5,1134.0
1181,2019/06/26,1137.0,1137.591,1136.0,1885200,1148.5,1132.5
1182,2019/06/27,1184.5,1174.11,1131.5,4502800,1184.5,1130.0
1183,2019/06/28,1169.5,1174.865,1177.5,3260800,1192.0,1165.5
1184,2019/07/01,1202.0,1201.142,1199.5,2390100,1209.5,1189.0
1185,2019/07/02,1203.0,1203.044,1210.5,1842700,1214.0,1195.5
1186,2019/07/03,1197.5,1189.317,1190.5,2491700,1200.5,1171.5
1187,2019/07/04,1201.0,1200.619,1209.5,918400,1209.5,1195.5
1188,2019/07/05,1199.5,1200.011,1194.5,1545300,1207.0,1192.0
1189,2019/07/08,1205.5,1207.228,1205.0,1711700,1217.5,1200.5
1190,2019/07/09,1203.0,1204.047,1199.0,1410300,1214.0,1191.5
1191,2019/07/10,1196.5,1195.397,1190.0,2022600,1200.0,1186.5
1192,2019/07/11,1197.5,1197.2,1188.5,1899800,1204.0,1184.0
1193,2019/07/12,1190.5,1193.32,1201.5,1472100,1202.5,1188.5
1194,2019/07/16,1195.0,1191.96,1190.5,1761700,1197.5,1182.5
1195,2019/07/17,1203.0,1204.147,1202.5,2458400,1210.5,1196.5
1196,2019/07/18,1197.0,1194.996,1196.0,3228200,1202.5,1187.0
1197,2019/07/19,1202.0,1204.597,1203.0,2689700,1217.0,1196.5
1198,2019/07/22,1205.0,1203.147,1200.5,1609500,1207.0,1197.5
1199,2019/07/23,1209.5,1206.711,1202.5,1461400,1215.0,1193.0
1200,2019/07/24,1210.0,1209.727,1219.0,2011800,1219.0,1201.0
1201,2019/07/25,1223.0,1217.935,1217.5,1554900,1224.5,1205.5
1202,2019/07/26,1229.0,1228.659,1226.0,2200600,1237.0,1219.5
1203,2019/07/29,1202.5,1208.374,1230.5,1682400,1230.5,1202.0
1204,2019/07/30,1209.5,1207.43,1194.0,1361100,1213.5,1192.0
1205,2019/07/31,1226.0,1222.166,1193.5,2554800,1235.0,1188.0
1206,2019/08/01,1231.0,1228.082,1210.5,1811500,1239.0,1210.0
1207,2019/08/02,1165.5,1170.777,1190.0,3012700,1195.5,1160.5
1208,2019/08/05,1130.5,1129.612,1150.0,2357300,1150.0,1113.0
1209,2019/08/06,1119.5,1104.341,1081.5,2095200,1120.5,1079.0
1210,2019/08/07,1099.5,1102.523,1115.0,2141000,1119.0,1096.5
1211,2019/08/08,1080.5,1084.023,1093.5,1991900,1096.0,1077.5
1212,2019/08/09,1061.0,1062.444,1084.0,3271000,1092.0,1047.5
1213,2019/08/13,988.5,996.883,1045.0,4855900,1048.0,984.5
1214,2019/08/14,999.8,1001.739,1003.5,2281100,1016.0,995.0
1215,2019/08/15,990.7,981.61,970.2,3632800,997.5,953.9
1216,2019/08/16,985.9,986.44,984.2,2096400,993.2,978.0
1217,2019/08/19,1007.0,1002.657,993.0,2268400,1009.0,989.1
1218,2019/08/20,1009.0,1007.228,1004.5,1458600,1012.0,1001.0
1219,2019/08/21,1005.5,1000.564,993.0,1731000,1006.0,987.6
1220,2019/08/22,1019.5,1015.845,1007.0,1903200,1020.0,1003.5
1221,2019/08/23,1030.5,1029.065,1030.0,2178000,1035.5,1019.5
