,Date,Close,VWAP,Open,Volume,High,Low
0,2014/08/25,311.0,311.986,313.0,14200,313.0,311.0
1,2014/08/26,309.0,310.971,312.0,10200,313.0,309.0
2,2014/08/27,311.0,310.611,311.0,7200,311.0,310.0
3,2014/08/28,313.0,312.701,312.0,14700,314.0,312.0
4,2014/08/29,313.0,313.127,313.0,16500,314.0,312.0
5,2014/09/01,322.0,319.349,314.0,34400,324.0,314.0
6,2014/09/02,320.0,319.647,321.0,30300,321.0,318.0
7,2014/09/03,324.0,322.02,320.0,35800,326.0,320.0
8,2014/09/04,324.0,325.767,323.0,32600,332.0,319.0
9,2014/09/05,324.0,325.921,326.0,13900,329.0,324.0
10,2014/09/08,326.0,324.912,324.0,22800,328.0,323.0
11,2014/09/09,325.0,324.45,326.0,10000,326.0,322.0
12,2014/09/10,350.0,343.763,320.0,364800,357.0,320.0
13,2014/09/11,342.0,343.614,350.0,187200,350.0,332.0
14,2014/09/12,337.0,337.508,342.0,51800,342.0,328.0
15,2014/09/16,343.0,339.922,337.0,56300,345.0,333.0
16,2014/09/17,339.0,339.831,340.0,26600,343.0,336.0
17,2014/09/18,343.0,341.848,336.0,40800,344.0,336.0
18,2014/09/19,343.0,340.68,343.0,29700,344.0,338.0
19,2014/09/22,340.0,340.175,343.0,12000,343.0,338.0
20,2014/09/24,340.0,338.994,336.0,17700,341.0,336.0
21,2014/09/25,340.0,340.33,343.0,33000,343.0,338.0
22,2014/09/26,340.0,338.886,339.0,36900,342.0,335.0
23,2014/09/29,340.0,339.372,340.0,28800,342.0,338.0
24,2014/09/30,337.0,336.507,337.0,28800,339.0,335.0
25,2014/10/01,331.0,333.741,337.0,38600,338.0,328.0
26,2014/10/02,320.0,317.893,316.0,64500,325.0,314.0
27,2014/10/03,320.0,320.71,318.0,24100,327.0,318.0
28,2014/10/06,329.0,327.913,328.0,24200,330.0,325.0
29,2014/10/07,327.0,329.593,330.0,16700,331.0,327.0
30,2014/10/08,324.0,323.243,320.0,17700,327.0,320.0
31,2014/10/09,325.0,325.615,323.0,34500,331.0,322.0
32,2014/10/10,319.0,320.102,319.0,29500,325.0,319.0
33,2014/10/14,316.0,317.602,318.0,27100,321.0,315.0
34,2014/10/15,321.0,319.343,317.0,14000,322.0,316.0
35,2014/10/16,315.0,316.924,315.0,13200,325.0,314.0
36,2014/10/17,315.0,314.497,312.0,18900,317.0,312.0
37,2014/10/20,319.0,317.429,318.0,19800,319.0,313.0
38,2014/10/21,317.0,318.457,320.0,16400,320.0,316.0
39,2014/10/22,320.0,319.146,318.0,24600,321.0,317.0
40,2014/10/23,322.0,321.732,321.0,22400,323.0,320.0
41,2014/10/24,322.0,323.863,324.0,16100,325.0,322.0
42,2014/10/27,324.0,324.079,324.0,8900,325.0,322.0
43,2014/10/28,322.0,323.034,322.0,5900,324.0,322.0
44,2014/10/29,326.0,324.787,322.0,21100,329.0,322.0
45,2014/10/30,328.0,327.858,330.0,14800,330.0,326.0
46,2014/10/31,330.0,329.477,333.0,29800,333.0,326.0
47,2014/11/04,334.0,335.002,337.0,50400,339.0,333.0
48,2014/11/05,333.0,330.781,334.0,16900,334.0,327.0
49,2014/11/06,330.0,330.724,330.0,12300,334.0,328.0
50,2014/11/07,329.0,328.857,329.0,9100,330.0,328.0
51,2014/11/10,320.0,323.65,330.0,37400,330.0,320.0
52,2014/11/11,314.0,315.318,318.0,47200,318.0,313.0
53,2014/11/12,315.0,315.895,316.0,20000,319.0,314.0
54,2014/11/13,317.0,315.157,318.0,31200,318.0,311.0
55,2014/11/14,316.0,316.71,318.0,15500,318.0,314.0
56,2014/11/17,311.0,313.938,316.0,16000,318.0,311.0
57,2014/11/18,318.0,318.653,310.0,25900,330.0,310.0
58,2014/11/19,316.0,315.971,314.0,17400,318.0,314.0
59,2014/11/20,316.0,316.872,318.0,7800,318.0,316.0
60,2014/11/21,317.0,316.585,316.0,10600,317.0,316.0
61,2014/11/25,317.0,317.375,319.0,16800,319.0,315.0
62,2014/11/26,318.0,318.887,319.0,25700,320.0,317.0
63,2014/11/27,319.0,320.894,321.0,21600,322.0,319.0
64,2014/11/28,322.0,321.849,322.0,7300,322.0,321.0
65,2014/12/01,323.0,322.72,323.0,20700,324.0,321.0
66,2014/12/02,324.0,322.421,323.0,14000,324.0,320.0
67,2014/12/03,323.0,322.882,325.0,22000,325.0,321.0
68,2014/12/04,324.0,322.262,325.0,12600,325.0,321.0
69,2014/12/05,322.0,322.377,325.0,19900,325.0,320.0
70,2014/12/08,324.0,323.178,323.0,17400,324.0,322.0
71,2014/12/09,320.0,320.667,320.0,13200,324.0,320.0
72,2014/12/10,318.0,319.021,318.0,23600,321.0,316.0
73,2014/12/11,318.0,319.084,316.0,20200,321.0,316.0
74,2014/12/12,317.0,319.025,321.0,24500,321.0,317.0
75,2014/12/15,314.0,314.463,314.0,12300,317.0,313.0
76,2014/12/16,307.0,309.8,313.0,19000,315.0,307.0
77,2014/12/17,307.0,306.448,305.0,18300,310.0,305.0
78,2014/12/18,308.0,310.4,310.0,9500,313.0,307.0
79,2014/12/19,313.0,311.457,310.0,8100,313.0,310.0
80,2014/12/22,316.0,314.0,313.0,11000,316.0,313.0
81,2014/12/24,314.0,315.995,319.0,20800,320.0,309.0
82,2014/12/25,317.0,315.423,316.0,21500,317.0,314.0
83,2014/12/26,319.0,318.28,316.0,5000,320.0,316.0
84,2014/12/29,320.0,319.682,320.0,11000,320.0,318.0
85,2014/12/30,318.0,320.188,321.0,16500,321.0,318.0
86,2015/01/05,321.0,321.233,319.0,12000,327.0,317.0
87,2015/01/06,316.0,316.971,321.0,17400,321.0,316.0
88,2015/01/07,316.0,316.63,312.0,9200,324.0,312.0
89,2015/01/08,317.0,316.154,316.0,6500,318.0,315.0
90,2015/01/09,317.0,315.766,315.0,10700,317.0,314.0
91,2015/01/13,320.0,316.409,315.0,11500,320.0,312.0
92,2015/01/14,312.0,313.461,319.0,7600,319.0,311.0
93,2015/01/15,314.0,313.966,318.0,2900,318.0,313.0
94,2015/01/16,310.0,311.69,314.0,8700,314.0,310.0
95,2015/01/19,312.0,312.396,314.0,4800,316.0,310.0
96,2015/01/20,318.0,316.608,316.0,10200,318.0,312.0
97,2015/01/21,314.0,315.6,317.0,6000,317.0,314.0
98,2015/01/22,317.0,315.655,316.0,17100,317.0,313.0
99,2015/01/23,318.0,317.117,318.0,12800,318.0,313.0
100,2015/01/26,316.0,315.55,315.0,2000,317.0,314.0
101,2015/01/27,318.0,317.262,316.0,6100,318.0,316.0
102,2015/01/28,318.0,317.059,318.0,10200,319.0,314.0
103,2015/01/29,319.0,318.236,318.0,7200,320.0,317.0
104,2015/01/30,318.0,318.009,320.0,11400,320.0,316.0
105,2015/02/02,316.0,317.145,318.0,8300,318.0,316.0
106,2015/02/03,313.0,313.539,316.0,13000,317.0,312.0
107,2015/02/04,316.0,316.111,313.0,3600,317.0,313.0
108,2015/02/05,315.0,314.962,316.0,13100,318.0,313.0
109,2015/02/06,315.0,314.283,314.0,5300,316.0,313.0
110,2015/02/09,316.0,316.076,317.0,11800,318.0,313.0
111,2015/02/10,316.0,315.449,318.0,8900,318.0,314.0
112,2015/02/12,316.0,317.58,318.0,13800,320.0,315.0
113,2015/02/13,317.0,317.729,318.0,5900,318.0,317.0
114,2015/02/16,321.0,319.549,320.0,17300,322.0,316.0
115,2015/02/17,322.0,320.872,321.0,16400,323.0,317.0
116,2015/02/18,323.0,324.037,323.0,18800,325.0,321.0
117,2015/02/19,324.0,324.151,323.0,16600,325.0,322.0
118,2015/02/20,324.0,323.392,324.0,13000,324.0,321.0
119,2015/02/23,323.0,323.718,325.0,20200,325.0,321.0
120,2015/02/24,325.0,323.932,324.0,8800,325.0,321.0
121,2015/02/25,321.0,323.64,324.0,12500,325.0,321.0
122,2015/02/26,325.0,324.356,324.0,7300,325.0,324.0
123,2015/02/27,324.0,323.96,324.0,22700,325.0,321.0
124,2015/03/02,324.0,324.415,324.0,17600,325.0,324.0
125,2015/03/03,321.0,321.933,325.0,7500,325.0,321.0
126,2015/03/04,321.0,320.105,321.0,20000,322.0,319.0
127,2015/03/05,321.0,320.581,319.0,3100,322.0,319.0
128,2015/03/06,321.0,320.444,321.0,9000,322.0,319.0
129,2015/03/09,320.0,320.958,322.0,16700,323.0,320.0
130,2015/03/10,326.0,325.073,322.0,35800,330.0,322.0
131,2015/03/11,327.0,327.384,328.0,8600,329.0,326.0
132,2015/03/12,330.0,328.86,327.0,10700,330.0,326.0
133,2015/03/13,332.0,331.062,331.0,34000,333.0,330.0
134,2015/03/16,334.0,332.795,332.0,22900,337.0,331.0
135,2015/03/17,335.0,336.039,338.0,15300,340.0,333.0
136,2015/03/18,336.0,335.392,337.0,7400,337.0,334.0
137,2015/03/19,334.0,333.131,335.0,15300,335.0,333.0
138,2015/03/20,338.0,337.063,333.0,30100,340.0,333.0
139,2015/03/23,338.0,337.595,338.0,17300,340.0,335.0
140,2015/03/24,339.0,337.116,336.0,14700,339.0,335.0
141,2015/03/25,337.0,337.934,338.0,22600,339.0,336.0
142,2015/03/26,332.0,334.763,336.0,57000,337.0,332.0
143,2015/03/27,319.0,319.051,316.0,29300,324.0,316.0
144,2015/03/30,316.0,315.471,316.0,15500,317.0,315.0
145,2015/03/31,318.0,317.17,318.0,11200,318.0,314.0
146,2015/04/01,314.0,311.784,314.0,25000,314.0,308.0
147,2015/04/02,318.0,315.512,314.0,12900,318.0,312.0
148,2015/04/03,320.0,317.846,320.0,16900,320.0,314.0
149,2015/04/06,319.0,318.539,318.0,3900,320.0,318.0
150,2015/04/07,318.0,319.182,319.0,12100,321.0,318.0
151,2015/04/08,322.0,320.104,318.0,19300,323.0,318.0
152,2015/04/09,322.0,322.269,322.0,7800,323.0,322.0
153,2015/04/10,322.0,321.887,323.0,10600,323.0,320.0
154,2015/04/13,322.0,321.267,322.0,4500,322.0,321.0
155,2015/04/14,324.0,318.966,317.0,8700,324.0,317.0
156,2015/04/15,323.0,321.551,323.0,4900,323.0,320.0
157,2015/04/16,322.0,318.426,319.0,10800,322.0,314.0
158,2015/04/17,318.0,319.353,318.0,6800,322.0,318.0
159,2015/04/20,318.0,318.319,318.0,4700,320.0,318.0
160,2015/04/21,320.0,317.875,318.0,6400,320.0,315.0
161,2015/04/22,320.0,319.299,320.0,6700,320.0,318.0
162,2015/04/23,319.0,317.609,319.0,9200,320.0,316.0
163,2015/04/24,319.0,319.176,320.0,14800,320.0,316.0
164,2015/04/27,321.0,321.164,321.0,5500,322.0,320.0
165,2015/04/28,323.0,322.491,322.0,11200,324.0,321.0
166,2015/04/30,324.0,323.901,324.0,16200,325.0,321.0
167,2015/05/01,321.0,317.763,321.0,11800,323.0,313.0
168,2015/05/07,321.0,320.233,324.0,17600,324.0,314.0
169,2015/05/08,319.0,321.185,324.0,8100,324.0,319.0
170,2015/05/11,316.0,319.306,320.0,14700,323.0,316.0
171,2015/05/12,315.0,315.61,316.0,10000,316.0,314.0
172,2015/05/13,313.0,314.098,318.0,15300,318.0,312.0
173,2015/05/14,311.0,313.0,315.0,18000,315.0,311.0
174,2015/05/15,312.0,312.761,312.0,7100,315.0,311.0
175,2015/05/18,318.0,317.46,317.0,12600,319.0,316.0
176,2015/05/19,318.0,319.428,320.0,14500,320.0,317.0
177,2015/05/20,320.0,319.41,318.0,10500,321.0,318.0
178,2015/05/21,318.0,318.699,320.0,14300,321.0,318.0
179,2015/05/22,318.0,317.602,319.0,11300,319.0,315.0
180,2015/05/25,318.0,318.68,319.0,12800,319.0,317.0
181,2015/05/26,317.0,317.548,317.0,7300,319.0,317.0
182,2015/05/27,316.0,316.727,317.0,5500,318.0,316.0
183,2015/05/28,317.0,317.194,318.0,19100,319.0,316.0
184,2015/05/29,316.0,316.244,316.0,16000,318.0,315.0
185,2015/06/01,321.0,320.4,317.0,19500,324.0,317.0
186,2015/06/02,321.0,321.711,321.0,39500,324.0,319.0
187,2015/06/03,322.0,321.044,321.0,20500,324.0,318.0
188,2015/06/04,323.0,322.899,324.0,21800,325.0,322.0
189,2015/06/05,323.0,321.978,321.0,9200,325.0,320.0
190,2015/06/08,328.0,327.597,323.0,32500,332.0,323.0
191,2015/06/09,327.0,330.373,330.0,39900,335.0,327.0
192,2015/06/10,327.0,329.887,330.0,12400,334.0,327.0
193,2015/06/11,326.0,327.707,328.0,11600,329.0,326.0
194,2015/06/12,328.0,329.904,330.0,29200,332.0,328.0
195,2015/06/15,329.0,327.333,326.0,5400,329.0,326.0
196,2015/06/16,326.0,328.185,328.0,10300,330.0,326.0
197,2015/06/17,329.0,326.76,328.0,12500,329.0,325.0
198,2015/06/18,326.0,325.314,326.0,8600,329.0,324.0
199,2015/06/19,334.0,330.219,326.0,36500,339.0,317.0
200,2015/06/22,330.0,329.34,329.0,10000,331.0,328.0
201,2015/06/23,334.0,331.664,332.0,22000,335.0,328.0
202,2015/06/24,330.0,330.791,334.0,20100,334.0,328.0
203,2015/06/25,330.0,331.987,333.0,15300,333.0,330.0
204,2015/06/26,329.0,331.145,334.0,6900,334.0,329.0
205,2015/06/29,325.0,323.782,321.0,15100,326.0,321.0
206,2015/06/30,334.0,326.304,325.0,29300,334.0,321.0
207,2015/07/01,328.0,329.507,332.0,7500,332.0,327.0
208,2015/07/02,327.0,329.87,331.0,16100,333.0,326.0
209,2015/07/03,326.0,327.051,329.0,5900,329.0,326.0
210,2015/07/06,321.0,322.011,325.0,18600,325.0,319.0
211,2015/07/07,327.0,325.933,324.0,10500,328.0,324.0
212,2015/07/08,320.0,322.396,327.0,13900,327.0,320.0
213,2015/07/09,316.0,315.525,315.0,12000,317.0,313.0
214,2015/07/10,319.0,318.155,318.0,11000,319.0,317.0
215,2015/07/13,322.0,321.876,321.0,8900,323.0,320.0
216,2015/07/14,325.0,325.527,329.0,9300,329.0,322.0
217,2015/07/15,326.0,325.654,328.0,15300,328.0,321.0
218,2015/07/16,326.0,326.484,326.0,9300,330.0,322.0
219,2015/07/17,327.0,326.387,326.0,9300,327.0,325.0
220,2015/07/21,325.0,324.699,327.0,16300,327.0,321.0
221,2015/07/22,325.0,324.893,322.0,17800,329.0,322.0
222,2015/07/23,328.0,327.175,329.0,12600,329.0,326.0
223,2015/07/24,326.0,329.444,331.0,27900,331.0,326.0
224,2015/07/27,325.0,327.21,328.0,16700,332.0,324.0
225,2015/07/28,320.0,318.06,317.0,43600,322.0,317.0
226,2015/07/29,318.0,318.533,321.0,12000,321.0,317.0
227,2015/07/30,327.0,325.464,326.0,23900,327.0,322.0
228,2015/07/31,329.0,328.836,331.0,29200,331.0,327.0
229,2015/08/03,328.0,329.448,331.0,15400,331.0,327.0
230,2015/08/04,329.0,326.632,324.0,20400,330.0,324.0
231,2015/08/05,328.0,327.385,329.0,7800,329.0,324.0
232,2015/08/06,329.0,328.571,328.0,8400,330.0,327.0
233,2015/08/07,327.0,327.556,328.0,11700,329.0,324.0
234,2015/08/10,329.0,327.204,330.0,14200,330.0,325.0
235,2015/08/11,331.0,330.008,331.0,13000,332.0,328.0
236,2015/08/12,326.0,327.271,330.0,14000,330.0,325.0
237,2015/08/13,328.0,328.37,325.0,16500,330.0,324.0
238,2015/08/14,328.0,326.963,328.0,8100,328.0,326.0
239,2015/08/17,325.0,325.405,328.0,11600,328.0,324.0
240,2015/08/18,324.0,323.955,325.0,6700,325.0,323.0
241,2015/08/19,323.0,323.467,323.0,6000,325.0,323.0
242,2015/08/20,320.0,320.623,322.0,12200,323.0,320.0
243,2015/08/21,313.0,315.201,318.0,27800,318.0,312.0
244,2015/08/24,300.0,304.798,312.0,45100,315.0,300.0
245,2015/08/25,289.0,293.891,298.0,40500,300.0,282.0
246,2015/08/26,299.0,297.805,297.0,11800,303.0,295.0
247,2015/08/27,302.0,304.511,303.0,13500,307.0,302.0
248,2015/08/28,310.0,306.841,305.0,13800,310.0,304.0
249,2015/08/31,309.0,308.234,311.0,12400,311.0,302.0
250,2015/09/01,299.0,302.814,301.0,25200,307.0,297.0
251,2015/09/02,295.0,295.0,295.0,8700,299.0,292.0
252,2015/09/03,294.0,295.338,295.0,16000,300.0,292.0
253,2015/09/04,286.0,288.775,297.0,17800,297.0,285.0
254,2015/09/07,285.0,283.624,286.0,18100,286.0,281.0
255,2015/09/08,278.0,281.449,282.0,18500,286.0,277.0
256,2015/09/09,286.0,283.607,283.0,12200,286.0,279.0
257,2015/09/10,280.0,281.054,286.0,22200,286.0,277.0
258,2015/09/11,286.0,285.757,286.0,21000,287.0,283.0
259,2015/09/14,286.0,288.837,293.0,8600,293.0,286.0
260,2015/09/15,282.0,283.679,284.0,19000,286.0,282.0
261,2015/09/16,284.0,283.963,286.0,8200,286.0,282.0
262,2015/09/17,284.0,295.406,284.0,74700,315.0,282.0
263,2015/09/18,286.0,284.821,286.0,18400,287.0,282.0
264,2015/09/24,281.0,283.564,285.0,31900,285.0,281.0
265,2015/09/25,285.0,284.118,286.0,24500,286.0,281.0
266,2015/09/28,284.0,283.712,283.0,6600,286.0,282.0
267,2015/09/29,275.0,278.273,283.0,22000,283.0,275.0
268,2015/09/30,279.0,278.203,278.0,6900,279.0,277.0
269,2015/10/01,284.0,282.768,281.0,12500,286.0,278.0
270,2015/10/02,285.0,284.531,284.0,4900,286.0,282.0
271,2015/10/05,285.0,285.94,286.0,6700,288.0,282.0
272,2015/10/06,290.0,288.793,286.0,5300,290.0,286.0
273,2015/10/07,291.0,289.683,290.0,6300,291.0,289.0
274,2015/10/08,292.0,290.947,292.0,7600,292.0,288.0
275,2015/10/09,295.0,291.971,292.0,13600,295.0,288.0
276,2015/10/13,294.0,294.71,293.0,9300,300.0,293.0
277,2015/10/14,289.0,290.704,294.0,9800,294.0,288.0
278,2015/10/15,292.0,289.74,289.0,7700,292.0,286.0
279,2015/10/16,290.0,288.959,293.0,12300,293.0,285.0
280,2015/10/19,288.0,287.6,290.0,7500,290.0,286.0
281,2015/10/20,288.0,288.661,288.0,5600,291.0,287.0
282,2015/10/21,293.0,291.219,289.0,11400,294.0,288.0
283,2015/10/22,292.0,292.289,293.0,4500,293.0,291.0
284,2015/10/23,296.0,295.701,297.0,19700,297.0,292.0
285,2015/10/26,297.0,298.183,296.0,14200,300.0,296.0
286,2015/10/27,298.0,296.492,296.0,11800,299.0,294.0
287,2015/10/28,300.0,298.917,299.0,14400,302.0,294.0
288,2015/10/29,301.0,299.864,299.0,8800,301.0,298.0
289,2015/10/30,305.0,302.235,302.0,17900,306.0,297.0
290,2015/11/02,300.0,301.73,302.0,11100,306.0,300.0
291,2015/11/04,304.0,304.526,307.0,5700,307.0,302.0
292,2015/11/05,305.0,304.151,306.0,8600,306.0,303.0
293,2015/11/06,308.0,308.448,305.0,13400,313.0,305.0
294,2015/11/09,292.0,299.577,314.0,52700,314.0,286.0
295,2015/11/10,287.0,285.961,292.0,51100,292.0,281.0
296,2015/11/11,286.0,287.424,290.0,9900,290.0,285.0
297,2015/11/12,287.0,286.652,288.0,16400,288.0,285.0
298,2015/11/13,288.0,286.768,287.0,19400,290.0,283.0
299,2015/11/16,288.0,287.392,288.0,10200,289.0,285.0
300,2015/11/17,287.0,287.926,288.0,39200,293.0,286.0
301,2015/11/18,289.0,289.503,292.0,16500,292.0,288.0
302,2015/11/19,289.0,288.353,288.0,15600,291.0,288.0
303,2015/11/20,290.0,288.484,291.0,15500,291.0,286.0
304,2015/11/24,292.0,290.976,291.0,12400,292.0,289.0
305,2015/11/25,293.0,292.665,293.0,16400,293.0,291.0
306,2015/11/26,294.0,294.651,294.0,12600,296.0,293.0
307,2015/11/27,296.0,294.567,296.0,6000,296.0,293.0
308,2015/11/30,294.0,294.504,296.0,14300,296.0,293.0
309,2015/12/01,295.0,294.266,294.0,24800,296.0,293.0
310,2015/12/02,294.0,294.802,297.0,26200,298.0,293.0
311,2015/12/03,292.0,293.392,294.0,33700,296.0,292.0
312,2015/12/04,290.0,290.878,292.0,20500,294.0,290.0
313,2015/12/07,291.0,291.73,293.0,15200,293.0,291.0
314,2015/12/08,288.0,290.031,292.0,9600,292.0,288.0
315,2015/12/09,289.0,289.261,289.0,11900,290.0,288.0
316,2015/12/10,286.0,286.825,287.0,15400,288.0,286.0
317,2015/12/11,288.0,292.436,293.0,25000,293.0,288.0
318,2015/12/14,281.0,282.235,282.0,32400,285.0,281.0
319,2015/12/15,281.0,282.817,283.0,10900,284.0,281.0
320,2015/12/16,283.0,283.937,283.0,15800,286.0,283.0
321,2015/12/17,285.0,285.644,287.0,13500,287.0,285.0
322,2015/12/18,284.0,284.835,288.0,18200,288.0,282.0
323,2015/12/21,283.0,283.318,286.0,12900,286.0,282.0
324,2015/12/22,282.0,282.147,282.0,13600,284.0,281.0
325,2015/12/24,282.0,281.837,284.0,13500,284.0,281.0
326,2015/12/25,277.0,278.111,282.0,44100,282.0,275.0
327,2015/12/28,283.0,279.901,277.0,14100,284.0,277.0
328,2015/12/29,284.0,283.12,283.0,12500,284.0,281.0
329,2015/12/30,285.0,284.724,284.0,12300,287.0,283.0
330,2016/01/04,282.0,283.095,284.0,8400,285.0,282.0
331,2016/01/05,283.0,283.84,282.0,5000,286.0,282.0
332,2016/01/06,286.0,284.155,282.0,7100,288.0,282.0
333,2016/01/07,281.0,283.425,286.0,8000,286.0,281.0
334,2016/01/08,281.0,282.216,281.0,13400,285.0,281.0
335,2016/01/12,275.0,276.979,281.0,18700,284.0,275.0
336,2016/01/13,281.0,281.391,278.0,15100,285.0,278.0
337,2016/01/14,276.0,277.598,281.0,19900,281.0,276.0
338,2016/01/15,275.0,277.425,279.0,7300,280.0,275.0
339,2016/01/18,269.0,270.91,272.0,19900,274.0,269.0
340,2016/01/19,268.0,269.405,270.0,7400,271.0,268.0
341,2016/01/20,265.0,267.293,270.0,16700,270.0,265.0
342,2016/01/21,257.0,261.039,261.0,15300,265.0,257.0
343,2016/01/22,269.0,261.547,268.0,29600,269.0,257.0
344,2016/01/25,275.0,275.486,277.0,17700,278.0,265.0
345,2016/01/26,269.0,271.825,273.0,12000,283.0,267.0
346,2016/01/27,277.0,276.0,275.0,3400,277.0,275.0
347,2016/01/28,273.0,271.975,276.0,7900,276.0,266.0
348,2016/01/29,281.0,277.552,277.0,23200,282.0,271.0
349,2016/02/01,284.0,282.631,285.0,16000,285.0,279.0
350,2016/02/02,282.0,282.2,279.0,4500,284.0,279.0
351,2016/02/03,277.0,277.605,279.0,8100,279.0,277.0
352,2016/02/04,281.0,279.662,277.0,6500,282.0,276.0
353,2016/02/05,278.0,275.862,276.0,9400,279.0,270.0
354,2016/02/08,268.0,270.166,270.0,18700,273.0,267.0
355,2016/02/09,260.0,262.381,265.0,17600,266.0,259.0
356,2016/02/10,255.0,256.926,263.0,33900,263.0,253.0
357,2016/02/12,231.0,232.503,231.0,37200,240.0,231.0
358,2016/02/15,236.0,233.355,241.0,29000,241.0,229.0
359,2016/02/16,242.0,244.736,247.0,22000,249.0,242.0
360,2016/02/17,244.0,244.526,240.0,21500,248.0,240.0
361,2016/02/18,246.0,245.954,249.0,8600,249.0,242.0
362,2016/02/19,244.0,244.477,244.0,13000,247.0,242.0
363,2016/02/22,248.0,246.33,244.0,10900,249.0,244.0
364,2016/02/23,250.0,248.497,249.0,14900,253.0,241.0
365,2016/02/24,250.0,249.496,250.0,12500,251.0,247.0
366,2016/02/25,256.0,255.56,254.0,64500,262.0,250.0
367,2016/02/26,253.0,254.686,259.0,10200,259.0,252.0
368,2016/02/29,253.0,253.759,257.0,35200,257.0,252.0
369,2016/03/01,254.0,255.0,254.0,23400,257.0,251.0
370,2016/03/02,257.0,258.87,257.0,22300,269.0,257.0
371,2016/03/03,262.0,259.494,257.0,17400,262.0,257.0
372,2016/03/04,274.0,267.732,260.0,52300,274.0,260.0
373,2016/03/07,275.0,274.46,272.0,20000,277.0,271.0
374,2016/03/08,271.0,271.706,274.0,23100,277.0,268.0
375,2016/03/09,270.0,267.866,267.0,13400,270.0,267.0
376,2016/03/10,271.0,270.705,271.0,6100,271.0,270.0
377,2016/03/11,271.0,268.881,267.0,21900,272.0,267.0
378,2016/03/14,274.0,274.084,275.0,15400,277.0,270.0
379,2016/03/15,271.0,272.286,272.0,9100,273.0,271.0
380,2016/03/16,272.0,274.073,271.0,17900,281.0,269.0
381,2016/03/17,271.0,272.33,273.0,17300,275.0,271.0
382,2016/03/18,271.0,269.038,271.0,13300,271.0,268.0
383,2016/03/22,269.0,271.021,272.0,34000,274.0,269.0
384,2016/03/23,274.0,273.04,275.0,25000,275.0,272.0
385,2016/03/24,272.0,270.658,273.0,18400,273.0,268.0
386,2016/03/25,273.0,272.525,273.0,36800,274.0,270.0
387,2016/03/28,274.0,273.7,275.0,32700,275.0,272.0
388,2016/03/29,265.0,261.801,261.0,27600,265.0,260.0
389,2016/03/30,262.0,261.747,264.0,8700,264.0,260.0
390,2016/03/31,252.0,256.009,263.0,22900,263.0,251.0
391,2016/04/01,248.0,249.305,253.0,22600,254.0,245.0
392,2016/04/04,253.0,251.635,250.0,15600,254.0,249.0
393,2016/04/05,244.0,246.788,252.0,13700,253.0,239.0
394,2016/04/06,243.0,246.156,250.0,9600,250.0,242.0
395,2016/04/07,244.0,242.302,243.0,17200,248.0,237.0
396,2016/04/08,243.0,241.821,240.0,13400,246.0,237.0
397,2016/04/11,237.0,235.333,243.0,16200,243.0,230.0
398,2016/04/12,243.0,242.729,239.0,14400,250.0,237.0
399,2016/04/13,243.0,243.383,242.0,8100,245.0,240.0
400,2016/04/14,245.0,245.718,244.0,14200,248.0,243.0
401,2016/04/15,247.0,248.352,246.0,14500,255.0,245.0
402,2016/04/18,248.0,247.357,247.0,11200,253.0,244.0
403,2016/04/19,256.0,253.287,252.0,11500,258.0,249.0
404,2016/04/20,253.0,254.433,258.0,6700,258.0,253.0
405,2016/04/21,256.0,253.586,255.0,15700,256.0,250.0
406,2016/04/22,257.0,256.274,256.0,8400,257.0,254.0
407,2016/04/25,256.0,256.601,257.0,19800,260.0,252.0
408,2016/04/26,254.0,253.892,256.0,12000,256.0,252.0
409,2016/04/27,249.0,250.457,255.0,16200,255.0,248.0
410,2016/04/28,248.0,251.728,254.0,16900,258.0,246.0
411,2016/05/02,241.0,241.574,242.0,10100,243.0,240.0
412,2016/05/06,243.0,239.684,240.0,11400,244.0,237.0
413,2016/05/09,242.0,241.547,241.0,7500,244.0,240.0
414,2016/05/10,248.0,245.614,238.0,13200,250.0,238.0
415,2016/05/11,247.0,248.828,252.0,5800,252.0,247.0
416,2016/05/12,248.0,246.225,247.0,7100,248.0,243.0
417,2016/05/13,250.0,247.548,245.0,16600,255.0,243.0
418,2016/05/16,263.0,258.947,258.0,56800,265.0,249.0
419,2016/05/17,266.0,263.155,264.0,21300,267.0,258.0
420,2016/05/18,259.0,259.364,266.0,12100,266.0,257.0
421,2016/05/19,259.0,258.623,259.0,6900,260.0,257.0
422,2016/05/20,263.0,262.867,259.0,13500,265.0,258.0
423,2016/05/23,259.0,258.782,260.0,15100,260.0,257.0
424,2016/05/24,263.0,259.452,259.0,15700,263.0,256.0
425,2016/05/25,261.0,261.519,262.0,21600,265.0,259.0
426,2016/05/26,261.0,260.571,263.0,8400,264.0,257.0
427,2016/05/27,260.0,260.268,261.0,7100,262.0,258.0
428,2016/05/30,261.0,260.553,261.0,10300,263.0,259.0
429,2016/05/31,259.0,260.397,263.0,23200,263.0,258.0
430,2016/06/01,259.0,259.547,260.0,5300,261.0,258.0
431,2016/06/02,255.0,255.581,259.0,6200,260.0,254.0
432,2016/06/03,255.0,255.151,254.0,9300,260.0,253.0
433,2016/06/06,257.0,255.269,250.0,14500,262.0,250.0
434,2016/06/07,258.0,257.705,260.0,4400,260.0,256.0
435,2016/06/08,257.0,258.0,260.0,3000,260.0,256.0
436,2016/06/09,257.0,258.07,259.0,7100,259.0,257.0
437,2016/06/10,255.0,255.108,255.0,17600,256.0,253.0
438,2016/06/13,253.0,254.209,255.0,4300,255.0,253.0
439,2016/06/14,249.0,249.419,250.0,12400,250.0,248.0
440,2016/06/15,249.0,249.082,250.0,6100,251.0,248.0
441,2016/06/16,243.0,246.171,250.0,7600,251.0,243.0
442,2016/06/17,249.0,247.755,245.0,5300,249.0,245.0
443,2016/06/20,246.0,246.486,247.0,14000,247.0,245.0
444,2016/06/21,247.0,247.615,247.0,1300,249.0,247.0
445,2016/06/22,246.0,246.578,248.0,7100,249.0,246.0
446,2016/06/23,249.0,248.0,249.0,5300,249.0,246.0
447,2016/06/24,236.0,246.866,256.0,23200,256.0,232.0
448,2016/06/27,241.0,240.038,236.0,7900,243.0,236.0
449,2016/06/28,238.0,235.56,241.0,21600,253.0,226.0
450,2016/06/29,244.0,243.149,239.0,7400,244.0,239.0
451,2016/06/30,241.0,244.509,247.0,10600,247.0,241.0
452,2016/07/01,248.0,246.125,245.0,5600,248.0,243.0
453,2016/07/04,247.0,248.927,248.0,13600,251.0,247.0
454,2016/07/05,248.0,246.427,248.0,6800,250.0,243.0
455,2016/07/06,241.0,242.183,245.0,6000,247.0,241.0
456,2016/07/07,243.0,242.085,242.0,4700,244.0,241.0
457,2016/07/08,238.0,240.049,245.0,6100,245.0,238.0
458,2016/07/11,242.0,241.211,241.0,7100,243.0,239.0
459,2016/07/12,246.0,246.25,248.0,4800,248.0,245.0
460,2016/07/13,247.0,247.733,248.0,3000,250.0,247.0
461,2016/07/14,249.0,249.836,247.0,6100,253.0,247.0
462,2016/07/15,247.0,249.628,250.0,9400,251.0,247.0
463,2016/07/19,254.0,251.319,247.0,4700,254.0,247.0
464,2016/07/20,256.0,255.807,255.0,8300,258.0,255.0
465,2016/07/21,259.0,257.868,256.0,7600,260.0,255.0
466,2016/07/22,261.0,258.889,259.0,7200,261.0,257.0
467,2016/07/25,266.0,265.57,266.0,33000,266.0,262.0
468,2016/07/26,263.0,263.419,266.0,7400,266.0,262.0
469,2016/07/27,266.0,265.966,262.0,14800,268.0,262.0
470,2016/07/28,267.0,266.228,267.0,7900,267.0,265.0
471,2016/07/29,270.0,269.052,270.0,30700,270.0,265.0
472,2016/08/01,267.0,269.779,273.0,14000,273.0,264.0
473,2016/08/02,264.0,265.513,267.0,7600,270.0,260.0
474,2016/08/03,262.0,263.206,264.0,10200,265.0,262.0
475,2016/08/04,267.0,265.724,261.0,7600,268.0,261.0
476,2016/08/05,255.0,257.631,267.0,17600,269.0,248.0
477,2016/08/08,246.0,248.315,254.0,20000,256.0,234.0
478,2016/08/09,248.0,246.578,246.0,4500,248.0,245.0
479,2016/08/10,247.0,248.023,251.0,8900,251.0,245.0
480,2016/08/12,248.0,247.677,249.0,6800,251.0,247.0
481,2016/08/15,246.0,248.528,248.0,3600,252.0,246.0
482,2016/08/16,240.0,240.935,241.0,32400,243.0,239.0
483,2016/08/17,239.0,238.402,239.0,13700,239.0,237.0
484,2016/08/18,238.0,237.98,237.0,5100,239.0,237.0
485,2016/08/19,239.0,239.0,240.0,6000,240.0,238.0
486,2016/08/22,239.0,238.141,239.0,18500,240.0,236.0
487,2016/08/23,241.0,241.5,243.0,9800,243.0,239.0
488,2016/08/24,242.0,243.095,243.0,13700,252.0,241.0
489,2016/08/25,242.0,244.586,246.0,14500,246.0,241.0
490,2016/08/26,238.0,238.68,242.0,9700,242.0,237.0
491,2016/08/29,239.0,239.652,240.0,4600,241.0,239.0
492,2016/08/30,241.0,240.535,240.0,4300,241.0,240.0
493,2016/08/31,245.0,244.189,243.0,14300,246.0,243.0
494,2016/09/01,248.0,246.741,246.0,5400,248.0,245.0
495,2016/09/02,248.0,248.231,244.0,3900,249.0,244.0
496,2016/09/05,250.0,250.1,249.0,5000,251.0,248.0
497,2016/09/06,252.0,251.433,253.0,6700,253.0,249.0
498,2016/09/07,250.0,250.929,250.0,8400,252.0,250.0
499,2016/09/08,252.0,251.662,251.0,7100,252.0,251.0
500,2016/09/09,252.0,249.808,249.0,13000,252.0,249.0
501,2016/09/12,249.0,248.818,249.0,4400,249.0,248.0
502,2016/09/13,249.0,249.75,252.0,3200,252.0,249.0
503,2016/09/14,249.0,248.912,251.0,6800,251.0,248.0
504,2016/09/15,248.0,247.659,248.0,4100,248.0,246.0
505,2016/09/16,251.0,250.318,250.0,6600,252.0,249.0
506,2016/09/20,249.0,249.064,248.0,7800,250.0,248.0
507,2016/09/21,255.0,252.752,251.0,11700,255.0,249.0
508,2016/09/23,256.0,257.592,258.0,28200,260.0,254.0
509,2016/09/26,258.0,256.827,256.0,12700,258.0,256.0
510,2016/09/27,257.0,255.404,253.0,15100,257.0,253.0
511,2016/09/28,257.0,254.679,254.0,13100,257.0,254.0
512,2016/09/29,262.0,259.939,255.0,14800,263.0,255.0
513,2016/09/30,259.0,258.886,260.0,14000,262.0,256.0
514,2016/10/03,260.0,260.255,262.0,4700,262.0,259.0
515,2016/10/04,260.0,260.342,260.0,7600,261.0,259.0
516,2016/10/05,261.0,260.156,259.0,7700,262.0,258.0
517,2016/10/06,260.0,260.948,262.0,7700,263.0,260.0
518,2016/10/07,259.0,258.635,259.0,7400,259.0,257.0
519,2016/10/11,261.0,259.897,262.0,5800,262.0,258.0
520,2016/10/12,258.0,258.112,262.0,18700,262.0,257.0
521,2016/10/13,260.0,259.433,259.0,12000,261.0,257.0
522,2016/10/14,259.0,257.154,256.0,3900,259.0,256.0
523,2016/10/17,260.0,259.65,261.0,10000,261.0,257.0
524,2016/10/18,261.0,260.467,260.0,1500,261.0,260.0
525,2016/10/19,259.0,259.479,260.0,4800,260.0,258.0
526,2016/10/20,260.0,258.813,259.0,7500,260.0,258.0
527,2016/10/21,260.0,259.92,260.0,5000,261.0,259.0
528,2016/10/24,262.0,261.245,261.0,4900,262.0,260.0
529,2016/10/25,264.0,262.944,263.0,21600,264.0,260.0
530,2016/10/26,265.0,263.802,265.0,10100,265.0,261.0
531,2016/10/27,264.0,263.838,264.0,8000,265.0,262.0
532,2016/10/28,265.0,264.789,264.0,31200,265.0,264.0
533,2016/10/31,263.0,263.19,263.0,9500,264.0,263.0
534,2016/11/01,259.0,260.373,261.0,20900,263.0,258.0
535,2016/11/02,255.0,256.525,258.0,16200,258.0,255.0
536,2016/11/04,253.0,253.322,255.0,14600,256.0,253.0
537,2016/11/07,256.0,254.979,255.0,9600,257.0,252.0
538,2016/11/08,255.0,255.177,256.0,3400,256.0,254.0
539,2016/11/09,243.0,245.863,257.0,33600,260.0,240.0
540,2016/11/10,253.0,251.848,248.0,15800,254.0,248.0
541,2016/11/11,259.0,257.194,254.0,10300,261.0,254.0
542,2016/11/14,260.0,262.374,263.0,16300,263.0,260.0
543,2016/11/15,260.0,258.403,261.0,7200,261.0,255.0
544,2016/11/16,262.0,262.206,260.0,19900,264.0,260.0
545,2016/11/17,268.0,263.418,262.0,79600,269.0,257.0
546,2016/11/18,268.0,268.726,270.0,17500,270.0,267.0
547,2016/11/21,270.0,269.831,270.0,41500,272.0,268.0
548,2016/11/22,270.0,269.921,271.0,21600,271.0,268.0
549,2016/11/24,272.0,271.631,272.0,14900,272.0,270.0
550,2016/11/25,272.0,272.08,272.0,28700,273.0,271.0
551,2016/11/28,273.0,272.473,272.0,15000,274.0,272.0
552,2016/11/29,274.0,273.125,272.0,11200,274.0,272.0
553,2016/11/30,274.0,273.838,275.0,27200,275.0,272.0
554,2016/12/01,275.0,274.72,275.0,28600,276.0,273.0
555,2016/12/02,274.0,273.249,275.0,20100,275.0,270.0
556,2016/12/05,275.0,274.908,274.0,26200,278.0,273.0
557,2016/12/06,276.0,276.163,277.0,23900,278.0,274.0
558,2016/12/07,289.0,285.448,278.0,137900,290.0,277.0
559,2016/12/08,302.0,305.292,297.0,349600,320.0,295.0
560,2016/12/09,303.0,300.98,301.0,101200,305.0,299.0
561,2016/12/12,293.0,293.992,302.0,104300,302.0,283.0
562,2016/12/13,292.0,290.112,293.0,44600,293.0,286.0
563,2016/12/14,285.0,285.621,292.0,78900,292.0,283.0
564,2016/12/15,283.0,282.911,286.0,77800,286.0,281.0
565,2016/12/16,284.0,283.146,284.0,50100,284.0,281.0
566,2016/12/19,280.0,279.711,279.0,68400,281.0,278.0
567,2016/12/20,285.0,283.844,286.0,73600,286.0,281.0
568,2016/12/21,284.0,284.666,285.0,46700,286.0,283.0
569,2016/12/22,283.0,281.341,283.0,67200,284.0,280.0
570,2016/12/26,282.0,282.159,283.0,29500,284.0,281.0
571,2016/12/27,281.0,280.035,282.0,85100,283.0,278.0
572,2016/12/28,283.0,281.954,280.0,30200,284.0,280.0
573,2016/12/29,280.0,279.563,281.0,38900,282.0,277.0
574,2016/12/30,285.0,283.322,279.0,52800,291.0,278.0
575,2017/01/04,288.0,288.337,291.0,74100,292.0,286.0
576,2017/01/05,288.0,287.676,289.0,32100,289.0,287.0
577,2017/01/06,288.0,287.837,288.0,49200,289.0,287.0
578,2017/01/10,290.0,289.858,290.0,90700,292.0,288.0
579,2017/01/11,292.0,291.258,291.0,26400,292.0,290.0
580,2017/01/12,289.0,290.339,292.0,62500,292.0,289.0
581,2017/01/13,289.0,288.73,288.0,49600,290.0,287.0
582,2017/01/16,287.0,289.474,289.0,60600,292.0,287.0
583,2017/01/17,286.0,285.188,286.0,66500,288.0,283.0
584,2017/01/18,286.0,285.06,286.0,44800,287.0,283.0
585,2017/01/19,287.0,286.362,288.0,27900,288.0,285.0
586,2017/01/20,289.0,287.891,287.0,49300,289.0,286.0
587,2017/01/23,288.0,287.095,288.0,27400,288.0,286.0
588,2017/01/24,286.0,285.422,284.0,34800,287.0,284.0
589,2017/01/25,289.0,287.737,287.0,38400,289.0,287.0
590,2017/01/26,291.0,291.318,292.0,60100,292.0,290.0
591,2017/01/27,297.0,295.835,292.0,203600,300.0,291.0
592,2017/01/30,298.0,296.792,298.0,136100,298.0,294.0
593,2017/01/31,297.0,295.561,295.0,46200,297.0,295.0
594,2017/02/01,292.0,292.707,295.0,106000,296.0,291.0
595,2017/02/02,288.0,289.827,294.0,86800,294.0,287.0
596,2017/02/03,289.0,289.431,288.0,55200,291.0,288.0
597,2017/02/06,285.0,286.878,290.0,124600,290.0,284.0
598,2017/02/07,286.0,286.882,286.0,22800,289.0,285.0
599,2017/02/08,289.0,287.898,289.0,13700,289.0,287.0
600,2017/02/09,288.0,287.752,288.0,13700,289.0,287.0
601,2017/02/10,289.0,290.156,289.0,102000,292.0,289.0
602,2017/02/13,294.0,292.495,292.0,67100,294.0,291.0
603,2017/02/14,295.0,294.218,294.0,70500,296.0,292.0
604,2017/02/15,298.0,297.456,296.0,68000,299.0,296.0
605,2017/02/16,299.0,297.41,299.0,65300,299.0,295.0
606,2017/02/17,297.0,296.261,298.0,52200,299.0,293.0
607,2017/02/20,300.0,298.514,296.0,61900,300.0,296.0
608,2017/02/21,300.0,300.662,302.0,68400,302.0,299.0
609,2017/02/22,304.0,304.175,301.0,108800,306.0,301.0
610,2017/02/23,308.0,308.324,306.0,209900,311.0,305.0
611,2017/02/24,305.0,306.646,307.0,119700,309.0,304.0
612,2017/02/27,311.0,309.377,303.0,540500,316.0,300.0
613,2017/02/28,309.0,308.403,310.0,160600,311.0,305.0
614,2017/03/01,310.0,309.1,309.0,78700,311.0,307.0
615,2017/03/02,312.0,311.848,312.0,87000,314.0,310.0
616,2017/03/03,312.0,312.646,313.0,86800,313.0,311.0
617,2017/03/06,313.0,312.863,314.0,47300,314.0,312.0
618,2017/03/07,313.0,313.008,312.0,50100,314.0,312.0
619,2017/03/08,308.0,310.352,313.0,120800,313.0,308.0
620,2017/03/09,308.0,308.803,308.0,39000,310.0,308.0
621,2017/03/10,308.0,308.561,308.0,104400,311.0,307.0
622,2017/03/13,309.0,307.006,307.0,112900,310.0,304.0
623,2017/03/14,307.0,307.06,309.0,65100,309.0,302.0
624,2017/03/15,306.0,305.612,306.0,42500,307.0,304.0
625,2017/03/16,305.0,305.358,307.0,119900,309.0,304.0
626,2017/03/17,306.0,305.559,305.0,47600,307.0,305.0
627,2017/03/21,305.0,306.108,306.0,45500,307.0,305.0
628,2017/03/22,304.0,303.896,303.0,101200,305.0,303.0
629,2017/03/23,305.0,305.601,304.0,69000,307.0,304.0
630,2017/03/24,309.0,307.974,309.0,81800,309.0,306.0
631,2017/03/27,307.0,307.44,310.0,90500,312.0,305.0
632,2017/03/28,307.0,306.419,307.0,140800,308.0,304.0
633,2017/03/29,301.0,296.753,299.0,144300,303.0,292.0
634,2017/03/30,300.0,301.911,303.0,86900,303.0,297.0
635,2017/03/31,299.0,301.232,298.0,99500,305.0,298.0
636,2017/04/03,294.0,295.03,299.0,70900,299.0,291.0
637,2017/04/04,287.0,290.094,293.0,56500,294.0,286.0
638,2017/04/05,285.0,284.17,287.0,55400,288.0,281.0
639,2017/04/06,276.0,280.345,285.0,49600,285.0,276.0
640,2017/04/07,280.0,281.847,278.0,77700,291.0,277.0
641,2017/04/10,285.0,282.881,284.0,24300,285.0,279.0
642,2017/04/11,279.0,280.27,285.0,31100,285.0,276.0
643,2017/04/12,275.0,275.05,279.0,57700,280.0,271.0
644,2017/04/13,273.0,272.407,275.0,39600,275.0,270.0
645,2017/04/14,270.0,271.167,272.0,24000,275.0,269.0
646,2017/04/17,269.0,268.689,271.0,40800,275.0,265.0
647,2017/04/18,271.0,269.684,272.0,35400,274.0,263.0
648,2017/04/19,270.0,271.571,272.0,22600,274.0,270.0
649,2017/04/20,271.0,270.955,270.0,11100,272.0,270.0
650,2017/04/21,276.0,274.797,273.0,23600,276.0,273.0
651,2017/04/24,277.0,276.629,279.0,28600,279.0,275.0
652,2017/04/25,278.0,272.48,280.0,65800,280.0,260.0
653,2017/04/26,282.0,280.096,281.0,41600,282.0,276.0
654,2017/04/27,283.0,282.26,281.0,21900,284.0,281.0
655,2017/04/28,280.0,281.605,283.0,20500,283.0,280.0
656,2017/05/01,283.0,282.687,282.0,38300,284.0,280.0
657,2017/05/02,285.0,284.19,284.0,14200,285.0,283.0
658,2017/05/08,288.0,287.627,287.0,31400,288.0,287.0
659,2017/05/09,287.0,286.508,287.0,30700,289.0,285.0
660,2017/05/10,287.0,287.17,288.0,40000,289.0,285.0
661,2017/05/11,291.0,290.412,288.0,55400,296.0,288.0
662,2017/05/12,292.0,290.806,290.0,55600,293.0,288.0
663,2017/05/15,292.0,291.899,294.0,108000,294.0,288.0
664,2017/05/16,289.0,289.836,292.0,28600,292.0,289.0
665,2017/05/17,288.0,287.798,288.0,28700,289.0,285.0
666,2017/05/18,288.0,285.872,283.0,49100,289.0,283.0
667,2017/05/19,289.0,287.609,289.0,37800,289.0,286.0
668,2017/05/22,292.0,291.6,291.0,46000,293.0,290.0
669,2017/05/23,291.0,291.273,292.0,24200,292.0,290.0
670,2017/05/24,293.0,292.44,292.0,67700,294.0,292.0
671,2017/05/25,293.0,293.294,294.0,42900,294.0,292.0
672,2017/05/26,291.0,292.242,294.0,14900,294.0,291.0
673,2017/05/29,292.0,291.82,294.0,35500,294.0,290.0
674,2017/05/30,292.0,290.877,292.0,32600,292.0,290.0
675,2017/05/31,290.0,291.036,293.0,22300,293.0,290.0
676,2017/06/01,291.0,291.155,291.0,21300,293.0,290.0
677,2017/06/02,291.0,291.097,292.0,71000,293.0,290.0
678,2017/06/05,291.0,291.215,292.0,27400,292.0,290.0
679,2017/06/06,290.0,290.229,292.0,22300,292.0,289.0
680,2017/06/07,291.0,290.994,292.0,16200,292.0,290.0
681,2017/06/08,290.0,290.958,291.0,16700,292.0,290.0
682,2017/06/09,289.0,289.495,290.0,46500,291.0,288.0
683,2017/06/12,289.0,288.973,290.0,41300,292.0,288.0
684,2017/06/13,290.0,289.367,289.0,15800,291.0,287.0
685,2017/06/14,288.0,288.959,290.0,17000,290.0,288.0
686,2017/06/15,289.0,289.026,289.0,15700,290.0,288.0
687,2017/06/16,289.0,288.52,288.0,17300,289.0,288.0
688,2017/06/19,286.0,287.923,288.0,42900,290.0,286.0
689,2017/06/20,288.0,288.709,289.0,23700,290.0,288.0
690,2017/06/21,288.0,287.417,289.0,21800,289.0,286.0
691,2017/06/22,290.0,288.932,288.0,60600,290.0,288.0
692,2017/06/23,291.0,290.259,291.0,35500,291.0,289.0
693,2017/06/26,289.0,290.409,291.0,28600,292.0,289.0
694,2017/06/27,289.0,289.553,290.0,62000,291.0,289.0
695,2017/06/28,289.0,288.883,289.0,54500,291.0,288.0
696,2017/06/29,289.0,288.896,291.0,50200,291.0,288.0
697,2017/06/30,288.0,288.176,288.0,63500,290.0,287.0
698,2017/07/03,289.0,289.22,290.0,14100,290.0,288.0
699,2017/07/04,289.0,289.182,290.0,36800,290.0,288.0
700,2017/07/05,293.0,290.949,290.0,54600,295.0,288.0
701,2017/07/06,291.0,291.755,294.0,51900,294.0,290.0
702,2017/07/07,292.0,291.932,291.0,23400,293.0,290.0
703,2017/07/10,294.0,294.271,294.0,70600,295.0,293.0
704,2017/07/11,295.0,295.13,295.0,25400,296.0,294.0
705,2017/07/12,295.0,295.021,296.0,28900,296.0,294.0
706,2017/07/13,296.0,295.169,296.0,21900,296.0,295.0
707,2017/07/14,294.0,294.455,295.0,86100,297.0,294.0
708,2017/07/18,294.0,294.183,295.0,52900,297.0,293.0
709,2017/07/19,295.0,294.807,293.0,8300,295.0,293.0
710,2017/07/20,295.0,293.806,296.0,25800,296.0,292.0
711,2017/07/21,294.0,294.206,293.0,34500,296.0,293.0
712,2017/07/24,299.0,297.264,294.0,76500,299.0,294.0
713,2017/07/25,299.0,299.004,300.0,46400,300.0,297.0
714,2017/07/26,300.0,300.664,299.0,39300,304.0,299.0
715,2017/07/27,302.0,303.55,300.0,56900,305.0,300.0
716,2017/07/28,301.0,301.551,303.0,42100,304.0,300.0
717,2017/07/31,301.0,302.055,301.0,72500,306.0,300.0
718,2017/08/01,300.0,301.49,301.0,62000,303.0,299.0
719,2017/08/02,303.0,302.512,301.0,54100,304.0,300.0
720,2017/08/03,304.0,304.22,303.0,68700,306.0,302.0
721,2017/08/04,307.0,308.119,304.0,423800,319.0,301.0
722,2017/08/07,312.0,314.025,317.0,196300,317.0,311.0
723,2017/08/08,315.0,313.999,315.0,151800,317.0,310.0
724,2017/08/09,313.0,310.772,312.0,116300,313.0,308.0
725,2017/08/10,312.0,310.739,313.0,47800,313.0,309.0
726,2017/08/14,309.0,307.528,308.0,84900,310.0,305.0
727,2017/08/15,311.0,310.877,310.0,47000,312.0,309.0
728,2017/08/16,310.0,310.184,311.0,47200,311.0,309.0
729,2017/08/17,312.0,311.625,310.0,68700,313.0,309.0
730,2017/08/18,309.0,309.518,310.0,53100,313.0,308.0
731,2017/08/21,312.0,311.192,311.0,53100,313.0,309.0
732,2017/08/22,313.0,312.432,312.0,65800,315.0,310.0
733,2017/08/23,313.0,314.262,314.0,113800,316.0,312.0
734,2017/08/24,314.0,313.32,312.0,65600,315.0,312.0
735,2017/08/25,314.0,313.26,314.0,41600,314.0,312.0
736,2017/08/28,320.0,317.742,315.0,187400,320.0,315.0
737,2017/08/29,319.0,318.088,319.0,66000,319.0,316.0
738,2017/08/30,319.0,319.561,320.0,112000,322.0,318.0
739,2017/08/31,322.0,320.948,320.0,103200,322.0,319.0
740,2017/09/01,321.0,324.085,325.0,145300,327.0,321.0
741,2017/09/04,326.0,323.23,326.0,148300,327.0,316.0
742,2017/09/05,315.0,317.801,326.0,123800,326.0,301.0
743,2017/09/06,325.0,319.445,313.0,125000,325.0,310.0
744,2017/09/07,405.0,392.135,324.0,6227500,405.0,322.0
745,2017/09/08,400.0,434.151,437.0,43539300,468.0,393.0
746,2017/09/11,448.0,442.523,440.0,54274600,473.0,415.0
747,2017/09/12,440.0,448.34,466.0,10960800,467.0,433.0
748,2017/09/13,520.0,506.722,480.0,8684900,520.0,480.0
749,2017/09/14,458.0,483.687,530.0,13172200,534.0,447.0
750,2017/09/15,468.0,469.137,450.0,6460700,493.0,448.0
751,2017/09/19,456.0,458.7,476.0,1934300,476.0,451.0
752,2017/09/20,435.0,438.106,450.0,1567200,450.0,430.0
753,2017/09/21,436.0,439.454,437.0,1216900,450.0,433.0
754,2017/09/22,438.0,434.91,439.0,718400,444.0,430.0
755,2017/09/25,440.0,440.853,438.0,633900,447.0,435.0
756,2017/09/26,436.0,443.727,440.0,1030600,456.0,436.0
757,2017/09/27,444.0,443.86,438.0,664800,449.0,438.0
758,2017/09/28,460.0,461.052,455.0,2432000,474.0,449.0
759,2017/09/29,452.0,456.603,457.0,811200,467.0,451.0
760,2017/10/02,468.0,461.546,456.0,1382000,469.0,452.0
761,2017/10/03,480.0,475.229,479.0,1502300,484.0,463.0
762,2017/10/04,462.0,471.026,480.0,956200,482.0,462.0
763,2017/10/05,447.0,451.223,462.0,1137200,470.0,442.0
764,2017/10/06,489.0,480.358,452.0,3047800,497.0,450.0
765,2017/10/10,569.0,548.701,497.0,5409800,569.0,497.0
766,2017/10/11,575.0,588.84,615.0,7897800,635.0,540.0
767,2017/10/12,556.0,576.579,568.0,2102900,605.0,549.0
768,2017/10/13,656.0,615.736,556.0,5102500,656.0,536.0
769,2017/10/16,674.0,706.742,706.0,6635100,745.0,665.0
770,2017/10/17,675.0,685.833,667.0,2420000,719.0,661.0
771,2017/10/18,664.0,671.228,680.0,1272500,695.0,656.0
772,2017/10/19,618.0,635.781,659.0,1257900,672.0,618.0
773,2017/10/20,627.0,634.393,628.0,1560500,666.0,610.0
774,2017/10/23,658.0,661.5,640.0,1789100,700.0,624.0
775,2017/10/24,633.0,641.115,650.0,598600,656.0,628.0
776,2017/10/25,614.0,623.016,638.0,631100,643.0,608.0
777,2017/10/26,628.0,625.058,620.0,408000,638.0,616.0
778,2017/10/27,619.0,621.853,632.0,464400,636.0,614.0
779,2017/10/30,654.0,642.968,624.0,785800,661.0,620.0
780,2017/10/31,648.0,649.702,656.0,360100,659.0,643.0
781,2017/11/01,659.0,657.491,644.0,768400,675.0,637.0
782,2017/11/02,671.0,664.898,666.0,682500,673.0,653.0
783,2017/11/06,675.0,682.926,680.0,946300,695.0,672.0
784,2017/11/07,660.0,667.792,676.0,847500,684.0,648.0
785,2017/11/08,622.0,626.695,654.0,1012800,663.0,612.0
786,2017/11/09,614.0,618.647,627.0,811000,641.0,592.0
787,2017/11/10,650.0,663.814,604.0,2805000,710.0,590.0
788,2017/11/13,618.0,627.46,640.0,750000,644.0,611.0
789,2017/11/14,591.0,603.458,617.0,808000,623.0,589.0
790,2017/11/15,562.0,560.046,581.0,951300,585.0,539.0
791,2017/11/16,575.0,581.192,563.0,620000,597.0,562.0
792,2017/11/17,562.0,570.389,578.0,354700,584.0,560.0
793,2017/11/20,568.0,566.202,560.0,313900,577.0,552.0
794,2017/11/21,569.0,575.568,570.0,312000,593.0,568.0
795,2017/11/22,621.0,607.583,582.0,1103800,628.0,578.0
796,2017/11/24,613.0,614.041,620.0,426900,625.0,599.0
797,2017/11/27,597.0,602.683,617.0,396300,624.0,591.0
798,2017/11/28,578.0,579.525,590.0,384800,595.0,571.0
799,2017/11/29,589.0,597.307,582.0,436900,616.0,582.0
800,2017/11/30,585.0,587.769,598.0,197800,598.0,580.0
801,2017/12/01,586.0,608.228,610.0,936900,634.0,586.0
802,2017/12/04,645.0,640.515,585.0,6912700,667.0,583.0
803,2017/12/05,632.0,653.117,648.0,7059100,682.0,618.0
804,2017/12/06,598.0,605.296,624.0,1291700,628.0,587.0
805,2017/12/07,604.0,607.355,603.0,845000,620.0,596.0
806,2017/12/08,608.0,603.109,600.0,394400,608.0,598.0
807,2017/12/11,613.0,620.675,617.0,611900,633.0,609.0
808,2017/12/12,631.0,633.063,617.0,752600,645.0,615.0
809,2017/12/13,654.0,644.21,629.0,1033900,656.0,629.0
810,2017/12/14,718.0,715.677,682.0,10855900,754.0,671.0
811,2017/12/15,742.0,734.212,705.0,8355200,760.0,704.0
812,2017/12/18,835.0,815.851,757.0,20105000,860.0,757.0
813,2017/12/19,792.0,801.107,833.0,9693900,837.0,770.0
814,2017/12/20,748.0,769.307,802.0,3486700,809.0,741.0
815,2017/12/21,777.0,788.392,769.0,4719100,816.0,763.0
816,2017/12/22,780.0,777.07,767.0,1677900,791.0,760.0
817,2017/12/25,755.0,763.843,771.0,1174400,783.0,753.0
818,2017/12/26,750.0,758.393,750.0,905800,773.0,747.0
819,2017/12/27,765.0,768.23,759.0,760100,788.0,759.0
820,2017/12/28,760.0,765.032,761.0,513100,773.0,755.0
821,2017/12/29,796.0,790.288,768.0,1903200,803.0,762.0
822,2018/01/04,800.0,801.44,807.0,1187300,816.0,792.0
823,2018/01/05,795.0,791.761,802.0,761200,807.0,786.0
824,2018/01/09,810.0,827.174,820.0,2927100,857.0,801.0
825,2018/01/10,880.0,854.6,799.0,3671200,886.0,792.0
826,2018/01/11,1030.0,962.535,871.0,6399100,1030.0,865.0
827,2018/01/12,999.0,1041.335,1090.0,5709100,1125.0,988.0
828,2018/01/15,1022.0,1034.951,1070.0,2370200,1075.0,1005.0
829,2018/01/16,1322.0,1216.2,1057.0,10040000,1322.0,1044.0
830,2018/01/17,1309.0,1295.116,1266.0,8211300,1357.0,1200.0
831,2018/01/18,1210.0,1276.846,1309.0,4260600,1380.0,1200.0
832,2018/01/19,1197.0,1173.605,1197.0,2380800,1229.0,1128.0
833,2018/01/22,1193.0,1221.513,1227.0,1232100,1263.0,1185.0
834,2018/01/23,1194.0,1201.947,1185.0,903800,1226.0,1182.0
835,2018/01/24,1154.0,1148.685,1180.0,1217900,1180.0,1121.0
836,2018/01/25,1158.0,1171.166,1157.0,1011400,1201.0,1141.0
837,2018/01/26,1151.0,1168.531,1157.0,619600,1193.0,1148.0
838,2018/01/29,1088.0,1113.797,1146.0,902800,1150.0,1086.0
839,2018/01/30,1060.0,1071.697,1100.0,804900,1107.0,1043.0
840,2018/01/31,1053.0,1074.445,1070.0,648300,1098.0,1051.0
841,2018/02/01,1092.0,1082.555,1077.0,630800,1111.0,1060.0
842,2018/02/02,1082.0,1078.875,1058.0,543300,1107.0,1058.0
843,2018/02/05,1007.0,1008.445,992.0,737000,1039.0,983.0
844,2018/02/06,909.0,907.797,905.0,1225700,960.0,872.0
845,2018/02/07,948.0,987.585,1014.0,785000,1021.0,943.0
846,2018/02/08,968.0,959.108,928.0,485100,985.0,928.0
847,2018/02/09,975.0,954.907,893.0,957800,1032.0,890.0
848,2018/02/13,902.0,946.553,1000.0,863400,1020.0,894.0
849,2018/02/14,908.0,919.338,917.0,486400,953.0,894.0
850,2018/02/15,948.0,940.972,931.0,605700,966.0,906.0
851,2018/02/16,915.0,936.238,970.0,642900,978.0,913.0
852,2018/02/19,960.0,951.399,918.0,553400,976.0,918.0
853,2018/02/20,986.0,981.387,951.0,555100,1002.0,951.0
854,2018/02/21,1033.0,1045.394,1052.0,1508500,1089.0,1009.0
855,2018/02/22,996.0,1002.825,1030.0,611000,1030.0,984.0
856,2018/02/23,1029.0,1024.74,1006.0,564700,1040.0,1004.0
857,2018/02/26,1010.0,1037.408,1050.0,654400,1072.0,1006.0
858,2018/02/27,982.0,992.738,1019.0,483400,1024.0,978.0
859,2018/02/28,963.0,967.864,967.0,398300,990.0,947.0
860,2018/03/01,956.0,964.727,957.0,366700,981.0,952.0
861,2018/03/02,927.0,921.494,932.0,485100,936.0,906.0
862,2018/03/05,886.0,896.357,920.0,428100,923.0,882.0
863,2018/03/06,917.0,920.629,910.0,333700,936.0,901.0
864,2018/03/07,902.0,911.233,921.0,321300,942.0,894.0
865,2018/03/08,907.0,904.619,928.0,254900,928.0,895.0
866,2018/03/09,904.0,908.571,922.0,247000,924.0,901.0
867,2018/03/12,900.0,904.375,911.0,261000,927.0,888.0
868,2018/03/13,896.0,892.342,888.0,157000,903.0,888.0
869,2018/03/14,894.0,895.482,894.0,167500,905.0,887.0
870,2018/03/15,882.0,883.287,894.0,202000,896.0,874.0
871,2018/03/16,857.0,863.214,889.0,243500,889.0,852.0
872,2018/03/19,815.0,824.078,844.0,317800,844.0,813.0
873,2018/03/20,804.0,804.994,796.0,330600,818.0,793.0
874,2018/03/22,813.0,809.537,802.0,152100,817.0,801.0
875,2018/03/23,772.0,778.698,783.0,290300,790.0,771.0
876,2018/03/26,769.0,752.063,763.0,308100,770.0,739.0
877,2018/03/27,790.0,787.492,792.0,187200,796.0,777.0
878,2018/03/28,795.0,790.525,772.0,182400,805.0,771.0
879,2018/03/29,772.0,777.68,801.0,157600,806.0,765.0
880,2018/03/30,786.0,786.948,773.0,165600,796.0,773.0
881,2018/04/02,782.0,789.322,792.0,152900,805.0,782.0
882,2018/04/03,762.0,761.972,767.0,175500,773.0,756.0
883,2018/04/04,752.0,754.493,770.0,136600,771.0,747.0
884,2018/04/05,737.0,738.79,749.0,223700,754.0,731.0
885,2018/04/06,726.0,730.918,725.0,258300,742.0,723.0
886,2018/04/09,729.0,717.899,715.0,465700,744.0,695.0
887,2018/04/10,716.0,715.488,719.0,219700,741.0,704.0
888,2018/04/11,707.0,710.861,723.0,149400,724.0,703.0
889,2018/04/12,698.0,700.022,698.0,149100,708.0,695.0
890,2018/04/13,716.0,713.154,700.0,178200,721.0,698.0
891,2018/04/16,686.0,694.711,713.0,299400,719.0,686.0
892,2018/04/17,681.0,674.101,682.0,225800,692.0,659.0
893,2018/04/18,705.0,700.961,681.0,226900,720.0,681.0
894,2018/04/19,725.0,720.072,706.0,228500,734.0,701.0
895,2018/04/20,728.0,721.561,714.0,139900,731.0,704.0
896,2018/04/23,756.0,751.51,728.0,271600,768.0,726.0
897,2018/04/24,730.0,740.358,755.0,351300,765.0,722.0
898,2018/04/25,716.0,718.432,723.0,183900,732.0,712.0
899,2018/04/26,705.0,707.41,715.0,374700,717.0,701.0
900,2018/04/27,695.0,694.484,707.0,216600,708.0,686.0
901,2018/05/01,684.0,685.96,682.0,96600,701.0,681.0
902,2018/05/02,702.0,694.252,680.0,139100,703.0,680.0
903,2018/05/07,702.0,700.304,697.0,66700,710.0,696.0
904,2018/05/08,730.0,724.542,700.0,247900,747.0,696.0
905,2018/05/09,734.0,734.353,740.0,186200,743.0,724.0
906,2018/05/10,740.0,739.984,739.0,97900,745.0,732.0
907,2018/05/11,721.0,728.086,745.0,651800,764.0,678.0
908,2018/05/14,699.0,699.072,706.0,238900,708.0,688.0
909,2018/05/15,725.0,716.881,701.0,158800,729.0,697.0
910,2018/05/16,728.0,725.273,721.0,124900,736.0,714.0
911,2018/05/17,736.0,738.264,725.0,123200,746.0,724.0
912,2018/05/18,746.0,744.933,732.0,104200,754.0,732.0
913,2018/05/21,744.0,745.875,740.0,91000,751.0,740.0
914,2018/05/22,721.0,729.718,743.0,94400,746.0,720.0
915,2018/05/23,708.0,712.556,720.0,134200,728.0,703.0
916,2018/05/24,699.0,699.619,706.0,99500,707.0,695.0
917,2018/05/25,690.0,692.8,695.0,99200,702.0,689.0
918,2018/05/28,697.0,692.984,699.0,50300,699.0,687.0
919,2018/05/29,675.0,679.438,694.0,108500,696.0,669.0
920,2018/05/30,655.0,653.022,649.0,141200,664.0,643.0
921,2018/05/31,651.0,655.2,670.0,144700,670.0,645.0
922,2018/06/01,659.0,656.19,652.0,63300,667.0,645.0
923,2018/06/04,656.0,658.969,661.0,60700,669.0,654.0
924,2018/06/05,632.0,634.918,660.0,145400,660.0,622.0
925,2018/06/06,625.0,628.282,625.0,126300,637.0,622.0
926,2018/06/07,656.0,647.125,630.0,135700,658.0,622.0
927,2018/06/08,652.0,651.755,652.0,84100,656.0,646.0
928,2018/06/11,666.0,661.356,649.0,88500,672.0,647.0
929,2018/06/12,666.0,662.95,670.0,72600,671.0,655.0
930,2018/06/13,665.0,666.907,666.0,40700,672.0,664.0
931,2018/06/14,653.0,657.541,659.0,59200,667.0,652.0
932,2018/06/15,647.0,651.309,665.0,66700,665.0,643.0
933,2018/06/18,624.0,628.324,636.0,82200,638.0,621.0
934,2018/06/19,605.0,613.411,620.0,104100,635.0,602.0
935,2018/06/20,606.0,587.907,606.0,198800,609.0,570.0
936,2018/06/21,608.0,606.559,596.0,132100,618.0,595.0
937,2018/06/22,608.0,606.666,607.0,70300,618.0,595.0
938,2018/06/25,587.0,595.111,602.0,85900,609.0,586.0
939,2018/06/26,580.0,578.321,567.0,103400,585.0,567.0
940,2018/06/27,580.0,579.306,577.0,60400,585.0,571.0
941,2018/06/28,578.0,573.516,576.0,79800,579.0,569.0
942,2018/06/29,568.0,568.666,580.0,116700,580.0,562.0
943,2018/07/02,549.0,560.247,563.0,87100,575.0,547.0
944,2018/07/03,541.0,545.065,548.0,89000,557.0,534.0
945,2018/07/04,531.0,533.148,534.0,115000,539.0,529.0
946,2018/07/05,501.0,510.563,527.0,193100,533.0,500.0
947,2018/07/06,518.0,513.349,504.0,149100,523.0,503.0
948,2018/07/09,528.0,520.052,516.0,75400,531.0,508.0
949,2018/07/10,529.0,534.833,528.0,98300,542.0,528.0
950,2018/07/11,530.0,518.284,523.0,140700,534.0,502.0
951,2018/07/12,517.0,523.485,528.0,68900,530.0,516.0
952,2018/07/13,525.0,522.827,520.0,68000,528.0,519.0
953,2018/07/17,526.0,527.135,521.0,103600,534.0,518.0
954,2018/07/18,534.0,533.443,527.0,65200,538.0,527.0
955,2018/07/19,541.0,542.086,535.0,75700,549.0,533.0
956,2018/07/20,531.0,531.912,538.0,62600,541.0,524.0
957,2018/07/23,528.0,527.013,521.0,46800,531.0,521.0
958,2018/07/24,591.0,564.25,532.0,314200,593.0,532.0
959,2018/07/25,649.0,667.107,634.0,3203700,691.0,625.0
960,2018/07/26,613.0,622.504,649.0,719300,652.0,604.0
961,2018/07/27,651.0,639.516,603.0,771800,655.0,603.0
962,2018/07/30,642.0,661.17,669.0,1013200,684.0,630.0
963,2018/07/31,614.0,619.714,632.0,330500,636.0,611.0
964,2018/08/01,627.0,625.985,621.0,432800,647.0,611.0
965,2018/08/02,631.0,632.667,630.0,296300,642.0,624.0
966,2018/08/03,605.0,621.376,631.0,424800,647.0,605.0
967,2018/08/06,593.0,590.335,600.0,294800,620.0,568.0
968,2018/08/07,575.0,576.305,585.0,212200,594.0,563.0
969,2018/08/08,586.0,583.084,570.0,124500,590.0,570.0
970,2018/08/09,579.0,577.813,583.0,66200,583.0,570.0
971,2018/08/10,579.0,581.757,575.0,118900,590.0,572.0
972,2018/08/13,538.0,544.713,579.0,285700,579.0,527.0
973,2018/08/14,545.0,543.414,538.0,73500,548.0,537.0
974,2018/08/15,531.0,535.688,545.0,96100,549.0,525.0
975,2018/08/16,512.0,514.072,524.0,132400,524.0,507.0
976,2018/08/17,519.0,517.488,513.0,76800,520.0,511.0
977,2018/08/20,509.0,514.527,519.0,75300,526.0,508.0
978,2018/08/21,508.0,505.484,501.0,86100,516.0,501.0
979,2018/08/22,573.0,559.211,517.0,1040300,587.0,513.0
980,2018/08/23,572.0,568.977,573.0,378100,583.0,560.0
981,2018/08/24,564.0,559.833,565.0,212500,569.0,550.0
982,2018/08/27,586.0,582.788,575.0,302200,598.0,566.0
983,2018/08/28,591.0,594.999,599.0,212100,604.0,583.0
984,2018/08/29,643.0,646.151,599.0,1586500,676.0,591.0
985,2018/08/30,641.0,638.723,647.0,582700,658.0,622.0
986,2018/08/31,620.0,625.61,622.0,233500,633.0,620.0
987,2018/09/03,601.0,606.801,630.0,216000,631.0,594.0
988,2018/09/04,616.0,616.388,604.0,248500,627.0,599.0
989,2018/09/05,607.0,612.793,616.0,178900,625.0,604.0
990,2018/09/06,588.0,590.758,602.0,165500,603.0,581.0
991,2018/09/07,575.0,571.086,578.0,129000,578.0,560.0
992,2018/09/10,573.0,573.753,565.0,88100,583.0,564.0
993,2018/09/11,566.0,568.764,575.0,124100,581.0,563.0
994,2018/09/12,538.0,546.488,567.0,176400,569.0,536.0
995,2018/09/13,542.0,543.897,536.0,123800,553.0,536.0
996,2018/09/14,563.0,555.981,548.0,176800,567.0,544.0
997,2018/09/18,565.0,561.589,567.0,125900,567.0,552.0
998,2018/09/19,573.0,572.42,569.0,98600,578.0,565.0
999,2018/09/20,570.0,566.43,574.0,115500,575.0,561.0
1000,2018/09/21,587.0,585.835,578.0,108300,592.0,574.0
1001,2018/09/25,614.0,602.584,590.0,201800,617.0,584.0
1002,2018/09/26,612.0,614.33,617.0,122600,625.0,607.0
1003,2018/09/27,592.0,599.345,613.0,133000,614.0,586.0
1004,2018/09/28,600.0,595.133,600.0,73100,600.0,588.0
1005,2018/10/01,601.0,604.098,597.0,63200,613.0,596.0
1006,2018/10/02,593.0,597.999,605.0,73900,609.0,592.0
1007,2018/10/03,580.0,584.526,590.0,79900,596.0,575.0
1008,2018/10/04,578.0,579.963,580.0,65500,592.0,572.0
1009,2018/10/05,561.0,561.313,573.0,100200,573.0,555.0
1010,2018/10/09,542.0,542.762,550.0,103500,550.0,538.0
1011,2018/10/10,532.0,531.477,543.0,122900,550.0,521.0
1012,2018/10/11,506.0,506.918,510.0,200900,517.0,503.0
1013,2018/10/12,526.0,517.736,502.0,110800,530.0,502.0
1014,2018/10/15,510.0,516.297,526.0,76100,530.0,510.0
1015,2018/10/16,519.0,515.749,510.0,81500,532.0,510.0
1016,2018/10/17,526.0,526.733,525.0,105400,536.0,522.0
1017,2018/10/18,520.0,523.564,525.0,59800,530.0,518.0
1018,2018/10/19,519.0,515.611,510.0,60700,521.0,510.0
1019,2018/10/22,513.0,512.831,518.0,56200,518.0,508.0
1020,2018/10/23,502.0,504.961,511.0,129100,513.0,501.0
1021,2018/10/24,496.0,492.684,504.0,152600,505.0,482.0
1022,2018/10/25,464.0,472.76,480.0,191000,484.0,464.0
1023,2018/10/26,451.0,458.458,472.0,112800,477.0,447.0
1024,2018/10/29,441.0,450.108,463.0,125300,471.0,438.0
1025,2018/10/30,473.0,458.091,432.0,145500,474.0,432.0
1026,2018/10/31,504.0,492.445,485.0,111900,505.0,473.0
1027,2018/11/01,502.0,501.792,501.0,74400,510.0,495.0
1028,2018/11/02,521.0,513.568,500.0,94700,523.0,500.0
1029,2018/11/05,505.0,509.179,512.0,76400,520.0,501.0
1030,2018/11/06,502.0,505.121,505.0,62800,513.0,501.0
1031,2018/11/07,506.0,508.217,506.0,75900,516.0,500.0
1032,2018/11/08,515.0,512.999,515.0,106000,517.0,509.0
1033,2018/11/09,494.0,500.361,505.0,219100,512.0,483.0
1034,2018/11/12,475.0,480.804,492.0,83200,492.0,473.0
1035,2018/11/13,464.0,463.97,465.0,115000,469.0,457.0
1036,2018/11/14,462.0,459.686,464.0,87200,469.0,450.0
1037,2018/11/15,463.0,458.834,452.0,53600,465.0,452.0
1038,2018/11/16,448.0,454.219,463.0,78700,470.0,445.0
1039,2018/11/19,460.0,457.106,446.0,35800,462.0,446.0
1040,2018/11/20,453.0,452.262,452.0,38600,456.0,447.0
1041,2018/11/21,457.0,449.205,440.0,52200,457.0,440.0
1042,2018/11/22,460.0,456.266,460.0,63600,461.0,445.0
1043,2018/11/26,461.0,459.052,454.0,34800,466.0,452.0
1044,2018/11/27,462.0,459.72,468.0,53900,468.0,455.0
1045,2018/11/28,470.0,468.418,465.0,53300,475.0,462.0
1046,2018/11/29,475.0,472.573,475.0,59000,477.0,467.0
1047,2018/11/30,476.0,476.181,475.0,54300,482.0,473.0
1048,2018/12/03,487.0,484.186,479.0,47900,490.0,478.0
1049,2018/12/04,475.0,483.285,490.0,82200,492.0,475.0
1050,2018/12/05,471.0,471.51,467.0,68200,477.0,466.0
1051,2018/12/06,455.0,457.334,473.0,84500,473.0,449.0
1052,2018/12/07,453.0,456.17,454.0,62500,462.0,452.0
1053,2018/12/10,440.0,438.601,448.0,58700,448.0,434.0
1054,2018/12/11,412.0,424.965,440.0,115500,444.0,410.0
1055,2018/12/12,424.0,423.393,420.0,69300,427.0,418.0
1056,2018/12/13,429.0,425.677,425.0,60100,430.0,420.0
1057,2018/12/14,428.0,424.099,426.0,72600,428.0,418.0
1058,2018/12/17,425.0,425.807,424.0,61200,432.0,420.0
1059,2018/12/18,418.0,412.778,418.0,117000,421.0,393.0
1060,2018/12/19,420.0,419.377,416.0,63100,425.0,411.0
1061,2018/12/20,381.0,393.561,410.0,130400,416.0,380.0
1062,2018/12/21,377.0,373.469,373.0,207700,384.0,363.0
1063,2018/12/25,341.0,348.51,355.0,191800,362.0,336.0
1064,2018/12/26,363.0,361.177,347.0,96600,369.0,347.0
1065,2018/12/27,397.0,392.455,398.0,84600,398.0,382.0
1066,2018/12/28,403.0,399.735,393.0,67500,405.0,391.0
1067,2019/01/04,399.0,392.092,387.0,84900,400.0,387.0
1068,2019/01/07,409.0,412.486,415.0,70000,420.0,408.0
1069,2019/01/08,412.0,413.285,410.0,46300,418.0,407.0
1070,2019/01/09,407.0,410.582,415.0,33500,416.0,405.0
1071,2019/01/10,410.0,406.211,406.0,58300,412.0,400.0
1072,2019/01/11,401.0,406.666,406.0,61700,417.0,399.0
1073,2019/01/15,411.0,411.432,399.0,61400,418.0,399.0
1074,2019/01/16,402.0,405.811,411.0,56100,413.0,400.0
1075,2019/01/17,415.0,413.165,402.0,150000,427.0,400.0
1076,2019/01/18,419.0,416.25,418.0,56000,422.0,409.0
1077,2019/01/21,423.0,422.778,421.0,27000,427.0,420.0
1078,2019/01/22,418.0,417.812,425.0,43000,425.0,411.0
1079,2019/01/23,411.0,414.757,412.0,37400,422.0,409.0
1080,2019/01/24,410.0,410.499,412.0,35500,415.0,405.0
1081,2019/01/25,419.0,417.423,406.0,66900,427.0,406.0
1082,2019/01/28,415.0,419.668,423.0,24400,429.0,415.0
1083,2019/01/29,413.0,409.808,413.0,35400,416.0,406.0
1084,2019/01/30,403.0,406.876,411.0,43700,415.0,403.0
1085,2019/01/31,417.0,416.197,411.0,54900,423.0,411.0
1086,2019/02/01,410.0,410.849,416.0,30400,416.0,407.0
1087,2019/02/04,415.0,414.727,413.0,32600,418.0,411.0
1088,2019/02/05,423.0,420.89,416.0,37100,424.0,416.0
1089,2019/02/06,424.0,424.823,428.0,21500,428.0,422.0
1090,2019/02/07,417.0,417.076,422.0,29000,422.0,414.0
1091,2019/02/08,413.0,410.66,414.0,37400,414.0,408.0
1092,2019/02/12,422.0,417.349,415.0,43300,422.0,410.0
1093,2019/02/13,429.0,424.814,421.0,50600,429.0,421.0
1094,2019/02/14,434.0,432.283,426.0,36700,435.0,426.0
1095,2019/02/15,433.0,427.645,432.0,34900,433.0,422.0
1096,2019/02/18,441.0,439.077,437.0,33700,443.0,436.0
1097,2019/02/19,437.0,441.564,437.0,69700,448.0,437.0
1098,2019/02/20,444.0,445.346,444.0,43700,452.0,440.0
1099,2019/02/21,441.0,439.54,444.0,35200,445.0,435.0
1100,2019/02/22,447.0,441.484,439.0,31000,447.0,434.0
1101,2019/02/25,451.0,448.602,451.0,54000,454.0,443.0
1102,2019/02/26,440.0,441.99,451.0,30000,451.0,436.0
1103,2019/02/27,460.0,448.654,440.0,78000,460.0,435.0
1104,2019/02/28,437.0,447.067,455.0,68600,460.0,437.0
1105,2019/03/01,441.0,440.72,439.0,48600,446.0,438.0
1106,2019/03/04,435.0,438.938,441.0,40400,448.0,434.0
1107,2019/03/05,435.0,429.973,434.0,58600,439.0,423.0
1108,2019/03/06,423.0,427.891,432.0,45100,434.0,422.0
1109,2019/03/07,414.0,413.374,420.0,68000,421.0,407.0
1110,2019/03/08,405.0,405.736,406.0,70100,411.0,402.0
1111,2019/03/11,416.0,410.407,405.0,53800,419.0,405.0
1112,2019/03/12,415.0,415.282,417.0,46500,421.0,411.0
1113,2019/03/13,414.0,413.937,412.0,60000,419.0,411.0
1114,2019/03/14,411.0,412.004,415.0,23400,418.0,409.0
1115,2019/03/15,410.0,412.129,411.0,30200,418.0,408.0
1116,2019/03/18,417.0,416.511,418.0,28600,421.0,413.0
1117,2019/03/19,411.0,410.479,415.0,31300,416.0,406.0
1118,2019/03/20,410.0,410.002,411.0,47100,413.0,407.0
1119,2019/03/22,415.0,411.61,411.0,32600,415.0,408.0
1120,2019/03/25,408.0,406.771,405.0,48400,411.0,403.0
1121,2019/03/26,426.0,421.194,412.0,49000,426.0,412.0
1122,2019/03/27,419.0,416.028,414.0,32400,421.0,411.0
1123,2019/03/28,411.0,410.101,412.0,34800,414.0,406.0
1124,2019/03/29,411.0,410.168,418.0,28500,418.0,406.0
1125,2019/04/01,418.0,418.629,412.0,39400,425.0,412.0
1126,2019/04/02,416.0,417.257,418.0,21000,421.0,414.0
1127,2019/04/03,427.0,422.973,416.0,33500,427.0,414.0
1128,2019/04/04,421.0,426.045,430.0,28700,433.0,421.0
1129,2019/04/05,413.0,414.433,422.0,38300,422.0,410.0
1130,2019/04/08,411.0,409.932,413.0,17700,413.0,407.0
1131,2019/04/09,407.0,405.449,409.0,29600,409.0,402.0
1132,2019/04/10,401.0,401.821,403.0,39100,405.0,399.0
1133,2019/04/11,404.0,402.484,400.0,12600,406.0,400.0
1134,2019/04/12,400.0,400.174,404.0,23600,404.0,396.0
1135,2019/04/15,413.0,409.53,403.0,31500,414.0,402.0
1136,2019/04/16,407.0,409.375,410.0,24000,414.0,405.0
1137,2019/04/17,410.0,408.343,408.0,13700,411.0,405.0
1138,2019/04/18,400.0,403.898,410.0,15700,410.0,400.0
1139,2019/04/19,404.0,405.491,405.0,16300,410.0,401.0
1140,2019/04/22,398.0,399.163,405.0,35700,405.0,396.0
1141,2019/04/23,404.0,401.262,399.0,14900,404.0,398.0
1142,2019/04/24,400.0,401.68,405.0,22200,407.0,399.0
1143,2019/04/25,403.0,401.68,403.0,23100,403.0,399.0
1144,2019/04/26,399.0,398.097,400.0,24800,401.0,395.0
1145,2019/05/07,393.0,396.432,398.0,20600,402.0,393.0
1146,2019/05/08,381.0,384.476,393.0,61400,393.0,375.0
1147,2019/05/09,374.0,374.836,380.0,41400,381.0,370.0
1148,2019/05/10,360.0,367.043,373.0,64600,385.0,356.0
1149,2019/05/13,349.0,350.05,352.0,68600,360.0,344.0
1150,2019/05/14,345.0,342.863,341.0,46600,350.0,335.0
1151,2019/05/15,336.0,339.44,352.0,36100,352.0,333.0
1152,2019/05/16,355.0,346.919,338.0,55200,357.0,333.0
1153,2019/05/17,350.0,353.179,354.0,36800,359.0,350.0
1154,2019/05/20,347.0,345.116,348.0,28500,348.0,341.0
1155,2019/05/21,345.0,342.561,343.0,18000,347.0,341.0
1156,2019/05/22,336.0,339.341,343.0,29900,346.0,336.0
1157,2019/05/23,336.0,330.938,332.0,51800,337.0,325.0
1158,2019/05/24,334.0,334.787,336.0,28100,337.0,332.0
1159,2019/05/27,325.0,327.411,328.0,25300,330.0,325.0
1160,2019/05/28,327.0,327.329,325.0,30700,332.0,323.0
1161,2019/05/29,350.0,333.801,324.0,49300,350.0,322.0
1162,2019/05/30,345.0,342.833,343.0,31100,346.0,338.0
1163,2019/05/31,338.0,338.494,342.0,16400,342.0,336.0
1164,2019/06/03,322.0,326.129,330.0,17100,332.0,322.0
1165,2019/06/04,332.0,328.139,323.0,18700,336.0,321.0
1166,2019/06/05,344.0,340.486,340.0,24700,344.0,336.0
1167,2019/06/06,345.0,344.622,344.0,18800,349.0,342.0
1168,2019/06/07,376.0,373.798,345.0,391000,387.0,341.0
1169,2019/06/10,393.0,391.743,400.0,182800,400.0,382.0
1170,2019/06/11,378.0,383.594,390.0,56200,391.0,377.0
1171,2019/06/12,410.0,404.231,386.0,751500,416.0,384.0
1172,2019/06/13,402.0,401.749,405.0,149500,407.0,396.0
1173,2019/06/14,399.0,399.385,402.0,74900,402.0,397.0
1174,2019/06/17,393.0,395.57,402.0,42600,402.0,392.0
1175,2019/06/18,387.0,389.84,395.0,51200,397.0,384.0
1176,2019/06/19,392.0,393.258,395.0,18600,395.0,391.0
1177,2019/06/20,390.0,387.318,385.0,15400,390.0,384.0
1178,2019/06/21,388.0,390.724,394.0,14500,394.0,388.0
1179,2019/06/24,375.0,379.2,384.0,44000,387.0,374.0
1180,2019/06/25,376.0,376.019,376.0,26200,379.0,375.0
1181,2019/06/26,380.0,380.375,375.0,30700,386.0,371.0
1182,2019/06/27,386.0,386.623,381.0,37400,392.0,380.0
1183,2019/06/28,382.0,383.726,387.0,24100,387.0,382.0
1184,2019/07/01,396.0,388.081,383.0,55400,396.0,381.0
1185,2019/07/02,401.0,399.587,397.0,63400,404.0,396.0
1186,2019/07/03,391.0,394.616,399.0,32800,399.0,390.0
1187,2019/07/04,389.0,390.717,391.0,42800,394.0,388.0
1188,2019/07/05,380.0,377.242,390.0,88000,390.0,372.0
1189,2019/07/08,381.0,378.194,380.0,54000,382.0,376.0
1190,2019/07/09,373.0,375.957,381.0,32400,382.0,373.0
1191,2019/07/10,376.0,377.433,373.0,52900,382.0,371.0
1192,2019/07/11,374.0,374.892,376.0,24100,378.0,373.0
1193,2019/07/12,393.0,386.725,376.0,204000,398.0,368.0
1194,2019/07/16,396.0,398.656,399.0,143100,408.0,391.0
1195,2019/07/17,384.0,387.917,398.0,47200,398.0,384.0
1196,2019/07/18,367.0,370.127,380.0,54300,380.0,367.0
1197,2019/07/19,373.0,370.507,367.0,27600,374.0,366.0
1198,2019/07/22,371.0,371.021,371.0,14400,373.0,369.0
1199,2019/07/23,375.0,374.701,370.0,21400,379.0,369.0
1200,2019/07/24,375.0,375.958,376.0,23600,379.0,374.0
1201,2019/07/25,376.0,377.103,378.0,22400,379.0,371.0
1202,2019/07/26,370.0,371.113,376.0,15100,376.0,369.0
1203,2019/07/29,370.0,370.309,371.0,9700,372.0,369.0
1204,2019/07/30,377.0,373.801,371.0,20100,377.0,370.0
1205,2019/07/31,370.0,373.336,375.0,24100,375.0,370.0
1206,2019/08/01,372.0,370.338,373.0,14200,373.0,367.0
1207,2019/08/02,338.0,342.194,356.0,112800,361.0,328.0
1208,2019/08/05,336.0,330.994,329.0,46500,341.0,325.0
1209,2019/08/06,333.0,325.938,320.0,57800,335.0,316.0
1210,2019/08/07,333.0,333.393,334.0,24700,337.0,329.0
1211,2019/08/08,333.0,335.469,335.0,17700,339.0,333.0
1212,2019/08/09,333.0,331.572,336.0,20800,336.0,327.0
1213,2019/08/13,327.0,327.84,329.0,21200,331.0,325.0
1214,2019/08/14,336.0,334.329,335.0,14900,336.0,331.0
1215,2019/08/15,325.0,324.736,320.0,21600,328.0,320.0
1216,2019/08/16,334.0,330.841,325.0,13200,336.0,324.0
1217,2019/08/19,330.0,331.373,333.0,11800,334.0,329.0
1218,2019/08/20,333.0,332.07,330.0,5700,333.0,330.0
1219,2019/08/21,333.0,331.567,328.0,6000,334.0,328.0
1220,2019/08/22,328.0,329.857,336.0,10500,337.0,327.0
1221,2019/08/23,329.0,330.163,333.0,15300,333.0,326.0
