,Date,Close,VWAP,Open,Volume,High,Low
0,2014/08/25,499.0,499.879,502.0,111700,507.0,495.0
1,2014/08/26,499.0,500.435,498.0,66000,504.0,497.0
2,2014/08/27,508.0,505.096,500.0,67000,508.0,500.0
3,2014/08/28,508.0,507.364,509.0,42600,511.0,504.0
4,2014/08/29,508.0,506.039,504.0,41200,511.0,503.0
5,2014/09/01,513.0,510.174,508.0,65500,514.0,504.0
6,2014/09/02,517.0,518.009,520.0,54500,521.0,514.0
7,2014/09/03,514.0,511.981,520.0,91100,520.0,498.0
8,2014/09/04,508.0,509.812,510.0,44700,513.0,508.0
9,2014/09/05,506.0,506.319,509.0,43200,509.0,505.0
10,2014/09/08,511.0,509.911,507.0,20300,513.0,506.0
11,2014/09/09,511.0,510.959,514.0,36700,514.0,508.0
12,2014/09/10,513.0,511.43,510.0,57900,515.0,509.0
13,2014/09/11,514.0,512.786,511.0,66700,518.0,509.0
14,2014/09/12,515.0,514.031,513.0,82800,517.0,512.0
15,2014/09/16,513.0,514.594,511.0,60900,518.0,511.0
16,2014/09/17,511.0,512.133,512.0,30800,515.0,510.0
17,2014/09/18,515.0,513.749,512.0,40200,517.0,510.0
18,2014/09/19,521.0,520.013,512.0,116900,525.0,512.0
19,2014/09/22,515.0,515.209,517.0,45400,519.0,513.0
20,2014/09/24,513.0,511.926,510.0,61000,516.0,508.0
21,2014/09/25,516.0,514.242,512.0,52900,516.0,512.0
22,2014/09/26,510.0,508.978,503.0,55100,515.0,503.0
23,2014/09/29,510.0,510.162,512.0,46300,513.0,507.0
24,2014/09/30,509.0,508.642,509.0,56900,512.0,507.0
25,2014/10/01,504.0,505.977,506.0,77500,509.0,504.0
26,2014/10/02,484.0,489.272,500.0,167300,500.0,484.0
27,2014/10/03,495.0,490.71,481.0,40700,497.0,481.0
28,2014/10/06,500.0,501.194,500.0,26800,504.0,499.0
29,2014/10/07,492.0,496.591,498.0,43300,501.0,492.0
30,2014/10/08,488.0,485.567,479.0,53600,491.0,479.0
31,2014/10/09,478.0,482.772,487.0,42500,492.0,478.0
32,2014/10/10,470.0,468.969,470.0,81600,478.0,463.0
33,2014/10/14,456.0,457.248,454.0,102200,464.0,453.0
34,2014/10/15,461.0,460.408,460.0,33100,463.0,458.0
35,2014/10/16,450.0,450.548,446.0,73500,457.0,446.0
36,2014/10/17,452.0,455.994,457.0,71500,465.0,450.0
37,2014/10/20,473.0,471.982,471.0,49100,478.0,466.0
38,2014/10/21,463.0,466.326,475.0,32500,475.0,463.0
39,2014/10/22,474.0,472.151,467.0,41800,476.0,466.0
40,2014/10/23,468.0,468.603,468.0,97300,475.0,461.0
41,2014/10/24,460.0,460.946,471.0,198200,472.0,455.0
42,2014/10/27,464.0,461.579,460.0,114000,467.0,456.0
43,2014/10/28,449.0,452.984,461.0,132500,462.0,448.0
44,2014/10/29,441.0,445.751,450.0,188600,452.0,440.0
45,2014/10/30,426.0,432.069,442.0,276500,446.0,421.0
46,2014/10/31,441.0,437.379,432.0,155300,444.0,432.0
47,2014/11/04,455.0,454.782,459.0,105800,460.0,450.0
48,2014/11/05,459.0,461.758,459.0,98400,467.0,456.0
49,2014/11/06,458.0,461.254,465.0,71800,465.0,456.0
50,2014/11/07,456.0,458.196,461.0,45000,462.0,456.0
51,2014/11/10,462.0,457.113,450.0,54200,463.0,450.0
52,2014/11/11,460.0,460.558,460.0,80600,464.0,458.0
53,2014/11/12,451.0,456.973,460.0,105500,463.0,451.0
54,2014/11/13,454.0,453.267,451.0,75800,457.0,450.0
55,2014/11/14,451.0,450.999,453.0,88300,454.0,449.0
56,2014/11/17,445.0,446.801,450.0,36600,450.0,444.0
57,2014/11/18,448.0,445.926,445.0,51300,449.0,443.0
58,2014/11/19,450.0,451.743,449.0,40500,454.0,449.0
59,2014/11/20,451.0,452.575,451.0,40900,456.0,450.0
60,2014/11/21,452.0,449.217,450.0,30000,454.0,445.0
61,2014/11/25,460.0,455.45,452.0,92700,461.0,450.0
62,2014/11/26,455.0,456.101,461.0,55200,462.0,453.0
63,2014/11/27,452.0,454.279,457.0,56700,457.0,451.0
64,2014/11/28,455.0,453.891,453.0,51200,457.0,453.0
65,2014/12/01,457.0,455.899,456.0,48700,457.0,453.0
66,2014/12/02,453.0,454.149,456.0,66000,458.0,452.0
67,2014/12/03,453.0,455.137,457.0,102600,462.0,453.0
68,2014/12/04,458.0,457.038,459.0,70400,459.0,454.0
69,2014/12/05,475.0,472.787,462.0,229800,486.0,460.0
70,2014/12/08,504.0,490.255,486.0,318400,504.0,476.0
71,2014/12/09,488.0,490.06,501.0,202600,501.0,483.0
72,2014/12/10,470.0,475.014,488.0,173000,490.0,468.0
73,2014/12/11,468.0,464.204,462.0,55000,471.0,460.0
74,2014/12/12,464.0,468.389,468.0,84900,474.0,464.0
75,2014/12/15,454.0,457.94,462.0,103200,463.0,454.0
76,2014/12/16,437.0,442.878,451.0,140400,451.0,436.0
77,2014/12/17,434.0,435.788,433.0,122500,441.0,432.0
78,2014/12/18,445.0,446.058,445.0,63400,450.0,443.0
79,2014/12/19,444.0,446.494,452.0,122700,453.0,443.0
80,2014/12/22,444.0,445.067,444.0,104800,450.0,444.0
81,2014/12/24,449.0,447.443,450.0,78400,450.0,445.0
82,2014/12/25,445.0,444.767,446.0,83400,447.0,443.0
83,2014/12/26,451.0,449.246,444.0,44800,453.0,444.0
84,2014/12/29,459.0,454.89,453.0,142400,461.0,449.0
85,2014/12/30,450.0,451.311,451.0,86400,454.0,450.0
86,2015/01/05,452.0,453.068,452.0,37000,456.0,451.0
87,2015/01/06,445.0,447.732,450.0,51900,450.0,444.0
88,2015/01/07,444.0,444.355,445.0,32400,449.0,443.0
89,2015/01/08,447.0,447.917,446.0,21700,450.0,446.0
90,2015/01/09,441.0,443.67,446.0,74500,448.0,441.0
91,2015/01/13,442.0,438.021,440.0,53600,442.0,434.0
92,2015/01/14,433.0,435.547,439.0,52700,440.0,433.0
93,2015/01/15,437.0,435.187,435.0,26700,438.0,433.0
94,2015/01/16,430.0,428.273,433.0,79100,434.0,424.0
95,2015/01/19,430.0,430.434,433.0,21200,433.0,429.0
96,2015/01/20,440.0,436.758,430.0,56300,441.0,429.0
97,2015/01/21,431.0,432.862,435.0,42600,436.0,431.0
98,2015/01/22,428.0,428.155,431.0,57300,432.0,426.0
99,2015/01/23,427.0,428.186,428.0,58200,430.0,427.0
100,2015/01/26,435.0,433.678,428.0,50300,439.0,427.0
101,2015/01/27,444.0,442.258,438.0,219900,451.0,438.0
102,2015/01/28,442.0,443.952,444.0,80500,448.0,439.0
103,2015/01/29,465.0,458.08,445.0,284400,468.0,442.0
104,2015/01/30,458.0,462.123,465.0,116100,469.0,456.0
105,2015/02/02,463.0,464.098,460.0,120000,470.0,458.0
106,2015/02/03,456.0,457.543,463.0,68300,465.0,454.0
107,2015/02/04,460.0,461.827,462.0,86000,469.0,457.0
108,2015/02/05,449.0,451.138,459.0,99900,459.0,448.0
109,2015/02/06,448.0,448.723,452.0,39300,452.0,447.0
110,2015/02/09,453.0,451.235,449.0,47300,454.0,449.0
111,2015/02/10,454.0,453.297,450.0,29600,456.0,448.0
112,2015/02/12,462.0,461.262,458.0,94000,464.0,455.0
113,2015/02/13,467.0,467.285,465.0,75900,469.0,463.0
114,2015/02/16,468.0,471.125,470.0,57500,473.0,468.0
115,2015/02/17,471.0,471.521,469.0,47200,473.0,469.0
116,2015/02/18,470.0,471.014,472.0,57300,474.0,467.0
117,2015/02/19,473.0,475.259,473.0,94700,480.0,471.0
118,2015/02/20,470.0,472.675,473.0,50500,476.0,469.0
119,2015/02/23,468.0,470.133,471.0,71700,474.0,466.0
120,2015/02/24,470.0,469.179,469.0,44600,471.0,466.0
121,2015/02/25,469.0,469.176,469.0,33000,472.0,467.0
122,2015/02/26,471.0,470.578,470.0,47200,473.0,467.0
123,2015/02/27,474.0,472.766,472.0,53000,474.0,471.0
124,2015/03/02,470.0,473.272,473.0,78400,476.0,470.0
125,2015/03/03,471.0,470.832,471.0,45200,473.0,469.0
126,2015/03/04,466.0,464.681,468.0,62400,468.0,461.0
127,2015/03/05,464.0,465.387,471.0,47600,471.0,462.0
128,2015/03/06,462.0,463.253,469.0,42300,469.0,460.0
129,2015/03/09,457.0,459.844,462.0,56500,463.0,455.0
130,2015/03/10,457.0,460.227,462.0,70900,464.0,456.0
131,2015/03/11,455.0,455.085,455.0,63500,458.0,451.0
132,2015/03/12,461.0,461.784,457.0,35100,464.0,457.0
133,2015/03/13,464.0,464.065,464.0,69500,466.0,462.0
134,2015/03/16,467.0,466.736,466.0,50000,470.0,465.0
135,2015/03/17,468.0,468.167,468.0,96900,471.0,466.0
136,2015/03/18,467.0,468.264,469.0,29600,469.0,466.0
137,2015/03/19,467.0,467.934,469.0,34900,470.0,467.0
138,2015/03/20,472.0,470.956,470.0,45300,472.0,467.0
139,2015/03/23,477.0,475.763,476.0,64200,477.0,473.0
140,2015/03/24,479.0,478.476,479.0,34900,480.0,477.0
141,2015/03/25,477.0,478.0,478.0,47500,480.0,476.0
142,2015/03/26,470.0,472.022,475.0,41100,475.0,468.0
143,2015/03/27,464.0,469.644,469.0,57500,477.0,462.0
144,2015/03/30,461.0,460.91,461.0,39800,464.0,458.0
145,2015/03/31,464.0,466.546,469.0,26400,470.0,463.0
146,2015/04/01,458.0,459.058,462.0,52000,462.0,456.0
147,2015/04/02,459.0,459.478,456.0,72200,464.0,456.0
148,2015/04/03,464.0,461.315,461.0,21600,464.0,458.0
149,2015/04/06,457.0,460.433,462.0,30700,465.0,457.0
150,2015/04/07,462.0,461.132,460.0,34200,464.0,458.0
151,2015/04/08,463.0,463.366,463.0,40200,465.0,462.0
152,2015/04/09,463.0,463.528,463.0,53200,467.0,462.0
153,2015/04/10,463.0,463.252,462.0,31300,466.0,462.0
154,2015/04/13,464.0,464.688,463.0,27900,468.0,462.0
155,2015/04/14,465.0,464.076,464.0,31600,466.0,463.0
156,2015/04/15,465.0,466.307,466.0,29600,469.0,464.0
157,2015/04/16,470.0,467.96,466.0,37400,471.0,465.0
158,2015/04/17,484.0,483.254,475.0,243500,492.0,475.0
159,2015/04/20,484.0,487.074,486.0,143800,491.0,484.0
160,2015/04/21,488.0,485.012,489.0,74200,490.0,480.0
161,2015/04/22,487.0,485.768,488.0,56900,490.0,480.0
162,2015/04/23,497.0,493.209,492.0,233000,497.0,489.0
163,2015/04/24,493.0,495.312,496.0,103300,498.0,492.0
164,2015/04/27,507.0,504.967,492.0,394100,516.0,486.0
165,2015/04/28,509.0,518.8,513.0,211600,528.0,509.0
166,2015/04/30,513.0,510.647,509.0,101700,518.0,505.0
167,2015/05/01,514.0,512.859,515.0,92600,519.0,508.0
168,2015/05/07,511.0,512.563,511.0,67000,516.0,509.0
169,2015/05/08,515.0,513.064,508.0,76400,516.0,508.0
170,2015/05/11,516.0,518.939,515.0,92900,524.0,515.0
171,2015/05/12,530.0,528.69,519.0,222300,534.0,516.0
172,2015/05/13,534.0,533.253,534.0,125700,536.0,528.0
173,2015/05/14,542.0,538.528,535.0,222900,542.0,533.0
174,2015/05/15,540.0,541.089,543.0,110700,546.0,534.0
175,2015/05/18,552.0,549.544,545.0,179100,555.0,541.0
176,2015/05/19,557.0,557.07,553.0,147300,563.0,552.0
177,2015/05/20,565.0,558.577,557.0,147600,565.0,551.0
178,2015/05/21,553.0,558.728,564.0,106100,565.0,553.0
179,2015/05/22,551.0,546.047,550.0,76800,553.0,538.0
180,2015/05/25,570.0,563.266,550.0,169100,572.0,548.0
181,2015/05/26,567.0,571.372,571.0,75100,575.0,567.0
182,2015/05/27,567.0,566.874,566.0,96900,571.0,560.0
183,2015/05/28,562.0,565.022,571.0,49700,571.0,560.0
184,2015/05/29,560.0,559.922,562.0,82100,562.0,554.0
185,2015/06/01,563.0,559.628,552.0,95000,568.0,552.0
186,2015/06/02,559.0,559.681,561.0,70300,563.0,555.0
187,2015/06/03,561.0,559.673,559.0,44300,563.0,557.0
188,2015/06/04,571.0,568.856,562.0,104200,572.0,562.0
189,2015/06/05,567.0,562.877,563.0,44600,568.0,558.0
190,2015/06/08,569.0,563.823,565.0,51300,570.0,558.0
191,2015/06/09,557.0,559.106,569.0,63200,569.0,554.0
192,2015/06/10,543.0,548.8,552.0,72900,556.0,536.0
193,2015/06/11,545.0,544.819,537.0,44800,551.0,537.0
194,2015/06/12,544.0,544.967,546.0,57200,547.0,542.0
195,2015/06/15,542.0,542.366,543.0,44600,545.0,540.0
196,2015/06/16,540.0,540.934,540.0,36600,545.0,539.0
197,2015/06/17,530.0,533.48,539.0,62100,542.0,528.0
198,2015/06/18,518.0,520.284,531.0,115600,532.0,511.0
199,2015/06/19,521.0,522.383,528.0,97500,529.0,515.0
200,2015/06/22,543.0,537.226,523.0,94100,544.0,522.0
201,2015/06/23,550.0,547.744,543.0,74600,553.0,543.0
202,2015/06/24,553.0,550.179,552.0,57500,553.0,546.0
203,2015/06/25,543.0,546.606,551.0,38800,551.0,543.0
204,2015/06/26,533.0,536.266,543.0,50800,543.0,531.0
205,2015/06/29,514.0,516.318,521.0,62900,521.0,512.0
206,2015/06/30,520.0,513.638,512.0,40000,521.0,510.0
207,2015/07/01,514.0,516.156,520.0,52600,520.0,512.0
208,2015/07/02,518.0,519.651,522.0,41500,526.0,515.0
209,2015/07/03,517.0,517.896,522.0,48900,522.0,515.0
210,2015/07/06,504.0,506.958,512.0,59700,512.0,501.0
211,2015/07/07,508.0,509.245,509.0,31900,512.0,508.0
212,2015/07/08,490.0,499.042,506.0,115300,509.0,490.0
213,2015/07/09,482.0,470.127,471.0,114500,485.0,459.0
214,2015/07/10,484.0,485.902,485.0,63500,493.0,481.0
215,2015/07/13,491.0,490.774,490.0,24300,496.0,486.0
216,2015/07/14,502.0,504.648,497.0,86800,513.0,497.0
217,2015/07/15,505.0,504.101,503.0,43800,508.0,500.0
218,2015/07/16,503.0,501.55,505.0,47800,507.0,496.0
219,2015/07/17,505.0,503.778,503.0,46900,507.0,500.0
220,2015/07/21,519.0,518.647,511.0,127400,528.0,509.0
221,2015/07/22,508.0,511.953,514.0,78900,517.0,508.0
222,2015/07/23,510.0,507.796,513.0,38300,513.0,503.0
223,2015/07/24,505.0,506.596,506.0,82100,513.0,502.0
224,2015/07/27,470.0,470.883,470.0,317500,478.0,465.0
225,2015/07/28,464.0,461.372,465.0,114200,468.0,453.0
226,2015/07/29,455.0,459.208,466.0,69400,468.0,455.0
227,2015/07/30,459.0,460.424,459.0,39900,464.0,458.0
228,2015/07/31,462.0,459.67,460.0,29400,463.0,457.0
229,2015/08/03,458.0,461.447,465.0,59100,465.0,454.0
230,2015/08/04,452.0,451.423,458.0,64800,458.0,448.0
231,2015/08/05,457.0,456.609,452.0,62900,464.0,449.0
232,2015/08/06,464.0,464.554,463.0,84300,468.0,460.0
233,2015/08/07,460.0,461.962,462.0,76300,468.0,457.0
234,2015/08/10,458.0,457.518,460.0,66400,461.0,452.0
235,2015/08/11,461.0,458.997,458.0,73000,463.0,454.0
236,2015/08/12,455.0,454.571,461.0,65000,461.0,451.0
237,2015/08/13,449.0,449.693,450.0,72200,454.0,447.0
238,2015/08/14,445.0,443.597,448.0,71500,450.0,438.0
239,2015/08/17,447.0,444.613,446.0,39000,448.0,441.0
240,2015/08/18,452.0,451.375,447.0,55700,456.0,447.0
241,2015/08/19,449.0,450.173,450.0,41700,455.0,447.0
242,2015/08/20,441.0,443.764,449.0,49500,449.0,440.0
243,2015/08/21,422.0,430.443,435.0,112100,437.0,421.0
244,2015/08/24,391.0,406.594,406.0,105200,423.0,390.0
245,2015/08/25,386.0,389.613,375.0,112200,412.0,372.0
246,2015/08/26,407.0,400.779,387.0,78700,413.0,386.0
247,2015/08/27,405.0,408.637,415.0,79300,418.0,402.0
248,2015/08/28,418.0,414.969,410.0,70300,420.0,409.0
249,2015/08/31,413.0,416.568,419.0,98700,422.0,413.0
250,2015/09/01,402.0,403.828,413.0,126300,414.0,400.0
251,2015/09/02,401.0,403.19,400.0,92900,412.0,392.0
252,2015/09/03,395.0,399.091,406.0,56900,408.0,395.0
253,2015/09/04,390.0,392.051,394.0,47300,398.0,388.0
254,2015/09/07,389.0,387.0,388.0,37000,390.0,379.0
255,2015/09/08,383.0,386.424,386.0,28300,390.0,383.0
256,2015/09/09,404.0,395.249,387.0,60600,404.0,387.0
257,2015/09/10,402.0,397.782,396.0,38100,404.0,390.0
258,2015/09/11,400.0,398.249,395.0,62200,405.0,395.0
259,2015/09/14,395.0,396.722,399.0,35600,400.0,393.0
260,2015/09/15,396.0,397.995,400.0,61900,402.0,395.0
261,2015/09/16,395.0,394.689,399.0,63900,400.0,390.0
262,2015/09/17,402.0,400.516,400.0,60300,405.0,398.0
263,2015/09/18,390.0,390.556,395.0,50400,395.0,387.0
264,2015/09/24,379.0,383.018,387.0,83600,387.0,379.0
265,2015/09/25,379.0,375.378,380.0,86200,385.0,372.0
266,2015/09/28,374.0,377.474,379.0,48100,381.0,374.0
267,2015/09/29,361.0,367.773,372.0,88600,372.0,360.0
268,2015/09/30,377.0,373.245,362.0,58900,380.0,362.0
269,2015/10/01,389.0,385.225,377.0,48000,392.0,377.0
270,2015/10/02,399.0,394.213,389.0,53600,399.0,389.0
271,2015/10/05,399.0,398.438,398.0,32200,401.0,397.0
272,2015/10/06,401.0,403.853,403.0,75400,409.0,400.0
273,2015/10/07,408.0,407.156,399.0,64600,414.0,399.0
274,2015/10/08,414.0,413.846,408.0,56000,422.0,408.0
275,2015/10/09,422.0,420.45,419.0,46900,424.0,416.0
276,2015/10/13,420.0,422.832,420.0,58800,429.0,418.0
277,2015/10/14,412.0,411.203,412.0,63600,415.0,406.0
278,2015/10/15,424.0,418.779,409.0,92100,429.0,408.0
279,2015/10/16,433.0,431.052,424.0,95200,436.0,424.0
280,2015/10/19,426.0,429.397,437.0,38300,437.0,423.0
281,2015/10/20,425.0,425.406,432.0,21200,432.0,421.0
282,2015/10/21,431.0,428.35,426.0,30900,431.0,421.0
283,2015/10/22,436.0,436.233,436.0,136500,439.0,435.0
284,2015/10/23,439.0,444.209,444.0,112200,449.0,439.0
285,2015/10/26,452.0,446.506,434.0,137500,453.0,434.0
286,2015/10/27,448.0,450.353,454.0,68500,454.0,448.0
287,2015/10/28,446.0,445.119,446.0,48700,448.0,442.0
288,2015/10/29,453.0,452.886,456.0,83900,456.0,447.0
289,2015/10/30,451.0,451.985,455.0,34100,455.0,448.0
290,2015/11/02,447.0,447.645,452.0,34900,452.0,444.0
291,2015/11/04,455.0,454.282,449.0,54900,459.0,449.0
292,2015/11/05,455.0,454.0,454.0,34600,458.0,447.0
293,2015/11/06,459.0,457.955,458.0,73000,460.0,456.0
294,2015/11/09,457.0,456.154,459.0,39700,459.0,453.0
295,2015/11/10,448.0,448.398,449.0,73900,455.0,443.0
296,2015/11/11,455.0,452.725,446.0,46500,457.0,446.0
297,2015/11/12,457.0,455.858,458.0,45100,459.0,451.0
298,2015/11/13,460.0,460.74,457.0,54200,468.0,456.0
299,2015/11/16,447.0,449.312,449.0,41400,452.0,447.0
300,2015/11/17,449.0,448.953,450.0,35800,452.0,443.0
301,2015/11/18,445.0,445.949,449.0,23400,451.0,441.0
302,2015/11/19,443.0,444.436,448.0,36000,449.0,441.0
303,2015/11/20,450.0,445.135,442.0,50400,450.0,439.0
304,2015/11/24,455.0,453.061,451.0,47700,456.0,448.0
305,2015/11/25,451.0,452.199,454.0,26200,455.0,449.0
306,2015/11/26,439.0,441.074,441.0,138000,444.0,439.0
307,2015/11/27,448.0,445.331,440.0,34800,448.0,439.0
308,2015/11/30,448.0,448.262,445.0,41600,452.0,445.0
309,2015/12/01,447.0,447.718,450.0,83700,450.0,445.0
310,2015/12/02,448.0,448.029,451.0,101000,452.0,440.0
311,2015/12/03,447.0,447.004,442.0,48900,449.0,442.0
312,2015/12/04,444.0,442.426,442.0,48100,447.0,438.0
313,2015/12/07,448.0,447.946,444.0,37300,451.0,444.0
314,2015/12/08,445.0,444.763,447.0,80700,449.0,438.0
315,2015/12/09,442.0,443.929,445.0,46500,446.0,441.0
316,2015/12/10,442.0,441.735,438.0,48000,445.0,437.0
317,2015/12/11,441.0,438.452,436.0,46900,444.0,436.0
318,2015/12/14,437.0,435.88,436.0,55100,439.0,434.0
319,2015/12/15,428.0,431.308,434.0,34700,436.0,427.0
320,2015/12/16,439.0,438.074,436.0,55700,442.0,433.0
321,2015/12/17,451.0,449.666,449.0,101400,454.0,445.0
322,2015/12/18,447.0,452.823,455.0,68900,457.0,447.0
323,2015/12/21,441.0,442.234,445.0,26500,445.0,440.0
324,2015/12/22,438.0,439.779,440.0,156700,442.0,438.0
325,2015/12/24,434.0,438.295,440.0,49500,445.0,433.0
326,2015/12/25,428.0,430.211,434.0,46400,436.0,426.0
327,2015/12/28,441.0,435.021,428.0,43300,442.0,428.0
328,2015/12/29,444.0,445.356,443.0,30100,448.0,442.0
329,2015/12/30,447.0,447.569,447.0,33200,451.0,443.0
330,2016/01/04,437.0,442.328,445.0,25600,450.0,437.0
331,2016/01/05,434.0,433.043,435.0,78300,436.0,428.0
332,2016/01/06,429.0,430.592,437.0,38700,438.0,428.0
333,2016/01/07,416.0,420.886,427.0,43000,428.0,416.0
334,2016/01/08,418.0,420.687,416.0,33900,429.0,413.0
335,2016/01/12,406.0,410.613,418.0,31300,419.0,405.0
336,2016/01/13,413.0,411.243,409.0,22600,416.0,406.0
337,2016/01/14,415.0,411.217,410.0,81500,427.0,398.0
338,2016/01/15,406.0,408.466,415.0,62900,417.0,405.0
339,2016/01/18,404.0,401.984,402.0,36500,406.0,398.0
340,2016/01/19,410.0,412.773,403.0,51000,423.0,402.0
341,2016/01/20,395.0,399.296,406.0,59100,410.0,393.0
342,2016/01/21,387.0,392.968,396.0,40100,403.0,386.0
343,2016/01/22,399.0,398.622,400.0,24600,404.0,393.0
344,2016/01/25,407.0,404.979,401.0,18800,408.0,399.0
345,2016/01/26,398.0,399.71,395.0,23100,404.0,395.0
346,2016/01/27,406.0,404.948,400.0,38400,411.0,400.0
347,2016/01/28,394.0,402.586,414.0,101300,414.0,393.0
348,2016/01/29,393.0,390.817,395.0,55800,395.0,386.0
349,2016/02/01,403.0,399.703,396.0,72700,405.0,395.0
350,2016/02/02,394.0,395.106,395.0,43500,398.0,392.0
351,2016/02/03,380.0,382.151,388.0,43200,391.0,379.0
352,2016/02/04,373.0,372.087,377.0,80200,383.0,363.0
353,2016/02/05,366.0,366.652,368.0,39700,374.0,363.0
354,2016/02/08,370.0,366.853,365.0,31900,374.0,361.0
355,2016/02/09,337.0,342.895,360.0,112000,361.0,330.0
356,2016/02/10,324.0,328.124,338.0,78800,343.0,323.0
357,2016/02/12,300.0,304.48,307.0,78100,314.0,300.0
358,2016/02/15,310.0,309.976,308.0,98100,314.0,305.0
359,2016/02/16,313.0,316.73,311.0,73300,323.0,309.0
360,2016/02/17,320.0,319.393,313.0,30800,323.0,312.0
361,2016/02/18,335.0,325.913,330.0,73500,335.0,306.0
362,2016/02/19,328.0,326.86,334.0,34900,334.0,322.0
363,2016/02/22,322.0,321.78,321.0,45000,327.0,317.0
364,2016/02/23,317.0,321.528,321.0,37900,328.0,317.0
365,2016/02/24,314.0,316.338,317.0,37300,322.0,312.0
366,2016/02/25,324.0,320.159,314.0,20100,324.0,314.0
367,2016/02/26,328.0,327.701,330.0,34800,330.0,325.0
368,2016/02/29,323.0,327.825,331.0,43400,331.0,323.0
369,2016/03/01,323.0,322.353,322.0,37100,325.0,321.0
370,2016/03/02,336.0,335.595,330.0,43400,340.0,328.0
371,2016/03/03,347.0,340.734,338.0,44400,347.0,336.0
372,2016/03/04,344.0,344.562,347.0,42500,348.0,342.0
373,2016/03/07,347.0,347.11,348.0,58400,350.0,344.0
374,2016/03/08,347.0,347.702,347.0,46900,354.0,343.0
375,2016/03/09,345.0,344.307,347.0,27400,347.0,342.0
376,2016/03/10,345.0,345.601,347.0,34300,347.0,344.0
377,2016/03/11,350.0,344.684,343.0,39600,351.0,341.0
378,2016/03/14,355.0,354.303,353.0,47500,357.0,350.0
379,2016/03/15,353.0,354.452,353.0,25000,359.0,352.0
380,2016/03/16,349.0,351.413,352.0,31500,357.0,349.0
381,2016/03/17,348.0,350.866,350.0,17900,357.0,346.0
382,2016/03/18,342.0,343.625,350.0,34700,350.0,340.0
383,2016/03/22,353.0,351.207,348.0,27600,355.0,347.0
384,2016/03/23,351.0,351.599,357.0,15700,357.0,348.0
385,2016/03/24,346.0,346.444,348.0,33100,349.0,343.0
386,2016/03/25,348.0,347.442,346.0,10400,349.0,346.0
387,2016/03/28,349.0,347.903,350.0,27800,350.0,345.0
388,2016/03/29,347.0,345.617,345.0,14900,349.0,343.0
389,2016/03/30,341.0,343.741,347.0,11200,347.0,341.0
390,2016/03/31,338.0,340.994,342.0,15400,346.0,338.0
391,2016/04/01,323.0,325.438,337.0,62100,337.0,323.0
392,2016/04/04,323.0,322.345,323.0,29000,327.0,318.0
393,2016/04/05,310.0,313.746,323.0,33000,323.0,310.0
394,2016/04/06,309.0,310.473,310.0,64300,311.0,306.0
395,2016/04/07,311.0,309.85,306.0,24000,313.0,306.0
396,2016/04/08,315.0,312.587,305.0,28800,320.0,305.0
397,2016/04/11,313.0,311.831,316.0,11800,316.0,309.0
398,2016/04/12,317.0,316.579,313.0,22300,319.0,313.0
399,2016/04/13,322.0,319.914,320.0,40800,326.0,315.0
400,2016/04/14,331.0,327.59,327.0,46300,331.0,323.0
401,2016/04/15,326.0,327.518,327.0,38600,331.0,326.0
402,2016/04/18,322.0,321.518,318.0,36900,326.0,318.0
403,2016/04/19,329.0,327.557,325.0,12400,329.0,324.0
404,2016/04/20,328.0,330.479,328.0,30300,333.0,328.0
405,2016/04/21,336.0,338.284,330.0,114200,340.0,330.0
406,2016/04/22,340.0,337.594,334.0,34500,340.0,333.0
407,2016/04/25,342.0,341.738,342.0,30200,345.0,338.0
408,2016/04/26,339.0,337.677,341.0,26000,341.0,333.0
409,2016/04/27,337.0,333.983,336.0,41100,339.0,328.0
410,2016/04/28,387.0,390.958,385.0,748400,410.0,381.0
411,2016/05/02,392.0,385.527,380.0,208900,397.0,376.0
412,2016/05/06,391.0,391.907,397.0,74100,399.0,388.0
413,2016/05/09,395.0,395.844,399.0,77400,401.0,392.0
414,2016/05/10,396.0,393.031,390.0,88300,398.0,387.0
415,2016/05/11,403.0,399.289,398.0,123400,405.0,391.0
416,2016/05/12,405.0,402.658,403.0,63700,406.0,398.0
417,2016/05/13,409.0,406.72,405.0,99600,412.0,400.0
418,2016/05/16,406.0,405.861,406.0,55500,408.0,402.0
419,2016/05/17,405.0,403.854,408.0,41000,408.0,401.0
420,2016/05/18,414.0,408.765,408.0,88600,414.0,402.0
421,2016/05/19,411.0,412.144,418.0,48600,418.0,406.0
422,2016/05/20,411.0,410.606,411.0,25100,412.0,408.0
423,2016/05/23,409.0,407.73,411.0,49600,412.0,403.0
424,2016/05/24,405.0,406.525,409.0,33700,410.0,404.0
425,2016/05/25,407.0,407.373,405.0,51800,412.0,402.0
426,2016/05/26,406.0,406.66,407.0,53600,409.0,404.0
427,2016/05/27,404.0,404.596,402.0,27000,407.0,402.0
428,2016/05/30,401.0,400.595,402.0,39700,403.0,399.0
429,2016/05/31,398.0,398.521,399.0,43000,401.0,396.0
430,2016/06/01,403.0,398.342,394.0,53300,403.0,394.0
431,2016/06/02,394.0,395.453,398.0,39500,400.0,393.0
432,2016/06/03,390.0,391.533,393.0,40500,398.0,389.0
433,2016/06/06,387.0,386.384,385.0,36700,392.0,382.0
434,2016/06/07,392.0,387.651,387.0,109500,395.0,387.0
435,2016/06/08,395.0,393.312,394.0,31100,395.0,392.0
436,2016/06/09,393.0,393.387,393.0,21200,395.0,392.0
437,2016/06/10,391.0,392.275,393.0,34900,393.0,390.0
438,2016/06/13,383.0,385.702,385.0,65800,398.0,383.0
439,2016/06/14,377.0,378.94,382.0,66600,385.0,374.0
440,2016/06/15,373.0,373.941,375.0,47400,377.0,370.0
441,2016/06/16,366.0,367.412,375.0,70700,375.0,365.0
442,2016/06/17,362.0,365.121,366.0,72200,371.0,360.0
443,2016/06/20,375.0,373.244,370.0,29500,379.0,370.0
444,2016/06/21,372.0,372.102,376.0,38400,376.0,368.0
445,2016/06/22,368.0,367.959,374.0,41300,374.0,365.0
446,2016/06/23,370.0,367.305,367.0,16700,370.0,365.0
447,2016/06/24,340.0,351.425,373.0,92400,375.0,333.0
448,2016/06/27,344.0,344.723,345.0,31800,346.0,343.0
449,2016/06/28,345.0,345.194,344.0,32000,349.0,342.0
450,2016/06/29,348.0,348.984,350.0,24500,350.0,346.0
451,2016/06/30,351.0,352.423,352.0,25300,358.0,350.0
452,2016/07/01,353.0,352.662,351.0,22500,356.0,351.0
453,2016/07/04,354.0,355.524,355.0,23100,358.0,353.0
454,2016/07/05,352.0,351.804,354.0,22900,354.0,350.0
455,2016/07/06,347.0,347.928,350.0,34700,350.0,346.0
456,2016/07/07,345.0,345.743,348.0,34600,349.0,343.0
457,2016/07/08,345.0,345.912,346.0,30700,349.0,345.0
458,2016/07/11,352.0,351.184,349.0,21800,352.0,348.0
459,2016/07/12,361.0,359.559,355.0,47200,364.0,355.0
460,2016/07/13,365.0,366.741,369.0,46300,370.0,364.0
461,2016/07/14,373.0,372.679,365.0,48900,376.0,365.0
462,2016/07/15,375.0,375.74,379.0,30800,379.0,374.0
463,2016/07/19,376.0,375.952,375.0,23100,378.0,374.0
464,2016/07/20,377.0,377.309,377.0,38200,380.0,370.0
465,2016/07/21,383.0,382.055,380.0,32900,385.0,379.0
466,2016/07/22,382.0,379.326,382.0,26400,382.0,374.0
467,2016/07/25,379.0,381.798,382.0,39600,386.0,379.0
468,2016/07/26,347.0,349.115,351.0,193000,354.0,346.0
469,2016/07/27,348.0,347.265,345.0,117500,350.0,345.0
470,2016/07/28,349.0,348.768,348.0,52600,351.0,346.0
471,2016/07/29,351.0,348.078,349.0,71500,351.0,345.0
472,2016/08/01,348.0,347.811,351.0,38600,351.0,345.0
473,2016/08/02,345.0,346.324,346.0,22200,348.0,344.0
474,2016/08/03,340.0,341.709,344.0,63800,344.0,340.0
475,2016/08/04,342.0,340.742,340.0,42700,344.0,338.0
476,2016/08/05,341.0,341.987,342.0,23200,344.0,341.0
477,2016/08/08,344.0,343.572,341.0,30600,345.0,341.0
478,2016/08/09,346.0,346.965,344.0,33800,350.0,343.0
479,2016/08/10,344.0,344.55,346.0,14000,346.0,343.0
480,2016/08/12,348.0,347.55,348.0,30000,349.0,344.0
481,2016/08/15,348.0,347.485,346.0,20000,350.0,346.0
482,2016/08/16,345.0,347.67,349.0,30000,349.0,345.0
483,2016/08/17,352.0,348.182,345.0,32400,352.0,344.0
484,2016/08/18,345.0,346.957,350.0,28000,351.0,343.0
485,2016/08/19,350.0,349.738,349.0,17200,354.0,346.0
486,2016/08/22,352.0,350.715,350.0,38200,353.0,347.0
487,2016/08/23,348.0,349.724,352.0,22100,352.0,347.0
488,2016/08/24,348.0,347.899,348.0,16800,350.0,347.0
489,2016/08/25,348.0,346.807,349.0,24900,349.0,345.0
490,2016/08/26,345.0,345.511,346.0,22300,347.0,344.0
491,2016/08/29,349.0,348.814,350.0,18800,350.0,348.0
492,2016/08/30,350.0,349.609,349.0,19200,351.0,347.0
493,2016/08/31,349.0,350.962,352.0,44200,353.0,349.0
494,2016/09/01,353.0,352.98,352.0,25200,354.0,351.0
495,2016/09/02,354.0,354.607,355.0,36600,357.0,352.0
496,2016/09/05,357.0,357.207,357.0,46400,359.0,356.0
497,2016/09/06,361.0,359.526,358.0,35200,362.0,358.0
498,2016/09/07,364.0,361.66,362.0,38500,364.0,359.0
499,2016/09/08,364.0,365.466,365.0,29200,367.0,364.0
500,2016/09/09,361.0,361.287,360.0,43200,363.0,359.0
501,2016/09/12,362.0,359.492,356.0,26400,363.0,356.0
502,2016/09/13,362.0,362.22,361.0,23600,365.0,359.0
503,2016/09/14,362.0,362.271,360.0,26200,365.0,360.0
504,2016/09/15,361.0,360.368,359.0,22800,362.0,358.0
505,2016/09/16,362.0,362.233,362.0,30100,364.0,360.0
506,2016/09/20,360.0,360.168,357.0,25600,363.0,357.0
507,2016/09/21,363.0,361.746,363.0,33400,364.0,358.0
508,2016/09/23,373.0,368.667,365.0,53500,375.0,365.0
509,2016/09/26,370.0,372.286,374.0,25200,375.0,369.0
510,2016/09/27,372.0,368.467,371.0,39600,372.0,362.0
511,2016/09/28,368.0,367.953,370.0,19000,370.0,365.0
512,2016/09/29,373.0,370.312,369.0,30500,373.0,368.0
513,2016/09/30,367.0,368.09,371.0,25600,371.0,367.0
514,2016/10/03,368.0,367.711,369.0,23500,369.0,367.0
515,2016/10/04,370.0,368.159,367.0,30800,371.0,367.0
516,2016/10/05,371.0,371.6,372.0,18500,373.0,370.0
517,2016/10/06,377.0,376.0,375.0,39400,378.0,373.0
518,2016/10/07,377.0,376.318,377.0,37700,377.0,374.0
519,2016/10/11,377.0,377.196,377.0,32600,378.0,376.0
520,2016/10/12,375.0,376.401,377.0,29200,378.0,374.0
521,2016/10/13,376.0,375.48,375.0,47100,380.0,372.0
522,2016/10/14,378.0,375.792,375.0,26900,379.0,374.0
523,2016/10/17,377.0,376.464,378.0,20900,380.0,375.0
524,2016/10/18,378.0,378.263,379.0,27400,380.0,376.0
525,2016/10/19,380.0,379.241,379.0,16200,380.0,378.0
526,2016/10/20,380.0,379.953,380.0,116400,382.0,378.0
527,2016/10/21,380.0,380.595,380.0,33300,382.0,379.0
528,2016/10/24,385.0,383.653,382.0,52100,385.0,382.0
529,2016/10/25,387.0,386.289,386.0,36300,388.0,385.0
530,2016/10/26,389.0,388.207,388.0,46400,390.0,386.0
531,2016/10/27,383.0,384.25,389.0,76400,389.0,381.0
532,2016/10/28,391.0,389.681,384.0,135600,392.0,383.0
533,2016/10/31,396.0,394.709,392.0,28500,397.0,392.0
534,2016/11/01,402.0,400.486,396.0,66300,404.0,396.0
535,2016/11/02,399.0,399.617,402.0,53800,403.0,397.0
536,2016/11/04,400.0,399.524,399.0,56900,401.0,398.0
537,2016/11/07,407.0,406.402,400.0,41300,411.0,400.0
538,2016/11/08,404.0,404.856,409.0,29900,409.0,403.0
539,2016/11/09,392.0,394.652,409.0,100300,409.0,386.0
540,2016/11/10,404.0,405.862,405.0,47700,409.0,402.0
541,2016/11/11,402.0,404.02,408.0,50200,411.0,401.0
542,2016/11/14,409.0,409.646,409.0,58400,412.0,408.0
543,2016/11/15,407.0,407.076,410.0,39500,410.0,404.0
544,2016/11/16,413.0,413.298,406.0,51000,416.0,406.0
545,2016/11/17,418.0,415.821,413.0,34600,419.0,413.0
546,2016/11/18,423.0,423.125,420.0,53600,426.0,420.0
547,2016/11/21,426.0,428.261,427.0,71400,433.0,423.0
548,2016/11/22,426.0,427.089,428.0,32500,430.0,426.0
549,2016/11/24,437.0,433.185,430.0,50800,438.0,429.0
550,2016/11/25,435.0,434.876,437.0,41100,439.0,432.0
551,2016/11/28,454.0,443.944,438.0,121200,454.0,435.0
552,2016/11/29,456.0,452.599,454.0,87100,456.0,447.0
553,2016/11/30,463.0,459.992,451.0,82000,464.0,451.0
554,2016/12/01,460.0,465.897,466.0,104100,472.0,458.0
555,2016/12/02,466.0,466.157,458.0,50300,472.0,458.0
556,2016/12/05,474.0,468.392,463.0,70100,474.0,460.0
557,2016/12/06,470.0,471.703,474.0,63700,474.0,468.0
558,2016/12/07,470.0,469.945,467.0,70600,474.0,465.0
559,2016/12/08,477.0,475.66,473.0,70500,479.0,472.0
560,2016/12/09,478.0,476.486,477.0,63800,479.0,473.0
561,2016/12/12,477.0,480.102,477.0,112800,487.0,474.0
562,2016/12/13,475.0,475.579,477.0,92900,478.0,472.0
563,2016/12/14,467.0,472.009,475.0,88900,475.0,467.0
564,2016/12/15,471.0,474.605,470.0,67800,480.0,469.0
565,2016/12/16,467.0,467.68,471.0,61800,472.0,464.0
566,2016/12/19,458.0,458.195,460.0,62100,462.0,455.0
567,2016/12/20,466.0,461.472,456.0,43200,467.0,455.0
568,2016/12/21,453.0,460.277,465.0,92600,466.0,453.0
569,2016/12/22,460.0,456.836,453.0,74500,462.0,453.0
570,2016/12/26,450.0,451.514,463.0,67100,463.0,443.0
571,2016/12/27,448.0,447.102,447.0,57000,452.0,445.0
572,2016/12/28,454.0,449.559,448.0,49200,456.0,444.0
573,2016/12/29,447.0,446.814,452.0,29000,454.0,444.0
574,2016/12/30,448.0,444.055,441.0,32800,449.0,440.0
575,2017/01/04,457.0,453.878,448.0,51800,460.0,445.0
576,2017/01/05,467.0,464.876,457.0,83300,469.0,457.0
577,2017/01/06,469.0,465.188,467.0,70900,470.0,460.0
578,2017/01/10,460.0,462.192,467.0,49400,467.0,460.0
579,2017/01/11,463.0,461.417,462.0,45600,464.0,457.0
580,2017/01/12,462.0,458.81,459.0,33600,462.0,455.0
581,2017/01/13,464.0,462.148,462.0,62800,465.0,458.0
582,2017/01/16,459.0,459.787,461.0,33300,464.0,457.0
583,2017/01/17,453.0,457.042,459.0,50300,461.0,452.0
584,2017/01/18,454.0,450.043,453.0,58000,457.0,442.0
585,2017/01/19,459.0,456.373,455.0,73500,461.0,450.0
586,2017/01/20,466.0,463.194,459.0,48000,467.0,457.0
587,2017/01/23,467.0,466.031,464.0,60700,470.0,460.0
588,2017/01/24,466.0,465.259,465.0,52500,468.0,460.0
589,2017/01/25,468.0,467.357,468.0,30500,470.0,465.0
590,2017/01/26,473.0,472.189,470.0,127200,477.0,468.0
591,2017/01/27,528.0,510.938,496.0,1074600,535.0,491.0
592,2017/01/30,565.0,542.628,533.0,864400,565.0,522.0
593,2017/01/31,550.0,549.147,542.0,342500,558.0,541.0
594,2017/02/01,545.0,545.001,548.0,226300,552.0,540.0
595,2017/02/02,563.0,561.608,547.0,395500,569.0,547.0
596,2017/02/03,554.0,557.618,561.0,150900,563.0,553.0
597,2017/02/06,550.0,552.746,556.0,126400,557.0,549.0
598,2017/02/07,566.0,564.525,549.0,305400,576.0,545.0
599,2017/02/08,568.0,567.924,563.0,157100,574.0,559.0
600,2017/02/09,570.0,568.365,572.0,87700,572.0,562.0
601,2017/02/10,577.0,574.668,573.0,128600,578.0,570.0
602,2017/02/13,579.0,580.644,580.0,100700,582.0,578.0
603,2017/02/14,575.0,577.742,580.0,80100,582.0,575.0
604,2017/02/15,570.0,574.554,575.0,160400,582.0,564.0
605,2017/02/16,575.0,573.625,573.0,30100,577.0,570.0
606,2017/02/17,579.0,577.312,575.0,69300,581.0,568.0
607,2017/02/20,573.0,572.266,574.0,21400,575.0,570.0
608,2017/02/21,573.0,572.314,570.0,63300,576.0,567.0
609,2017/02/22,572.0,572.917,571.0,77400,577.0,570.0
610,2017/02/23,579.0,576.044,577.0,95700,579.0,558.0
611,2017/02/24,577.0,576.637,578.0,37200,578.0,572.0
612,2017/02/27,567.0,567.177,569.0,53000,572.0,563.0
613,2017/02/28,573.0,571.033,568.0,72100,578.0,565.0
614,2017/03/01,567.0,566.594,573.0,63300,573.0,563.0
615,2017/03/02,571.0,569.569,569.0,65400,572.0,567.0
616,2017/03/03,577.0,574.948,568.0,77300,580.0,567.0
617,2017/03/06,569.0,573.455,578.0,49700,578.0,569.0
618,2017/03/07,565.0,567.066,571.0,48400,571.0,565.0
619,2017/03/08,565.0,565.812,566.0,68200,569.0,564.0
620,2017/03/09,566.0,566.818,564.0,20300,569.0,564.0
621,2017/03/10,570.0,565.97,563.0,67400,571.0,562.0
622,2017/03/13,562.0,562.412,565.0,59200,568.0,558.0
623,2017/03/14,566.0,563.386,559.0,40400,567.0,558.0
624,2017/03/15,562.0,563.287,565.0,31700,566.0,561.0
625,2017/03/16,559.0,558.319,559.0,32900,561.0,555.0
626,2017/03/17,556.0,557.611,559.0,27500,560.0,556.0
627,2017/03/21,558.0,557.579,559.0,43700,559.0,555.0
628,2017/03/22,544.0,549.207,555.0,84000,556.0,544.0
629,2017/03/23,546.0,546.031,544.0,55300,550.0,544.0
630,2017/03/24,548.0,549.041,546.0,41700,553.0,546.0
631,2017/03/27,553.0,547.714,543.0,63900,555.0,543.0
632,2017/03/28,558.0,553.483,553.0,82800,558.0,548.0
633,2017/03/29,557.0,554.168,553.0,29100,558.0,550.0
634,2017/03/30,551.0,550.542,555.0,25100,555.0,547.0
635,2017/03/31,550.0,553.076,556.0,31800,558.0,550.0
636,2017/04/03,542.0,545.185,549.0,55700,549.0,541.0
637,2017/04/04,527.0,533.578,537.0,58300,543.0,523.0
638,2017/04/05,526.0,529.165,537.0,33900,538.0,524.0
639,2017/04/06,512.0,513.61,527.0,80400,527.0,506.0
640,2017/04/07,512.0,515.101,514.0,59300,519.0,511.0
641,2017/04/10,526.0,521.856,515.0,45700,531.0,511.0
642,2017/04/11,519.0,522.654,526.0,42200,526.0,519.0
643,2017/04/12,507.0,508.862,513.0,47000,514.0,507.0
644,2017/04/13,502.0,504.401,506.0,51400,513.0,502.0
645,2017/04/14,500.0,503.528,502.0,36200,516.0,500.0
646,2017/04/17,503.0,501.535,500.0,25800,505.0,499.0
647,2017/04/18,506.0,507.214,507.0,16800,513.0,504.0
648,2017/04/19,503.0,507.05,510.0,22100,512.0,502.0
649,2017/04/20,513.0,511.602,509.0,22100,515.0,507.0
650,2017/04/21,514.0,516.138,518.0,24000,519.0,512.0
651,2017/04/24,522.0,519.957,519.0,23300,523.0,515.0
652,2017/04/25,528.0,527.162,523.0,48900,534.0,521.0
653,2017/04/26,546.0,539.274,535.0,56900,546.0,531.0
654,2017/04/27,646.0,646.0,646.0,79000,646.0,646.0
655,2017/04/28,694.0,691.496,696.0,2280300,715.0,663.0
656,2017/05/01,701.0,693.038,689.0,687500,709.0,673.0
657,2017/05/02,698.0,697.095,700.0,282800,702.0,689.0
658,2017/05/08,700.0,709.53,700.0,458100,743.0,694.0
659,2017/05/09,694.0,694.686,692.0,130100,699.0,692.0
660,2017/05/10,716.0,707.23,700.0,269100,718.0,691.0
661,2017/05/11,722.0,719.542,720.0,219900,732.0,705.0
662,2017/05/12,733.0,727.109,722.0,253500,735.0,716.0
663,2017/05/15,699.0,710.792,735.0,293700,735.0,699.0
664,2017/05/16,706.0,698.898,701.0,209000,708.0,685.0
665,2017/05/17,700.0,698.68,703.0,149500,704.0,688.0
666,2017/05/18,692.0,689.609,685.0,167300,697.0,683.0
667,2017/05/19,705.0,706.278,701.0,180200,719.0,697.0
668,2017/05/22,740.0,739.329,731.0,468100,748.0,729.0
669,2017/05/23,746.0,741.681,740.0,204400,750.0,730.0
670,2017/05/24,779.0,769.281,754.0,456800,780.0,752.0
671,2017/05/25,765.0,777.276,783.0,284500,792.0,764.0
672,2017/05/26,761.0,764.404,774.0,208600,774.0,756.0
673,2017/05/29,775.0,777.497,765.0,217900,789.0,760.0
674,2017/05/30,769.0,771.037,775.0,172100,782.0,761.0
675,2017/05/31,762.0,763.701,773.0,113900,773.0,756.0
676,2017/06/01,764.0,764.092,759.0,165400,771.0,759.0
677,2017/06/02,755.0,758.478,765.0,219600,768.0,754.0
678,2017/06/05,805.0,789.217,761.0,471900,808.0,760.0
679,2017/06/06,782.0,787.857,800.0,278600,804.0,781.0
680,2017/06/07,776.0,780.583,786.0,148800,791.0,775.0
681,2017/06/08,768.0,770.51,776.0,184700,780.0,761.0
682,2017/06/09,767.0,766.709,768.0,125500,773.0,758.0
683,2017/06/12,770.0,767.163,768.0,91500,774.0,758.0
684,2017/06/13,761.0,758.633,750.0,209100,779.0,750.0
685,2017/06/14,759.0,755.962,765.0,266900,770.0,745.0
686,2017/06/15,745.0,751.95,753.0,121200,765.0,745.0
687,2017/06/16,749.0,745.381,750.0,144300,753.0,739.0
688,2017/06/19,748.0,751.035,751.0,111400,760.0,745.0
689,2017/06/20,758.0,757.268,757.0,98000,762.0,749.0
690,2017/06/21,766.0,764.349,757.0,119300,769.0,751.0
691,2017/06/22,745.0,752.534,765.0,154600,766.0,745.0
692,2017/06/23,735.0,739.996,743.0,190300,749.0,733.0
693,2017/06/26,741.0,741.621,733.0,89700,750.0,733.0
694,2017/06/27,763.0,754.377,740.0,127000,763.0,740.0
695,2017/06/28,749.0,756.038,766.0,104800,768.0,746.0
696,2017/06/29,755.0,753.931,751.0,44800,758.0,750.0
697,2017/06/30,752.0,751.035,745.0,90600,756.0,745.0
698,2017/07/03,767.0,763.533,752.0,162600,774.0,752.0
699,2017/07/04,752.0,763.599,774.0,156600,776.0,751.0
700,2017/07/05,773.0,771.339,761.0,174400,778.0,757.0
701,2017/07/06,796.0,796.026,781.0,516500,814.0,780.0
702,2017/07/07,785.0,787.54,792.0,159300,793.0,780.0
703,2017/07/10,794.0,797.909,795.0,165700,802.0,793.0
704,2017/07/11,812.0,805.024,797.0,269600,812.0,791.0
705,2017/07/12,792.0,794.74,811.0,257400,811.0,784.0
706,2017/07/13,788.0,791.74,796.0,161200,800.0,784.0
707,2017/07/14,789.0,788.857,790.0,66600,793.0,783.0
708,2017/07/18,796.0,795.053,789.0,111100,800.0,786.0
709,2017/07/19,785.0,788.626,794.0,98100,796.0,781.0
710,2017/07/20,795.0,793.321,785.0,110000,799.0,785.0
711,2017/07/21,822.0,817.39,795.0,360200,828.0,792.0
712,2017/07/24,866.0,851.376,829.0,504600,868.0,826.0
713,2017/07/25,868.0,881.493,867.0,375600,904.0,867.0
714,2017/07/26,875.0,873.982,880.0,270100,885.0,860.0
715,2017/07/27,869.0,867.899,875.0,169900,875.0,860.0
716,2017/07/28,798.0,797.972,794.0,804800,812.0,789.0
717,2017/07/31,797.0,798.044,802.0,240600,807.0,791.0
718,2017/08/01,753.0,769.924,797.0,545300,803.0,747.0
719,2017/08/02,784.0,772.888,760.0,324100,791.0,754.0
720,2017/08/03,819.0,811.889,796.0,328800,824.0,786.0
721,2017/08/04,818.0,818.831,810.0,194000,831.0,804.0
722,2017/08/07,813.0,816.234,826.0,100200,826.0,812.0
723,2017/08/08,807.0,808.413,811.0,96100,817.0,802.0
724,2017/08/09,790.0,791.844,804.0,168700,804.0,787.0
725,2017/08/10,782.0,783.324,790.0,128700,792.0,778.0
726,2017/08/14,793.0,784.384,771.0,178900,798.0,762.0
727,2017/08/15,814.0,807.781,804.0,159100,814.0,798.0
728,2017/08/16,818.0,821.443,808.0,140900,828.0,808.0
729,2017/08/17,831.0,823.462,821.0,88600,832.0,809.0
730,2017/08/18,801.0,807.303,819.0,146600,819.0,798.0
731,2017/08/21,801.0,802.012,802.0,73300,809.0,795.0
732,2017/08/22,815.0,812.268,804.0,81600,819.0,799.0
733,2017/08/23,806.0,811.528,819.0,98900,824.0,803.0
734,2017/08/24,813.0,812.733,801.0,75200,819.0,801.0
735,2017/08/25,801.0,803.178,816.0,66800,816.0,800.0
736,2017/08/28,816.0,811.742,803.0,81800,818.0,803.0
737,2017/08/29,809.0,807.324,806.0,67700,812.0,804.0
738,2017/08/30,818.0,810.54,809.0,94100,818.0,804.0
739,2017/08/31,815.0,814.081,819.0,100800,824.0,807.0
740,2017/09/01,826.0,817.358,815.0,214700,832.0,803.0
741,2017/09/04,807.0,810.873,812.0,109800,818.0,805.0
742,2017/09/05,804.0,804.826,807.0,155700,814.0,799.0
743,2017/09/06,805.0,799.697,793.0,133600,812.0,779.0
744,2017/09/07,817.0,818.746,812.0,151400,828.0,808.0
745,2017/09/08,814.0,821.779,815.0,123200,835.0,812.0
746,2017/09/11,829.0,832.223,820.0,136400,841.0,820.0
747,2017/09/12,832.0,834.588,840.0,103600,845.0,823.0
748,2017/09/13,858.0,855.734,839.0,170300,867.0,835.0
749,2017/09/14,865.0,864.159,863.0,113400,869.0,859.0
750,2017/09/15,854.0,852.719,860.0,169400,860.0,846.0
751,2017/09/19,870.0,863.285,869.0,162400,870.0,850.0
752,2017/09/20,867.0,865.209,870.0,96400,870.0,859.0
753,2017/09/21,866.0,868.949,869.0,223600,883.0,864.0
754,2017/09/22,870.0,867.5,869.0,152300,872.0,861.0
755,2017/09/25,861.0,869.67,870.0,109700,882.0,861.0
756,2017/09/26,873.0,866.851,864.0,73100,873.0,854.0
757,2017/09/27,868.0,867.068,855.0,84900,873.0,853.0
758,2017/09/28,874.0,872.945,868.0,117300,880.0,867.0
759,2017/09/29,872.0,871.879,874.0,57700,876.0,866.0
760,2017/10/02,886.0,884.461,880.0,116700,891.0,875.0
761,2017/10/03,886.0,889.521,895.0,97000,899.0,883.0
762,2017/10/04,889.0,887.218,888.0,79700,893.0,882.0
763,2017/10/05,872.0,877.309,888.0,100300,888.0,871.0
764,2017/10/06,872.0,864.516,864.0,123700,872.0,857.0
765,2017/10/10,886.0,878.74,872.0,130000,886.0,872.0
766,2017/10/11,869.0,872.248,887.0,111900,887.0,865.0
767,2017/10/12,864.0,865.546,865.0,140400,874.0,861.0
768,2017/10/13,859.0,855.119,865.0,170100,867.0,846.0
769,2017/10/16,855.0,852.476,854.0,151300,858.0,848.0
770,2017/10/17,866.0,862.124,857.0,90800,866.0,856.0
771,2017/10/18,853.0,857.433,868.0,125700,871.0,851.0
772,2017/10/19,876.0,869.681,853.0,169300,878.0,853.0
773,2017/10/20,859.0,861.805,865.0,114100,867.0,858.0
774,2017/10/23,875.0,867.804,859.0,106100,875.0,855.0
775,2017/10/24,884.0,881.325,876.0,129000,893.0,870.0
776,2017/10/25,878.0,885.473,884.0,167300,896.0,876.0
777,2017/10/26,925.0,912.664,880.0,467200,929.0,880.0
778,2017/10/27,944.0,933.316,927.0,234100,944.0,920.0
779,2017/10/30,941.0,940.189,950.0,338500,952.0,911.0
780,2017/10/31,870.0,857.031,866.0,932600,878.0,827.0
781,2017/11/01,842.0,850.036,875.0,599100,878.0,839.0
782,2017/11/02,838.0,832.913,842.0,395200,845.0,824.0
783,2017/11/06,862.0,869.147,863.0,481500,883.0,856.0
784,2017/11/07,879.0,870.987,858.0,252200,881.0,854.0
785,2017/11/08,902.0,891.583,878.0,340600,908.0,868.0
786,2017/11/09,899.0,906.863,908.0,252400,927.0,881.0
787,2017/11/10,892.0,888.736,890.0,105100,899.0,880.0
788,2017/11/13,899.0,901.03,895.0,130900,907.0,892.0
789,2017/11/14,906.0,911.667,895.0,224600,919.0,893.0
790,2017/11/15,866.0,877.495,900.0,175600,900.0,862.0
791,2017/11/16,871.0,871.283,857.0,121600,880.0,857.0
792,2017/11/17,876.0,878.89,885.0,127400,892.0,870.0
793,2017/11/20,858.0,859.679,870.0,207300,876.0,853.0
794,2017/11/21,884.0,880.465,873.0,128400,888.0,865.0
795,2017/11/22,891.0,890.183,889.0,158200,895.0,882.0
796,2017/11/24,881.0,883.819,891.0,69200,891.0,881.0
797,2017/11/27,892.0,892.45,887.0,113100,902.0,884.0
798,2017/11/28,877.0,881.349,892.0,86200,894.0,875.0
799,2017/11/29,871.0,876.492,879.0,78800,887.0,869.0
800,2017/11/30,864.0,865.441,870.0,230800,881.0,859.0
801,2017/12/01,873.0,870.854,867.0,63600,876.0,864.0
802,2017/12/04,871.0,872.769,876.0,132200,877.0,866.0
803,2017/12/05,873.0,871.366,871.0,78700,876.0,865.0
804,2017/12/06,861.0,863.193,871.0,133000,871.0,861.0
805,2017/12/07,882.0,875.604,860.0,112900,884.0,860.0
806,2017/12/08,888.0,886.438,885.0,104800,894.0,881.0
807,2017/12/11,894.0,891.302,888.0,111800,895.0,886.0
808,2017/12/12,900.0,900.504,898.0,101300,907.0,895.0
809,2017/12/13,880.0,886.354,900.0,81600,902.0,878.0
810,2017/12/14,886.0,883.756,883.0,41000,891.0,872.0
811,2017/12/15,889.0,887.957,883.0,83400,894.0,879.0
812,2017/12/18,907.0,904.381,894.0,83400,912.0,894.0
813,2017/12/19,903.0,900.346,907.0,73500,908.0,893.0
814,2017/12/20,917.0,910.829,901.0,111200,918.0,896.0
815,2017/12/21,929.0,920.192,917.0,112200,929.0,905.0
816,2017/12/22,943.0,936.251,930.0,98500,943.0,930.0
817,2017/12/25,940.0,942.511,943.0,63800,950.0,934.0
818,2017/12/26,939.0,939.03,940.0,62600,944.0,934.0
819,2017/12/27,974.0,964.895,938.0,184200,979.0,936.0
820,2017/12/28,967.0,968.856,972.0,105000,976.0,958.0
821,2017/12/29,960.0,963.868,965.0,53200,969.0,960.0
822,2018/01/04,977.0,975.452,964.0,147000,983.0,964.0
823,2018/01/05,987.0,981.949,974.0,116000,990.0,967.0
824,2018/01/09,1004.0,999.945,991.0,233300,1010.0,981.0
825,2018/01/10,1010.0,1005.152,1005.0,84800,1012.0,996.0
826,2018/01/11,1003.0,1001.687,1003.0,91800,1007.0,992.0
827,2018/01/12,1022.0,1018.334,1003.0,83600,1027.0,1001.0
828,2018/01/15,1011.0,1019.813,1025.0,84000,1033.0,1011.0
829,2018/01/16,1005.0,1003.105,1010.0,106700,1010.0,998.0
830,2018/01/17,1005.0,1001.968,1001.0,104200,1009.0,995.0
831,2018/01/18,988.0,1003.001,1006.0,87200,1014.0,988.0
832,2018/01/19,997.0,997.776,983.0,92300,1007.0,981.0
833,2018/01/22,1008.0,1004.73,1006.0,91000,1011.0,994.0
834,2018/01/23,1018.0,1015.217,1010.0,71400,1023.0,1004.0
835,2018/01/24,993.0,999.832,1019.0,119600,1020.0,990.0
836,2018/01/25,982.0,985.919,990.0,100600,993.0,981.0
837,2018/01/26,977.0,980.818,993.0,110300,993.0,974.0
838,2018/01/29,973.0,976.403,979.0,246800,986.0,966.0
839,2018/01/30,1123.0,1111.066,1050.0,1080000,1123.0,1036.0
840,2018/01/31,1108.0,1120.678,1112.0,810700,1148.0,1098.0
841,2018/02/01,1158.0,1140.981,1105.0,363700,1163.0,1101.0
842,2018/02/02,1140.0,1141.064,1155.0,182300,1157.0,1129.0
843,2018/02/05,1087.0,1089.311,1094.0,230400,1108.0,1075.0
844,2018/02/06,982.0,988.23,1035.0,392900,1042.0,939.0
845,2018/02/07,960.0,995.63,1033.0,177500,1036.0,960.0
846,2018/02/08,973.0,967.06,968.0,154300,983.0,952.0
847,2018/02/09,944.0,933.431,931.0,189300,946.0,924.0
848,2018/02/13,916.0,931.523,958.0,193100,969.0,916.0
849,2018/02/14,886.0,896.84,914.0,198100,915.0,878.0
850,2018/02/15,905.0,906.313,891.0,106600,918.0,891.0
851,2018/02/16,912.0,912.928,916.0,81700,923.0,905.0
852,2018/02/19,952.0,940.562,920.0,105600,955.0,920.0
853,2018/02/20,950.0,938.808,940.0,111700,950.0,928.0
854,2018/02/21,949.0,948.563,945.0,90300,962.0,941.0
855,2018/02/22,942.0,940.064,946.0,74900,955.0,931.0
856,2018/02/23,950.0,945.433,947.0,60300,953.0,935.0
857,2018/02/26,950.0,952.055,952.0,79800,963.0,947.0
858,2018/02/27,960.0,956.999,951.0,92900,965.0,946.0
859,2018/02/28,957.0,959.109,955.0,54300,967.0,947.0
860,2018/03/01,928.0,930.416,950.0,115700,950.0,920.0
861,2018/03/02,919.0,915.218,903.0,111700,925.0,900.0
862,2018/03/05,869.0,879.652,919.0,222900,919.0,864.0
863,2018/03/06,886.0,887.701,884.0,185300,903.0,873.0
864,2018/03/07,879.0,873.603,888.0,261500,889.0,860.0
865,2018/03/08,875.0,872.964,888.0,197800,889.0,862.0
866,2018/03/09,882.0,887.875,887.0,95900,903.0,872.0
867,2018/03/12,908.0,902.65,893.0,76600,910.0,888.0
868,2018/03/13,915.0,904.635,908.0,84400,915.0,895.0
869,2018/03/14,909.0,910.238,910.0,52100,920.0,904.0
870,2018/03/15,900.0,894.766,904.0,90100,904.0,882.0
871,2018/03/16,886.0,889.643,900.0,88500,901.0,882.0
872,2018/03/19,868.0,872.382,880.0,123000,890.0,861.0
873,2018/03/20,867.0,861.384,856.0,81100,869.0,853.0
874,2018/03/22,876.0,870.987,867.0,68600,878.0,862.0
875,2018/03/23,823.0,835.905,855.0,224600,856.0,819.0
876,2018/03/26,823.0,810.333,811.0,171700,824.0,799.0
877,2018/03/27,834.0,831.614,835.0,156600,837.0,826.0
878,2018/03/28,815.0,809.345,804.0,118500,821.0,801.0
879,2018/03/29,805.0,805.786,821.0,80500,827.0,793.0
880,2018/03/30,813.0,813.485,810.0,77400,819.0,806.0
881,2018/04/02,820.0,818.649,815.0,70400,825.0,813.0
882,2018/04/03,809.0,808.631,810.0,82400,817.0,801.0
883,2018/04/04,816.0,814.2,811.0,47600,820.0,807.0
884,2018/04/05,823.0,818.833,817.0,83000,825.0,809.0
885,2018/04/06,812.0,812.608,821.0,91400,826.0,808.0
886,2018/04/09,808.0,804.702,808.0,112100,812.0,794.0
887,2018/04/10,822.0,809.239,808.0,133300,825.0,791.0
888,2018/04/11,830.0,828.357,820.0,40600,837.0,818.0
889,2018/04/12,819.0,819.788,829.0,90600,830.0,815.0
890,2018/04/13,831.0,828.687,820.0,67300,835.0,820.0
891,2018/04/16,830.0,827.142,837.0,64600,839.0,817.0
892,2018/04/17,796.0,802.882,833.0,126700,833.0,793.0
893,2018/04/18,820.0,812.705,803.0,109800,825.0,797.0
894,2018/04/19,837.0,835.564,828.0,120000,845.0,818.0
895,2018/04/20,830.0,829.896,837.0,67600,837.0,824.0
896,2018/04/23,849.0,840.9,833.0,111000,849.0,826.0
897,2018/04/24,837.0,851.545,859.0,229700,864.0,834.0
898,2018/04/25,822.0,816.969,837.0,481400,837.0,799.0
899,2018/04/26,804.0,806.783,822.0,351100,822.0,799.0
900,2018/04/27,801.0,798.856,803.0,411700,806.0,788.0
901,2018/05/01,779.0,783.031,797.0,257000,798.0,775.0
902,2018/05/02,775.0,777.372,777.0,322800,783.0,773.0
903,2018/05/07,773.0,771.673,778.0,229900,779.0,766.0
904,2018/05/08,785.0,781.337,778.0,213800,788.0,770.0
905,2018/05/09,779.0,780.489,784.0,179700,790.0,773.0
906,2018/05/10,779.0,777.6,787.0,149800,787.0,774.0
907,2018/05/11,780.0,776.309,780.0,135500,782.0,773.0
908,2018/05/14,782.0,780.701,782.0,167700,785.0,777.0
909,2018/05/15,785.0,780.713,786.0,179300,786.0,776.0
910,2018/05/16,777.0,777.658,781.0,147200,783.0,775.0
911,2018/05/17,780.0,780.857,779.0,111000,785.0,777.0
912,2018/05/18,780.0,781.085,784.0,130600,788.0,777.0
913,2018/05/21,796.0,793.523,785.0,138000,798.0,785.0
914,2018/05/22,798.0,802.874,806.0,169700,810.0,797.0
915,2018/05/23,779.0,783.439,800.0,175200,800.0,779.0
916,2018/05/24,766.0,768.731,781.0,328700,781.0,763.0
917,2018/05/25,752.0,756.815,764.0,306800,775.0,750.0
918,2018/05/28,754.0,753.484,755.0,147500,759.0,751.0
919,2018/05/29,740.0,743.559,753.0,220000,753.0,735.0
920,2018/05/30,726.0,724.838,727.0,157500,732.0,719.0
921,2018/05/31,725.0,724.702,735.0,182400,736.0,719.0
922,2018/06/01,721.0,717.456,722.0,146600,724.0,709.0
923,2018/06/04,737.0,732.799,729.0,97700,739.0,721.0
924,2018/06/05,724.0,726.02,740.0,83800,740.0,719.0
925,2018/06/06,732.0,727.506,725.0,84000,732.0,721.0
926,2018/06/07,742.0,738.061,732.0,72500,743.0,731.0
927,2018/06/08,745.0,743.307,742.0,86800,747.0,738.0
928,2018/06/11,741.0,740.408,748.0,100300,748.0,734.0
929,2018/06/12,728.0,731.974,743.0,128700,743.0,728.0
930,2018/06/13,729.0,726.139,728.0,82700,731.0,721.0
931,2018/06/14,724.0,725.544,732.0,82000,732.0,722.0
932,2018/06/15,722.0,721.378,728.0,87400,728.0,718.0
933,2018/06/18,712.0,710.544,721.0,131300,721.0,707.0
934,2018/06/19,705.0,704.982,710.0,156600,713.0,701.0
935,2018/06/20,706.0,692.503,705.0,205100,706.0,680.0
936,2018/06/21,708.0,708.864,704.0,70000,717.0,703.0
937,2018/06/22,698.0,693.327,700.0,113800,700.0,688.0
938,2018/06/25,683.0,688.261,701.0,136200,703.0,681.0
939,2018/06/26,681.0,671.222,673.0,225300,683.0,661.0
940,2018/06/27,671.0,671.184,681.0,137800,683.0,664.0
941,2018/06/28,674.0,669.502,671.0,114100,676.0,664.0
942,2018/06/29,675.0,671.126,675.0,103800,676.0,665.0
943,2018/07/02,664.0,676.815,675.0,152200,693.0,663.0
944,2018/07/03,666.0,666.123,668.0,140000,673.0,660.0
945,2018/07/04,648.0,653.165,661.0,176700,663.0,648.0
946,2018/07/05,661.0,658.251,648.0,176400,669.0,645.0
947,2018/07/06,662.0,657.752,663.0,158800,664.0,651.0
948,2018/07/09,675.0,664.735,665.0,108900,675.0,654.0
949,2018/07/10,699.0,692.843,675.0,164000,703.0,672.0
950,2018/07/11,685.0,685.929,701.0,145000,701.0,673.0
951,2018/07/12,682.0,680.519,682.0,72400,687.0,675.0
952,2018/07/13,688.0,685.307,685.0,60900,692.0,679.0
953,2018/07/17,693.0,692.806,693.0,116100,700.0,687.0
954,2018/07/18,704.0,702.192,695.0,92000,708.0,695.0
955,2018/07/19,717.0,711.1,703.0,131000,720.0,700.0
956,2018/07/20,702.0,708.447,715.0,211800,718.0,696.0
957,2018/07/23,692.0,690.891,695.0,113300,699.0,687.0
958,2018/07/24,714.0,705.424,697.0,81100,715.0,695.0
959,2018/07/25,714.0,713.398,712.0,99200,728.0,707.0
960,2018/07/26,720.0,716.173,714.0,73000,720.0,711.0
961,2018/07/27,736.0,732.958,725.0,159500,738.0,725.0
962,2018/07/30,783.0,769.994,745.0,636100,784.0,743.0
963,2018/07/31,772.0,770.398,783.0,167900,784.0,762.0
964,2018/08/01,771.0,770.362,775.0,101300,777.0,764.0
965,2018/08/02,744.0,751.691,768.0,210100,769.0,740.0
966,2018/08/03,727.0,733.372,740.0,178400,748.0,726.0
967,2018/08/06,720.0,722.127,732.0,122400,732.0,716.0
968,2018/08/07,738.0,731.937,724.0,65200,738.0,724.0
969,2018/08/08,733.0,735.588,736.0,79900,742.0,730.0
970,2018/08/09,730.0,727.371,726.0,64900,732.0,720.0
971,2018/08/10,717.0,716.669,725.0,127200,725.0,711.0
972,2018/08/13,686.0,689.994,711.0,166400,712.0,680.0
973,2018/08/14,701.0,692.983,691.0,120900,701.0,686.0
974,2018/08/15,690.0,691.636,701.0,77000,702.0,681.0
975,2018/08/16,703.0,694.096,679.0,144200,708.0,675.0
976,2018/08/17,714.0,706.068,695.0,58900,714.0,695.0
977,2018/08/20,702.0,705.846,715.0,61200,715.0,700.0
978,2018/08/21,690.0,692.037,691.0,56800,702.0,688.0
979,2018/08/22,720.0,710.947,698.0,62400,720.0,690.0
980,2018/08/23,713.0,711.353,720.0,45100,720.0,706.0
981,2018/08/24,719.0,716.516,719.0,25600,719.0,712.0
982,2018/08/27,739.0,733.528,719.0,79700,740.0,719.0
983,2018/08/28,742.0,750.86,755.0,120900,764.0,740.0
984,2018/08/29,754.0,752.663,748.0,78700,757.0,745.0
985,2018/08/30,745.0,746.495,760.0,119900,760.0,740.0
986,2018/08/31,756.0,750.728,737.0,102400,757.0,734.0
987,2018/09/03,733.0,739.083,753.0,83400,755.0,729.0
988,2018/09/04,728.0,727.365,734.0,69800,734.0,723.0
989,2018/09/05,727.0,727.602,728.0,68300,732.0,721.0
990,2018/09/06,718.0,718.904,724.0,50200,729.0,712.0
991,2018/09/07,705.0,705.043,709.0,51600,711.0,701.0
992,2018/09/10,715.0,714.554,706.0,49800,721.0,706.0
993,2018/09/11,721.0,716.014,718.0,62500,722.0,710.0
994,2018/09/12,699.0,701.127,722.0,95300,723.0,694.0
995,2018/09/13,704.0,702.555,698.0,61100,710.0,695.0
996,2018/09/14,726.0,720.606,715.0,76700,730.0,714.0
997,2018/09/18,741.0,733.89,729.0,65300,742.0,718.0
998,2018/09/19,746.0,749.858,747.0,130800,756.0,744.0
999,2018/09/20,748.0,747.452,749.0,78400,752.0,742.0
1000,2018/09/21,772.0,763.947,751.0,178300,772.0,751.0
1001,2018/09/25,775.0,771.93,772.0,127000,780.0,761.0
1002,2018/09/26,776.0,768.235,765.0,71600,777.0,757.0
1003,2018/09/27,762.0,766.391,774.0,52700,774.0,759.0
1004,2018/09/28,766.0,768.479,768.0,63300,774.0,764.0
1005,2018/10/01,760.0,764.264,770.0,52200,770.0,760.0
1006,2018/10/02,751.0,759.781,767.0,89000,776.0,751.0
1007,2018/10/03,743.0,746.725,752.0,50200,754.0,742.0
1008,2018/10/04,750.0,746.417,750.0,47000,753.0,739.0
1009,2018/10/05,752.0,750.842,742.0,93500,759.0,735.0
1010,2018/10/09,727.0,732.254,744.0,87900,744.0,726.0
1011,2018/10/10,708.0,714.045,727.0,140300,733.0,707.0
1012,2018/10/11,689.0,684.165,675.0,157700,693.0,668.0
1013,2018/10/12,699.0,691.706,686.0,64700,701.0,682.0
1014,2018/10/15,688.0,690.919,696.0,70000,697.0,685.0
1015,2018/10/16,691.0,689.716,688.0,60500,699.0,684.0
1016,2018/10/17,701.0,697.982,700.0,83700,704.0,691.0
1017,2018/10/18,691.0,696.684,703.0,67400,707.0,691.0
1018,2018/10/19,695.0,686.131,687.0,80300,695.0,678.0
1019,2018/10/22,691.0,688.932,690.0,42500,696.0,682.0
1020,2018/10/23,675.0,680.702,690.0,93900,690.0,675.0
1021,2018/10/24,676.0,674.769,675.0,91500,685.0,668.0
1022,2018/10/25,651.0,652.871,657.0,140700,658.0,648.0
1023,2018/10/26,618.0,630.793,657.0,265300,657.0,616.0
1024,2018/10/29,570.0,582.632,590.0,367600,601.0,566.0
1025,2018/10/30,584.0,575.989,568.0,278400,585.0,557.0
1026,2018/10/31,617.0,605.847,591.0,141400,617.0,588.0
1027,2018/11/01,614.0,610.254,616.0,155900,619.0,598.0
1028,2018/11/02,652.0,639.321,616.0,167400,660.0,616.0
1029,2018/11/05,648.0,647.671,645.0,53800,653.0,638.0
1030,2018/11/06,643.0,646.92,648.0,33600,653.0,643.0
1031,2018/11/07,631.0,641.934,644.0,143500,657.0,628.0
1032,2018/11/08,634.0,635.202,640.0,101100,640.0,627.0
1033,2018/11/09,629.0,629.985,630.0,38700,639.0,626.0
1034,2018/11/12,626.0,622.697,625.0,41900,628.0,615.0
1035,2018/11/13,605.0,603.854,610.0,77600,612.0,598.0
1036,2018/11/14,600.0,603.38,610.0,60300,612.0,599.0
1037,2018/11/15,600.0,598.652,598.0,71600,605.0,592.0
1038,2018/11/16,586.0,591.716,601.0,52900,604.0,586.0
1039,2018/11/19,588.0,589.053,590.0,72000,597.0,582.0
1040,2018/11/20,585.0,582.709,587.0,65200,589.0,578.0
1041,2018/11/21,582.0,580.654,576.0,58100,588.0,573.0
1042,2018/11/22,580.0,581.265,588.0,91700,590.0,573.0
1043,2018/11/26,589.0,583.313,579.0,62700,590.0,575.0
1044,2018/11/27,592.0,591.472,592.0,77400,596.0,582.0
1045,2018/11/28,607.0,602.297,593.0,91800,608.0,593.0
1046,2018/11/29,604.0,608.096,610.0,83600,613.0,603.0
1047,2018/11/30,604.0,604.071,604.0,69500,609.0,601.0
1048,2018/12/03,615.0,612.788,607.0,178800,618.0,607.0
1049,2018/12/04,593.0,601.565,616.0,98700,618.0,592.0
1050,2018/12/05,588.0,586.251,586.0,86500,592.0,580.0
1051,2018/12/06,578.0,579.284,587.0,82300,588.0,573.0
1052,2018/12/07,567.0,566.438,579.0,138100,585.0,558.0
1053,2018/12/10,565.0,565.016,565.0,89000,570.0,560.0
1054,2018/12/11,556.0,559.159,565.0,99800,565.0,554.0
1055,2018/12/12,568.0,567.878,560.0,75100,577.0,559.0
1056,2018/12/13,568.0,568.618,568.0,95000,575.0,562.0
1057,2018/12/14,559.0,562.244,564.0,98000,570.0,556.0
1058,2018/12/17,548.0,554.04,556.0,181100,561.0,548.0
1059,2018/12/18,542.0,544.295,541.0,121400,551.0,535.0
1060,2018/12/19,542.0,541.834,542.0,83000,548.0,533.0
1061,2018/12/20,524.0,530.848,537.0,138900,543.0,521.0
1062,2018/12/21,512.0,514.296,517.0,140800,522.0,507.0
1063,2018/12/25,483.0,481.622,470.0,207800,494.0,470.0
1064,2018/12/26,497.0,496.005,484.0,145300,504.0,484.0
1065,2018/12/27,538.0,526.667,521.0,122900,539.0,518.0
1066,2018/12/28,539.0,540.13,538.0,67900,546.0,537.0
1067,2019/01/04,534.0,531.81,535.0,104500,540.0,521.0
1068,2019/01/07,541.0,546.188,544.0,97800,554.0,541.0
1069,2019/01/08,551.0,548.346,542.0,57500,555.0,539.0
1070,2019/01/09,548.0,547.696,556.0,45100,556.0,544.0
1071,2019/01/10,544.0,541.515,545.0,59000,547.0,536.0
1072,2019/01/11,549.0,549.315,545.0,33000,554.0,545.0
1073,2019/01/15,576.0,565.728,547.0,126600,580.0,544.0
1074,2019/01/16,567.0,567.692,579.0,77600,579.0,562.0
1075,2019/01/17,578.0,577.786,574.0,55000,585.0,572.0
1076,2019/01/18,580.0,581.747,579.0,80500,588.0,576.0
1077,2019/01/21,588.0,587.107,582.0,58000,591.0,582.0
1078,2019/01/22,583.0,581.1,588.0,41900,588.0,577.0
1079,2019/01/23,571.0,574.003,574.0,74300,581.0,567.0
1080,2019/01/24,581.0,577.445,571.0,26300,583.0,570.0
1081,2019/01/25,590.0,590.551,580.0,53700,597.0,580.0
1082,2019/01/28,591.0,591.802,594.0,28300,596.0,587.0
1083,2019/01/29,587.0,580.892,589.0,51100,589.0,574.0
1084,2019/01/30,569.0,575.671,585.0,82900,586.0,569.0
1085,2019/01/31,579.0,577.443,564.0,81000,586.0,562.0
1086,2019/02/01,563.0,565.684,571.0,65100,576.0,562.0
1087,2019/02/04,580.0,577.066,570.0,56500,580.0,570.0
1088,2019/02/05,583.0,583.559,583.0,51000,589.0,579.0
1089,2019/02/06,584.0,583.045,585.0,33500,587.0,580.0
1090,2019/02/07,584.0,581.244,586.0,60700,588.0,578.0
1091,2019/02/08,573.0,573.401,575.0,57300,581.0,567.0
1092,2019/02/12,587.0,585.389,574.0,51100,591.0,574.0
1093,2019/02/13,596.0,594.397,589.0,84100,599.0,588.0
1094,2019/02/14,598.0,600.646,597.0,53100,604.0,597.0
1095,2019/02/15,592.0,591.173,595.0,42900,597.0,587.0
1096,2019/02/18,608.0,606.724,605.0,38800,609.0,605.0
1097,2019/02/19,610.0,609.423,609.0,31700,615.0,605.0
1098,2019/02/20,609.0,610.566,615.0,36200,616.0,606.0
1099,2019/02/21,609.0,609.046,614.0,28400,614.0,606.0
1100,2019/02/22,610.0,608.993,605.0,28700,614.0,604.0
1101,2019/02/25,617.0,614.378,611.0,24900,617.0,609.0
1102,2019/02/26,617.0,616.982,620.0,44700,623.0,610.0
1103,2019/02/27,613.0,617.405,619.0,49100,624.0,612.0
1104,2019/02/28,607.0,611.859,613.0,38900,617.0,607.0
1105,2019/03/01,609.0,610.728,607.0,26100,615.0,607.0
1106,2019/03/04,619.0,618.421,614.0,39400,623.0,614.0
1107,2019/03/05,616.0,616.101,619.0,40500,622.0,611.0
1108,2019/03/06,615.0,615.614,615.0,23600,620.0,613.0
1109,2019/03/07,607.0,608.23,615.0,50000,615.0,605.0
1110,2019/03/08,579.0,588.071,600.0,100800,601.0,578.0
1111,2019/03/11,581.0,579.423,580.0,34500,585.0,575.0
1112,2019/03/12,588.0,588.712,587.0,50300,596.0,586.0
1113,2019/03/13,575.0,580.8,587.0,59900,590.0,575.0
1114,2019/03/14,572.0,574.338,580.0,40300,580.0,571.0
1115,2019/03/15,565.0,571.132,572.0,58300,581.0,565.0
1116,2019/03/18,579.0,577.393,575.0,50700,582.0,572.0
1117,2019/03/19,577.0,577.443,579.0,63500,582.0,573.0
1118,2019/03/20,579.0,580.168,581.0,58900,585.0,576.0
1119,2019/03/22,603.0,593.86,584.0,83500,604.0,583.0
1120,2019/03/25,590.0,587.649,593.0,75100,593.0,578.0
1121,2019/03/26,607.0,601.163,597.0,168700,607.0,595.0
1122,2019/03/27,594.0,590.29,589.0,71500,595.0,585.0
1123,2019/03/28,583.0,581.764,592.0,55900,592.0,575.0
1124,2019/03/29,575.0,578.717,587.0,44200,589.0,573.0
1125,2019/04/01,590.0,591.008,577.0,52300,598.0,577.0
1126,2019/04/02,593.0,592.901,593.0,36200,598.0,587.0
1127,2019/04/03,605.0,599.67,592.0,35800,605.0,591.0
1128,2019/04/04,605.0,608.447,599.0,44700,614.0,599.0
1129,2019/04/05,614.0,611.489,606.0,26200,614.0,606.0
1130,2019/04/08,604.0,608.643,616.0,25500,616.0,603.0
1131,2019/04/09,599.0,599.337,605.0,41000,606.0,596.0
1132,2019/04/10,591.0,589.075,590.0,28200,592.0,583.0
1133,2019/04/11,585.0,585.72,590.0,23900,590.0,583.0
1134,2019/04/12,582.0,582.134,585.0,33500,587.0,578.0
1135,2019/04/15,601.0,597.721,590.0,44500,601.0,590.0
1136,2019/04/16,596.0,595.526,600.0,35200,604.0,583.0
1137,2019/04/17,598.0,598.12,595.0,38200,603.0,593.0
1138,2019/04/18,588.0,589.113,595.0,38000,596.0,584.0
1139,2019/04/19,590.0,590.89,590.0,16300,596.0,588.0
1140,2019/04/22,589.0,589.044,590.0,16000,594.0,585.0
1141,2019/04/23,591.0,588.454,588.0,17200,592.0,585.0
1142,2019/04/24,588.0,589.096,585.0,42800,593.0,585.0
1143,2019/04/25,615.0,614.128,598.0,196800,623.0,598.0
1144,2019/04/26,625.0,619.661,615.0,108300,626.0,605.0
1145,2019/05/07,596.0,605.92,618.0,67700,620.0,596.0
1146,2019/05/08,587.0,588.633,593.0,41900,593.0,585.0
1147,2019/05/09,577.0,578.4,585.0,58200,585.0,570.0
1148,2019/05/10,579.0,580.355,575.0,45300,592.0,573.0
1149,2019/05/13,568.0,581.499,589.0,81900,597.0,567.0
1150,2019/05/14,563.0,557.1,556.0,59900,565.0,548.0
1151,2019/05/15,571.0,562.39,570.0,47700,571.0,552.0
1152,2019/05/16,564.0,564.734,573.0,42500,574.0,558.0
1153,2019/05/17,567.0,567.032,565.0,37000,574.0,562.0
1154,2019/05/20,579.0,573.925,572.0,58600,583.0,563.0
1155,2019/05/21,574.0,573.642,578.0,39700,584.0,565.0
1156,2019/05/22,573.0,574.122,574.0,36100,578.0,569.0
1157,2019/05/23,573.0,570.748,572.0,27800,574.0,567.0
1158,2019/05/24,573.0,572.296,563.0,50000,579.0,563.0
1159,2019/05/27,573.0,571.931,573.0,21600,574.0,569.0
1160,2019/05/28,572.0,572.815,574.0,19500,578.0,571.0
1161,2019/05/29,568.0,566.784,569.0,30500,571.0,561.0
1162,2019/05/30,577.0,573.31,568.0,17400,578.0,566.0
1163,2019/05/31,574.0,574.927,577.0,44900,579.0,567.0
1164,2019/06/03,562.0,560.36,567.0,35800,567.0,556.0
1165,2019/06/04,568.0,564.353,561.0,32600,569.0,558.0
1166,2019/06/05,586.0,582.122,575.0,34400,587.0,575.0
1167,2019/06/06,582.0,586.18,589.0,26700,590.0,582.0
1168,2019/06/07,583.0,584.375,587.0,24000,589.0,582.0
1169,2019/06/10,592.0,590.786,588.0,15400,594.0,588.0
1170,2019/06/11,594.0,595.216,594.0,36600,600.0,592.0
1171,2019/06/12,596.0,596.583,594.0,22800,601.0,592.0
1172,2019/06/13,584.0,586.617,595.0,31100,595.0,582.0
1173,2019/06/14,584.0,583.824,585.0,21000,589.0,578.0
1174,2019/06/17,576.0,578.981,579.0,41500,586.0,576.0
1175,2019/06/18,566.0,570.622,576.0,19300,580.0,565.0
1176,2019/06/19,584.0,581.704,576.0,23300,587.0,575.0
1177,2019/06/20,588.0,585.768,587.0,16400,589.0,579.0
1178,2019/06/21,592.0,591.596,595.0,29200,595.0,586.0
1179,2019/06/24,593.0,589.345,584.0,17400,595.0,584.0
1180,2019/06/25,590.0,591.49,588.0,15700,596.0,588.0
1181,2019/06/26,583.0,585.585,591.0,11800,591.0,583.0
1182,2019/06/27,593.0,590.792,584.0,18300,594.0,584.0
1183,2019/06/28,589.0,594.146,593.0,32300,601.0,588.0
1184,2019/07/01,607.0,603.827,595.0,57900,609.0,595.0
1185,2019/07/02,615.0,611.75,608.0,40800,616.0,603.0
1186,2019/07/03,618.0,615.192,614.0,28600,618.0,609.0
1187,2019/07/04,616.0,616.836,618.0,22600,619.0,615.0
1188,2019/07/05,613.0,612.258,618.0,18600,618.0,608.0
1189,2019/07/08,603.0,608.107,615.0,22400,617.0,603.0
1190,2019/07/09,600.0,601.487,602.0,30200,606.0,597.0
1191,2019/07/10,595.0,596.965,604.0,31400,604.0,594.0
1192,2019/07/11,607.0,604.153,600.0,19600,609.0,595.0
1193,2019/07/12,602.0,603.858,609.0,16200,609.0,600.0
1194,2019/07/16,595.0,596.5,598.0,20000,601.0,592.0
1195,2019/07/17,591.0,592.193,595.0,17100,597.0,587.0
1196,2019/07/18,574.0,578.578,588.0,37000,588.0,573.0
1197,2019/07/19,578.0,579.762,576.0,20600,585.0,575.0
1198,2019/07/22,582.0,583.469,582.0,13000,587.0,581.0
1199,2019/07/23,586.0,586.65,586.0,15700,589.0,584.0
1200,2019/07/24,589.0,588.144,588.0,16000,592.0,586.0
1201,2019/07/25,594.0,588.72,588.0,45000,594.0,584.0
1202,2019/07/26,592.0,593.162,592.0,29000,599.0,589.0
1203,2019/07/29,587.0,585.219,592.0,23300,592.0,582.0
1204,2019/07/30,588.0,589.044,587.0,13500,592.0,587.0
1205,2019/07/31,582.0,583.961,586.0,23200,587.0,582.0
1206,2019/08/01,583.0,581.109,582.0,16500,585.0,577.0
1207,2019/08/02,560.0,564.515,578.0,90500,578.0,557.0
1208,2019/08/05,546.0,548.892,555.0,51900,555.0,543.0
1209,2019/08/06,553.0,544.459,532.0,58400,553.0,532.0
1210,2019/08/07,552.0,553.349,554.0,23500,558.0,551.0
1211,2019/08/08,549.0,550.455,552.0,22400,553.0,546.0
1212,2019/08/09,546.0,548.428,554.0,22900,555.0,546.0
1213,2019/08/13,534.0,534.284,541.0,46100,541.0,530.0
1214,2019/08/14,545.0,541.728,540.0,16200,545.0,539.0
1215,2019/08/15,538.0,533.855,528.0,23500,538.0,528.0
1216,2019/08/16,539.0,540.234,535.0,17100,544.0,535.0
1217,2019/08/19,544.0,545.094,544.0,30800,552.0,538.0
1218,2019/08/20,564.0,559.712,553.0,29900,564.0,547.0
1219,2019/08/21,555.0,559.595,563.0,16300,565.0,554.0
1220,2019/08/22,554.0,559.017,557.0,24200,564.0,553.0
1221,2019/08/23,556.0,556.327,555.0,9800,560.0,553.0
