,Date,Close,VWAP,Open,Volume,High,Low
0,2014/08/25,519.0,496.619,439.0,321700,519.0,437.0
1,2014/08/26,619.0,616.401,619.0,935000,619.0,570.0
2,2014/08/27,639.0,660.688,609.0,2243200,719.0,600.0
3,2014/08/28,570.0,606.773,645.0,503200,650.0,570.0
4,2014/08/29,531.0,538.293,542.0,403900,560.0,526.0
5,2014/09/01,559.0,562.332,538.0,360700,611.0,530.0
6,2014/09/02,585.0,571.729,567.0,193400,588.0,556.0
7,2014/09/03,685.0,658.319,586.0,1789700,685.0,572.0
8,2014/09/04,638.0,655.643,664.0,622800,689.0,632.0
9,2014/09/05,638.0,706.55,678.0,1754700,738.0,630.0
10,2014/09/08,611.0,613.295,608.0,369500,647.0,600.0
11,2014/09/09,585.0,595.856,611.0,207400,617.0,582.0
12,2014/09/10,626.0,626.096,593.0,475200,669.0,592.0
13,2014/09/11,605.0,605.745,621.0,193300,622.0,590.0
14,2014/09/12,637.0,641.347,645.0,465300,667.0,625.0
15,2014/09/16,605.0,605.055,611.0,276300,621.0,595.0
16,2014/09/17,651.0,663.774,605.0,1208100,705.0,600.0
17,2014/09/18,652.0,690.944,690.0,948000,726.0,651.0
18,2014/09/19,641.0,648.584,641.0,237000,684.0,635.0
19,2014/09/22,675.0,663.022,670.0,260700,690.0,633.0
20,2014/09/24,713.0,705.313,665.0,745900,736.0,664.0
21,2014/09/25,768.0,763.399,719.0,1249500,813.0,710.0
22,2014/09/26,835.0,817.536,790.0,1191200,872.0,760.0
23,2014/09/29,788.0,816.815,850.0,571500,858.0,775.0
24,2014/09/30,702.0,716.488,760.0,732200,783.0,677.0
25,2014/10/01,652.0,674.78,704.0,510200,710.0,652.0
26,2014/10/02,622.0,647.117,644.0,424300,683.0,622.0
27,2014/10/03,659.0,642.77,645.0,288500,659.0,624.0
28,2014/10/06,660.0,667.258,663.0,199500,694.0,648.0
29,2014/10/07,612.0,632.107,650.0,297300,670.0,611.0
30,2014/10/08,606.0,595.894,599.0,185900,615.0,572.0
31,2014/10/09,575.0,596.263,606.0,225900,637.0,567.0
32,2014/10/10,550.0,540.726,535.0,286300,563.0,523.0
33,2014/10/14,517.0,525.606,542.0,176300,542.0,510.0
34,2014/10/15,547.0,547.294,547.0,166200,565.0,531.0
35,2014/10/16,506.0,511.656,511.0,156200,524.0,503.0
36,2014/10/17,500.0,506.907,515.0,92300,526.0,490.0
37,2014/10/20,537.0,533.033,520.0,79000,549.0,520.0
38,2014/10/21,560.0,579.232,530.0,486100,625.0,520.0
39,2014/10/22,563.0,573.245,560.0,168700,603.0,558.0
40,2014/10/23,570.0,556.253,554.0,120800,578.0,538.0
41,2014/10/24,545.0,557.78,567.0,102900,582.0,544.0
42,2014/10/27,521.0,531.268,535.0,90800,540.0,521.0
43,2014/10/28,524.0,516.162,512.0,73700,528.0,505.0
44,2014/10/29,522.0,522.396,521.0,57300,533.0,510.0
45,2014/10/30,506.0,512.957,512.0,75000,526.0,500.0
46,2014/10/31,517.0,505.135,513.0,82400,517.0,498.0
47,2014/11/04,494.0,487.174,500.0,153000,500.0,471.0
48,2014/11/05,528.0,511.117,488.0,86300,530.0,488.0
49,2014/11/06,531.0,537.417,528.0,106900,559.0,511.0
50,2014/11/07,631.0,631.0,631.0,108400,631.0,631.0
51,2014/11/10,610.0,620.659,611.0,616200,663.0,590.0
52,2014/11/11,600.0,609.992,605.0,222300,642.0,590.0
53,2014/11/12,566.0,576.814,603.0,185200,612.0,561.0
54,2014/11/13,577.0,573.93,563.0,173100,603.0,543.0
55,2014/11/14,546.0,548.883,569.0,155600,576.0,535.0
56,2014/11/17,533.0,539.672,550.0,61300,558.0,527.0
57,2014/11/18,567.0,556.212,549.0,134900,576.0,533.0
58,2014/11/19,626.0,651.461,647.0,1999700,667.0,617.0
59,2014/11/20,577.0,592.147,619.0,465500,626.0,576.0
60,2014/11/21,640.0,612.41,579.0,421200,641.0,570.0
61,2014/11/25,654.0,653.006,644.0,420400,678.0,615.0
62,2014/11/26,706.0,685.264,650.0,607400,709.0,644.0
63,2014/11/27,688.0,699.361,715.0,605300,736.0,672.0
64,2014/11/28,638.0,661.741,688.0,355900,698.0,632.0
65,2014/12/01,650.0,648.699,648.0,156100,660.0,632.0
66,2014/12/02,668.0,659.615,640.0,127900,670.0,640.0
67,2014/12/03,654.0,663.614,662.0,206200,685.0,641.0
68,2014/12/04,629.0,643.866,664.0,143400,664.0,629.0
69,2014/12/05,644.0,633.451,626.0,69700,645.0,617.0
70,2014/12/08,630.0,648.497,645.0,72500,662.0,630.0
71,2014/12/09,618.0,623.511,625.0,62200,639.0,615.0
72,2014/12/10,648.0,634.327,610.0,101900,650.0,607.0
73,2014/12/11,637.0,638.302,630.0,97900,650.0,624.0
74,2014/12/12,640.0,642.227,633.0,88500,656.0,633.0
75,2014/12/15,588.0,601.511,627.0,228800,629.0,580.0
76,2014/12/16,558.0,555.043,570.0,164800,570.0,545.0
77,2014/12/17,533.0,545.948,542.0,125300,568.0,533.0
78,2014/12/18,555.0,561.487,555.0,153100,585.0,544.0
79,2014/12/19,552.0,549.467,570.0,99800,570.0,540.0
80,2014/12/22,545.0,539.703,555.0,239500,560.0,528.0
81,2014/12/24,547.0,547.781,537.0,136500,559.0,536.0
82,2014/12/25,564.0,553.425,542.0,187000,574.0,542.0
83,2014/12/26,580.0,573.331,560.0,149400,584.0,558.0
84,2014/12/29,610.0,597.996,583.0,240400,615.0,582.0
85,2014/12/30,636.0,631.594,610.0,250100,645.0,610.0
86,2015/01/05,710.0,688.109,646.0,943700,736.0,621.0
87,2015/01/06,685.0,700.083,681.0,958400,778.0,655.0
88,2015/01/07,749.0,744.713,695.0,1712100,785.0,680.0
89,2015/01/08,746.0,755.129,771.0,779600,825.0,707.0
90,2015/01/09,727.0,713.821,751.0,610400,760.0,680.0
91,2015/01/13,825.0,824.318,790.0,2121800,876.0,767.0
92,2015/01/14,786.0,796.016,799.0,1089500,842.0,756.0
93,2015/01/15,725.0,748.767,777.0,554100,810.0,711.0
94,2015/01/16,704.0,712.256,712.0,545700,750.0,676.0
95,2015/01/19,722.0,723.864,704.0,725100,755.0,682.0
96,2015/01/20,710.0,724.914,732.0,291800,745.0,708.0
97,2015/01/21,696.0,699.804,705.0,152100,716.0,689.0
98,2015/01/22,703.0,690.094,692.0,183800,719.0,672.0
99,2015/01/23,697.0,695.625,704.0,177200,717.0,674.0
100,2015/01/26,700.0,708.689,687.0,167700,723.0,681.0
101,2015/01/27,690.0,696.023,700.0,51800,704.0,690.0
102,2015/01/28,698.0,710.407,700.0,125400,721.0,698.0
103,2015/01/29,688.0,694.878,690.0,130100,716.0,678.0
104,2015/01/30,680.0,682.826,690.0,105200,691.0,675.0
105,2015/02/02,780.0,767.09,759.0,1114500,780.0,735.0
106,2015/02/03,733.0,745.528,772.0,850800,795.0,713.0
107,2015/02/04,726.0,724.881,734.0,188500,741.0,707.0
108,2015/02/05,743.0,741.347,730.0,331700,759.0,718.0
109,2015/02/06,755.0,760.31,753.0,369600,781.0,745.0
110,2015/02/09,830.0,845.618,800.0,1548400,899.0,760.0
111,2015/02/10,954.0,902.419,845.0,1159300,972.0,807.0
112,2015/02/12,1090.0,1062.857,1010.0,2343900,1104.0,984.0
113,2015/02/13,970.0,1005.659,1100.0,1125100,1129.0,937.0
114,2015/02/16,1120.0,1103.964,1060.0,1464900,1120.0,1060.0
115,2015/02/17,1300.0,1178.57,1150.0,2746800,1300.0,1065.0
116,2015/02/18,1200.0,1263.574,1250.0,1517600,1342.0,1183.0
117,2015/02/19,1104.0,1095.37,1164.0,882400,1168.0,1040.0
118,2015/02/20,1081.0,1113.938,1082.0,566600,1165.0,1060.0
119,2015/02/23,1288.0,1220.096,1111.0,1226100,1350.0,1090.0
120,2015/02/24,1222.0,1281.537,1288.0,1173900,1350.0,1194.0
121,2015/02/25,1179.0,1199.841,1173.0,453200,1277.0,1141.0
122,2015/02/26,1169.0,1177.668,1160.0,260400,1234.0,1143.0
123,2015/02/27,1117.0,1106.594,1146.0,337800,1169.0,1063.0
124,2015/03/02,1118.0,1127.766,1094.0,242300,1175.0,1090.0
125,2015/03/03,1054.0,1055.728,1082.0,284800,1103.0,1028.0
126,2015/03/04,1103.0,1078.611,1054.0,212600,1115.0,1046.0
127,2015/03/05,1070.0,1103.242,1087.0,193100,1150.0,1067.0
128,2015/03/06,1015.0,1031.519,1050.0,273100,1072.0,1012.0
129,2015/03/09,1092.0,1078.221,1030.0,360100,1126.0,1020.0
130,2015/03/10,1020.0,1050.227,1080.0,422500,1124.0,990.0
131,2015/03/11,1013.0,1009.864,989.0,229000,1043.0,979.0
132,2015/03/12,1150.0,1128.14,1045.0,846200,1190.0,1040.0
133,2015/03/13,1103.0,1122.869,1174.0,445800,1188.0,1073.0
134,2015/03/16,1043.0,1047.327,1089.0,290700,1109.0,1021.0
135,2015/03/17,1063.0,1064.133,1061.0,179100,1095.0,1033.0
136,2015/03/18,1032.0,1042.452,1060.0,173200,1070.0,1025.0
137,2015/03/19,1018.0,1005.153,1020.0,230700,1025.0,995.0
138,2015/03/20,1014.0,1015.039,1005.0,85400,1039.0,998.0
139,2015/03/23,1043.0,1052.988,1030.0,199000,1087.0,1021.0
140,2015/03/24,1037.0,1033.414,1049.0,75600,1055.0,1022.0
141,2015/03/25,1021.0,1032.919,1057.0,118100,1061.0,1011.0
142,2015/03/26,1004.0,1004.749,1005.0,108600,1018.0,1000.0
143,2015/03/27,1006.0,1003.459,998.0,121900,1028.0,990.0
144,2015/03/30,1026.0,1009.619,1009.0,79200,1030.0,998.0
145,2015/03/31,1024.0,1021.2,1020.0,64600,1034.0,1010.0
146,2015/04/01,1005.0,1010.856,1038.0,90000,1038.0,999.0
147,2015/04/02,975.0,982.205,980.0,171000,1010.0,960.0
148,2015/04/03,1030.0,1035.701,1021.0,318700,1090.0,990.0
149,2015/04/06,1023.0,1013.653,1016.0,73800,1030.0,1000.0
150,2015/04/07,1029.0,1029.531,1022.0,151100,1056.0,1010.0
151,2015/04/08,1098.0,1068.583,1035.0,293500,1098.0,1030.0
152,2015/04/09,1040.0,1066.228,1101.0,298900,1115.0,1028.0
153,2015/04/10,1045.0,1039.632,1040.0,112700,1063.0,1017.0
154,2015/04/13,1087.0,1066.098,1040.0,232100,1103.0,1015.0
155,2015/04/14,1110.0,1103.755,1095.0,224500,1128.0,1075.0
156,2015/04/15,1072.0,1082.905,1100.0,117600,1119.0,1070.0
157,2015/04/16,1045.0,1053.239,1065.0,140200,1089.0,1027.0
158,2015/04/17,1124.0,1124.648,1091.0,736300,1169.0,1091.0
159,2015/04/20,1123.0,1116.9,1102.0,280300,1154.0,1067.0
160,2015/04/21,1078.0,1130.616,1144.0,384400,1180.0,1078.0
161,2015/04/22,1140.0,1126.195,1098.0,220900,1150.0,1088.0
162,2015/04/23,1105.0,1105.947,1129.0,121900,1133.0,1080.0
163,2015/04/24,1048.0,1049.524,1087.0,276600,1095.0,1022.0
164,2015/04/27,1141.0,1175.385,1140.0,1579600,1240.0,1105.0
165,2015/04/28,1123.0,1129.436,1113.0,265300,1177.0,1111.0
166,2015/04/30,1057.0,1071.254,1100.0,342900,1105.0,1030.0
167,2015/05/01,1009.0,1014.538,1046.0,415900,1056.0,989.0
168,2015/05/07,998.0,1006.8,1010.0,183300,1030.0,992.0
169,2015/05/08,1005.0,1007.64,1008.0,266300,1036.0,981.0
170,2015/05/11,995.0,991.075,1000.0,207000,1008.0,970.0
171,2015/05/12,992.0,990.976,990.0,169500,1006.0,975.0
172,2015/05/13,1014.0,1007.05,1005.0,87500,1015.0,998.0
173,2015/05/14,992.0,994.153,1014.0,158400,1014.0,985.0
174,2015/05/15,996.0,995.661,994.0,85600,1001.0,990.0
175,2015/05/18,991.0,999.461,995.0,127300,1021.0,987.0
176,2015/05/19,1000.0,998.756,992.0,88000,1007.0,991.0
177,2015/05/20,997.0,995.31,992.0,137300,1004.0,987.0
178,2015/05/21,1024.0,1023.72,994.0,269000,1043.0,994.0
179,2015/05/22,1013.0,1010.961,1016.0,78800,1030.0,1003.0
180,2015/05/25,1017.0,1009.134,1008.0,81500,1024.0,996.0
181,2015/05/26,1001.0,1001.866,1007.0,74500,1014.0,998.0
182,2015/05/27,1006.0,1002.332,998.0,76300,1010.0,997.0
183,2015/05/28,1002.0,1006.27,1015.0,71600,1018.0,1000.0
184,2015/05/29,1013.0,1009.962,1008.0,101800,1022.0,1000.0
185,2015/06/01,1005.0,1005.86,1013.0,65100,1013.0,1001.0
186,2015/06/02,1000.0,1001.375,1001.0,119000,1010.0,996.0
187,2015/06/03,995.0,991.621,1000.0,194800,1005.0,980.0
188,2015/06/04,1017.0,1006.216,991.0,120700,1020.0,989.0
189,2015/06/05,1004.0,1006.723,1019.0,79000,1019.0,1000.0
190,2015/06/08,996.0,1000.396,1000.0,57300,1011.0,996.0
191,2015/06/09,973.0,982.834,996.0,165200,998.0,960.0
192,2015/06/10,917.0,940.164,950.0,355300,965.0,917.0
193,2015/06/11,920.0,920.928,925.0,109000,930.0,913.0
194,2015/06/12,930.0,904.191,920.0,244500,930.0,887.0
195,2015/06/15,905.0,901.371,904.0,180300,917.0,890.0
196,2015/06/16,891.0,894.752,902.0,88300,910.0,884.0
197,2015/06/17,872.0,874.86,885.0,140600,894.0,865.0
198,2015/06/18,905.0,888.092,871.0,255700,915.0,870.0
199,2015/06/19,907.0,896.183,900.0,134100,912.0,883.0
200,2015/06/22,928.0,923.884,916.0,104900,940.0,906.0
201,2015/06/23,942.0,950.038,943.0,164500,973.0,935.0
202,2015/06/24,935.0,946.069,955.0,94300,959.0,933.0
203,2015/06/25,930.0,928.239,936.0,64100,942.0,921.0
204,2015/06/26,923.0,920.931,922.0,56600,935.0,910.0
205,2015/06/29,870.0,876.943,869.0,178600,892.0,865.0
206,2015/06/30,881.0,870.552,865.0,86100,885.0,860.0
207,2015/07/01,892.0,883.433,880.0,59600,895.0,875.0
208,2015/07/02,882.0,892.531,900.0,45200,906.0,877.0
209,2015/07/03,890.0,879.815,882.0,35200,890.0,870.0
210,2015/07/06,865.0,871.711,875.0,107200,889.0,855.0
211,2015/07/07,868.0,868.154,865.0,28500,875.0,863.0
212,2015/07/08,792.0,810.162,875.0,317800,876.0,771.0
213,2015/07/09,780.0,736.105,740.0,373100,789.0,688.0
214,2015/07/10,790.0,785.886,765.0,110500,816.0,756.0
215,2015/07/13,805.0,798.144,777.0,62000,810.0,777.0
216,2015/07/14,839.0,831.49,819.0,118700,847.0,816.0
217,2015/07/15,831.0,834.002,830.0,60600,858.0,821.0
218,2015/07/16,855.0,840.661,839.0,75700,860.0,824.0
219,2015/07/17,865.0,855.198,855.0,71600,865.0,846.0
220,2015/07/21,918.0,887.797,865.0,188200,919.0,859.0
221,2015/07/22,886.0,895.694,918.0,125100,918.0,882.0
222,2015/07/23,905.0,917.078,889.0,206400,943.0,880.0
223,2015/07/24,915.0,912.565,898.0,93500,933.0,898.0
224,2015/07/27,887.0,887.792,901.0,90400,913.0,873.0
225,2015/07/28,876.0,854.914,850.0,96800,887.0,838.0
226,2015/07/29,844.0,851.373,861.0,42100,868.0,841.0
227,2015/07/30,841.0,839.2,844.0,30500,850.0,831.0
228,2015/07/31,863.0,855.702,841.0,57400,875.0,836.0
229,2015/08/03,810.0,816.851,848.0,183000,848.0,802.0
230,2015/08/04,777.0,782.401,795.0,117900,798.0,773.0
231,2015/08/05,795.0,782.981,777.0,77500,798.0,773.0
232,2015/08/06,772.0,780.513,790.0,73500,792.0,772.0
233,2015/08/07,755.0,759.382,773.0,82800,777.0,741.0
234,2015/08/10,748.0,751.672,757.0,75300,760.0,739.0
235,2015/08/11,768.0,749.704,723.0,94200,771.0,723.0
236,2015/08/12,735.0,743.802,756.0,59600,769.0,726.0
237,2015/08/13,734.0,722.288,730.0,75000,737.0,706.0
238,2015/08/14,731.0,727.86,734.0,23600,736.0,719.0
239,2015/08/17,737.0,730.425,735.0,53200,739.0,721.0
240,2015/08/18,787.0,839.541,722.0,1318800,887.0,722.0
241,2015/08/19,747.0,763.768,802.0,293200,802.0,735.0
242,2015/08/20,757.0,765.933,758.0,156900,790.0,741.0
243,2015/08/21,717.0,725.182,730.0,208300,749.0,711.0
244,2015/08/24,605.0,643.029,667.0,340900,706.0,598.0
245,2015/08/25,573.0,595.808,575.0,265300,650.0,537.0
246,2015/08/26,670.0,637.335,601.0,251500,673.0,600.0
247,2015/08/27,650.0,666.569,670.0,373600,700.0,646.0
248,2015/08/28,677.0,675.401,672.0,122400,689.0,662.0
249,2015/08/31,674.0,670.559,673.0,91900,688.0,658.0
250,2015/09/01,712.0,706.165,673.0,267300,754.0,659.0
251,2015/09/02,682.0,688.589,677.0,164800,720.0,667.0
252,2015/09/03,675.0,688.714,689.0,97400,709.0,672.0
253,2015/09/04,683.0,699.998,678.0,442900,747.0,645.0
254,2015/09/07,654.0,659.13,673.0,137800,684.0,645.0
255,2015/09/08,677.0,687.16,653.0,324900,721.0,645.0
256,2015/09/09,709.0,708.718,705.0,196000,730.0,692.0
257,2015/09/10,755.0,728.911,684.0,365700,775.0,681.0
258,2015/09/11,862.0,824.139,780.0,644000,900.0,768.0
259,2015/09/14,816.0,843.564,900.0,708800,907.0,775.0
260,2015/09/15,780.0,787.735,809.0,236000,819.0,761.0
261,2015/09/16,736.0,748.572,785.0,246400,793.0,715.0
262,2015/09/17,737.0,738.506,731.0,171300,760.0,724.0
263,2015/09/18,750.0,742.735,737.0,143900,760.0,731.0
264,2015/09/24,698.0,711.262,721.0,130500,735.0,698.0
265,2015/09/25,701.0,687.321,688.0,97800,714.0,670.0
266,2015/09/28,739.0,726.766,708.0,98000,745.0,704.0
267,2015/09/29,700.0,706.182,721.0,85800,725.0,690.0
268,2015/09/30,718.0,714.089,708.0,62000,730.0,700.0
269,2015/10/01,730.0,732.265,730.0,62200,744.0,724.0
270,2015/10/02,787.0,775.804,730.0,429000,807.0,725.0
271,2015/10/05,788.0,795.954,817.0,226100,817.0,781.0
272,2015/10/06,815.0,810.188,793.0,222700,838.0,788.0
273,2015/10/07,853.0,856.849,830.0,489900,888.0,830.0
274,2015/10/08,822.0,825.808,838.0,150200,849.0,806.0
275,2015/10/09,873.0,859.002,828.0,248500,886.0,810.0
276,2015/10/13,861.0,887.816,888.0,372500,911.0,854.0
277,2015/10/14,860.0,841.428,845.0,137500,862.0,823.0
278,2015/10/15,877.0,864.8,850.0,210100,885.0,838.0
279,2015/10/16,871.0,868.591,868.0,160600,883.0,856.0
280,2015/10/19,829.0,842.62,871.0,158500,871.0,818.0
281,2015/10/20,816.0,817.912,820.0,79700,830.0,810.0
282,2015/10/21,852.0,845.191,828.0,190800,869.0,814.0
283,2015/10/22,834.0,840.738,841.0,99500,855.0,830.0
284,2015/10/23,853.0,843.491,839.0,97800,863.0,822.0
285,2015/10/26,872.0,873.318,860.0,179600,888.0,853.0
286,2015/10/27,855.0,858.776,865.0,112700,872.0,841.0
287,2015/10/28,832.0,843.367,845.0,143300,867.0,826.0
288,2015/10/29,831.0,829.706,830.0,84100,845.0,816.0
289,2015/10/30,804.0,800.08,816.0,196000,820.0,779.0
290,2015/11/02,843.0,833.698,789.0,187300,858.0,789.0
291,2015/11/04,815.0,823.962,838.0,115300,846.0,810.0
292,2015/11/05,820.0,822.479,820.0,205900,849.0,799.0
293,2015/11/06,843.0,831.652,815.0,151000,850.0,812.0
294,2015/11/09,929.0,894.854,853.0,689700,929.0,833.0
295,2015/11/10,934.0,929.385,899.0,439700,960.0,894.0
296,2015/11/11,941.0,949.881,964.0,344600,973.0,923.0
297,2015/11/12,895.0,906.109,926.0,203300,935.0,880.0
298,2015/11/13,1045.0,1001.994,910.0,1516600,1045.0,905.0
299,2015/11/16,1146.0,1107.972,1051.0,1771600,1169.0,1020.0
300,2015/11/17,1135.0,1139.935,1194.0,1052300,1195.0,1071.0
301,2015/11/18,1064.0,1142.711,1120.0,1368600,1260.0,1064.0
302,2015/11/19,1158.0,1105.32,1054.0,729900,1158.0,1047.0
303,2015/11/20,1316.0,1254.077,1160.0,2409700,1335.0,1109.0
304,2015/11/24,1525.0,1430.852,1301.0,2675600,1570.0,1284.0
305,2015/11/25,1490.0,1548.95,1550.0,2680300,1620.0,1450.0
306,2015/11/26,1562.0,1484.658,1460.0,1805200,1562.0,1393.0
307,2015/11/27,1498.0,1551.099,1565.0,1570900,1608.0,1484.0
308,2015/11/30,1540.0,1482.631,1468.0,1434900,1564.0,1400.0
309,2015/12/01,1560.0,1509.447,1515.0,767400,1560.0,1461.0
310,2015/12/02,1717.0,1685.977,1562.0,1432300,1745.0,1544.0
311,2015/12/03,1653.0,1679.508,1725.0,844500,1776.0,1605.0
312,2015/12/04,1495.0,1564.586,1620.0,686000,1680.0,1471.0
313,2015/12/07,1650.0,1584.988,1500.0,584100,1661.0,1495.0
314,2015/12/08,1599.0,1623.763,1650.0,421700,1685.0,1555.0
315,2015/12/09,1547.0,1567.681,1559.0,297200,1620.0,1524.0
316,2015/12/10,1555.0,1552.987,1516.0,354800,1614.0,1490.0
317,2015/12/11,1534.0,1572.953,1552.0,516800,1638.0,1511.0
318,2015/12/14,1563.0,1529.054,1494.0,330200,1566.0,1475.0
319,2015/12/15,1476.0,1556.048,1600.0,660800,1633.0,1423.0
320,2015/12/16,1369.0,1401.672,1530.0,660300,1569.0,1233.0
321,2015/12/17,1427.0,1376.611,1355.0,456200,1452.0,1271.0
322,2015/12/18,1448.0,1464.564,1432.0,355800,1502.0,1432.0
323,2015/12/21,1386.0,1390.313,1420.0,383800,1469.0,1321.0
324,2015/12/22,1490.0,1434.842,1344.0,414400,1495.0,1344.0
325,2015/12/24,1790.0,1698.356,1528.0,1813400,1790.0,1522.0
326,2015/12/25,1950.0,1840.107,1900.0,2444200,2010.0,1635.0
327,2015/12/28,2350.0,2281.721,2130.0,1602500,2350.0,2102.0
328,2015/12/29,2600.0,2560.827,2500.0,2781100,2685.0,2453.0
329,2015/12/30,2908.0,2688.843,2550.0,2661300,2980.0,2480.0
330,2016/01/04,2860.0,2877.96,2808.0,1675100,2995.0,2763.0
331,2016/01/05,2501.0,2599.07,2760.0,1403800,2820.0,2381.0
332,2016/01/06,2250.0,2363.827,2399.0,1082400,2578.0,2214.0
333,2016/01/07,2211.0,2258.133,2181.0,876500,2404.0,2145.0
334,2016/01/08,2500.0,2357.231,2182.0,1142400,2539.0,2105.0
335,2016/01/12,2310.0,2414.508,2500.0,1071500,2620.0,2150.0
336,2016/01/13,2190.0,2296.078,2483.0,418500,2485.0,2181.0
337,2016/01/14,2100.0,2060.031,2102.0,580300,2157.0,1968.0
338,2016/01/15,1850.0,1973.856,2101.0,541500,2185.0,1800.0
339,2016/01/18,1808.0,1729.709,1650.0,733000,1854.0,1582.0
340,2016/01/19,2208.0,1980.535,1768.0,1292700,2208.0,1692.0
341,2016/01/20,1708.0,1991.503,2173.0,1539000,2285.0,1708.0
342,2016/01/21,1639.0,1748.313,1778.0,1656700,1950.0,1588.0
343,2016/01/22,1723.0,1764.787,1839.0,796900,1884.0,1658.0
344,2016/01/25,1980.0,1933.33,1787.0,1291700,2070.0,1733.0
345,2016/01/26,1864.0,1904.705,1899.0,850000,1987.0,1818.0
346,2016/01/27,1887.0,1889.838,1951.0,598300,1993.0,1780.0
347,2016/01/28,1873.0,1868.728,1840.0,413900,1932.0,1801.0
348,2016/01/29,1756.0,1733.564,1865.0,554500,1870.0,1660.0
349,2016/02/01,1710.0,1742.837,1750.0,434700,1820.0,1700.0
350,2016/02/02,1815.0,1837.171,1780.0,700900,1915.0,1758.0
351,2016/02/03,1763.0,1730.586,1750.0,315700,1798.0,1690.0
352,2016/02/04,1551.0,1629.459,1750.0,445100,1790.0,1501.0
353,2016/02/05,1773.0,1643.364,1549.0,861500,1951.0,1413.0
354,2016/02/08,1686.0,1685.082,1653.0,1060500,1794.0,1575.0
355,2016/02/09,1502.0,1538.359,1585.0,559200,1624.0,1480.0
356,2016/02/10,1563.0,1538.399,1582.0,855900,1648.0,1430.0
357,2016/02/12,1358.0,1416.267,1400.0,585100,1500.0,1358.0
358,2016/02/15,1658.0,1658.0,1658.0,44700,1658.0,1658.0
359,2016/02/16,1990.0,1985.674,1978.0,2826000,2058.0,1869.0
360,2016/02/17,2270.0,2039.374,1958.0,2684400,2270.0,1807.0
361,2016/02/18,2435.0,2378.885,2283.0,3140900,2538.0,2180.0
362,2016/02/19,2299.0,2331.444,2310.0,2053800,2479.0,2241.0
363,2016/02/22,2253.0,2270.125,2210.0,1273200,2348.0,2167.0
364,2016/02/23,2019.0,2071.12,2263.0,1539100,2270.0,1980.0
365,2016/02/24,2000.0,2059.323,1976.0,1585300,2198.0,1972.0
366,2016/02/25,1910.0,1927.892,1987.0,950700,2033.0,1882.0
367,2016/02/26,1950.0,2046.434,1950.0,2804200,2208.0,1857.0
368,2016/02/29,2134.0,2097.657,2050.0,1633100,2175.0,2001.0
369,2016/03/01,2397.0,2294.265,2230.0,3883900,2420.0,2142.0
370,2016/03/02,2370.0,2439.69,2397.0,3217300,2520.0,2327.0
371,2016/03/03,2289.0,2345.599,2340.0,1560200,2479.0,2234.0
372,2016/03/04,2205.0,2208.213,2200.0,752100,2253.0,2175.0
373,2016/03/07,2194.0,2279.625,2344.0,765800,2346.0,2191.0
374,2016/03/08,2088.0,2095.342,2145.0,734400,2165.0,2025.0
375,2016/03/09,2230.0,2166.348,2070.0,1004500,2237.0,2046.0
376,2016/03/10,2203.0,2228.494,2230.0,648200,2285.0,2180.0
377,2016/03/11,2137.0,2163.724,2150.0,416900,2209.0,2118.0
378,2016/03/14,2142.0,2158.525,2187.0,336900,2216.0,2130.0
379,2016/03/15,2178.0,2152.692,2107.0,720700,2215.0,2085.0
380,2016/03/16,2113.0,2142.019,2168.0,367600,2190.0,2112.0
381,2016/03/17,2162.0,2197.06,2125.0,1058600,2285.0,2115.0
382,2016/03/18,2046.0,2074.302,2121.0,517200,2140.0,2030.0
383,2016/03/22,2009.0,2005.527,1990.0,347400,2039.0,1987.0
384,2016/03/23,2008.0,2056.668,2090.0,367600,2120.0,2006.0
385,2016/03/24,2076.0,2064.094,2020.0,367000,2115.0,2008.0
386,2016/03/25,2020.0,2036.918,2041.0,274400,2082.0,2015.0
387,2016/03/28,1998.0,1986.049,2011.0,365300,2023.0,1948.0
388,2016/03/29,2070.0,2051.947,1991.0,332800,2089.0,1988.0
389,2016/03/30,2042.0,2073.17,2100.0,198200,2106.0,2027.0
390,2016/03/31,2025.0,2029.601,2000.0,207800,2072.0,1999.0
391,2016/04/01,1915.0,1932.417,1985.0,433500,1998.0,1895.0
392,2016/04/04,1865.0,1883.111,1864.0,231500,1928.0,1848.0
393,2016/04/05,1675.0,1708.921,1839.0,599400,1856.0,1630.0
394,2016/04/06,1682.0,1681.843,1681.0,279300,1716.0,1649.0
395,2016/04/07,1705.0,1722.373,1704.0,276600,1765.0,1671.0
396,2016/04/08,1726.0,1688.414,1632.0,244900,1750.0,1622.0
397,2016/04/11,1917.0,1855.178,1775.0,896300,1930.0,1772.0
398,2016/04/12,1814.0,1842.748,1879.0,397600,1885.0,1793.0
399,2016/04/13,1814.0,1808.987,1802.0,143600,1829.0,1780.0
400,2016/04/14,1806.0,1821.664,1843.0,168600,1860.0,1802.0
401,2016/04/15,1841.0,1831.495,1787.0,225200,1885.0,1774.0
402,2016/04/18,1720.0,1754.427,1801.0,257400,1805.0,1720.0
403,2016/04/19,1794.0,1776.79,1745.0,226100,1820.0,1745.0
404,2016/04/20,1918.0,1915.038,1846.0,597600,1984.0,1805.0
405,2016/04/21,1940.0,1979.219,2000.0,443200,2021.0,1918.0
406,2016/04/22,1994.0,1952.0,1940.0,421800,2023.0,1855.0
407,2016/04/25,2090.0,2174.137,2156.0,1378700,2270.0,2075.0
408,2016/04/26,1859.0,1913.977,2018.0,775200,2018.0,1802.0
409,2016/04/27,1880.0,1870.846,1879.0,253200,1927.0,1810.0
410,2016/04/28,1823.0,1846.716,1880.0,193400,1900.0,1800.0
411,2016/05/02,2042.0,2058.127,2070.0,1183400,2121.0,1975.0
412,2016/05/06,2080.0,2060.443,2089.0,523100,2115.0,2000.0
413,2016/05/09,2110.0,2092.004,2080.0,352200,2160.0,2033.0
414,2016/05/10,2035.0,2059.115,2100.0,232200,2130.0,2005.0
415,2016/05/11,2078.0,2081.675,2030.0,306900,2135.0,2009.0
416,2016/05/12,2167.0,2294.025,2057.0,2966000,2500.0,2046.0
417,2016/05/13,2230.0,2239.414,2137.0,978200,2315.0,2116.0
418,2016/05/16,2287.0,2385.236,2279.0,2544100,2510.0,2229.0
419,2016/05/17,2388.0,2351.364,2286.0,695000,2430.0,2272.0
420,2016/05/18,2206.0,2269.921,2438.0,1025900,2448.0,2100.0
421,2016/05/19,2280.0,2247.43,2275.0,452400,2320.0,2158.0
422,2016/05/20,2460.0,2404.606,2302.0,970400,2464.0,2286.0
423,2016/05/23,2410.0,2382.333,2390.0,482900,2444.0,2305.0
424,2016/05/24,2415.0,2403.488,2420.0,332200,2450.0,2353.0
425,2016/05/25,2525.0,2487.893,2430.0,860900,2548.0,2391.0
426,2016/05/26,2421.0,2474.6,2530.0,768800,2549.0,2360.0
427,2016/05/27,2298.0,2335.322,2380.0,665800,2440.0,2240.0
428,2016/05/30,2303.0,2289.891,2241.0,356700,2369.0,2229.0
429,2016/05/31,2276.0,2274.189,2300.0,228800,2322.0,2252.0
430,2016/06/01,2253.0,2283.145,2250.0,391200,2350.0,2212.0
431,2016/06/02,2154.0,2189.894,2270.0,258200,2270.0,2120.0
432,2016/06/03,2092.0,2107.566,2154.0,295500,2189.0,2058.0
433,2016/06/06,2081.0,2044.918,2002.0,241800,2125.0,1992.0
434,2016/06/07,2072.0,2072.926,2078.0,173100,2114.0,2050.0
435,2016/06/08,2212.0,2156.007,2078.0,477700,2279.0,2020.0
436,2016/06/09,2118.0,2158.073,2135.0,455200,2240.0,2095.0
437,2016/06/10,2111.0,2136.113,2120.0,153300,2175.0,2105.0
438,2016/06/13,1938.0,1975.077,2013.0,326800,2047.0,1933.0
439,2016/06/14,1713.0,1795.88,1898.0,546300,1962.0,1712.0
440,2016/06/15,1767.0,1747.599,1715.0,367100,1825.0,1685.0
441,2016/06/16,1620.0,1636.2,1730.0,385200,1760.0,1555.0
442,2016/06/17,1700.0,1691.651,1712.0,321600,1785.0,1625.0
443,2016/06/20,1730.0,1752.949,1721.0,292000,1798.0,1675.0
444,2016/06/21,1755.0,1752.642,1700.0,127500,1794.0,1700.0
445,2016/06/22,1757.0,1771.32,1795.0,246700,1833.0,1711.0
446,2016/06/23,1899.0,1927.527,1711.0,1859400,2140.0,1680.0
447,2016/06/24,1566.0,1692.212,1918.0,1308500,1983.0,1499.0
448,2016/06/27,1640.0,1642.888,1606.0,683700,1720.0,1600.0
449,2016/06/28,1671.0,1643.837,1602.0,415400,1710.0,1571.0
450,2016/06/29,1720.0,1715.355,1712.0,314500,1752.0,1681.0
451,2016/06/30,1732.0,1776.198,1790.0,352400,1827.0,1721.0
452,2016/07/01,1793.0,1795.941,1768.0,329600,1838.0,1755.0
453,2016/07/04,1841.0,1822.885,1785.0,191400,1849.0,1770.0
454,2016/07/05,1896.0,1891.461,1841.0,581500,1957.0,1795.0
455,2016/07/06,1801.0,1804.911,1804.0,293500,1861.0,1766.0
456,2016/07/07,1716.0,1782.041,1814.0,246500,1840.0,1716.0
457,2016/07/08,1690.0,1689.726,1716.0,171300,1750.0,1642.0
458,2016/07/11,1760.0,1761.044,1770.0,125200,1795.0,1728.0
459,2016/07/12,1805.0,1800.839,1795.0,173700,1830.0,1770.0
460,2016/07/13,1787.0,1795.614,1821.0,208000,1837.0,1753.0
461,2016/07/14,1747.0,1750.141,1788.0,202900,1799.0,1709.0
462,2016/07/15,1709.0,1702.317,1711.0,218200,1735.0,1683.0
463,2016/07/19,1714.0,1681.753,1669.0,173000,1715.0,1650.0
464,2016/07/20,1693.0,1701.933,1739.0,124700,1746.0,1673.0
465,2016/07/21,1682.0,1696.895,1706.0,170600,1730.0,1677.0
466,2016/07/22,1679.0,1663.655,1658.0,116000,1693.0,1643.0
467,2016/07/25,1714.0,1740.862,1669.0,292800,1818.0,1661.0
468,2016/07/26,1703.0,1699.019,1706.0,110500,1727.0,1676.0
469,2016/07/27,1697.0,1703.092,1715.0,108800,1720.0,1688.0
470,2016/07/28,1657.0,1686.237,1681.0,128000,1714.0,1657.0
471,2016/07/29,1731.0,1667.148,1650.0,209500,1761.0,1590.0
472,2016/08/01,1824.0,1873.816,1850.0,824100,1940.0,1820.0
473,2016/08/02,1979.0,1912.143,1784.0,747800,1985.0,1780.0
474,2016/08/03,1945.0,1985.521,1940.0,679700,2030.0,1915.0
475,2016/08/04,1901.0,1935.667,1991.0,259900,2010.0,1891.0
476,2016/08/05,1782.0,1843.102,1916.0,307000,1938.0,1782.0
477,2016/08/08,1754.0,1782.603,1802.0,150900,1822.0,1754.0
478,2016/08/09,1850.0,1810.466,1770.0,130600,1850.0,1744.0
479,2016/08/10,1870.0,1862.459,1839.0,133200,1900.0,1800.0
480,2016/08/12,1904.0,1874.917,1852.0,135400,1904.0,1834.0
481,2016/08/15,1960.0,1941.738,1900.0,200900,1970.0,1890.0
482,2016/08/16,1908.0,1938.241,1940.0,196000,1977.0,1888.0
483,2016/08/17,1885.0,1913.527,1908.0,159700,1960.0,1878.0
484,2016/08/18,1918.0,1916.254,1900.0,127400,1945.0,1886.0
485,2016/08/19,2095.0,2022.871,1945.0,604000,2111.0,1926.0
486,2016/08/22,2129.0,2167.098,2129.0,943200,2222.0,2085.0
487,2016/08/23,2119.0,2144.081,2120.0,423000,2208.0,2074.0
488,2016/08/24,2227.0,2176.944,2118.0,338800,2228.0,2110.0
489,2016/08/25,2180.0,2212.487,2229.0,397000,2258.0,2175.0
490,2016/08/26,2012.0,2039.462,2150.0,593300,2152.0,1970.0
491,2016/08/29,2180.0,2129.044,2070.0,468000,2194.0,2051.0
492,2016/08/30,2190.0,2173.022,2156.0,326800,2220.0,2111.0
493,2016/08/31,2064.0,2108.581,2181.0,392400,2210.0,2044.0
494,2016/09/01,2050.0,2053.659,2090.0,211100,2091.0,2023.0
495,2016/09/02,2026.0,1982.082,2020.0,406800,2030.0,1923.0
496,2016/09/05,2029.0,2012.13,2024.0,189900,2047.0,1981.0
497,2016/09/06,2090.0,2080.977,2020.0,196500,2103.0,2015.0
498,2016/09/07,2111.0,2112.034,2052.0,219600,2147.0,2051.0
499,2016/09/08,2030.0,2060.536,2090.0,161700,2128.0,2021.0
500,2016/09/09,2040.0,2005.498,1994.0,167900,2046.0,1975.0
501,2016/09/12,1940.0,1963.094,1986.0,190000,2020.0,1932.0
502,2016/09/13,1947.0,1967.261,1989.0,122300,2010.0,1932.0
503,2016/09/14,1851.0,1884.008,1924.0,193400,1930.0,1844.0
504,2016/09/15,1839.0,1831.456,1811.0,147500,1864.0,1808.0
505,2016/09/16,1850.0,1853.609,1851.0,100200,1878.0,1834.0
506,2016/09/20,1872.0,1876.988,1831.0,131400,1903.0,1830.0
507,2016/09/21,1878.0,1868.206,1872.0,97200,1893.0,1840.0
508,2016/09/23,1940.0,1936.719,1899.0,130300,1970.0,1896.0
509,2016/09/26,1911.0,1947.739,1977.0,100200,1980.0,1910.0
510,2016/09/27,1904.0,1889.369,1885.0,89100,1919.0,1858.0
511,2016/09/28,1927.0,1928.153,1894.0,56700,1951.0,1894.0
512,2016/09/29,1916.0,1914.436,1940.0,115500,1949.0,1895.0
513,2016/09/30,1881.0,1894.588,1895.0,95100,1927.0,1871.0
514,2016/10/03,2040.0,2006.359,2000.0,386800,2040.0,1946.0
515,2016/10/04,2164.0,2149.148,2050.0,886600,2240.0,2007.0
516,2016/10/05,2120.0,2115.241,2195.0,314800,2195.0,2071.0
517,2016/10/06,2083.0,2096.19,2102.0,150900,2128.0,2073.0
518,2016/10/07,2072.0,2044.864,2056.0,143400,2080.0,2016.0
519,2016/10/11,2053.0,2073.285,2099.0,86000,2110.0,2045.0
520,2016/10/12,2049.0,2057.156,2032.0,114000,2114.0,2029.0
521,2016/10/13,2070.0,2083.843,2070.0,148800,2123.0,2051.0
522,2016/10/14,2148.0,2129.613,2080.0,330900,2177.0,2075.0
523,2016/10/17,2159.0,2172.183,2180.0,222400,2196.0,2142.0
524,2016/10/18,2220.0,2198.534,2170.0,330100,2228.0,2133.0
525,2016/10/19,2180.0,2204.531,2200.0,261200,2233.0,2175.0
526,2016/10/20,2113.0,2150.883,2195.0,197700,2210.0,2110.0
527,2016/10/21,2209.0,2169.824,2103.0,222100,2220.0,2103.0
528,2016/10/24,2125.0,2163.281,2238.0,253500,2244.0,2110.0
529,2016/10/25,2103.0,2092.306,2125.0,202000,2140.0,2056.0
530,2016/10/26,2495.0,2400.003,2103.0,3332300,2575.0,2093.0
531,2016/10/27,2405.0,2379.012,2362.0,1615700,2474.0,2251.0
532,2016/10/28,2561.0,2536.902,2455.0,1954600,2619.0,2410.0
533,2016/10/31,2646.0,2670.862,2620.0,1831900,2769.0,2571.0
534,2016/11/01,2595.0,2633.444,2642.0,814100,2716.0,2535.0
535,2016/11/02,2572.0,2512.879,2541.0,816200,2630.0,2400.0
536,2016/11/04,2570.0,2604.857,2600.0,668000,2676.0,2530.0
537,2016/11/07,2923.0,2814.106,2645.0,1472600,2940.0,2600.0
538,2016/11/08,2921.0,2912.683,2930.0,1499600,2989.0,2836.0
539,2016/11/09,2860.0,2857.101,3005.0,2300600,3095.0,2635.0
540,2016/11/10,3360.0,3189.711,3070.0,2052700,3360.0,3005.0
541,2016/11/11,2850.0,3056.11,3325.0,5356200,3555.0,2712.0
542,2016/11/14,2852.0,2951.186,2940.0,2135100,3100.0,2810.0
543,2016/11/15,2558.0,2576.011,2600.0,6330000,2829.0,2352.0
544,2016/11/16,2384.0,2457.843,2445.0,1676900,2575.0,2382.0
545,2016/11/17,2405.0,2432.795,2384.0,1262100,2499.0,2377.0
546,2016/11/18,2317.0,2343.684,2433.0,807600,2447.0,2275.0
547,2016/11/21,2330.0,2308.458,2319.0,650700,2378.0,2230.0
548,2016/11/22,2411.0,2369.633,2310.0,468100,2419.0,2284.0
549,2016/11/24,2363.0,2421.848,2436.0,496600,2476.0,2362.0
550,2016/11/25,2411.0,2413.544,2351.0,787200,2496.0,2325.0
551,2016/11/28,2402.0,2411.427,2390.0,468100,2450.0,2361.0
552,2016/11/29,2340.0,2359.991,2415.0,401100,2415.0,2332.0
553,2016/11/30,2406.0,2418.365,2380.0,706700,2480.0,2335.0
554,2016/12/01,2374.0,2416.247,2456.0,355300,2458.0,2367.0
555,2016/12/02,2354.0,2359.045,2352.0,234700,2384.0,2345.0
556,2016/12/05,2350.0,2360.908,2356.0,261100,2400.0,2330.0
557,2016/12/06,2330.0,2354.905,2354.0,219800,2377.0,2330.0
558,2016/12/07,2336.0,2351.563,2339.0,198700,2394.0,2321.0
559,2016/12/08,2344.0,2327.391,2359.0,156700,2359.0,2300.0
560,2016/12/09,1844.0,1844.0,1844.0,66200,1844.0,1844.0
561,2016/12/12,1876.0,1834.521,1804.0,1608500,1935.0,1757.0
562,2016/12/13,2010.0,1967.923,1854.0,917800,2030.0,1852.0
563,2016/12/14,1991.0,2016.9,2020.0,403500,2078.0,1982.0
564,2016/12/15,1893.0,1905.49,1987.0,322800,1995.0,1861.0
565,2016/12/16,1812.0,1827.671,1891.0,410000,1909.0,1800.0
566,2016/12/19,1739.0,1726.656,1772.0,483400,1781.0,1700.0
567,2016/12/20,1778.0,1780.465,1764.0,371000,1820.0,1741.0
568,2016/12/21,1747.0,1780.524,1780.0,205600,1831.0,1745.0
569,2016/12/22,1724.0,1729.373,1721.0,142200,1786.0,1721.0
570,2016/12/26,1722.0,1721.814,1711.0,123400,1745.0,1704.0
571,2016/12/27,1717.0,1718.838,1722.0,177100,1732.0,1714.0
572,2016/12/28,1805.0,1798.068,1739.0,232400,1898.0,1739.0
573,2016/12/29,1735.0,1746.929,1765.0,159600,1787.0,1726.0
574,2016/12/30,1756.0,1756.533,1724.0,106800,1785.0,1724.0
575,2017/01/04,1768.0,1789.031,1796.0,166300,1808.0,1767.0
576,2017/01/05,1835.0,1807.178,1771.0,192500,1836.0,1771.0
577,2017/01/06,1807.0,1824.002,1818.0,260800,1852.0,1788.0
578,2017/01/10,1785.0,1799.414,1813.0,135300,1832.0,1781.0
579,2017/01/11,1781.0,1791.766,1800.0,117300,1814.0,1781.0
580,2017/01/12,1738.0,1752.729,1788.0,148700,1791.0,1733.0
581,2017/01/13,1759.0,1748.094,1730.0,101700,1770.0,1726.0
582,2017/01/16,1719.0,1728.215,1762.0,164800,1764.0,1716.0
583,2017/01/17,1700.0,1713.304,1719.0,122700,1743.0,1700.0
584,2017/01/18,1678.0,1678.376,1691.0,150300,1717.0,1656.0
585,2017/01/19,1680.0,1679.852,1686.0,105700,1703.0,1670.0
586,2017/01/20,1665.0,1654.559,1689.0,107200,1689.0,1641.0
587,2017/01/23,1643.0,1642.29,1660.0,60000,1660.0,1634.0
588,2017/01/24,1653.0,1650.672,1640.0,43900,1666.0,1636.0
589,2017/01/25,1692.0,1679.465,1652.0,116300,1710.0,1637.0
590,2017/01/26,1709.0,1699.201,1698.0,75100,1717.0,1675.0
591,2017/01/27,1736.0,1722.05,1712.0,153700,1743.0,1680.0
592,2017/01/30,1723.0,1744.224,1728.0,126100,1770.0,1721.0
593,2017/01/31,1670.0,1689.301,1702.0,99400,1715.0,1670.0
594,2017/02/01,1679.0,1680.025,1685.0,64200,1699.0,1667.0
595,2017/02/02,1661.0,1677.876,1671.0,63900,1715.0,1660.0
596,2017/02/03,1691.0,1679.557,1689.0,122100,1709.0,1648.0
597,2017/02/06,1686.0,1686.956,1704.0,77900,1719.0,1665.0
598,2017/02/07,1671.0,1671.528,1700.0,84600,1700.0,1660.0
599,2017/02/08,1712.0,1694.594,1675.0,86400,1713.0,1667.0
600,2017/02/09,1685.0,1691.275,1704.0,48700,1712.0,1678.0
601,2017/02/10,1765.0,1731.577,1701.0,218600,1765.0,1670.0
602,2017/02/13,1640.0,1645.048,1645.0,401800,1677.0,1635.0
603,2017/02/14,1657.0,1649.387,1635.0,140600,1674.0,1634.0
604,2017/02/15,1674.0,1669.72,1657.0,74400,1686.0,1652.0
605,2017/02/16,1665.0,1680.097,1674.0,114900,1709.0,1660.0
606,2017/02/17,1680.0,1680.904,1668.0,62200,1697.0,1665.0
607,2017/02/20,1676.0,1671.196,1667.0,45900,1682.0,1658.0
608,2017/02/21,1646.0,1652.491,1666.0,133200,1676.0,1636.0
609,2017/02/22,1685.0,1687.956,1646.0,194900,1716.0,1646.0
610,2017/02/23,1656.0,1663.262,1670.0,80100,1681.0,1654.0
611,2017/02/24,1655.0,1658.424,1656.0,45800,1670.0,1648.0
612,2017/02/27,1672.0,1665.895,1653.0,43900,1677.0,1653.0
613,2017/02/28,1647.0,1657.094,1670.0,89700,1688.0,1646.0
614,2017/03/01,1629.0,1638.887,1647.0,148600,1656.0,1627.0
615,2017/03/02,1638.0,1627.271,1629.0,107500,1647.0,1616.0
616,2017/03/03,1614.0,1622.777,1626.0,64500,1639.0,1614.0
617,2017/03/06,1612.0,1606.081,1614.0,85300,1626.0,1597.0
618,2017/03/07,1596.0,1606.155,1609.0,62600,1625.0,1596.0
619,2017/03/08,1605.0,1619.601,1596.0,72700,1644.0,1596.0
620,2017/03/09,1600.0,1607.426,1620.0,50900,1620.0,1597.0
621,2017/03/10,1598.0,1598.833,1598.0,54400,1610.0,1593.0
622,2017/03/13,1552.0,1574.872,1592.0,81100,1600.0,1552.0
623,2017/03/14,1611.0,1590.245,1552.0,93600,1630.0,1552.0
624,2017/03/15,1545.0,1565.335,1584.0,81400,1600.0,1545.0
625,2017/03/16,1534.0,1528.4,1516.0,88800,1568.0,1510.0
626,2017/03/17,1508.0,1514.568,1530.0,47200,1535.0,1508.0
627,2017/03/21,1529.0,1502.796,1494.0,80300,1530.0,1480.0
628,2017/03/22,1491.0,1498.047,1512.0,29700,1512.0,1491.0
629,2017/03/23,1478.0,1485.804,1488.0,58600,1505.0,1476.0
630,2017/03/24,1473.0,1467.757,1478.0,57300,1480.0,1460.0
631,2017/03/27,1391.0,1412.915,1444.0,125900,1455.0,1391.0
632,2017/03/28,1403.0,1405.533,1380.0,69000,1433.0,1380.0
633,2017/03/29,1467.0,1453.258,1398.0,64400,1473.0,1398.0
634,2017/03/30,1440.0,1454.888,1460.0,34900,1469.0,1440.0
635,2017/03/31,1405.0,1433.704,1443.0,46600,1455.0,1405.0
636,2017/04/03,1376.0,1386.747,1398.0,53400,1408.0,1374.0
637,2017/04/04,1302.0,1328.126,1362.0,97400,1373.0,1300.0
638,2017/04/05,1294.0,1282.325,1300.0,126100,1332.0,1251.0
639,2017/04/06,1266.0,1275.393,1294.0,144200,1305.0,1250.0
640,2017/04/07,1282.0,1281.176,1272.0,219300,1333.0,1218.0
641,2017/04/10,1263.0,1267.854,1271.0,71400,1296.0,1250.0
642,2017/04/11,1219.0,1232.792,1251.0,79000,1266.0,1215.0
643,2017/04/12,1150.0,1166.151,1188.0,162600,1194.0,1126.0
644,2017/04/13,1230.0,1190.267,1070.0,276000,1290.0,1070.0
645,2017/04/14,1305.0,1330.242,1218.0,694300,1452.0,1211.0
646,2017/04/17,1262.0,1283.326,1279.0,138900,1335.0,1256.0
647,2017/04/18,1323.0,1332.465,1269.0,310900,1380.0,1269.0
648,2017/04/19,1280.0,1306.244,1293.0,145400,1350.0,1280.0
649,2017/04/20,1268.0,1264.662,1273.0,133300,1294.0,1242.0
650,2017/04/21,1251.0,1253.167,1293.0,128400,1293.0,1229.0
651,2017/04/24,1233.0,1241.96,1252.0,55500,1264.0,1231.0
652,2017/04/25,1242.0,1239.881,1223.0,46100,1251.0,1220.0
653,2017/04/26,1317.0,1295.667,1265.0,166400,1318.0,1253.0
654,2017/04/27,1318.0,1309.532,1294.0,95900,1328.0,1293.0
655,2017/04/28,1260.0,1292.422,1319.0,205200,1337.0,1260.0
656,2017/05/01,1424.0,1381.296,1299.0,468600,1427.0,1290.0
657,2017/05/02,1404.0,1398.507,1418.0,173700,1420.0,1375.0
658,2017/05/08,1426.0,1449.741,1464.0,196400,1490.0,1420.0
659,2017/05/09,1415.0,1432.52,1420.0,135900,1480.0,1402.0
660,2017/05/10,1395.0,1401.844,1405.0,112700,1423.0,1391.0
661,2017/05/11,1373.0,1388.432,1387.0,106400,1420.0,1363.0
662,2017/05/12,1330.0,1346.404,1356.0,138500,1372.0,1330.0
663,2017/05/15,1330.0,1322.498,1310.0,76100,1338.0,1306.0
664,2017/05/16,1334.0,1331.863,1345.0,69500,1352.0,1319.0
665,2017/05/17,1300.0,1310.425,1325.0,99100,1330.0,1292.0
666,2017/05/18,1308.0,1304.663,1263.0,123900,1335.0,1263.0
667,2017/05/19,1331.0,1329.973,1316.0,47200,1343.0,1316.0
668,2017/05/22,1343.0,1338.425,1343.0,50300,1348.0,1323.0
669,2017/05/23,1321.0,1331.792,1349.0,73400,1352.0,1315.0
670,2017/05/24,1371.0,1353.366,1326.0,93100,1376.0,1323.0
671,2017/05/25,1385.0,1378.806,1375.0,91300,1399.0,1358.0
672,2017/05/26,1395.0,1399.799,1388.0,105800,1422.0,1373.0
673,2017/05/29,1390.0,1397.4,1385.0,76800,1419.0,1369.0
674,2017/05/30,1398.0,1406.764,1390.0,94700,1435.0,1384.0
675,2017/05/31,1391.0,1389.202,1396.0,54000,1403.0,1377.0
676,2017/06/01,1455.0,1432.826,1393.0,191800,1455.0,1391.0
677,2017/06/02,1426.0,1459.14,1469.0,188200,1498.0,1414.0
678,2017/06/05,1498.0,1487.93,1431.0,262300,1530.0,1431.0
679,2017/06/06,1448.0,1469.033,1498.0,124800,1510.0,1448.0
680,2017/06/07,1463.0,1459.217,1447.0,79800,1475.0,1433.0
681,2017/06/08,1436.0,1445.741,1464.0,91000,1476.0,1415.0
682,2017/06/09,1567.0,1522.391,1438.0,441700,1577.0,1436.0
683,2017/06/12,1513.0,1582.601,1607.0,777600,1669.0,1501.0
684,2017/06/13,1511.0,1488.655,1481.0,202700,1536.0,1451.0
685,2017/06/14,1437.0,1467.034,1526.0,231000,1529.0,1437.0
686,2017/06/15,1422.0,1428.253,1435.0,102800,1449.0,1419.0
687,2017/06/16,1420.0,1415.228,1431.0,83000,1443.0,1404.0
688,2017/06/19,1458.0,1441.611,1424.0,81700,1460.0,1418.0
689,2017/06/20,1445.0,1450.516,1465.0,76800,1473.0,1434.0
690,2017/06/21,1458.0,1446.069,1435.0,86900,1460.0,1431.0
691,2017/06/22,1488.0,1491.188,1461.0,148300,1514.0,1450.0
692,2017/06/23,1450.0,1471.983,1501.0,121000,1508.0,1446.0
693,2017/06/26,1485.0,1496.121,1458.0,143800,1524.0,1455.0
694,2017/06/27,1500.0,1496.626,1491.0,62800,1514.0,1482.0
695,2017/06/28,1476.0,1475.971,1500.0,83100,1500.0,1464.0
696,2017/06/29,1477.0,1489.964,1485.0,80600,1504.0,1477.0
697,2017/06/30,1435.0,1448.913,1450.0,116000,1466.0,1435.0
698,2017/07/03,1460.0,1460.129,1465.0,78200,1474.0,1440.0
699,2017/07/04,1429.0,1441.355,1468.0,72900,1473.0,1423.0
700,2017/07/05,1426.0,1431.463,1430.0,62900,1456.0,1420.0
701,2017/07/06,1418.0,1421.382,1422.0,63100,1432.0,1413.0
702,2017/07/07,1439.0,1429.737,1418.0,41400,1443.0,1413.0
703,2017/07/10,1468.0,1463.896,1451.0,108600,1487.0,1437.0
704,2017/07/11,1477.0,1492.692,1464.0,141200,1517.0,1464.0
705,2017/07/12,1455.0,1467.638,1478.0,63500,1495.0,1452.0
706,2017/07/13,1433.0,1441.758,1464.0,66100,1470.0,1430.0
707,2017/07/14,1455.0,1452.869,1433.0,51000,1462.0,1429.0
708,2017/07/18,1433.0,1438.538,1440.0,48000,1447.0,1431.0
709,2017/07/19,1452.0,1446.404,1437.0,33400,1454.0,1436.0
710,2017/07/20,1453.0,1451.897,1460.0,30000,1461.0,1443.0
711,2017/07/21,1445.0,1447.138,1456.0,58900,1460.0,1439.0
712,2017/07/24,1447.0,1438.918,1445.0,38000,1449.0,1432.0
713,2017/07/25,1479.0,1464.059,1460.0,73500,1480.0,1443.0
714,2017/07/26,1451.0,1463.753,1481.0,32000,1481.0,1451.0
715,2017/07/27,1452.0,1454.379,1455.0,31900,1463.0,1449.0
716,2017/07/28,1425.0,1436.838,1452.0,58600,1452.0,1425.0
717,2017/07/31,1382.0,1398.692,1426.0,120100,1431.0,1381.0
718,2017/08/01,1313.0,1334.879,1384.0,134600,1387.0,1309.0
719,2017/08/02,1354.0,1344.522,1316.0,30300,1356.0,1316.0
720,2017/08/03,1319.0,1325.208,1346.0,40000,1346.0,1314.0
721,2017/08/04,1315.0,1314.246,1314.0,31300,1330.0,1301.0
722,2017/08/07,1318.0,1325.087,1325.0,25300,1335.0,1316.0
723,2017/08/08,1324.0,1322.116,1314.0,20700,1333.0,1314.0
724,2017/08/09,1294.0,1297.691,1312.0,61500,1315.0,1284.0
725,2017/08/10,1256.0,1271.633,1295.0,64100,1295.0,1256.0
726,2017/08/14,1232.0,1227.487,1210.0,44600,1243.0,1206.0
727,2017/08/15,1243.0,1245.421,1261.0,28500,1264.0,1232.0
728,2017/08/16,1284.0,1274.199,1243.0,29700,1292.0,1243.0
729,2017/08/17,1294.0,1304.976,1292.0,62300,1317.0,1283.0
730,2017/08/18,1300.0,1308.637,1280.0,86100,1342.0,1273.0
731,2017/08/21,1275.0,1283.009,1293.0,45100,1310.0,1267.0
732,2017/08/22,1263.0,1262.875,1278.0,74200,1282.0,1243.0
733,2017/08/23,1248.0,1260.491,1279.0,33200,1280.0,1245.0
734,2017/08/24,1245.0,1245.579,1246.0,29200,1258.0,1236.0
735,2017/08/25,1244.0,1247.811,1245.0,25400,1260.0,1239.0
736,2017/08/28,1280.0,1281.037,1250.0,86400,1309.0,1246.0
737,2017/08/29,1270.0,1266.076,1264.0,39500,1275.0,1255.0
738,2017/08/30,1274.0,1267.289,1275.0,56500,1279.0,1251.0
739,2017/08/31,1276.0,1271.878,1278.0,37800,1284.0,1263.0
740,2017/09/01,1265.0,1269.036,1261.0,33800,1287.0,1261.0
741,2017/09/04,1224.0,1231.31,1260.0,93200,1268.0,1213.0
742,2017/09/05,1154.0,1177.372,1221.0,137700,1231.0,1145.0
743,2017/09/06,1162.0,1152.77,1117.0,69600,1178.0,1102.0
744,2017/09/07,1183.0,1181.157,1171.0,45300,1202.0,1169.0
745,2017/09/08,1177.0,1171.194,1170.0,34500,1187.0,1161.0
746,2017/09/11,1183.0,1190.595,1189.0,30400,1211.0,1181.0
747,2017/09/12,1226.0,1220.709,1195.0,47700,1235.0,1195.0
748,2017/09/13,1216.0,1224.227,1234.0,28700,1234.0,1215.0
749,2017/09/14,1196.0,1206.029,1216.0,31300,1224.0,1190.0
750,2017/09/15,1206.0,1208.677,1190.0,30300,1220.0,1185.0
751,2017/09/19,1232.0,1231.635,1232.0,29000,1239.0,1226.0
752,2017/09/20,1216.0,1226.592,1232.0,30900,1237.0,1216.0
753,2017/09/21,1222.0,1230.917,1225.0,35000,1245.0,1216.0
754,2017/09/22,1206.0,1201.671,1223.0,38000,1224.0,1192.0
755,2017/09/25,1208.0,1211.989,1203.0,27200,1219.0,1202.0
756,2017/09/26,1446.0,1406.458,1311.0,995900,1495.0,1299.0
757,2017/09/27,1440.0,1419.288,1432.0,350700,1467.0,1375.0
758,2017/09/28,1484.0,1462.313,1446.0,377000,1500.0,1402.0
759,2017/09/29,1580.0,1555.859,1500.0,694800,1609.0,1490.0
760,2017/10/02,1572.0,1577.775,1580.0,345000,1620.0,1527.0
761,2017/10/03,1552.0,1556.716,1598.0,148400,1598.0,1531.0
762,2017/10/04,1463.0,1492.324,1580.0,252800,1580.0,1461.0
763,2017/10/05,1489.0,1502.057,1467.0,136100,1538.0,1467.0
764,2017/10/06,1496.0,1478.244,1499.0,93400,1503.0,1462.0
765,2017/10/10,1505.0,1505.403,1491.0,53400,1527.0,1489.0
766,2017/10/11,1500.0,1498.634,1519.0,42300,1519.0,1488.0
767,2017/10/12,1519.0,1520.723,1500.0,84100,1541.0,1495.0
768,2017/10/13,1498.0,1488.503,1515.0,110400,1515.0,1472.0
769,2017/10/16,1530.0,1526.539,1498.0,113100,1556.0,1486.0
770,2017/10/17,1505.0,1517.297,1530.0,56900,1534.0,1502.0
771,2017/10/18,1545.0,1537.808,1501.0,147100,1560.0,1493.0
772,2017/10/19,1540.0,1538.892,1530.0,46300,1552.0,1527.0
773,2017/10/20,1531.0,1527.264,1527.0,89500,1545.0,1513.0
774,2017/10/23,1535.0,1515.135,1532.0,92800,1538.0,1500.0
775,2017/10/24,1575.0,1544.533,1534.0,87100,1576.0,1510.0
776,2017/10/25,1538.0,1547.797,1585.0,187000,1585.0,1515.0
777,2017/10/26,1536.0,1525.601,1522.0,58400,1546.0,1510.0
778,2017/10/27,1567.0,1562.717,1540.0,124400,1573.0,1534.0
779,2017/10/30,1628.0,1612.494,1596.0,384500,1644.0,1588.0
780,2017/10/31,1675.0,1631.945,1611.0,220900,1684.0,1581.0
781,2017/11/01,1654.0,1663.858,1670.0,205300,1685.0,1637.0
782,2017/11/02,1621.0,1615.966,1649.0,154200,1649.0,1598.0
783,2017/11/06,1555.0,1588.901,1618.0,146000,1634.0,1555.0
784,2017/11/07,1573.0,1558.856,1545.0,57700,1575.0,1543.0
785,2017/11/08,1604.0,1579.333,1575.0,80800,1612.0,1546.0
786,2017/11/09,1570.0,1576.969,1616.0,141800,1616.0,1537.0
787,2017/11/10,1521.0,1505.87,1514.0,160900,1525.0,1470.0
788,2017/11/13,1505.0,1506.798,1512.0,58500,1522.0,1481.0
789,2017/11/14,1452.0,1467.256,1505.0,162300,1506.0,1444.0
790,2017/11/15,1387.0,1405.769,1435.0,151800,1460.0,1380.0
791,2017/11/16,1420.0,1414.184,1394.0,59700,1436.0,1379.0
792,2017/11/17,1450.0,1443.072,1432.0,57000,1458.0,1424.0
793,2017/11/20,1465.0,1460.05,1433.0,70600,1476.0,1433.0
794,2017/11/21,1453.0,1452.411,1468.0,44800,1468.0,1442.0
795,2017/11/22,1450.0,1444.484,1453.0,51200,1460.0,1427.0
796,2017/11/24,1453.0,1442.673,1434.0,58400,1458.0,1429.0
797,2017/11/27,1462.0,1466.319,1455.0,47700,1479.0,1455.0
798,2017/11/28,1434.0,1438.168,1460.0,48800,1465.0,1415.0
799,2017/11/29,1442.0,1447.745,1446.0,35300,1458.0,1438.0
800,2017/11/30,1470.0,1448.598,1462.0,43300,1470.0,1420.0
801,2017/12/01,1455.0,1454.936,1463.0,34600,1478.0,1440.0
802,2017/12/04,1413.0,1426.091,1431.0,82500,1449.0,1412.0
803,2017/12/05,1389.0,1390.298,1400.0,71900,1410.0,1375.0
804,2017/12/06,1361.0,1375.416,1376.0,75900,1408.0,1351.0
805,2017/12/07,1397.0,1388.465,1362.0,49300,1407.0,1362.0
806,2017/12/08,1437.0,1418.292,1389.0,46200,1437.0,1389.0
807,2017/12/11,1419.0,1423.046,1426.0,56700,1437.0,1417.0
808,2017/12/12,1456.0,1438.85,1421.0,90000,1456.0,1421.0
809,2017/12/13,1447.0,1453.032,1456.0,67900,1466.0,1437.0
810,2017/12/14,1440.0,1437.249,1436.0,37300,1463.0,1423.0
811,2017/12/15,1520.0,1497.309,1460.0,217800,1529.0,1455.0
812,2017/12/18,1446.0,1471.487,1530.0,162500,1537.0,1438.0
813,2017/12/19,1447.0,1443.154,1453.0,57200,1457.0,1431.0
814,2017/12/20,1422.0,1431.045,1442.0,73500,1447.0,1421.0
815,2017/12/21,1434.0,1423.429,1415.0,56400,1440.0,1410.0
816,2017/12/22,1423.0,1427.231,1448.0,48000,1449.0,1411.0
817,2017/12/25,1391.0,1399.862,1415.0,108200,1421.0,1391.0
818,2017/12/26,1380.0,1388.243,1382.0,131200,1409.0,1377.0
819,2017/12/27,1446.0,1442.711,1409.0,119800,1459.0,1405.0
820,2017/12/28,1443.0,1451.906,1444.0,51100,1467.0,1433.0
821,2017/12/29,1476.0,1467.472,1445.0,66800,1488.0,1444.0
822,2018/01/04,1480.0,1486.863,1481.0,89000,1502.0,1462.0
823,2018/01/05,1522.0,1512.948,1500.0,109100,1533.0,1476.0
824,2018/01/09,1531.0,1525.569,1520.0,93100,1547.0,1504.0
825,2018/01/10,1537.0,1531.656,1540.0,56400,1542.0,1522.0
826,2018/01/11,1506.0,1516.867,1522.0,64500,1537.0,1501.0
827,2018/01/12,1511.0,1517.96,1513.0,52700,1530.0,1506.0
828,2018/01/15,1574.0,1553.824,1530.0,154700,1588.0,1509.0
829,2018/01/16,1575.0,1562.643,1566.0,104400,1581.0,1535.0
830,2018/01/17,1548.0,1540.94,1557.0,86200,1563.0,1522.0
831,2018/01/18,1509.0,1525.881,1550.0,74200,1558.0,1503.0
832,2018/01/19,1508.0,1506.01,1512.0,48100,1523.0,1496.0
833,2018/01/22,1525.0,1517.909,1506.0,53000,1542.0,1498.0
834,2018/01/23,1547.0,1548.256,1523.0,74600,1570.0,1523.0
835,2018/01/24,1541.0,1545.754,1547.0,73500,1562.0,1526.0
836,2018/01/25,1532.0,1541.527,1531.0,48400,1559.0,1526.0
837,2018/01/26,1511.0,1526.608,1549.0,65800,1550.0,1511.0
838,2018/01/29,1502.0,1507.517,1519.0,54900,1524.0,1500.0
839,2018/01/30,1465.0,1472.736,1499.0,105800,1507.0,1447.0
840,2018/01/31,1450.0,1458.388,1460.0,45100,1475.0,1443.0
841,2018/02/01,1484.0,1477.691,1462.0,48500,1495.0,1456.0
842,2018/02/02,1516.0,1497.575,1484.0,84500,1516.0,1465.0
843,2018/02/05,1492.0,1488.306,1476.0,85000,1507.0,1473.0
844,2018/02/06,1336.0,1358.509,1402.0,227000,1413.0,1298.0
845,2018/02/07,1352.0,1381.659,1396.0,68400,1400.0,1346.0
846,2018/02/08,1390.0,1379.292,1356.0,55900,1402.0,1354.0
847,2018/02/09,1382.0,1350.383,1303.0,118900,1392.0,1303.0
848,2018/02/13,1082.0,1085.352,1082.0,377900,1107.0,1082.0
849,2018/02/14,1009.0,1010.137,1032.0,457500,1050.0,975.0
850,2018/02/15,1060.0,1036.531,1031.0,137600,1060.0,1010.0
851,2018/02/16,1128.0,1109.489,1076.0,184200,1139.0,1072.0
852,2018/02/19,1218.0,1195.999,1137.0,145000,1232.0,1137.0
853,2018/02/20,1184.0,1175.118,1181.0,157100,1190.0,1151.0
854,2018/02/21,1154.0,1165.145,1185.0,89900,1219.0,1140.0
855,2018/02/22,1118.0,1126.823,1137.0,58100,1139.0,1115.0
856,2018/02/23,1190.0,1174.056,1133.0,127700,1202.0,1128.0
857,2018/02/26,1167.0,1181.262,1186.0,68800,1208.0,1162.0
858,2018/02/27,1164.0,1167.316,1170.0,38300,1174.0,1157.0
859,2018/02/28,1170.0,1183.544,1160.0,88400,1212.0,1160.0
860,2018/03/01,1147.0,1150.694,1167.0,34300,1169.0,1141.0
861,2018/03/02,1152.0,1137.568,1117.0,39600,1154.0,1117.0
862,2018/03/05,1093.0,1112.032,1133.0,63500,1153.0,1081.0
863,2018/03/06,1130.0,1141.102,1109.0,62500,1177.0,1109.0
864,2018/03/07,1130.0,1132.598,1130.0,48000,1156.0,1112.0
865,2018/03/08,1141.0,1140.194,1140.0,29400,1165.0,1127.0
866,2018/03/09,1125.0,1132.141,1150.0,43400,1150.0,1117.0
867,2018/03/12,1139.0,1132.065,1135.0,32500,1145.0,1120.0
868,2018/03/13,1145.0,1143.151,1123.0,33100,1153.0,1123.0
869,2018/03/14,1163.0,1157.921,1138.0,73000,1179.0,1131.0
870,2018/03/15,1163.0,1157.366,1150.0,26800,1165.0,1148.0
871,2018/03/16,1162.0,1151.585,1162.0,36900,1170.0,1139.0
872,2018/03/19,1098.0,1109.123,1151.0,83900,1151.0,1073.0
873,2018/03/20,1071.0,1080.105,1080.0,54500,1093.0,1071.0
874,2018/03/22,1071.0,1074.224,1073.0,71400,1092.0,1064.0
875,2018/03/23,1018.0,1026.513,1020.0,70200,1044.0,1015.0
876,2018/03/26,1016.0,993.434,992.0,77500,1016.0,980.0
877,2018/03/27,1012.0,1019.558,1033.0,37300,1039.0,1006.0
878,2018/03/28,1017.0,1016.58,1000.0,23800,1033.0,1000.0
879,2018/03/29,1021.0,1021.255,1017.0,38000,1035.0,1008.0
880,2018/03/30,1043.0,1036.563,1025.0,24500,1044.0,1025.0
881,2018/04/02,1010.0,1025.988,1041.0,58600,1057.0,1010.0
882,2018/04/03,998.0,998.545,996.0,43500,1009.0,993.0
883,2018/04/04,985.0,989.645,1002.0,56600,1006.0,978.0
884,2018/04/05,983.0,984.91,988.0,33200,993.0,979.0
885,2018/04/06,959.0,966.956,978.0,83200,984.0,959.0
886,2018/04/09,965.0,951.853,953.0,61000,973.0,937.0
887,2018/04/10,949.0,950.083,958.0,39900,962.0,940.0
888,2018/04/11,940.0,944.292,950.0,26700,959.0,938.0
889,2018/04/12,956.0,953.857,940.0,21000,964.0,940.0
890,2018/04/13,955.0,948.908,947.0,31500,960.0,943.0
891,2018/04/16,936.0,946.2,956.0,39600,960.0,936.0
892,2018/04/17,903.0,907.001,932.0,89700,941.0,887.0
893,2018/04/18,954.0,931.828,896.0,78600,956.0,894.0
894,2018/04/19,972.0,968.385,951.0,46700,988.0,950.0
895,2018/04/20,969.0,973.295,971.0,25100,979.0,961.0
896,2018/04/23,981.0,973.739,964.0,13400,981.0,961.0
897,2018/04/24,975.0,981.743,978.0,35000,992.0,975.0
898,2018/04/25,977.0,975.345,966.0,20900,985.0,966.0
899,2018/04/26,978.0,973.431,987.0,32500,987.0,960.0
900,2018/04/27,972.0,978.366,978.0,21300,985.0,970.0
901,2018/05/01,1122.0,1122.0,1122.0,21300,1122.0,1122.0
902,2018/05/02,1181.0,1242.429,1272.0,925500,1314.0,1170.0
903,2018/05/07,1221.0,1213.986,1171.0,198500,1245.0,1164.0
904,2018/05/08,1187.0,1198.206,1243.0,106600,1243.0,1174.0
905,2018/05/09,1184.0,1182.472,1174.0,70800,1204.0,1160.0
906,2018/05/10,1165.0,1186.837,1206.0,54000,1213.0,1163.0
907,2018/05/11,1176.0,1175.81,1165.0,49000,1194.0,1159.0
908,2018/05/14,1176.0,1176.123,1184.0,39800,1188.0,1167.0
909,2018/05/15,1184.0,1176.257,1176.0,54400,1186.0,1160.0
910,2018/05/16,1192.0,1195.216,1183.0,72800,1213.0,1183.0
911,2018/05/17,1194.0,1207.616,1192.0,70000,1232.0,1190.0
912,2018/05/18,1232.0,1213.932,1200.0,69400,1232.0,1193.0
913,2018/05/21,1228.0,1249.726,1242.0,122900,1274.0,1222.0
914,2018/05/22,1230.0,1240.765,1232.0,55800,1268.0,1225.0
915,2018/05/23,1203.0,1218.126,1221.0,60400,1239.0,1195.0
916,2018/05/24,1171.0,1179.875,1192.0,56900,1199.0,1171.0
917,2018/05/25,1186.0,1186.166,1166.0,69500,1205.0,1166.0
918,2018/05/28,1203.0,1203.242,1190.0,47600,1214.0,1190.0
919,2018/05/29,1175.0,1175.144,1189.0,34100,1195.0,1165.0
920,2018/05/30,1298.0,1289.238,1160.0,632100,1380.0,1160.0
921,2018/05/31,1198.0,1241.903,1328.0,201100,1328.0,1195.0
922,2018/06/01,1189.0,1192.962,1210.0,94100,1213.0,1181.0
923,2018/06/04,1207.0,1203.645,1196.0,91000,1220.0,1191.0
924,2018/06/05,1155.0,1171.114,1212.0,98700,1213.0,1155.0
925,2018/06/06,1128.0,1141.076,1150.0,77300,1169.0,1128.0
926,2018/06/07,1174.0,1172.061,1150.0,50800,1195.0,1149.0
927,2018/06/08,1207.0,1201.692,1194.0,52000,1217.0,1172.0
928,2018/06/11,1210.0,1207.047,1216.0,32000,1222.0,1196.0
929,2018/06/12,1222.0,1219.295,1208.0,46800,1232.0,1208.0
930,2018/06/13,1229.0,1225.718,1222.0,56100,1245.0,1204.0
931,2018/06/14,1228.0,1222.634,1221.0,27300,1236.0,1209.0
932,2018/06/15,1329.0,1296.13,1225.0,274300,1350.0,1218.0
933,2018/06/18,1333.0,1311.709,1311.0,145700,1350.0,1276.0
934,2018/06/19,1316.0,1338.04,1339.0,263200,1375.0,1300.0
935,2018/06/20,1384.0,1340.932,1329.0,378600,1384.0,1268.0
936,2018/06/21,1434.0,1389.246,1394.0,451300,1441.0,1324.0
937,2018/06/22,1367.0,1382.118,1400.0,200700,1411.0,1356.0
938,2018/06/25,1385.0,1417.329,1375.0,256300,1463.0,1371.0
939,2018/06/26,1426.0,1403.576,1371.0,154300,1439.0,1370.0
940,2018/06/27,1377.0,1396.679,1436.0,99400,1450.0,1373.0
941,2018/06/28,1386.0,1387.794,1400.0,99500,1413.0,1350.0
942,2018/06/29,1450.0,1432.349,1400.0,175400,1465.0,1381.0
943,2018/07/02,1370.0,1408.406,1440.0,135900,1458.0,1366.0
944,2018/07/03,1346.0,1344.688,1380.0,128400,1409.0,1310.0
945,2018/07/04,1286.0,1307.154,1346.0,104900,1346.0,1284.0
946,2018/07/05,1186.0,1214.274,1266.0,191000,1286.0,1183.0
947,2018/07/06,1246.0,1225.378,1200.0,169900,1270.0,1182.0
948,2018/07/09,1279.0,1248.524,1254.0,102500,1290.0,1208.0
949,2018/07/10,1326.0,1324.782,1339.0,130500,1356.0,1295.0
950,2018/07/11,1340.0,1359.542,1312.0,159800,1397.0,1312.0
951,2018/07/12,1365.0,1365.122,1346.0,72000,1387.0,1330.0
952,2018/07/13,1388.0,1393.785,1385.0,68000,1415.0,1375.0
953,2018/07/17,1365.0,1366.261,1388.0,73300,1388.0,1345.0
954,2018/07/18,1441.0,1449.194,1366.0,306700,1494.0,1366.0
955,2018/07/19,1350.0,1377.406,1431.0,229200,1450.0,1336.0
956,2018/07/20,1385.0,1366.583,1342.0,90900,1394.0,1332.0
957,2018/07/23,1354.0,1360.788,1370.0,68000,1385.0,1340.0
958,2018/07/24,1361.0,1361.418,1355.0,62200,1374.0,1345.0
959,2018/07/25,1382.0,1374.892,1367.0,76800,1391.0,1347.0
960,2018/07/26,1377.0,1377.481,1393.0,52200,1393.0,1355.0
961,2018/07/27,1408.0,1404.874,1385.0,171500,1430.0,1381.0
962,2018/07/30,1126.0,1186.565,1237.0,675600,1245.0,1124.0
963,2018/07/31,1082.0,1088.773,1121.0,261500,1126.0,1058.0
964,2018/08/01,1092.0,1100.938,1120.0,119600,1121.0,1075.0
965,2018/08/02,1123.0,1133.368,1119.0,121300,1170.0,1092.0
966,2018/08/03,1117.0,1139.061,1159.0,63600,1167.0,1112.0
967,2018/08/06,1095.0,1099.189,1102.0,30700,1113.0,1090.0
968,2018/08/07,1132.0,1110.961,1099.0,35900,1136.0,1090.0
969,2018/08/08,1141.0,1135.414,1122.0,28500,1148.0,1119.0
970,2018/08/09,1149.0,1157.912,1160.0,70100,1168.0,1143.0
971,2018/08/10,1147.0,1154.781,1164.0,24600,1164.0,1141.0
972,2018/08/13,1100.0,1098.816,1130.0,61300,1133.0,1081.0
973,2018/08/14,1090.0,1088.455,1102.0,89000,1116.0,1060.0
974,2018/08/15,1087.0,1096.847,1092.0,77100,1128.0,1081.0
975,2018/08/16,1095.0,1108.172,1083.0,244600,1138.0,1070.0
976,2018/08/17,1061.0,1071.585,1083.0,72100,1093.0,1055.0
977,2018/08/20,1052.0,1060.766,1062.0,30400,1078.0,1046.0
978,2018/08/21,1036.0,1037.526,1056.0,31400,1057.0,1030.0
979,2018/08/22,1061.0,1048.482,1046.0,44600,1062.0,1029.0
980,2018/08/23,1092.0,1082.122,1077.0,42500,1092.0,1061.0
981,2018/08/24,1115.0,1103.879,1090.0,61300,1115.0,1084.0
982,2018/08/27,1170.0,1159.782,1130.0,253400,1197.0,1112.0
983,2018/08/28,1167.0,1192.038,1200.0,194300,1214.0,1162.0
984,2018/08/29,1263.0,1266.135,1220.0,517200,1320.0,1209.0
985,2018/08/30,1210.0,1222.132,1233.0,211500,1260.0,1198.0
986,2018/08/31,1268.0,1235.103,1197.0,133900,1273.0,1184.0
987,2018/09/03,1242.0,1247.106,1298.0,123000,1298.0,1211.0
988,2018/09/04,1230.0,1220.191,1237.0,85500,1242.0,1198.0
989,2018/09/05,1237.0,1234.433,1230.0,44300,1250.0,1218.0
990,2018/09/06,1212.0,1203.732,1220.0,82200,1223.0,1184.0
991,2018/09/07,1234.0,1212.229,1186.0,111600,1259.0,1150.0
992,2018/09/10,1225.0,1229.765,1232.0,36200,1246.0,1221.0
993,2018/09/11,1206.0,1212.124,1225.0,37000,1244.0,1195.0
994,2018/09/12,1198.0,1188.675,1203.0,49600,1211.0,1160.0
995,2018/09/13,1183.0,1190.013,1187.0,39400,1205.0,1173.0
996,2018/09/14,1227.0,1216.873,1206.0,45600,1235.0,1194.0
997,2018/09/18,1216.0,1222.501,1227.0,38300,1235.0,1208.0
998,2018/09/19,1241.0,1229.555,1216.0,79600,1250.0,1206.0
999,2018/09/20,1249.0,1246.049,1253.0,55200,1256.0,1235.0
1000,2018/09/21,1202.0,1214.725,1249.0,96200,1249.0,1202.0
1001,2018/09/25,1228.0,1220.239,1216.0,68700,1233.0,1205.0
1002,2018/09/26,1328.0,1307.969,1239.0,423500,1354.0,1237.0
1003,2018/09/27,1266.0,1278.06,1319.0,240500,1320.0,1250.0
1004,2018/09/28,1300.0,1278.256,1285.0,106000,1300.0,1253.0
1005,2018/10/01,1335.0,1335.777,1303.0,235200,1374.0,1294.0
1006,2018/10/02,1273.0,1297.745,1348.0,159200,1352.0,1268.0
1007,2018/10/03,1264.0,1239.028,1283.0,142300,1283.0,1207.0
1008,2018/10/04,1267.0,1266.109,1289.0,64500,1289.0,1245.0
1009,2018/10/05,1228.0,1237.436,1237.0,142100,1270.0,1215.0
1010,2018/10/09,1205.0,1204.774,1215.0,87000,1233.0,1185.0
1011,2018/10/10,1208.0,1204.893,1211.0,55900,1228.0,1191.0
1012,2018/10/11,1132.0,1129.415,1100.0,161100,1158.0,1098.0
1013,2018/10/12,1176.0,1149.249,1113.0,73800,1183.0,1113.0
1014,2018/10/15,1160.0,1173.623,1180.0,55200,1195.0,1156.0
1015,2018/10/16,1141.0,1141.032,1151.0,65700,1163.0,1128.0
1016,2018/10/17,1181.0,1170.161,1161.0,62900,1186.0,1147.0
1017,2018/10/18,1187.0,1187.698,1178.0,69800,1207.0,1173.0
1018,2018/10/19,1203.0,1183.817,1169.0,31200,1205.0,1161.0
1019,2018/10/22,1226.0,1219.586,1200.0,69600,1238.0,1188.0
1020,2018/10/23,1200.0,1210.047,1221.0,76100,1230.0,1196.0
1021,2018/10/24,1169.0,1176.35,1206.0,90800,1219.0,1156.0
1022,2018/10/25,1072.0,1095.25,1120.0,147000,1132.0,1065.0
1023,2018/10/26,1040.0,1074.889,1100.0,148200,1128.0,1040.0
1024,2018/10/29,990.0,1001.846,1000.0,202500,1030.0,980.0
1025,2018/10/30,1062.0,1027.661,990.0,129000,1065.0,980.0
1026,2018/10/31,1114.0,1091.591,1080.0,75000,1125.0,1071.0
1027,2018/11/01,1100.0,1100.662,1105.0,51500,1115.0,1084.0
1028,2018/11/02,1167.0,1147.212,1135.0,67500,1168.0,1117.0
1029,2018/11/05,1180.0,1177.685,1176.0,68800,1192.0,1155.0
1030,2018/11/06,1193.0,1184.361,1180.0,52300,1204.0,1163.0
1031,2018/11/07,1213.0,1211.471,1204.0,81900,1232.0,1186.0
1032,2018/11/08,1229.0,1234.515,1225.0,76300,1248.0,1222.0
1033,2018/11/09,1249.0,1275.716,1212.0,290500,1341.0,1208.0
1034,2018/11/12,1173.0,1199.938,1231.0,104700,1236.0,1166.0
1035,2018/11/13,1130.0,1133.909,1113.0,94100,1163.0,1106.0
1036,2018/11/14,1118.0,1119.696,1124.0,53000,1139.0,1107.0
1037,2018/11/15,1154.0,1143.836,1114.0,45000,1164.0,1113.0
1038,2018/11/16,1098.0,1112.286,1153.0,68200,1156.0,1093.0
1039,2018/11/19,1118.0,1106.957,1090.0,58100,1147.0,1075.0
1040,2018/11/20,1070.0,1082.444,1096.0,58400,1105.0,1070.0
1041,2018/11/21,1095.0,1072.207,1060.0,76700,1105.0,1047.0
1042,2018/11/22,1101.0,1088.477,1100.0,63900,1111.0,1073.0
1043,2018/11/26,1121.0,1106.581,1101.0,40600,1130.0,1081.0
1044,2018/11/27,1108.0,1118.403,1121.0,44200,1135.0,1099.0
1045,2018/11/28,1128.0,1129.005,1115.0,38700,1147.0,1115.0
1046,2018/11/29,1116.0,1120.444,1120.0,35800,1139.0,1109.0
1047,2018/11/30,1110.0,1111.257,1112.0,39700,1133.0,1097.0
1048,2018/12/03,1125.0,1124.975,1115.0,39500,1137.0,1107.0
1049,2018/12/04,1104.0,1114.692,1128.0,47000,1142.0,1104.0
1050,2018/12/05,1091.0,1088.988,1080.0,49400,1111.0,1075.0
1051,2018/12/06,1062.0,1065.711,1082.0,60100,1090.0,1050.0
1052,2018/12/07,1053.0,1062.967,1065.0,63700,1084.0,1052.0
1053,2018/12/10,1005.0,1018.641,1033.0,64900,1043.0,1003.0
1054,2018/12/11,986.0,995.717,1005.0,65100,1025.0,979.0
1055,2018/12/12,1017.0,1001.589,986.0,47900,1023.0,980.0
1056,2018/12/13,1028.0,1015.424,1010.0,30900,1030.0,1002.0
1057,2018/12/14,1015.0,1006.891,1014.0,43000,1029.0,992.0
1058,2018/12/17,1002.0,1010.093,1006.0,48400,1025.0,1001.0
1059,2018/12/18,967.0,977.908,987.0,88900,996.0,965.0
1060,2018/12/19,992.0,1001.511,970.0,121200,1058.0,962.0
1061,2018/12/20,885.0,916.271,962.0,198500,971.0,881.0
1062,2018/12/21,813.0,823.716,873.0,200500,873.0,795.0
1063,2018/12/25,710.0,730.611,742.0,234400,759.0,705.0
1064,2018/12/26,735.0,737.514,757.0,95600,757.0,717.0
1065,2018/12/27,781.0,794.555,825.0,105400,826.0,767.0
1066,2018/12/28,770.0,763.803,768.0,95900,780.0,746.0
1067,2019/01/04,783.0,745.916,742.0,91800,784.0,725.0
1068,2019/01/07,788.0,793.808,795.0,122800,810.0,781.0
1069,2019/01/08,823.0,815.238,790.0,105600,833.0,790.0
1070,2019/01/09,811.0,813.844,823.0,100100,829.0,801.0
1071,2019/01/10,823.0,816.385,814.0,45200,828.0,801.0
1072,2019/01/11,847.0,847.887,834.0,86900,866.0,834.0
1073,2019/01/15,855.0,860.106,846.0,76200,883.0,841.0
1074,2019/01/16,859.0,859.033,857.0,45800,869.0,842.0
1075,2019/01/17,888.0,886.751,866.0,53100,900.0,858.0
1076,2019/01/18,887.0,888.461,893.0,48400,900.0,878.0
1077,2019/01/21,880.0,899.083,910.0,51700,920.0,878.0
1078,2019/01/22,872.0,875.177,877.0,31000,890.0,860.0
1079,2019/01/23,876.0,872.648,857.0,17900,889.0,854.0
1080,2019/01/24,911.0,898.124,880.0,46000,911.0,871.0
1081,2019/01/25,932.0,933.44,911.0,47100,950.0,908.0
1082,2019/01/28,927.0,922.599,917.0,26700,937.0,905.0
1083,2019/01/29,930.0,912.607,920.0,35900,930.0,900.0
1084,2019/01/30,886.0,900.827,922.0,62900,928.0,884.0
1085,2019/01/31,912.0,905.632,887.0,26600,915.0,887.0
1086,2019/02/01,913.0,923.636,927.0,45300,938.0,909.0
1087,2019/02/04,941.0,934.577,915.0,42500,954.0,913.0
1088,2019/02/05,944.0,943.971,941.0,41100,957.0,922.0
1089,2019/02/06,938.0,940.36,950.0,21100,953.0,932.0
1090,2019/02/07,917.0,921.251,942.0,22700,942.0,914.0
1091,2019/02/08,891.0,897.526,892.0,32700,912.0,890.0
1092,2019/02/12,912.0,915.24,910.0,30400,926.0,907.0
1093,2019/02/13,922.0,919.292,919.0,24000,928.0,903.0
1094,2019/02/14,936.0,928.941,925.0,34100,939.0,916.0
1095,2019/02/15,960.0,951.189,940.0,170000,988.0,919.0
1096,2019/02/18,810.0,810.0,810.0,14200,810.0,810.0
1097,2019/02/19,757.0,729.646,713.0,563400,759.0,713.0
1098,2019/02/20,763.0,759.896,762.0,139600,775.0,741.0
1099,2019/02/21,787.0,785.932,774.0,96100,807.0,766.0
1100,2019/02/22,777.0,772.096,780.0,63600,787.0,763.0
1101,2019/02/25,761.0,762.131,777.0,76600,782.0,751.0
1102,2019/02/26,744.0,744.594,760.0,72200,760.0,736.0
1103,2019/02/27,740.0,737.222,740.0,64900,749.0,728.0
1104,2019/02/28,736.0,743.449,739.0,55000,758.0,734.0
1105,2019/03/01,728.0,729.205,737.0,65800,740.0,721.0
1106,2019/03/04,726.0,726.106,733.0,55500,733.0,722.0
1107,2019/03/05,719.0,716.398,721.0,92400,723.0,709.0
1108,2019/03/06,713.0,710.096,713.0,55400,718.0,707.0
1109,2019/03/07,701.0,698.553,708.0,145300,710.0,690.0
1110,2019/03/08,675.0,679.454,700.0,104000,700.0,669.0
1111,2019/03/11,667.0,659.72,682.0,73100,685.0,643.0
1112,2019/03/12,680.0,684.887,682.0,50300,692.0,675.0
1113,2019/03/13,691.0,693.189,690.0,40700,704.0,684.0
1114,2019/03/14,681.0,685.285,691.0,42800,695.0,673.0
1115,2019/03/15,689.0,692.966,691.0,44500,700.0,681.0
1116,2019/03/18,690.0,685.497,695.0,16500,695.0,681.0
1117,2019/03/19,677.0,679.856,684.0,32600,686.0,671.0
1118,2019/03/20,682.0,680.621,680.0,24000,685.0,676.0
1119,2019/03/22,698.0,700.195,682.0,107200,713.0,682.0
1120,2019/03/25,682.0,675.542,684.0,48000,684.0,667.0
1121,2019/03/26,677.0,678.696,680.0,34500,684.0,676.0
1122,2019/03/27,680.0,684.31,680.0,38700,692.0,679.0
1123,2019/03/28,663.0,668.831,681.0,55100,682.0,661.0
1124,2019/03/29,667.0,664.437,667.0,17400,669.0,660.0
1125,2019/04/01,663.0,671.545,668.0,47500,678.0,662.0
1126,2019/04/02,656.0,662.363,672.0,48200,676.0,652.0
1127,2019/04/03,659.0,663.259,656.0,32000,673.0,652.0
1128,2019/04/04,656.0,659.56,659.0,21600,669.0,655.0
1129,2019/04/05,664.0,658.35,658.0,20600,666.0,653.0
1130,2019/04/08,666.0,666.034,668.0,20600,671.0,660.0
1131,2019/04/09,664.0,658.852,660.0,57600,666.0,651.0
1132,2019/04/10,666.0,664.565,659.0,25500,674.0,655.0
1133,2019/04/11,660.0,663.519,664.0,26000,669.0,658.0
1134,2019/04/12,655.0,660.444,658.0,36300,673.0,655.0
1135,2019/04/15,663.0,657.225,655.0,43600,666.0,651.0
1136,2019/04/16,658.0,663.536,667.0,24800,668.0,656.0
1137,2019/04/17,654.0,649.531,656.0,42600,656.0,641.0
1138,2019/04/18,646.0,646.204,658.0,37700,658.0,643.0
1139,2019/04/19,660.0,658.303,645.0,54800,669.0,645.0
1140,2019/04/22,655.0,665.668,664.0,61100,679.0,653.0
1141,2019/04/23,651.0,653.878,652.0,50900,667.0,645.0
1142,2019/04/24,652.0,657.059,657.0,62500,669.0,649.0
1143,2019/04/25,643.0,645.853,650.0,27800,652.0,643.0
1144,2019/04/26,640.0,630.613,635.0,63500,642.0,620.0
1145,2019/05/07,643.0,645.739,635.0,52000,654.0,635.0
1146,2019/05/08,648.0,638.473,633.0,54800,649.0,629.0
1147,2019/05/09,639.0,641.699,646.0,39900,649.0,633.0
1148,2019/05/10,646.0,640.245,639.0,65000,651.0,628.0
1149,2019/05/13,746.0,736.925,720.0,652500,746.0,720.0
1150,2019/05/14,879.0,779.984,720.0,1289500,887.0,701.0
1151,2019/05/15,885.0,866.255,869.0,472600,885.0,839.0
1152,2019/05/16,865.0,866.48,876.0,316100,899.0,825.0
1153,2019/05/17,856.0,878.483,872.0,298600,898.0,854.0
1154,2019/05/20,837.0,840.893,871.0,250300,871.0,817.0
1155,2019/05/21,797.0,804.735,832.0,312500,832.0,788.0
1156,2019/05/22,808.0,820.055,820.0,254200,847.0,790.0
1157,2019/05/23,785.0,792.438,808.0,175200,818.0,774.0
1158,2019/05/24,785.0,785.289,783.0,141500,812.0,763.0
1159,2019/05/27,781.0,784.048,800.0,75400,800.0,771.0
1160,2019/05/28,799.0,796.733,789.0,229500,817.0,777.0
1161,2019/05/29,760.0,763.302,784.0,308000,787.0,748.0
1162,2019/05/30,765.0,758.79,759.0,230600,777.0,742.0
1163,2019/05/31,726.0,767.767,756.0,1273000,833.0,725.0
1164,2019/06/03,688.0,699.583,711.0,310900,730.0,678.0
1165,2019/06/04,691.0,682.441,691.0,128000,698.0,665.0
1166,2019/06/05,723.0,715.529,710.0,157000,729.0,703.0
1167,2019/06/06,704.0,713.193,722.0,93900,731.0,698.0
1168,2019/06/07,720.0,709.163,705.0,50900,720.0,698.0
1169,2019/06/10,748.0,739.386,725.0,230400,760.0,715.0
1170,2019/06/11,767.0,759.436,770.0,543500,783.0,737.0
1171,2019/06/12,730.0,746.363,760.0,187300,772.0,730.0
1172,2019/06/13,743.0,727.662,731.0,133700,750.0,705.0
1173,2019/06/14,761.0,753.554,744.0,61200,762.0,738.0
1174,2019/06/17,792.0,787.89,778.0,336600,811.0,766.0
1175,2019/06/18,743.0,769.675,803.0,267900,806.0,742.0
1176,2019/06/19,761.0,765.731,769.0,79200,778.0,753.0
1177,2019/06/20,765.0,758.886,764.0,129600,775.0,746.0
1178,2019/06/21,720.0,737.328,760.0,160800,766.0,720.0
1179,2019/06/24,723.0,707.373,716.0,219600,727.0,685.0
1180,2019/06/25,739.0,740.234,720.0,113900,753.0,720.0
1181,2019/06/26,748.0,751.201,742.0,133500,765.0,728.0
1182,2019/06/27,756.0,757.208,751.0,78200,765.0,747.0
1183,2019/06/28,761.0,762.797,756.0,88700,770.0,752.0
1184,2019/07/01,786.0,781.9,769.0,168200,794.0,767.0
1185,2019/07/02,808.0,803.801,783.0,189000,814.0,779.0
1186,2019/07/03,810.0,810.146,815.0,148200,825.0,800.0
1187,2019/07/04,823.0,817.629,805.0,95200,830.0,801.0
1188,2019/07/05,834.0,828.854,826.0,131800,837.0,822.0
1189,2019/07/08,860.0,855.799,856.0,157000,867.0,841.0
1190,2019/07/09,845.0,851.694,869.0,139300,869.0,839.0
1191,2019/07/10,867.0,863.974,845.0,115900,878.0,838.0
1192,2019/07/11,874.0,868.194,863.0,70600,875.0,856.0
1193,2019/07/12,852.0,866.699,879.0,143000,889.0,843.0
1194,2019/07/16,860.0,859.032,861.0,94200,873.0,847.0
1195,2019/07/17,857.0,856.039,858.0,64000,864.0,852.0
1196,2019/07/18,853.0,853.766,853.0,82100,861.0,845.0
1197,2019/07/19,877.0,889.486,860.0,202300,908.0,860.0
1198,2019/07/22,866.0,864.881,875.0,91800,881.0,852.0
1199,2019/07/23,855.0,863.013,864.0,82400,877.0,853.0
1200,2019/07/24,855.0,854.75,855.0,52300,862.0,848.0
1201,2019/07/25,868.0,866.871,851.0,48100,877.0,851.0
1202,2019/07/26,867.0,864.237,866.0,44800,870.0,857.0
1203,2019/07/29,862.0,870.729,876.0,49800,884.0,861.0
1204,2019/07/30,861.0,862.58,862.0,59500,873.0,858.0
1205,2019/07/31,880.0,873.427,862.0,72100,886.0,856.0
1206,2019/08/01,901.0,893.124,879.0,135200,903.0,868.0
1207,2019/08/02,860.0,859.907,886.0,443300,888.0,844.0
1208,2019/08/05,710.0,710.0,710.0,78600,710.0,710.0
1209,2019/08/06,666.0,640.58,655.0,1065500,666.0,621.0
1210,2019/08/07,645.0,644.856,650.0,268300,657.0,639.0
1211,2019/08/08,630.0,634.944,644.0,313000,646.0,626.0
1212,2019/08/09,627.0,633.7,632.0,157400,645.0,627.0
1213,2019/08/13,627.0,620.2,624.0,175200,632.0,610.0
1214,2019/08/14,639.0,642.16,642.0,151700,650.0,636.0
1215,2019/08/15,619.0,617.547,620.0,146400,625.0,608.0
1216,2019/08/16,631.0,629.783,624.0,60700,635.0,620.0
1217,2019/08/19,641.0,636.438,635.0,57600,646.0,629.0
1218,2019/08/20,646.0,649.083,646.0,86000,660.0,636.0
1219,2019/08/21,645.0,641.51,645.0,45100,646.0,634.0
1220,2019/08/22,629.0,640.495,646.0,97100,659.0,623.0
1221,2019/08/23,636.0,633.437,630.0,46200,637.0,627.0
