ds,yhat
2019-08-22,90.1506424045195
2019-08-23,89.72381099583976
2019-08-26,91.71461170544806
2019-08-27,91.71804409210766
2019-08-28,91.20067344156125
2019-08-29,90.69336991633362
2019-08-30,90.52117766651786
2019-09-02,89.29251892746849
2019-09-03,88.31709104688187
2019-09-04,87.83570343724266
2019-09-05,88.13098309711013
2019-09-06,88.84912937179192
2019-09-09,88.50976487868911
2019-09-10,88.15505883936093
2019-09-11,88.42604483682624
2019-09-12,89.0762686834626
2019-09-13,89.47279821982228
2019-09-17,88.92263005456648
2019-09-18,90.01783392700001
2019-09-19,90.89698232036105
2019-09-20,90.96156788221994
