ds,yhat
2019-07-16,1378.3421641725308
2019-07-17,1359.5157755098276
2019-07-18,1344.8221493681062
2019-07-19,1334.0149963738936
2019-07-22,1283.9521737765217
2019-07-23,1255.597951228222
2019-07-24,1225.9413669330802
2019-07-25,1200.4935012828
2019-07-26,1183.5115570042701
2019-07-29,1154.3197283831355
2019-07-30,1124.4365303901577
2019-07-31,1079.2112641365634
2019-08-01,1028.782385611773
2019-08-02,987.3643619360964
2019-08-05,945.2791160233664
2019-08-06,923.5690730511897
2019-08-07,885.3526999132623
2019-08-08,840.1227199507703
2019-08-09,803.659218326437
