,Date,Close,VWAP,Open,Volume,High,Low
0,2014/08/25,1194.0,1187.61,1185.0,1974500,1196.0,1178.0
1,2014/08/26,1185.0,1187.605,1194.0,2262900,1196.0,1182.0
2,2014/08/27,1189.0,1191.822,1194.0,2136200,1205.0,1182.0
3,2014/08/28,1163.0,1167.152,1181.0,2969900,1182.0,1161.0
4,2014/08/29,1143.0,1147.228,1155.0,4398300,1157.0,1136.0
5,2014/09/01,1157.0,1149.835,1142.0,2260000,1159.0,1138.0
6,2014/09/02,1178.0,1171.256,1166.0,2183100,1181.0,1156.0
7,2014/09/03,1184.0,1185.215,1184.0,2486400,1197.0,1177.0
8,2014/09/04,1186.0,1186.433,1186.0,1910900,1195.0,1178.0
9,2014/09/05,1208.0,1201.628,1195.0,3165300,1210.0,1185.0
10,2014/09/08,1190.0,1189.656,1204.0,1962200,1204.0,1182.0
11,2014/09/09,1206.0,1206.7,1209.0,1532100,1212.0,1201.0
12,2014/09/10,1237.0,1226.969,1209.0,2705000,1237.0,1207.0
13,2014/09/11,1228.0,1231.853,1248.0,1814500,1256.0,1221.0
14,2014/09/12,1231.0,1223.717,1220.0,4253600,1234.0,1216.0
15,2014/09/16,1226.0,1225.578,1222.0,1520500,1231.0,1221.0
16,2014/09/17,1212.0,1217.841,1221.0,1800200,1228.0,1212.0
17,2014/09/18,1236.0,1228.844,1218.0,2150500,1240.0,1215.0
18,2014/09/19,1270.0,1267.436,1245.0,2901100,1280.0,1239.0
19,2014/09/22,1255.0,1254.351,1264.0,2015100,1265.0,1244.0
20,2014/09/24,1209.0,1217.401,1245.0,4664100,1245.0,1202.0
21,2014/09/25,1255.0,1245.403,1231.0,3050900,1255.0,1225.0
22,2014/09/26,1223.0,1227.838,1230.0,2898800,1239.0,1220.0
23,2014/09/29,1203.0,1211.362,1243.0,4979500,1244.0,1195.0
24,2014/09/30,1184.0,1182.688,1205.0,4843300,1205.0,1174.0
25,2014/10/01,1173.0,1179.212,1188.0,2792000,1193.0,1168.0
26,2014/10/02,1138.0,1147.878,1164.0,3481700,1172.0,1134.0
27,2014/10/03,1155.0,1148.983,1133.0,3058500,1156.0,1132.0
28,2014/10/06,1170.0,1171.149,1173.0,2181200,1179.0,1161.0
29,2014/10/07,1167.0,1170.467,1165.0,1930000,1177.0,1162.0
30,2014/10/08,1175.0,1176.382,1165.0,4013900,1190.0,1163.0
31,2014/10/09,1147.0,1155.195,1180.0,2920800,1180.0,1143.0
32,2014/10/10,1128.0,1128.072,1129.0,3463000,1142.0,1110.0
33,2014/10/14,1097.0,1097.932,1091.0,3636900,1107.0,1088.0
34,2014/10/15,1123.0,1111.464,1103.0,2815400,1125.0,1094.0
35,2014/10/16,1080.0,1085.386,1084.0,4356400,1096.0,1075.0
36,2014/10/17,1050.0,1056.724,1076.0,4156900,1077.0,1046.0
37,2014/10/20,1092.0,1083.647,1077.0,3747400,1092.0,1068.0
38,2014/10/21,1075.0,1083.494,1094.0,2304800,1100.0,1072.0
39,2014/10/22,1108.0,1107.645,1120.0,2274200,1127.0,1095.0
40,2014/10/23,1099.0,1098.128,1095.0,1474800,1106.0,1087.0
41,2014/10/24,1112.0,1112.626,1115.0,1910800,1121.0,1105.0
42,2014/10/27,1124.0,1122.045,1124.0,2021700,1127.0,1114.0
43,2014/10/28,1138.0,1139.038,1127.0,3025200,1148.0,1124.0
44,2014/10/29,1162.0,1159.015,1152.0,2534900,1165.0,1152.0
45,2014/10/30,1169.0,1170.81,1170.0,5046700,1183.0,1145.0
46,2014/10/31,1214.0,1201.711,1172.0,3973100,1224.0,1172.0
47,2014/11/04,1263.0,1255.652,1245.0,5330300,1279.0,1210.0
48,2014/11/05,1266.0,1258.307,1265.0,4015100,1277.0,1235.0
49,2014/11/06,1269.0,1275.119,1274.0,3319900,1288.0,1262.0
50,2014/11/07,1264.0,1270.118,1280.0,2232500,1284.0,1261.0
51,2014/11/10,1261.0,1258.31,1258.0,1613200,1265.0,1245.0
52,2014/11/11,1280.0,1278.213,1273.0,2185700,1289.0,1266.0
53,2014/11/12,1289.0,1300.534,1293.0,2788500,1313.0,1285.0
54,2014/11/13,1300.0,1293.457,1287.0,1706700,1301.0,1274.0
55,2014/11/14,1314.0,1315.766,1323.0,2701600,1324.0,1300.0
56,2014/11/17,1275.0,1287.257,1319.0,2519100,1320.0,1270.0
57,2014/11/18,1316.0,1306.808,1287.0,2097500,1317.0,1287.0
58,2014/11/19,1330.0,1331.187,1325.0,2426400,1342.0,1324.0
59,2014/11/20,1345.0,1346.14,1348.0,2671600,1359.0,1336.0
60,2014/11/21,1342.0,1332.49,1333.0,2946400,1345.0,1318.0
61,2014/11/25,1350.0,1353.329,1356.0,2709200,1364.0,1348.0
62,2014/11/26,1359.0,1358.306,1345.0,2103400,1365.0,1344.0
63,2014/11/27,1329.0,1333.884,1350.0,2086200,1352.0,1324.0
64,2014/11/28,1384.0,1372.26,1330.0,4248700,1392.0,1325.0
65,2014/12/01,1420.0,1416.324,1414.0,2283600,1427.0,1396.0
66,2014/12/02,1449.0,1442.046,1420.0,2359300,1455.0,1408.0
67,2014/12/03,1441.0,1452.724,1473.0,2589300,1477.0,1440.0
68,2014/12/04,1441.0,1444.341,1450.0,1731500,1459.0,1435.0
69,2014/12/05,1461.0,1452.778,1451.0,1822600,1465.0,1433.0
70,2014/12/08,1457.0,1461.775,1473.0,1717100,1477.0,1451.0
71,2014/12/09,1415.0,1426.555,1433.0,1839500,1448.0,1414.0
72,2014/12/10,1380.0,1382.4,1389.0,2667800,1404.0,1367.0
73,2014/12/11,1361.0,1354.348,1345.0,2421300,1365.0,1336.0
74,2014/12/12,1388.0,1373.022,1358.0,4193300,1405.0,1357.0
75,2014/12/15,1343.0,1349.738,1360.0,2823800,1365.0,1333.0
76,2014/12/16,1308.0,1316.078,1321.0,3029100,1340.0,1307.0
77,2014/12/17,1320.0,1320.937,1312.0,3366700,1344.0,1301.0
78,2014/12/18,1336.0,1346.81,1349.0,2394900,1363.0,1332.0
79,2014/12/19,1370.0,1365.02,1367.0,3732300,1371.0,1350.0
80,2014/12/22,1373.0,1370.918,1379.0,1374500,1384.0,1361.0
81,2014/12/24,1390.0,1393.236,1395.0,1419600,1400.0,1387.0
82,2014/12/25,1350.0,1346.545,1350.0,3410700,1368.0,1328.0
83,2014/12/26,1360.0,1357.177,1353.0,2257000,1372.0,1346.0
84,2014/12/29,1352.0,1351.051,1374.0,2143200,1375.0,1333.0
85,2014/12/30,1325.0,1334.645,1342.0,1613900,1349.0,1325.0
86,2015/01/05,1309.0,1312.371,1324.0,3119200,1328.0,1297.0
87,2015/01/06,1253.0,1260.116,1279.0,4251300,1280.0,1248.0
88,2015/01/07,1262.0,1265.801,1255.0,2848900,1278.0,1255.0
89,2015/01/08,1271.0,1270.889,1273.0,2318100,1281.0,1257.0
90,2015/01/09,1264.0,1270.841,1283.0,2481900,1288.0,1256.0
91,2015/01/13,1256.0,1244.171,1254.0,2333900,1258.0,1226.0
92,2015/01/14,1236.0,1236.323,1235.0,3307700,1250.0,1227.0
93,2015/01/15,1260.0,1253.091,1236.0,1793300,1265.0,1236.0
94,2015/01/16,1234.0,1226.583,1215.0,2968400,1243.0,1214.0
95,2015/01/19,1244.0,1243.272,1246.0,1471900,1250.0,1234.0
96,2015/01/20,1288.0,1281.553,1262.0,2245800,1290.0,1259.0
97,2015/01/21,1272.0,1270.492,1287.0,2036800,1288.0,1257.0
98,2015/01/22,1261.0,1256.704,1270.0,1808400,1272.0,1248.0
99,2015/01/23,1272.0,1276.931,1286.0,1645500,1293.0,1266.0
100,2015/01/26,1283.0,1275.675,1261.0,1980100,1283.0,1256.0
101,2015/01/27,1289.0,1294.674,1301.0,1852100,1312.0,1283.0
102,2015/01/28,1274.0,1276.336,1268.0,1904800,1286.0,1266.0
103,2015/01/29,1283.0,1283.556,1266.0,2503400,1299.0,1264.0
104,2015/01/30,1306.0,1308.088,1307.0,3250300,1318.0,1294.0
105,2015/02/02,1183.0,1194.732,1188.0,5430600,1230.0,1163.0
106,2015/02/03,1156.0,1157.792,1176.0,4403800,1178.0,1146.0
107,2015/02/04,1183.0,1190.092,1173.0,4353000,1205.0,1170.0
108,2015/02/05,1158.0,1159.532,1167.0,3691000,1175.0,1151.0
109,2015/02/06,1175.0,1180.506,1191.0,3298900,1198.0,1171.0
110,2015/02/09,1180.0,1181.19,1189.0,1530100,1191.0,1172.0
111,2015/02/10,1189.0,1185.565,1180.0,2218300,1196.0,1178.0
112,2015/02/12,1215.0,1219.72,1224.0,3530200,1236.0,1208.0
113,2015/02/13,1180.0,1183.694,1199.0,4669400,1219.0,1161.0
114,2015/02/16,1177.0,1182.271,1201.0,1560100,1201.0,1175.0
115,2015/02/17,1174.0,1171.638,1174.0,2349900,1180.0,1164.0
116,2015/02/18,1218.0,1210.783,1201.0,3305900,1224.0,1186.0
117,2015/02/19,1230.0,1229.877,1243.0,3122500,1250.0,1218.0
118,2015/02/20,1247.0,1248.849,1237.0,2432300,1257.0,1234.0
119,2015/02/23,1263.0,1264.109,1268.0,2069800,1275.0,1255.0
120,2015/02/24,1249.0,1247.97,1265.0,2394800,1265.0,1240.0
121,2015/02/25,1229.0,1232.575,1257.0,2270100,1257.0,1221.0
122,2015/02/26,1219.0,1216.69,1224.0,3997800,1237.0,1209.0
123,2015/02/27,1220.0,1221.083,1229.0,2111900,1229.0,1214.0
124,2015/03/02,1231.0,1228.463,1225.0,1534800,1237.0,1219.0
125,2015/03/03,1227.0,1227.089,1239.0,2011400,1246.0,1221.0
126,2015/03/04,1227.0,1217.926,1220.0,2350900,1229.0,1203.0
127,2015/03/05,1237.0,1230.252,1213.0,1820000,1240.0,1211.0
128,2015/03/06,1255.0,1251.059,1233.0,2492700,1260.0,1232.0
129,2015/03/09,1233.0,1232.51,1246.0,1795900,1246.0,1223.0
130,2015/03/10,1225.0,1228.47,1236.0,1743500,1247.0,1216.0
131,2015/03/11,1224.0,1225.8,1219.0,1578700,1237.0,1207.0
132,2015/03/12,1227.0,1227.134,1232.0,1589600,1235.0,1223.0
133,2015/03/13,1229.0,1234.734,1236.0,3794100,1242.0,1221.0
134,2015/03/16,1220.0,1220.167,1228.0,2473600,1230.0,1212.0
135,2015/03/17,1258.0,1254.303,1232.0,2526300,1270.0,1228.0
136,2015/03/18,1277.0,1274.131,1262.0,2520200,1283.0,1262.0
137,2015/03/19,1273.0,1272.967,1280.0,1744400,1290.0,1264.0
138,2015/03/20,1281.0,1275.922,1273.0,1473000,1281.0,1260.0
139,2015/03/23,1285.0,1290.51,1293.0,2636500,1302.0,1278.0
140,2015/03/24,1255.0,1255.105,1272.0,3270600,1276.0,1241.0
141,2015/03/25,1275.0,1270.824,1258.0,2181900,1279.0,1256.0
142,2015/03/26,1253.0,1251.631,1263.0,3039800,1263.0,1236.0
143,2015/03/27,1237.0,1241.011,1249.0,3382100,1263.0,1217.0
144,2015/03/30,1225.0,1226.528,1240.0,2135700,1240.0,1213.0
145,2015/03/31,1221.0,1230.694,1252.0,2918900,1253.0,1219.0
146,2015/04/01,1232.0,1232.835,1228.0,3690000,1243.0,1222.0
147,2015/04/02,1245.0,1248.304,1242.0,2477900,1258.0,1236.0
148,2015/04/03,1256.0,1258.069,1248.0,1360700,1264.0,1248.0
149,2015/04/06,1254.0,1249.448,1245.0,1291100,1260.0,1236.0
150,2015/04/07,1265.0,1265.922,1259.0,1708100,1274.0,1252.0
151,2015/04/08,1288.0,1289.152,1282.0,3404000,1295.0,1281.0
152,2015/04/09,1327.0,1317.801,1300.0,4043300,1328.0,1297.0
153,2015/04/10,1326.0,1324.215,1326.0,3291100,1332.0,1310.0
154,2015/04/13,1329.0,1330.37,1325.0,2039900,1337.0,1324.0
155,2015/04/14,1331.0,1332.2,1325.0,1413600,1340.0,1325.0
156,2015/04/15,1323.0,1320.951,1325.0,1786500,1325.0,1316.0
157,2015/04/16,1340.0,1332.211,1324.0,1863800,1343.0,1319.0
158,2015/04/17,1338.0,1341.391,1345.0,2149200,1350.0,1333.0
159,2015/04/20,1324.0,1321.79,1311.0,1786100,1330.0,1310.0
160,2015/04/21,1331.0,1327.746,1318.0,1278900,1334.0,1317.0
161,2015/04/22,1347.0,1347.451,1344.0,1892900,1353.0,1341.0
162,2015/04/23,1353.0,1358.776,1358.0,1798400,1377.0,1349.0
163,2015/04/24,1362.0,1362.546,1350.0,1620400,1371.0,1350.0
164,2015/04/27,1365.0,1367.492,1374.0,1586400,1377.0,1362.0
165,2015/04/28,1356.0,1359.755,1376.0,1685000,1376.0,1350.0
166,2015/04/30,1329.0,1328.718,1326.0,2298300,1339.0,1316.0
167,2015/05/01,1317.0,1312.344,1325.0,2017700,1327.0,1299.0
168,2015/05/07,1311.0,1308.574,1287.0,2051300,1321.0,1287.0
169,2015/05/08,1323.0,1320.883,1308.0,1854600,1332.0,1308.0
170,2015/05/11,1341.0,1336.307,1338.0,2029700,1344.0,1324.0
171,2015/05/12,1337.0,1331.147,1329.0,2394300,1343.0,1314.0
172,2015/05/13,1355.0,1355.917,1342.0,2541400,1364.0,1339.0
173,2015/05/14,1516.0,1505.418,1460.0,9449600,1557.0,1452.0
174,2015/05/15,1509.0,1516.638,1514.0,4169100,1538.0,1503.0
175,2015/05/18,1549.0,1548.412,1513.0,2514600,1565.0,1509.0
176,2015/05/19,1593.0,1596.567,1560.0,3394000,1620.0,1560.0
177,2015/05/20,1630.0,1626.567,1593.0,2862800,1642.0,1588.0
178,2015/05/21,1593.0,1617.083,1632.0,3672700,1652.0,1587.0
179,2015/05/22,1588.0,1573.215,1563.0,4298200,1596.0,1552.0
180,2015/05/25,1557.0,1565.963,1586.0,3738600,1586.0,1552.0
181,2015/05/26,1557.0,1562.943,1575.0,2124400,1577.0,1553.0
182,2015/05/27,1552.0,1530.659,1503.0,4334500,1553.0,1502.0
183,2015/05/28,1560.0,1564.339,1576.0,3335300,1583.0,1552.0
184,2015/05/29,1568.0,1561.751,1552.0,3961900,1575.0,1542.0
185,2015/06/01,1579.0,1574.137,1555.0,2552400,1588.0,1551.0
186,2015/06/02,1570.0,1565.74,1556.0,2784700,1579.0,1555.0
187,2015/06/03,1568.0,1569.081,1560.0,3143000,1584.0,1554.0
188,2015/06/04,1587.0,1587.238,1567.0,2704300,1604.0,1558.0
189,2015/06/05,1569.0,1568.29,1580.0,1747900,1583.0,1556.0
190,2015/06/08,1568.0,1570.198,1582.0,1198100,1585.0,1560.0
191,2015/06/09,1531.0,1538.931,1564.0,2406700,1564.0,1529.0
192,2015/06/10,1507.0,1513.059,1521.0,3697900,1530.0,1501.0
193,2015/06/11,1527.0,1523.482,1528.0,1688500,1532.0,1513.0
194,2015/06/12,1532.0,1520.066,1514.0,3648300,1534.0,1513.0
195,2015/06/15,1510.0,1508.688,1511.0,1721100,1514.0,1496.0
196,2015/06/16,1484.0,1485.226,1501.0,3515300,1506.0,1475.0
197,2015/06/17,1477.0,1479.79,1476.0,2152000,1497.0,1471.0
198,2015/06/18,1469.0,1469.416,1469.0,1741500,1478.0,1462.0
199,2015/06/19,1482.0,1486.233,1471.0,3789100,1502.0,1471.0
200,2015/06/22,1516.0,1527.011,1506.0,3551700,1556.0,1506.0
201,2015/06/23,1542.0,1531.671,1511.0,2138600,1546.0,1507.0
202,2015/06/24,1483.0,1492.727,1474.0,5389200,1530.0,1474.0
203,2015/06/25,1476.0,1483.888,1483.0,2596700,1501.0,1476.0
204,2015/06/26,1448.0,1451.895,1474.0,3003800,1475.0,1441.0
205,2015/06/29,1411.0,1407.846,1397.0,3882600,1418.0,1383.0
206,2015/06/30,1429.0,1429.43,1420.0,4308000,1442.0,1415.0
207,2015/07/01,1433.0,1433.537,1420.0,2697800,1442.0,1420.0
208,2015/07/02,1454.0,1460.171,1463.0,3934200,1490.0,1451.0
209,2015/07/03,1480.0,1470.015,1463.0,1951700,1481.0,1453.0
210,2015/07/06,1443.0,1444.314,1444.0,2411000,1463.0,1430.0
211,2015/07/07,1467.0,1468.616,1464.0,2402500,1478.0,1463.0
212,2015/07/08,1435.0,1440.686,1457.0,2394100,1457.0,1433.0
213,2015/07/09,1450.0,1421.468,1413.0,3416900,1451.0,1376.0
214,2015/07/10,1448.0,1447.033,1452.0,2715800,1459.0,1429.0
215,2015/07/13,1481.0,1477.438,1464.0,2732900,1490.0,1460.0
216,2015/07/14,1502.0,1504.612,1510.0,2264200,1514.0,1490.0
217,2015/07/15,1518.0,1518.398,1519.0,2215300,1528.0,1506.0
218,2015/07/16,1518.0,1515.312,1527.0,2640900,1527.0,1506.0
219,2015/07/17,1533.0,1529.397,1522.0,1894200,1535.0,1517.0
220,2015/07/21,1542.0,1546.665,1542.0,1551200,1560.0,1531.0
221,2015/07/22,1505.0,1510.302,1518.0,2765700,1523.0,1501.0
222,2015/07/23,1503.0,1517.418,1531.0,2452000,1545.0,1497.0
223,2015/07/24,1500.0,1510.027,1517.0,1769300,1535.0,1499.0
224,2015/07/27,1492.0,1488.604,1488.0,1713000,1499.0,1481.0
225,2015/07/28,1495.0,1488.092,1481.0,1286000,1506.0,1470.0
226,2015/07/29,1500.0,1505.039,1506.0,1496200,1519.0,1496.0
227,2015/07/30,1515.0,1523.615,1524.0,3330500,1538.0,1512.0
228,2015/07/31,1547.0,1540.76,1514.0,2451500,1560.0,1503.0
229,2015/08/03,1558.0,1553.054,1559.0,2538500,1564.0,1536.0
230,2015/08/04,1558.0,1554.457,1554.0,1491200,1564.0,1542.0
231,2015/08/05,1569.0,1563.16,1555.0,1494600,1579.0,1537.0
232,2015/08/06,1573.0,1571.948,1566.0,2082100,1591.0,1556.0
233,2015/08/07,1439.0,1444.248,1490.0,7314500,1500.0,1416.0
234,2015/08/10,1434.0,1435.47,1464.0,3252000,1474.0,1419.0
235,2015/08/11,1438.0,1438.742,1445.0,2350500,1454.0,1428.0
236,2015/08/12,1418.0,1416.908,1425.0,1969200,1429.0,1407.0
237,2015/08/13,1421.0,1422.965,1418.0,1344900,1434.0,1415.0
238,2015/08/14,1417.0,1411.175,1420.0,2037300,1423.0,1399.0
239,2015/08/17,1412.0,1411.732,1419.0,1075100,1428.0,1406.0
240,2015/08/18,1416.0,1418.265,1412.0,1280500,1427.0,1405.0
241,2015/08/19,1400.0,1414.16,1424.0,2275900,1437.0,1399.0
242,2015/08/20,1403.0,1405.033,1397.0,1752000,1416.0,1396.0
243,2015/08/21,1362.0,1368.99,1376.0,3350300,1389.0,1355.0
244,2015/08/24,1312.0,1319.768,1332.0,4274700,1343.0,1303.0
245,2015/08/25,1269.0,1289.924,1265.0,4198300,1332.0,1246.0
246,2015/08/26,1303.0,1282.244,1254.0,3782000,1307.0,1253.0
247,2015/08/27,1299.0,1309.402,1332.0,2737500,1334.0,1295.0
248,2015/08/28,1345.0,1337.879,1320.0,2063500,1354.0,1316.0
249,2015/08/31,1332.0,1334.837,1351.0,2422000,1356.0,1317.0
250,2015/09/01,1289.0,1299.706,1327.0,2025200,1328.0,1288.0
251,2015/09/02,1265.0,1272.925,1266.0,3026100,1298.0,1254.0
252,2015/09/03,1284.0,1289.987,1286.0,2413000,1307.0,1280.0
253,2015/09/04,1250.0,1254.061,1290.0,2367900,1291.0,1233.0
254,2015/09/07,1247.0,1235.474,1234.0,2810000,1249.0,1214.0
255,2015/09/08,1239.0,1244.565,1253.0,1572100,1266.0,1234.0
256,2015/09/09,1311.0,1299.149,1285.0,3473500,1311.0,1273.0
257,2015/09/10,1305.0,1293.241,1276.0,2027100,1309.0,1271.0
258,2015/09/11,1312.0,1307.73,1301.0,3869800,1325.0,1294.0
259,2015/09/14,1283.0,1287.646,1319.0,1956600,1322.0,1273.0
260,2015/09/15,1291.0,1291.078,1291.0,3037900,1306.0,1267.0
261,2015/09/16,1323.0,1321.378,1307.0,1962300,1334.0,1302.0
262,2015/09/17,1341.0,1342.116,1340.0,2250500,1353.0,1331.0
263,2015/09/18,1317.0,1318.743,1325.0,3221100,1328.0,1303.0
264,2015/09/24,1304.0,1308.839,1305.0,3572400,1329.0,1294.0
265,2015/09/25,1302.0,1290.195,1300.0,3271000,1306.0,1264.0
266,2015/09/28,1274.0,1275.761,1297.0,1413300,1298.0,1265.0
267,2015/09/29,1224.0,1227.804,1254.0,2911600,1254.0,1217.0
268,2015/09/30,1254.0,1250.169,1245.0,2188900,1261.0,1234.0
269,2015/10/01,1249.0,1241.175,1247.0,3367400,1258.0,1215.0
270,2015/10/02,1264.0,1256.208,1241.0,1973900,1270.0,1233.0
271,2015/10/05,1266.0,1262.409,1274.0,1851900,1274.0,1254.0
272,2015/10/06,1293.0,1297.098,1284.0,2454300,1309.0,1273.0
273,2015/10/07,1326.0,1320.914,1294.0,2155200,1331.0,1294.0
274,2015/10/08,1336.0,1343.817,1328.0,2282600,1358.0,1320.0
275,2015/10/09,1375.0,1366.192,1349.0,2778700,1380.0,1341.0
276,2015/10/13,1371.0,1372.584,1379.0,1603700,1384.0,1362.0
277,2015/10/14,1344.0,1343.824,1367.0,2671700,1374.0,1330.0
278,2015/10/15,1359.0,1354.954,1339.0,1742200,1366.0,1335.0
279,2015/10/16,1370.0,1371.614,1366.0,2008600,1381.0,1360.0
280,2015/10/19,1362.0,1362.856,1369.0,1418900,1375.0,1350.0
281,2015/10/20,1368.0,1364.566,1359.0,1383400,1370.0,1350.0
282,2015/10/21,1403.0,1397.923,1362.0,2270500,1413.0,1356.0
283,2015/10/22,1376.0,1378.075,1381.0,2362300,1396.0,1367.0
284,2015/10/23,1406.0,1409.257,1410.0,2187500,1417.0,1399.0
285,2015/10/26,1426.0,1430.034,1428.0,1413400,1438.0,1424.0
286,2015/10/27,1416.0,1418.67,1425.0,1764800,1431.0,1409.0
287,2015/10/28,1370.0,1368.821,1392.0,3913900,1401.0,1355.0
288,2015/10/29,1382.0,1386.033,1398.0,4238400,1414.0,1368.0
289,2015/10/30,1251.0,1262.153,1262.0,8870900,1301.0,1244.0
290,2015/11/02,1223.0,1219.896,1213.0,4041900,1231.0,1208.0
291,2015/11/04,1249.0,1254.647,1258.0,4546300,1265.0,1242.0
292,2015/11/05,1256.0,1256.099,1253.0,2765500,1263.0,1248.0
293,2015/11/06,1271.0,1270.21,1271.0,1913700,1279.0,1260.0
294,2015/11/09,1292.0,1288.653,1281.0,1899300,1294.0,1273.0
295,2015/11/10,1275.0,1270.303,1271.0,2734800,1278.0,1259.0
296,2015/11/11,1281.0,1273.305,1272.0,2781600,1286.0,1256.0
297,2015/11/12,1281.0,1280.603,1278.0,2159700,1286.0,1264.0
298,2015/11/13,1270.0,1266.487,1266.0,2397600,1272.0,1258.0
299,2015/11/16,1252.0,1248.345,1240.0,2047200,1260.0,1238.0
300,2015/11/17,1265.0,1270.562,1268.0,2578200,1281.0,1264.0
301,2015/11/18,1266.0,1268.522,1274.0,1581500,1277.0,1263.0
302,2015/11/19,1292.0,1286.538,1274.0,3736000,1297.0,1267.0
303,2015/11/20,1283.0,1278.193,1280.0,2151800,1285.0,1272.0
304,2015/11/24,1265.0,1262.148,1272.0,3421100,1272.0,1254.0
305,2015/11/25,1276.0,1269.553,1256.0,2685100,1276.0,1254.0
306,2015/11/26,1283.0,1285.604,1277.0,2576600,1303.0,1276.0
307,2015/11/27,1290.0,1293.147,1292.0,2026300,1304.0,1287.0
308,2015/11/30,1294.0,1294.002,1290.0,4061200,1306.0,1283.0
309,2015/12/01,1317.0,1315.362,1303.0,2396700,1326.0,1300.0
310,2015/12/02,1312.0,1315.315,1319.0,1855900,1328.0,1309.0
311,2015/12/03,1321.0,1321.657,1311.0,1824900,1332.0,1308.0
312,2015/12/04,1296.0,1295.106,1297.0,2452500,1308.0,1288.0
313,2015/12/07,1302.0,1308.07,1314.0,1801700,1320.0,1300.0
314,2015/12/08,1285.0,1286.134,1301.0,1729800,1306.0,1274.0
315,2015/12/09,1259.0,1261.943,1291.0,3004000,1293.0,1249.0
316,2015/12/10,1242.0,1239.776,1244.0,1996300,1246.0,1228.0
317,2015/12/11,1228.0,1223.19,1218.0,4637300,1237.0,1215.0
318,2015/12/14,1217.0,1210.535,1206.0,2976800,1223.0,1193.0
319,2015/12/15,1198.0,1200.41,1211.0,2614900,1214.0,1196.0
320,2015/12/16,1215.0,1216.159,1217.0,1576100,1224.0,1210.0
321,2015/12/17,1223.0,1230.929,1247.0,2486300,1247.0,1222.0
322,2015/12/18,1197.0,1211.268,1222.0,3224900,1241.0,1195.0
323,2015/12/21,1191.0,1182.883,1187.0,1983400,1192.0,1169.0
324,2015/12/22,1191.0,1189.35,1186.0,1481600,1195.0,1181.0
325,2015/12/24,1192.0,1197.134,1205.0,1158000,1214.0,1187.0
326,2015/12/25,1187.0,1187.537,1192.0,954800,1196.0,1181.0
327,2015/12/28,1210.0,1210.052,1194.0,1590600,1225.0,1189.0
328,2015/12/29,1225.0,1222.75,1214.0,1521700,1232.0,1204.0
329,2015/12/30,1222.0,1227.87,1222.0,1836700,1244.0,1216.0
330,2016/01/04,1196.0,1202.084,1214.0,1743700,1226.0,1192.0
331,2016/01/05,1183.0,1185.663,1187.0,2525100,1197.0,1177.0
332,2016/01/06,1132.0,1139.108,1169.0,4590200,1169.0,1125.0
333,2016/01/07,1104.0,1112.754,1125.0,3523500,1133.0,1102.0
334,2016/01/08,1104.0,1108.342,1089.0,3687900,1130.0,1084.0
335,2016/01/12,1071.0,1072.055,1082.0,3173400,1089.0,1060.0
336,2016/01/13,1102.0,1102.097,1081.0,2184100,1118.0,1081.0
337,2016/01/14,1080.0,1071.744,1074.0,2383700,1090.0,1061.0
338,2016/01/15,1064.0,1072.026,1099.0,2962100,1104.0,1057.0
339,2016/01/18,1058.0,1051.906,1040.0,1612200,1063.0,1035.0
340,2016/01/19,1070.0,1064.201,1057.0,1662900,1076.0,1050.0
341,2016/01/20,1031.0,1038.341,1065.0,2206900,1076.0,1027.0
342,2016/01/21,1008.0,1032.038,1036.0,2590800,1055.0,1008.0
343,2016/01/22,1076.0,1061.612,1042.0,3514200,1081.0,1039.0
344,2016/01/25,1087.0,1086.653,1094.0,2073500,1100.0,1075.0
345,2016/01/26,1064.0,1068.275,1073.0,2104900,1087.0,1059.0
346,2016/01/27,1094.0,1092.214,1080.0,2498800,1104.0,1078.0
347,2016/01/28,1050.0,1059.051,1084.0,3613400,1086.0,1048.0
348,2016/01/29,1001.0,988.271,975.0,7891700,1010.0,958.0
349,2016/02/01,1009.0,1010.715,1031.0,5026700,1032.0,1001.0
350,2016/02/02,1005.0,1007.91,1006.0,2767700,1019.0,1001.0
351,2016/02/03,962.0,967.757,989.0,3772600,990.0,957.0
352,2016/02/04,974.0,973.152,967.0,3260800,987.0,952.0
353,2016/02/05,977.0,976.076,964.0,2987200,986.0,963.0
354,2016/02/08,974.0,969.933,965.0,2670400,980.0,955.0
355,2016/02/09,928.0,932.954,950.0,3318400,951.0,922.0
356,2016/02/10,903.0,908.706,928.0,4025500,933.0,893.0
357,2016/02/12,852.0,862.285,862.0,5889000,875.0,849.0
358,2016/02/15,924.0,915.908,895.0,3626800,936.0,889.0
359,2016/02/16,937.0,936.242,917.0,2947700,951.0,915.0
360,2016/02/17,927.0,935.121,936.0,2772700,963.0,915.0
361,2016/02/18,943.0,946.266,942.0,3456900,959.0,933.0
362,2016/02/19,917.0,919.089,939.0,2919500,949.0,904.0
363,2016/02/22,922.0,918.534,903.0,1911500,927.0,899.0
364,2016/02/23,938.0,941.103,930.0,2266800,958.0,928.0
365,2016/02/24,928.0,925.264,925.0,1918900,935.0,914.0
366,2016/02/25,944.0,942.574,941.0,2223700,959.0,933.0
367,2016/02/26,956.0,957.363,955.0,2015200,967.0,950.0
368,2016/02/29,947.0,959.896,971.0,2277800,981.0,947.0
369,2016/03/01,927.0,922.305,938.0,2790800,940.0,907.0
370,2016/03/02,979.0,976.512,957.0,2695200,984.0,955.0
371,2016/03/03,994.0,987.019,971.0,2189600,996.0,966.0
372,2016/03/04,1015.0,1010.983,998.0,2057300,1019.0,991.0
373,2016/03/07,1011.0,1014.332,1017.0,1623200,1024.0,1009.0
374,2016/03/08,1009.0,1005.315,1018.0,3012400,1023.0,989.0
375,2016/03/09,985.0,984.225,997.0,2487600,1002.0,972.0
376,2016/03/10,1003.0,999.876,998.0,1847900,1006.0,981.0
377,2016/03/11,1030.0,1010.948,991.0,4658400,1031.0,988.0
378,2016/03/14,1039.0,1037.367,1041.0,1691500,1044.0,1029.0
379,2016/03/15,1030.0,1031.407,1037.0,2384300,1042.0,1025.0
380,2016/03/16,1013.0,1013.272,1013.0,2116300,1019.0,1007.0
381,2016/03/17,1017.0,1021.728,1029.0,2448200,1046.0,1002.0
382,2016/03/18,1006.0,999.522,1002.0,2319600,1011.0,990.0
383,2016/03/22,1017.0,1018.007,1021.0,1756100,1036.0,1002.0
384,2016/03/23,1007.0,1009.475,1017.0,1060500,1020.0,1005.0
385,2016/03/24,975.0,984.178,1008.0,2689300,1009.0,974.0
386,2016/03/25,992.0,988.901,979.0,1393800,995.0,977.0
387,2016/03/28,990.0,990.449,1004.0,2110700,1012.0,978.0
388,2016/03/29,995.0,993.062,983.0,1688200,1001.0,977.0
389,2016/03/30,951.0,963.9,996.0,3214600,999.0,950.0
390,2016/03/31,956.0,961.247,960.0,2489000,969.0,953.0
391,2016/04/01,905.0,915.121,948.0,3985500,952.0,900.0
392,2016/04/04,913.0,915.301,919.0,2249800,931.0,907.0
393,2016/04/05,876.0,881.541,899.0,2193300,908.0,874.0
394,2016/04/06,883.0,885.143,874.0,2495800,900.0,872.0
395,2016/04/07,883.0,886.202,882.0,1989500,900.0,876.0
396,2016/04/08,897.0,891.743,875.0,2617200,912.0,872.0
397,2016/04/11,911.0,899.278,897.0,2979400,915.0,878.0
398,2016/04/12,926.0,918.512,902.0,2484600,928.0,887.0
399,2016/04/13,953.0,948.579,940.0,1865900,955.0,934.0
400,2016/04/14,988.0,983.108,972.0,3504600,992.0,968.0
401,2016/04/15,968.0,968.835,966.0,2269700,976.0,963.0
402,2016/04/18,933.0,935.897,934.0,2806900,946.0,928.0
403,2016/04/19,973.0,970.014,963.0,2452200,977.0,961.0
404,2016/04/20,981.0,986.467,985.0,2142300,1000.0,979.0
405,2016/04/21,1003.0,999.694,1000.0,2535400,1006.0,986.0
406,2016/04/22,1022.0,1013.769,1017.0,2993500,1024.0,998.0
407,2016/04/25,1033.0,1033.569,1026.0,2173100,1044.0,1022.0
408,2016/04/26,1026.0,1025.847,1033.0,1757400,1036.0,1017.0
409,2016/04/27,1003.0,1005.926,1031.0,2825800,1032.0,997.0
410,2016/04/28,968.0,988.599,1026.0,3915100,1031.0,966.0
411,2016/05/02,912.0,908.297,914.0,3462100,923.0,896.0
412,2016/05/06,929.0,924.286,927.0,4358700,941.0,909.0
413,2016/05/09,938.0,939.026,933.0,2047700,948.0,929.0
414,2016/05/10,946.0,937.022,916.0,2915600,950.0,915.0
415,2016/05/11,960.0,965.607,969.0,2145000,980.0,956.0
416,2016/05/12,965.0,959.58,945.0,2041400,967.0,936.0
417,2016/05/13,902.0,915.238,965.0,5182200,970.0,894.0
418,2016/05/16,914.0,914.994,896.0,2396900,926.0,896.0
419,2016/05/17,925.0,921.383,925.0,2120400,929.0,915.0
420,2016/05/18,933.0,929.397,920.0,2051900,939.0,913.0
421,2016/05/19,922.0,926.336,942.0,2360400,949.0,916.0
422,2016/05/20,917.0,914.339,921.0,2375300,924.0,904.0
423,2016/05/23,919.0,912.081,915.0,1910800,919.0,900.0
424,2016/05/24,904.0,905.271,915.0,2361400,916.0,900.0
425,2016/05/25,920.0,918.872,919.0,2039600,924.0,913.0
426,2016/05/26,919.0,923.977,933.0,2224900,940.0,916.0
427,2016/05/27,925.0,924.538,925.0,1415700,928.0,920.0
428,2016/05/30,942.0,937.464,940.0,1355300,942.0,929.0
429,2016/05/31,956.0,951.15,939.0,2477300,959.0,934.0
430,2016/06/01,945.0,949.456,964.0,2185800,964.0,940.0
431,2016/06/02,909.0,914.084,931.0,2931700,931.0,906.0
432,2016/06/03,888.0,892.152,901.0,3183900,908.0,882.0
433,2016/06/06,882.0,875.58,868.0,2123500,882.0,863.0
434,2016/06/07,894.0,890.941,886.0,2160500,896.0,883.0
435,2016/06/08,871.0,874.977,893.0,3255400,893.0,867.0
436,2016/06/09,863.0,860.604,867.0,3368600,870.0,855.0
437,2016/06/10,873.0,868.497,870.0,4485200,874.0,857.0
438,2016/06/13,833.0,842.411,860.0,2605400,860.0,833.0
439,2016/06/14,820.0,824.89,826.0,3251300,836.0,818.0
440,2016/06/15,827.0,826.781,820.0,2840700,834.0,813.0
441,2016/06/16,791.0,796.567,813.0,3975300,815.0,785.0
442,2016/06/17,798.0,799.823,804.0,4993800,811.0,793.0
443,2016/06/20,822.0,820.181,821.0,2480200,832.0,811.0
444,2016/06/21,834.0,830.706,825.0,2702600,839.0,814.0
445,2016/06/22,832.0,832.922,837.0,2255400,839.0,827.0
446,2016/06/23,841.0,835.073,828.0,1687300,842.0,823.0
447,2016/06/24,752.0,785.749,847.0,4775200,852.0,750.0
448,2016/06/27,740.0,740.929,766.0,2917900,767.0,729.0
449,2016/06/28,725.0,717.802,714.0,4678300,733.0,698.0
450,2016/06/29,742.0,739.445,726.0,3073400,747.0,726.0
451,2016/06/30,740.0,744.866,757.0,3515900,760.0,740.0
452,2016/07/01,747.0,748.228,755.0,2849400,763.0,742.0
453,2016/07/04,732.0,725.892,717.0,4605100,735.0,713.0
454,2016/07/05,727.0,725.746,730.0,2393700,732.0,720.0
455,2016/07/06,727.0,716.216,712.0,5986300,729.0,704.0
456,2016/07/07,715.0,716.623,720.0,3756300,729.0,712.0
457,2016/07/08,715.0,720.138,723.0,2523000,734.0,714.0
458,2016/07/11,747.0,741.464,738.0,3106600,751.0,731.0
459,2016/07/12,786.0,784.779,770.0,3382600,793.0,769.0
460,2016/07/13,792.0,801.327,825.0,4585300,825.0,788.0
461,2016/07/14,800.0,796.585,796.0,3076000,805.0,784.0
462,2016/07/15,797.0,797.655,785.0,4210500,808.0,785.0
463,2016/07/19,796.0,799.029,810.0,4128500,815.0,791.0
464,2016/07/20,784.0,786.855,794.0,3659500,799.0,779.0
465,2016/07/21,817.0,813.505,804.0,3487600,820.0,802.0
466,2016/07/22,809.0,819.663,811.0,4189400,843.0,804.0
467,2016/07/25,837.0,837.038,817.0,3819400,847.0,813.0
468,2016/07/26,807.0,807.835,829.0,2828900,831.0,800.0
469,2016/07/27,823.0,824.456,822.0,2767400,836.0,812.0
470,2016/07/28,831.0,821.063,813.0,6269700,871.0,796.0
471,2016/07/29,836.0,836.918,810.0,6328900,866.0,810.0
472,2016/08/01,825.0,820.267,824.0,3226500,827.0,804.0
473,2016/08/02,797.0,805.74,818.0,2866600,826.0,795.0
474,2016/08/03,770.0,774.561,783.0,3094800,783.0,768.0
475,2016/08/04,802.0,788.961,770.0,3318700,804.0,768.0
476,2016/08/05,812.0,815.235,808.0,3255400,827.0,803.0
477,2016/08/08,861.0,851.004,832.0,4288900,862.0,825.0
478,2016/08/09,898.0,888.102,871.0,5948800,902.0,865.0
479,2016/08/10,886.0,884.073,895.0,3120600,895.0,876.0
480,2016/08/12,895.0,894.388,896.0,2542400,899.0,887.0
481,2016/08/15,895.0,894.186,896.0,1741300,899.0,889.0
482,2016/08/16,877.0,884.495,894.0,3316200,896.0,876.0
483,2016/08/17,911.0,905.02,883.0,3176900,914.0,879.0
484,2016/08/18,875.0,881.397,888.0,3623900,897.0,873.0
485,2016/08/19,907.0,904.216,886.0,2911100,912.0,884.0
486,2016/08/22,901.0,898.767,902.0,2191700,904.0,890.0
487,2016/08/23,874.0,878.097,892.0,2776300,899.0,870.0
488,2016/08/24,892.0,891.564,874.0,2709600,897.0,874.0
489,2016/08/25,888.0,889.379,888.0,2705700,897.0,884.0
490,2016/08/26,873.0,875.556,886.0,1834100,889.0,867.0
491,2016/08/29,913.0,911.308,897.0,2678200,919.0,892.0
492,2016/08/30,909.0,911.753,912.0,2053200,922.0,906.0
493,2016/08/31,932.0,927.351,919.0,2816000,934.0,911.0
494,2016/09/01,928.0,927.982,935.0,2068100,935.0,920.0
495,2016/09/02,926.0,925.413,926.0,1623600,932.0,916.0
496,2016/09/05,941.0,947.209,943.0,2513600,956.0,939.0
497,2016/09/06,946.0,949.257,948.0,2249500,956.0,944.0
498,2016/09/07,918.0,915.916,920.0,3358300,927.0,910.0
499,2016/09/08,920.0,920.298,915.0,2610000,928.0,911.0
500,2016/09/09,924.0,922.889,917.0,2487200,933.0,917.0
501,2016/09/12,901.0,900.813,915.0,1739300,916.0,893.0
502,2016/09/13,885.0,880.621,890.0,3532200,893.0,872.0
503,2016/09/14,875.0,875.89,875.0,2438900,885.0,871.0
504,2016/09/15,855.0,853.389,867.0,4061000,868.0,841.0
505,2016/09/16,858.0,858.453,856.0,2338500,866.0,854.0
506,2016/09/20,866.0,863.102,849.0,2790900,868.0,845.0
507,2016/09/21,882.0,873.478,870.0,2844700,885.0,855.0
508,2016/09/23,874.0,873.529,885.0,1932900,886.0,868.0
509,2016/09/26,856.0,859.254,870.0,2772100,870.0,853.0
510,2016/09/27,866.0,851.371,840.0,2432700,866.0,830.0
511,2016/09/28,849.0,846.098,852.0,2589700,854.0,841.0
512,2016/09/29,868.0,867.838,861.0,2156300,873.0,854.0
513,2016/09/30,850.0,847.218,851.0,2342900,853.0,840.0
514,2016/10/03,853.0,853.96,858.0,1395900,859.0,849.0
515,2016/10/04,863.0,862.107,857.0,1832300,869.0,857.0
516,2016/10/05,873.0,869.35,868.0,2091600,876.0,860.0
517,2016/10/06,877.0,881.703,880.0,2185000,889.0,876.0
518,2016/10/07,897.0,892.223,881.0,2569800,897.0,879.0
519,2016/10/11,899.0,900.344,895.0,2094600,910.0,887.0
520,2016/10/12,886.0,888.963,891.0,1849100,898.0,883.0
521,2016/10/13,880.0,881.577,886.0,2095300,893.0,871.0
522,2016/10/14,884.0,876.991,868.0,2643700,890.0,868.0
523,2016/10/17,895.0,897.271,887.0,2259800,908.0,887.0
524,2016/10/18,897.0,895.82,895.0,2277900,900.0,888.0
525,2016/10/19,913.0,914.418,910.0,3328300,923.0,906.0
526,2016/10/20,924.0,920.345,913.0,2466300,925.0,907.0
527,2016/10/21,927.0,931.549,933.0,2128000,939.0,925.0
528,2016/10/24,929.0,928.153,930.0,1696400,933.0,921.0
529,2016/10/25,941.0,941.184,936.0,1837400,946.0,935.0
530,2016/10/26,936.0,932.64,937.0,1725000,938.0,925.0
531,2016/10/27,920.0,919.19,935.0,3679600,935.0,908.0
532,2016/10/28,932.0,926.354,900.0,6018200,944.0,897.0
533,2016/10/31,941.0,940.62,933.0,2653900,948.0,930.0
534,2016/11/01,937.0,934.763,935.0,2571500,942.0,924.0
535,2016/11/02,917.0,917.754,917.0,2693000,927.0,911.0
536,2016/11/04,917.0,912.575,907.0,2911000,922.0,903.0
537,2016/11/07,923.0,923.571,926.0,2680900,931.0,919.0
538,2016/11/08,930.0,930.984,929.0,1875600,936.0,926.0
539,2016/11/09,860.0,879.887,941.0,5597800,945.0,852.0
540,2016/11/10,927.0,924.917,915.0,3631900,933.0,908.0
541,2016/11/11,939.0,943.222,945.0,3949900,953.0,935.0
542,2016/11/14,964.0,961.786,950.0,2504600,970.0,942.0
543,2016/11/15,970.0,966.215,964.0,2393900,973.0,958.0
544,2016/11/16,978.0,975.754,975.0,2611800,980.0,967.0
545,2016/11/17,979.0,973.039,971.0,2207800,979.0,960.0
546,2016/11/18,988.0,989.313,992.0,2806600,998.0,985.0
547,2016/11/21,1001.0,1004.511,998.0,2942600,1014.0,998.0
548,2016/11/22,1029.0,1029.238,1031.0,3999900,1039.0,1024.0
549,2016/11/24,1058.0,1060.329,1059.0,4091300,1072.0,1053.0
550,2016/11/25,1082.0,1077.59,1063.0,4010600,1085.0,1059.0
551,2016/11/28,1077.0,1075.694,1083.0,3038300,1083.0,1068.0
552,2016/11/29,1075.0,1074.119,1067.0,2625100,1080.0,1066.0
553,2016/11/30,1092.0,1091.225,1080.0,5541400,1098.0,1077.0
554,2016/12/01,1108.0,1117.058,1118.0,3830200,1131.0,1104.0
555,2016/12/02,1115.0,1113.601,1110.0,3253500,1127.0,1100.0
556,2016/12/05,1102.0,1101.064,1112.0,2428300,1114.0,1092.0
557,2016/12/06,1112.0,1108.057,1104.0,2995700,1113.0,1098.0
558,2016/12/07,1120.0,1117.314,1111.0,3729500,1122.0,1107.0
559,2016/12/08,1131.0,1130.056,1130.0,4043300,1144.0,1121.0
560,2016/12/09,1145.0,1135.61,1121.0,5709900,1148.0,1121.0
561,2016/12/12,1136.0,1138.419,1153.0,3490400,1154.0,1120.0
562,2016/12/13,1130.0,1128.888,1126.0,3304300,1138.0,1120.0
563,2016/12/14,1138.0,1134.536,1126.0,2338000,1141.0,1122.0
564,2016/12/15,1143.0,1144.119,1140.0,2078600,1154.0,1136.0
565,2016/12/16,1168.0,1169.242,1161.0,3317900,1179.0,1160.0
566,2016/12/19,1161.0,1161.233,1169.0,1825100,1173.0,1156.0
567,2016/12/20,1152.0,1149.132,1154.0,2647100,1159.0,1140.0
568,2016/12/21,1160.0,1162.39,1161.0,3012800,1174.0,1151.0
569,2016/12/22,1164.0,1163.077,1171.0,2135100,1172.0,1156.0
570,2016/12/26,1159.0,1162.725,1172.0,1831100,1175.0,1157.0
571,2016/12/27,1165.0,1166.386,1159.0,1723700,1173.0,1157.0
572,2016/12/28,1177.0,1175.325,1172.0,1901900,1181.0,1167.0
573,2016/12/29,1157.0,1159.711,1173.0,1996500,1174.0,1153.0
574,2016/12/30,1161.0,1155.775,1147.0,2059800,1166.0,1136.0
575,2017/01/04,1194.0,1188.347,1167.0,3014900,1196.0,1162.0
576,2017/01/05,1182.0,1182.713,1198.0,2442600,1198.0,1176.0
577,2017/01/06,1182.0,1180.994,1172.0,2098700,1188.0,1170.0
578,2017/01/10,1177.0,1178.988,1178.0,3022200,1191.0,1172.0
579,2017/01/11,1195.0,1190.72,1179.0,2010300,1195.0,1175.0
580,2017/01/12,1175.0,1175.19,1189.0,2635600,1194.0,1166.0
581,2017/01/13,1188.0,1180.309,1171.0,2276000,1189.0,1159.0
582,2017/01/16,1175.0,1178.99,1184.0,1766800,1190.0,1173.0
583,2017/01/17,1163.0,1167.498,1186.0,1939300,1186.0,1159.0
584,2017/01/18,1152.0,1146.895,1149.0,3067300,1159.0,1135.0
585,2017/01/19,1165.0,1161.924,1161.0,2082800,1175.0,1153.0
586,2017/01/20,1170.0,1168.661,1165.0,1615400,1175.0,1163.0
587,2017/01/23,1156.0,1158.193,1159.0,1817200,1166.0,1150.0
588,2017/01/24,1151.0,1152.687,1150.0,1702400,1160.0,1147.0
589,2017/01/25,1173.0,1171.949,1176.0,1970900,1182.0,1164.0
590,2017/01/26,1205.0,1201.637,1186.0,3499500,1207.0,1186.0
591,2017/01/27,1206.0,1207.275,1214.0,2428800,1219.0,1200.0
592,2017/01/30,1205.0,1205.367,1220.0,2296900,1226.0,1198.0
593,2017/01/31,1172.0,1174.089,1184.0,2694900,1189.0,1167.0
594,2017/02/01,1074.0,1063.738,1055.0,7368600,1078.0,1028.0
595,2017/02/02,1053.0,1055.63,1073.0,3346000,1076.0,1050.0
596,2017/02/03,1062.0,1063.454,1063.0,2465900,1071.0,1055.0
597,2017/02/06,1057.0,1057.811,1070.0,2834700,1071.0,1052.0
598,2017/02/07,1052.0,1048.265,1028.0,3132000,1057.0,1027.0
599,2017/02/08,1070.0,1063.306,1052.0,2949200,1070.0,1044.0
600,2017/02/09,1065.0,1064.977,1066.0,2006500,1068.0,1062.0
601,2017/02/10,1103.0,1098.75,1090.0,3794400,1106.0,1082.0
602,2017/02/13,1114.0,1113.271,1115.0,2709400,1119.0,1107.0
603,2017/02/14,1103.0,1111.658,1119.0,2500200,1126.0,1103.0
604,2017/02/15,1119.0,1119.281,1115.0,1610600,1123.0,1112.0
605,2017/02/16,1126.0,1126.164,1122.0,2728900,1135.0,1121.0
606,2017/02/17,1112.0,1111.881,1114.0,3139300,1117.0,1106.0
607,2017/02/20,1105.0,1098.171,1104.0,2376500,1107.0,1085.0
608,2017/02/21,1101.0,1091.933,1090.0,2655400,1101.0,1079.0
609,2017/02/22,1091.0,1088.621,1101.0,3049200,1102.0,1082.0
610,2017/02/23,1094.0,1092.533,1089.0,2200100,1098.0,1084.0
611,2017/02/24,1090.0,1089.892,1090.0,1783200,1097.0,1084.0
612,2017/02/27,1072.0,1074.395,1081.0,2022000,1088.0,1067.0
613,2017/02/28,1083.0,1086.975,1083.0,2395000,1094.0,1080.0
614,2017/03/01,1093.0,1088.466,1090.0,2168400,1096.0,1078.0
615,2017/03/02,1114.0,1113.955,1111.0,2802400,1119.0,1109.0
616,2017/03/03,1114.0,1110.475,1105.0,2441400,1117.0,1101.0
617,2017/03/06,1104.0,1101.791,1104.0,1680600,1107.0,1092.0
618,2017/03/07,1093.0,1089.288,1095.0,2761400,1096.0,1074.0
619,2017/03/08,1090.0,1089.684,1094.0,1436100,1097.0,1083.0
620,2017/03/09,1095.0,1095.066,1098.0,2186900,1102.0,1092.0
621,2017/03/10,1121.0,1115.252,1110.0,3617300,1125.0,1103.0
622,2017/03/13,1123.0,1119.355,1121.0,1395200,1123.0,1112.0
623,2017/03/14,1115.0,1116.117,1122.0,2139200,1123.0,1104.0
624,2017/03/15,1109.0,1104.787,1107.0,2028200,1110.0,1098.0
625,2017/03/16,1115.0,1112.011,1099.0,1860800,1117.0,1097.0
626,2017/03/17,1100.0,1101.29,1107.0,2427200,1108.0,1097.0
627,2017/03/21,1075.0,1074.011,1070.0,3116900,1083.0,1063.0
628,2017/03/22,1037.0,1040.426,1049.0,3852300,1052.0,1034.0
629,2017/03/23,1032.0,1034.134,1036.0,3022100,1040.0,1031.0
630,2017/03/24,1033.0,1034.138,1029.0,3178200,1042.0,1027.0
631,2017/03/27,1013.0,1016.917,1032.0,2989900,1032.0,1010.0
632,2017/03/28,1024.0,1023.69,1023.0,2735200,1030.0,1015.0
633,2017/03/29,1010.0,1012.373,1022.0,2230700,1029.0,1006.0
634,2017/03/30,1007.0,1011.695,1011.0,2530400,1018.0,1007.0
635,2017/03/31,996.0,1006.224,1015.0,2557700,1020.0,996.0
636,2017/04/03,1006.0,1004.5,999.0,2150400,1010.0,998.0
637,2017/04/04,991.0,990.168,1000.0,2727000,1003.0,981.0
638,2017/04/05,984.0,982.925,994.0,3042900,998.0,975.0
639,2017/04/06,959.0,959.158,969.0,4956600,969.0,953.0
640,2017/04/07,953.0,957.985,964.0,5263700,967.0,949.0
641,2017/04/10,967.0,964.173,956.0,2961300,970.0,956.0
642,2017/04/11,963.0,959.579,952.0,2363800,965.0,951.0
643,2017/04/12,947.0,946.84,947.0,2602700,953.0,942.0
644,2017/04/13,944.0,941.574,936.0,2222500,947.0,935.0
645,2017/04/14,945.0,946.417,954.0,2438600,954.0,938.0
646,2017/04/17,931.0,932.434,939.0,2332400,940.0,929.0
647,2017/04/18,936.0,939.804,942.0,2222900,951.0,932.0
648,2017/04/19,933.0,933.285,932.0,2310800,939.0,929.0
649,2017/04/20,943.0,945.168,934.0,3170200,955.0,930.0
650,2017/04/21,945.0,944.712,950.0,2749400,952.0,940.0
651,2017/04/24,959.0,960.941,961.0,2349000,964.0,958.0
652,2017/04/25,975.0,970.265,959.0,1902400,977.0,954.0
653,2017/04/26,995.0,991.268,985.0,2433600,995.0,983.0
654,2017/04/27,994.0,991.851,990.0,1974500,996.0,982.0
655,2017/04/28,985.0,984.296,993.0,2291600,994.0,979.0
656,2017/05/01,986.0,981.261,976.0,1718100,988.0,968.0
657,2017/05/02,1000.0,998.709,989.0,2042500,1003.0,988.0
658,2017/05/08,1021.0,1020.09,1022.0,3414200,1023.0,1016.0
659,2017/05/09,1008.0,1004.813,1012.0,4262400,1012.0,997.0
660,2017/05/10,1007.0,1007.416,1007.0,2940400,1014.0,1001.0
661,2017/05/11,1014.0,1013.542,1009.0,3014900,1019.0,1006.0
662,2017/05/12,928.0,933.036,951.0,10240500,953.0,922.0
663,2017/05/15,917.0,914.888,914.0,4349800,919.0,906.0
664,2017/05/16,923.0,925.175,929.0,3344800,933.0,919.0
665,2017/05/17,917.0,912.523,914.0,2717200,917.0,902.0
666,2017/05/18,891.0,892.568,895.0,3880300,900.0,889.0
667,2017/05/19,899.0,896.514,891.0,2478000,902.0,890.0
668,2017/05/22,899.0,899.357,906.0,2640700,912.0,896.0
669,2017/05/23,888.0,889.526,892.0,2696700,894.0,887.0
670,2017/05/24,890.0,888.677,890.0,2412600,891.0,886.0
671,2017/05/25,888.0,886.04,888.0,2345400,890.0,880.0
672,2017/05/26,882.0,883.029,887.0,2135700,887.0,881.0
673,2017/05/29,887.0,887.936,887.0,2129500,892.0,885.0
674,2017/05/30,883.0,880.432,888.0,2709900,889.0,875.0
675,2017/05/31,871.0,870.938,879.0,5331400,880.0,868.0
676,2017/06/01,878.0,878.061,874.0,3113100,885.0,873.0
677,2017/06/02,916.0,903.465,890.0,6124500,920.0,883.0
678,2017/06/05,892.0,896.349,902.0,3025200,910.0,891.0
679,2017/06/06,880.0,882.362,891.0,2480800,892.0,878.0
680,2017/06/07,890.0,885.078,877.0,2510800,890.0,871.0
681,2017/06/08,890.0,892.422,900.0,2716800,901.0,888.0
682,2017/06/09,893.0,891.847,895.0,3015200,896.0,882.0
683,2017/06/12,896.0,894.515,895.0,3098800,900.0,889.0
684,2017/06/13,889.0,888.997,890.0,2808600,894.0,883.0
685,2017/06/14,891.0,890.249,895.0,2579300,895.0,886.0
686,2017/06/15,882.0,884.703,888.0,2879900,891.0,881.0
687,2017/06/16,892.0,891.995,887.0,4572000,897.0,886.0
688,2017/06/19,890.0,890.347,894.0,2697000,895.0,886.0
689,2017/06/20,890.0,890.818,895.0,4345200,896.0,886.0
690,2017/06/21,891.0,889.384,889.0,3625200,895.0,883.0
691,2017/06/22,890.0,889.091,889.0,2548200,893.0,882.0
692,2017/06/23,895.0,892.683,893.0,2814200,895.0,889.0
693,2017/06/26,896.0,898.3,898.0,2538400,903.0,895.0
694,2017/06/27,912.0,910.857,905.0,2429000,915.0,902.0
695,2017/06/28,927.0,927.277,915.0,4026100,933.0,914.0
696,2017/06/29,928.0,928.111,932.0,3372300,936.0,924.0
697,2017/06/30,932.0,929.307,923.0,3984500,934.0,921.0
698,2017/07/03,935.0,941.228,947.0,4481600,950.0,932.0
699,2017/07/04,935.0,936.77,940.0,2759300,944.0,929.0
700,2017/07/05,949.0,941.953,931.0,3374300,950.0,931.0
701,2017/07/06,932.0,934.708,945.0,5533200,946.0,929.0
702,2017/07/07,935.0,933.628,927.0,2484700,940.0,922.0
703,2017/07/10,946.0,944.868,941.0,3025500,948.0,940.0
704,2017/07/11,963.0,957.751,948.0,3483800,964.0,946.0
705,2017/07/12,960.0,960.996,963.0,2466100,968.0,957.0
706,2017/07/13,949.0,952.313,967.0,3016800,968.0,945.0
707,2017/07/14,953.0,949.528,949.0,3185500,955.0,940.0
708,2017/07/18,967.0,963.16,956.0,3256900,969.0,955.0
709,2017/07/19,952.0,953.532,964.0,3188300,965.0,949.0
710,2017/07/20,957.0,954.649,952.0,2950800,960.0,944.0
711,2017/07/21,971.0,971.362,965.0,3869200,977.0,965.0
712,2017/07/24,979.0,973.188,962.0,4278200,980.0,956.0
713,2017/07/25,984.0,982.173,977.0,3783800,986.0,973.0
714,2017/07/26,988.0,987.184,988.0,3828200,993.0,981.0
715,2017/07/27,992.0,987.134,983.0,3521500,992.0,978.0
716,2017/07/28,1003.0,999.259,992.0,4534900,1005.0,992.0
717,2017/07/31,914.0,909.702,916.0,12775800,922.0,902.0
718,2017/08/01,905.0,904.921,913.0,4135800,913.0,901.0
719,2017/08/02,907.0,904.013,902.0,4653300,910.0,898.0
720,2017/08/03,906.0,904.026,908.0,3458800,909.0,901.0
721,2017/08/04,906.0,903.777,901.0,2444900,908.0,898.0
722,2017/08/07,914.0,911.789,906.0,2617800,915.0,904.0
723,2017/08/08,918.0,916.53,914.0,3479800,926.0,912.0
724,2017/08/09,907.0,911.142,918.0,3615800,922.0,905.0
725,2017/08/10,902.0,903.859,911.0,2432100,912.0,900.0
726,2017/08/14,915.0,906.16,890.0,4437700,917.0,887.0
727,2017/08/15,924.0,925.298,922.0,3993800,934.0,918.0
728,2017/08/16,923.0,922.629,918.0,2181200,927.0,917.0
729,2017/08/17,926.0,925.98,922.0,2006400,930.0,920.0
730,2017/08/18,911.0,912.454,915.0,2307100,916.0,910.0
731,2017/08/21,879.0,883.774,900.0,5853400,900.0,878.0
732,2017/08/22,882.0,880.119,879.0,2428800,884.0,875.0
733,2017/08/23,880.0,883.006,886.0,2173500,890.0,880.0
734,2017/08/24,881.0,881.278,877.0,1867100,885.0,874.0
735,2017/08/25,882.0,884.334,887.0,1900000,890.0,881.0
736,2017/08/28,879.0,879.079,883.0,1759800,885.0,876.0
737,2017/08/29,877.0,874.335,875.0,2417700,878.0,870.0
738,2017/08/30,886.0,883.273,884.0,2012800,888.0,875.0
739,2017/08/31,878.0,880.532,882.0,4123400,886.0,877.0
740,2017/09/01,879.0,878.93,882.0,2902500,882.0,874.0
741,2017/09/04,869.0,872.33,879.0,2639100,881.0,867.0
742,2017/09/05,855.0,861.017,868.0,3383900,871.0,855.0
743,2017/09/06,849.0,848.111,850.0,3497100,851.0,843.0
744,2017/09/07,857.0,857.573,856.0,2387000,862.0,854.0
745,2017/09/08,838.0,843.727,847.0,5295500,856.0,836.0
746,2017/09/11,852.0,854.215,846.0,3418700,867.0,842.0
747,2017/09/12,864.0,864.397,862.0,2734800,868.0,858.0
748,2017/09/13,877.0,882.342,873.0,4217800,891.0,871.0
749,2017/09/14,868.0,866.115,870.0,3935700,870.0,861.0
750,2017/09/15,910.0,901.379,891.0,7495600,910.0,890.0
751,2017/09/19,930.0,927.601,924.0,4501900,931.0,915.0
752,2017/09/20,935.0,935.02,931.0,3265900,940.0,927.0
753,2017/09/21,938.0,942.284,943.0,3241300,948.0,936.0
754,2017/09/22,948.0,944.682,940.0,3906300,950.0,931.0
755,2017/09/25,939.0,944.278,954.0,2573100,955.0,937.0
756,2017/09/26,942.0,941.858,942.0,3391200,945.0,939.0
757,2017/09/27,932.0,932.322,930.0,3321500,941.0,922.0
758,2017/09/28,934.0,936.676,940.0,4371300,946.0,927.0
759,2017/09/29,924.0,925.304,930.0,3128200,935.0,920.0
760,2017/10/02,922.0,920.825,921.0,3751500,928.0,915.0
761,2017/10/03,936.0,933.38,926.0,2604900,938.0,926.0
762,2017/10/04,940.0,941.257,943.0,2455400,948.0,935.0
763,2017/10/05,948.0,945.856,942.0,3682800,952.0,934.0
764,2017/10/06,951.0,949.753,951.0,3100100,952.0,946.0
765,2017/10/10,952.0,951.871,953.0,2879400,959.0,949.0
766,2017/10/11,949.0,950.726,949.0,2493100,955.0,947.0
767,2017/10/12,948.0,949.924,949.0,2015400,955.0,948.0
768,2017/10/13,951.0,948.339,947.0,5356000,953.0,939.0
769,2017/10/16,953.0,952.878,952.0,2952400,959.0,948.0
770,2017/10/17,964.0,961.616,956.0,2942300,964.0,956.0
771,2017/10/18,965.0,961.676,967.0,2724400,967.0,956.0
772,2017/10/19,976.0,972.803,967.0,3441600,977.0,962.0
773,2017/10/20,975.0,972.788,977.0,3182000,977.0,966.0
774,2017/10/23,979.0,980.108,984.0,2509000,985.0,975.0
775,2017/10/24,989.0,985.707,980.0,2702400,989.0,978.0
776,2017/10/25,982.0,986.269,991.0,2614200,994.0,978.0
777,2017/10/26,983.0,981.507,977.0,1976000,985.0,976.0
778,2017/10/27,991.0,987.998,985.0,2865000,993.0,983.0
779,2017/10/30,980.0,978.588,991.0,5257700,994.0,966.0
780,2017/10/31,988.0,993.71,995.0,8121200,1013.0,981.0
781,2017/11/01,1046.0,1034.406,1003.0,10248500,1048.0,1000.0
782,2017/11/02,1054.0,1046.789,1049.0,5094000,1054.0,1036.0
783,2017/11/06,1061.0,1062.294,1050.0,4492000,1072.0,1050.0
784,2017/11/07,1085.0,1079.006,1063.0,5072000,1086.0,1062.0
785,2017/11/08,1092.0,1083.954,1077.0,3497600,1092.0,1071.0
786,2017/11/09,1081.0,1083.809,1089.0,6555900,1097.0,1067.0
787,2017/11/10,1066.0,1064.993,1062.0,3963600,1073.0,1054.0
788,2017/11/13,1055.0,1060.769,1065.0,2265100,1068.0,1055.0
789,2017/11/14,1052.0,1050.995,1050.0,2539500,1060.0,1045.0
790,2017/11/15,1035.0,1037.023,1044.0,5241100,1047.0,1029.0
791,2017/11/16,1037.0,1028.563,1022.0,4700000,1037.0,1014.0
792,2017/11/17,1040.0,1044.384,1049.0,3450400,1058.0,1037.0
793,2017/11/20,1035.0,1034.68,1037.0,2054700,1044.0,1029.0
794,2017/11/21,1042.0,1044.183,1041.0,2319500,1050.0,1039.0
795,2017/11/22,1033.0,1035.156,1039.0,3015200,1042.0,1031.0
796,2017/11/24,1076.0,1066.564,1045.0,5416000,1078.0,1044.0
797,2017/11/27,1067.0,1071.159,1080.0,3337200,1081.0,1063.0
798,2017/11/28,1055.0,1054.948,1057.0,2499500,1064.0,1049.0
799,2017/11/29,1079.0,1075.454,1068.0,4521000,1083.0,1067.0
800,2017/11/30,1096.0,1089.362,1083.0,5441300,1096.0,1075.0
801,2017/12/01,1105.0,1108.45,1111.0,4869200,1125.0,1092.0
802,2017/12/04,1094.0,1097.471,1110.0,2525300,1110.0,1091.0
803,2017/12/05,1095.0,1095.056,1091.0,2136200,1101.0,1085.0
804,2017/12/06,1078.0,1079.812,1095.0,2702600,1096.0,1075.0
805,2017/12/07,1076.0,1077.226,1080.0,3351300,1086.0,1072.0
806,2017/12/08,1093.0,1090.681,1090.0,4102700,1102.0,1084.0
807,2017/12/11,1110.0,1104.301,1096.0,2375700,1110.0,1095.0
808,2017/12/12,1110.0,1105.645,1105.0,2524600,1112.0,1095.0
809,2017/12/13,1090.0,1095.418,1115.0,2885300,1116.0,1088.0
810,2017/12/14,1071.0,1075.162,1083.0,3352700,1086.0,1068.0
811,2017/12/15,1058.0,1061.662,1066.0,3708400,1070.0,1057.0
812,2017/12/18,1067.0,1068.258,1067.0,3099200,1074.0,1061.0
813,2017/12/19,1070.0,1069.843,1069.0,2359100,1075.0,1063.0
814,2017/12/20,1080.0,1078.847,1067.0,3014400,1087.0,1066.0
815,2017/12/21,1074.0,1070.479,1072.0,2640000,1077.0,1062.0
816,2017/12/22,1083.0,1081.121,1084.0,2591800,1085.0,1076.0
817,2017/12/25,1080.0,1076.367,1080.0,1623000,1083.0,1068.0
818,2017/12/26,1078.0,1078.622,1081.0,1397200,1085.0,1074.0
819,2017/12/27,1083.0,1083.679,1080.0,1369700,1087.0,1079.0
820,2017/12/28,1080.0,1080.238,1080.0,1378100,1086.0,1073.0
821,2017/12/29,1084.0,1081.87,1078.0,2060200,1086.0,1074.0
822,2018/01/04,1115.0,1115.199,1107.0,4313800,1124.0,1103.0
823,2018/01/05,1118.0,1119.095,1123.0,2366500,1123.0,1115.0
824,2018/01/09,1128.0,1130.225,1128.0,2486500,1143.0,1124.0
825,2018/01/10,1125.0,1126.393,1125.0,1983400,1132.0,1121.0
826,2018/01/11,1134.0,1131.651,1121.0,2522000,1140.0,1120.0
827,2018/01/12,1138.0,1134.414,1134.0,2958900,1139.0,1128.0
828,2018/01/15,1137.0,1142.264,1150.0,2892900,1160.0,1135.0
829,2018/01/16,1134.0,1134.752,1146.0,2220300,1146.0,1129.0
830,2018/01/17,1124.0,1115.152,1123.0,4123500,1124.0,1100.0
831,2018/01/18,1113.0,1120.512,1135.0,3260200,1136.0,1107.0
832,2018/01/19,1115.0,1113.218,1119.0,2714500,1123.0,1104.0
833,2018/01/22,1119.0,1120.075,1119.0,2593300,1127.0,1113.0
834,2018/01/23,1110.0,1111.679,1112.0,2713700,1118.0,1108.0
835,2018/01/24,1111.0,1110.602,1100.0,2417000,1118.0,1099.0
836,2018/01/25,1094.0,1091.948,1095.0,2620000,1097.0,1085.0
837,2018/01/26,1092.0,1094.845,1099.0,2868100,1106.0,1087.0
838,2018/01/29,1090.0,1091.531,1090.0,2706400,1099.0,1085.0
839,2018/01/30,1089.0,1085.111,1083.0,3177300,1093.0,1073.0
840,2018/01/31,1086.0,1087.679,1080.0,3504300,1097.0,1074.0
841,2018/02/01,1115.0,1101.427,1081.0,4830900,1115.0,1075.0
842,2018/02/02,1037.0,1034.336,1025.0,8676100,1046.0,1018.0
843,2018/02/05,1017.0,1022.747,1026.0,4145200,1034.0,1017.0
844,2018/02/06,989.0,978.835,980.0,7048800,990.0,965.0
845,2018/02/07,978.0,990.871,1010.0,4396700,1014.0,977.0
846,2018/02/08,977.0,976.594,982.0,3975200,987.0,967.0
847,2018/02/09,954.0,951.924,951.0,4091100,960.0,944.0
848,2018/02/13,937.0,945.374,966.0,3684700,966.0,935.0
849,2018/02/14,930.0,931.162,941.0,3291600,948.0,922.0
850,2018/02/15,936.0,936.829,939.0,2821200,944.0,932.0
851,2018/02/16,957.0,953.376,935.0,4092600,961.0,931.0
852,2018/02/19,974.0,969.355,963.0,2148900,976.0,959.0
853,2018/02/20,973.0,973.478,973.0,1808300,983.0,967.0
854,2018/02/21,977.0,979.542,976.0,2445600,988.0,974.0
855,2018/02/22,968.0,966.883,971.0,2842500,976.0,962.0
856,2018/02/23,984.0,982.141,978.0,2368700,991.0,973.0
857,2018/02/26,987.0,992.511,995.0,2041900,1000.0,987.0
858,2018/02/27,1002.0,1004.115,1001.0,2141000,1017.0,996.0
859,2018/02/28,991.0,995.817,1003.0,2853000,1010.0,991.0
860,2018/03/01,973.0,972.995,987.0,3043000,987.0,964.0
861,2018/03/02,940.0,941.439,948.0,3407700,952.0,933.0
862,2018/03/05,927.0,925.887,928.0,2104400,930.0,918.0
863,2018/03/06,935.0,940.669,939.0,2167700,952.0,933.0
864,2018/03/07,925.0,925.439,926.0,2642500,934.0,921.0
865,2018/03/08,936.0,938.708,935.0,2644000,945.0,934.0
866,2018/03/09,945.0,945.647,942.0,3262600,959.0,938.0
867,2018/03/12,958.0,959.283,959.0,2906300,964.0,954.0
868,2018/03/13,953.0,952.586,953.0,2746300,957.0,949.0
869,2018/03/14,943.0,943.384,944.0,2806700,949.0,937.0
870,2018/03/15,945.0,942.317,944.0,2324100,949.0,931.0
871,2018/03/16,936.0,939.769,951.0,2332100,951.0,935.0
872,2018/03/19,910.0,914.678,930.0,3882200,930.0,908.0
873,2018/03/20,923.0,919.414,910.0,3394600,925.0,910.0
874,2018/03/22,938.0,935.519,929.0,2986300,944.0,928.0
875,2018/03/23,904.0,904.036,909.0,4035300,915.0,899.0
876,2018/03/26,907.0,898.008,898.0,3231200,907.0,886.0
877,2018/03/27,928.0,927.176,922.0,3607200,935.0,919.0
878,2018/03/28,899.0,893.875,891.0,3435800,899.0,885.0
879,2018/03/29,893.0,893.761,904.0,3123800,905.0,886.0
880,2018/03/30,912.0,909.766,902.0,2942500,917.0,900.0
881,2018/04/02,907.0,910.122,905.0,1931300,915.0,905.0
882,2018/04/03,906.0,901.34,896.0,2396700,908.0,891.0
883,2018/04/04,900.0,904.293,908.0,2491900,915.0,899.0
884,2018/04/05,905.0,905.994,905.0,2257200,913.0,897.0
885,2018/04/06,898.0,902.418,903.0,2539600,911.0,897.0
886,2018/04/09,903.0,900.338,895.0,2314100,908.0,892.0
887,2018/04/10,921.0,916.12,900.0,2594900,927.0,895.0
888,2018/04/11,925.0,926.275,924.0,2039700,931.0,921.0
889,2018/04/12,908.0,909.015,920.0,2321800,920.0,902.0
890,2018/04/13,922.0,920.102,907.0,2308600,926.0,905.0
891,2018/04/16,925.0,922.231,920.0,2199600,927.0,912.0
892,2018/04/17,923.0,923.279,923.0,1559200,927.0,920.0
893,2018/04/18,922.0,921.197,923.0,2930600,926.0,914.0
894,2018/04/19,944.0,942.879,929.0,2886900,949.0,922.0
895,2018/04/20,948.0,947.444,954.0,2371600,955.0,942.0
896,2018/04/23,957.0,967.114,974.0,4857500,983.0,955.0
897,2018/04/24,968.0,963.659,962.0,2394800,970.0,953.0
898,2018/04/25,949.0,951.796,968.0,2547800,968.0,947.0
899,2018/04/26,931.0,934.51,946.0,3837100,946.0,930.0
900,2018/04/27,940.0,937.778,937.0,3533000,943.0,929.0
901,2018/05/01,943.0,943.403,936.0,2108700,949.0,932.0
902,2018/05/02,943.0,946.17,952.0,1922500,956.0,940.0
903,2018/05/07,936.0,933.003,943.0,1664100,943.0,926.0
904,2018/05/08,947.0,947.414,943.0,1706600,954.0,942.0
905,2018/05/09,948.0,949.5,950.0,1756400,956.0,944.0
906,2018/05/10,956.0,955.421,955.0,2060000,960.0,948.0
907,2018/05/11,964.0,960.308,958.0,1726200,964.0,953.0
908,2018/05/14,972.0,971.049,969.0,2476500,978.0,965.0
909,2018/05/15,1007.0,1012.729,1049.0,7777400,1054.0,991.0
910,2018/05/16,1017.0,1019.286,1002.0,3552800,1028.0,998.0
911,2018/05/17,1037.0,1034.759,1020.0,3181400,1043.0,1013.0
912,2018/05/18,1044.0,1038.949,1040.0,2402500,1044.0,1027.0
913,2018/05/21,1047.0,1047.133,1050.0,2198700,1056.0,1037.0
914,2018/05/22,1039.0,1044.082,1058.0,2125400,1063.0,1035.0
915,2018/05/23,1040.0,1040.76,1040.0,2958800,1055.0,1033.0
916,2018/05/24,1020.0,1020.144,1030.0,2588300,1030.0,1015.0
917,2018/05/25,1024.0,1024.178,1023.0,2179100,1030.0,1016.0
918,2018/05/28,1029.0,1022.834,1021.0,1488500,1029.0,1016.0
919,2018/05/29,1010.0,1007.702,1005.0,2328100,1016.0,1001.0
920,2018/05/30,978.0,979.219,987.0,3736600,994.0,972.0
921,2018/05/31,994.0,991.649,987.0,4438500,1002.0,982.0
922,2018/06/01,986.0,988.168,986.0,2346500,996.0,982.0
923,2018/06/04,1011.0,1007.168,999.0,1955700,1014.0,992.0
924,2018/06/05,1018.0,1018.387,1022.0,1956000,1028.0,1011.0
925,2018/06/06,1036.0,1031.97,1023.0,2803600,1038.0,1023.0
926,2018/06/07,1049.0,1047.179,1046.0,2147000,1050.0,1042.0
927,2018/06/08,1038.0,1047.067,1050.0,3560900,1055.0,1037.0
928,2018/06/11,1036.0,1033.932,1037.0,1345300,1042.0,1024.0
929,2018/06/12,1051.0,1047.296,1055.0,2274000,1055.0,1035.0
930,2018/06/13,1065.0,1061.076,1053.0,2452200,1068.0,1044.0
931,2018/06/14,1066.0,1064.598,1060.0,2219000,1071.0,1053.0
932,2018/06/15,1062.0,1061.45,1072.0,2257100,1073.0,1053.0
933,2018/06/18,1046.0,1045.827,1061.0,1530700,1063.0,1036.0
934,2018/06/19,1041.0,1044.559,1045.0,2416300,1057.0,1035.0
935,2018/06/20,1048.0,1039.291,1041.0,2101700,1049.0,1022.0
936,2018/06/21,1052.0,1049.983,1041.0,1651100,1057.0,1032.0
937,2018/06/22,1039.0,1037.895,1039.0,2285200,1043.0,1030.0
938,2018/06/25,1037.0,1037.088,1036.0,2163500,1041.0,1030.0
939,2018/06/26,1049.0,1040.923,1026.0,2294200,1050.0,1019.0
940,2018/06/27,1038.0,1036.661,1038.0,1758200,1041.0,1028.0
941,2018/06/28,1037.0,1034.441,1028.0,1655100,1040.0,1025.0
942,2018/06/29,1029.0,1025.4,1019.0,2652100,1034.0,1012.0
943,2018/07/02,1006.0,1015.802,1015.0,2799200,1032.0,1004.0
944,2018/07/03,1008.0,1007.842,1017.0,2365400,1019.0,999.0
945,2018/07/04,988.0,993.242,1004.0,2293900,1009.0,988.0
946,2018/07/05,971.0,972.469,979.0,3547400,981.0,968.0
947,2018/07/06,981.0,978.852,972.0,2509900,984.0,968.0
948,2018/07/09,995.0,993.404,986.0,1785900,998.0,980.0
949,2018/07/10,997.0,1000.961,1005.0,1934900,1015.0,997.0
950,2018/07/11,969.0,971.768,983.0,2574700,983.0,965.0
951,2018/07/12,979.0,978.67,978.0,3174400,985.0,971.0
952,2018/07/13,980.0,980.026,982.0,2980100,992.0,974.0
953,2018/07/17,974.0,972.553,984.0,3529500,984.0,964.0
954,2018/07/18,985.0,985.485,988.0,2233600,994.0,978.0
955,2018/07/19,1014.0,1011.828,997.0,3426400,1020.0,996.0
956,2018/07/20,1010.0,1008.385,1014.0,2102100,1019.0,1001.0
957,2018/07/23,1007.0,1008.259,1004.0,1772600,1014.0,998.0
958,2018/07/24,1020.0,1018.737,1018.0,1401400,1025.0,1009.0
959,2018/07/25,1024.0,1025.445,1023.0,1530400,1034.0,1021.0
960,2018/07/26,1021.0,1021.6,1025.0,2309100,1030.0,1017.0
961,2018/07/27,1026.0,1023.387,1022.0,1285500,1027.0,1018.0
962,2018/07/30,1015.0,1018.232,1029.0,1862500,1038.0,1007.0
963,2018/07/31,1001.0,1003.551,1010.0,2975200,1012.0,989.0
964,2018/08/01,1037.0,1033.15,1030.0,4295800,1042.0,1025.0
965,2018/08/02,1075.0,1085.302,1097.0,6911600,1118.0,1072.0
966,2018/08/03,1098.0,1090.912,1081.0,4460900,1102.0,1073.0
967,2018/08/06,1102.0,1103.742,1101.0,4539900,1115.0,1092.0
968,2018/08/07,1100.0,1095.542,1099.0,2134000,1103.0,1086.0
969,2018/08/08,1102.0,1100.381,1105.0,3005400,1109.0,1092.0
970,2018/08/09,1113.0,1110.154,1105.0,2387500,1115.0,1098.0
971,2018/08/10,1085.0,1093.211,1111.0,3096300,1111.0,1082.0
972,2018/08/13,1054.0,1053.683,1070.0,3169500,1071.0,1041.0
973,2018/08/14,1081.0,1073.896,1069.0,2744400,1082.0,1060.0
974,2018/08/15,1067.0,1064.84,1076.0,2842400,1078.0,1047.0
975,2018/08/16,1069.0,1063.188,1059.0,2652200,1071.0,1048.0
976,2018/08/17,1068.0,1070.392,1069.0,1443700,1077.0,1065.0
977,2018/08/20,1061.0,1059.523,1068.0,2318200,1068.0,1052.0
978,2018/08/21,1084.0,1076.501,1064.0,3155200,1085.0,1058.0
979,2018/08/22,1097.0,1092.537,1091.0,3376000,1098.0,1083.0
980,2018/08/23,1094.0,1097.05,1105.0,2267000,1109.0,1090.0
981,2018/08/24,1107.0,1109.127,1110.0,5003000,1120.0,1100.0
982,2018/08/27,1104.0,1101.439,1100.0,1737000,1110.0,1092.0
983,2018/08/28,1109.0,1109.764,1113.0,2007000,1116.0,1105.0
984,2018/08/29,1132.0,1132.468,1115.0,3650700,1148.0,1113.0
985,2018/08/30,1136.0,1136.028,1147.0,2404800,1148.0,1129.0
986,2018/08/31,1131.0,1129.36,1116.0,2494900,1135.0,1111.0
987,2018/09/03,1111.0,1110.97,1133.0,2223800,1135.0,1102.0
988,2018/09/04,1103.0,1103.222,1115.0,1787500,1116.0,1096.0
989,2018/09/05,1087.0,1091.14,1100.0,2516400,1100.0,1086.0
990,2018/09/06,1061.0,1067.702,1095.0,3131800,1096.0,1059.0
991,2018/09/07,1043.0,1044.247,1050.0,3374400,1053.0,1038.0
992,2018/09/10,1050.0,1051.216,1045.0,2008500,1058.0,1044.0
993,2018/09/11,1073.0,1066.699,1052.0,2574300,1074.0,1049.0
994,2018/09/12,1082.0,1079.845,1077.0,3749600,1092.0,1066.0
995,2018/09/13,1093.0,1091.15,1087.0,2304300,1096.0,1083.0
996,2018/09/14,1121.0,1110.197,1105.0,3647900,1122.0,1095.0
997,2018/09/18,1168.0,1158.905,1120.0,4623500,1172.0,1119.0
998,2018/09/19,1184.0,1187.603,1185.0,3866800,1197.0,1180.0
999,2018/09/20,1162.0,1164.708,1177.0,2862200,1179.0,1158.0
1000,2018/09/21,1168.0,1170.9,1165.0,4332900,1183.0,1160.0
1001,2018/09/25,1176.0,1175.978,1181.0,3324200,1187.0,1168.0
1002,2018/09/26,1185.0,1180.987,1167.0,3208300,1189.0,1167.0
1003,2018/09/27,1175.0,1178.598,1178.0,2273400,1187.0,1173.0
1004,2018/09/28,1208.0,1205.031,1200.0,4258800,1214.0,1192.0
1005,2018/10/01,1234.0,1237.385,1228.0,3788000,1254.0,1219.0
1006,2018/10/02,1226.0,1229.074,1229.0,3531000,1244.0,1221.0
1007,2018/10/03,1222.0,1220.206,1220.0,2450500,1228.0,1212.0
1008,2018/10/04,1229.0,1232.514,1230.0,3704500,1239.0,1227.0
1009,2018/10/05,1222.0,1223.245,1227.0,2842900,1231.0,1214.0
1010,2018/10/09,1203.0,1198.0,1186.0,4000400,1212.0,1174.0
1011,2018/10/10,1188.0,1191.645,1204.0,3763500,1211.0,1178.0
1012,2018/10/11,1152.0,1146.945,1138.0,3934400,1155.0,1137.0
1013,2018/10/12,1158.0,1149.637,1145.0,3174200,1159.0,1135.0
1014,2018/10/15,1156.0,1155.095,1154.0,2364000,1165.0,1143.0
1015,2018/10/16,1175.0,1164.485,1146.0,2934400,1175.0,1144.0
1016,2018/10/17,1191.0,1190.11,1198.0,3275800,1202.0,1183.0
1017,2018/10/18,1169.0,1172.143,1195.0,2830800,1195.0,1159.0
1018,2018/10/19,1162.0,1156.474,1152.0,2115500,1165.0,1141.0
1019,2018/10/22,1178.0,1171.31,1166.0,1752500,1183.0,1150.0
1020,2018/10/23,1149.0,1154.523,1171.0,2803500,1175.0,1145.0
1021,2018/10/24,1173.0,1171.766,1170.0,3378200,1185.0,1161.0
1022,2018/10/25,1129.0,1130.563,1140.0,3458800,1144.0,1123.0
1023,2018/10/26,1131.0,1133.232,1145.0,3406000,1153.0,1118.0
1024,2018/10/29,1101.0,1111.96,1140.0,4096000,1145.0,1098.0
1025,2018/10/30,1104.0,1095.411,1095.0,6836200,1111.0,1069.0
1026,2018/10/31,1121.0,1120.902,1125.0,4605800,1135.0,1101.0
1027,2018/11/01,1085.0,1094.128,1110.0,4148300,1116.0,1082.0
1028,2018/11/02,1079.0,1080.594,1085.0,3792200,1092.0,1068.0
1029,2018/11/05,1069.0,1070.807,1069.0,2508700,1081.0,1060.0
1030,2018/11/06,1076.0,1071.98,1062.0,2430100,1080.0,1057.0
1031,2018/11/07,1074.0,1079.224,1076.0,2430900,1094.0,1068.0
1032,2018/11/08,1075.0,1078.801,1092.0,2018700,1094.0,1072.0
1033,2018/11/09,1063.0,1068.116,1074.0,1759900,1082.0,1059.0
1034,2018/11/12,1048.0,1049.294,1051.0,1448600,1057.0,1043.0
1035,2018/11/13,1018.0,1012.063,1019.0,3393400,1021.0,1000.0
1036,2018/11/14,1039.0,1032.208,1032.0,3602500,1040.0,1012.0
1037,2018/11/15,1044.0,1037.209,1028.0,2697200,1044.0,1023.0
1038,2018/11/16,1064.0,1055.974,1048.0,4917900,1064.0,1044.0
1039,2018/11/19,1076.0,1073.718,1067.0,3940100,1085.0,1058.0
1040,2018/11/20,1038.0,1041.345,1058.0,4325100,1065.0,1032.0
1041,2018/11/21,1003.0,1005.012,1016.0,4533200,1020.0,998.0
1042,2018/11/22,1004.0,1004.535,1007.0,2488600,1012.0,999.0
1043,2018/11/26,992.0,992.07,1001.0,3014100,1006.0,984.0
1044,2018/11/27,1000.0,999.043,1003.0,2772300,1010.0,991.0
1045,2018/11/28,1034.0,1030.163,1021.0,4525800,1039.0,1016.0
1046,2018/11/29,1038.0,1041.74,1049.0,3034200,1057.0,1036.0
1047,2018/11/30,1022.0,1028.651,1052.0,3858800,1062.0,1019.0
1048,2018/12/03,1041.0,1039.289,1035.0,2355000,1046.0,1028.0
1049,2018/12/04,1049.0,1058.017,1047.0,3945800,1072.0,1045.0
1050,2018/12/05,1050.0,1046.485,1041.0,3987800,1058.0,1037.0
1051,2018/12/06,1016.0,1014.364,1041.0,3506200,1043.0,1003.0
1052,2018/12/07,1036.0,1031.328,1025.0,3616500,1041.0,1016.0
1053,2018/12/10,1036.0,1028.631,1019.0,2597600,1038.0,1011.0
1054,2018/12/11,1004.0,1009.679,1041.0,3156300,1045.0,1001.0
1055,2018/12/12,1025.0,1025.169,1013.0,2750300,1034.0,1007.0
1056,2018/12/13,1036.0,1038.276,1043.0,2443500,1047.0,1029.0
1057,2018/12/14,1026.0,1027.289,1027.0,3276100,1040.0,1017.0
1058,2018/12/17,1028.0,1033.543,1031.0,2258300,1048.0,1028.0
1059,2018/12/18,1029.0,1027.394,1016.0,2703600,1037.0,1015.0
1060,2018/12/19,1030.0,1032.385,1032.0,2516100,1043.0,1026.0
1061,2018/12/20,999.0,1006.043,1017.0,2529700,1026.0,992.0
1062,2018/12/21,988.0,988.759,985.0,3172500,1001.0,981.0
1063,2018/12/25,952.0,951.727,958.0,2021100,960.0,938.0
1064,2018/12/26,960.0,956.706,958.0,2290300,973.0,945.0
1065,2018/12/27,991.0,991.155,986.0,2520700,1002.0,983.0
1066,2018/12/28,993.0,993.573,986.0,1865200,1001.0,985.0
1067,2019/01/04,965.0,963.098,968.0,2707200,972.0,948.0
1068,2019/01/07,1009.0,1008.59,984.0,2418500,1016.0,984.0
1069,2019/01/08,1015.0,1011.361,1010.0,2591400,1020.0,996.0
1070,2019/01/09,1020.0,1022.497,1041.0,2690100,1044.0,1015.0
1071,2019/01/10,1016.0,1018.613,1016.0,2724500,1031.0,1013.0
1072,2019/01/11,1033.0,1030.299,1025.0,2139100,1040.0,1021.0
1073,2019/01/15,1052.0,1051.494,1035.0,2427600,1061.0,1033.0
1074,2019/01/16,1033.0,1033.109,1044.0,2482000,1046.0,1026.0
1075,2019/01/17,1033.0,1037.35,1040.0,2819200,1054.0,1028.0
1076,2019/01/18,1045.0,1046.905,1042.0,2125200,1053.0,1040.0
1077,2019/01/21,1047.0,1052.313,1055.0,1784700,1067.0,1046.0
1078,2019/01/22,1041.0,1043.12,1053.0,1498300,1053.0,1040.0
1079,2019/01/23,1044.0,1044.446,1038.0,2587300,1051.0,1034.0
1080,2019/01/24,1068.0,1062.434,1055.0,2894100,1068.0,1046.0
1081,2019/01/25,1069.0,1066.095,1064.0,1951200,1071.0,1058.0
1082,2019/01/28,1068.0,1068.733,1073.0,1342000,1080.0,1065.0
1083,2019/01/29,1066.0,1065.262,1065.0,2041500,1074.0,1059.0
1084,2019/01/30,1065.0,1065.769,1068.0,1773900,1072.0,1063.0
1085,2019/01/31,1093.0,1088.499,1083.0,2975900,1095.0,1076.0
1086,2019/02/01,1065.0,1066.746,1084.0,2923200,1085.0,1061.0
1087,2019/02/04,1009.0,1001.264,980.0,6231200,1015.0,978.0
1088,2019/02/05,1026.0,1027.641,1026.0,3534600,1037.0,1023.0
1089,2019/02/06,1051.0,1051.755,1040.0,4381200,1066.0,1039.0
1090,2019/02/07,1069.0,1065.476,1049.0,3274300,1072.0,1049.0
1091,2019/02/08,1038.0,1042.887,1060.0,4595800,1065.0,1026.0
1092,2019/02/12,1047.0,1046.773,1038.0,2847000,1056.0,1038.0
1093,2019/02/13,1084.0,1081.415,1070.0,2887200,1088.0,1068.0
1094,2019/02/14,1086.0,1083.694,1070.0,1886400,1090.0,1070.0
1095,2019/02/15,1069.0,1073.654,1096.0,2588900,1098.0,1064.0
1096,2019/02/18,1079.0,1080.257,1089.0,1356800,1091.0,1073.0
1097,2019/02/19,1079.0,1077.088,1076.0,1517400,1083.0,1067.0
1098,2019/02/20,1087.0,1087.825,1085.0,1640600,1093.0,1080.0
1099,2019/02/21,1076.0,1078.387,1083.0,2520500,1089.0,1074.0
1100,2019/02/22,1087.0,1082.332,1067.0,2066200,1087.0,1066.0
1101,2019/02/25,1093.0,1095.966,1095.0,1730900,1102.0,1089.0
1102,2019/02/26,1091.0,1091.296,1097.0,1521000,1101.0,1085.0
1103,2019/02/27,1093.0,1093.106,1094.0,1683900,1100.0,1087.0
1104,2019/02/28,1080.0,1081.451,1095.0,2489500,1098.0,1076.0
1105,2019/03/01,1087.0,1085.504,1080.0,1866000,1092.0,1075.0
1106,2019/03/04,1090.0,1094.225,1098.0,1747300,1101.0,1090.0
1107,2019/03/05,1078.0,1076.381,1080.0,3047900,1087.0,1058.0
1108,2019/03/06,1077.0,1078.247,1075.0,1741300,1085.0,1073.0
1109,2019/03/07,1075.0,1074.227,1072.0,1772200,1081.0,1066.0
1110,2019/03/08,1061.0,1066.585,1074.0,2947100,1079.0,1058.0
1111,2019/03/11,1071.0,1069.63,1069.0,1378100,1075.0,1062.0
1112,2019/03/12,1104.0,1101.206,1088.0,2418600,1107.0,1088.0
1113,2019/03/13,1100.0,1098.487,1107.0,2538600,1115.0,1085.0
1114,2019/03/14,1088.0,1093.505,1110.0,1573000,1115.0,1086.0
1115,2019/03/15,1101.0,1102.36,1107.0,2329400,1111.0,1097.0
1116,2019/03/18,1110.0,1107.445,1108.0,1224400,1110.0,1100.0
1117,2019/03/19,1108.0,1109.339,1116.0,1308000,1120.0,1106.0
1118,2019/03/20,1112.0,1109.966,1112.0,1328700,1116.0,1104.0
1119,2019/03/22,1099.0,1102.281,1119.0,2343900,1122.0,1095.0
1120,2019/03/25,1074.0,1069.751,1083.0,2216900,1089.0,1059.0
1121,2019/03/26,1091.0,1088.069,1087.0,2810700,1093.0,1081.0
1122,2019/03/27,1080.0,1077.898,1091.0,2316200,1092.0,1066.0
1123,2019/03/28,1069.0,1060.167,1062.0,2648700,1070.0,1043.0
1124,2019/03/29,1089.0,1087.514,1082.0,2471900,1091.0,1080.0
1125,2019/04/01,1110.0,1109.557,1098.0,1910700,1117.0,1096.0
1126,2019/04/02,1112.0,1113.166,1120.0,1556000,1126.0,1108.0
1127,2019/04/03,1117.0,1116.092,1117.0,1903300,1120.0,1107.0
1128,2019/04/04,1122.0,1120.168,1118.0,1608300,1122.0,1111.0
1129,2019/04/05,1122.0,1121.773,1120.0,1641200,1127.0,1113.0
1130,2019/04/08,1124.0,1123.457,1117.0,1998600,1129.0,1113.0
1131,2019/04/09,1136.0,1133.762,1137.0,2738600,1139.0,1124.0
1132,2019/04/10,1128.0,1126.022,1125.0,2004500,1129.0,1118.0
1133,2019/04/11,1125.0,1131.02,1148.0,1574600,1149.0,1122.0
1134,2019/04/12,1124.0,1125.96,1130.0,2136100,1133.0,1121.0
1135,2019/04/15,1127.0,1129.623,1139.0,1828800,1143.0,1125.0
1136,2019/04/16,1127.0,1125.611,1115.0,2399800,1131.0,1114.0
1137,2019/04/17,1136.0,1134.691,1123.0,2019200,1142.0,1123.0
1138,2019/04/18,1107.0,1109.425,1125.0,2493600,1130.0,1100.0
1139,2019/04/19,1108.0,1110.429,1114.0,986900,1118.0,1106.0
1140,2019/04/22,1107.0,1105.015,1101.0,1035100,1109.0,1094.0
1141,2019/04/23,1115.0,1110.458,1102.0,2227300,1117.0,1097.0
1142,2019/04/24,1110.0,1112.399,1124.0,2299000,1127.0,1102.0
1143,2019/04/25,1117.0,1110.251,1108.0,2256000,1117.0,1098.0
1144,2019/04/26,1114.0,1107.719,1110.0,2259000,1114.0,1096.0
1145,2019/05/07,1102.0,1102.246,1109.0,3218100,1112.0,1085.0
1146,2019/05/08,1104.0,1102.578,1095.0,2815100,1107.0,1090.0
1147,2019/05/09,1101.0,1104.724,1113.0,2212600,1114.0,1099.0
1148,2019/05/10,1076.0,1081.271,1109.0,3737900,1112.0,1066.0
1149,2019/05/13,1069.0,1069.261,1078.0,2836400,1082.0,1061.0
1150,2019/05/14,995.0,970.621,1000.0,7245300,1001.0,934.0
1151,2019/05/15,974.0,975.022,987.0,4605600,988.0,960.0
1152,2019/05/16,975.0,971.722,972.0,2597700,978.0,962.0
1153,2019/05/17,985.0,985.57,975.0,2120900,998.0,974.0
1154,2019/05/20,995.0,993.49,994.0,1851900,998.0,988.0
1155,2019/05/21,1008.0,1004.568,999.0,2556200,1011.0,993.0
1156,2019/05/22,1010.0,1012.731,1009.0,2206100,1024.0,1007.0
1157,2019/05/23,1014.0,1012.365,1000.0,1739700,1017.0,1000.0
1158,2019/05/24,994.0,994.6,1008.0,2050100,1009.0,989.0
1159,2019/05/27,996.0,996.726,999.0,1165900,1002.0,992.0
1160,2019/05/28,1010.0,1009.033,1003.0,2979100,1015.0,1000.0
1161,2019/05/29,990.0,990.988,995.0,2662500,1003.0,978.0
1162,2019/05/30,973.0,973.776,975.0,1717200,983.0,966.0
1163,2019/05/31,958.0,960.967,966.0,2239600,970.0,955.0
1164,2019/06/03,946.0,946.128,945.0,1645100,954.0,940.0
1165,2019/06/04,945.0,943.633,937.0,2444800,950.0,936.0
1166,2019/06/05,975.0,974.21,973.0,2129300,981.0,965.0
1167,2019/06/06,977.0,977.578,969.0,1532200,982.0,968.0
1168,2019/06/07,996.0,993.715,980.0,1799100,1002.0,979.0
1169,2019/06/10,1015.0,1014.287,1003.0,1995600,1019.0,999.0
1170,2019/06/11,1025.0,1025.227,1016.0,1500600,1032.0,1015.0
1171,2019/06/12,1022.0,1025.797,1030.0,2136800,1038.0,1021.0
1172,2019/06/13,1010.0,1012.628,1014.0,2167200,1020.0,1010.0
1173,2019/06/14,1017.0,1024.417,1030.0,3079700,1034.0,1017.0
1174,2019/06/17,1014.0,1016.339,1011.0,1883100,1024.0,1011.0
1175,2019/06/18,1023.0,1021.519,1014.0,1883300,1028.0,1012.0
1176,2019/06/19,1045.0,1043.34,1031.0,2255700,1049.0,1030.0
1177,2019/06/20,1056.0,1052.99,1040.0,1934700,1058.0,1040.0
1178,2019/06/21,1065.0,1063.059,1061.0,2900600,1072.0,1050.0
1179,2019/06/24,1056.0,1052.811,1057.0,1648700,1061.0,1035.0
1180,2019/06/25,1049.0,1050.353,1050.0,1532500,1059.0,1045.0
1181,2019/06/26,1048.0,1045.809,1034.0,1857100,1050.0,1033.0
1182,2019/06/27,1054.0,1055.79,1059.0,1955400,1064.0,1052.0
1183,2019/06/28,1049.0,1044.829,1044.0,2142600,1050.0,1035.0
1184,2019/07/01,1068.0,1066.67,1070.0,1490800,1072.0,1056.0
1185,2019/07/02,1079.0,1077.96,1070.0,1541400,1082.0,1069.0
1186,2019/07/03,1067.0,1067.833,1084.0,1578500,1084.0,1062.0
1187,2019/07/04,1083.0,1082.545,1086.0,1257500,1087.0,1076.0
1188,2019/07/05,1083.0,1081.213,1078.0,1184500,1083.0,1078.0
1189,2019/07/08,1087.0,1085.356,1078.0,1565000,1090.0,1078.0
1190,2019/07/09,1076.0,1077.045,1087.0,1602900,1090.0,1070.0
1191,2019/07/10,1081.0,1079.62,1071.0,1964300,1084.0,1069.0
1192,2019/07/11,1086.0,1087.062,1085.0,1411200,1093.0,1080.0
1193,2019/07/12,1087.0,1087.413,1093.0,990700,1093.0,1083.0
1194,2019/07/16,1087.0,1088.204,1088.0,1181500,1097.0,1082.0
1195,2019/07/17,1088.0,1084.812,1076.0,1503100,1090.0,1073.0
1196,2019/07/18,1034.0,1044.57,1075.0,3122100,1076.0,1031.0
1197,2019/07/19,1044.0,1039.584,1024.0,2212900,1045.0,1023.0
1198,2019/07/22,1030.0,1031.957,1037.0,1604500,1039.0,1029.0
1199,2019/07/23,1042.0,1041.018,1026.0,1356900,1048.0,1022.0
1200,2019/07/24,1037.0,1039.728,1048.0,1437100,1048.0,1035.0
1201,2019/07/25,1025.0,1024.196,1026.0,1948900,1028.0,1019.0
1202,2019/07/26,1025.0,1025.644,1015.0,1920600,1036.0,1014.0
1203,2019/07/29,1022.0,1022.667,1025.0,2078400,1030.0,1017.0
1204,2019/07/30,1027.0,1024.226,1030.0,2286000,1048.0,1019.0
1205,2019/07/31,910.0,919.604,929.0,8372700,947.0,905.0
1206,2019/08/01,863.0,860.918,869.0,6968000,874.0,851.0
1207,2019/08/02,824.0,830.794,839.0,5718700,848.0,819.0
1208,2019/08/05,788.0,790.773,801.0,6090800,805.0,782.0
1209,2019/08/06,772.0,768.301,763.0,4403300,774.0,759.0
1210,2019/08/07,759.0,763.003,759.0,3232200,775.0,758.0
1211,2019/08/08,752.0,754.234,759.0,2819300,763.0,748.0
1212,2019/08/09,762.0,753.596,752.0,4550500,763.0,744.0
1213,2019/08/13,761.0,760.332,758.0,3001500,768.0,750.0
1214,2019/08/14,757.0,756.618,773.0,3144800,774.0,750.0
1215,2019/08/15,735.0,733.556,732.0,3644900,739.0,728.0
1216,2019/08/16,731.0,731.505,734.0,3050200,741.0,727.0
1217,2019/08/19,732.0,731.43,740.0,2787600,741.0,724.0
1218,2019/08/20,744.0,741.084,732.0,3140800,752.0,730.0
1219,2019/08/21,731.0,732.486,735.0,1378800,739.0,731.0
1220,2019/08/22,742.0,741.861,744.0,2224500,747.0,738.0
1221,2019/08/23,752.0,750.641,740.0,2762700,755.0,740.0
