ds,yhat
2019-07-18,1738.1323650073878
2019-07-19,1694.832191232454
2019-07-22,3003.089892248055
2019-07-23,3055.695962343273
2019-07-24,2826.1227441127694
2019-07-25,2574.918691508315
2019-07-26,2513.090404919217
2019-07-29,2741.2522738876996
2019-07-30,2562.9337323268082
2019-07-31,2362.947820680938
2019-08-01,2250.4809811641903
2019-08-02,2197.267398815746
2019-08-05,1483.5124309907987
2019-08-06,1226.6312185643294
2019-08-07,1128.807545501607
2019-08-08,1113.739342094639
2019-08-09,1021.5397734167541
2019-08-13,327.61218491372347
2019-08-14,430.4853856778052
2019-08-15,372.92700814884233
2019-08-16,39.3953984267705
