,Date,Close,VWAP,Open,Volume,High,Low
0,2014/08/25,738.0,732.217,743.0,124500,752.0,720.0
1,2014/08/26,732.0,728.576,734.0,98600,736.0,723.0
2,2014/08/27,732.0,733.785,728.0,85700,745.0,726.0
3,2014/08/28,749.0,739.365,736.0,99900,750.0,721.0
4,2014/08/29,750.0,738.521,719.0,122400,755.0,719.0
5,2014/09/01,748.0,744.489,735.0,166000,753.0,735.0
6,2014/09/02,750.0,745.014,733.0,254000,754.0,729.0
7,2014/09/03,784.0,768.955,743.0,286900,786.0,743.0
8,2014/09/04,737.0,761.992,790.0,355900,794.0,730.0
9,2014/09/05,749.0,747.89,747.0,91600,752.0,743.0
10,2014/09/08,754.0,751.858,752.0,56300,754.0,746.0
11,2014/09/09,746.0,742.387,739.0,102800,749.0,739.0
12,2014/09/10,749.0,739.875,731.0,107600,751.0,731.0
13,2014/09/11,749.0,746.609,742.0,88700,751.0,742.0
14,2014/09/12,757.0,757.526,755.0,138200,763.0,750.0
15,2014/09/16,774.0,764.204,748.0,136600,777.0,748.0
16,2014/09/17,775.0,775.592,772.0,97800,781.0,771.0
17,2014/09/18,795.0,790.065,779.0,209000,805.0,777.0
18,2014/09/19,777.0,776.799,772.0,168900,795.0,763.0
19,2014/09/22,769.0,774.06,782.0,100900,785.0,767.0
20,2014/09/24,782.0,778.39,768.0,99100,784.0,766.0
21,2014/09/25,786.0,781.767,780.0,112200,789.0,776.0
22,2014/09/26,790.0,789.98,789.0,128600,803.0,781.0
23,2014/09/29,801.0,802.481,802.0,174200,810.0,793.0
24,2014/09/30,801.0,798.946,800.0,66200,806.0,793.0
25,2014/10/01,805.0,807.857,800.0,249600,820.0,795.0
26,2014/10/02,784.0,788.873,803.0,182900,803.0,782.0
27,2014/10/03,792.0,793.665,781.0,115900,804.0,781.0
28,2014/10/06,826.0,822.514,806.0,219300,834.0,801.0
29,2014/10/07,803.0,814.726,826.0,116600,826.0,802.0
30,2014/10/08,783.0,781.948,779.0,134200,786.0,771.0
31,2014/10/09,784.0,792.453,795.0,130600,801.0,781.0
32,2014/10/10,762.0,761.576,760.0,140700,769.0,755.0
33,2014/10/14,746.0,748.901,736.0,162100,763.0,736.0
34,2014/10/15,759.0,752.705,751.0,96700,762.0,744.0
35,2014/10/16,740.0,744.78,744.0,87700,753.0,737.0
36,2014/10/17,730.0,734.734,731.0,93000,741.0,729.0
37,2014/10/20,774.0,765.45,750.0,68000,774.0,750.0
38,2014/10/21,747.0,751.605,759.0,88800,765.0,741.0
39,2014/10/22,763.0,757.226,754.0,47700,763.0,750.0
40,2014/10/23,754.0,754.153,750.0,53100,758.0,749.0
41,2014/10/24,751.0,754.555,772.0,68300,772.0,750.0
42,2014/10/27,763.0,760.375,761.0,89700,764.0,752.0
43,2014/10/28,756.0,755.756,759.0,39400,766.0,754.0
44,2014/10/29,779.0,772.409,758.0,81500,779.0,758.0
45,2014/10/30,769.0,770.929,778.0,150600,780.0,769.0
46,2014/10/31,799.0,791.129,784.0,161500,803.0,781.0
47,2014/11/04,824.0,824.324,806.0,329900,845.0,796.0
48,2014/11/05,804.0,803.363,809.0,124500,816.0,793.0
49,2014/11/06,808.0,809.154,796.0,142600,822.0,788.0
50,2014/11/07,795.0,796.225,796.0,98100,801.0,791.0
51,2014/11/10,785.0,785.507,796.0,147000,796.0,781.0
52,2014/11/11,797.0,794.258,786.0,75300,802.0,785.0
53,2014/11/12,797.0,798.226,799.0,145600,806.0,780.0
54,2014/11/13,785.0,782.493,789.0,48900,789.0,778.0
55,2014/11/14,799.0,795.807,800.0,78100,800.0,791.0
56,2014/11/17,793.0,797.809,800.0,98600,804.0,791.0
57,2014/11/18,812.0,808.056,793.0,55700,813.0,793.0
58,2014/11/19,795.0,797.264,814.0,139600,819.0,781.0
59,2014/11/20,785.0,790.331,802.0,100400,805.0,781.0
60,2014/11/21,793.0,789.47,784.0,174300,800.0,782.0
61,2014/11/25,811.0,808.868,793.0,202400,820.0,786.0
62,2014/11/26,796.0,800.885,803.0,89800,808.0,795.0
63,2014/11/27,801.0,800.485,800.0,71900,808.0,796.0
64,2014/11/28,809.0,805.069,801.0,118400,810.0,798.0
65,2014/12/01,802.0,803.324,809.0,78300,810.0,796.0
66,2014/12/02,805.0,801.076,803.0,138800,806.0,797.0
67,2014/12/03,806.0,802.736,807.0,100900,808.0,799.0
68,2014/12/04,804.0,808.105,809.0,114800,818.0,800.0
69,2014/12/05,810.0,803.553,798.0,76500,812.0,788.0
70,2014/12/08,811.0,812.906,815.0,67100,819.0,807.0
71,2014/12/09,788.0,798.026,810.0,98800,813.0,787.0
72,2014/12/10,801.0,796.81,812.0,200400,812.0,786.0
73,2014/12/11,800.0,798.903,797.0,53400,805.0,788.0
74,2014/12/12,794.0,801.383,797.0,105800,813.0,792.0
75,2014/12/15,800.0,797.31,783.0,90800,802.0,781.0
76,2014/12/16,753.0,760.706,786.0,124000,786.0,749.0
77,2014/12/17,759.0,761.99,752.0,61800,771.0,752.0
78,2014/12/18,777.0,782.194,784.0,72100,790.0,774.0
79,2014/12/19,780.0,779.489,787.0,51900,790.0,773.0
80,2014/12/22,786.0,784.159,790.0,59300,790.0,778.0
81,2014/12/24,792.0,791.371,786.0,99500,799.0,783.0
82,2014/12/25,800.0,799.217,792.0,72800,809.0,791.0
83,2014/12/26,810.0,807.316,793.0,59100,810.0,793.0
84,2014/12/29,815.0,814.036,812.0,74700,819.0,811.0
85,2014/12/30,820.0,815.06,809.0,51900,820.0,808.0
86,2015/01/05,820.0,818.993,818.0,60500,824.0,811.0
87,2015/01/06,807.0,810.758,813.0,94900,820.0,804.0
88,2015/01/07,807.0,808.909,801.0,71200,823.0,801.0
89,2015/01/08,804.0,809.57,819.0,75400,820.0,798.0
90,2015/01/09,791.0,795.88,805.0,76800,806.0,769.0
91,2015/01/13,797.0,788.296,796.0,74100,797.0,779.0
92,2015/01/14,770.0,780.433,789.0,70500,797.0,769.0
93,2015/01/15,786.0,782.776,770.0,53600,791.0,770.0
94,2015/01/16,763.0,764.031,770.0,74000,770.0,759.0
95,2015/01/19,766.0,768.402,770.0,41800,778.0,764.0
96,2015/01/20,780.0,776.344,767.0,39000,780.0,766.0
97,2015/01/21,792.0,788.271,780.0,97300,795.0,779.0
98,2015/01/22,785.0,782.119,788.0,34500,797.0,777.0
99,2015/01/23,783.0,781.065,785.0,33800,790.0,775.0
100,2015/01/26,777.0,775.061,773.0,38000,782.0,771.0
101,2015/01/27,782.0,778.842,779.0,34200,783.0,770.0
102,2015/01/28,792.0,787.071,778.0,31000,792.0,778.0
103,2015/01/29,775.0,781.549,792.0,44800,792.0,774.0
104,2015/01/30,786.0,785.55,784.0,36000,789.0,782.0
105,2015/02/02,782.0,780.249,779.0,26500,785.0,772.0
106,2015/02/03,770.0,771.45,780.0,61300,784.0,765.0
107,2015/02/04,792.0,788.258,778.0,43500,794.0,775.0
108,2015/02/05,776.0,780.238,792.0,58500,794.0,768.0
109,2015/02/06,790.0,788.882,791.0,49800,793.0,781.0
110,2015/02/09,801.0,795.792,798.0,62100,802.0,786.0
111,2015/02/10,794.0,794.557,794.0,41800,800.0,791.0
112,2015/02/12,794.0,795.813,795.0,90900,803.0,788.0
113,2015/02/13,801.0,800.665,794.0,47100,806.0,794.0
114,2015/02/16,798.0,800.111,804.0,55700,805.0,796.0
115,2015/02/17,801.0,802.75,798.0,91700,805.0,798.0
116,2015/02/18,802.0,800.834,800.0,77200,805.0,798.0
117,2015/02/19,800.0,796.362,802.0,138300,802.0,793.0
118,2015/02/20,794.0,794.904,795.0,88900,797.0,791.0
119,2015/02/23,791.0,792.611,795.0,62500,795.0,789.0
120,2015/02/24,770.0,773.913,785.0,199200,785.0,765.0
121,2015/02/25,762.0,765.002,775.0,167000,779.0,759.0
122,2015/02/26,753.0,754.903,760.0,177900,761.0,751.0
123,2015/02/27,753.0,755.345,760.0,100200,762.0,751.0
124,2015/03/02,756.0,759.103,760.0,115600,765.0,754.0
125,2015/03/03,738.0,745.417,753.0,214000,757.0,736.0
126,2015/03/04,735.0,733.98,739.0,175400,743.0,731.0
127,2015/03/05,724.0,726.008,730.0,220400,731.0,723.0
128,2015/03/06,709.0,717.158,725.0,238900,727.0,709.0
129,2015/03/09,692.0,700.385,708.0,374800,713.0,690.0
130,2015/03/10,695.0,698.658,702.0,354400,706.0,693.0
131,2015/03/11,699.0,694.07,693.0,294400,701.0,690.0
132,2015/03/12,711.0,711.216,708.0,312100,719.0,707.0
133,2015/03/13,713.0,713.921,715.0,471000,722.0,706.0
134,2015/03/16,738.0,729.466,720.0,320400,739.0,716.0
135,2015/03/17,729.0,731.089,735.0,335600,736.0,726.0
136,2015/03/18,733.0,732.762,735.0,226200,739.0,730.0
137,2015/03/19,740.0,734.651,736.0,267100,740.0,725.0
138,2015/03/20,748.0,743.4,739.0,214800,749.0,733.0
139,2015/03/23,765.0,763.146,757.0,238400,772.0,757.0
140,2015/03/24,774.0,769.103,766.0,295500,777.0,762.0
141,2015/03/25,780.0,777.012,777.0,292000,781.0,772.0
142,2015/03/26,784.0,783.562,780.0,330300,789.0,779.0
143,2015/03/27,768.0,772.085,775.0,385200,778.0,755.0
144,2015/03/30,758.0,758.562,763.0,254400,765.0,748.0
145,2015/03/31,771.0,773.123,763.0,270600,780.0,763.0
146,2015/04/01,769.0,771.434,772.0,205100,779.0,762.0
147,2015/04/02,776.0,772.605,763.0,223500,781.0,759.0
148,2015/04/03,773.0,774.304,775.0,75300,783.0,769.0
149,2015/04/06,763.0,764.603,771.0,46400,771.0,761.0
150,2015/04/07,762.0,762.269,759.0,103500,767.0,755.0
151,2015/04/08,761.0,763.74,760.0,118900,770.0,760.0
152,2015/04/09,766.0,778.813,782.0,159500,790.0,764.0
153,2015/04/10,785.0,780.499,777.0,197600,788.0,769.0
154,2015/04/13,792.0,789.879,793.0,115500,794.0,786.0
155,2015/04/14,790.0,789.849,788.0,138100,795.0,784.0
156,2015/04/15,787.0,787.51,785.0,88600,793.0,782.0
157,2015/04/16,787.0,786.2,790.0,131600,792.0,780.0
158,2015/04/17,783.0,780.834,782.0,145400,786.0,773.0
159,2015/04/20,767.0,769.622,771.0,159000,776.0,764.0
160,2015/04/21,767.0,767.543,770.0,110100,776.0,765.0
161,2015/04/22,782.0,780.8,771.0,96400,785.0,767.0
162,2015/04/23,785.0,784.932,785.0,70700,787.0,779.0
163,2015/04/24,782.0,781.175,785.0,128700,786.0,777.0
164,2015/04/27,800.0,798.024,788.0,282200,805.0,780.0
165,2015/04/28,790.0,792.215,804.0,96900,804.0,786.0
166,2015/04/30,785.0,784.441,780.0,80100,790.0,780.0
167,2015/05/01,781.0,780.765,798.0,85400,798.0,776.0
168,2015/05/07,776.0,781.879,781.0,46300,788.0,775.0
169,2015/05/08,768.0,777.972,785.0,134200,800.0,764.0
170,2015/05/11,747.0,744.488,760.0,285200,762.0,710.0
171,2015/05/12,748.0,749.195,747.0,58400,754.0,746.0
172,2015/05/13,741.0,742.408,745.0,57100,748.0,737.0
173,2015/05/14,729.0,732.324,734.0,76900,741.0,728.0
174,2015/05/15,727.0,729.229,732.0,110000,737.0,723.0
175,2015/05/18,736.0,734.339,735.0,71900,736.0,731.0
176,2015/05/19,741.0,739.622,736.0,92800,745.0,736.0
177,2015/05/20,751.0,748.219,747.0,50800,752.0,742.0
178,2015/05/21,749.0,751.027,757.0,45300,760.0,746.0
179,2015/05/22,756.0,752.233,752.0,37700,757.0,747.0
180,2015/05/25,758.0,758.682,759.0,33300,761.0,757.0
181,2015/05/26,756.0,758.316,758.0,46800,762.0,754.0
182,2015/05/27,757.0,756.739,759.0,34900,760.0,754.0
183,2015/05/28,769.0,768.416,765.0,96400,777.0,762.0
184,2015/05/29,779.0,776.831,763.0,80600,781.0,763.0
185,2015/06/01,778.0,776.074,781.0,32600,781.0,769.0
186,2015/06/02,779.0,777.334,772.0,43100,784.0,772.0
187,2015/06/03,799.0,795.289,787.0,125800,800.0,785.0
188,2015/06/04,792.0,791.601,791.0,153900,800.0,785.0
189,2015/06/05,785.0,782.644,783.0,96300,791.0,778.0
190,2015/06/08,782.0,779.551,786.0,159400,793.0,772.0
191,2015/06/09,776.0,777.064,782.0,82800,786.0,773.0
192,2015/06/10,783.0,783.58,775.0,86100,789.0,775.0
193,2015/06/11,802.0,797.252,786.0,200100,807.0,781.0
194,2015/06/12,809.0,803.878,802.0,316200,812.0,797.0
195,2015/06/15,805.0,800.931,800.0,126900,810.0,794.0
196,2015/06/16,798.0,799.484,805.0,121000,805.0,793.0
197,2015/06/17,788.0,789.786,797.0,48100,797.0,788.0
198,2015/06/18,778.0,781.105,785.0,85200,792.0,776.0
199,2015/06/19,775.0,783.677,789.0,192500,802.0,775.0
200,2015/06/22,785.0,781.414,775.0,61300,787.0,775.0
201,2015/06/23,798.0,788.705,778.0,86300,798.0,773.0
202,2015/06/24,798.0,799.018,800.0,71200,803.0,792.0
203,2015/06/25,784.0,787.452,795.0,38700,795.0,783.0
204,2015/06/26,782.0,782.951,788.0,45200,788.0,780.0
205,2015/06/29,763.0,763.558,758.0,110500,769.0,756.0
206,2015/06/30,765.0,767.061,776.0,151900,780.0,759.0
207,2015/07/01,766.0,766.514,770.0,94500,771.0,762.0
208,2015/07/02,775.0,776.39,781.0,80500,783.0,771.0
209,2015/07/03,769.0,772.478,778.0,105900,779.0,765.0
210,2015/07/06,751.0,754.987,754.0,124200,761.0,749.0
211,2015/07/07,747.0,751.685,750.0,123700,762.0,746.0
212,2015/07/08,738.0,740.541,741.0,75100,745.0,738.0
213,2015/07/09,723.0,720.131,726.0,87300,726.0,706.0
214,2015/07/10,737.0,739.994,721.0,161200,757.0,713.0
215,2015/07/13,752.0,748.242,750.0,79500,752.0,737.0
216,2015/07/14,766.0,766.846,764.0,85900,772.0,761.0
217,2015/07/15,768.0,764.645,769.0,80000,770.0,760.0
218,2015/07/16,781.0,777.291,776.0,67100,784.0,767.0
219,2015/07/17,771.0,772.145,779.0,22700,780.0,768.0
220,2015/07/21,795.0,792.058,777.0,104300,798.0,777.0
221,2015/07/22,800.0,800.26,800.0,130600,805.0,787.0
222,2015/07/23,798.0,791.863,800.0,48900,800.0,785.0
223,2015/07/24,789.0,790.31,795.0,50300,798.0,785.0
224,2015/07/27,771.0,777.444,785.0,31100,785.0,770.0
225,2015/07/28,777.0,773.483,766.0,47400,788.0,760.0
226,2015/07/29,774.0,772.672,779.0,26200,782.0,764.0
227,2015/07/30,773.0,776.173,778.0,22500,784.0,770.0
228,2015/07/31,788.0,782.474,772.0,19200,788.0,772.0
229,2015/08/03,786.0,784.257,788.0,10900,794.0,778.0
230,2015/08/04,794.0,783.565,789.0,30100,794.0,775.0
231,2015/08/05,792.0,787.176,796.0,53900,800.0,778.0
232,2015/08/06,797.0,796.479,793.0,72400,803.0,783.0
233,2015/08/07,802.0,797.887,804.0,82000,805.0,785.0
234,2015/08/10,819.0,810.149,803.0,112000,820.0,796.0
235,2015/08/11,839.0,831.734,820.0,169600,840.0,817.0
236,2015/08/12,844.0,840.436,830.0,101800,845.0,829.0
237,2015/08/13,861.0,856.349,844.0,172300,865.0,843.0
238,2015/08/14,877.0,870.432,864.0,140400,879.0,863.0
239,2015/08/17,910.0,901.254,898.0,169500,911.0,893.0
240,2015/08/18,925.0,922.926,914.0,170100,930.0,914.0
241,2015/08/19,936.0,928.119,925.0,218200,941.0,915.0
242,2015/08/20,925.0,925.472,925.0,191000,936.0,919.0
243,2015/08/21,899.0,900.902,895.0,138300,912.0,895.0
244,2015/08/24,869.0,884.317,881.0,171000,903.0,869.0
245,2015/08/25,822.0,838.822,822.0,200500,873.0,811.0
246,2015/08/26,837.0,834.76,860.0,142700,860.0,821.0
247,2015/08/27,847.0,850.655,849.0,174500,864.0,839.0
248,2015/08/28,889.0,884.408,875.0,97700,898.0,865.0
249,2015/08/31,883.0,884.495,889.0,113900,901.0,875.0
250,2015/09/01,862.0,879.897,889.0,118800,899.0,861.0
251,2015/09/02,843.0,853.201,850.0,189000,867.0,838.0
252,2015/09/03,855.0,860.937,852.0,112000,872.0,852.0
253,2015/09/04,820.0,828.754,841.0,218600,850.0,813.0
254,2015/09/07,813.0,816.217,813.0,79200,827.0,805.0
255,2015/09/08,785.0,797.524,813.0,67700,813.0,784.0
256,2015/09/09,826.0,816.335,804.0,76800,828.0,798.0
257,2015/09/10,817.0,810.217,805.0,66500,825.0,794.0
258,2015/09/11,815.0,804.274,794.0,127300,824.0,793.0
259,2015/09/14,808.0,814.569,815.0,96700,832.0,805.0
260,2015/09/15,808.0,815.38,815.0,73500,827.0,804.0
261,2015/09/16,802.0,801.938,815.0,108800,816.0,795.0
262,2015/09/17,802.0,793.947,805.0,133800,807.0,777.0
263,2015/09/18,776.0,783.99,796.0,154000,808.0,726.0
264,2015/09/24,754.0,757.715,766.0,173000,772.0,734.0
265,2015/09/25,789.0,774.653,758.0,82400,790.0,758.0
266,2015/09/28,784.0,781.492,781.0,55100,791.0,765.0
267,2015/09/29,777.0,783.717,784.0,106700,794.0,767.0
268,2015/09/30,783.0,788.053,788.0,58300,803.0,774.0
269,2015/10/01,792.0,787.587,788.0,54500,793.0,778.0
270,2015/10/02,791.0,789.554,788.0,30700,799.0,784.0
271,2015/10/05,807.0,804.246,800.0,46700,814.0,796.0
272,2015/10/06,810.0,817.672,818.0,63800,832.0,807.0
273,2015/10/07,816.0,805.387,816.0,33300,817.0,799.0
274,2015/10/08,820.0,813.811,813.0,81600,824.0,800.0
275,2015/10/09,832.0,825.306,820.0,63500,837.0,813.0
276,2015/10/13,841.0,842.796,832.0,58400,852.0,832.0
277,2015/10/14,823.0,824.003,837.0,36300,841.0,813.0
278,2015/10/15,848.0,839.742,823.0,31000,849.0,821.0
279,2015/10/16,841.0,846.96,855.0,46900,863.0,835.0
280,2015/10/19,814.0,817.163,838.0,56500,838.0,806.0
281,2015/10/20,816.0,814.581,824.0,40100,824.0,805.0
282,2015/10/21,841.0,832.437,818.0,55800,844.0,812.0
283,2015/10/22,837.0,840.007,830.0,30700,848.0,830.0
284,2015/10/23,858.0,862.052,850.0,83000,874.0,842.0
285,2015/10/26,874.0,872.301,873.0,62700,880.0,863.0
286,2015/10/27,841.0,851.196,872.0,43400,872.0,840.0
287,2015/10/28,827.0,828.722,849.0,37100,849.0,818.0
288,2015/10/29,836.0,839.609,838.0,156400,854.0,832.0
289,2015/10/30,857.0,857.932,840.0,72300,867.0,840.0
290,2015/11/02,870.0,868.867,856.0,70000,878.0,856.0
291,2015/11/04,899.0,894.187,880.0,102600,900.0,880.0
292,2015/11/05,916.0,909.481,899.0,110500,924.0,894.0
293,2015/11/06,935.0,944.486,919.0,126700,960.0,919.0
294,2015/11/09,955.0,947.838,930.0,124700,957.0,925.0
295,2015/11/10,962.0,961.773,945.0,66800,970.0,937.0
296,2015/11/11,941.0,944.613,953.0,75200,963.0,935.0
297,2015/11/12,958.0,952.749,942.0,38300,961.0,942.0
298,2015/11/13,942.0,943.04,951.0,32800,955.0,935.0
299,2015/11/16,927.0,922.652,931.0,65200,933.0,914.0
300,2015/11/17,946.0,945.448,930.0,54700,954.0,930.0
301,2015/11/18,946.0,948.688,950.0,39100,952.0,942.0
302,2015/11/19,948.0,949.427,950.0,34900,955.0,944.0
303,2015/11/20,959.0,956.143,950.0,34900,961.0,950.0
304,2015/11/24,961.0,959.287,958.0,42100,964.0,955.0
305,2015/11/25,972.0,969.7,965.0,73000,976.0,952.0
306,2015/11/26,960.0,982.435,977.0,118200,999.0,959.0
307,2015/11/27,969.0,969.282,963.0,35800,978.0,963.0
308,2015/11/30,989.0,984.696,984.0,71800,996.0,971.0
309,2015/12/01,977.0,974.761,985.0,43000,985.0,963.0
310,2015/12/02,972.0,974.645,986.0,34400,987.0,966.0
311,2015/12/03,990.0,983.919,984.0,47900,990.0,973.0
312,2015/12/04,970.0,969.278,975.0,48600,978.0,961.0
313,2015/12/07,993.0,992.448,978.0,45300,1000.0,978.0
314,2015/12/08,973.0,981.357,998.0,45700,999.0,967.0
315,2015/12/09,990.0,992.237,999.0,83500,1000.0,980.0
316,2015/12/10,968.0,978.666,1000.0,80500,1000.0,959.0
317,2015/12/11,1018.0,1000.554,992.0,189500,1019.0,979.0
318,2015/12/14,1001.0,994.545,1010.0,62400,1018.0,974.0
319,2015/12/15,1023.0,1011.102,1001.0,65900,1024.0,988.0
320,2015/12/16,1044.0,1035.518,1030.0,130400,1047.0,1026.0
321,2015/12/17,1042.0,1052.212,1047.0,116100,1070.0,1035.0
322,2015/12/18,1040.0,1049.016,1050.0,58100,1069.0,1036.0
323,2015/12/21,1027.0,1029.303,1040.0,60400,1045.0,1017.0
324,2015/12/22,1012.0,1009.436,1016.0,82800,1030.0,998.0
325,2015/12/24,1017.0,1022.135,1024.0,45300,1032.0,1015.0
326,2015/12/25,1003.0,1007.077,1005.0,36200,1015.0,993.0
327,2015/12/28,1025.0,1020.966,1019.0,46600,1030.0,1013.0
328,2015/12/29,1032.0,1028.0,1022.0,40800,1041.0,1014.0
329,2015/12/30,1028.0,1034.471,1045.0,21000,1048.0,1023.0
330,2016/01/04,996.0,1001.125,1006.0,40800,1028.0,975.0
331,2016/01/05,992.0,990.218,988.0,34400,1002.0,978.0
332,2016/01/06,970.0,971.275,982.0,43700,995.0,958.0
333,2016/01/07,940.0,947.974,964.0,45200,966.0,938.0
334,2016/01/08,933.0,937.229,934.0,43600,950.0,929.0
335,2016/01/12,904.0,911.559,920.0,33300,928.0,903.0
336,2016/01/13,944.0,937.628,920.0,22300,948.0,920.0
337,2016/01/14,925.0,921.315,918.0,38700,928.0,907.0
338,2016/01/15,963.0,955.947,953.0,50900,963.0,941.0
339,2016/01/18,951.0,952.935,950.0,39900,965.0,941.0
340,2016/01/19,960.0,956.897,956.0,32000,967.0,945.0
341,2016/01/20,924.0,936.116,956.0,45600,960.0,924.0
342,2016/01/21,884.0,904.304,909.0,63100,927.0,883.0
343,2016/01/22,933.0,921.777,910.0,50200,935.0,910.0
344,2016/01/25,967.0,963.437,963.0,31100,969.0,951.0
345,2016/01/26,918.0,932.131,958.0,32100,958.0,916.0
346,2016/01/27,943.0,940.079,943.0,34100,948.0,927.0
347,2016/01/28,946.0,946.112,940.0,46400,960.0,919.0
348,2016/01/29,941.0,935.478,952.0,74000,955.0,909.0
349,2016/02/01,974.0,967.745,957.0,40000,976.0,950.0
350,2016/02/02,971.0,971.585,955.0,30600,980.0,955.0
351,2016/02/03,926.0,929.806,941.0,34000,951.0,920.0
352,2016/02/04,924.0,923.523,912.0,17600,931.0,912.0
353,2016/02/05,926.0,920.295,910.0,42100,936.0,910.0
354,2016/02/08,964.0,942.254,926.0,35900,966.0,900.0
355,2016/02/09,899.0,900.813,919.0,55100,934.0,877.0
356,2016/02/10,897.0,879.067,901.0,83800,907.0,850.0
357,2016/02/12,845.0,857.05,869.0,66000,883.0,841.0
358,2016/02/15,878.0,864.369,858.0,94700,886.0,830.0
359,2016/02/16,882.0,896.635,888.0,81900,919.0,879.0
360,2016/02/17,878.0,878.104,879.0,27800,899.0,863.0
361,2016/02/18,890.0,897.725,899.0,43200,908.0,888.0
362,2016/02/19,880.0,880.403,886.0,21100,891.0,870.0
363,2016/02/22,863.0,868.19,871.0,24700,885.0,859.0
364,2016/02/23,849.0,855.233,874.0,16300,874.0,844.0
365,2016/02/24,853.0,859.758,838.0,31800,872.0,833.0
366,2016/02/25,911.0,902.929,850.0,49200,915.0,850.0
367,2016/02/26,915.0,917.332,910.0,44000,935.0,906.0
368,2016/02/29,882.0,900.03,927.0,46100,929.0,878.0
369,2016/03/01,899.0,887.404,876.0,38100,900.0,874.0
370,2016/03/02,940.0,928.489,901.0,63000,943.0,901.0
371,2016/03/03,945.0,936.903,938.0,48600,948.0,922.0
372,2016/03/04,945.0,939.73,940.0,27000,945.0,932.0
373,2016/03/07,952.0,954.198,957.0,41400,969.0,946.0
374,2016/03/08,964.0,951.864,945.0,65500,973.0,929.0
375,2016/03/09,1011.0,992.44,971.0,131900,1017.0,971.0
376,2016/03/10,1046.0,1045.081,1019.0,136200,1060.0,1019.0
377,2016/03/11,1041.0,1032.868,1028.0,88000,1046.0,1017.0
378,2016/03/14,1060.0,1050.245,1047.0,84200,1060.0,1038.0
379,2016/03/15,1085.0,1081.864,1065.0,89100,1103.0,1056.0
380,2016/03/16,1041.0,1042.731,1065.0,102200,1067.0,1024.0
381,2016/03/17,1028.0,1038.622,1053.0,79700,1065.0,1017.0
382,2016/03/18,1024.0,1024.358,1028.0,34600,1036.0,1016.0
383,2016/03/22,1063.0,1057.509,1054.0,51500,1069.0,1041.0
384,2016/03/23,1046.0,1047.101,1063.0,32800,1069.0,1035.0
385,2016/03/24,1036.0,1037.238,1032.0,55000,1047.0,1026.0
386,2016/03/25,1055.0,1042.582,1034.0,45200,1055.0,1023.0
387,2016/03/28,1073.0,1062.823,1060.0,61700,1073.0,1050.0
388,2016/03/29,1111.0,1103.286,1051.0,118800,1118.0,1051.0
389,2016/03/30,1095.0,1087.323,1111.0,84000,1111.0,1042.0
390,2016/03/31,1078.0,1086.896,1103.0,36600,1108.0,1076.0
391,2016/04/01,1043.0,1056.466,1094.0,76000,1094.0,1041.0
392,2016/04/04,1094.0,1081.24,1049.0,44100,1096.0,1049.0
393,2016/04/05,1087.0,1085.079,1096.0,79400,1108.0,1070.0
394,2016/04/06,1088.0,1082.353,1079.0,45600,1094.0,1063.0
395,2016/04/07,1120.0,1110.418,1092.0,123100,1120.0,1090.0
396,2016/04/08,1100.0,1095.808,1071.0,160200,1114.0,1065.0
397,2016/04/11,1099.0,1096.928,1096.0,37700,1114.0,1080.0
398,2016/04/12,1130.0,1124.51,1103.0,55700,1138.0,1091.0
399,2016/04/13,1161.0,1161.329,1132.0,106400,1195.0,1132.0
400,2016/04/14,1165.0,1167.101,1190.0,80600,1190.0,1145.0
401,2016/04/15,1130.0,1139.385,1160.0,57100,1162.0,1123.0
402,2016/04/18,1080.0,1094.771,1110.0,52500,1110.0,1079.0
403,2016/04/19,1128.0,1119.037,1080.0,70900,1140.0,1080.0
404,2016/04/20,1152.0,1146.981,1121.0,66600,1171.0,1118.0
405,2016/04/21,1163.0,1163.823,1172.0,61700,1187.0,1150.0
406,2016/04/22,1162.0,1141.399,1163.0,70600,1167.0,1113.0
407,2016/04/25,1164.0,1153.36,1160.0,42500,1170.0,1140.0
408,2016/04/26,1163.0,1164.528,1161.0,46200,1180.0,1145.0
409,2016/04/27,1135.0,1144.766,1162.0,49100,1175.0,1132.0
410,2016/04/28,1157.0,1146.724,1152.0,100200,1177.0,1079.0
411,2016/05/02,1128.0,1116.407,1105.0,52400,1159.0,1100.0
412,2016/05/06,1097.0,1099.365,1110.0,83100,1131.0,1086.0
413,2016/05/09,1121.0,1114.146,1094.0,41700,1124.0,1094.0
414,2016/05/10,1063.0,1079.658,1135.0,174000,1142.0,992.0
415,2016/05/11,1010.0,1003.333,1021.0,206900,1021.0,975.0
416,2016/05/12,1100.0,1086.541,1026.0,166100,1111.0,1026.0
417,2016/05/13,1061.0,1069.8,1096.0,76600,1096.0,1052.0
418,2016/05/16,1073.0,1068.577,1031.0,78500,1099.0,1031.0
419,2016/05/17,1112.0,1102.309,1084.0,51400,1115.0,1069.0
420,2016/05/18,1062.0,1067.193,1106.0,82900,1106.0,1052.0
421,2016/05/19,1048.0,1050.712,1053.0,89000,1064.0,1038.0
422,2016/05/20,1042.0,1028.33,1050.0,102900,1060.0,1013.0
423,2016/05/23,1041.0,1036.162,1034.0,75200,1053.0,1026.0
424,2016/05/24,1045.0,1045.976,1039.0,58500,1066.0,1033.0
425,2016/05/25,1041.0,1040.742,1050.0,57300,1065.0,1033.0
426,2016/05/26,1057.0,1045.206,1041.0,65900,1062.0,1025.0
427,2016/05/27,1049.0,1051.253,1057.0,40700,1061.0,1043.0
428,2016/05/30,1060.0,1055.969,1057.0,35900,1064.0,1047.0
429,2016/05/31,1046.0,1049.565,1072.0,471600,1072.0,1046.0
430,2016/06/01,1058.0,1080.326,1042.0,111000,1103.0,1042.0
431,2016/06/02,1047.0,1045.86,1050.0,57800,1063.0,1019.0
432,2016/06/03,1032.0,1033.963,1040.0,73500,1055.0,1024.0
433,2016/06/06,1008.0,1011.443,1020.0,131300,1030.0,999.0
434,2016/06/07,1009.0,1011.541,1015.0,31400,1029.0,1004.0
435,2016/06/08,1013.0,1011.434,1018.0,37800,1019.0,1000.0
436,2016/06/09,998.0,1000.677,1000.0,84200,1016.0,993.0
437,2016/06/10,969.0,985.921,1000.0,151400,1000.0,968.0
438,2016/06/13,925.0,938.482,949.0,61000,958.0,925.0
439,2016/06/14,896.0,904.076,922.0,77700,925.0,893.0
440,2016/06/15,899.0,897.263,889.0,52100,911.0,882.0
441,2016/06/16,867.0,879.438,903.0,54800,903.0,866.0
442,2016/06/17,877.0,884.737,878.0,63900,910.0,875.0
443,2016/06/20,902.0,905.386,896.0,43500,916.0,892.0
444,2016/06/21,916.0,907.055,898.0,61500,920.0,882.0
445,2016/06/22,853.0,867.399,900.0,72900,900.0,851.0
446,2016/06/23,881.0,870.859,853.0,78200,887.0,845.0
447,2016/06/24,833.0,859.661,921.0,106900,921.0,803.0
448,2016/06/27,861.0,859.983,863.0,65600,878.0,848.0
449,2016/06/28,862.0,853.518,835.0,66800,873.0,831.0
450,2016/06/29,870.0,868.414,869.0,41600,877.0,854.0
451,2016/06/30,880.0,881.731,875.0,79800,892.0,867.0
452,2016/07/01,901.0,905.57,914.0,62100,914.0,897.0
453,2016/07/04,894.0,902.734,916.0,63600,916.0,886.0
454,2016/07/05,909.0,907.096,901.0,56400,916.0,883.0
455,2016/07/06,875.0,874.477,900.0,66300,900.0,858.0
456,2016/07/07,874.0,875.794,872.0,65500,895.0,860.0
457,2016/07/08,861.0,872.341,885.0,48100,890.0,859.0
458,2016/07/11,919.0,907.881,891.0,36900,923.0,885.0
459,2016/07/12,970.0,965.815,946.0,61200,981.0,940.0
460,2016/07/13,947.0,968.733,998.0,40100,998.0,941.0
461,2016/07/14,950.0,947.707,951.0,27300,953.0,934.0
462,2016/07/15,976.0,964.81,956.0,93900,985.0,926.0
463,2016/07/19,1009.0,992.13,976.0,101600,1016.0,951.0
464,2016/07/20,983.0,981.359,998.0,39800,998.0,968.0
465,2016/07/21,1014.0,997.441,990.0,66600,1016.0,977.0
466,2016/07/22,989.0,989.353,997.0,19000,1000.0,982.0
467,2016/07/25,980.0,984.785,987.0,27000,997.0,975.0
468,2016/07/26,971.0,971.852,978.0,25600,980.0,963.0
469,2016/07/27,989.0,986.437,980.0,45800,999.0,954.0
470,2016/07/28,974.0,973.822,977.0,19100,992.0,962.0
471,2016/07/29,969.0,964.385,971.0,23900,975.0,941.0
472,2016/08/01,972.0,963.148,954.0,27100,976.0,938.0
473,2016/08/02,989.0,987.104,956.0,39400,1007.0,956.0
474,2016/08/03,947.0,950.407,963.0,37100,978.0,938.0
475,2016/08/04,938.0,934.598,940.0,29100,945.0,921.0
476,2016/08/05,934.0,935.813,939.0,24000,948.0,928.0
477,2016/08/08,966.0,954.372,939.0,54300,975.0,918.0
478,2016/08/09,952.0,953.0,966.0,47900,973.0,922.0
479,2016/08/10,933.0,938.37,956.0,35100,968.0,929.0
480,2016/08/12,941.0,937.743,945.0,61800,946.0,925.0
481,2016/08/15,929.0,933.88,928.0,33400,954.0,915.0
482,2016/08/16,929.0,932.242,928.0,65700,943.0,918.0
483,2016/08/17,901.0,903.669,916.0,59200,917.0,895.0
484,2016/08/18,876.0,880.704,890.0,30100,892.0,873.0
485,2016/08/19,877.0,879.204,876.0,16200,889.0,876.0
486,2016/08/22,891.0,886.072,878.0,15300,895.0,878.0
487,2016/08/23,870.0,878.163,891.0,28800,895.0,870.0
488,2016/08/24,882.0,883.834,884.0,20500,895.0,873.0
489,2016/08/25,870.0,875.633,882.0,14700,889.0,869.0
490,2016/08/26,861.0,865.348,871.0,28200,880.0,855.0
491,2016/08/29,888.0,884.563,875.0,19000,894.0,860.0
492,2016/08/30,902.0,899.628,893.0,24200,910.0,888.0
493,2016/08/31,954.0,927.552,900.0,78700,957.0,900.0
494,2016/09/01,1008.0,1001.325,969.0,133400,1026.0,954.0
495,2016/09/02,1012.0,1001.595,992.0,73400,1015.0,975.0
496,2016/09/05,1012.0,1008.607,999.0,79800,1017.0,995.0
497,2016/09/06,1003.0,1006.822,1015.0,105200,1015.0,995.0
498,2016/09/07,998.0,997.38,979.0,81600,1005.0,978.0
499,2016/09/08,988.0,992.229,986.0,34900,1000.0,986.0
500,2016/09/09,998.0,997.96,986.0,77200,1013.0,986.0
501,2016/09/12,996.0,986.868,968.0,35600,1000.0,968.0
502,2016/09/13,1018.0,1014.028,1000.0,65000,1024.0,997.0
503,2016/09/14,1027.0,1026.147,1016.0,78900,1033.0,1004.0
504,2016/09/15,976.0,991.584,1012.0,50000,1015.0,976.0
505,2016/09/16,954.0,953.921,980.0,495600,980.0,940.0
506,2016/09/20,997.0,991.64,950.0,66300,1001.0,950.0
507,2016/09/21,1040.0,1021.468,993.0,91800,1040.0,991.0
508,2016/09/23,1047.0,1042.42,1040.0,116700,1053.0,1024.0
509,2016/09/26,1021.0,1027.905,1042.0,30500,1042.0,1019.0
510,2016/09/27,1035.0,1027.34,1018.0,84700,1035.0,1014.0
511,2016/09/28,1044.0,1031.008,1035.0,52800,1045.0,1001.0
512,2016/09/29,1055.0,1054.964,1048.0,39000,1059.0,1039.0
513,2016/09/30,1036.0,1026.854,995.0,129900,1050.0,986.0
514,2016/10/03,1014.0,1023.461,1047.0,30600,1050.0,1010.0
515,2016/10/04,1046.0,1041.733,1018.0,50200,1050.0,1018.0
516,2016/10/05,1046.0,1039.063,1033.0,57100,1046.0,1026.0
517,2016/10/06,1040.0,1041.851,1045.0,30900,1050.0,1035.0
518,2016/10/07,1023.0,1023.212,1034.0,26000,1035.0,1016.0
519,2016/10/11,1065.0,1059.572,1029.0,91400,1072.0,1029.0
520,2016/10/12,1044.0,1047.902,1042.0,55000,1057.0,1042.0
521,2016/10/13,1040.0,1034.158,1034.0,70700,1050.0,1021.0
522,2016/10/14,1043.0,1038.094,1032.0,50100,1049.0,1023.0
523,2016/10/17,1039.0,1036.492,1031.0,25400,1045.0,1031.0
524,2016/10/18,1031.0,1029.985,1028.0,40000,1038.0,1026.0
525,2016/10/19,1038.0,1037.706,1033.0,33300,1045.0,1031.0
526,2016/10/20,1050.0,1049.238,1038.0,44500,1055.0,1037.0
527,2016/10/21,1040.0,1043.071,1046.0,43600,1050.0,1038.0
528,2016/10/24,1027.0,1026.751,1036.0,38900,1036.0,1018.0
529,2016/10/25,1048.0,1045.392,1029.0,53800,1053.0,1029.0
530,2016/10/26,1050.0,1049.563,1048.0,31100,1054.0,1042.0
531,2016/10/27,1055.0,1055.113,1051.0,36300,1065.0,1046.0
532,2016/10/28,1053.0,1055.796,1064.0,200400,1068.0,1051.0
533,2016/10/31,1057.0,1056.422,1053.0,53800,1064.0,1041.0
534,2016/11/01,1098.0,1083.67,1047.0,93100,1099.0,1042.0
535,2016/11/02,1086.0,1083.566,1080.0,72600,1089.0,1072.0
536,2016/11/04,1066.0,1067.283,1065.0,55800,1082.0,1057.0
537,2016/11/07,1120.0,1114.075,1100.0,80000,1124.0,1089.0
538,2016/11/08,1108.0,1101.504,1060.0,69200,1120.0,1060.0
539,2016/11/09,1056.0,1076.402,1105.0,67100,1117.0,1053.0
540,2016/11/10,1118.0,1120.088,1124.0,74300,1133.0,1110.0
541,2016/11/11,1113.0,1117.349,1121.0,59400,1135.0,1104.0
542,2016/11/14,1125.0,1126.628,1113.0,63200,1134.0,1113.0
543,2016/11/15,1118.0,1119.431,1122.0,36000,1131.0,1111.0
544,2016/11/16,1120.0,1117.361,1120.0,59000,1126.0,1107.0
545,2016/11/17,1118.0,1116.482,1105.0,27800,1122.0,1105.0
546,2016/11/18,1125.0,1124.955,1116.0,76200,1135.0,1109.0
547,2016/11/21,1120.0,1119.49,1120.0,30600,1124.0,1113.0
548,2016/11/22,1110.0,1110.978,1119.0,31700,1120.0,1095.0
549,2016/11/24,1108.0,1108.14,1109.0,27900,1114.0,1099.0
550,2016/11/25,1112.0,1112.036,1105.0,41200,1123.0,1105.0
551,2016/11/28,1113.0,1105.206,1106.0,47100,1115.0,1096.0
552,2016/11/29,1125.0,1120.158,1109.0,39300,1127.0,1105.0
553,2016/11/30,1136.0,1129.018,1119.0,83700,1136.0,1109.0
554,2016/12/01,1127.0,1137.136,1140.0,59400,1150.0,1123.0
555,2016/12/02,1087.0,1094.702,1120.0,37900,1120.0,1080.0
556,2016/12/05,1074.0,1072.829,1073.0,49000,1082.0,1060.0
557,2016/12/06,1085.0,1088.959,1104.0,70800,1104.0,1077.0
558,2016/12/07,1122.0,1109.952,1095.0,72600,1128.0,1092.0
559,2016/12/08,1138.0,1132.114,1133.0,73900,1142.0,1113.0
560,2016/12/09,1139.0,1131.342,1124.0,83000,1144.0,1116.0
561,2016/12/12,1133.0,1135.21,1144.0,49100,1144.0,1118.0
562,2016/12/13,1140.0,1133.01,1134.0,48000,1144.0,1117.0
563,2016/12/14,1139.0,1138.961,1146.0,40900,1146.0,1130.0
564,2016/12/15,1149.0,1143.635,1145.0,47400,1149.0,1134.0
565,2016/12/16,1147.0,1148.031,1149.0,70500,1158.0,1115.0
566,2016/12/19,1142.0,1141.375,1147.0,34400,1149.0,1128.0
567,2016/12/20,1134.0,1126.795,1136.0,51600,1143.0,1054.0
568,2016/12/21,1113.0,1119.03,1134.0,36500,1135.0,1110.0
569,2016/12/22,1126.0,1120.792,1108.0,37900,1130.0,1098.0
570,2016/12/26,1127.0,1126.356,1119.0,41000,1137.0,1119.0
571,2016/12/27,1124.0,1123.029,1122.0,24000,1131.0,1113.0
572,2016/12/28,1137.0,1132.345,1130.0,76300,1141.0,1119.0
573,2016/12/29,1119.0,1118.399,1135.0,33100,1136.0,1102.0
574,2016/12/30,1147.0,1140.303,1114.0,42600,1150.0,1111.0
575,2017/01/04,1180.0,1170.136,1150.0,46200,1181.0,1149.0
576,2017/01/05,1173.0,1175.823,1182.0,30500,1183.0,1170.0
577,2017/01/06,1175.0,1174.702,1172.0,31500,1179.0,1166.0
578,2017/01/10,1178.0,1182.084,1176.0,40700,1197.0,1168.0
579,2017/01/11,1180.0,1179.109,1184.0,21100,1186.0,1170.0
580,2017/01/12,1151.0,1158.426,1173.0,46900,1180.0,1148.0
581,2017/01/13,1158.0,1155.074,1141.0,27100,1166.0,1141.0
582,2017/01/16,1150.0,1151.412,1154.0,23300,1168.0,1135.0
583,2017/01/17,1129.0,1128.741,1147.0,25900,1147.0,1117.0
584,2017/01/18,1134.0,1129.424,1123.0,22400,1139.0,1120.0
585,2017/01/19,1152.0,1152.584,1145.0,17300,1160.0,1145.0
586,2017/01/20,1156.0,1149.645,1145.0,29300,1163.0,1134.0
587,2017/01/23,1121.0,1129.046,1138.0,35000,1144.0,1120.0
588,2017/01/24,1110.0,1116.552,1116.0,29000,1138.0,1094.0
589,2017/01/25,1129.0,1128.16,1129.0,80000,1139.0,1107.0
590,2017/01/26,1129.0,1129.019,1137.0,42000,1138.0,1120.0
591,2017/01/27,1122.0,1125.269,1134.0,41700,1135.0,1113.0
592,2017/01/30,1112.0,1110.963,1112.0,27300,1115.0,1105.0
593,2017/01/31,1100.0,1097.592,1100.0,36800,1112.0,1089.0
594,2017/02/01,1108.0,1098.232,1087.0,28400,1112.0,1079.0
595,2017/02/02,1068.0,1079.809,1108.0,33000,1108.0,1067.0
596,2017/02/03,1092.0,1080.058,1068.0,60900,1097.0,1064.0
597,2017/02/06,1086.0,1076.579,1098.0,47700,1098.0,1050.0
598,2017/02/07,1061.0,1066.038,1070.0,16000,1077.0,1061.0
599,2017/02/08,1061.0,1060.943,1061.0,31800,1072.0,1054.0
600,2017/02/09,1067.0,1068.881,1057.0,47000,1085.0,1054.0
601,2017/02/10,1069.0,1072.801,1087.0,79700,1087.0,1063.0
602,2017/02/13,1080.0,1074.614,1039.0,110200,1101.0,1031.0
603,2017/02/14,1078.0,1090.495,1087.0,66900,1110.0,1073.0
604,2017/02/15,1100.0,1098.413,1091.0,63000,1107.0,1090.0
605,2017/02/16,1109.0,1101.275,1096.0,30900,1112.0,1085.0
606,2017/02/17,1094.0,1091.94,1106.0,28400,1106.0,1084.0
607,2017/02/20,1094.0,1091.923,1092.0,16900,1098.0,1076.0
608,2017/02/21,1101.0,1099.511,1091.0,33300,1105.0,1080.0
609,2017/02/22,1113.0,1108.158,1104.0,43700,1120.0,1082.0
610,2017/02/23,1100.0,1103.003,1110.0,33900,1115.0,1096.0
611,2017/02/24,1100.0,1102.914,1096.0,46600,1112.0,1089.0
612,2017/02/27,1083.0,1086.25,1091.0,22000,1101.0,1078.0
613,2017/02/28,1093.0,1100.003,1085.0,90200,1115.0,1085.0
614,2017/03/01,1102.0,1098.957,1097.0,16300,1104.0,1086.0
615,2017/03/02,1120.0,1108.972,1111.0,97700,1129.0,1096.0
616,2017/03/03,1111.0,1105.591,1111.0,95200,1114.0,1084.0
617,2017/03/06,1085.0,1087.988,1099.0,40700,1099.0,1076.0
618,2017/03/07,1074.0,1077.847,1085.0,38000,1091.0,1070.0
619,2017/03/08,1071.0,1068.445,1076.0,52600,1076.0,1057.0
620,2017/03/09,1082.0,1085.639,1080.0,75800,1099.0,1070.0
621,2017/03/10,1088.0,1086.784,1080.0,144600,1099.0,1071.0
622,2017/03/13,1077.0,1079.313,1086.0,42500,1086.0,1070.0
623,2017/03/14,1073.0,1075.514,1081.0,35000,1085.0,1070.0
624,2017/03/15,1063.0,1064.855,1065.0,22100,1070.0,1062.0
625,2017/03/16,1066.0,1062.509,1049.0,66000,1075.0,1045.0
626,2017/03/17,1067.0,1067.968,1066.0,74000,1079.0,1056.0
627,2017/03/21,1060.0,1060.107,1053.0,52300,1070.0,1053.0
628,2017/03/22,1037.0,1039.795,1031.0,43000,1052.0,1026.0
629,2017/03/23,1028.0,1031.074,1041.0,28300,1043.0,1026.0
630,2017/03/24,1044.0,1040.84,1023.0,50600,1050.0,1023.0
631,2017/03/27,1013.0,1019.839,1033.0,42800,1034.0,1010.0
632,2017/03/28,1030.0,1029.689,1023.0,62700,1036.0,1022.0
633,2017/03/29,1037.0,1034.994,1029.0,81100,1044.0,1018.0
634,2017/03/30,1028.0,1029.204,1023.0,53900,1035.0,1022.0
635,2017/03/31,1014.0,1024.235,1031.0,67300,1037.0,1014.0
636,2017/04/03,1007.0,1010.475,1014.0,39200,1023.0,1007.0
637,2017/04/04,988.0,992.848,1005.0,40800,1005.0,980.0
638,2017/04/05,979.0,987.023,994.0,38500,1000.0,979.0
639,2017/04/06,955.0,961.794,981.0,72700,984.0,946.0
640,2017/04/07,955.0,963.452,964.0,81500,973.0,954.0
641,2017/04/10,960.0,963.509,956.0,68200,970.0,955.0
642,2017/04/11,947.0,949.582,950.0,72300,955.0,940.0
643,2017/04/12,942.0,937.768,931.0,63900,944.0,930.0
644,2017/04/13,937.0,933.254,932.0,37400,947.0,928.0
645,2017/04/14,933.0,933.949,931.0,33100,944.0,926.0
646,2017/04/17,934.0,932.807,933.0,23300,939.0,928.0
647,2017/04/18,935.0,940.525,941.0,27800,949.0,935.0
648,2017/04/19,940.0,940.379,928.0,35400,946.0,928.0
649,2017/04/20,951.0,950.495,944.0,40200,954.0,941.0
650,2017/04/21,956.0,957.291,958.0,32700,988.0,949.0
651,2017/04/24,969.0,973.264,963.0,54900,987.0,960.0
652,2017/04/25,975.0,975.287,967.0,28200,980.0,967.0
653,2017/04/26,982.0,981.769,980.0,35100,989.0,972.0
654,2017/04/27,988.0,984.619,970.0,53800,991.0,967.0
655,2017/04/28,980.0,981.292,973.0,51700,988.0,970.0
656,2017/05/01,993.0,990.486,974.0,17300,996.0,974.0
657,2017/05/02,1001.0,999.285,985.0,33700,1004.0,983.0
658,2017/05/08,1027.0,1024.279,1010.0,61700,1030.0,1010.0
659,2017/05/09,1028.0,1027.484,1030.0,45500,1032.0,1021.0
660,2017/05/10,1029.0,1029.584,1028.0,39700,1034.0,1020.0
661,2017/05/11,1010.0,1010.696,1004.0,48700,1022.0,1000.0
662,2017/05/12,1029.0,1026.658,990.0,117600,1056.0,990.0
663,2017/05/15,1023.0,1025.268,1029.0,98100,1041.0,1014.0
664,2017/05/16,1033.0,1030.946,1030.0,66700,1044.0,1023.0
665,2017/05/17,1043.0,1039.36,1033.0,78100,1049.0,1023.0
666,2017/05/18,1022.0,1019.503,1021.0,36000,1029.0,1014.0
667,2017/05/19,1012.0,1010.43,1025.0,26300,1025.0,1000.0
668,2017/05/22,1009.0,1007.02,1011.0,19600,1017.0,985.0
669,2017/05/23,1011.0,1011.815,1009.0,31900,1017.0,1003.0
670,2017/05/24,1019.0,1017.493,1023.0,20500,1027.0,1011.0
671,2017/05/25,1031.0,1026.432,1009.0,37500,1033.0,1001.0
672,2017/05/26,1022.0,1020.234,1026.0,30400,1026.0,1015.0
673,2017/05/29,1026.0,1027.635,1022.0,29600,1032.0,1012.0
674,2017/05/30,1029.0,1029.678,1035.0,36900,1037.0,1023.0
675,2017/05/31,1029.0,1029.668,1031.0,67800,1047.0,1020.0
676,2017/06/01,1030.0,1030.946,1027.0,42700,1045.0,1022.0
677,2017/06/02,1043.0,1044.636,1038.0,121900,1055.0,1022.0
678,2017/06/05,1029.0,1027.323,1032.0,79900,1033.0,1011.0
679,2017/06/06,1009.0,1013.312,1030.0,41700,1030.0,1004.0
680,2017/06/07,1001.0,1001.223,1006.0,54200,1010.0,995.0
681,2017/06/08,1005.0,1006.946,1002.0,70200,1015.0,996.0
682,2017/06/09,995.0,995.669,992.0,86500,1006.0,992.0
683,2017/06/12,985.0,988.353,992.0,32600,999.0,983.0
684,2017/06/13,989.0,988.512,987.0,60500,994.0,982.0
685,2017/06/14,981.0,988.326,1000.0,47500,1002.0,981.0
686,2017/06/15,968.0,970.334,978.0,50300,978.0,965.0
687,2017/06/16,974.0,975.837,968.0,272000,988.0,955.0
688,2017/06/19,995.0,992.887,980.0,27500,998.0,979.0
689,2017/06/20,1006.0,1001.708,1007.0,91700,1024.0,981.0
690,2017/06/21,992.0,1000.564,1006.0,50700,1012.0,992.0
691,2017/06/22,990.0,993.706,994.0,41500,1004.0,987.0
692,2017/06/23,994.0,993.05,985.0,43800,998.0,985.0
693,2017/06/26,993.0,995.662,998.0,29300,1002.0,990.0
694,2017/06/27,1016.0,1008.413,998.0,52500,1016.0,998.0
695,2017/06/28,1009.0,1027.546,1046.0,57700,1046.0,1007.0
696,2017/06/29,1030.0,1025.303,1022.0,83500,1030.0,1020.0
697,2017/06/30,1029.0,1026.771,1024.0,69900,1032.0,1015.0
698,2017/07/03,1018.0,1023.325,1023.0,84700,1033.0,1017.0
699,2017/07/04,1008.0,1015.803,1025.0,56400,1034.0,1004.0
700,2017/07/05,1031.0,1024.114,998.0,83400,1038.0,998.0
701,2017/07/06,1022.0,1019.206,1018.0,32500,1024.0,1013.0
702,2017/07/07,1029.0,1025.15,1007.0,91000,1033.0,990.0
703,2017/07/10,1029.0,1029.012,1026.0,42800,1034.0,1021.0
704,2017/07/11,1033.0,1034.009,1027.0,34800,1039.0,1027.0
705,2017/07/12,1026.0,1028.57,1020.0,77500,1033.0,1020.0
706,2017/07/13,1029.0,1028.355,1025.0,52900,1035.0,1021.0
707,2017/07/14,1032.0,1031.453,1029.0,84400,1037.0,1027.0
708,2017/07/18,1028.0,1029.605,1033.0,46300,1035.0,1024.0
709,2017/07/19,1027.0,1025.902,1028.0,33800,1029.0,1022.0
710,2017/07/20,1030.0,1028.491,1028.0,28100,1031.0,1024.0
711,2017/07/21,1030.0,1029.757,1025.0,70900,1032.0,1025.0
712,2017/07/24,1034.0,1032.311,1023.0,70500,1041.0,1020.0
713,2017/07/25,1027.0,1030.855,1029.0,77300,1039.0,1027.0
714,2017/07/26,1036.0,1035.004,1032.0,55900,1042.0,1031.0
715,2017/07/27,1033.0,1036.336,1037.0,75300,1042.0,1032.0
716,2017/07/28,1045.0,1036.326,1029.0,56200,1045.0,1020.0
717,2017/07/31,1028.0,1037.128,1045.0,64100,1047.0,1028.0
718,2017/08/01,1032.0,1030.124,1030.0,52400,1034.0,1026.0
719,2017/08/02,1044.0,1040.176,1037.0,29600,1048.0,1029.0
720,2017/08/03,1048.0,1043.249,1046.0,32500,1048.0,1038.0
721,2017/08/04,1058.0,1053.193,1042.0,74300,1060.0,1037.0
722,2017/08/07,1075.0,1073.563,1062.0,82000,1083.0,1062.0
723,2017/08/08,1071.0,1071.038,1078.0,37000,1083.0,1066.0
724,2017/08/09,1060.0,1061.841,1071.0,72200,1080.0,1053.0
725,2017/08/10,1058.0,1058.829,1050.0,62500,1066.0,1049.0
726,2017/08/14,1028.0,1036.272,1037.0,108300,1049.0,1024.0
727,2017/08/15,1048.0,1048.136,1042.0,59400,1055.0,1041.0
728,2017/08/16,1030.0,1039.895,1045.0,90500,1056.0,1028.0
729,2017/08/17,1048.0,1043.956,1027.0,41200,1051.0,1027.0
730,2017/08/18,1023.0,1027.192,1027.0,57700,1035.0,1021.0
731,2017/08/21,1034.0,1039.769,1033.0,64000,1049.0,1027.0
732,2017/08/22,1035.0,1038.262,1039.0,25200,1048.0,1033.0
733,2017/08/23,1032.0,1039.048,1053.0,41800,1054.0,1030.0
734,2017/08/24,1035.0,1038.697,1029.0,36900,1047.0,1028.0
735,2017/08/25,1046.0,1045.921,1032.0,47100,1057.0,1026.0
736,2017/08/28,1068.0,1062.677,1050.0,59800,1073.0,1044.0
737,2017/08/29,1059.0,1058.503,1055.0,47900,1066.0,1050.0
738,2017/08/30,1039.0,1041.096,1063.0,100200,1063.0,1032.0
739,2017/08/31,1040.0,1035.613,1037.0,74900,1042.0,1030.0
740,2017/09/01,1047.0,1046.469,1049.0,75000,1053.0,1038.0
741,2017/09/04,1031.0,1032.955,1041.0,60400,1048.0,1023.0
742,2017/09/05,1018.0,1022.741,1025.0,55100,1033.0,1015.0
743,2017/09/06,1030.0,1027.344,1012.0,59100,1037.0,1009.0
744,2017/09/07,1049.0,1047.958,1035.0,57000,1054.0,1031.0
745,2017/09/08,1042.0,1042.387,1033.0,109100,1055.0,1030.0
746,2017/09/11,1042.0,1048.561,1053.0,43300,1059.0,1040.0
747,2017/09/12,1051.0,1053.43,1060.0,44200,1060.0,1050.0
748,2017/09/13,1035.0,1041.618,1054.0,56300,1055.0,1035.0
749,2017/09/14,1039.0,1035.155,1031.0,79800,1041.0,1025.0
750,2017/09/15,1041.0,1043.341,1036.0,75100,1049.0,1033.0
751,2017/09/19,1054.0,1048.878,1041.0,109600,1059.0,1035.0
752,2017/09/20,1050.0,1046.918,1046.0,77000,1051.0,1037.0
753,2017/09/21,1042.0,1047.134,1050.0,92100,1054.0,1042.0
754,2017/09/22,1046.0,1048.048,1045.0,96600,1054.0,1041.0
755,2017/09/25,1051.0,1051.852,1053.0,104900,1058.0,1049.0
756,2017/09/26,1054.0,1052.241,1051.0,61000,1058.0,1043.0
757,2017/09/27,1050.0,1049.826,1042.0,73100,1055.0,1031.0
758,2017/09/28,1055.0,1055.468,1057.0,90700,1061.0,1047.0
759,2017/09/29,1058.0,1059.931,1061.0,166100,1063.0,1050.0
760,2017/10/02,1060.0,1061.558,1071.0,87500,1071.0,1058.0
761,2017/10/03,1063.0,1063.307,1067.0,52800,1069.0,1059.0
762,2017/10/04,1065.0,1063.647,1063.0,62900,1071.0,1059.0
763,2017/10/05,1071.0,1072.589,1072.0,101700,1082.0,1067.0
764,2017/10/06,1075.0,1073.913,1072.0,50300,1079.0,1069.0
765,2017/10/10,1098.0,1094.17,1072.0,95100,1101.0,1070.0
766,2017/10/11,1104.0,1111.465,1106.0,108600,1127.0,1098.0
767,2017/10/12,1124.0,1121.409,1111.0,70600,1128.0,1107.0
768,2017/10/13,1122.0,1120.367,1119.0,75400,1125.0,1114.0
769,2017/10/16,1114.0,1117.544,1120.0,57700,1124.0,1111.0
770,2017/10/17,1115.0,1113.637,1120.0,37200,1120.0,1109.0
771,2017/10/18,1118.0,1112.277,1111.0,33600,1119.0,1105.0
772,2017/10/19,1114.0,1113.96,1112.0,52700,1119.0,1108.0
773,2017/10/20,1113.0,1110.98,1100.0,54000,1116.0,1100.0
774,2017/10/23,1129.0,1126.79,1117.0,56300,1131.0,1113.0
775,2017/10/24,1139.0,1135.685,1118.0,70200,1141.0,1117.0
776,2017/10/25,1127.0,1129.1,1131.0,59100,1137.0,1122.0
777,2017/10/26,1137.0,1138.139,1125.0,57700,1144.0,1125.0
778,2017/10/27,1144.0,1140.158,1132.0,43000,1145.0,1130.0
779,2017/10/30,1142.0,1139.823,1136.0,171000,1147.0,1124.0
780,2017/10/31,1145.0,1142.477,1130.0,44700,1148.0,1130.0
781,2017/11/01,1143.0,1139.735,1150.0,58000,1150.0,1133.0
782,2017/11/02,1150.0,1144.631,1150.0,50700,1152.0,1132.0
783,2017/11/06,1148.0,1146.353,1141.0,40500,1152.0,1141.0
784,2017/11/07,1151.0,1144.57,1137.0,43700,1152.0,1133.0
785,2017/11/08,1163.0,1158.348,1155.0,51800,1167.0,1146.0
786,2017/11/09,1164.0,1163.991,1169.0,63800,1178.0,1146.0
787,2017/11/10,1154.0,1151.282,1140.0,44700,1165.0,1140.0
788,2017/11/13,1154.0,1144.788,1101.0,71200,1163.0,1101.0
789,2017/11/14,1149.0,1146.916,1138.0,42800,1157.0,1134.0
790,2017/11/15,1138.0,1139.496,1156.0,78900,1156.0,1123.0
791,2017/11/16,1157.0,1148.709,1131.0,47800,1160.0,1122.0
792,2017/11/17,1133.0,1137.447,1157.0,40900,1159.0,1130.0
793,2017/11/20,1132.0,1131.421,1122.0,29000,1138.0,1122.0
794,2017/11/21,1170.0,1166.307,1141.0,47900,1175.0,1140.0
795,2017/11/22,1170.0,1170.654,1180.0,35000,1180.0,1163.0
796,2017/11/24,1186.0,1176.735,1156.0,63100,1191.0,1151.0
797,2017/11/27,1207.0,1200.143,1196.0,54000,1209.0,1186.0
798,2017/11/28,1219.0,1216.387,1218.0,55100,1223.0,1203.0
799,2017/11/29,1209.0,1215.975,1233.0,28500,1233.0,1207.0
800,2017/11/30,1223.0,1216.371,1210.0,107700,1226.0,1206.0
801,2017/12/01,1201.0,1206.499,1211.0,48700,1220.0,1200.0
802,2017/12/04,1210.0,1207.953,1200.0,53600,1215.0,1197.0
803,2017/12/05,1210.0,1208.169,1211.0,60500,1213.0,1202.0
804,2017/12/06,1192.0,1189.529,1191.0,64100,1197.0,1179.0
805,2017/12/07,1196.0,1198.224,1190.0,36600,1206.0,1190.0
806,2017/12/08,1197.0,1181.34,1166.0,73800,1197.0,1166.0
807,2017/12/11,1200.0,1197.376,1198.0,64100,1203.0,1188.0
808,2017/12/12,1192.0,1196.267,1200.0,46000,1203.0,1189.0
809,2017/12/13,1200.0,1197.718,1200.0,48300,1201.0,1189.0
810,2017/12/14,1225.0,1218.688,1216.0,95600,1228.0,1209.0
811,2017/12/15,1214.0,1216.511,1220.0,126200,1224.0,1197.0
812,2017/12/18,1200.0,1195.062,1226.0,184000,1227.0,1150.0
813,2017/12/19,1200.0,1197.287,1200.0,77600,1203.0,1192.0
814,2017/12/20,1241.0,1229.716,1200.0,89500,1247.0,1200.0
815,2017/12/21,1249.0,1249.372,1241.0,64800,1260.0,1241.0
816,2017/12/22,1282.0,1276.582,1255.0,96300,1288.0,1254.0
817,2017/12/25,1312.0,1300.866,1280.0,76700,1314.0,1280.0
818,2017/12/26,1301.0,1303.8,1313.0,47000,1321.0,1296.0
819,2017/12/27,1290.0,1296.543,1304.0,68500,1321.0,1285.0
820,2017/12/28,1278.0,1278.648,1292.0,52200,1297.0,1265.0
821,2017/12/29,1262.0,1263.906,1278.0,35100,1281.0,1256.0
822,2018/01/04,1305.0,1294.851,1288.0,87000,1305.0,1281.0
823,2018/01/05,1320.0,1317.553,1311.0,93400,1325.0,1302.0
824,2018/01/09,1318.0,1316.558,1331.0,74400,1339.0,1306.0
825,2018/01/10,1307.0,1309.794,1325.0,54300,1330.0,1297.0
826,2018/01/11,1298.0,1294.907,1295.0,58300,1302.0,1286.0
827,2018/01/12,1318.0,1316.848,1309.0,81400,1326.0,1308.0
828,2018/01/15,1325.0,1325.942,1339.0,35900,1339.0,1320.0
829,2018/01/16,1321.0,1323.548,1325.0,37800,1331.0,1317.0
830,2018/01/17,1331.0,1329.979,1310.0,52300,1336.0,1310.0
831,2018/01/18,1318.0,1328.929,1346.0,65700,1357.0,1318.0
832,2018/01/19,1331.0,1331.407,1327.0,38800,1340.0,1324.0
833,2018/01/22,1317.0,1321.266,1339.0,28600,1345.0,1313.0
834,2018/01/23,1326.0,1326.567,1336.0,44100,1336.0,1317.0
835,2018/01/24,1322.0,1323.623,1326.0,40000,1331.0,1320.0
836,2018/01/25,1274.0,1282.267,1304.0,49400,1305.0,1272.0
837,2018/01/26,1289.0,1293.039,1289.0,60900,1303.0,1286.0
838,2018/01/29,1295.0,1294.891,1285.0,23800,1300.0,1285.0
839,2018/01/30,1274.0,1278.879,1287.0,37200,1294.0,1273.0
840,2018/01/31,1267.0,1271.249,1274.0,67100,1282.0,1267.0
841,2018/02/01,1296.0,1292.802,1268.0,54400,1301.0,1268.0
842,2018/02/02,1285.0,1285.019,1283.0,46800,1296.0,1270.0
843,2018/02/05,1250.0,1245.505,1226.0,72300,1258.0,1226.0
844,2018/02/06,1168.0,1173.223,1190.0,122400,1207.0,1150.0
845,2018/02/07,1172.0,1186.936,1186.0,80100,1215.0,1172.0
846,2018/02/08,1167.0,1167.964,1167.0,126500,1174.0,1151.0
847,2018/02/09,1147.0,1145.012,1126.0,52000,1167.0,1120.0
848,2018/02/13,1087.0,1048.892,980.0,236800,1102.0,970.0
849,2018/02/14,1057.0,1065.08,1069.0,47600,1095.0,1050.0
850,2018/02/15,1066.0,1073.787,1074.0,39400,1095.0,1066.0
851,2018/02/16,1037.0,1044.97,1059.0,73500,1060.0,1035.0
852,2018/02/19,1089.0,1081.331,1067.0,65600,1090.0,1061.0
853,2018/02/20,1102.0,1094.223,1093.0,51100,1105.0,1077.0
854,2018/02/21,1133.0,1127.952,1105.0,90200,1144.0,1098.0
855,2018/02/22,1132.0,1123.03,1124.0,43200,1133.0,1107.0
856,2018/02/23,1150.0,1150.224,1150.0,52800,1160.0,1144.0
857,2018/02/26,1160.0,1160.255,1162.0,51700,1170.0,1149.0
858,2018/02/27,1162.0,1162.221,1167.0,85100,1177.0,1152.0
859,2018/02/28,1145.0,1154.599,1158.0,69800,1169.0,1145.0
860,2018/03/01,1130.0,1130.579,1150.0,48000,1150.0,1119.0
861,2018/03/02,1100.0,1104.258,1099.0,58600,1111.0,1093.0
862,2018/03/05,1086.0,1089.356,1103.0,50300,1103.0,1081.0
863,2018/03/06,1103.0,1106.824,1100.0,42500,1122.0,1095.0
864,2018/03/07,1110.0,1111.388,1104.0,54700,1124.0,1095.0
865,2018/03/08,1111.0,1116.828,1140.0,34300,1140.0,1105.0
866,2018/03/09,1123.0,1133.073,1141.0,65500,1149.0,1119.0
867,2018/03/12,1142.0,1143.032,1147.0,49400,1153.0,1133.0
868,2018/03/13,1156.0,1150.3,1139.0,51300,1160.0,1137.0
869,2018/03/14,1145.0,1149.342,1160.0,52000,1160.0,1144.0
870,2018/03/15,1137.0,1138.466,1157.0,39700,1157.0,1125.0
871,2018/03/16,1155.0,1151.627,1147.0,78000,1157.0,1141.0
872,2018/03/19,1131.0,1131.629,1146.0,46100,1153.0,1115.0
873,2018/03/20,1133.0,1128.63,1125.0,32400,1138.0,1112.0
874,2018/03/22,1151.0,1147.003,1135.0,36800,1155.0,1134.0
875,2018/03/23,1100.0,1102.839,1121.0,71000,1121.0,1092.0
876,2018/03/26,1110.0,1097.445,1080.0,72800,1110.0,1077.0
877,2018/03/27,1152.0,1142.515,1117.0,82100,1153.0,1111.0
878,2018/03/28,1144.0,1134.838,1130.0,47400,1146.0,1092.0
879,2018/03/29,1148.0,1145.178,1156.0,37700,1156.0,1135.0
880,2018/03/30,1153.0,1154.873,1160.0,51300,1162.0,1141.0
881,2018/04/02,1147.0,1152.073,1164.0,19200,1164.0,1145.0
882,2018/04/03,1145.0,1146.11,1133.0,35500,1158.0,1127.0
883,2018/04/04,1164.0,1162.646,1158.0,72300,1172.0,1148.0
884,2018/04/05,1155.0,1157.975,1171.0,54800,1171.0,1147.0
885,2018/04/06,1146.0,1152.505,1158.0,46500,1163.0,1145.0
886,2018/04/09,1147.0,1145.404,1142.0,26000,1150.0,1138.0
887,2018/04/10,1151.0,1150.321,1146.0,49900,1157.0,1132.0
888,2018/04/11,1155.0,1154.627,1155.0,51800,1163.0,1145.0
889,2018/04/12,1148.0,1151.839,1159.0,33500,1160.0,1145.0
890,2018/04/13,1176.0,1174.68,1156.0,49300,1184.0,1156.0
891,2018/04/16,1168.0,1165.63,1161.0,77200,1174.0,1159.0
892,2018/04/17,1170.0,1173.933,1179.0,29700,1187.0,1162.0
893,2018/04/18,1195.0,1188.448,1167.0,61800,1198.0,1162.0
894,2018/04/19,1183.0,1188.014,1196.0,22000,1207.0,1181.0
895,2018/04/20,1181.0,1180.691,1176.0,39800,1188.0,1164.0
896,2018/04/23,1176.0,1175.372,1172.0,46300,1180.0,1166.0
897,2018/04/24,1193.0,1190.678,1186.0,28900,1196.0,1180.0
898,2018/04/25,1191.0,1188.939,1182.0,47300,1194.0,1172.0
899,2018/04/26,1190.0,1190.673,1198.0,45200,1198.0,1183.0
900,2018/04/27,1166.0,1170.005,1186.0,42000,1188.0,1159.0
901,2018/05/01,1145.0,1148.312,1152.0,40700,1157.0,1142.0
902,2018/05/02,1150.0,1148.189,1147.0,33900,1153.0,1143.0
903,2018/05/07,1160.0,1153.914,1130.0,40500,1168.0,1128.0
904,2018/05/08,1181.0,1182.64,1167.0,38600,1194.0,1163.0
905,2018/05/09,1167.0,1169.931,1175.0,29000,1185.0,1160.0
906,2018/05/10,1158.0,1154.409,1167.0,23000,1167.0,1142.0
907,2018/05/11,1156.0,1153.594,1155.0,82200,1176.0,1125.0
908,2018/05/14,1149.0,1152.336,1156.0,42300,1163.0,1148.0
909,2018/05/15,1131.0,1135.47,1149.0,43600,1149.0,1131.0
910,2018/05/16,1117.0,1121.759,1129.0,26600,1130.0,1114.0
911,2018/05/17,1126.0,1124.872,1124.0,60700,1135.0,1113.0
912,2018/05/18,1135.0,1133.637,1135.0,38600,1138.0,1127.0
913,2018/05/21,1151.0,1147.086,1140.0,27800,1156.0,1140.0
914,2018/05/22,1134.0,1140.689,1145.0,30200,1156.0,1133.0
915,2018/05/23,1135.0,1132.835,1135.0,27200,1139.0,1120.0
916,2018/05/24,1106.0,1111.902,1130.0,32600,1130.0,1100.0
917,2018/05/25,1094.0,1095.906,1100.0,25400,1102.0,1090.0
918,2018/05/28,1103.0,1103.298,1124.0,55400,1124.0,1093.0
919,2018/05/29,1094.0,1096.142,1110.0,35900,1110.0,1090.0
920,2018/05/30,1089.0,1076.432,1082.0,67800,1089.0,1057.0
921,2018/05/31,1098.0,1091.363,1091.0,98600,1105.0,1070.0
922,2018/06/01,1103.0,1099.432,1085.0,54200,1108.0,1075.0
923,2018/06/04,1109.0,1109.264,1109.0,48100,1119.0,1102.0
924,2018/06/05,1096.0,1090.383,1101.0,36600,1101.0,1077.0
925,2018/06/06,1094.0,1091.713,1089.0,24000,1098.0,1083.0
926,2018/06/07,1113.0,1105.77,1090.0,25600,1126.0,1085.0
927,2018/06/08,1112.0,1105.021,1100.0,47400,1117.0,1100.0
928,2018/06/11,1119.0,1113.511,1110.0,26400,1123.0,1102.0
929,2018/06/12,1126.0,1123.117,1127.0,23900,1130.0,1112.0
930,2018/06/13,1136.0,1132.744,1116.0,16000,1136.0,1115.0
931,2018/06/14,1139.0,1134.609,1126.0,43500,1141.0,1117.0
932,2018/06/15,1136.0,1140.161,1139.0,60400,1149.0,1134.0
933,2018/06/18,1144.0,1142.495,1140.0,47700,1148.0,1128.0
934,2018/06/19,1137.0,1142.599,1134.0,41600,1152.0,1134.0
935,2018/06/20,1157.0,1142.363,1137.0,55700,1160.0,1117.0
936,2018/06/21,1160.0,1169.17,1160.0,46000,1180.0,1160.0
937,2018/06/22,1241.0,1209.544,1151.0,104200,1242.0,1146.0
938,2018/06/25,1161.0,1192.69,1237.0,90200,1237.0,1159.0
939,2018/06/26,1182.0,1181.453,1188.0,66700,1200.0,1158.0
940,2018/06/27,1191.0,1190.947,1180.0,31800,1204.0,1172.0
941,2018/06/28,1201.0,1191.098,1187.0,39800,1202.0,1169.0
942,2018/06/29,1195.0,1188.151,1204.0,68800,1206.0,1153.0
943,2018/07/02,1139.0,1162.261,1187.0,43000,1203.0,1137.0
944,2018/07/03,1111.0,1120.006,1132.0,34600,1146.0,1103.0
945,2018/07/04,1125.0,1120.899,1092.0,53600,1136.0,1085.0
946,2018/07/05,1095.0,1105.078,1111.0,35800,1130.0,1090.0
947,2018/07/06,1129.0,1123.785,1098.0,28400,1133.0,1098.0
948,2018/07/09,1177.0,1154.753,1130.0,73600,1189.0,1114.0
949,2018/07/10,1155.0,1153.647,1182.0,74400,1182.0,1124.0
950,2018/07/11,1120.0,1117.424,1146.0,58200,1148.0,1096.0
951,2018/07/12,1131.0,1126.131,1130.0,59600,1136.0,1105.0
952,2018/07/13,1142.0,1136.396,1135.0,47000,1149.0,1122.0
953,2018/07/17,1120.0,1124.975,1128.0,48300,1142.0,1115.0
954,2018/07/18,1126.0,1130.46,1121.0,18900,1145.0,1121.0
955,2018/07/19,1120.0,1119.634,1127.0,24600,1133.0,1113.0
956,2018/07/20,1108.0,1102.354,1109.0,42900,1116.0,1088.0
957,2018/07/23,1101.0,1098.048,1096.0,35200,1104.0,1086.0
958,2018/07/24,1098.0,1093.377,1098.0,66800,1101.0,1074.0
959,2018/07/25,1098.0,1090.51,1098.0,52600,1100.0,1074.0
960,2018/07/26,1121.0,1107.78,1107.0,54600,1125.0,1085.0
961,2018/07/27,1124.0,1126.791,1125.0,41200,1140.0,1117.0
962,2018/07/30,1124.0,1121.74,1114.0,38100,1131.0,1108.0
963,2018/07/31,1111.0,1107.675,1118.0,28000,1118.0,1100.0
964,2018/08/01,1095.0,1097.95,1111.0,20000,1118.0,1090.0
965,2018/08/02,1080.0,1088.52,1104.0,30200,1112.0,1078.0
966,2018/08/03,1064.0,1069.797,1082.0,33500,1086.0,1061.0
967,2018/08/06,1068.0,1069.693,1064.0,32600,1084.0,1060.0
968,2018/08/07,1080.0,1075.027,1068.0,51900,1083.0,1065.0
969,2018/08/08,1099.0,1093.012,1081.0,41400,1107.0,1079.0
970,2018/08/09,1096.0,1094.482,1098.0,36100,1099.0,1081.0
971,2018/08/10,1096.0,1089.665,1066.0,87500,1102.0,1066.0
972,2018/08/13,1060.0,1065.171,1066.0,90800,1096.0,1052.0
973,2018/08/14,1063.0,1065.709,1054.0,55600,1091.0,1054.0
974,2018/08/15,1032.0,1039.646,1047.0,51100,1060.0,1029.0
975,2018/08/16,1033.0,1030.972,1031.0,70200,1040.0,1018.0
976,2018/08/17,1044.0,1042.678,1040.0,37300,1051.0,1039.0
977,2018/08/20,1050.0,1050.754,1050.0,49500,1058.0,1044.0
978,2018/08/21,1058.0,1058.45,1051.0,53100,1063.0,1051.0
979,2018/08/22,1064.0,1062.593,1060.0,45400,1074.0,1056.0
980,2018/08/23,1070.0,1066.89,1064.0,19100,1072.0,1060.0
981,2018/08/24,1077.0,1075.713,1076.0,31400,1079.0,1071.0
982,2018/08/27,1085.0,1090.926,1087.0,47000,1104.0,1084.0
983,2018/08/28,1089.0,1086.447,1098.0,35100,1098.0,1079.0
984,2018/08/29,1099.0,1099.662,1088.0,28400,1110.0,1088.0
985,2018/08/30,1110.0,1100.374,1099.0,35800,1113.0,1088.0
986,2018/08/31,1100.0,1100.139,1096.0,44700,1110.0,1089.0
987,2018/09/03,1076.0,1084.248,1099.0,23000,1101.0,1072.0
988,2018/09/04,1051.0,1058.41,1076.0,37100,1077.0,1048.0
989,2018/09/05,1044.0,1052.302,1054.0,96200,1071.0,1040.0
990,2018/09/06,1047.0,1038.82,1039.0,54500,1060.0,1015.0
991,2018/09/07,1053.0,1038.411,1030.0,57000,1060.0,1011.0
992,2018/09/10,1047.0,1049.291,1049.0,26500,1071.0,1043.0
993,2018/09/11,1063.0,1058.027,1043.0,33700,1090.0,1035.0
994,2018/09/12,1079.0,1059.996,1056.0,82400,1087.0,1014.0
995,2018/09/13,1141.0,1130.799,1078.0,78500,1149.0,1078.0
996,2018/09/14,1139.0,1139.887,1134.0,75200,1158.0,1130.0
997,2018/09/18,1142.0,1136.987,1135.0,68200,1150.0,1123.0
998,2018/09/19,1169.0,1168.016,1165.0,38300,1174.0,1154.0
999,2018/09/20,1157.0,1160.446,1179.0,46000,1184.0,1145.0
1000,2018/09/21,1160.0,1155.721,1170.0,118000,1176.0,1140.0
1001,2018/09/25,1170.0,1170.252,1170.0,101800,1176.0,1155.0
1002,2018/09/26,1165.0,1155.73,1155.0,54900,1166.0,1137.0
1003,2018/09/27,1127.0,1135.004,1154.0,68300,1154.0,1125.0
1004,2018/09/28,1134.0,1139.094,1137.0,56700,1148.0,1134.0
1005,2018/10/01,1153.0,1153.249,1133.0,43300,1169.0,1123.0
1006,2018/10/02,1170.0,1170.178,1157.0,58400,1195.0,1152.0
1007,2018/10/03,1149.0,1167.01,1177.0,79700,1192.0,1147.0
1008,2018/10/04,1143.0,1145.703,1168.0,57900,1171.0,1132.0
1009,2018/10/05,1135.0,1134.41,1128.0,59100,1146.0,1114.0
1010,2018/10/09,1065.0,1077.386,1107.0,78600,1122.0,1062.0
1011,2018/10/10,1095.0,1092.766,1077.0,50000,1103.0,1073.0
1012,2018/10/11,1016.0,1030.057,1052.0,59900,1068.0,1012.0
1013,2018/10/12,1025.0,1024.528,1020.0,73300,1032.0,1013.0
1014,2018/10/15,1008.0,1012.515,1018.0,61000,1022.0,1005.0
1015,2018/10/16,1004.0,1004.211,1011.0,61100,1012.0,997.0
1016,2018/10/17,1037.0,1031.383,1018.0,45900,1040.0,1017.0
1017,2018/10/18,1025.0,1030.2,1042.0,41500,1045.0,1024.0
1018,2018/10/19,1005.0,1004.585,1001.0,45100,1012.0,997.0
1019,2018/10/22,1032.0,1015.587,995.0,67300,1037.0,990.0
1020,2018/10/23,1007.0,1019.02,1028.0,54000,1041.0,1006.0
1021,2018/10/24,1004.0,1001.666,1008.0,69700,1012.0,986.0
1022,2018/10/25,972.0,974.668,974.0,56700,986.0,965.0
1023,2018/10/26,964.0,970.298,973.0,66800,988.0,962.0
1024,2018/10/29,985.0,989.135,979.0,66000,1014.0,977.0
1025,2018/10/30,1046.0,1034.946,982.0,224600,1046.0,975.0
1026,2018/10/31,1079.0,1063.935,1032.0,105300,1080.0,1032.0
1027,2018/11/01,1171.0,1152.481,1080.0,157300,1183.0,1073.0
1028,2018/11/02,1162.0,1151.18,1119.0,89300,1168.0,1115.0
1029,2018/11/05,1119.0,1130.008,1140.0,62300,1160.0,1118.0
1030,2018/11/06,1115.0,1115.101,1130.0,58600,1136.0,1104.0
1031,2018/11/07,1105.0,1116.92,1132.0,43700,1145.0,1098.0
1032,2018/11/08,1125.0,1122.203,1115.0,38400,1130.0,1110.0
1033,2018/11/09,1112.0,1119.641,1125.0,41500,1141.0,1107.0
1034,2018/11/12,1269.0,1260.903,1180.0,439500,1290.0,1173.0
1035,2018/11/13,1256.0,1255.794,1249.0,125500,1278.0,1237.0
1036,2018/11/14,1182.0,1200.616,1239.0,93300,1247.0,1176.0
1037,2018/11/15,1175.0,1171.996,1166.0,56300,1182.0,1163.0
1038,2018/11/16,1182.0,1183.165,1174.0,75400,1203.0,1163.0
1039,2018/11/19,1199.0,1200.109,1168.0,51400,1218.0,1168.0
1040,2018/11/20,1177.0,1177.688,1187.0,65000,1198.0,1171.0
1041,2018/11/21,1166.0,1165.465,1153.0,52100,1177.0,1149.0
1042,2018/11/22,1160.0,1164.182,1169.0,30200,1187.0,1152.0
1043,2018/11/26,1154.0,1157.123,1166.0,42300,1171.0,1150.0
1044,2018/11/27,1156.0,1157.324,1160.0,70900,1173.0,1149.0
1045,2018/11/28,1197.0,1187.652,1163.0,56000,1200.0,1149.0
1046,2018/11/29,1197.0,1209.762,1217.0,48800,1236.0,1194.0
1047,2018/11/30,1232.0,1221.55,1200.0,45100,1232.0,1197.0
1048,2018/12/03,1193.0,1204.626,1240.0,63400,1247.0,1186.0
1049,2018/12/04,1141.0,1154.151,1188.0,58200,1196.0,1139.0
1050,2018/12/05,1155.0,1152.088,1119.0,63700,1168.0,1115.0
1051,2018/12/06,1100.0,1116.244,1150.0,55400,1155.0,1098.0
1052,2018/12/07,1089.0,1090.781,1102.0,53000,1105.0,1082.0
1053,2018/12/10,1064.0,1057.957,1063.0,62600,1072.0,1043.0
1054,2018/12/11,1075.0,1081.027,1093.0,78100,1108.0,1064.0
1055,2018/12/12,1114.0,1115.826,1129.0,69000,1129.0,1100.0
1056,2018/12/13,1137.0,1135.908,1144.0,73800,1144.0,1117.0
1057,2018/12/14,1150.0,1146.756,1145.0,86700,1163.0,1129.0
1058,2018/12/17,1148.0,1151.634,1159.0,40400,1163.0,1138.0
1059,2018/12/18,1116.0,1127.153,1136.0,38500,1149.0,1114.0
1060,2018/12/19,1070.0,1080.34,1119.0,49700,1119.0,1064.0
1061,2018/12/20,1031.0,1049.409,1089.0,57500,1098.0,1028.0
1062,2018/12/21,1004.0,1010.254,1025.0,59500,1038.0,987.0
1063,2018/12/25,946.0,939.267,973.0,68200,973.0,917.0
1064,2018/12/26,930.0,935.078,953.0,48500,961.0,916.0
1065,2018/12/27,987.0,977.256,950.0,43400,989.0,950.0
1066,2018/12/28,994.0,992.574,997.0,40400,1006.0,982.0
1067,2019/01/04,973.0,979.531,983.0,65900,1003.0,963.0
1068,2019/01/07,1008.0,1002.254,1011.0,46400,1019.0,985.0
1069,2019/01/08,1014.0,1012.971,1012.0,27700,1028.0,999.0
1070,2019/01/09,1009.0,1006.532,1020.0,22200,1020.0,996.0
1071,2019/01/10,968.0,974.169,996.0,40800,996.0,965.0
1072,2019/01/11,963.0,968.626,980.0,38200,992.0,956.0
1073,2019/01/15,961.0,955.299,939.0,41100,968.0,934.0
1074,2019/01/16,957.0,960.872,961.0,28800,973.0,952.0
1075,2019/01/17,950.0,954.983,968.0,29300,982.0,942.0
1076,2019/01/18,953.0,959.373,957.0,28400,972.0,949.0
1077,2019/01/21,959.0,957.359,963.0,33700,970.0,949.0
1078,2019/01/22,953.0,946.791,959.0,28700,963.0,932.0
1079,2019/01/23,927.0,928.784,938.0,24100,938.0,922.0
1080,2019/01/24,940.0,938.893,941.0,28000,947.0,928.0
1081,2019/01/25,945.0,948.365,945.0,42500,966.0,936.0
1082,2019/01/28,940.0,943.905,951.0,25300,953.0,935.0
1083,2019/01/29,944.0,934.242,931.0,41700,949.0,914.0
1084,2019/01/30,916.0,922.912,950.0,65800,953.0,914.0
1085,2019/01/31,936.0,933.307,929.0,42700,940.0,921.0
1086,2019/02/01,916.0,919.25,933.0,32000,936.0,913.0
1087,2019/02/04,965.0,952.138,924.0,36300,965.0,924.0
1088,2019/02/05,959.0,960.568,965.0,44700,971.0,948.0
1089,2019/02/06,948.0,952.25,964.0,26800,964.0,943.0
1090,2019/02/07,953.0,944.453,946.0,37100,956.0,925.0
1091,2019/02/08,923.0,922.978,936.0,36100,939.0,914.0
1092,2019/02/12,951.0,948.419,923.0,85500,955.0,922.0
1093,2019/02/13,951.0,942.498,932.0,93700,955.0,916.0
1094,2019/02/14,1010.0,993.921,956.0,79900,1017.0,956.0
1095,2019/02/15,1003.0,996.097,995.0,34900,1004.0,978.0
1096,2019/02/18,1067.0,1045.609,1030.0,66300,1070.0,1013.0
1097,2019/02/19,1020.0,1027.64,1074.0,87400,1074.0,1000.0
1098,2019/02/20,993.0,995.435,1005.0,41600,1015.0,983.0
1099,2019/02/21,1004.0,999.804,999.0,28100,1008.0,987.0
1100,2019/02/22,1007.0,1005.96,990.0,40400,1022.0,988.0
1101,2019/02/25,1005.0,1002.647,1001.0,26900,1015.0,996.0
1102,2019/02/26,996.0,995.0,1003.0,21400,1006.0,988.0
1103,2019/02/27,980.0,980.143,986.0,44900,993.0,974.0
1104,2019/02/28,999.0,991.358,982.0,72300,1002.0,961.0
1105,2019/03/01,985.0,992.735,993.0,37800,1007.0,982.0
1106,2019/03/04,989.0,985.748,993.0,34500,995.0,981.0
1107,2019/03/05,980.0,974.377,985.0,38500,985.0,962.0
1108,2019/03/06,963.0,964.278,972.0,42800,973.0,957.0
1109,2019/03/07,952.0,951.641,953.0,42000,968.0,944.0
1110,2019/03/08,916.0,923.764,931.0,57300,936.0,914.0
1111,2019/03/11,911.0,916.506,920.0,68200,936.0,909.0
1112,2019/03/12,949.0,946.785,925.0,71600,962.0,923.0
1113,2019/03/13,953.0,958.238,947.0,78900,969.0,942.0
1114,2019/03/14,970.0,974.749,968.0,74900,989.0,961.0
1115,2019/03/15,978.0,977.11,976.0,62600,985.0,972.0
1116,2019/03/18,983.0,980.845,982.0,59400,986.0,974.0
1117,2019/03/19,981.0,979.391,982.0,33800,987.0,968.0
1118,2019/03/20,982.0,981.38,980.0,30000,990.0,973.0
1119,2019/03/22,986.0,979.809,979.0,27200,988.0,972.0
1120,2019/03/25,936.0,942.207,957.0,44000,957.0,935.0
1121,2019/03/26,973.0,975.981,951.0,113600,992.0,950.0
1122,2019/03/27,991.0,979.452,978.0,47100,994.0,949.0
1123,2019/03/28,957.0,958.703,977.0,32000,977.0,954.0
1124,2019/03/29,972.0,967.291,962.0,22700,976.0,951.0
1125,2019/04/01,992.0,997.342,984.0,53200,1008.0,984.0
1126,2019/04/02,995.0,994.44,992.0,20700,999.0,985.0
1127,2019/04/03,1010.0,1002.143,982.0,27900,1010.0,977.0
1128,2019/04/04,1004.0,1007.503,1003.0,20300,1013.0,1003.0
1129,2019/04/05,1015.0,1011.555,1006.0,20900,1017.0,1004.0
1130,2019/04/08,995.0,999.37,1005.0,13500,1008.0,993.0
1131,2019/04/09,991.0,987.679,997.0,22100,1000.0,977.0
1132,2019/04/10,976.0,977.028,976.0,14100,987.0,969.0
1133,2019/04/11,960.0,963.029,971.0,17200,971.0,954.0
1134,2019/04/12,956.0,957.225,963.0,16000,963.0,952.0
1135,2019/04/15,988.0,989.215,984.0,51200,998.0,980.0
1136,2019/04/16,988.0,983.08,991.0,33600,991.0,970.0
1137,2019/04/17,995.0,987.092,986.0,31400,996.0,972.0
1138,2019/04/18,951.0,956.83,987.0,50700,987.0,945.0
1139,2019/04/19,952.0,951.435,951.0,26700,964.0,945.0
1140,2019/04/22,961.0,954.972,949.0,28700,963.0,942.0
1141,2019/04/23,978.0,969.06,960.0,30100,981.0,955.0
1142,2019/04/24,964.0,971.915,986.0,21200,986.0,963.0
1143,2019/04/25,975.0,970.852,967.0,14900,978.0,957.0
1144,2019/04/26,972.0,970.125,971.0,19200,978.0,959.0
1145,2019/05/07,948.0,956.709,976.0,30200,976.0,946.0
1146,2019/05/08,912.0,917.71,931.0,41400,935.0,907.0
1147,2019/05/09,883.0,889.049,908.0,53200,910.0,878.0
1148,2019/05/10,882.0,889.58,870.0,60500,906.0,870.0
1149,2019/05/13,881.0,891.573,879.0,51800,916.0,868.0
1150,2019/05/14,890.0,879.342,852.0,39200,898.0,850.0
1151,2019/05/15,925.0,914.313,900.0,22400,925.0,892.0
1152,2019/05/16,932.0,930.289,940.0,44700,940.0,914.0
1153,2019/05/17,942.0,947.082,947.0,36800,960.0,938.0
1154,2019/05/20,934.0,932.954,936.0,19600,945.0,920.0
1155,2019/05/21,932.0,929.189,926.0,16400,939.0,920.0
1156,2019/05/22,915.0,921.196,932.0,15800,932.0,915.0
1157,2019/05/23,899.0,900.117,910.0,18800,916.0,893.0
1158,2019/05/24,922.0,912.787,894.0,35600,922.0,885.0
1159,2019/05/27,946.0,936.353,935.0,28900,946.0,922.0
1160,2019/05/28,966.0,954.105,937.0,45600,966.0,931.0
1161,2019/05/29,919.0,942.038,960.0,60300,965.0,917.0
1162,2019/05/30,956.0,944.994,909.0,48100,961.0,909.0
1163,2019/05/31,953.0,956.369,945.0,41500,965.0,942.0
1164,2019/06/03,932.0,933.65,932.0,16000,946.0,925.0
1165,2019/06/04,973.0,960.241,940.0,53200,974.0,939.0
1166,2019/06/05,1001.0,992.181,988.0,38600,1003.0,972.0
1167,2019/06/06,972.0,976.972,989.0,28900,989.0,967.0
1168,2019/06/07,954.0,954.757,973.0,36200,975.0,949.0
1169,2019/06/10,998.0,989.863,971.0,67700,1005.0,966.0
1170,2019/06/11,987.0,985.511,991.0,42300,992.0,978.0
1171,2019/06/12,983.0,986.108,984.0,57300,992.0,978.0
1172,2019/06/13,949.0,954.141,971.0,36300,973.0,945.0
1173,2019/06/14,956.0,952.315,952.0,29200,957.0,947.0
1174,2019/06/17,942.0,942.439,946.0,36000,950.0,937.0
1175,2019/06/18,906.0,913.742,937.0,34500,948.0,902.0
1176,2019/06/19,932.0,927.484,921.0,37800,938.0,919.0
1177,2019/06/20,930.0,929.583,939.0,18000,943.0,922.0
1178,2019/06/21,925.0,928.822,934.0,68900,944.0,925.0
1179,2019/06/24,969.0,950.394,940.0,47000,972.0,928.0
1180,2019/06/25,963.0,964.789,970.0,15600,972.0,958.0
1181,2019/06/26,941.0,947.275,955.0,41900,964.0,939.0
1182,2019/06/27,974.0,966.962,942.0,23900,975.0,942.0
1183,2019/06/28,959.0,967.296,970.0,35200,981.0,956.0
1184,2019/07/01,1013.0,1001.829,1004.0,67800,1013.0,987.0
1185,2019/07/02,1041.0,1025.67,1013.0,65500,1042.0,1009.0
1186,2019/07/03,1030.0,1027.603,1036.0,25700,1038.0,1018.0
1187,2019/07/04,1037.0,1033.441,1031.0,21100,1037.0,1026.0
1188,2019/07/05,1019.0,1022.971,1021.0,27900,1036.0,1017.0
1189,2019/07/08,1000.0,1008.297,1015.0,36400,1025.0,1000.0
1190,2019/07/09,979.0,981.717,1002.0,20500,1002.0,970.0
1191,2019/07/10,948.0,953.147,967.0,45600,967.0,948.0
1192,2019/07/11,964.0,958.025,945.0,47300,966.0,945.0
1193,2019/07/12,981.0,1015.318,1039.0,224800,1068.0,976.0
1194,2019/07/16,984.0,984.164,981.0,47600,995.0,974.0
1195,2019/07/17,974.0,977.075,981.0,29500,986.0,971.0
1196,2019/07/18,940.0,946.447,973.0,81700,987.0,933.0
1197,2019/07/19,954.0,956.462,950.0,63700,963.0,944.0
1198,2019/07/22,957.0,959.321,960.0,34600,967.0,953.0
1199,2019/07/23,958.0,954.48,961.0,44400,961.0,942.0
1200,2019/07/24,956.0,959.172,963.0,24400,970.0,954.0
1201,2019/07/25,970.0,967.0,956.0,25200,972.0,956.0
1202,2019/07/26,949.0,951.162,961.0,22900,963.0,945.0
1203,2019/07/29,942.0,945.237,953.0,19800,953.0,938.0
1204,2019/07/30,943.0,944.628,942.0,28500,951.0,941.0
1205,2019/07/31,922.0,928.331,932.0,48600,937.0,922.0
1206,2019/08/01,967.0,948.904,921.0,59500,967.0,913.0
1207,2019/08/02,903.0,910.616,931.0,65600,934.0,901.0
1208,2019/08/05,858.0,868.681,890.0,87800,890.0,854.0
1209,2019/08/06,853.0,845.585,843.0,79300,858.0,834.0
1210,2019/08/07,862.0,862.023,849.0,73100,872.0,837.0
1211,2019/08/08,879.0,873.766,860.0,44400,886.0,856.0
1212,2019/08/09,875.0,875.428,879.0,63500,890.0,867.0
1213,2019/08/13,878.0,874.09,860.0,80300,884.0,850.0
1214,2019/08/14,879.0,878.968,893.0,65100,893.0,869.0
1215,2019/08/15,869.0,863.99,850.0,48600,873.0,850.0
1216,2019/08/16,875.0,870.774,864.0,54000,883.0,859.0
1217,2019/08/19,893.0,890.766,886.0,24800,900.0,882.0
1218,2019/08/20,891.0,888.532,893.0,38000,899.0,883.0
1219,2019/08/21,873.0,877.644,877.0,26100,886.0,873.0
1220,2019/08/22,866.0,868.373,882.0,43700,886.0,862.0
1221,2019/08/23,867.0,866.244,866.0,22500,869.0,861.0
