ds,yhat
2019-07-16,1746.2556726886335
2019-07-17,1740.639158267779
2019-07-18,1732.408006756991
2019-07-19,1723.9880164484157
2019-07-22,1717.3456102523742
2019-07-23,1714.5153124235405
2019-07-24,1704.5349879957823
2019-07-25,1688.0716953700942
2019-07-26,1670.4899401713346
2019-07-29,1647.4570004748766
2019-07-30,1638.4438135019966
2019-07-31,1621.0115841614797
2019-08-01,1598.3285604494793
2019-08-02,1578.0358372762914
2019-08-05,1560.9542491742466
2019-08-06,1553.9213391831204
2019-08-07,1538.7334260690118
2019-08-08,1518.6847976476872
2019-08-09,1500.1104356635815
