,Date,Close,VWAP,Open,Volume,High,Low
0,2014/12/25,0.0,0.0,0.0,0,0.0,0.0
1,2014/12/26,975.0,903.941,901.5,6978600,987.5,815.0
2,2014/12/29,855.0,920.664,935.0,4327400,990.0,853.0
3,2014/12/30,780.0,814.438,835.0,2662000,869.5,768.0
4,2015/01/05,881.5,872.598,780.5,4667000,942.5,752.5
5,2015/01/06,852.5,869.474,845.0,1867200,922.5,825.0
6,2015/01/07,825.0,862.492,864.0,1657800,922.5,801.5
7,2015/01/08,797.5,825.16,833.0,473400,874.0,795.0
8,2015/01/09,766.5,786.861,825.0,359200,825.0,750.0
9,2015/01/13,710.0,718.129,760.0,393000,769.5,695.5
10,2015/01/14,706.5,694.495,699.0,339000,737.0,667.0
11,2015/01/15,681.5,685.347,691.5,164000,707.5,675.0
12,2015/01/16,737.5,711.848,675.0,201000,737.5,675.0
13,2015/01/19,682.5,695.889,735.0,276800,737.5,675.0
14,2015/01/20,671.5,666.355,690.0,196800,694.0,657.5
15,2015/01/21,680.0,673.381,667.0,130600,697.0,655.0
16,2015/01/22,635.5,651.794,680.0,249000,682.0,635.0
17,2015/01/23,675.0,657.179,650.5,282600,677.5,636.0
18,2015/01/26,739.5,709.575,686.0,225600,739.5,677.0
19,2015/01/27,802.0,782.011,760.0,442400,805.0,750.0
20,2015/01/28,826.5,835.263,800.0,645000,883.5,763.5
21,2015/01/29,762.5,805.68,825.0,378200,859.0,762.5
22,2015/01/30,793.5,779.184,785.0,197200,800.0,742.0
23,2015/02/02,863.0,891.359,813.5,1582000,958.5,812.5
24,2015/02/03,782.0,913.617,883.0,3328400,1040.0,757.5
25,2015/02/04,855.0,842.818,822.0,1052600,887.0,790.0
26,2015/02/05,883.0,921.132,935.0,2195200,965.0,875.0
27,2015/02/06,922.5,893.766,900.5,1009200,972.0,835.5
28,2015/02/09,1112.5,1006.442,950.0,2426000,1112.5,930.0
29,2015/02/10,1100.0,1136.79,1187.5,2725200,1245.0,1032.0
30,2015/02/12,1031.0,1047.583,1055.0,808200,1099.0,1005.0
31,2015/02/13,1281.0,1127.643,950.0,2559600,1281.0,935.5
32,2015/02/16,1330.0,1355.406,1250.0,5299600,1467.0,1225.0
33,2015/02/17,1580.0,1531.488,1449.5,5124400,1580.0,1425.0
34,2015/02/18,1562.5,1535.499,1612.5,4778600,1650.0,1440.0
35,2015/02/19,1550.0,1626.863,1702.5,3083400,1800.0,1515.0
36,2015/02/20,1309.5,1403.176,1455.0,2422000,1565.0,1302.5
37,2015/02/23,1363.5,1356.976,1350.0,1206400,1399.0,1311.5
38,2015/02/24,1308.5,1290.555,1343.0,562200,1348.0,1257.5
39,2015/02/25,1254.0,1257.235,1283.5,398600,1293.0,1225.0
40,2015/02/26,1313.0,1284.967,1250.0,677800,1345.5,1212.5
41,2015/02/27,1440.0,1395.163,1329.5,1367000,1469.0,1325.0
42,2015/03/02,1493.0,1432.233,1424.0,543400,1495.0,1369.0
43,2015/03/03,1405.0,1455.461,1520.0,587800,1542.5,1380.0
44,2015/03/04,1355.0,1353.91,1359.0,251800,1400.0,1315.0
45,2015/03/05,1346.0,1372.547,1397.0,177400,1400.0,1340.0
46,2015/03/06,1219.0,1256.905,1321.0,770200,1337.5,1200.0
47,2015/03/09,1125.0,1142.871,1226.0,886800,1250.0,1083.0
48,2015/03/10,1161.5,1156.844,1130.5,431200,1186.0,1112.5
49,2015/03/11,1092.5,1116.593,1150.0,490400,1156.5,1077.5
50,2015/03/12,1027.5,1039.788,1043.0,516600,1072.5,1015.5
51,2015/03/13,1105.0,1053.764,1025.0,792400,1110.0,990.0
52,2015/03/16,1011.0,1071.103,1094.5,493600,1127.5,1000.0
53,2015/03/17,1152.5,1123.43,1008.0,1274000,1208.5,1005.0
54,2015/03/18,1115.0,1142.267,1152.5,418000,1195.0,1105.5
55,2015/03/19,1078.5,1079.191,1090.0,292800,1112.5,1065.0
56,2015/03/20,1127.0,1103.689,1075.0,320600,1135.0,1055.0
57,2015/03/23,1132.0,1161.261,1159.5,566000,1204.5,1120.0
58,2015/03/24,1147.5,1135.723,1142.5,328600,1168.0,1100.0
59,2015/03/25,1160.0,1213.228,1172.5,1526800,1276.5,1136.0
60,2015/03/26,1096.5,1111.585,1130.0,443400,1153.0,1076.5
61,2015/03/27,1050.0,1077.005,1101.5,348200,1116.0,1038.0
62,2015/03/30,1027.0,1034.501,1074.5,280000,1075.0,1013.0
63,2015/03/31,1050.5,1046.25,1028.5,141800,1062.0,1028.5
64,2015/04/01,1032.0,1040.666,1050.0,115400,1069.0,1026.0
65,2015/04/02,1010.0,1006.632,1025.0,251000,1035.0,996.0
66,2015/04/03,1005.0,1005.33,1005.0,98000,1015.5,998.5
67,2015/04/06,963.0,965.95,995.0,233600,997.5,950.0
68,2015/04/07,1044.0,1002.85,965.0,307800,1044.0,963.5
69,2015/04/08,1290.5,1172.946,1075.0,1347600,1290.5,1044.0
70,2015/04/09,1273.5,1333.109,1325.0,2371400,1419.5,1236.0
71,2015/04/10,1350.0,1334.2,1313.0,1130200,1385.0,1275.0
72,2015/04/13,1469.0,1461.818,1424.0,1645200,1512.5,1390.0
73,2015/04/14,1362.5,1399.678,1422.5,632800,1447.5,1351.0
74,2015/04/15,1328.0,1321.115,1342.5,359200,1360.0,1300.0
75,2015/04/16,1248.0,1263.814,1303.0,446400,1315.0,1230.5
76,2015/04/17,1224.5,1246.112,1236.5,302600,1283.5,1214.5
77,2015/04/20,1158.0,1155.638,1215.0,551600,1215.0,1118.5
78,2015/04/21,1188.5,1183.418,1152.0,266400,1210.0,1150.0
79,2015/04/22,1225.0,1226.171,1213.5,211600,1249.5,1187.5
80,2015/04/23,1195.5,1203.153,1192.5,183600,1232.5,1178.5
81,2015/04/24,1207.5,1205.824,1179.0,106400,1224.5,1179.0
82,2015/04/27,1210.0,1237.33,1232.5,186400,1258.0,1202.5
83,2015/04/28,1197.5,1208.599,1235.0,130600,1235.0,1192.5
84,2015/04/30,1139.0,1141.602,1176.0,252000,1189.5,1083.5
85,2015/05/01,1118.0,1108.04,1125.0,132000,1137.0,1090.5
86,2015/05/07,1105.0,1098.168,1093.5,74400,1117.5,1088.5
87,2015/05/08,1113.5,1110.772,1105.0,51800,1123.0,1095.5
88,2015/05/11,1224.5,1189.466,1135.0,237600,1225.0,1122.5
89,2015/05/12,1261.5,1253.897,1270.0,305000,1273.5,1231.5
90,2015/05/13,1200.0,1242.64,1262.5,192200,1265.0,1200.0
91,2015/05/14,1177.5,1193.684,1205.5,266200,1264.5,1150.5
92,2015/05/15,1134.5,1141.436,1152.5,143200,1176.5,1130.5
93,2015/05/18,1131.5,1119.284,1116.0,101600,1150.5,1090.0
94,2015/05/19,1123.5,1122.722,1131.5,188800,1149.5,1104.0
95,2015/05/20,1145.5,1143.74,1120.0,227200,1163.5,1113.0
96,2015/05/21,1113.5,1124.091,1128.5,165400,1150.5,1107.5
97,2015/05/22,1113.0,1118.649,1120.0,104400,1137.5,1107.5
98,2015/05/25,1113.0,1116.433,1111.5,51000,1123.5,1111.5
99,2015/05/26,1101.5,1106.555,1112.5,81400,1114.5,1100.5
100,2015/05/27,1080.0,1086.244,1100.0,150600,1104.0,1078.5
101,2015/05/28,1080.5,1081.671,1089.5,49200,1089.5,1078.0
102,2015/05/29,1085.0,1084.237,1081.0,57000,1090.0,1078.5
103,2015/06/01,1069.0,1072.343,1075.0,73200,1079.5,1069.0
104,2015/06/02,1088.0,1096.107,1112.5,108600,1112.5,1078.5
105,2015/06/03,1101.0,1091.719,1093.5,55600,1106.5,1080.0
106,2015/06/04,1122.0,1114.033,1110.5,78400,1127.5,1101.0
107,2015/06/05,1100.0,1104.806,1111.0,59400,1119.5,1098.0
108,2015/06/08,1125.0,1132.074,1125.0,130200,1147.5,1116.0
109,2015/06/09,1100.0,1100.005,1102.0,79400,1106.5,1095.0
110,2015/06/10,1112.5,1118.142,1100.0,95800,1144.5,1090.5
111,2015/06/11,1162.5,1141.802,1132.5,121000,1162.5,1121.5
112,2015/06/12,1172.5,1161.654,1163.5,104600,1177.0,1144.0
113,2015/06/15,1155.0,1161.86,1161.0,71400,1179.5,1150.5
114,2015/06/16,1116.0,1120.759,1145.0,86800,1145.0,1110.0
115,2015/06/17,1112.5,1118.704,1116.0,32800,1129.0,1111.5
116,2015/06/18,1094.0,1101.531,1107.5,49200,1117.0,1094.0
117,2015/06/19,1108.5,1097.644,1095.0,40400,1108.5,1093.0
118,2015/06/22,1109.0,1110.146,1092.5,38400,1125.5,1092.5
119,2015/06/23,1114.0,1118.363,1124.5,48000,1130.5,1107.5
120,2015/06/24,1142.5,1151.579,1117.5,142000,1174.5,1117.5
121,2015/06/25,1124.0,1139.247,1150.0,110400,1162.0,1111.0
122,2015/06/26,1165.0,1156.206,1129.0,141400,1170.0,1129.0
123,2015/06/29,1095.0,1107.387,1103.5,164000,1133.5,1090.5
124,2015/06/30,1097.0,1096.765,1095.0,69800,1124.5,1083.5
125,2015/07/01,1105.0,1101.409,1099.0,47200,1114.0,1092.0
126,2015/07/02,1072.5,1097.214,1116.5,106000,1116.5,1069.0
127,2015/07/03,1048.5,1057.715,1075.0,127000,1088.5,1040.5
128,2015/07/06,1002.5,1004.836,1001.5,149600,1033.5,983.5
129,2015/07/07,1034.5,1036.724,1052.5,93600,1059.5,1023.0
130,2015/07/08,981.5,994.901,1059.5,188000,1059.5,969.0
131,2015/07/09,974.5,903.528,901.5,277800,990.0,825.0
132,2015/07/10,1002.5,998.719,986.5,100200,1017.5,977.5
133,2015/07/13,995.5,1002.349,991.0,52200,1020.5,990.0
134,2015/07/14,1049.5,1040.203,1035.0,140200,1064.5,1020.0
135,2015/07/15,1124.5,1122.927,1065.5,451200,1175.0,1061.0
136,2015/07/16,1200.5,1176.374,1103.0,417800,1224.5,1101.0
137,2015/07/17,1244.5,1238.418,1225.0,359400,1255.0,1210.5
138,2015/07/21,1160.0,1180.282,1199.5,211000,1219.5,1144.5
139,2015/07/22,1199.5,1152.467,1159.5,143000,1201.0,1120.0
140,2015/07/23,1182.0,1174.233,1186.5,146200,1206.5,1150.0
141,2015/07/24,1182.0,1185.78,1187.5,102200,1209.0,1165.5
142,2015/07/27,1262.0,1239.233,1211.5,332800,1265.0,1193.0
143,2015/07/28,1258.5,1245.229,1247.5,253600,1280.0,1201.0
144,2015/07/29,1250.0,1288.963,1279.5,375200,1312.5,1237.5
145,2015/07/30,1209.0,1210.625,1225.0,184000,1235.0,1191.0
146,2015/07/31,1190.0,1192.043,1209.0,62800,1209.0,1180.5
147,2015/08/03,1122.5,1140.648,1200.0,137800,1200.0,1115.5
148,2015/08/04,1087.0,1099.617,1115.0,133400,1142.0,1079.0
149,2015/08/05,1095.5,1088.392,1077.5,60800,1112.0,1075.0
150,2015/08/06,1102.5,1100.742,1096.0,41800,1110.0,1091.0
151,2015/08/07,1092.5,1095.447,1091.5,61800,1103.5,1091.0
152,2015/08/10,1075.5,1080.775,1101.5,55600,1102.0,1065.0
153,2015/08/11,1096.5,1085.15,1069.5,21400,1096.5,1069.5
154,2015/08/12,1084.5,1083.865,1082.5,65800,1095.0,1073.5
155,2015/08/13,1110.0,1102.889,1075.5,80200,1117.5,1071.0
156,2015/08/14,1074.5,1088.681,1135.0,110600,1138.5,1063.5
157,2015/08/17,1047.5,1056.583,1055.0,76000,1086.0,1044.0
158,2015/08/18,1039.0,1039.407,1027.0,52400,1049.5,1026.5
159,2015/08/19,1012.0,1018.713,1025.0,75200,1047.5,1005.0
160,2015/08/20,1010.0,1004.5,1000.0,48600,1023.0,995.0
161,2015/08/21,960.5,971.647,975.0,98800,990.0,960.0
162,2015/08/24,775.5,842.759,900.5,430600,925.0,760.5
163,2015/08/25,712.5,726.644,720.5,559000,815.0,640.0
164,2015/08/26,768.0,781.021,817.5,214400,817.5,751.0
165,2015/08/27,841.0,839.234,806.0,205800,862.5,806.0
166,2015/08/28,945.5,934.769,850.0,416000,1025.0,850.0
167,2015/08/31,922.5,913.303,910.5,138400,944.5,890.5
168,2015/09/01,970.0,983.694,1052.5,435800,1063.0,915.5
169,2015/09/02,921.5,921.235,900.0,147800,949.5,900.0
170,2015/09/03,937.5,941.832,950.0,65000,955.0,925.0
171,2015/09/04,871.5,872.247,925.5,126400,935.0,826.5
172,2015/09/07,835.5,828.197,845.0,107000,867.5,783.0
173,2015/09/08,816.0,837.786,855.5,37800,864.5,810.0
174,2015/09/09,855.5,854.832,856.0,61800,863.5,835.0
175,2015/09/10,855.0,854.113,856.0,42400,872.0,833.0
176,2015/09/11,897.5,919.965,850.5,164600,965.0,850.0
177,2015/09/14,892.0,899.874,900.0,34000,920.0,875.5
178,2015/09/15,879.5,887.459,892.0,29400,899.5,875.5
179,2015/09/16,879.0,887.665,905.0,21800,905.0,875.0
180,2015/09/17,891.0,865.936,879.0,51800,897.5,834.5
181,2015/09/18,871.0,866.772,861.0,25000,880.0,850.5
182,2015/09/24,834.5,847.979,840.5,28400,864.0,834.5
183,2015/09/25,845.5,842.568,830.5,27800,862.0,830.0
184,2015/09/28,865.0,851.84,834.0,26200,865.0,834.0
185,2015/09/29,848.0,854.314,875.0,31800,877.5,840.5
186,2015/09/30,847.5,871.081,882.5,35600,885.0,837.5
187,2015/10/01,851.0,853.755,860.5,20000,867.0,843.0
188,2015/10/02,840.5,843.236,851.0,20800,851.0,838.5
189,2015/10/05,847.0,847.839,845.0,18000,859.5,840.5
190,2015/10/06,854.0,856.208,850.5,28400,869.5,845.5
191,2015/10/07,863.5,857.56,854.0,10000,864.0,850.5
192,2015/10/08,861.0,876.392,860.0,68800,892.5,854.5
193,2015/10/09,871.5,868.305,878.5,21000,878.5,861.0
194,2015/10/13,851.0,854.061,870.0,26200,870.0,847.0
195,2015/10/14,838.5,841.097,846.5,22800,847.5,838.5
196,2015/10/15,836.0,831.232,820.0,16800,848.5,818.0
197,2015/10/16,864.5,854.564,830.0,34200,864.5,830.0
198,2015/10/19,836.5,842.522,862.5,27400,862.5,836.5
199,2015/10/20,845.0,841.006,836.0,17200,849.0,835.5
200,2015/10/21,842.5,842.5,849.5,10800,849.5,835.5
201,2015/10/22,839.0,836.391,846.5,19200,846.5,830.0
202,2015/10/23,862.0,888.503,894.5,210400,908.0,862.0
203,2015/10/26,887.5,877.029,882.0,55600,890.0,859.0
204,2015/10/27,867.0,880.299,885.0,37400,887.5,867.0
205,2015/10/28,874.5,868.405,865.0,19000,875.0,857.5
206,2015/10/29,878.5,878.389,882.5,26200,886.0,869.0
207,2015/10/30,877.0,876.161,875.0,29800,880.0,870.5
208,2015/11/02,880.0,862.428,865.0,15200,880.0,850.5
209,2015/11/04,872.0,881.507,891.5,27800,899.0,863.5
210,2015/11/05,864.5,862.053,872.0,26600,876.5,855.0
211,2015/11/06,855.5,858.158,851.0,26000,869.0,851.0
212,2015/11/09,863.0,860.258,856.0,18200,869.5,851.5
213,2015/11/10,865.0,866.316,863.0,15200,874.5,858.5
214,2015/11/11,868.5,867.673,864.5,15000,871.5,860.5
215,2015/11/12,874.5,870.219,865.0,17800,874.5,865.0
216,2015/11/13,913.5,893.144,880.0,100400,920.0,870.0
217,2015/11/16,855.0,856.707,860.0,139400,873.5,843.0
218,2015/11/17,835.5,844.261,857.5,77800,861.5,835.5
219,2015/11/18,825.0,829.442,835.0,69000,835.0,825.0
220,2015/11/19,832.5,835.409,828.0,35000,839.5,828.0
221,2015/11/20,842.5,840.56,840.5,29800,845.0,833.0
222,2015/11/24,840.0,839.539,841.5,36000,842.5,831.0
223,2015/11/25,828.5,832.082,840.0,32800,840.0,826.0
224,2015/11/26,822.5,822.745,825.0,37200,828.5,819.5
225,2015/11/27,815.0,812.115,824.5,53000,824.5,800.0
226,2015/11/30,800.5,802.731,807.5,29000,807.5,800.5
227,2015/12/01,810.0,806.866,800.5,23200,817.5,800.5
228,2015/12/02,805.0,804.733,803.5,12000,809.5,800.5
229,2015/12/03,800.0,799.888,802.5,52000,807.0,794.0
230,2015/12/04,784.0,785.795,797.5,56000,797.5,776.0
231,2015/12/07,788.0,794.15,780.5,28600,805.0,780.0
232,2015/12/08,782.5,787.452,787.5,27000,799.5,780.5
233,2015/12/09,774.0,779.814,796.0,26400,796.0,773.5
234,2015/12/10,762.0,765.006,770.0,35400,772.5,759.5
235,2015/12/11,749.5,736.923,740.5,112400,749.5,725.0
236,2015/12/14,738.5,724.789,720.5,61600,740.0,713.5
237,2015/12/15,715.5,717.724,712.5,53600,737.0,712.5
238,2015/12/16,800.0,770.818,715.5,113600,805.0,715.5
239,2015/12/17,784.5,773.387,797.0,97200,797.0,755.0
240,2015/12/18,758.5,755.821,760.5,39000,767.0,747.0
241,2015/12/21,748.5,728.686,750.0,44600,750.0,716.0
242,2015/12/22,725.0,727.122,738.5,30400,738.5,716.0
243,2015/12/24,715.0,712.611,725.0,77600,725.0,700.0
244,2015/12/25,680.5,689.886,700.0,68600,702.0,680.5
245,2015/12/28,730.0,719.828,687.0,40600,736.5,687.0
246,2015/12/29,711.5,718.671,709.5,21600,740.0,704.0
247,2015/12/30,728.5,722.094,713.0,19200,730.5,713.0
248,2016/01/04,727.0,731.195,730.0,11800,748.5,719.5
249,2016/01/05,727.0,717.939,720.0,9800,727.0,702.0
250,2016/01/06,704.0,709.724,712.0,15200,727.0,703.5
251,2016/01/07,693.0,694.245,702.5,31800,703.5,682.5
252,2016/01/08,694.5,686.82,681.5,27200,697.5,670.0
253,2016/01/12,664.5,666.789,679.5,19000,684.0,654.5
254,2016/01/13,676.5,671.901,664.5,17200,682.0,664.5
255,2016/01/14,639.0,641.532,675.0,44200,675.0,631.0
256,2016/01/15,608.5,624.579,626.5,51600,648.0,607.0
257,2016/01/18,581.0,580.485,575.0,59400,599.5,565.5
258,2016/01/19,625.0,588.243,581.0,37000,638.0,550.0
259,2016/01/20,560.0,589.985,608.0,33400,620.5,560.0
260,2016/01/21,535.0,563.726,545.0,68000,580.0,523.5
261,2016/01/22,621.5,609.763,580.0,81000,644.0,564.0
262,2016/01/25,695.0,680.31,666.5,202800,724.5,625.5
263,2016/01/26,704.5,702.046,710.0,141800,720.0,675.0
264,2016/01/27,730.0,722.857,709.0,102200,744.0,695.0
265,2016/01/28,725.0,724.266,715.0,50800,734.0,713.5
266,2016/01/29,706.5,704.734,710.5,65800,720.5,676.5
267,2016/02/01,729.0,723.969,712.5,19200,734.0,712.5
268,2016/02/02,736.5,732.102,720.0,25600,745.0,719.5
269,2016/02/03,685.0,682.946,707.5,61200,707.5,670.0
270,2016/02/04,663.0,667.4,684.5,24000,684.5,643.5
271,2016/02/05,623.0,621.633,640.0,39200,645.5,591.0
272,2016/02/08,632.5,618.483,612.5,17600,638.0,607.5
273,2016/02/09,615.0,593.904,598.0,47800,615.0,575.0
274,2016/02/10,566.0,574.143,600.0,55800,607.5,557.0
275,2016/02/12,518.0,521.949,525.0,89000,540.0,510.0
276,2016/02/15,585.0,587.045,599.5,77200,599.5,550.0
277,2016/02/16,625.0,614.105,615.0,128600,629.0,580.0
278,2016/02/17,610.5,636.371,631.0,77400,663.0,610.0
279,2016/02/18,636.5,631.693,621.5,43000,649.5,612.5
280,2016/02/19,633.0,618.864,621.5,60400,642.5,598.0
281,2016/02/22,650.0,641.268,633.0,27200,650.0,629.5
282,2016/02/23,639.5,637.514,653.5,43600,656.5,615.0
283,2016/02/24,616.5,617.15,624.5,23400,624.5,603.5
284,2016/02/25,608.0,613.272,603.5,18400,620.0,603.5
285,2016/02/26,576.0,594.671,605.5,92400,610.0,575.0
286,2016/02/29,582.0,579.589,572.0,35000,604.5,571.0
287,2016/03/01,598.0,606.656,612.0,54000,622.0,586.0
288,2016/03/02,606.5,608.539,603.0,28200,614.5,603.0
289,2016/03/03,608.0,602.198,606.0,21200,610.0,593.0
290,2016/03/04,612.5,604.701,596.0,28400,612.5,596.0
291,2016/03/07,627.0,629.809,612.5,47000,645.0,612.5
292,2016/03/08,634.5,623.194,623.5,50000,649.5,607.5
293,2016/03/09,653.0,645.334,641.0,43400,653.0,635.0
294,2016/03/10,670.0,670.448,657.0,74600,682.5,657.0
295,2016/03/11,664.0,658.554,655.0,46000,677.5,641.0
296,2016/03/14,690.5,702.0,675.0,67000,725.0,675.0
297,2016/03/15,731.0,718.917,719.0,63600,733.5,702.5
298,2016/03/16,791.0,797.183,731.0,292000,832.5,731.0
299,2016/03/17,760.0,784.459,824.0,124800,825.0,750.5
300,2016/03/18,780.0,767.6,750.0,66800,786.5,750.0
301,2016/03/22,790.5,782.841,780.0,34000,793.0,769.5
302,2016/03/23,855.0,907.4,776.0,704800,990.5,775.5
303,2016/03/24,830.0,840.776,835.0,151800,874.5,820.5
304,2016/03/25,759.0,783.505,830.0,140200,830.0,759.0
305,2016/03/28,810.0,783.854,752.5,96400,817.5,750.5
306,2016/03/29,821.5,809.657,810.0,41400,823.5,795.0
307,2016/03/30,798.0,801.527,801.5,33000,819.0,789.0
308,2016/03/31,812.0,805.077,795.0,19400,819.0,785.0
309,2016/04/01,761.5,770.985,826.0,52600,827.0,750.0
310,2016/04/04,755.0,765.002,780.0,103800,822.5,743.0
311,2016/04/05,680.5,704.854,743.0,71800,743.0,680.0
312,2016/04/06,675.5,684.659,675.0,47800,700.5,669.0
313,2016/04/07,673.0,665.182,676.0,46600,691.0,646.0
314,2016/04/08,673.5,658.022,646.0,112000,695.5,641.0
315,2016/04/11,707.5,678.908,675.5,67400,710.0,653.5
316,2016/04/12,700.0,710.381,710.5,54800,724.0,696.0
317,2016/04/13,712.5,716.441,714.5,50600,735.0,705.5
318,2016/04/14,732.5,727.819,709.5,97000,759.5,706.0
319,2016/04/15,730.0,735.229,732.5,51600,744.5,727.5
320,2016/04/18,717.0,704.889,710.0,47600,722.5,690.5
321,2016/04/19,749.5,736.119,705.5,51400,756.5,705.5
322,2016/04/20,757.5,757.586,764.5,51000,767.5,739.0
323,2016/04/21,824.5,806.118,772.5,145400,844.0,765.0
324,2016/04/22,846.0,833.727,833.0,95200,865.0,810.0
325,2016/04/25,897.5,880.479,864.5,139800,899.5,857.0
326,2016/04/26,840.5,859.121,900.0,133000,900.0,816.5
327,2016/04/27,874.0,846.982,840.5,67000,874.0,813.0
328,2016/04/28,854.0,855.484,894.0,81000,894.0,814.0
329,2016/05/02,804.5,798.633,794.0,95600,824.5,774.0
330,2016/05/06,813.0,790.9,797.5,39800,813.0,777.0
331,2016/05/09,945.5,972.367,910.0,736000,1013.0,864.0
332,2016/05/10,1075.0,1044.276,985.5,1068200,1110.5,951.0
333,2016/05/11,1048.5,1089.52,1094.0,939400,1167.5,1003.5
334,2016/05/12,953.0,1006.918,1073.5,360600,1080.0,951.0
335,2016/05/13,984.5,987.267,961.0,275800,1040.0,953.5
336,2016/05/16,865.5,900.17,956.0,331600,956.0,865.0
337,2016/05/17,1049.0,1000.188,868.0,642200,1060.5,866.0
338,2016/05/18,975.0,992.646,1082.5,407200,1082.5,905.0
339,2016/05/19,1010.5,1010.97,988.0,210000,1047.0,976.5
340,2016/05/20,1150.0,1159.548,1185.5,1214000,1212.0,1115.0
341,2016/05/23,1227.0,1218.774,1200.0,660200,1248.0,1177.5
342,2016/05/24,1173.5,1177.284,1200.0,315400,1214.5,1140.5
343,2016/05/25,1115.0,1132.276,1150.0,254000,1189.5,1086.5
344,2016/05/26,1113.5,1060.557,1082.5,289200,1113.5,1011.0
345,2016/05/27,1085.0,1090.82,1100.0,101000,1113.5,1071.0
346,2016/05/30,1144.5,1134.89,1085.0,193200,1162.0,1083.0
347,2016/05/31,1199.0,1169.001,1152.5,237600,1200.0,1128.0
348,2016/06/01,1224.0,1244.611,1175.0,627200,1304.5,1174.5
349,2016/06/02,1175.5,1196.057,1230.0,273600,1256.5,1132.5
350,2016/06/03,1270.0,1247.049,1171.5,325800,1275.0,1171.5
351,2016/06/06,1321.5,1283.955,1230.5,291200,1325.0,1230.0
352,2016/06/07,1261.0,1262.937,1296.5,385600,1300.5,1230.5
353,2016/06/08,1240.0,1251.924,1286.0,172000,1287.0,1236.0
354,2016/06/09,1280.0,1275.623,1256.5,229800,1313.0,1240.5
355,2016/06/10,1333.0,1316.652,1305.0,387600,1344.0,1263.0
356,2016/06/13,1259.5,1271.997,1283.0,204400,1307.5,1239.5
357,2016/06/14,1096.5,1122.005,1234.5,437000,1243.5,1034.0
358,2016/06/15,1181.5,1149.832,1085.0,237800,1195.5,1060.5
359,2016/06/16,1083.0,1110.451,1175.0,190000,1190.0,1067.5
360,2016/06/17,1095.0,1116.221,1130.0,110600,1160.0,1075.0
361,2016/06/20,1153.0,1157.084,1113.5,109000,1180.0,1109.0
362,2016/06/21,1210.0,1191.954,1175.0,139200,1222.5,1154.5
363,2016/06/22,1164.0,1168.508,1190.0,114600,1210.0,1147.0
364,2016/06/23,1153.5,1129.982,1150.0,93800,1161.5,1105.0
365,2016/06/24,1025.0,1043.27,1200.0,372600,1205.0,925.0
366,2016/06/27,1107.5,1100.537,1075.0,122000,1150.0,1050.0
367,2016/06/28,1111.0,1075.09,1078.0,110400,1137.0,990.0
368,2016/06/29,1075.0,1094.922,1081.0,91200,1134.0,1059.0
369,2016/06/30,1028.0,1044.619,1087.0,111300,1095.0,1017.0
370,2016/07/01,1082.0,1070.983,1048.0,103600,1099.0,1031.0
371,2016/07/04,1124.0,1109.751,1112.0,84400,1130.0,1069.0
372,2016/07/05,1100.0,1123.406,1127.0,70200,1150.0,1090.0
373,2016/07/06,1043.0,1038.299,1060.0,67000,1064.0,1011.0
374,2016/07/07,1013.0,1024.21,1071.0,57500,1071.0,1005.0
375,2016/07/08,960.0,970.714,1020.0,107700,1026.0,940.0
376,2016/07/11,975.0,987.399,1010.0,60100,1010.0,968.0
377,2016/07/12,1054.0,1032.999,1000.0,109400,1074.0,990.0
378,2016/07/13,1077.0,1070.89,1070.0,227100,1117.0,1000.0
379,2016/07/14,1085.0,1093.037,1077.0,96600,1116.0,1053.0
380,2016/07/15,992.0,1018.667,1100.0,126800,1100.0,987.0
381,2016/07/19,1089.0,1100.177,1000.0,526400,1142.0,986.0
382,2016/07/20,1013.0,1012.287,1016.0,130900,1025.0,1001.0
383,2016/07/21,1042.0,1050.267,1042.0,138400,1078.0,1020.0
384,2016/07/22,1149.0,1151.891,1040.0,1038200,1273.0,1003.0
385,2016/07/25,1024.0,1063.476,1100.0,397200,1111.0,1022.0
386,2016/07/26,997.0,1016.557,1031.0,183800,1063.0,995.0
387,2016/07/27,954.0,982.48,1011.0,178000,1026.0,945.0
388,2016/07/28,919.0,930.497,960.0,156000,965.0,912.0
389,2016/07/29,920.0,885.566,899.0,160600,934.0,845.0
390,2016/08/01,912.0,911.198,902.0,56100,941.0,883.0
391,2016/08/02,932.0,937.862,917.0,79900,963.0,904.0
392,2016/08/03,890.0,907.033,928.0,82200,929.0,882.0
393,2016/08/04,918.0,911.179,900.0,49800,924.0,891.0
394,2016/08/05,897.0,915.402,939.0,50200,939.0,893.0
395,2016/08/08,873.0,884.587,930.0,97500,930.0,864.0
396,2016/08/09,882.0,874.468,869.0,54300,895.0,855.0
397,2016/08/10,891.0,894.723,882.0,31800,908.0,882.0
398,2016/08/12,938.0,931.72,895.0,89900,954.0,891.0
399,2016/08/15,905.0,911.091,915.0,83700,939.0,893.0
400,2016/08/16,919.0,926.396,901.0,74500,948.0,900.0
401,2016/08/17,892.0,905.069,920.0,83700,936.0,890.0
402,2016/08/18,896.0,898.019,889.0,59100,912.0,885.0
403,2016/08/19,935.0,905.007,890.0,60100,935.0,884.0
404,2016/08/22,907.0,930.03,950.0,116400,955.0,906.0
405,2016/08/23,927.0,931.429,916.0,64400,950.0,907.0
406,2016/08/24,999.0,974.704,950.0,233300,1005.0,947.0
407,2016/08/25,1149.0,1141.015,1134.0,286900,1149.0,1121.0
408,2016/08/26,1117.0,1148.837,1221.0,2194900,1233.0,1087.0
409,2016/08/29,1216.0,1201.679,1146.0,1528700,1280.0,1104.0
410,2016/08/30,1164.0,1207.747,1200.0,1020300,1270.0,1147.0
411,2016/08/31,1270.0,1291.957,1240.0,2193900,1355.0,1221.0
412,2016/09/01,1486.0,1405.668,1309.0,3863600,1497.0,1304.0
413,2016/09/02,1425.0,1426.614,1449.0,1900000,1474.0,1375.0
414,2016/09/05,1641.0,1626.101,1485.0,7109700,1722.0,1485.0
415,2016/09/06,1686.0,1637.322,1670.0,3159400,1715.0,1560.0
416,2016/09/07,1632.0,1649.019,1613.0,1036600,1697.0,1595.0
417,2016/09/08,1530.0,1563.64,1650.0,949500,1675.0,1495.0
418,2016/09/09,1530.0,1525.928,1502.0,563000,1575.0,1480.0
419,2016/09/12,1483.0,1538.879,1569.0,986700,1645.0,1435.0
420,2016/09/13,1610.0,1609.508,1540.0,2237900,1679.0,1472.0
421,2016/09/14,1379.0,1466.465,1580.0,1586800,1600.0,1293.0
422,2016/09/15,1398.0,1402.351,1370.0,1027800,1459.0,1351.0
423,2016/09/16,1324.0,1322.441,1368.0,530100,1405.0,1276.0
424,2016/09/20,1310.0,1340.369,1310.0,249600,1388.0,1301.0
425,2016/09/21,1355.0,1327.557,1315.0,263000,1371.0,1282.0
426,2016/09/23,1450.0,1414.335,1342.0,410300,1450.0,1313.0
427,2016/09/26,1403.0,1448.962,1480.0,368500,1490.0,1396.0
428,2016/09/27,1507.0,1467.842,1421.0,521200,1548.0,1350.0
429,2016/09/28,1519.0,1542.753,1531.0,921400,1590.0,1480.0
430,2016/09/29,1645.0,1610.471,1540.0,1341300,1672.0,1510.0
431,2016/09/30,1601.0,1589.205,1614.0,828000,1630.0,1535.0
432,2016/10/03,1518.0,1638.176,1637.0,2077400,1734.0,1502.0
433,2016/10/04,1509.0,1507.847,1490.0,487200,1557.0,1468.0
434,2016/10/05,1563.0,1563.344,1530.0,408500,1600.0,1506.0
435,2016/10/06,1505.0,1520.696,1580.0,293700,1583.0,1483.0
436,2016/10/07,1434.0,1427.929,1495.0,389400,1502.0,1402.0
437,2016/10/11,1369.0,1381.698,1433.0,332200,1448.0,1342.0
438,2016/10/12,1329.0,1341.088,1351.0,267900,1375.0,1316.0
439,2016/10/13,1324.0,1352.857,1362.0,414000,1410.0,1313.0
440,2016/10/14,1275.0,1276.403,1325.0,343200,1331.0,1245.0
441,2016/10/17,1283.0,1239.903,1290.0,299400,1290.0,1208.0
442,2016/10/18,1270.0,1280.762,1271.0,254100,1307.0,1255.0
443,2016/10/19,1272.0,1284.837,1266.0,182600,1307.0,1266.0
444,2016/10/20,1255.0,1253.914,1264.0,163200,1278.0,1237.0
445,2016/10/21,1228.0,1241.134,1239.0,120100,1270.0,1224.0
446,2016/10/24,1218.0,1236.108,1248.0,145100,1270.0,1215.0
447,2016/10/25,1197.0,1195.531,1227.0,227800,1244.0,1164.0
448,2016/10/26,1200.0,1198.11,1188.0,119400,1217.0,1177.0
449,2016/10/27,1200.0,1206.596,1206.0,100000,1227.0,1193.0
450,2016/10/28,1178.0,1176.337,1195.0,138200,1205.0,1155.0
451,2016/10/31,1187.0,1192.28,1171.0,97200,1214.0,1158.0
452,2016/11/01,1142.0,1143.146,1175.0,150700,1186.0,1118.0
453,2016/11/02,1081.0,1088.209,1121.0,194000,1137.0,1053.0
454,2016/11/04,1052.0,1052.544,1075.0,119000,1075.0,1037.0
455,2016/11/07,1103.0,1078.732,1075.0,99300,1103.0,1052.0
456,2016/11/08,1053.0,1058.258,1092.0,128100,1092.0,1039.0
457,2016/11/09,980.0,986.961,1050.0,309800,1064.0,937.0
458,2016/11/10,1071.0,1044.445,1030.0,128800,1071.0,1019.0
459,2016/11/11,1003.0,1015.784,1041.0,140800,1058.0,987.0
460,2016/11/14,1039.0,1045.435,1000.0,128900,1066.0,1000.0
461,2016/11/15,1062.0,1058.456,1076.0,167200,1082.0,1032.0
462,2016/11/16,1147.0,1139.727,1070.0,341000,1170.0,1070.0
463,2016/11/17,1124.0,1115.545,1118.0,137500,1132.0,1102.0
464,2016/11/18,1111.0,1118.677,1123.0,126500,1140.0,1106.0
465,2016/11/21,1118.0,1122.754,1112.0,84400,1137.0,1112.0
466,2016/11/22,1089.0,1090.195,1110.0,113600,1113.0,1080.0
467,2016/11/24,1075.0,1094.285,1107.0,88000,1120.0,1075.0
468,2016/11/25,1032.0,1044.874,1075.0,103100,1077.0,1028.0
469,2016/11/28,1074.0,1058.873,1025.0,97800,1083.0,1025.0
470,2016/11/29,1075.0,1076.715,1074.0,67600,1089.0,1057.0
471,2016/11/30,1133.0,1107.229,1075.0,156900,1136.0,1064.0
472,2016/12/01,1096.0,1134.147,1140.0,207600,1184.0,1077.0
473,2016/12/02,1052.0,1062.281,1086.0,85800,1086.0,1042.0
474,2016/12/05,1034.0,1037.258,1038.0,61700,1060.0,1020.0
475,2016/12/06,1018.0,1027.781,1040.0,85800,1053.0,1012.0
476,2016/12/07,1028.0,1023.339,1012.0,93100,1042.0,1008.0
477,2016/12/08,1008.0,1016.095,1035.0,58700,1038.0,1007.0
478,2016/12/09,1042.0,1029.911,1008.0,81700,1047.0,1005.0
479,2016/12/12,1039.0,1038.13,1052.0,71300,1067.0,1024.0
480,2016/12/13,1092.0,1076.284,1052.0,129100,1098.0,1042.0
481,2016/12/14,1077.0,1082.728,1094.0,101900,1114.0,1066.0
482,2016/12/15,1058.0,1056.084,1082.0,70200,1085.0,1041.0
483,2016/12/16,1034.0,1038.437,1044.0,67100,1053.0,1031.0
484,2016/12/19,1044.0,1052.269,1044.0,69600,1073.0,1035.0
485,2016/12/20,1063.0,1056.469,1044.0,70600,1070.0,1033.0
486,2016/12/21,1044.0,1059.884,1084.0,83800,1085.0,1040.0
487,2016/12/22,1019.0,1025.937,1044.0,64900,1047.0,1017.0
488,2016/12/26,1061.0,1048.426,1020.0,96100,1076.0,1018.0
489,2016/12/27,1059.0,1065.126,1076.0,64400,1076.0,1052.0
490,2016/12/28,1081.0,1082.783,1064.0,77800,1094.0,1064.0
491,2016/12/29,1050.0,1059.676,1073.0,58900,1087.0,1040.0
492,2016/12/30,1051.0,1046.251,1023.0,75200,1070.0,1023.0
493,2017/01/04,1055.0,1055.837,1054.0,56300,1067.0,1040.0
494,2017/01/05,1137.0,1110.409,1065.0,207500,1140.0,1056.0
495,2017/01/06,1162.0,1143.067,1137.0,161900,1163.0,1126.0
496,2017/01/10,1157.0,1183.448,1186.0,201700,1216.0,1140.0
497,2017/01/11,1117.0,1130.886,1157.0,74700,1157.0,1111.0
498,2017/01/12,1114.0,1103.89,1110.0,67900,1123.0,1082.0
499,2017/01/13,1142.0,1133.068,1114.0,50400,1149.0,1114.0
500,2017/01/16,1120.0,1133.262,1149.0,55400,1160.0,1112.0
501,2017/01/17,1123.0,1114.697,1121.0,42500,1136.0,1100.0
502,2017/01/18,1126.0,1114.405,1114.0,34600,1130.0,1105.0
503,2017/01/19,1096.0,1119.868,1136.0,84800,1155.0,1095.0
504,2017/01/20,1192.0,1234.655,1285.0,1388100,1289.0,1177.0
505,2017/01/23,1206.0,1191.105,1194.0,173200,1213.0,1168.0
506,2017/01/24,1195.0,1191.522,1205.0,127100,1215.0,1171.0
507,2017/01/25,1206.0,1199.256,1207.0,91000,1212.0,1183.0
508,2017/01/26,1272.0,1262.879,1220.0,410300,1295.0,1211.0
509,2017/01/27,1268.0,1295.226,1293.0,265900,1332.0,1257.0
510,2017/01/30,1266.0,1275.669,1273.0,98800,1307.0,1251.0
511,2017/01/31,1260.0,1245.443,1250.0,110600,1266.0,1228.0
512,2017/02/01,1240.0,1231.021,1249.0,113400,1265.0,1200.0
513,2017/02/02,1201.0,1219.251,1250.0,89200,1253.0,1201.0
514,2017/02/03,1187.0,1197.669,1201.0,125100,1225.0,1174.0
515,2017/02/06,1235.0,1222.946,1200.0,85100,1242.0,1197.0
516,2017/02/07,1260.0,1261.812,1230.0,165100,1289.0,1222.0
517,2017/02/08,1285.0,1274.309,1260.0,135400,1298.0,1234.0
518,2017/02/09,1290.0,1301.655,1300.0,164200,1320.0,1285.0
519,2017/02/10,1260.0,1273.603,1290.0,97600,1305.0,1252.0
520,2017/02/13,1272.0,1286.888,1265.0,133100,1310.0,1262.0
521,2017/02/14,1317.0,1305.426,1296.0,200800,1318.0,1282.0
522,2017/02/15,1362.0,1379.351,1383.0,543200,1410.0,1355.0
523,2017/02/16,1404.0,1392.974,1365.0,365700,1427.0,1345.0
524,2017/02/17,1389.0,1363.45,1384.0,205000,1389.0,1333.0
525,2017/02/20,1425.0,1420.462,1390.0,203800,1440.0,1390.0
526,2017/02/21,1390.0,1398.267,1435.0,175600,1444.0,1366.0
527,2017/02/22,1400.0,1389.294,1399.0,105600,1414.0,1370.0
528,2017/02/23,1390.0,1374.775,1386.0,87200,1402.0,1352.0
529,2017/02/24,1409.0,1417.637,1404.0,167300,1439.0,1393.0
530,2017/02/27,1378.0,1378.606,1403.0,83900,1405.0,1361.0
531,2017/02/28,1421.0,1415.401,1398.0,149100,1436.0,1380.0
532,2017/03/01,1410.0,1396.836,1420.0,72500,1420.0,1380.0
533,2017/03/02,1394.0,1394.769,1420.0,59200,1421.0,1386.0
534,2017/03/03,1438.0,1422.157,1384.0,183700,1439.0,1384.0
535,2017/03/06,1501.0,1483.805,1459.0,476100,1505.0,1456.0
536,2017/03/07,1472.0,1494.797,1501.0,289800,1532.0,1451.0
537,2017/03/08,1520.0,1503.741,1479.0,202000,1535.0,1458.0
538,2017/03/09,1497.0,1502.908,1538.0,199300,1538.0,1473.0
539,2017/03/10,1469.0,1475.445,1520.0,172500,1520.0,1447.0
540,2017/03/13,1402.0,1428.372,1476.0,217700,1492.0,1395.0
541,2017/03/14,1411.0,1386.598,1381.0,189200,1423.0,1349.0
542,2017/03/15,1358.0,1363.95,1396.0,137400,1397.0,1338.0
543,2017/03/16,1329.0,1326.485,1332.0,201000,1360.0,1305.0
544,2017/03/17,1295.0,1295.687,1320.0,183500,1324.0,1263.0
545,2017/03/21,1289.0,1270.37,1260.0,179800,1304.0,1242.0
546,2017/03/22,1241.0,1253.257,1257.0,125500,1273.0,1241.0
547,2017/03/23,1376.0,1411.899,1235.0,2470500,1532.0,1215.0
548,2017/03/24,1299.0,1326.74,1400.0,690900,1406.0,1280.0
549,2017/03/27,1241.0,1246.187,1260.0,266800,1268.0,1235.0
550,2017/03/28,1257.0,1254.002,1246.0,123500,1267.0,1234.0
551,2017/03/29,1246.0,1248.004,1259.0,158400,1265.0,1235.0
552,2017/03/30,1256.0,1272.307,1260.0,201900,1297.0,1243.0
553,2017/03/31,1248.0,1256.989,1268.0,89800,1271.0,1247.0
554,2017/04/03,1198.0,1197.649,1242.0,239300,1257.0,1174.0
555,2017/04/04,1200.0,1185.101,1189.0,175100,1221.0,1150.0
556,2017/04/05,1157.0,1156.764,1188.0,197500,1220.0,1130.0
557,2017/04/06,1111.0,1115.832,1157.0,167300,1157.0,1090.0
558,2017/04/07,1132.0,1137.304,1127.0,116700,1169.0,1102.0
559,2017/04/10,1134.0,1145.879,1143.0,45300,1163.0,1131.0
560,2017/04/11,1102.0,1112.648,1126.0,135900,1138.0,1097.0
561,2017/04/12,1057.0,1055.657,1089.0,151500,1089.0,1037.0
562,2017/04/13,1100.0,1068.336,1018.0,156500,1100.0,1016.0
563,2017/04/14,1102.0,1129.935,1075.0,169400,1180.0,1057.0
564,2017/04/17,1178.0,1173.351,1120.0,204500,1194.0,1120.0
565,2017/04/18,1166.0,1185.963,1214.0,141200,1217.0,1160.0
566,2017/04/19,1175.0,1192.966,1146.0,148600,1222.0,1143.0
567,2017/04/20,1194.0,1204.779,1174.0,113900,1229.0,1174.0
568,2017/04/21,1210.0,1203.078,1200.0,79700,1225.0,1183.0
569,2017/04/24,1156.0,1183.342,1222.0,108700,1231.0,1150.0
570,2017/04/25,1165.0,1154.914,1145.0,81200,1180.0,1140.0
571,2017/04/26,1189.0,1186.319,1180.0,52400,1200.0,1163.0
572,2017/04/27,1195.0,1188.59,1180.0,36100,1195.0,1177.0
573,2017/04/28,1158.0,1171.789,1197.0,52000,1197.0,1157.0
574,2017/05/01,1165.0,1173.412,1159.0,43900,1195.0,1159.0
575,2017/05/02,1255.0,1251.669,1189.0,575600,1309.0,1171.0
576,2017/05/08,1227.0,1236.057,1261.0,215500,1270.0,1218.0
577,2017/05/09,1228.0,1222.612,1218.0,65400,1240.0,1207.0
578,2017/05/10,1228.0,1228.182,1222.0,46800,1235.0,1222.0
579,2017/05/11,1222.0,1217.01,1220.0,137100,1232.0,1204.0
580,2017/05/12,1403.0,1383.824,1342.0,1329900,1422.0,1326.0
581,2017/05/15,1375.0,1372.731,1379.0,276400,1408.0,1330.0
582,2017/05/16,1355.0,1355.62,1380.0,160400,1398.0,1336.0
583,2017/05/17,1316.0,1319.049,1348.0,268900,1352.0,1302.0
584,2017/05/18,1268.0,1265.317,1257.0,288300,1291.0,1250.0
585,2017/05/19,1275.0,1259.266,1280.0,179200,1285.0,1242.0
586,2017/05/22,1276.0,1265.077,1270.0,128000,1280.0,1255.0
587,2017/05/23,1250.0,1256.014,1282.0,141000,1282.0,1247.0
588,2017/05/24,1308.0,1290.19,1256.0,262300,1319.0,1256.0
589,2017/05/25,1296.0,1310.63,1313.0,176700,1340.0,1289.0
590,2017/05/26,1328.0,1312.363,1296.0,177000,1336.0,1287.0
591,2017/05/29,1320.0,1335.69,1352.0,173300,1368.0,1312.0
592,2017/05/30,1430.0,1385.861,1350.0,618600,1430.0,1343.0
593,2017/05/31,1399.0,1402.18,1420.0,342300,1436.0,1373.0
594,2017/06/01,1397.0,1413.494,1404.0,264000,1445.0,1391.0
595,2017/06/02,1357.0,1367.244,1400.0,250100,1405.0,1346.0
596,2017/06/05,1355.0,1365.375,1360.0,156100,1388.0,1351.0
597,2017/06/06,1309.0,1328.346,1357.0,180000,1360.0,1309.0
598,2017/06/07,1350.0,1334.6,1309.0,130800,1360.0,1304.0
599,2017/06/08,1337.0,1350.295,1360.0,85500,1375.0,1330.0
600,2017/06/09,1360.0,1351.698,1339.0,128600,1365.0,1332.0
601,2017/06/12,1356.0,1377.321,1371.0,254800,1407.0,1343.0
602,2017/06/13,1397.0,1388.762,1352.0,236400,1405.0,1349.0
603,2017/06/14,1385.0,1419.864,1410.0,476500,1455.0,1352.0
604,2017/06/15,1415.0,1396.34,1396.0,181900,1418.0,1377.0
605,2017/06/16,1392.0,1402.843,1420.0,158700,1434.0,1386.0
606,2017/06/19,1380.0,1385.488,1402.0,134100,1406.0,1371.0
607,2017/06/20,1368.0,1373.129,1394.0,110400,1395.0,1367.0
608,2017/06/21,1425.0,1419.131,1368.0,313900,1448.0,1362.0
609,2017/06/22,1422.0,1420.786,1428.0,184400,1436.0,1397.0
610,2017/06/23,1465.0,1461.894,1430.0,581600,1500.0,1392.0
611,2017/06/26,1499.0,1478.124,1500.0,339500,1509.0,1437.0
612,2017/06/27,1526.0,1512.332,1505.0,350000,1535.0,1482.0
613,2017/06/28,1494.0,1512.628,1513.0,306200,1548.0,1477.0
614,2017/06/29,1539.0,1544.038,1510.0,349400,1590.0,1500.0
615,2017/06/30,1485.0,1492.574,1500.0,285200,1525.0,1460.0
616,2017/07/03,1438.0,1453.704,1484.0,128600,1499.0,1430.0
617,2017/07/04,1425.0,1431.149,1453.0,160600,1463.0,1406.0
618,2017/07/05,1418.0,1429.126,1447.0,113900,1459.0,1408.0
619,2017/07/06,1392.0,1402.57,1422.0,139400,1431.0,1380.0
620,2017/07/07,1406.0,1438.2,1368.0,413300,1550.0,1365.0
621,2017/07/10,1434.0,1426.62,1409.0,121200,1450.0,1392.0
622,2017/07/11,1489.0,1483.833,1453.0,235100,1514.0,1430.0
623,2017/07/12,1465.0,1472.816,1490.0,109200,1500.0,1453.0
624,2017/07/13,1457.0,1469.301,1488.0,75500,1490.0,1456.0
625,2017/07/14,1478.0,1468.169,1457.0,103000,1480.0,1457.0
626,2017/07/18,1561.0,1537.908,1490.0,468500,1580.0,1481.0
627,2017/07/19,1595.0,1598.295,1570.0,520300,1628.0,1570.0
628,2017/07/20,1582.0,1593.211,1619.0,255500,1625.0,1561.0
629,2017/07/21,1566.0,1567.403,1582.0,104000,1585.0,1553.0
630,2017/07/24,1650.0,1620.912,1569.0,320300,1650.0,1565.0
631,2017/07/25,1716.0,1676.195,1650.0,490100,1719.0,1620.0
632,2017/07/26,1683.0,1698.754,1725.0,291600,1742.0,1653.0
633,2017/07/27,1700.0,1705.648,1705.0,201100,1748.0,1670.0
634,2017/07/28,1644.0,1648.526,1685.0,238900,1687.0,1606.0
635,2017/07/31,1660.0,1631.362,1632.0,136900,1660.0,1601.0
636,2017/08/01,1651.0,1660.56,1652.0,282600,1717.0,1586.0
637,2017/08/02,1695.0,1686.195,1637.0,185300,1711.0,1637.0
638,2017/08/03,1617.0,1637.771,1689.0,200400,1694.0,1611.0
639,2017/08/04,1629.0,1623.659,1601.0,114700,1654.0,1600.0
640,2017/08/07,1633.0,1635.465,1644.0,64800,1648.0,1624.0
641,2017/08/08,1650.0,1658.228,1635.0,102200,1680.0,1635.0
642,2017/08/09,1660.0,1635.535,1680.0,117900,1680.0,1614.0
643,2017/08/10,1621.0,1625.392,1644.0,155400,1663.0,1595.0
644,2017/08/14,1600.0,1538.52,1470.0,205500,1610.0,1460.0
645,2017/08/15,1490.0,1507.214,1645.0,569500,1645.0,1406.0
646,2017/08/16,1514.0,1514.438,1520.0,175300,1533.0,1480.0
647,2017/08/17,1515.0,1519.928,1520.0,92700,1534.0,1499.0
648,2017/08/18,1456.0,1465.043,1465.0,181000,1497.0,1445.0
649,2017/08/21,1422.0,1434.904,1457.0,114300,1475.0,1415.0
650,2017/08/22,1428.0,1441.895,1430.0,137400,1480.0,1425.0
651,2017/08/23,1512.0,1490.419,1460.0,147400,1518.0,1454.0
652,2017/08/24,1542.0,1532.551,1501.0,162500,1558.0,1496.0
653,2017/08/25,1529.0,1537.663,1550.0,95300,1569.0,1502.0
654,2017/08/28,1532.0,1541.003,1534.0,90200,1559.0,1529.0
655,2017/08/29,1527.0,1517.943,1497.0,107300,1549.0,1490.0
656,2017/08/30,1526.0,1515.94,1527.0,83600,1548.0,1499.0
657,2017/08/31,1513.0,1513.769,1524.0,41100,1524.0,1505.0
658,2017/09/01,1481.0,1492.522,1513.0,94500,1525.0,1472.0
659,2017/09/04,1432.0,1446.784,1488.0,142200,1498.0,1421.0
660,2017/09/05,1351.0,1369.406,1438.0,215400,1451.0,1312.0
661,2017/09/06,1372.0,1353.897,1321.0,113800,1396.0,1310.0
662,2017/09/07,1357.0,1373.575,1370.0,46300,1396.0,1354.0
663,2017/09/08,1339.0,1341.651,1344.0,60200,1378.0,1326.0
664,2017/09/11,1375.0,1369.472,1357.0,42400,1386.0,1345.0
665,2017/09/12,1399.0,1391.691,1381.0,45000,1409.0,1376.0
666,2017/09/13,1421.0,1425.155,1428.0,97500,1449.0,1401.0
667,2017/09/14,1387.0,1397.608,1413.0,61000,1421.0,1381.0
668,2017/09/15,1405.0,1384.651,1364.0,57000,1406.0,1360.0
669,2017/09/19,1422.0,1420.748,1421.0,53200,1432.0,1408.0
670,2017/09/20,1424.0,1432.164,1445.0,62200,1446.0,1414.0
671,2017/09/21,1391.0,1410.995,1431.0,112800,1432.0,1388.0
672,2017/09/22,1360.0,1376.834,1420.0,133600,1420.0,1352.0
673,2017/09/25,1352.0,1362.592,1360.0,86500,1395.0,1346.0
674,2017/09/26,1322.0,1328.149,1352.0,113100,1352.0,1316.0
675,2017/09/27,1362.0,1343.303,1328.0,77600,1370.0,1323.0
676,2017/09/28,1342.0,1350.221,1367.0,69800,1380.0,1331.0
677,2017/09/29,1336.0,1340.666,1339.0,55600,1357.0,1333.0
678,2017/10/02,1360.0,1356.95,1365.0,57600,1374.0,1343.0
679,2017/10/03,1361.0,1356.578,1375.0,55000,1375.0,1343.0
680,2017/10/04,1348.0,1350.086,1365.0,41800,1365.0,1344.0
681,2017/10/05,1306.0,1318.414,1343.0,113500,1348.0,1304.0
682,2017/10/06,1306.0,1307.451,1306.0,52600,1315.0,1302.0
683,2017/10/10,1290.0,1289.583,1315.0,110300,1318.0,1274.0
684,2017/10/11,1273.0,1272.36,1300.0,88400,1300.0,1260.0
685,2017/10/12,1300.0,1286.356,1275.0,63200,1300.0,1272.0
686,2017/10/13,1295.0,1290.106,1300.0,41700,1302.0,1280.0
687,2017/10/16,1252.0,1256.512,1279.0,137500,1284.0,1245.0
688,2017/10/17,1241.0,1248.499,1252.0,88900,1266.0,1240.0
689,2017/10/18,1237.0,1243.802,1255.0,73100,1260.0,1231.0
690,2017/10/19,1252.0,1245.213,1247.0,48400,1257.0,1230.0
691,2017/10/20,1257.0,1244.452,1250.0,39200,1257.0,1235.0
692,2017/10/23,1254.0,1253.957,1262.0,86300,1263.0,1243.0
693,2017/10/24,1294.0,1282.906,1259.0,105400,1299.0,1259.0
694,2017/10/25,1321.0,1320.628,1297.0,165800,1344.0,1297.0
695,2017/10/26,1314.0,1316.239,1320.0,65300,1336.0,1307.0
696,2017/10/27,1327.0,1320.569,1317.0,59400,1335.0,1308.0
697,2017/10/30,1374.0,1359.529,1342.0,96400,1374.0,1342.0
698,2017/10/31,1372.0,1368.563,1385.0,91000,1386.0,1352.0
699,2017/11/01,1365.0,1355.841,1372.0,86700,1372.0,1341.0
700,2017/11/02,1338.0,1343.096,1361.0,67900,1367.0,1333.0
701,2017/11/06,1328.0,1335.956,1343.0,43300,1354.0,1323.0
702,2017/11/07,1317.0,1323.733,1345.0,26200,1345.0,1315.0
703,2017/11/08,1335.0,1316.006,1317.0,47000,1337.0,1307.0
704,2017/11/09,1330.0,1345.397,1352.0,143700,1380.0,1304.0
705,2017/11/10,1343.0,1326.158,1330.0,60300,1346.0,1306.0
706,2017/11/13,1353.0,1340.167,1350.0,54600,1353.0,1323.0
707,2017/11/14,1327.0,1340.793,1359.0,137100,1361.0,1327.0
708,2017/11/15,1238.0,1263.468,1321.0,215900,1324.0,1231.0
709,2017/11/16,1305.0,1302.891,1288.0,113700,1320.0,1276.0
710,2017/11/17,1339.0,1356.603,1305.0,237200,1398.0,1305.0
711,2017/11/20,1490.0,1439.738,1369.0,702700,1494.0,1348.0
712,2017/11/21,1494.0,1480.978,1471.0,275200,1510.0,1446.0
713,2017/11/22,1462.0,1480.729,1510.0,184000,1515.0,1449.0
714,2017/11/24,1444.0,1456.641,1465.0,114900,1487.0,1438.0
715,2017/11/27,1462.0,1499.838,1474.0,229000,1538.0,1451.0
716,2017/11/28,1437.0,1435.209,1456.0,195400,1484.0,1380.0
717,2017/11/29,1437.0,1431.382,1437.0,82800,1460.0,1406.0
718,2017/11/30,1424.0,1394.532,1440.0,222300,1440.0,1365.0
719,2017/12/01,1411.0,1404.932,1418.0,95000,1422.0,1388.0
720,2017/12/04,1334.0,1359.891,1394.0,193700,1399.0,1329.0
721,2017/12/05,1345.0,1334.386,1345.0,85500,1354.0,1303.0
722,2017/12/06,1320.0,1327.025,1328.0,61000,1355.0,1302.0
723,2017/12/07,1341.0,1346.982,1322.0,54700,1366.0,1322.0
724,2017/12/08,1341.0,1343.911,1350.0,48500,1358.0,1330.0
725,2017/12/11,1350.0,1358.051,1353.0,69300,1380.0,1343.0
726,2017/12/12,1377.0,1355.931,1347.0,50600,1377.0,1344.0
727,2017/12/13,1448.0,1431.256,1391.0,241100,1458.0,1381.0
728,2017/12/14,1430.0,1426.125,1436.0,112500,1437.0,1402.0
729,2017/12/15,1403.0,1415.265,1411.0,108900,1448.0,1386.0
730,2017/12/18,1405.0,1406.968,1420.0,34800,1424.0,1382.0
731,2017/12/19,1397.0,1414.191,1405.0,44600,1439.0,1397.0
732,2017/12/20,1362.0,1378.81,1397.0,57300,1403.0,1362.0
733,2017/12/21,1361.0,1363.865,1356.0,49700,1382.0,1353.0
734,2017/12/22,1419.0,1422.409,1420.0,280400,1470.0,1396.0
735,2017/12/25,1385.0,1400.218,1430.0,56900,1430.0,1385.0
736,2017/12/26,1395.0,1400.673,1415.0,66300,1415.0,1391.0
737,2017/12/27,1442.0,1436.138,1420.0,119900,1457.0,1410.0
738,2017/12/28,1411.0,1433.172,1448.0,84100,1468.0,1404.0
739,2017/12/29,1400.0,1409.563,1420.0,55600,1449.0,1393.0
740,2018/01/04,1408.0,1407.313,1410.0,64300,1421.0,1396.0
741,2018/01/05,1397.0,1405.171,1417.0,46800,1417.0,1397.0
742,2018/01/09,1393.0,1385.222,1402.0,376600,1402.0,1373.0
743,2018/01/10,1402.0,1388.473,1405.0,65500,1405.0,1380.0
744,2018/01/11,1391.0,1393.624,1394.0,60300,1405.0,1387.0
745,2018/01/12,1386.0,1389.201,1399.0,66800,1399.0,1382.0
746,2018/01/15,1419.0,1401.827,1389.0,72800,1420.0,1383.0
747,2018/01/16,1398.0,1406.149,1420.0,67700,1426.0,1395.0
748,2018/01/17,1382.0,1388.539,1398.0,74000,1399.0,1381.0
749,2018/01/18,1393.0,1398.102,1384.0,70800,1411.0,1384.0
750,2018/01/19,1393.0,1391.674,1397.0,43300,1408.0,1383.0
751,2018/01/22,1413.0,1406.709,1392.0,68300,1419.0,1383.0
752,2018/01/23,1408.0,1413.661,1413.0,91400,1434.0,1400.0
753,2018/01/24,1405.0,1407.071,1402.0,126200,1428.0,1390.0
754,2018/01/25,1423.0,1422.43,1401.0,85900,1444.0,1394.0
755,2018/01/26,1405.0,1415.951,1417.0,56600,1438.0,1405.0
756,2018/01/29,1408.0,1415.932,1430.0,45500,1430.0,1404.0
757,2018/01/30,1371.0,1379.302,1409.0,132200,1409.0,1357.0
758,2018/01/31,1342.0,1343.164,1360.0,85800,1364.0,1310.0
759,2018/02/01,1385.0,1372.05,1370.0,53900,1385.0,1348.0
760,2018/02/02,1383.0,1386.739,1385.0,68300,1398.0,1370.0
761,2018/02/05,1334.0,1338.159,1355.0,80000,1355.0,1325.0
762,2018/02/06,1202.0,1199.295,1184.0,195800,1267.0,1155.0
763,2018/02/07,1218.0,1247.734,1271.0,80900,1278.0,1213.0
764,2018/02/08,1257.0,1240.722,1224.0,44900,1259.0,1222.0
765,2018/02/09,1220.0,1195.393,1159.0,77600,1229.0,1159.0
766,2018/02/13,1170.0,1205.09,1270.0,67800,1270.0,1170.0
767,2018/02/14,1145.0,1155.455,1172.0,111500,1200.0,1125.0
768,2018/02/15,1031.0,1039.258,1031.0,319800,1062.0,1019.0
769,2018/02/16,1062.0,1062.861,1040.0,149200,1087.0,1040.0
770,2018/02/19,1106.0,1092.792,1090.0,108300,1115.0,1067.0
771,2018/02/20,1125.0,1125.58,1106.0,101600,1151.0,1090.0
772,2018/02/21,1141.0,1148.689,1125.0,64000,1169.0,1125.0
773,2018/02/22,1131.0,1121.606,1127.0,49700,1137.0,1105.0
774,2018/02/23,1110.0,1108.015,1130.0,104000,1130.0,1090.0
775,2018/02/26,1121.0,1125.309,1129.0,67700,1141.0,1115.0
776,2018/02/27,1092.0,1120.289,1127.0,466000,1146.0,1087.0
777,2018/02/28,1103.0,1101.835,1090.0,90700,1116.0,1084.0
778,2018/03/01,1099.0,1098.743,1103.0,52100,1110.0,1085.0
779,2018/03/02,1075.0,1072.838,1079.0,74700,1080.0,1063.0
780,2018/03/05,1025.0,1029.769,1066.0,174500,1076.0,1007.0
781,2018/03/06,1050.0,1049.198,1041.0,111400,1071.0,1026.0
782,2018/03/07,1059.0,1064.779,1054.0,96300,1080.0,1054.0
783,2018/03/08,1075.0,1074.733,1056.0,42700,1085.0,1056.0
784,2018/03/09,1066.0,1078.053,1099.0,45100,1099.0,1063.0
785,2018/03/12,1055.0,1064.486,1078.0,70800,1082.0,1048.0
786,2018/03/13,1100.0,1094.407,1067.0,75600,1111.0,1061.0
787,2018/03/14,1110.0,1110.786,1100.0,87800,1126.0,1087.0
788,2018/03/15,1122.0,1120.369,1100.0,56700,1137.0,1090.0
789,2018/03/16,1106.0,1114.289,1126.0,47400,1145.0,1100.0
790,2018/03/19,1083.0,1090.727,1110.0,75200,1119.0,1070.0
791,2018/03/20,1067.0,1066.263,1056.0,68100,1081.0,1056.0
792,2018/03/22,1069.0,1064.564,1067.0,63100,1083.0,1055.0
793,2018/03/23,1031.0,1029.238,1026.0,114200,1061.0,1020.0
794,2018/03/26,1033.0,1007.723,1018.0,107500,1034.0,983.0
795,2018/03/27,1031.0,1026.934,1059.0,101900,1059.0,1014.0
796,2018/03/28,1039.0,1031.951,1015.0,93700,1047.0,1014.0
797,2018/03/29,1073.0,1066.202,1055.0,56000,1084.0,1044.0
798,2018/03/30,1072.0,1081.11,1086.0,30900,1090.0,1072.0
799,2018/04/02,1055.0,1063.042,1068.0,37700,1077.0,1050.0
800,2018/04/03,1029.0,1034.971,1038.0,47700,1049.0,1025.0
801,2018/04/04,1025.0,1025.962,1039.0,55900,1039.0,1018.0
802,2018/04/05,1043.0,1035.917,1028.0,29000,1048.0,1027.0
803,2018/04/06,1026.0,1032.368,1043.0,38600,1051.0,1026.0
804,2018/04/09,1040.0,1028.869,1022.0,29700,1042.0,1015.0
805,2018/04/10,1028.0,1030.159,1038.0,31400,1042.0,1020.0
806,2018/04/11,1031.0,1025.266,1026.0,39800,1036.0,1017.0
807,2018/04/12,1045.0,1033.564,1031.0,358400,1065.0,1031.0
808,2018/04/13,1056.0,1053.556,1046.0,33100,1063.0,1045.0
809,2018/04/16,1026.0,1038.403,1069.0,31500,1069.0,1026.0
810,2018/04/17,1012.0,1003.078,1029.0,102800,1035.0,980.0
811,2018/04/18,1029.0,1020.752,1010.0,23400,1030.0,1006.0
812,2018/04/19,1036.0,1033.034,1033.0,20900,1042.0,1019.0
813,2018/04/20,1037.0,1055.951,1036.0,72900,1072.0,1035.0
814,2018/04/23,1057.0,1048.877,1040.0,30900,1057.0,1037.0
815,2018/04/24,1050.0,1052.473,1058.0,22000,1060.0,1045.0
816,2018/04/25,1056.0,1049.846,1050.0,24000,1059.0,1042.0
817,2018/04/26,1099.0,1072.034,1056.0,93100,1100.0,1040.0
818,2018/04/27,1072.0,1104.161,1099.0,294000,1169.0,1050.0
819,2018/05/01,1040.0,1050.49,1076.0,96800,1098.0,1028.0
820,2018/05/02,1044.0,1042.489,1040.0,23100,1052.0,1035.0
821,2018/05/07,1035.0,1038.704,1046.0,38500,1048.0,1030.0
822,2018/05/08,1106.0,1078.318,1030.0,154500,1118.0,1030.0
823,2018/05/09,1103.0,1108.041,1136.0,54000,1136.0,1093.0
824,2018/05/10,1144.0,1132.431,1103.0,119200,1152.0,1084.0
825,2018/05/11,1107.0,1121.482,1139.0,45200,1144.0,1101.0
826,2018/05/14,1118.0,1107.602,1101.0,47500,1125.0,1078.0
827,2018/05/15,1007.0,1013.164,1010.0,231300,1037.0,1006.0
828,2018/05/16,998.0,1004.805,1017.0,92500,1017.0,991.0
829,2018/05/17,1017.0,1010.143,1001.0,48400,1018.0,1000.0
830,2018/05/18,1014.0,1012.152,1015.0,25600,1020.0,1003.0
831,2018/05/21,1025.0,1027.59,1014.0,38500,1037.0,1014.0
832,2018/05/22,1038.0,1033.61,1033.0,40800,1040.0,1026.0
833,2018/05/23,1044.0,1038.919,1042.0,45600,1050.0,1028.0
834,2018/05/24,1025.0,1031.836,1041.0,34800,1044.0,1024.0
835,2018/05/25,1024.0,1024.316,1026.0,15200,1030.0,1020.0
836,2018/05/28,1013.0,1017.031,1024.0,16100,1025.0,1011.0
837,2018/05/29,1013.0,1008.551,1013.0,38500,1019.0,1000.0
838,2018/05/30,1008.0,1003.424,1000.0,29500,1014.0,999.0
839,2018/05/31,1025.0,1020.547,1014.0,27800,1028.0,1011.0
840,2018/06/01,1007.0,1020.983,1026.0,34300,1033.0,1007.0
841,2018/06/04,972.0,981.254,1000.0,147100,1007.0,963.0
842,2018/06/05,912.0,931.296,965.0,183600,966.0,898.0
843,2018/06/06,922.0,911.864,903.0,94700,941.0,879.0
844,2018/06/07,914.0,904.601,922.0,97100,922.0,897.0
845,2018/06/08,933.0,919.796,915.0,32400,933.0,908.0
846,2018/06/11,932.0,934.924,933.0,34000,942.0,930.0
847,2018/06/12,934.0,934.056,925.0,16100,940.0,925.0
848,2018/06/13,939.0,931.741,940.0,31700,940.0,926.0
849,2018/06/14,947.0,948.739,939.0,28000,967.0,934.0
850,2018/06/15,948.0,949.624,950.0,30600,961.0,940.0
851,2018/06/18,921.0,934.296,956.0,55500,957.0,920.0
852,2018/06/19,908.0,912.31,917.0,30000,924.0,908.0
853,2018/06/20,925.0,910.607,911.0,31000,933.0,895.0
854,2018/06/21,935.0,938.967,924.0,18400,948.0,923.0
855,2018/06/22,933.0,935.914,923.0,25700,948.0,923.0
856,2018/06/25,905.0,919.721,937.0,35100,946.0,902.0
857,2018/06/26,915.0,913.019,901.0,37300,940.0,900.0
858,2018/06/27,935.0,933.596,915.0,50700,959.0,908.0
859,2018/06/28,908.0,920.244,926.0,34900,950.0,907.0
860,2018/06/29,947.0,936.687,914.0,37400,950.0,911.0
861,2018/07/02,951.0,953.02,950.0,40300,968.0,940.0
862,2018/07/03,926.0,936.632,951.0,28000,960.0,917.0
863,2018/07/04,924.0,923.121,913.0,17400,943.0,912.0
864,2018/07/05,920.0,928.182,921.0,43900,945.0,907.0
865,2018/07/06,938.0,929.591,914.0,22500,944.0,912.0
866,2018/07/09,968.0,958.503,939.0,30400,972.0,938.0
867,2018/07/10,946.0,955.638,961.0,28200,964.0,943.0
868,2018/07/11,944.0,939.525,946.0,23600,952.0,922.0
869,2018/07/12,943.0,945.682,940.0,31400,960.0,930.0
870,2018/07/13,936.0,941.708,935.0,37700,958.0,930.0
871,2018/07/17,927.0,928.838,932.0,32000,939.0,922.0
872,2018/07/18,1017.0,1023.87,993.0,1102200,1077.0,970.0
873,2018/07/19,1143.0,1103.473,1050.0,1234400,1173.0,1018.0
874,2018/07/20,1136.0,1126.285,1135.0,450500,1159.0,1093.0
875,2018/07/23,1159.0,1133.848,1115.0,307900,1176.0,1082.0
876,2018/07/24,1210.0,1190.695,1177.0,433900,1215.0,1146.0
877,2018/07/25,1175.0,1182.358,1197.0,156000,1202.0,1170.0
878,2018/07/26,1174.0,1204.709,1223.0,215600,1247.0,1170.0
879,2018/07/27,1110.0,1123.871,1148.0,174100,1165.0,1102.0
880,2018/07/30,1049.0,1063.816,1100.0,170600,1100.0,1034.0
881,2018/07/31,1050.0,1061.011,1043.0,84000,1092.0,1039.0
882,2018/08/01,1062.0,1058.636,1041.0,54700,1077.0,1039.0
883,2018/08/02,1066.0,1057.021,1043.0,53500,1075.0,1043.0
884,2018/08/03,1021.0,1034.452,1062.0,63300,1064.0,1020.0
885,2018/08/06,1023.0,1027.896,1023.0,27000,1036.0,1021.0
886,2018/08/07,1000.0,1002.981,1013.0,64400,1019.0,990.0
887,2018/08/08,997.0,985.647,1000.0,43600,1005.0,970.0
888,2018/08/09,999.0,996.725,1000.0,25100,1000.0,989.0
889,2018/08/10,1001.0,1004.172,1000.0,36100,1012.0,999.0
890,2018/08/13,959.0,967.838,1000.0,61200,1002.0,952.0
891,2018/08/14,951.0,964.704,944.0,59700,990.0,944.0
892,2018/08/15,899.0,885.911,856.0,153400,919.0,856.0
893,2018/08/16,910.0,901.768,881.0,56100,920.0,879.0
894,2018/08/17,895.0,903.568,910.0,42600,923.0,891.0
895,2018/08/20,898.0,899.171,900.0,22200,908.0,891.0
896,2018/08/21,875.0,887.792,891.0,66900,928.0,865.0
897,2018/08/22,892.0,889.917,883.0,41000,906.0,873.0
898,2018/08/23,908.0,901.875,900.0,24700,909.0,891.0
899,2018/08/24,918.0,913.943,910.0,36600,925.0,901.0
900,2018/08/27,928.0,934.738,923.0,38900,946.0,923.0
901,2018/08/28,914.0,923.528,931.0,25400,938.0,911.0
902,2018/08/29,925.0,925.685,915.0,44500,939.0,915.0
903,2018/08/30,944.0,941.897,933.0,46800,956.0,929.0
904,2018/08/31,966.0,959.239,947.0,63200,974.0,943.0
905,2018/09/03,989.0,987.686,981.0,44000,997.0,979.0
906,2018/09/04,963.0,972.548,995.0,44900,995.0,954.0
907,2018/09/05,959.0,960.259,960.0,21600,972.0,946.0
908,2018/09/06,935.0,939.228,950.0,44400,957.0,927.0
909,2018/09/07,927.0,924.511,921.0,21900,936.0,913.0
910,2018/09/10,918.0,925.871,929.0,19300,935.0,918.0
911,2018/09/11,913.0,915.707,917.0,18400,923.0,910.0
912,2018/09/12,940.0,915.228,926.0,51800,944.0,888.0
913,2018/09/13,932.0,933.741,945.0,31300,950.0,916.0
914,2018/09/14,900.0,909.787,921.0,42800,923.0,899.0
915,2018/09/18,914.0,914.61,904.0,42000,923.0,902.0
916,2018/09/19,908.0,914.644,920.0,20500,921.0,908.0
917,2018/09/20,914.0,914.651,916.0,28100,929.0,906.0
918,2018/09/21,914.0,916.925,914.0,16000,928.0,911.0
919,2018/09/25,929.0,926.632,914.0,43800,940.0,908.0
920,2018/09/26,964.0,958.97,939.0,50100,973.0,936.0
921,2018/09/27,945.0,950.665,949.0,32200,961.0,943.0
922,2018/09/28,974.0,968.367,960.0,39200,975.0,960.0
923,2018/10/01,962.0,968.615,980.0,31700,985.0,955.0
924,2018/10/02,933.0,946.482,969.0,51900,973.0,930.0
925,2018/10/03,931.0,932.346,948.0,31800,948.0,924.0
926,2018/10/04,933.0,934.586,936.0,9900,940.0,931.0
927,2018/10/05,926.0,927.493,938.0,20900,942.0,919.0
928,2018/10/09,918.0,917.671,912.0,14600,929.0,910.0
929,2018/10/10,920.0,918.066,915.0,22700,934.0,911.0
930,2018/10/11,891.0,886.441,860.0,61700,918.0,860.0
931,2018/10/12,915.0,907.056,880.0,17800,922.0,879.0
932,2018/10/15,912.0,914.167,916.0,14400,923.0,905.0
933,2018/10/16,914.0,917.329,922.0,7600,928.0,908.0
934,2018/10/17,933.0,929.092,919.0,20700,942.0,918.0
935,2018/10/18,961.0,949.199,933.0,35600,962.0,933.0
936,2018/10/19,952.0,956.823,946.0,27600,970.0,946.0
937,2018/10/22,897.0,901.504,877.0,137100,939.0,871.0
938,2018/10/23,905.0,911.426,895.0,44100,926.0,887.0
939,2018/10/24,901.0,915.935,916.0,30900,932.0,901.0
940,2018/10/25,881.0,891.067,892.0,46000,902.0,880.0
941,2018/10/26,845.0,860.456,915.0,78800,915.0,833.0
942,2018/10/29,899.0,898.826,850.0,94600,920.0,850.0
943,2018/10/30,920.0,913.952,884.0,22800,927.0,883.0
944,2018/10/31,933.0,937.502,920.0,26700,951.0,912.0
945,2018/11/01,926.0,934.768,948.0,11200,948.0,923.0
946,2018/11/02,920.0,923.163,922.0,17200,935.0,912.0
947,2018/11/05,926.0,920.315,922.0,12400,930.0,905.0
948,2018/11/06,913.0,920.663,926.0,16900,935.0,911.0
949,2018/11/07,907.0,907.584,913.0,25700,924.0,895.0
950,2018/11/08,919.0,916.969,917.0,22700,925.0,911.0
951,2018/11/09,899.0,902.334,919.0,35300,920.0,892.0
952,2018/11/12,906.0,904.445,894.0,12800,911.0,894.0
953,2018/11/13,901.0,911.55,895.0,25800,931.0,893.0
954,2018/11/14,901.0,894.086,901.0,32600,908.0,885.0
955,2018/11/15,894.0,892.272,886.0,17300,899.0,886.0
956,2018/11/16,880.0,873.537,887.0,27000,900.0,853.0
957,2018/11/19,862.0,862.581,889.0,15500,889.0,843.0
958,2018/11/20,852.0,851.266,852.0,16900,859.0,847.0
959,2018/11/21,840.0,847.899,840.0,20800,865.0,838.0
960,2018/11/22,854.0,843.49,835.0,14900,864.0,835.0
961,2018/11/26,868.0,855.988,839.0,24500,868.0,839.0
962,2018/11/27,885.0,877.038,868.0,18500,885.0,850.0
963,2018/11/28,894.0,891.43,885.0,25100,900.0,885.0
964,2018/11/29,904.0,900.693,891.0,26400,912.0,890.0
965,2018/11/30,918.0,911.259,904.0,20500,920.0,901.0
966,2018/12/03,901.0,909.349,923.0,19200,924.0,899.0
967,2018/12/04,905.0,896.883,892.0,23000,906.0,887.0
968,2018/12/05,901.0,897.35,899.0,10300,904.0,890.0
969,2018/12/06,896.0,889.648,896.0,10800,896.0,881.0
970,2018/12/07,907.0,903.512,900.0,24600,910.0,891.0
971,2018/12/10,883.0,883.846,877.0,17500,893.0,877.0
972,2018/12/11,851.0,866.539,894.0,19300,894.0,849.0
973,2018/12/12,857.0,848.231,847.0,24200,869.0,836.0
974,2018/12/13,902.0,893.783,860.0,33600,913.0,860.0
975,2018/12/14,909.0,922.244,915.0,50800,939.0,901.0
976,2018/12/17,937.0,930.591,900.0,35000,939.0,887.0
977,2018/12/18,903.0,911.293,922.0,37200,934.0,890.0
978,2018/12/19,837.0,847.758,889.0,78600,900.0,798.0
979,2018/12/20,760.0,787.349,831.0,436600,836.0,737.0
980,2018/12/21,719.0,719.065,745.0,75800,758.0,682.0
981,2018/12/25,638.0,645.293,629.0,78200,669.0,629.0
982,2018/12/26,627.0,625.495,626.0,78400,644.0,600.0
983,2018/12/27,635.0,645.632,660.0,57000,667.0,631.0
984,2018/12/28,635.0,625.807,621.0,45000,642.0,617.0
985,2019/01/04,632.0,611.469,615.0,40300,632.0,596.0
986,2019/01/07,653.0,645.882,640.0,66000,663.0,628.0
987,2019/01/08,675.0,668.68,650.0,57100,688.0,646.0
988,2019/01/09,647.0,652.542,665.0,44100,675.0,644.0
989,2019/01/10,617.0,626.08,646.0,51100,646.0,615.0
990,2019/01/11,626.0,616.373,612.0,23300,628.0,610.0
991,2019/01/15,647.0,628.78,620.0,48200,647.0,613.0
992,2019/01/16,678.0,666.635,649.0,39700,686.0,640.0
993,2019/01/17,697.0,685.333,684.0,36900,697.0,670.0
994,2019/01/18,712.0,708.242,696.0,38800,724.0,692.0
995,2019/01/21,692.0,708.352,725.0,28700,725.0,692.0
996,2019/01/22,677.0,671.781,690.0,31000,690.0,661.0
997,2019/01/23,671.0,670.688,667.0,20800,688.0,656.0
998,2019/01/24,692.0,681.826,665.0,36200,697.0,663.0
999,2019/01/25,710.0,698.548,687.0,23000,710.0,681.0
1000,2019/01/28,699.0,706.628,714.0,13700,720.0,695.0
1001,2019/01/29,703.0,692.834,691.0,18100,705.0,675.0
1002,2019/01/30,683.0,689.642,698.0,20100,702.0,680.0
1003,2019/01/31,703.0,692.086,685.0,23300,708.0,676.0
1004,2019/02/01,692.0,693.532,699.0,12600,712.0,687.0
1005,2019/02/04,704.0,691.927,693.0,19200,709.0,676.0
1006,2019/02/05,703.0,702.816,709.0,14700,710.0,690.0
1007,2019/02/06,696.0,698.554,708.0,9200,708.0,692.0
1008,2019/02/07,680.0,686.756,690.0,13500,697.0,679.0
1009,2019/02/08,677.0,666.006,678.0,15900,693.0,651.0
1010,2019/02/12,675.0,673.273,671.0,16500,685.0,660.0
1011,2019/02/13,668.0,674.217,700.0,19800,700.0,661.0
1012,2019/02/14,705.0,686.213,671.0,34700,716.0,661.0
1013,2019/02/15,651.0,656.633,660.0,43600,672.0,642.0
1014,2019/02/18,654.0,649.489,658.0,13100,662.0,644.0
1015,2019/02/19,649.0,641.922,657.0,25500,657.0,636.0
1016,2019/02/20,648.0,643.18,652.0,15600,652.0,637.0
1017,2019/02/21,649.0,644.771,646.0,16600,649.0,643.0
1018,2019/02/22,654.0,650.009,645.0,11600,656.0,644.0
1019,2019/02/25,654.0,653.994,658.0,16200,663.0,648.0
1020,2019/02/26,635.0,637.685,647.0,20300,647.0,631.0
1021,2019/02/27,640.0,640.473,630.0,20300,656.0,630.0
1022,2019/02/28,642.0,642.97,645.0,16600,649.0,640.0
1023,2019/03/01,649.0,645.779,642.0,9500,649.0,642.0
1024,2019/03/04,719.0,703.954,663.0,136200,735.0,653.0
1025,2019/03/05,800.0,798.075,701.0,297700,860.0,701.0
1026,2019/03/06,805.0,799.7,830.0,81000,830.0,779.0
1027,2019/03/07,759.0,768.351,794.0,67600,800.0,748.0
1028,2019/03/08,721.0,732.02,739.0,30300,744.0,721.0
1029,2019/03/11,737.0,750.642,709.0,92500,818.0,701.0
1030,2019/03/12,755.0,747.235,750.0,63300,773.0,716.0
1031,2019/03/13,789.0,772.007,751.0,54900,793.0,736.0
1032,2019/03/14,773.0,782.551,792.0,27400,795.0,770.0
1033,2019/03/15,783.0,779.683,783.0,27100,792.0,761.0
1034,2019/03/18,801.0,806.759,797.0,58100,825.0,783.0
1035,2019/03/19,777.0,782.973,803.0,26200,803.0,771.0
1036,2019/03/20,761.0,755.663,777.0,68600,777.0,731.0
1037,2019/03/22,811.0,773.09,776.0,54700,811.0,742.0
1038,2019/03/25,770.0,761.052,785.0,71300,792.0,721.0
1039,2019/03/26,764.0,765.627,770.0,16600,775.0,752.0
1040,2019/03/27,793.0,779.327,779.0,20800,793.0,763.0
1041,2019/03/28,767.0,769.047,785.0,29700,785.0,759.0
1042,2019/03/29,771.0,770.312,765.0,17000,778.0,765.0
1043,2019/04/01,777.0,784.805,799.0,16400,799.0,773.0
1044,2019/04/02,770.0,775.838,779.0,26600,794.0,768.0
1045,2019/04/03,780.0,765.244,766.0,32400,782.0,750.0
1046,2019/04/04,770.0,770.828,777.0,15100,783.0,764.0
1047,2019/04/05,769.0,769.571,783.0,4900,783.0,764.0
1048,2019/04/08,772.0,774.35,773.0,21700,782.0,769.0
1049,2019/04/09,761.0,768.866,774.0,25300,781.0,759.0
1050,2019/04/10,758.0,751.205,750.0,16100,764.0,732.0
1051,2019/04/11,770.0,763.261,764.0,14200,774.0,753.0
1052,2019/04/12,769.0,768.267,768.0,9000,773.0,762.0
1053,2019/04/15,781.0,800.008,775.0,156500,842.0,766.0
1054,2019/04/16,787.0,794.399,786.0,83000,816.0,770.0
1055,2019/04/17,854.0,839.666,787.0,187600,907.0,787.0
1056,2019/04/18,831.0,853.47,849.0,127100,893.0,822.0
1057,2019/04/19,762.0,781.046,822.0,203400,830.0,752.0
1058,2019/04/22,703.0,716.087,751.0,156000,751.0,699.0
1059,2019/04/23,692.0,686.429,698.0,65000,704.0,667.0
1060,2019/04/24,706.0,701.6,692.0,42500,713.0,687.0
1061,2019/04/25,722.0,715.719,706.0,24900,724.0,706.0
1062,2019/04/26,708.0,702.668,714.0,22900,716.0,692.0
1063,2019/05/07,716.0,711.174,706.0,21800,722.0,701.0
1064,2019/05/08,702.0,705.622,715.0,22200,716.0,694.0
1065,2019/05/09,679.0,685.968,702.0,34000,702.0,669.0
1066,2019/05/10,671.0,679.688,669.0,27200,692.0,669.0
1067,2019/05/13,668.0,670.982,676.0,27600,681.0,663.0
1068,2019/05/14,649.0,656.822,658.0,28600,671.0,649.0
1069,2019/05/15,678.0,678.113,655.0,41600,690.0,655.0
1070,2019/05/16,663.0,656.989,680.0,37700,680.0,644.0
1071,2019/05/17,685.0,693.893,674.0,57700,719.0,673.0
1072,2019/05/20,695.0,685.135,685.0,14100,696.0,672.0
1073,2019/05/21,668.0,674.725,685.0,25100,688.0,664.0
1074,2019/05/22,664.0,672.797,683.0,30600,684.0,660.0
1075,2019/05/23,661.0,659.341,681.0,22000,681.0,652.0
1076,2019/05/24,659.0,654.263,651.0,18600,666.0,639.0
1077,2019/05/27,661.0,665.674,661.0,8900,675.0,659.0
1078,2019/05/28,666.0,667.295,661.0,15600,679.0,660.0
1079,2019/05/29,670.0,670.08,667.0,15100,680.0,661.0
1080,2019/05/30,654.0,655.556,674.0,26600,677.0,642.0
1081,2019/05/31,651.0,655.99,662.0,20000,667.0,645.0
1082,2019/06/03,620.0,626.906,647.0,32900,647.0,612.0
1083,2019/06/04,615.0,614.39,621.0,18200,623.0,607.0
1084,2019/06/05,646.0,634.153,623.0,55100,657.0,612.0
1085,2019/06/06,666.0,702.116,640.0,301400,742.0,634.0
1086,2019/06/07,683.0,688.451,666.0,55400,710.0,665.0
1087,2019/06/10,679.0,688.873,712.0,53600,712.0,671.0
1088,2019/06/11,687.0,685.362,686.0,21800,696.0,670.0
1089,2019/06/12,695.0,691.58,697.0,11200,697.0,676.0
1090,2019/06/13,676.0,674.944,690.0,23200,690.0,665.0
1091,2019/06/14,680.0,683.336,690.0,13100,690.0,675.0
1092,2019/06/17,666.0,668.948,684.0,19100,684.0,662.0
1093,2019/06/18,668.0,665.867,676.0,24100,680.0,660.0
1094,2019/06/19,667.0,669.183,669.0,11500,676.0,662.0
1095,2019/06/20,672.0,674.203,674.0,12800,679.0,668.0
1096,2019/06/21,662.0,661.649,667.0,33600,672.0,653.0
1097,2019/06/24,665.0,662.21,664.0,21000,667.0,651.0
1098,2019/06/25,659.0,661.146,665.0,8200,669.0,657.0
1099,2019/06/26,668.0,681.444,704.0,50400,705.0,665.0
1100,2019/06/27,670.0,671.863,669.0,12400,679.0,668.0
1101,2019/06/28,669.0,670.596,673.0,9400,675.0,665.0
1102,2019/07/01,670.0,670.19,677.0,14200,677.0,664.0
1103,2019/07/02,675.0,678.025,676.0,12000,681.0,674.0
1104,2019/07/03,675.0,679.795,675.0,14600,684.0,673.0
1105,2019/07/04,684.0,678.843,672.0,8300,684.0,672.0
1106,2019/07/05,681.0,683.489,689.0,8800,689.0,677.0
1107,2019/07/08,666.0,674.657,678.0,10500,681.0,666.0
1108,2019/07/09,665.0,673.761,666.0,23400,681.0,665.0
1109,2019/07/10,668.0,669.94,667.0,5000,674.0,663.0
1110,2019/07/11,671.0,671.061,669.0,13200,676.0,667.0
1111,2019/07/12,676.0,671.939,668.0,13000,676.0,666.0
1112,2019/07/16,662.0,659.475,668.0,16000,668.0,654.0
1113,2019/07/17,670.0,666.732,652.0,25400,679.0,652.0
1114,2019/07/18,666.0,667.784,668.0,8800,676.0,664.0
1115,2019/07/19,672.0,673.091,672.0,8800,678.0,670.0
1116,2019/07/22,687.0,679.775,677.0,26700,687.0,667.0
1117,2019/07/23,684.0,684.839,680.0,5600,689.0,679.0
1118,2019/07/24,674.0,674.069,675.0,10100,678.0,670.0
1119,2019/07/25,672.0,669.226,667.0,5300,675.0,667.0
1120,2019/07/26,669.0,668.542,668.0,2400,673.0,667.0
1121,2019/07/29,670.0,667.421,668.0,5700,670.0,666.0
1122,2019/07/30,670.0,665.403,671.0,6700,671.0,660.0
1123,2019/07/31,672.0,669.1,660.0,6000,673.0,660.0
1124,2019/08/01,705.0,689.906,671.0,51900,705.0,663.0
1125,2019/08/02,705.0,699.057,683.0,33300,708.0,683.0
1126,2019/08/05,688.0,707.29,705.0,56300,725.0,680.0
1127,2019/08/06,683.0,675.994,668.0,32100,685.0,666.0
1128,2019/08/07,680.0,689.159,685.0,22700,701.0,677.0
1129,2019/08/08,696.0,691.287,684.0,23000,701.0,682.0
1130,2019/08/09,706.0,706.414,698.0,23900,715.0,695.0
1131,2019/08/13,709.0,710.955,710.0,40300,724.0,694.0
1132,2019/08/14,670.0,668.147,665.0,53000,678.0,651.0
1133,2019/08/15,663.0,662.369,654.0,21400,673.0,654.0
1134,2019/08/16,664.0,662.461,661.0,12800,669.0,659.0
1135,2019/08/19,650.0,659.255,665.0,178000,667.0,646.0
1136,2019/08/20,654.0,652.824,660.0,9100,660.0,649.0
1137,2019/08/21,662.0,659.813,659.0,9600,664.0,657.0
1138,2019/08/22,659.0,656.824,662.0,13100,665.0,651.0
1139,2019/08/23,656.0,658.477,665.0,10900,665.0,653.0
