ds,yhat
2019-08-07,69.29858985166666
2019-08-08,69.54806535869686
2019-08-09,69.48795437122686
2019-08-13,68.11236123940428
2019-08-14,68.53365314218453
2019-08-15,68.9521606765752
2019-08-16,68.98597462970315
2019-08-19,67.5483338254029
2019-08-20,67.70283301844708
2019-08-21,68.26582864577615
2019-08-22,68.84216266395852
2019-08-23,69.06552663114968
2019-08-26,68.30664504154385
2019-08-27,68.51800370459607
2019-08-28,69.06482364605888
2019-08-29,69.6959940801936
2019-08-30,70.149344261308
2019-09-02,69.78340132186744
2019-09-03,69.44620959717453
2019-09-04,69.29739964681205
2019-09-05,69.46011663238247
