,Date,Close,VWAP,Open,Volume,High,Low
0,2014/08/25,2980.0,2978.849,2995.0,707200,3000.0,2965.0
1,2014/08/26,2955.0,2957.308,2965.0,369600,2965.0,2950.0
2,2014/08/27,2980.0,2969.793,2965.0,289000,2980.0,2960.0
3,2014/08/28,2945.0,2953.032,2970.0,334800,2970.0,2940.0
4,2014/08/29,2935.0,2924.009,2920.0,477200,2940.0,2905.0
5,2014/09/01,2950.0,2955.888,2960.0,385400,2970.0,2945.0
6,2014/09/02,3070.0,3040.681,2960.0,1499600,3080.0,2950.0
7,2014/09/03,3120.0,3136.997,3150.0,1277000,3160.0,3110.0
8,2014/09/04,3055.0,3075.759,3140.0,832600,3145.0,3040.0
9,2014/09/05,3110.0,3124.818,3165.0,1240800,3170.0,3085.0
10,2014/09/08,3165.0,3162.11,3170.0,1163000,3190.0,3105.0
11,2014/09/09,3135.0,3148.798,3185.0,626200,3190.0,3125.0
12,2014/09/10,3130.0,3119.963,3115.0,487600,3135.0,3095.0
13,2014/09/11,3115.0,3139.116,3160.0,966800,3175.0,3105.0
14,2014/09/12,3165.0,3144.645,3135.0,1206000,3170.0,3125.0
15,2014/09/16,3210.0,3207.452,3180.0,1150800,3230.0,3175.0
16,2014/09/17,3170.0,3195.402,3240.0,851600,3240.0,3160.0
17,2014/09/18,3275.0,3276.887,3220.0,2046600,3335.0,3205.0
18,2014/09/19,3310.0,3306.304,3285.0,1128400,3335.0,3280.0
19,2014/09/22,3310.0,3304.103,3305.0,666200,3330.0,3280.0
20,2014/09/24,3330.0,3316.683,3290.0,615200,3335.0,3275.0
21,2014/09/25,3385.0,3376.079,3340.0,705400,3400.0,3340.0
22,2014/09/26,3380.0,3367.694,3325.0,654400,3390.0,3310.0
23,2014/09/29,3375.0,3379.277,3425.0,529600,3435.0,3355.0
24,2014/09/30,3285.0,3280.64,3305.0,1365200,3325.0,3250.0
25,2014/10/01,3230.0,3243.522,3280.0,856600,3295.0,3220.0
26,2014/10/02,3155.0,3171.123,3175.0,790800,3205.0,3140.0
27,2014/10/03,3165.0,3147.843,3140.0,671200,3170.0,3125.0
28,2014/10/06,3240.0,3248.408,3245.0,710200,3275.0,3220.0
29,2014/10/07,3190.0,3196.477,3220.0,517200,3230.0,3170.0
30,2014/10/08,3105.0,3094.398,3100.0,1010800,3115.0,3075.0
31,2014/10/09,3055.0,3089.846,3115.0,818800,3155.0,3045.0
32,2014/10/10,2990.0,2988.491,3005.0,1137600,3020.0,2955.0
33,2014/10/14,2900.0,2916.375,2905.0,1613200,2945.0,2885.0
34,2014/10/15,2875.0,2852.902,2905.0,1574800,2905.0,2825.0
35,2014/10/16,2760.0,2769.263,2785.0,1250000,2795.0,2740.0
36,2014/10/17,2705.0,2730.009,2770.0,1101600,2785.0,2700.0
37,2014/10/20,2825.0,2802.219,2770.0,1224400,2825.0,2765.0
38,2014/10/21,2730.0,2760.005,2825.0,1134200,2840.0,2720.0
39,2014/10/22,2850.0,2831.825,2810.0,971800,2855.0,2805.0
40,2014/10/23,2770.0,2781.438,2810.0,1186800,2815.0,2760.0
41,2014/10/24,2835.0,2829.981,2845.0,869400,2850.0,2805.0
42,2014/10/27,2855.0,2846.831,2860.0,639000,2870.0,2825.0
43,2014/10/28,2835.0,2835.929,2870.0,573600,2875.0,2810.0
44,2014/10/29,2875.0,2866.219,2850.0,804800,2885.0,2845.0
45,2014/10/30,2885.0,2886.004,2860.0,1087400,2910.0,2860.0
46,2014/10/31,3000.0,2955.223,2890.0,2239600,3030.0,2870.0
47,2014/11/04,3040.0,3060.537,3125.0,1951400,3125.0,3020.0
48,2014/11/05,3025.0,3020.237,3035.0,1252600,3065.0,2985.0
49,2014/11/06,2960.0,2964.267,3025.0,1648200,3025.0,2910.0
50,2014/11/07,2870.0,2831.458,2800.0,1759000,2880.0,2725.0
51,2014/11/10,2855.0,2861.92,2890.0,1568400,2905.0,2830.0
52,2014/11/11,2785.0,2787.729,2820.0,2001200,2830.0,2755.0
53,2014/11/12,2780.0,2767.994,2780.0,1579800,2790.0,2735.0
54,2014/11/13,2765.0,2742.352,2750.0,1415200,2770.0,2705.0
55,2014/11/14,2765.0,2758.348,2775.0,1202600,2780.0,2740.0
56,2014/11/17,2700.0,2722.276,2765.0,1588400,2780.0,2690.0
57,2014/11/18,2650.0,2654.764,2705.0,1657400,2720.0,2630.0
58,2014/11/19,2590.0,2589.899,2600.0,2242000,2600.0,2550.0
59,2014/11/20,2605.0,2602.829,2600.0,1464000,2630.0,2590.0
60,2014/11/21,2655.0,2633.871,2640.0,1632400,2670.0,2600.0
61,2014/11/25,2725.0,2729.77,2720.0,1792800,2750.0,2705.0
62,2014/11/26,2705.0,2704.996,2730.0,1055000,2745.0,2680.0
63,2014/11/27,2655.0,2660.04,2695.0,949400,2695.0,2640.0
64,2014/11/28,2540.0,2562.528,2645.0,2976600,2650.0,2515.0
65,2014/12/01,2535.0,2540.402,2560.0,1387600,2565.0,2525.0
66,2014/12/02,2560.0,2555.924,2550.0,1101600,2575.0,2540.0
67,2014/12/03,2675.0,2651.156,2585.0,2364600,2695.0,2585.0
68,2014/12/04,2650.0,2647.27,2675.0,1189000,2685.0,2625.0
69,2014/12/05,2650.0,2645.131,2655.0,836800,2665.0,2630.0
70,2014/12/08,2630.0,2632.774,2655.0,747000,2660.0,2615.0
71,2014/12/09,2550.0,2570.707,2595.0,1160800,2600.0,2545.0
72,2014/12/10,2570.0,2544.662,2550.0,1096400,2580.0,2520.0
73,2014/12/11,2560.0,2550.428,2520.0,814000,2575.0,2520.0
74,2014/12/12,2570.0,2578.747,2575.0,1242400,2595.0,2570.0
75,2014/12/15,2485.0,2493.2,2505.0,1405400,2525.0,2465.0
76,2014/12/16,2415.0,2419.614,2455.0,1337600,2460.0,2390.0
77,2014/12/17,2440.0,2432.047,2395.0,835800,2450.0,2385.0
78,2014/12/18,2495.0,2500.62,2505.0,1048600,2520.0,2485.0
79,2014/12/19,2540.0,2528.982,2525.0,1119600,2545.0,2510.0
80,2014/12/22,2525.0,2512.542,2515.0,601600,2525.0,2500.0
81,2014/12/24,2500.0,2509.745,2515.0,729800,2525.0,2500.0
82,2014/12/25,2465.0,2466.509,2495.0,730600,2505.0,2445.0
83,2014/12/26,2495.0,2484.589,2450.0,489200,2505.0,2450.0
84,2014/12/29,2490.0,2500.187,2500.0,641200,2525.0,2475.0
85,2014/12/30,2485.0,2493.156,2495.0,441400,2505.0,2480.0
86,2015/01/05,2450.0,2472.81,2495.0,649200,2500.0,2450.0
87,2015/01/06,2395.0,2406.159,2410.0,993400,2425.0,2385.0
88,2015/01/07,2390.0,2400.622,2380.0,688800,2425.0,2375.0
89,2015/01/08,2405.0,2421.317,2425.0,654400,2450.0,2400.0
90,2015/01/09,2350.0,2366.024,2420.0,1249400,2430.0,2330.0
91,2015/01/13,2295.0,2283.812,2295.0,1083800,2300.0,2270.0
92,2015/01/14,2245.0,2263.305,2280.0,1047800,2300.0,2240.0
93,2015/01/15,2305.0,2274.685,2245.0,898400,2310.0,2235.0
94,2015/01/16,2270.0,2254.431,2250.0,1086400,2275.0,2240.0
95,2015/01/19,2340.0,2315.34,2270.0,1060600,2345.0,2265.0
96,2015/01/20,2375.0,2383.666,2365.0,1444200,2430.0,2355.0
97,2015/01/21,2300.0,2306.279,2335.0,1181200,2335.0,2285.0
98,2015/01/22,2335.0,2316.404,2300.0,1140400,2335.0,2295.0
99,2015/01/23,2345.0,2348.258,2355.0,691000,2365.0,2330.0
100,2015/01/26,2355.0,2341.514,2310.0,526600,2365.0,2300.0
101,2015/01/27,2390.0,2379.973,2370.0,548800,2395.0,2360.0
102,2015/01/28,2350.0,2351.71,2350.0,814200,2370.0,2330.0
103,2015/01/29,2330.0,2334.052,2325.0,495400,2350.0,2315.0
104,2015/01/30,2285.0,2301.777,2350.0,843600,2360.0,2280.0
105,2015/02/02,2275.0,2281.172,2270.0,652200,2305.0,2265.0
106,2015/02/03,2335.0,2339.906,2335.0,1086200,2365.0,2315.0
107,2015/02/04,2470.0,2455.426,2385.0,1805200,2485.0,2385.0
108,2015/02/05,2410.0,2413.096,2440.0,889600,2455.0,2395.0
109,2015/02/06,2420.0,2425.487,2425.0,587800,2440.0,2410.0
110,2015/02/09,2465.0,2458.599,2435.0,907200,2480.0,2425.0
111,2015/02/10,2435.0,2429.691,2425.0,2664200,2475.0,2345.0
112,2015/02/12,2360.0,2381.865,2470.0,1507600,2470.0,2350.0
113,2015/02/13,2310.0,2306.595,2310.0,1866800,2325.0,2285.0
114,2015/02/16,2355.0,2358.199,2350.0,891400,2370.0,2340.0
115,2015/02/17,2380.0,2383.242,2375.0,1046200,2405.0,2350.0
116,2015/02/18,2380.0,2387.421,2400.0,759600,2405.0,2375.0
117,2015/02/19,2380.0,2379.976,2370.0,537800,2395.0,2360.0
118,2015/02/20,2375.0,2377.629,2385.0,660400,2400.0,2360.0
119,2015/02/23,2395.0,2394.436,2390.0,859800,2415.0,2380.0
120,2015/02/24,2420.0,2409.534,2400.0,805800,2425.0,2390.0
121,2015/02/25,2480.0,2470.017,2445.0,1534200,2490.0,2435.0
122,2015/02/26,2540.0,2533.413,2505.0,1525400,2550.0,2500.0
123,2015/02/27,2550.0,2560.397,2560.0,1256600,2595.0,2530.0
124,2015/03/02,2530.0,2546.408,2580.0,508600,2585.0,2530.0
125,2015/03/03,2490.0,2491.411,2530.0,832000,2535.0,2465.0
126,2015/03/04,2510.0,2495.713,2470.0,573800,2520.0,2465.0
127,2015/03/05,2510.0,2512.582,2515.0,485800,2530.0,2495.0
128,2015/03/06,2515.0,2518.68,2515.0,540000,2535.0,2505.0
129,2015/03/09,2475.0,2478.8,2485.0,613000,2495.0,2465.0
130,2015/03/10,2610.0,2587.487,2560.0,2708600,2615.0,2540.0
131,2015/03/11,2660.0,2644.781,2600.0,2010400,2675.0,2590.0
132,2015/03/12,2660.0,2661.841,2680.0,1224200,2690.0,2640.0
133,2015/03/13,2715.0,2706.754,2710.0,1989800,2725.0,2680.0
134,2015/03/16,2710.0,2717.164,2710.0,1533200,2740.0,2700.0
135,2015/03/17,2715.0,2725.653,2740.0,821000,2740.0,2715.0
136,2015/03/18,2695.0,2687.878,2700.0,803000,2710.0,2665.0
137,2015/03/19,2720.0,2697.373,2700.0,1121600,2720.0,2665.0
138,2015/03/20,2710.0,2692.484,2710.0,714200,2715.0,2675.0
139,2015/03/23,2725.0,2711.72,2710.0,575800,2725.0,2695.0
140,2015/03/24,2685.0,2699.908,2710.0,609000,2725.0,2685.0
141,2015/03/25,2685.0,2675.531,2680.0,745800,2695.0,2660.0
142,2015/03/26,2655.0,2630.182,2640.0,972600,2665.0,2595.0
143,2015/03/27,2590.0,2604.047,2625.0,877800,2655.0,2565.0
144,2015/03/30,2525.0,2527.405,2565.0,1165800,2570.0,2510.0
145,2015/03/31,2535.0,2562.188,2550.0,1166600,2605.0,2535.0
146,2015/04/01,2520.0,2527.336,2535.0,830200,2575.0,2505.0
147,2015/04/02,2515.0,2521.446,2570.0,1011600,2575.0,2490.0
148,2015/04/03,2535.0,2523.317,2525.0,515800,2550.0,2500.0
149,2015/04/06,2525.0,2528.771,2520.0,452400,2545.0,2510.0
150,2015/04/07,2550.0,2558.809,2535.0,637400,2585.0,2535.0
151,2015/04/08,2590.0,2588.042,2590.0,770400,2600.0,2565.0
152,2015/04/09,2600.0,2602.806,2620.0,643600,2625.0,2585.0
153,2015/04/10,2580.0,2586.859,2595.0,592800,2600.0,2575.0
154,2015/04/13,2590.0,2588.357,2590.0,725600,2610.0,2570.0
155,2015/04/14,2600.0,2592.838,2595.0,395000,2605.0,2585.0
156,2015/04/15,2605.0,2594.647,2605.0,702800,2610.0,2570.0
157,2015/04/16,2665.0,2649.577,2615.0,1154000,2670.0,2605.0
158,2015/04/17,2630.0,2642.598,2650.0,711800,2665.0,2625.0
159,2015/04/20,2610.0,2611.016,2615.0,594600,2640.0,2585.0
160,2015/04/21,2585.0,2584.565,2605.0,475800,2610.0,2575.0
161,2015/04/22,2600.0,2600.021,2595.0,535800,2620.0,2585.0
162,2015/04/23,2625.0,2636.404,2620.0,749400,2665.0,2610.0
163,2015/04/24,2650.0,2654.808,2640.0,1046400,2670.0,2625.0
164,2015/04/27,2660.0,2655.331,2650.0,444000,2665.0,2645.0
165,2015/04/28,2695.0,2693.319,2680.0,796400,2705.0,2670.0
166,2015/04/30,2680.0,2692.942,2720.0,961200,2730.0,2660.0
167,2015/05/01,2645.0,2641.743,2670.0,709200,2695.0,2615.0
168,2015/05/07,2650.0,2652.724,2610.0,756800,2675.0,2610.0
169,2015/05/08,2720.0,2702.682,2670.0,1143800,2730.0,2665.0
170,2015/05/11,2745.0,2739.16,2735.0,1164200,2760.0,2710.0
171,2015/05/12,2940.0,2909.778,2875.0,3504200,2950.0,2850.0
172,2015/05/13,2945.0,2936.37,2910.0,1325800,2965.0,2910.0
173,2015/05/14,2915.0,2916.134,2920.0,655600,2945.0,2895.0
174,2015/05/15,2865.0,2872.315,2925.0,945000,2925.0,2855.0
175,2015/05/18,2905.0,2891.725,2870.0,681800,2910.0,2865.0
176,2015/05/19,2910.0,2911.421,2920.0,478000,2925.0,2895.0
177,2015/05/20,2885.0,2892.614,2910.0,517200,2910.0,2880.0
178,2015/05/21,2920.0,2938.345,2960.0,1060400,2980.0,2905.0
179,2015/05/22,2985.0,2982.243,2930.0,1674600,3005.0,2915.0
180,2015/05/25,3005.0,2996.601,3025.0,655400,3030.0,2975.0
181,2015/05/26,3045.0,3032.59,3010.0,839600,3055.0,2985.0
182,2015/05/27,3000.0,2994.991,2995.0,1057400,3010.0,2970.0
183,2015/05/28,2970.0,2976.942,3005.0,518600,3015.0,2955.0
184,2015/05/29,3025.0,3004.318,2970.0,854000,3035.0,2965.0
185,2015/06/01,3050.0,3054.236,3040.0,949200,3075.0,3035.0
186,2015/06/02,3085.0,3098.101,3070.0,1354800,3130.0,3055.0
187,2015/06/03,3040.0,3042.293,3045.0,762800,3070.0,3020.0
188,2015/06/04,3175.0,3165.395,3110.0,1722600,3200.0,3110.0
189,2015/06/05,3115.0,3126.764,3185.0,753400,3185.0,3100.0
190,2015/06/08,3105.0,3100.861,3120.0,498400,3125.0,3080.0
191,2015/06/09,3065.0,3090.099,3105.0,650600,3120.0,3060.0
192,2015/06/10,3125.0,3121.649,3075.0,1228600,3180.0,3045.0
193,2015/06/11,3205.0,3186.077,3170.0,1104800,3215.0,3155.0
194,2015/06/12,3140.0,3152.55,3175.0,946800,3180.0,3115.0
195,2015/06/15,3155.0,3145.747,3140.0,520600,3170.0,3120.0
196,2015/06/16,3130.0,3140.646,3195.0,584000,3195.0,3110.0
197,2015/06/17,3105.0,3108.656,3155.0,508800,3155.0,3090.0
198,2015/06/18,2985.0,3011.439,3085.0,1103800,3085.0,2975.0
199,2015/06/19,3090.0,3042.123,2980.0,1644000,3090.0,2935.0
200,2015/06/22,3080.0,3068.101,3070.0,384400,3085.0,3045.0
201,2015/06/23,3055.0,3055.558,3080.0,864000,3090.0,3030.0
202,2015/06/24,3035.0,3038.069,3045.0,650200,3065.0,3020.0
203,2015/06/25,3010.0,3015.59,3040.0,437600,3045.0,3000.0
204,2015/06/26,3025.0,3019.991,3015.0,444400,3040.0,2995.0
205,2015/06/29,2960.0,2963.425,2955.0,549800,2990.0,2945.0
206,2015/06/30,2965.0,2958.033,2975.0,726800,3000.0,2925.0
207,2015/07/01,2905.0,2924.815,2950.0,946600,2975.0,2885.0
208,2015/07/02,2905.0,2900.421,2935.0,883400,2940.0,2885.0
209,2015/07/03,2900.0,2889.856,2905.0,583400,2910.0,2860.0
210,2015/07/06,2840.0,2848.099,2860.0,865800,2885.0,2825.0
211,2015/07/07,2870.0,2876.074,2885.0,721000,2910.0,2860.0
212,2015/07/08,2795.0,2812.74,2860.0,1177200,2875.0,2790.0
213,2015/07/09,2820.0,2762.909,2760.0,1551400,2820.0,2690.0
214,2015/07/10,2785.0,2796.437,2820.0,1111400,2825.0,2775.0
215,2015/07/13,2805.0,2813.773,2800.0,392000,2830.0,2790.0
216,2015/07/14,2860.0,2876.329,2855.0,681000,2925.0,2850.0
217,2015/07/15,2820.0,2830.586,2875.0,532800,2885.0,2800.0
218,2015/07/16,2810.0,2813.115,2845.0,574600,2845.0,2800.0
219,2015/07/17,2805.0,2799.849,2825.0,607600,2830.0,2785.0
220,2015/07/21,2830.0,2836.487,2845.0,735400,2885.0,2805.0
221,2015/07/22,2845.0,2843.464,2810.0,705800,2865.0,2810.0
222,2015/07/23,2795.0,2799.062,2850.0,722600,2860.0,2780.0
223,2015/07/24,2810.0,2813.806,2795.0,1267400,2855.0,2760.0
224,2015/07/27,2820.0,2825.279,2805.0,797000,2855.0,2800.0
225,2015/07/28,2815.0,2800.873,2800.0,599000,2825.0,2765.0
226,2015/07/29,2735.0,2737.088,2805.0,1331800,2805.0,2700.0
227,2015/07/30,2775.0,2786.986,2740.0,997600,2815.0,2725.0
228,2015/07/31,2815.0,2789.922,2760.0,474600,2815.0,2745.0
229,2015/08/03,2775.0,2781.725,2815.0,620200,2815.0,2765.0
230,2015/08/04,2720.0,2717.312,2755.0,797800,2755.0,2690.0
231,2015/08/05,2710.0,2715.902,2715.0,674200,2750.0,2680.0
232,2015/08/06,2525.0,2508.193,2470.0,3584400,2555.0,2465.0
233,2015/08/07,2605.0,2594.086,2555.0,1732000,2615.0,2555.0
234,2015/08/10,2580.0,2559.791,2555.0,965800,2585.0,2520.0
235,2015/08/11,2600.0,2587.172,2580.0,1318000,2605.0,2565.0
236,2015/08/12,2595.0,2595.534,2615.0,1204400,2615.0,2575.0
237,2015/08/13,2630.0,2624.695,2600.0,928400,2645.0,2595.0
238,2015/08/14,2645.0,2630.451,2620.0,879000,2645.0,2605.0
239,2015/08/17,2615.0,2616.914,2665.0,502800,2665.0,2600.0
240,2015/08/18,2645.0,2645.575,2615.0,805800,2670.0,2605.0
241,2015/08/19,2615.0,2616.153,2635.0,455400,2640.0,2600.0
242,2015/08/20,2590.0,2580.571,2590.0,585200,2595.0,2555.0
243,2015/08/21,2535.0,2548.855,2535.0,935400,2575.0,2525.0
244,2015/08/24,2450.0,2468.439,2500.0,1338200,2530.0,2430.0
245,2015/08/25,2345.0,2384.124,2380.0,1828000,2460.0,2315.0
246,2015/08/26,2390.0,2360.709,2345.0,941400,2395.0,2315.0
247,2015/08/27,2365.0,2376.856,2425.0,1019000,2435.0,2350.0
248,2015/08/28,2485.0,2475.059,2420.0,1060200,2500.0,2410.0
249,2015/08/31,2420.0,2424.61,2460.0,900200,2470.0,2395.0
250,2015/09/01,2380.0,2375.248,2385.0,1100800,2400.0,2340.0
251,2015/09/02,2295.0,2313.234,2350.0,1625600,2360.0,2280.0
252,2015/09/03,2310.0,2332.366,2320.0,678400,2365.0,2305.0
253,2015/09/04,2300.0,2298.077,2325.0,868200,2325.0,2275.0
254,2015/09/07,2310.0,2303.834,2265.0,856000,2345.0,2260.0
255,2015/09/08,2345.0,2362.519,2315.0,848200,2415.0,2315.0
256,2015/09/09,2445.0,2431.979,2415.0,913000,2470.0,2395.0
257,2015/09/10,2410.0,2393.379,2375.0,517400,2420.0,2360.0
258,2015/09/11,2415.0,2392.662,2370.0,861000,2430.0,2370.0
259,2015/09/14,2375.0,2371.925,2405.0,578800,2410.0,2355.0
260,2015/09/15,2280.0,2276.053,2255.0,1761600,2300.0,2250.0
261,2015/09/16,2290.0,2288.571,2280.0,1090800,2315.0,2260.0
262,2015/09/17,2350.0,2346.94,2325.0,783200,2380.0,2320.0
263,2015/09/18,2305.0,2299.906,2315.0,766200,2320.0,2270.0
264,2015/09/24,2270.0,2269.125,2265.0,996600,2305.0,2250.0
265,2015/09/25,2270.0,2256.922,2255.0,1414000,2285.0,2235.0
266,2015/09/28,2250.0,2248.192,2245.0,710600,2265.0,2240.0
267,2015/09/29,2170.0,2177.292,2220.0,1394200,2220.0,2150.0
268,2015/09/30,2200.0,2207.74,2205.0,662000,2230.0,2185.0
269,2015/10/01,2270.0,2262.224,2240.0,802600,2290.0,2220.0
270,2015/10/02,2210.0,2211.651,2225.0,738000,2240.0,2175.0
271,2015/10/05,2310.0,2308.063,2245.0,703400,2345.0,2245.0
272,2015/10/06,2280.0,2318.762,2345.0,821800,2360.0,2270.0
273,2015/10/07,2425.0,2398.914,2310.0,1378600,2445.0,2310.0
274,2015/10/08,2460.0,2487.419,2430.0,1052400,2530.0,2430.0
275,2015/10/09,2535.0,2520.351,2475.0,749400,2550.0,2475.0
276,2015/10/13,2450.0,2455.57,2515.0,1035800,2525.0,2425.0
277,2015/10/14,2405.0,2408.978,2440.0,755400,2455.0,2385.0
278,2015/10/15,2440.0,2428.902,2400.0,576200,2440.0,2400.0
279,2015/10/16,2455.0,2456.531,2440.0,611000,2480.0,2440.0
280,2015/10/19,2420.0,2427.467,2460.0,523400,2465.0,2410.0
281,2015/10/20,2475.0,2460.266,2455.0,738000,2485.0,2425.0
282,2015/10/21,2550.0,2541.543,2480.0,700600,2565.0,2480.0
283,2015/10/22,2545.0,2546.389,2505.0,467400,2575.0,2505.0
284,2015/10/23,2605.0,2612.746,2615.0,755600,2625.0,2595.0
285,2015/10/26,2620.0,2617.83,2640.0,518400,2640.0,2605.0
286,2015/10/27,2590.0,2594.763,2635.0,830200,2635.0,2580.0
287,2015/10/28,2600.0,2595.912,2610.0,563800,2620.0,2575.0
288,2015/10/29,2640.0,2637.122,2635.0,971200,2670.0,2610.0
289,2015/10/30,2635.0,2635.745,2640.0,886400,2655.0,2615.0
290,2015/11/02,2590.0,2593.857,2600.0,794200,2620.0,2580.0
291,2015/11/04,2625.0,2638.362,2635.0,478600,2665.0,2615.0
292,2015/11/05,2630.0,2629.455,2620.0,427400,2645.0,2610.0
293,2015/11/06,2655.0,2649.991,2655.0,315600,2665.0,2630.0
294,2015/11/09,2665.0,2659.347,2645.0,682400,2670.0,2630.0
295,2015/11/10,2670.0,2648.075,2645.0,695000,2675.0,2615.0
296,2015/11/11,2855.0,2852.348,2825.0,2111400,2895.0,2820.0
297,2015/11/12,2830.0,2802.264,2825.0,1127800,2850.0,2740.0
298,2015/11/13,2860.0,2847.891,2815.0,1227800,2875.0,2805.0
299,2015/11/16,2830.0,2826.751,2800.0,619200,2850.0,2800.0
300,2015/11/17,2875.0,2886.425,2880.0,610800,2915.0,2875.0
301,2015/11/18,2875.0,2882.676,2900.0,600200,2910.0,2870.0
302,2015/11/19,2955.0,2952.549,2910.0,1215200,2980.0,2900.0
303,2015/11/20,2950.0,2937.003,2955.0,697600,2955.0,2915.0
304,2015/11/24,2995.0,2986.327,2980.0,746800,3010.0,2950.0
305,2015/11/25,2980.0,2981.172,2990.0,538400,3000.0,2965.0
306,2015/11/26,2980.0,2979.907,3000.0,503200,3000.0,2955.0
307,2015/11/27,2985.0,2988.986,2990.0,622200,3010.0,2955.0
308,2015/11/30,3035.0,3020.002,2970.0,982000,3035.0,2970.0
309,2015/12/01,3085.0,3069.299,3030.0,738600,3085.0,3025.0
310,2015/12/02,3080.0,3069.318,3085.0,634200,3085.0,3040.0
311,2015/12/03,3030.0,3036.513,3075.0,714600,3090.0,3000.0
312,2015/12/04,3025.0,3023.31,3000.0,1029400,3045.0,2985.0
313,2015/12/07,3030.0,3046.548,3075.0,489000,3090.0,3025.0
314,2015/12/08,2960.0,2945.065,3015.0,1159000,3030.0,2920.0
315,2015/12/09,2955.0,2962.5,2935.0,1131800,2990.0,2930.0
316,2015/12/10,2880.0,2889.234,2930.0,1116200,2935.0,2865.0
317,2015/12/11,2910.0,2866.056,2830.0,1326600,2920.0,2830.0
318,2015/12/14,2880.0,2865.957,2850.0,869200,2895.0,2820.0
319,2015/12/15,2850.0,2867.712,2895.0,694800,2915.0,2850.0
320,2015/12/16,2910.0,2909.284,2910.0,622800,2925.0,2880.0
321,2015/12/17,2925.0,2935.317,2960.0,838600,2970.0,2905.0
322,2015/12/18,2855.0,2886.831,2925.0,956800,2965.0,2850.0
323,2015/12/21,2810.0,2803.946,2820.0,1059600,2825.0,2785.0
324,2015/12/22,2830.0,2813.286,2790.0,1237600,2840.0,2770.0
325,2015/12/24,2835.0,2855.093,2845.0,580200,2890.0,2825.0
326,2015/12/25,2795.0,2800.566,2840.0,339400,2845.0,2780.0
327,2015/12/28,2885.0,2881.662,2815.0,505600,2910.0,2815.0
328,2015/12/29,2885.0,2871.689,2880.0,344600,2895.0,2835.0
329,2015/12/30,2895.0,2911.841,2920.0,478000,2960.0,2885.0
330,2016/01/04,2830.0,2842.477,2870.0,611800,2895.0,2815.0
331,2016/01/05,2825.0,2833.479,2795.0,533000,2865.0,2795.0
332,2016/01/06,2790.0,2791.97,2830.0,341200,2855.0,2760.0
333,2016/01/07,2720.0,2739.67,2755.0,647400,2780.0,2710.0
334,2016/01/08,2730.0,2727.89,2675.0,546800,2775.0,2675.0
335,2016/01/12,2675.0,2695.109,2695.0,958600,2750.0,2660.0
336,2016/01/13,2695.0,2690.015,2655.0,818600,2715.0,2650.0
337,2016/01/14,2620.0,2606.353,2610.0,939800,2630.0,2585.0
338,2016/01/15,2600.0,2612.728,2645.0,687000,2670.0,2585.0
339,2016/01/18,2595.0,2574.414,2560.0,701200,2600.0,2545.0
340,2016/01/19,2610.0,2597.396,2590.0,707200,2630.0,2565.0
341,2016/01/20,2510.0,2530.588,2595.0,820200,2600.0,2500.0
342,2016/01/21,2390.0,2461.111,2485.0,1337000,2530.0,2385.0
343,2016/01/22,2545.0,2517.177,2485.0,958400,2560.0,2465.0
344,2016/01/25,2565.0,2562.366,2575.0,604800,2590.0,2540.0
345,2016/01/26,2480.0,2490.175,2520.0,544200,2520.0,2465.0
346,2016/01/27,2570.0,2568.247,2555.0,642800,2595.0,2545.0
347,2016/01/28,2550.0,2557.156,2570.0,739400,2575.0,2525.0
348,2016/01/29,2635.0,2594.752,2550.0,999200,2650.0,2520.0
349,2016/02/01,2680.0,2662.318,2655.0,695800,2695.0,2620.0
350,2016/02/02,2635.0,2656.383,2680.0,561200,2700.0,2630.0
351,2016/02/03,2550.0,2547.019,2590.0,874000,2590.0,2525.0
352,2016/02/04,2525.0,2526.546,2500.0,742000,2560.0,2490.0
353,2016/02/05,2520.0,2495.613,2480.0,965800,2525.0,2460.0
354,2016/02/08,2515.0,2493.351,2470.0,1325800,2540.0,2430.0
355,2016/02/09,2355.0,2369.31,2410.0,1271800,2430.0,2320.0
356,2016/02/10,2190.0,2181.622,2245.0,4033400,2265.0,2145.0
357,2016/02/12,2125.0,2139.427,2135.0,2637200,2170.0,2110.0
358,2016/02/15,2260.0,2221.027,2170.0,1594000,2275.0,2150.0
359,2016/02/16,2205.0,2230.429,2225.0,2422800,2260.0,2200.0
360,2016/02/17,2175.0,2189.902,2185.0,1227400,2245.0,2150.0
361,2016/02/18,2170.0,2173.112,2200.0,1345600,2210.0,2155.0
362,2016/02/19,2140.0,2131.608,2160.0,1102200,2165.0,2095.0
363,2016/02/22,2130.0,2134.49,2135.0,751200,2160.0,2110.0
364,2016/02/23,2150.0,2170.815,2170.0,1233400,2215.0,2130.0
365,2016/02/24,2105.0,2127.645,2165.0,1353600,2180.0,2090.0
366,2016/02/25,2140.0,2133.54,2115.0,620400,2150.0,2115.0
367,2016/02/26,2180.0,2198.26,2170.0,944800,2220.0,2170.0
368,2016/02/29,2175.0,2201.096,2215.0,799400,2235.0,2175.0
369,2016/03/01,2185.0,2164.327,2170.0,1035000,2195.0,2125.0
370,2016/03/02,2275.0,2269.381,2225.0,920000,2295.0,2225.0
371,2016/03/03,2300.0,2283.938,2260.0,559200,2300.0,2255.0
372,2016/03/04,2390.0,2382.778,2380.0,958200,2400.0,2360.0
373,2016/03/07,2530.0,2523.741,2535.0,1780600,2575.0,2495.0
374,2016/03/08,2430.0,2463.181,2530.0,1766200,2540.0,2430.0
375,2016/03/09,2400.0,2393.071,2410.0,992600,2415.0,2375.0
376,2016/03/10,2465.0,2453.838,2405.0,1262600,2480.0,2405.0
377,2016/03/11,2500.0,2467.494,2450.0,1333400,2510.0,2430.0
378,2016/03/14,2515.0,2502.925,2490.0,842400,2525.0,2465.0
379,2016/03/15,2515.0,2510.579,2510.0,484200,2535.0,2485.0
380,2016/03/16,2435.0,2439.591,2465.0,659600,2470.0,2425.0
381,2016/03/17,2425.0,2440.747,2455.0,663800,2480.0,2405.0
382,2016/03/18,2460.0,2447.886,2430.0,702000,2475.0,2420.0
383,2016/03/22,2495.0,2492.079,2480.0,790200,2525.0,2465.0
384,2016/03/23,2475.0,2472.595,2485.0,468200,2500.0,2450.0
385,2016/03/24,2390.0,2406.395,2435.0,697000,2465.0,2380.0
386,2016/03/25,2365.0,2370.489,2400.0,966000,2400.0,2355.0
387,2016/03/28,2430.0,2422.263,2415.0,579800,2445.0,2400.0
388,2016/03/29,2425.0,2425.227,2410.0,375000,2445.0,2410.0
389,2016/03/30,2350.0,2357.163,2385.0,699000,2395.0,2345.0
390,2016/03/31,2350.0,2365.701,2360.0,551000,2390.0,2345.0
391,2016/04/01,2280.0,2298.534,2350.0,690000,2350.0,2275.0
392,2016/04/04,2295.0,2296.398,2280.0,501400,2335.0,2260.0
393,2016/04/05,2250.0,2257.145,2275.0,503200,2305.0,2240.0
394,2016/04/06,2290.0,2286.043,2290.0,712800,2305.0,2250.0
395,2016/04/07,2320.0,2305.386,2265.0,813600,2330.0,2235.0
396,2016/04/08,2365.0,2344.427,2290.0,1106800,2400.0,2270.0
397,2016/04/11,2410.0,2380.471,2390.0,737400,2420.0,2330.0
398,2016/04/12,2460.0,2448.328,2405.0,569200,2470.0,2395.0
399,2016/04/13,2525.0,2498.322,2480.0,857600,2535.0,2470.0
400,2016/04/14,2625.0,2604.342,2565.0,704400,2635.0,2560.0
401,2016/04/15,2585.0,2590.079,2605.0,587000,2635.0,2575.0
402,2016/04/18,2530.0,2525.453,2490.0,499200,2555.0,2490.0
403,2016/04/19,2615.0,2607.833,2615.0,413800,2635.0,2580.0
404,2016/04/20,2615.0,2628.712,2615.0,430800,2655.0,2610.0
405,2016/04/21,2665.0,2647.774,2660.0,455400,2670.0,2610.0
406,2016/04/22,2650.0,2618.999,2605.0,771400,2655.0,2590.0
407,2016/04/25,2635.0,2631.07,2655.0,664600,2675.0,2605.0
408,2016/04/26,2615.0,2614.477,2635.0,344200,2640.0,2590.0
409,2016/04/27,2640.0,2633.634,2620.0,428200,2650.0,2620.0
410,2016/04/28,2525.0,2580.242,2635.0,534200,2650.0,2520.0
411,2016/05/02,2415.0,2420.434,2455.0,553800,2465.0,2395.0
412,2016/05/06,2395.0,2392.458,2410.0,645800,2435.0,2365.0
413,2016/05/09,2400.0,2404.165,2410.0,476400,2425.0,2390.0
414,2016/05/10,2450.0,2433.663,2410.0,445000,2460.0,2380.0
415,2016/05/11,2480.0,2482.279,2450.0,487600,2515.0,2445.0
416,2016/05/12,2745.0,2710.905,2700.0,1319000,2755.0,2635.0
417,2016/05/13,2660.0,2666.279,2715.0,1055800,2715.0,2620.0
418,2016/05/16,2680.0,2680.908,2640.0,469200,2705.0,2630.0
419,2016/05/17,2735.0,2717.026,2700.0,454600,2735.0,2660.0
420,2016/05/18,2785.0,2762.047,2695.0,928000,2800.0,2690.0
421,2016/05/19,2760.0,2764.447,2810.0,547200,2820.0,2735.0
422,2016/05/20,2820.0,2798.928,2760.0,643800,2830.0,2755.0
423,2016/05/23,2795.0,2777.621,2780.0,598200,2810.0,2725.0
424,2016/05/24,2800.0,2800.69,2800.0,699000,2820.0,2770.0
425,2016/05/25,2770.0,2777.799,2830.0,718800,2835.0,2760.0
426,2016/05/26,2755.0,2765.845,2800.0,726000,2810.0,2740.0
427,2016/05/27,2775.0,2770.407,2760.0,223600,2780.0,2750.0
428,2016/05/30,2800.0,2793.956,2800.0,398400,2810.0,2775.0
429,2016/05/31,2840.0,2833.958,2800.0,398000,2850.0,2785.0
430,2016/06/01,2790.0,2800.364,2810.0,464200,2820.0,2775.0
431,2016/06/02,2680.0,2706.591,2770.0,852000,2770.0,2680.0
432,2016/06/03,2690.0,2676.445,2695.0,592000,2700.0,2650.0
433,2016/06/06,2695.0,2687.895,2695.0,463600,2705.0,2665.0
434,2016/06/07,2835.0,2820.619,2785.0,944800,2845.0,2785.0
435,2016/06/08,2840.0,2829.488,2850.0,496000,2850.0,2805.0
436,2016/06/09,2755.0,2770.098,2815.0,634200,2830.0,2740.0
437,2016/06/10,2755.0,2759.703,2775.0,703800,2775.0,2740.0
438,2016/06/13,2650.0,2672.969,2715.0,334800,2715.0,2650.0
439,2016/06/14,2650.0,2652.26,2700.0,551000,2710.0,2625.0
440,2016/06/15,2685.0,2680.583,2650.0,671000,2700.0,2640.0
441,2016/06/16,2570.0,2600.769,2635.0,951800,2670.0,2565.0
442,2016/06/17,2630.0,2646.594,2610.0,1390600,2695.0,2595.0
443,2016/06/20,2790.0,2778.794,2730.0,1212200,2825.0,2725.0
444,2016/06/21,2830.0,2819.361,2770.0,909000,2845.0,2765.0
445,2016/06/22,2835.0,2828.605,2835.0,634200,2855.0,2785.0
446,2016/06/23,2915.0,2894.058,2850.0,704000,2920.0,2820.0
447,2016/06/24,2725.0,2811.755,2945.0,1120200,2965.0,2715.0
448,2016/06/27,2750.0,2753.579,2755.0,847000,2790.0,2695.0
449,2016/06/28,2700.0,2694.733,2705.0,842600,2730.0,2625.0
450,2016/06/29,2750.0,2739.837,2745.0,895800,2770.0,2700.0
451,2016/06/30,2805.0,2808.935,2780.0,837400,2825.0,2780.0
452,2016/07/01,2815.0,2816.046,2795.0,477200,2840.0,2795.0
453,2016/07/04,2790.0,2778.96,2750.0,411400,2800.0,2740.0
454,2016/07/05,2720.0,2738.577,2745.0,606200,2775.0,2720.0
455,2016/07/06,2760.0,2730.557,2700.0,990400,2765.0,2685.0
456,2016/07/07,2820.0,2812.388,2770.0,862400,2840.0,2765.0
457,2016/07/08,2795.0,2806.681,2790.0,928600,2835.0,2785.0
458,2016/07/11,2855.0,2870.51,2860.0,635400,2900.0,2845.0
459,2016/07/12,2835.0,2858.753,2890.0,1031400,2910.0,2830.0
460,2016/07/13,2850.0,2857.009,2885.0,688000,2890.0,2835.0
461,2016/07/14,2870.0,2841.74,2840.0,856000,2875.0,2800.0
462,2016/07/15,2890.0,2892.516,2880.0,703200,2920.0,2860.0
463,2016/07/19,2885.0,2878.31,2900.0,582600,2900.0,2855.0
464,2016/07/20,2870.0,2853.082,2885.0,474800,2885.0,2825.0
465,2016/07/21,2900.0,2898.488,2890.0,523600,2910.0,2880.0
466,2016/07/22,2860.0,2856.187,2835.0,349600,2875.0,2835.0
467,2016/07/25,2840.0,2855.83,2870.0,466600,2870.0,2835.0
468,2016/07/26,2810.0,2805.271,2820.0,491200,2830.0,2785.0
469,2016/07/27,2805.0,2817.923,2830.0,703800,2855.0,2785.0
470,2016/07/28,2825.0,2812.991,2785.0,487800,2835.0,2770.0
471,2016/07/29,2810.0,2802.53,2815.0,788200,2840.0,2760.0
472,2016/08/01,2760.0,2765.208,2770.0,572400,2795.0,2730.0
473,2016/08/02,2715.0,2733.904,2725.0,416800,2765.0,2710.0
474,2016/08/03,2655.0,2660.811,2640.0,653800,2685.0,2640.0
475,2016/08/04,2680.0,2674.557,2670.0,548400,2695.0,2645.0
476,2016/08/05,2585.0,2661.045,2750.0,1237000,2790.0,2575.0
477,2016/08/08,2680.0,2666.015,2630.0,786200,2690.0,2610.0
478,2016/08/09,2780.0,2760.377,2700.0,655200,2785.0,2690.0
479,2016/08/10,2800.0,2797.603,2780.0,537200,2825.0,2775.0
480,2016/08/12,2810.0,2811.733,2825.0,405800,2835.0,2795.0
481,2016/08/15,2780.0,2787.419,2810.0,514400,2810.0,2775.0
482,2016/08/16,2755.0,2784.304,2795.0,567600,2825.0,2755.0
483,2016/08/17,2700.0,2707.01,2735.0,727400,2750.0,2680.0
484,2016/08/18,2635.0,2649.723,2665.0,574000,2665.0,2630.0
485,2016/08/19,2675.0,2674.95,2675.0,454400,2700.0,2655.0
486,2016/08/22,2680.0,2683.307,2685.0,348400,2705.0,2670.0
487,2016/08/23,2600.0,2612.242,2655.0,576000,2655.0,2580.0
488,2016/08/24,2660.0,2658.415,2610.0,526200,2670.0,2610.0
489,2016/08/25,2615.0,2606.497,2620.0,587400,2635.0,2590.0
490,2016/08/26,2595.0,2597.165,2615.0,481400,2620.0,2575.0
491,2016/08/29,2680.0,2675.4,2675.0,339800,2685.0,2660.0
492,2016/08/30,2625.0,2627.449,2665.0,408400,2670.0,2610.0
493,2016/08/31,2660.0,2650.912,2620.0,398200,2670.0,2615.0
494,2016/09/01,2665.0,2645.02,2630.0,549800,2670.0,2615.0
495,2016/09/02,2770.0,2742.85,2700.0,928000,2780.0,2690.0
496,2016/09/05,2850.0,2859.911,2845.0,876200,2885.0,2840.0
497,2016/09/06,2855.0,2858.659,2830.0,572000,2885.0,2830.0
498,2016/09/07,2860.0,2853.098,2810.0,516800,2870.0,2805.0
499,2016/09/08,2840.0,2852.335,2845.0,598000,2885.0,2830.0
500,2016/09/09,2860.0,2876.506,2890.0,773600,2905.0,2850.0
501,2016/09/12,2785.0,2792.884,2830.0,581600,2830.0,2770.0
502,2016/09/13,2835.0,2831.12,2835.0,487400,2855.0,2805.0
503,2016/09/14,2820.0,2834.672,2820.0,371600,2860.0,2810.0
504,2016/09/15,2785.0,2783.892,2785.0,442000,2805.0,2760.0
505,2016/09/16,2795.0,2798.391,2815.0,298200,2815.0,2790.0
506,2016/09/20,2770.0,2746.206,2745.0,773600,2775.0,2700.0
507,2016/09/21,2900.0,2851.886,2775.0,903600,2905.0,2770.0
508,2016/09/23,2890.0,2896.175,2900.0,440000,2920.0,2880.0
509,2016/09/26,2885.0,2893.807,2890.0,555800,2920.0,2870.0
510,2016/09/27,2910.0,2875.12,2855.0,543400,2910.0,2825.0
511,2016/09/28,2871.0,2882.247,2920.0,591100,2920.0,2861.0
512,2016/09/29,3015.0,2997.901,2920.0,1048500,3025.0,2902.0
513,2016/09/30,2973.0,2968.686,2947.0,872100,2997.0,2928.0
514,2016/10/03,2972.0,2959.243,2985.0,926100,2995.0,2923.0
515,2016/10/04,3090.0,3079.371,3015.0,1553800,3125.0,3015.0
516,2016/10/05,3085.0,3077.275,3090.0,649700,3095.0,3050.0
517,2016/10/06,3135.0,3123.849,3095.0,776100,3150.0,3075.0
518,2016/10/07,3145.0,3142.29,3140.0,538300,3155.0,3120.0
519,2016/10/11,3195.0,3205.741,3135.0,997600,3245.0,3135.0
520,2016/10/12,3120.0,3130.205,3175.0,817900,3175.0,3105.0
521,2016/10/13,3140.0,3140.647,3140.0,698700,3160.0,3115.0
522,2016/10/14,3100.0,3085.886,3120.0,1086500,3120.0,3035.0
523,2016/10/17,3125.0,3113.832,3100.0,519000,3135.0,3085.0
524,2016/10/18,3180.0,3173.381,3150.0,675900,3200.0,3130.0
525,2016/10/19,3160.0,3164.593,3175.0,531900,3185.0,3150.0
526,2016/10/20,3175.0,3170.535,3180.0,807500,3185.0,3130.0
527,2016/10/21,3190.0,3193.332,3170.0,984000,3215.0,3130.0
528,2016/10/24,3190.0,3170.027,3180.0,576400,3190.0,3130.0
529,2016/10/25,3195.0,3199.695,3200.0,917200,3230.0,3180.0
530,2016/10/26,3135.0,3137.705,3150.0,1124800,3175.0,3120.0
531,2016/10/27,3130.0,3134.371,3140.0,621300,3150.0,3120.0
532,2016/10/28,3110.0,3116.146,3140.0,1064300,3160.0,3095.0
533,2016/10/31,3120.0,3127.87,3095.0,1144800,3150.0,3090.0
534,2016/11/01,3130.0,3122.886,3090.0,1047200,3145.0,3090.0
535,2016/11/02,3050.0,3056.103,3050.0,983200,3080.0,3015.0
536,2016/11/04,3015.0,3012.895,3010.0,631800,3045.0,2998.0
537,2016/11/07,3050.0,3051.346,3055.0,650700,3090.0,3040.0
538,2016/11/08,2985.0,2997.708,3050.0,929100,3070.0,2978.0
539,2016/11/09,2868.0,2916.935,3040.0,1709400,3075.0,2806.0
540,2016/11/10,3060.0,3062.381,3125.0,999900,3125.0,3020.0
541,2016/11/11,2938.0,2934.338,2840.0,1983900,3035.0,2834.0
542,2016/11/14,3010.0,3045.009,3080.0,1661400,3130.0,3000.0
543,2016/11/15,2942.0,2974.188,3000.0,1670200,3015.0,2934.0
544,2016/11/16,3010.0,2997.584,2990.0,1279500,3040.0,2963.0
545,2016/11/17,3025.0,3027.495,3055.0,904500,3070.0,2999.0
546,2016/11/18,3070.0,3071.86,3060.0,1000600,3090.0,3025.0
547,2016/11/21,3050.0,3065.564,3125.0,577200,3135.0,3045.0
548,2016/11/22,3060.0,3054.926,3095.0,752700,3095.0,3035.0
549,2016/11/24,3090.0,3088.849,3085.0,638600,3115.0,3045.0
550,2016/11/25,3095.0,3113.82,3105.0,799900,3145.0,3075.0
551,2016/11/28,3055.0,3051.736,3060.0,800500,3065.0,3020.0
552,2016/11/29,3000.0,3002.421,3025.0,894100,3030.0,2996.0
553,2016/11/30,2974.0,2970.418,2990.0,1317900,2990.0,2933.0
554,2016/12/01,3070.0,3069.448,3035.0,1280900,3095.0,3025.0
555,2016/12/02,3080.0,3108.999,3105.0,1301200,3175.0,3075.0
556,2016/12/05,3090.0,3071.942,3070.0,712000,3095.0,3040.0
557,2016/12/06,3085.0,3095.811,3110.0,851800,3125.0,3080.0
558,2016/12/07,3085.0,3081.467,3085.0,752400,3100.0,3050.0
559,2016/12/08,3170.0,3134.908,3115.0,1039600,3175.0,3095.0
560,2016/12/09,3175.0,3162.918,3100.0,1325900,3215.0,3100.0
561,2016/12/12,3195.0,3198.354,3210.0,1008800,3230.0,3175.0
562,2016/12/13,3175.0,3169.474,3200.0,509000,3210.0,3140.0
563,2016/12/14,3180.0,3179.083,3185.0,550700,3195.0,3160.0
564,2016/12/15,3155.0,3165.029,3190.0,628000,3200.0,3145.0
565,2016/12/16,3215.0,3211.302,3180.0,810200,3225.0,3170.0
566,2016/12/19,3205.0,3193.853,3205.0,459200,3210.0,3165.0
567,2016/12/20,3220.0,3209.844,3220.0,508900,3235.0,3185.0
568,2016/12/21,3260.0,3275.403,3245.0,1202200,3305.0,3240.0
569,2016/12/22,3270.0,3266.008,3260.0,809800,3285.0,3230.0
570,2016/12/26,3300.0,3321.582,3340.0,698100,3360.0,3295.0
571,2016/12/27,3275.0,3281.22,3260.0,551700,3305.0,3240.0
572,2016/12/28,3355.0,3354.28,3340.0,940700,3380.0,3310.0
573,2016/12/29,3295.0,3305.88,3325.0,1083600,3355.0,3275.0
574,2016/12/30,3330.0,3317.714,3290.0,674200,3350.0,3275.0
575,2017/01/04,3405.0,3379.628,3320.0,793800,3410.0,3310.0
576,2017/01/05,3370.0,3362.993,3395.0,780900,3405.0,3345.0
577,2017/01/06,3280.0,3268.645,3320.0,1446000,3320.0,3225.0
578,2017/01/10,3290.0,3282.203,3285.0,762300,3305.0,3260.0
579,2017/01/11,3355.0,3359.077,3315.0,780700,3390.0,3315.0
580,2017/01/12,3325.0,3334.583,3365.0,591500,3380.0,3310.0
581,2017/01/13,3340.0,3329.143,3310.0,639700,3345.0,3305.0
582,2017/01/16,3360.0,3352.606,3335.0,859500,3375.0,3325.0
583,2017/01/17,3270.0,3285.465,3340.0,838800,3345.0,3260.0
584,2017/01/18,3275.0,3254.101,3240.0,488100,3285.0,3215.0
585,2017/01/19,3325.0,3319.705,3305.0,545200,3335.0,3295.0
586,2017/01/20,3440.0,3416.18,3350.0,1139400,3455.0,3340.0
587,2017/01/23,3455.0,3465.82,3450.0,1053300,3510.0,3425.0
588,2017/01/24,3430.0,3434.916,3450.0,699000,3460.0,3415.0
589,2017/01/25,3465.0,3466.977,3490.0,664100,3505.0,3440.0
590,2017/01/26,3570.0,3541.54,3510.0,1354300,3570.0,3495.0
591,2017/01/27,3575.0,3578.36,3605.0,855600,3620.0,3560.0
592,2017/01/30,3565.0,3547.597,3540.0,1041700,3570.0,3500.0
593,2017/01/31,3490.0,3490.709,3510.0,855000,3540.0,3455.0
594,2017/02/01,3500.0,3474.134,3450.0,666800,3510.0,3410.0
595,2017/02/02,3480.0,3495.746,3530.0,701100,3530.0,3470.0
596,2017/02/03,3475.0,3480.945,3480.0,663800,3500.0,3450.0
597,2017/02/06,3510.0,3499.137,3525.0,605500,3525.0,3480.0
598,2017/02/07,3485.0,3473.444,3470.0,665900,3505.0,3425.0
599,2017/02/08,3455.0,3419.411,3415.0,1039000,3475.0,3370.0
600,2017/02/09,3195.0,3154.528,3050.0,3661600,3215.0,3040.0
601,2017/02/10,3345.0,3318.603,3245.0,1939900,3355.0,3240.0
602,2017/02/13,3300.0,3306.944,3315.0,1102600,3330.0,3275.0
603,2017/02/14,3310.0,3347.03,3350.0,924000,3390.0,3310.0
604,2017/02/15,3385.0,3363.635,3375.0,836900,3385.0,3315.0
605,2017/02/16,3400.0,3402.887,3385.0,635300,3435.0,3375.0
606,2017/02/17,3410.0,3389.123,3360.0,723500,3420.0,3330.0
607,2017/02/20,3365.0,3355.465,3365.0,533000,3390.0,3305.0
608,2017/02/21,3340.0,3343.531,3375.0,612100,3375.0,3325.0
609,2017/02/22,3330.0,3327.495,3335.0,604400,3345.0,3305.0
610,2017/02/23,3380.0,3363.296,3350.0,717600,3390.0,3320.0
611,2017/02/24,3345.0,3341.305,3350.0,685600,3360.0,3310.0
612,2017/02/27,3320.0,3300.039,3300.0,651200,3320.0,3265.0
613,2017/02/28,3310.0,3322.801,3340.0,634000,3360.0,3305.0
614,2017/03/01,3345.0,3331.697,3310.0,523800,3355.0,3285.0
615,2017/03/02,3440.0,3425.153,3385.0,1145700,3450.0,3355.0
616,2017/03/03,3410.0,3402.097,3400.0,697800,3425.0,3385.0
617,2017/03/06,3475.0,3455.404,3375.0,890400,3485.0,3375.0
618,2017/03/07,3580.0,3554.768,3485.0,1110200,3595.0,3470.0
619,2017/03/08,3520.0,3516.236,3550.0,949400,3550.0,3480.0
620,2017/03/09,3510.0,3512.638,3535.0,793100,3535.0,3500.0
621,2017/03/10,3575.0,3547.59,3510.0,906300,3590.0,3510.0
622,2017/03/13,3535.0,3537.886,3550.0,372000,3575.0,3525.0
623,2017/03/14,3500.0,3496.097,3505.0,663200,3510.0,3470.0
624,2017/03/15,3475.0,3465.368,3450.0,437400,3485.0,3425.0
625,2017/03/16,3510.0,3495.908,3455.0,476600,3510.0,3455.0
626,2017/03/17,3550.0,3540.421,3495.0,1059200,3560.0,3485.0
627,2017/03/21,3580.0,3592.697,3595.0,741400,3640.0,3565.0
628,2017/03/22,3515.0,3517.789,3500.0,553500,3535.0,3495.0
629,2017/03/23,3475.0,3480.242,3535.0,701100,3535.0,3455.0
630,2017/03/24,3510.0,3511.038,3475.0,384100,3540.0,3470.0
631,2017/03/27,3395.0,3408.576,3440.0,752600,3460.0,3390.0
632,2017/03/28,3515.0,3487.18,3435.0,1313500,3535.0,3430.0
633,2017/03/29,3600.0,3589.391,3590.0,787600,3600.0,3565.0
634,2017/03/30,3610.0,3626.316,3580.0,906000,3665.0,3565.0
635,2017/03/31,3635.0,3659.336,3670.0,1222300,3700.0,3630.0
636,2017/04/03,3585.0,3566.933,3630.0,1045800,3630.0,3525.0
637,2017/04/04,3510.0,3515.84,3515.0,1002800,3545.0,3495.0
638,2017/04/05,3480.0,3476.749,3535.0,974400,3545.0,3440.0
639,2017/04/06,3360.0,3382.945,3450.0,1084400,3460.0,3350.0
640,2017/04/07,3380.0,3385.705,3390.0,1069400,3410.0,3350.0
641,2017/04/10,3460.0,3440.552,3390.0,841200,3465.0,3385.0
642,2017/04/11,3370.0,3373.324,3405.0,823200,3435.0,3345.0
643,2017/04/12,3255.0,3257.575,3300.0,1662100,3310.0,3230.0
644,2017/04/13,3230.0,3198.933,3130.0,1120500,3240.0,3130.0
645,2017/04/14,3180.0,3192.597,3220.0,747700,3220.0,3165.0
646,2017/04/17,3195.0,3184.72,3185.0,537500,3205.0,3160.0
647,2017/04/18,3210.0,3214.351,3225.0,827000,3245.0,3185.0
648,2017/04/19,3190.0,3184.284,3170.0,813900,3210.0,3160.0
649,2017/04/20,3190.0,3181.138,3160.0,1012700,3195.0,3150.0
650,2017/04/21,3235.0,3214.808,3230.0,972600,3235.0,3180.0
651,2017/04/24,3245.0,3261.859,3300.0,513600,3315.0,3240.0
652,2017/04/25,3290.0,3279.655,3250.0,614000,3295.0,3230.0
653,2017/04/26,3355.0,3348.085,3330.0,768200,3360.0,3315.0
654,2017/04/27,3390.0,3384.528,3340.0,671200,3410.0,3330.0
655,2017/04/28,3395.0,3385.126,3380.0,695900,3405.0,3355.0
656,2017/05/01,3405.0,3387.298,3385.0,543300,3415.0,3345.0
657,2017/05/02,3420.0,3426.104,3425.0,529600,3455.0,3410.0
658,2017/05/08,3450.0,3454.205,3485.0,737100,3495.0,3435.0
659,2017/05/09,3425.0,3424.203,3440.0,599000,3450.0,3400.0
660,2017/05/10,3430.0,3425.644,3425.0,544700,3450.0,3405.0
661,2017/05/11,3440.0,3445.858,3410.0,571500,3475.0,3410.0
662,2017/05/12,3270.0,3274.342,3300.0,1650500,3320.0,3245.0
663,2017/05/15,3155.0,3157.473,3200.0,1620600,3200.0,3135.0
664,2017/05/16,3170.0,3153.398,3160.0,973200,3175.0,3115.0
665,2017/05/17,3065.0,3089.684,3140.0,1036500,3140.0,3065.0
666,2017/05/18,3050.0,3029.213,3020.0,878200,3050.0,3000.0
667,2017/05/19,3065.0,3058.076,3065.0,648500,3075.0,3035.0
668,2017/05/22,3065.0,3065.307,3095.0,892300,3100.0,3050.0
669,2017/05/23,3045.0,3051.429,3050.0,515200,3065.0,3035.0
670,2017/05/24,3110.0,3092.565,3080.0,705100,3110.0,3055.0
671,2017/05/25,3165.0,3150.094,3120.0,868900,3170.0,3110.0
672,2017/05/26,3110.0,3121.699,3175.0,643100,3175.0,3105.0
673,2017/05/29,3110.0,3115.247,3110.0,529300,3140.0,3085.0
674,2017/05/30,3120.0,3111.828,3110.0,444400,3130.0,3090.0
675,2017/05/31,3135.0,3128.471,3120.0,679100,3145.0,3105.0
676,2017/06/01,3150.0,3152.095,3135.0,547300,3175.0,3125.0
677,2017/06/02,3205.0,3212.122,3170.0,943600,3250.0,3170.0
678,2017/06/05,3160.0,3158.722,3180.0,581500,3205.0,3135.0
679,2017/06/06,3050.0,3073.507,3100.0,909400,3110.0,3045.0
680,2017/06/07,3055.0,3056.596,3050.0,831600,3075.0,3045.0
681,2017/06/08,3100.0,3099.937,3100.0,624900,3115.0,3080.0
682,2017/06/09,3085.0,3087.528,3095.0,889500,3110.0,3070.0
683,2017/06/12,3115.0,3113.04,3100.0,726100,3140.0,3090.0
684,2017/06/13,3100.0,3107.931,3125.0,748800,3140.0,3085.0
685,2017/06/14,3055.0,3062.914,3105.0,582100,3115.0,3045.0
686,2017/06/15,3010.0,3011.355,3040.0,885300,3065.0,2991.0
687,2017/06/16,3035.0,3029.608,3035.0,774700,3045.0,3010.0
688,2017/06/19,3085.0,3079.052,3060.0,848800,3100.0,3050.0
689,2017/06/20,3115.0,3117.791,3105.0,509000,3135.0,3105.0
690,2017/06/21,3060.0,3070.461,3095.0,646300,3105.0,3050.0
691,2017/06/22,3030.0,3032.929,3045.0,697800,3050.0,3020.0
692,2017/06/23,2993.0,2989.863,3025.0,1473300,3035.0,2964.0
693,2017/06/26,3010.0,3004.764,2996.0,431600,3015.0,2991.0
694,2017/06/27,3070.0,3062.752,3045.0,613000,3085.0,3025.0
695,2017/06/28,3065.0,3067.476,3070.0,383500,3085.0,3050.0
696,2017/06/29,3065.0,3069.612,3080.0,550700,3100.0,3055.0
697,2017/06/30,3110.0,3080.839,3055.0,925600,3110.0,3045.0
698,2017/07/03,3165.0,3162.189,3150.0,838700,3185.0,3130.0
699,2017/07/04,3190.0,3193.343,3205.0,826100,3220.0,3170.0
700,2017/07/05,3225.0,3209.353,3190.0,590300,3230.0,3185.0
701,2017/07/06,3240.0,3258.046,3235.0,1078100,3285.0,3225.0
702,2017/07/07,3235.0,3232.43,3220.0,857100,3260.0,3200.0
703,2017/07/10,3260.0,3259.494,3270.0,824500,3285.0,3245.0
704,2017/07/11,3325.0,3316.405,3260.0,1149200,3350.0,3260.0
705,2017/07/12,3330.0,3335.098,3355.0,726600,3365.0,3320.0
706,2017/07/13,3355.0,3352.779,3340.0,794100,3380.0,3330.0
707,2017/07/14,3380.0,3381.525,3395.0,834500,3435.0,3365.0
708,2017/07/18,3325.0,3328.593,3340.0,641100,3355.0,3310.0
709,2017/07/19,3300.0,3287.571,3290.0,674100,3305.0,3260.0
710,2017/07/20,3315.0,3298.666,3310.0,543300,3320.0,3270.0
711,2017/07/21,3255.0,3254.53,3295.0,836500,3310.0,3230.0
712,2017/07/24,3215.0,3209.544,3220.0,895600,3240.0,3190.0
713,2017/07/25,3235.0,3232.401,3230.0,498100,3255.0,3220.0
714,2017/07/26,3295.0,3298.509,3280.0,683500,3325.0,3270.0
715,2017/07/27,3285.0,3281.585,3270.0,397800,3300.0,3255.0
716,2017/07/28,3270.0,3276.931,3280.0,542600,3305.0,3260.0
717,2017/07/31,3235.0,3243.573,3270.0,599000,3275.0,3230.0
718,2017/08/01,3240.0,3248.932,3255.0,450700,3275.0,3235.0
719,2017/08/02,3280.0,3268.486,3250.0,372300,3290.0,3230.0
720,2017/08/03,3275.0,3266.926,3260.0,402600,3285.0,3240.0
721,2017/08/04,3290.0,3280.838,3270.0,300900,3300.0,3240.0
722,2017/08/07,3365.0,3344.452,3305.0,440500,3370.0,3300.0
723,2017/08/08,3390.0,3384.854,3365.0,655800,3420.0,3360.0
724,2017/08/09,3490.0,3539.377,3640.0,2301700,3650.0,3480.0
725,2017/08/10,3400.0,3413.137,3465.0,885600,3465.0,3385.0
726,2017/08/14,3290.0,3303.072,3330.0,801500,3330.0,3280.0
727,2017/08/15,3305.0,3294.269,3300.0,808400,3315.0,3260.0
728,2017/08/16,3290.0,3285.45,3290.0,447200,3300.0,3265.0
729,2017/08/17,3295.0,3293.824,3280.0,410300,3310.0,3280.0
730,2017/08/18,3250.0,3250.263,3255.0,473400,3265.0,3230.0
731,2017/08/21,3255.0,3251.099,3240.0,374900,3275.0,3225.0
732,2017/08/22,3315.0,3290.197,3240.0,482000,3315.0,3240.0
733,2017/08/23,3395.0,3411.153,3370.0,863300,3465.0,3350.0
734,2017/08/24,3400.0,3399.561,3375.0,442600,3430.0,3370.0
735,2017/08/25,3425.0,3416.91,3425.0,350200,3435.0,3380.0
736,2017/08/28,3425.0,3441.458,3470.0,354600,3500.0,3410.0
737,2017/08/29,3385.0,3380.124,3400.0,410800,3400.0,3370.0
738,2017/08/30,3400.0,3390.389,3390.0,382100,3410.0,3375.0
739,2017/08/31,3405.0,3409.114,3430.0,373600,3440.0,3390.0
740,2017/09/01,3450.0,3434.195,3430.0,452200,3450.0,3390.0
741,2017/09/04,3450.0,3445.694,3440.0,348500,3465.0,3425.0
742,2017/09/05,3475.0,3495.516,3500.0,844500,3565.0,3455.0
743,2017/09/06,3455.0,3460.986,3450.0,492400,3505.0,3440.0
744,2017/09/07,3490.0,3480.822,3470.0,528400,3505.0,3440.0
745,2017/09/08,3425.0,3438.595,3465.0,758700,3485.0,3405.0
746,2017/09/11,3505.0,3496.8,3470.0,411400,3510.0,3460.0
747,2017/09/12,3565.0,3559.366,3565.0,617800,3575.0,3540.0
748,2017/09/13,3610.0,3623.281,3625.0,626700,3650.0,3600.0
749,2017/09/14,3575.0,3582.156,3600.0,423300,3615.0,3565.0
750,2017/09/15,3610.0,3598.32,3560.0,423800,3615.0,3550.0
751,2017/09/19,3655.0,3648.889,3650.0,494600,3665.0,3630.0
752,2017/09/20,3740.0,3724.579,3700.0,951900,3745.0,3690.0
753,2017/09/21,3770.0,3793.342,3765.0,1046600,3860.0,3745.0
754,2017/09/22,3720.0,3725.384,3790.0,751900,3790.0,3700.0
755,2017/09/25,3775.0,3765.684,3725.0,683500,3785.0,3725.0
756,2017/09/26,3760.0,3757.675,3765.0,548700,3780.0,3740.0
757,2017/09/27,3725.0,3725.275,3745.0,501800,3770.0,3700.0
758,2017/09/28,3755.0,3747.121,3740.0,424800,3770.0,3725.0
759,2017/09/29,3735.0,3732.551,3735.0,642000,3755.0,3710.0
760,2017/10/02,3785.0,3775.445,3750.0,355300,3800.0,3735.0
761,2017/10/03,3800.0,3792.212,3785.0,450000,3825.0,3765.0
762,2017/10/04,3795.0,3802.723,3825.0,385100,3830.0,3790.0
763,2017/10/05,3775.0,3776.93,3765.0,363000,3795.0,3750.0
764,2017/10/06,3780.0,3779.01,3775.0,339800,3810.0,3760.0
765,2017/10/10,3725.0,3734.121,3760.0,538700,3760.0,3715.0
766,2017/10/11,3730.0,3716.993,3710.0,436600,3735.0,3685.0
767,2017/10/12,3815.0,3801.776,3740.0,677200,3835.0,3735.0
768,2017/10/13,3870.0,3841.013,3810.0,736600,3880.0,3775.0
769,2017/10/16,3875.0,3884.59,3915.0,394000,3925.0,3865.0
770,2017/10/17,3855.0,3863.832,3900.0,426600,3900.0,3845.0
771,2017/10/18,3810.0,3816.442,3855.0,427000,3855.0,3800.0
772,2017/10/19,3845.0,3865.022,3880.0,525800,3920.0,3835.0
773,2017/10/20,3910.0,3914.245,3880.0,910100,3975.0,3880.0
774,2017/10/23,3970.0,3966.804,3965.0,519000,3980.0,3950.0
775,2017/10/24,4010.0,3983.414,3955.0,529600,4010.0,3935.0
776,2017/10/25,3985.0,4015.305,4050.0,491900,4070.0,3975.0
777,2017/10/26,3970.0,3972.335,3965.0,293400,3995.0,3960.0
778,2017/10/27,4085.0,4063.044,4040.0,651500,4090.0,4025.0
779,2017/10/30,4110.0,4115.461,4140.0,1244000,4150.0,4105.0
780,2017/10/31,4060.0,4068.406,4040.0,500200,4100.0,4040.0
781,2017/11/01,4150.0,4121.147,4095.0,575000,4150.0,4075.0
782,2017/11/02,4145.0,4175.243,4210.0,555200,4225.0,4135.0
783,2017/11/06,4210.0,4200.947,4200.0,544900,4240.0,4180.0
784,2017/11/07,4300.0,4259.47,4200.0,478800,4300.0,4195.0
785,2017/11/08,4210.0,4228.769,4255.0,530500,4260.0,4205.0
786,2017/11/09,4150.0,4201.305,4210.0,847800,4270.0,4100.0
787,2017/11/10,4060.0,4074.773,4075.0,1076300,4130.0,4030.0
788,2017/11/13,4070.0,4092.086,4090.0,569200,4125.0,4055.0
789,2017/11/14,4410.0,4387.762,4230.0,1789300,4460.0,4225.0
790,2017/11/15,4365.0,4386.827,4375.0,891800,4465.0,4325.0
791,2017/11/16,4485.0,4439.612,4360.0,914600,4500.0,4315.0
792,2017/11/17,4590.0,4594.087,4525.0,1328500,4660.0,4520.0
793,2017/11/20,4485.0,4525.263,4565.0,1039700,4635.0,4460.0
794,2017/11/21,4625.0,4605.579,4555.0,759900,4635.0,4525.0
795,2017/11/22,4705.0,4694.695,4650.0,644900,4725.0,4640.0
796,2017/11/24,4645.0,4654.352,4690.0,497800,4690.0,4635.0
797,2017/11/27,4545.0,4531.826,4555.0,1072600,4565.0,4485.0
798,2017/11/28,4400.0,4371.578,4450.0,1547500,4455.0,4305.0
799,2017/11/29,4385.0,4406.867,4480.0,845600,4490.0,4360.0
800,2017/11/30,4385.0,4374.27,4365.0,828900,4400.0,4345.0
801,2017/12/01,4350.0,4351.074,4375.0,816700,4390.0,4320.0
802,2017/12/04,4295.0,4306.372,4330.0,865600,4345.0,4290.0
803,2017/12/05,4250.0,4255.577,4255.0,548100,4280.0,4240.0
804,2017/12/06,4110.0,4152.203,4220.0,1028400,4230.0,4105.0
805,2017/12/07,4245.0,4241.447,4235.0,1045500,4290.0,4210.0
806,2017/12/08,4300.0,4302.993,4300.0,955800,4365.0,4265.0
807,2017/12/11,4290.0,4277.424,4330.0,521000,4330.0,4250.0
808,2017/12/12,4295.0,4287.351,4300.0,429700,4315.0,4265.0
809,2017/12/13,4240.0,4254.451,4290.0,582200,4305.0,4225.0
810,2017/12/14,4245.0,4252.416,4240.0,508700,4285.0,4230.0
811,2017/12/15,4235.0,4239.485,4245.0,651800,4270.0,4205.0
812,2017/12/18,4325.0,4293.227,4295.0,518300,4325.0,4255.0
813,2017/12/19,4265.0,4271.261,4305.0,520500,4325.0,4250.0
814,2017/12/20,4290.0,4272.478,4280.0,339400,4295.0,4230.0
815,2017/12/21,4330.0,4304.113,4305.0,344300,4330.0,4270.0
816,2017/12/22,4355.0,4330.759,4350.0,404000,4360.0,4280.0
817,2017/12/25,4320.0,4318.492,4320.0,197300,4340.0,4300.0
818,2017/12/26,4285.0,4288.925,4320.0,268300,4320.0,4265.0
819,2017/12/27,4280.0,4280.35,4300.0,310300,4310.0,4260.0
820,2017/12/28,4295.0,4303.247,4310.0,403400,4360.0,4265.0
821,2017/12/29,4295.0,4297.741,4285.0,241000,4320.0,4275.0
822,2018/01/04,4505.0,4463.522,4420.0,702600,4505.0,4405.0
823,2018/01/05,4585.0,4574.705,4600.0,515200,4625.0,4520.0
824,2018/01/09,4630.0,4645.381,4640.0,607400,4720.0,4605.0
825,2018/01/10,4570.0,4575.247,4620.0,292100,4630.0,4550.0
826,2018/01/11,4550.0,4544.435,4540.0,390300,4575.0,4515.0
827,2018/01/12,4595.0,4591.131,4560.0,476800,4620.0,4560.0
828,2018/01/15,4630.0,4629.805,4630.0,351200,4660.0,4600.0
829,2018/01/16,4635.0,4629.1,4640.0,292100,4660.0,4600.0
830,2018/01/17,4610.0,4594.892,4595.0,398500,4625.0,4555.0
831,2018/01/18,4650.0,4672.659,4665.0,553600,4715.0,4640.0
832,2018/01/19,4700.0,4697.927,4680.0,465100,4745.0,4665.0
833,2018/01/22,4670.0,4671.138,4690.0,352800,4715.0,4645.0
834,2018/01/23,4670.0,4679.948,4700.0,345300,4725.0,4665.0
835,2018/01/24,4550.0,4570.256,4630.0,447100,4645.0,4530.0
836,2018/01/25,4605.0,4605.824,4585.0,467400,4640.0,4550.0
837,2018/01/26,4595.0,4591.159,4595.0,416400,4615.0,4565.0
838,2018/01/29,4645.0,4626.777,4620.0,282800,4655.0,4590.0
839,2018/01/30,4515.0,4547.642,4595.0,419600,4620.0,4500.0
840,2018/01/31,4470.0,4489.587,4475.0,559300,4525.0,4455.0
841,2018/02/01,4590.0,4546.781,4500.0,399600,4590.0,4480.0
842,2018/02/02,4460.0,4478.093,4525.0,413300,4525.0,4450.0
843,2018/02/05,4310.0,4327.67,4335.0,496300,4360.0,4305.0
844,2018/02/06,4070.0,4039.061,4065.0,1161600,4105.0,3945.0
845,2018/02/07,4030.0,4112.093,4185.0,769300,4195.0,4025.0
846,2018/02/08,4135.0,4107.086,4055.0,655200,4155.0,4055.0
847,2018/02/09,3965.0,3938.646,3935.0,761700,3965.0,3895.0
848,2018/02/13,3955.0,3987.825,4035.0,530600,4040.0,3945.0
849,2018/02/14,3980.0,3959.266,3955.0,601600,4000.0,3895.0
850,2018/02/15,3985.0,3996.096,3980.0,1170800,4065.0,3945.0
851,2018/02/16,3855.0,3871.485,3890.0,1339400,3915.0,3830.0
852,2018/02/19,4035.0,3984.586,3920.0,709100,4040.0,3905.0
853,2018/02/20,3970.0,3956.762,4015.0,457500,4015.0,3915.0
854,2018/02/21,3970.0,3962.463,3965.0,743500,3990.0,3915.0
855,2018/02/22,3940.0,3939.168,3955.0,662100,3980.0,3905.0
856,2018/02/23,4005.0,3973.416,3935.0,451600,4005.0,3915.0
857,2018/02/26,3935.0,3953.97,4040.0,467100,4045.0,3925.0
858,2018/02/27,4100.0,4081.548,4035.0,696200,4120.0,4010.0
859,2018/02/28,4000.0,4022.842,4080.0,531900,4085.0,4000.0
860,2018/03/01,3900.0,3909.918,3960.0,435200,3970.0,3885.0
861,2018/03/02,3830.0,3814.409,3785.0,940800,3865.0,3770.0
862,2018/03/05,3705.0,3711.495,3690.0,594400,3755.0,3685.0
863,2018/03/06,3775.0,3778.292,3775.0,595700,3815.0,3745.0
864,2018/03/07,3715.0,3719.093,3740.0,465000,3750.0,3685.0
865,2018/03/08,3700.0,3704.586,3735.0,585000,3775.0,3675.0
866,2018/03/09,3755.0,3757.693,3765.0,640000,3795.0,3720.0
867,2018/03/12,3920.0,3914.625,3910.0,607900,3950.0,3885.0
868,2018/03/13,3965.0,3940.404,3890.0,812500,3990.0,3860.0
869,2018/03/14,3995.0,3963.911,3905.0,654000,4010.0,3880.0
870,2018/03/15,3940.0,3909.045,3950.0,483600,3955.0,3835.0
871,2018/03/16,3915.0,3919.319,3965.0,371500,3965.0,3900.0
872,2018/03/19,3925.0,3929.632,3910.0,351600,3970.0,3895.0
873,2018/03/20,3880.0,3882.274,3905.0,465300,3915.0,3860.0
874,2018/03/22,3915.0,3924.952,3900.0,473800,3975.0,3890.0
875,2018/03/23,3600.0,3633.367,3750.0,1176900,3785.0,3580.0
876,2018/03/26,3595.0,3557.796,3565.0,554400,3600.0,3510.0
877,2018/03/27,3745.0,3722.237,3700.0,998200,3750.0,3660.0
878,2018/03/28,3730.0,3711.727,3655.0,551400,3735.0,3645.0
879,2018/03/29,3730.0,3727.004,3750.0,448100,3775.0,3700.0
880,2018/03/30,3865.0,3845.605,3800.0,500300,3870.0,3790.0
881,2018/04/02,3830.0,3848.439,3865.0,251100,3885.0,3825.0
882,2018/04/03,3725.0,3714.807,3720.0,555600,3735.0,3690.0
883,2018/04/04,3700.0,3703.298,3740.0,362400,3740.0,3675.0
884,2018/04/05,3725.0,3723.349,3735.0,322600,3750.0,3695.0
885,2018/04/06,3715.0,3742.272,3755.0,523900,3800.0,3710.0
886,2018/04/09,3750.0,3733.923,3725.0,352900,3765.0,3680.0
887,2018/04/10,3860.0,3818.444,3725.0,562400,3885.0,3720.0
888,2018/04/11,3915.0,3932.871,3960.0,557400,4000.0,3880.0
889,2018/04/12,3845.0,3862.076,3930.0,335000,3935.0,3835.0
890,2018/04/13,3995.0,3978.946,3895.0,725300,4010.0,3890.0
891,2018/04/16,3975.0,3957.753,3985.0,351800,3990.0,3915.0
892,2018/04/17,3980.0,3969.024,3950.0,354900,4005.0,3935.0
893,2018/04/18,4145.0,4123.257,4050.0,727200,4190.0,4020.0
894,2018/04/19,4235.0,4269.902,4215.0,1027100,4345.0,4215.0
895,2018/04/20,4210.0,4194.112,4220.0,483200,4220.0,4145.0
896,2018/04/23,4225.0,4218.96,4245.0,238000,4250.0,4190.0
897,2018/04/24,4290.0,4279.686,4280.0,331600,4305.0,4220.0
898,2018/04/25,4245.0,4240.114,4235.0,428700,4270.0,4200.0
899,2018/04/26,4205.0,4222.727,4240.0,372000,4265.0,4200.0
900,2018/04/27,4190.0,4183.383,4210.0,544900,4215.0,4145.0
901,2018/05/01,4250.0,4231.321,4205.0,344100,4255.0,4185.0
902,2018/05/02,4180.0,4185.096,4235.0,321500,4235.0,4160.0
903,2018/05/07,4215.0,4203.052,4205.0,288700,4230.0,4160.0
904,2018/05/08,4175.0,4193.237,4215.0,310300,4250.0,4165.0
905,2018/05/09,4175.0,4181.012,4205.0,282000,4205.0,4160.0
906,2018/05/10,4150.0,4149.186,4190.0,277000,4190.0,4120.0
907,2018/05/11,4285.0,4246.829,4180.0,500400,4285.0,4155.0
908,2018/05/14,4340.0,4323.229,4310.0,461400,4350.0,4280.0
909,2018/05/15,3975.0,3976.522,3990.0,1329300,4050.0,3885.0
910,2018/05/16,3765.0,3802.109,3945.0,1043200,3955.0,3740.0
911,2018/05/17,3895.0,3876.747,3835.0,611200,3905.0,3830.0
912,2018/05/18,3910.0,3898.055,3915.0,435200,3925.0,3865.0
913,2018/05/21,4035.0,4017.636,3945.0,500500,4050.0,3940.0
914,2018/05/22,4115.0,4091.175,4075.0,563300,4130.0,4025.0
915,2018/05/23,4100.0,4107.041,4105.0,433300,4150.0,4060.0
916,2018/05/24,4025.0,4008.008,4085.0,368900,4085.0,3955.0
917,2018/05/25,3870.0,3911.625,4025.0,750600,4025.0,3870.0
918,2018/05/28,3825.0,3823.236,3815.0,472200,3860.0,3795.0
919,2018/05/29,3770.0,3780.922,3790.0,443700,3820.0,3740.0
920,2018/05/30,3710.0,3711.189,3730.0,609000,3770.0,3680.0
921,2018/05/31,3755.0,3707.121,3695.0,859100,3785.0,3605.0
922,2018/06/01,3760.0,3754.08,3730.0,404500,3780.0,3705.0
923,2018/06/04,3825.0,3818.366,3810.0,463800,3865.0,3775.0
924,2018/06/05,3795.0,3835.151,3860.0,483900,3920.0,3780.0
925,2018/06/06,3765.0,3761.838,3735.0,346800,3795.0,3735.0
926,2018/06/07,3765.0,3783.107,3800.0,297900,3825.0,3765.0
927,2018/06/08,3705.0,3735.934,3750.0,433200,3785.0,3700.0
928,2018/06/11,3700.0,3696.778,3690.0,286500,3715.0,3655.0
929,2018/06/12,3705.0,3722.12,3745.0,295800,3765.0,3695.0
930,2018/06/13,3715.0,3702.746,3705.0,270600,3720.0,3680.0
931,2018/06/14,3640.0,3636.251,3650.0,381300,3660.0,3615.0
932,2018/06/15,3525.0,3542.33,3600.0,858000,3610.0,3515.0
933,2018/06/18,3365.0,3393.722,3500.0,944000,3525.0,3350.0
934,2018/06/19,3330.0,3358.487,3345.0,599600,3410.0,3330.0
935,2018/06/20,3370.0,3340.094,3335.0,566400,3380.0,3280.0
936,2018/06/21,3365.0,3373.85,3365.0,287900,3415.0,3340.0
937,2018/06/22,3315.0,3311.622,3300.0,468900,3335.0,3270.0
938,2018/06/25,3300.0,3317.289,3350.0,281600,3365.0,3295.0
939,2018/06/26,3435.0,3385.557,3300.0,762300,3445.0,3295.0
940,2018/06/27,3405.0,3422.176,3445.0,683900,3510.0,3385.0
941,2018/06/28,3435.0,3418.686,3370.0,384300,3450.0,3355.0
942,2018/06/29,3445.0,3434.34,3435.0,552300,3455.0,3405.0
943,2018/07/02,3385.0,3440.685,3455.0,487700,3510.0,3375.0
944,2018/07/03,3330.0,3327.279,3390.0,421000,3395.0,3290.0
945,2018/07/04,3335.0,3327.194,3305.0,393400,3355.0,3285.0
946,2018/07/05,3285.0,3296.283,3330.0,317300,3355.0,3270.0
947,2018/07/06,3365.0,3352.137,3305.0,493400,3380.0,3295.0
948,2018/07/09,3410.0,3410.535,3405.0,358100,3440.0,3385.0
949,2018/07/10,3495.0,3489.785,3480.0,540500,3515.0,3420.0
950,2018/07/11,3435.0,3420.547,3450.0,419600,3450.0,3350.0
951,2018/07/12,3425.0,3421.281,3430.0,320000,3440.0,3390.0
952,2018/07/13,3475.0,3475.548,3480.0,322000,3505.0,3450.0
953,2018/07/17,3435.0,3439.927,3445.0,438500,3480.0,3395.0
954,2018/07/18,3435.0,3441.281,3450.0,363800,3455.0,3425.0
955,2018/07/19,3470.0,3478.363,3455.0,575300,3510.0,3450.0
956,2018/07/20,3450.0,3448.216,3470.0,495400,3475.0,3410.0
957,2018/07/23,3345.0,3355.778,3390.0,538200,3405.0,3335.0
958,2018/07/24,3420.0,3407.515,3380.0,361200,3425.0,3380.0
959,2018/07/25,3460.0,3461.387,3455.0,498800,3500.0,3435.0
960,2018/07/26,3445.0,3440.414,3490.0,569100,3490.0,3410.0
961,2018/07/27,3420.0,3423.605,3440.0,593700,3455.0,3400.0
962,2018/07/30,3410.0,3417.552,3415.0,990600,3455.0,3400.0
963,2018/07/31,3370.0,3379.256,3400.0,625900,3415.0,3360.0
964,2018/08/01,3375.0,3368.523,3350.0,460400,3400.0,3330.0
965,2018/08/02,3310.0,3315.774,3325.0,674700,3370.0,3275.0
966,2018/08/03,3265.0,3284.513,3285.0,579800,3335.0,3260.0
967,2018/08/06,3180.0,3208.395,3250.0,610400,3250.0,3175.0
968,2018/08/07,3205.0,3212.373,3170.0,546100,3240.0,3165.0
969,2018/08/08,3260.0,3270.191,3210.0,828600,3325.0,3210.0
970,2018/08/09,3305.0,3312.72,3280.0,551600,3355.0,3265.0
971,2018/08/10,3720.0,3700.003,3600.0,2384900,3780.0,3570.0
972,2018/08/13,3595.0,3634.396,3655.0,877000,3695.0,3590.0
973,2018/08/14,3625.0,3583.497,3615.0,576800,3645.0,3515.0
974,2018/08/15,3660.0,3654.248,3635.0,496200,3685.0,3610.0
975,2018/08/16,3585.0,3562.642,3585.0,494400,3595.0,3525.0
976,2018/08/17,3640.0,3640.631,3635.0,373000,3660.0,3610.0
977,2018/08/20,3615.0,3630.333,3670.0,305100,3685.0,3610.0
978,2018/08/21,3560.0,3566.107,3600.0,430600,3620.0,3545.0
979,2018/08/22,3640.0,3623.252,3535.0,362400,3640.0,3535.0
980,2018/08/23,3655.0,3676.2,3710.0,448500,3725.0,3640.0
981,2018/08/24,3690.0,3684.486,3695.0,454800,3705.0,3645.0
982,2018/08/27,3710.0,3701.919,3715.0,350800,3735.0,3670.0
983,2018/08/28,3725.0,3740.908,3755.0,277600,3790.0,3710.0
984,2018/08/29,3760.0,3749.313,3745.0,257700,3770.0,3715.0
985,2018/08/30,3835.0,3822.739,3800.0,372900,3840.0,3800.0
986,2018/08/31,3800.0,3801.778,3790.0,400500,3840.0,3765.0
987,2018/09/03,3700.0,3718.629,3805.0,268400,3805.0,3695.0
988,2018/09/04,3705.0,3713.109,3725.0,255400,3745.0,3690.0
989,2018/09/05,3710.0,3707.57,3725.0,326100,3740.0,3675.0
990,2018/09/06,3685.0,3692.183,3680.0,394900,3755.0,3660.0
991,2018/09/07,3630.0,3635.099,3635.0,373400,3680.0,3605.0
992,2018/09/10,3640.0,3636.296,3600.0,381300,3675.0,3585.0
993,2018/09/11,3730.0,3720.191,3675.0,402600,3745.0,3650.0
994,2018/09/12,3695.0,3712.349,3750.0,428400,3770.0,3680.0
995,2018/09/13,3720.0,3731.402,3705.0,324100,3785.0,3680.0
996,2018/09/14,3850.0,3807.339,3765.0,636100,3860.0,3755.0
997,2018/09/18,3860.0,3849.054,3850.0,328600,3890.0,3800.0
998,2018/09/19,3900.0,3917.721,3960.0,389000,3975.0,3900.0
999,2018/09/20,3895.0,3924.696,3965.0,770700,4000.0,3870.0
1000,2018/09/21,3900.0,3893.206,3925.0,525600,3925.0,3840.0
1001,2018/09/25,3885.0,3879.958,3920.0,406700,3920.0,3850.0
1002,2018/09/26,3975.0,3949.974,3885.0,342900,3980.0,3870.0
1003,2018/09/27,3860.0,3890.175,3925.0,343100,3955.0,3855.0
1004,2018/09/28,3920.0,3906.39,3880.0,494500,3940.0,3855.0
1005,2018/10/01,3925.0,3910.781,3890.0,411300,3935.0,3855.0
1006,2018/10/02,3960.0,3975.647,3955.0,444600,4040.0,3945.0
1007,2018/10/03,3900.0,3916.526,3955.0,225800,3960.0,3895.0
1008,2018/10/04,3945.0,3949.656,3970.0,276000,4000.0,3915.0
1009,2018/10/05,3855.0,3865.317,3880.0,357000,3890.0,3845.0
1010,2018/10/09,3680.0,3717.666,3800.0,603000,3805.0,3675.0
1011,2018/10/10,3690.0,3686.278,3725.0,401000,3735.0,3635.0
1012,2018/10/11,3470.0,3455.153,3490.0,820000,3500.0,3410.0
1013,2018/10/12,3540.0,3483.625,3415.0,583000,3545.0,3400.0
1014,2018/10/15,3465.0,3473.198,3475.0,382900,3500.0,3455.0
1015,2018/10/16,3515.0,3488.562,3425.0,355300,3520.0,3425.0
1016,2018/10/17,3580.0,3575.648,3560.0,345600,3605.0,3550.0
1017,2018/10/18,3500.0,3512.631,3565.0,301600,3565.0,3485.0
1018,2018/10/19,3425.0,3403.151,3390.0,637700,3440.0,3355.0
1019,2018/10/22,3385.0,3368.109,3360.0,591300,3405.0,3310.0
1020,2018/10/23,3225.0,3245.376,3320.0,742000,3340.0,3215.0
1021,2018/10/24,3250.0,3253.866,3235.0,1022200,3315.0,3190.0
1022,2018/10/25,3155.0,3181.663,3180.0,562800,3225.0,3145.0
1023,2018/10/26,3100.0,3117.077,3170.0,657500,3200.0,3060.0
1024,2018/10/29,3115.0,3137.772,3170.0,292600,3185.0,3110.0
1025,2018/10/30,3195.0,3179.818,3105.0,428700,3210.0,3095.0
1026,2018/10/31,3300.0,3269.32,3200.0,480300,3305.0,3185.0
1027,2018/11/01,3210.0,3233.99,3290.0,695800,3310.0,3180.0
1028,2018/11/02,3325.0,3293.694,3245.0,502700,3345.0,3235.0
1029,2018/11/05,3285.0,3284.184,3270.0,574200,3325.0,3250.0
1030,2018/11/06,3290.0,3286.903,3290.0,263500,3310.0,3265.0
1031,2018/11/07,3315.0,3348.021,3295.0,557700,3415.0,3270.0
1032,2018/11/08,3400.0,3409.965,3405.0,461100,3440.0,3390.0
1033,2018/11/09,3330.0,3337.598,3395.0,450700,3395.0,3305.0
1034,2018/11/12,3345.0,3347.142,3295.0,315100,3390.0,3290.0
1035,2018/11/13,3255.0,3195.179,3195.0,516200,3260.0,3115.0
1036,2018/11/14,2980.0,3012.918,3045.0,1949400,3105.0,2978.0
1037,2018/11/15,3010.0,3018.938,2965.0,1069400,3075.0,2958.0
1038,2018/11/16,2979.0,3001.875,3025.0,676400,3070.0,2977.0
1039,2018/11/19,3010.0,3012.442,2979.0,458800,3040.0,2979.0
1040,2018/11/20,2861.0,2886.707,2950.0,1018000,2950.0,2855.0
1041,2018/11/21,2813.0,2766.222,2752.0,1285400,2817.0,2703.0
1042,2018/11/22,2838.0,2831.868,2823.0,568500,2860.0,2788.0
1043,2018/11/26,2782.0,2773.282,2788.0,1008000,2797.0,2737.0
1044,2018/11/27,2830.0,2820.423,2828.0,606800,2842.0,2782.0
1045,2018/11/28,2898.0,2878.664,2830.0,459600,2906.0,2830.0
1046,2018/11/29,2906.0,2902.707,2878.0,520800,2917.0,2878.0
1047,2018/11/30,2944.0,2939.667,2935.0,606500,2957.0,2907.0
1048,2018/12/03,3035.0,3033.663,3010.0,726900,3055.0,2996.0
1049,2018/12/04,2959.0,2994.25,3050.0,638300,3065.0,2943.0
1050,2018/12/05,2922.0,2900.541,2885.0,599000,2931.0,2860.0
1051,2018/12/06,2838.0,2845.264,2903.0,688900,2904.0,2808.0
1052,2018/12/07,2847.0,2847.322,2860.0,504000,2890.0,2818.0
1053,2018/12/10,2797.0,2785.393,2776.0,598100,2810.0,2744.0
1054,2018/12/11,2758.0,2755.425,2770.0,484500,2780.0,2725.0
1055,2018/12/12,2782.0,2785.794,2756.0,775300,2821.0,2733.0
1056,2018/12/13,2852.0,2839.378,2811.0,552300,2863.0,2797.0
1057,2018/12/14,2742.0,2767.352,2813.0,935600,2817.0,2716.0
1058,2018/12/17,2687.0,2697.871,2701.0,691200,2748.0,2675.0
1059,2018/12/18,2611.0,2621.001,2623.0,900700,2675.0,2581.0
1060,2018/12/19,2613.0,2592.992,2593.0,663300,2625.0,2531.0
1061,2018/12/20,2476.0,2508.03,2577.0,651200,2594.0,2463.0
1062,2018/12/21,2434.0,2429.111,2443.0,916500,2469.0,2396.0
1063,2018/12/25,2317.0,2333.995,2340.0,484400,2372.0,2308.0
1064,2018/12/26,2341.0,2330.886,2331.0,405500,2369.0,2293.0
1065,2018/12/27,2438.0,2420.887,2423.0,771800,2449.0,2365.0
1066,2018/12/28,2471.0,2463.008,2423.0,442700,2489.0,2418.0
1067,2019/01/04,2487.0,2467.945,2499.0,1141700,2512.0,2418.0
1068,2019/01/07,2558.0,2582.594,2599.0,674000,2619.0,2556.0
1069,2019/01/08,2644.0,2642.464,2608.0,522000,2672.0,2600.0
1070,2019/01/09,2686.0,2675.995,2667.0,635100,2699.0,2646.0
1071,2019/01/10,2680.0,2673.943,2663.0,396800,2692.0,2648.0
1072,2019/01/11,2664.0,2679.687,2704.0,546500,2715.0,2662.0
1073,2019/01/15,2765.0,2740.487,2665.0,524500,2779.0,2653.0
1074,2019/01/16,2690.0,2704.102,2773.0,480000,2786.0,2669.0
1075,2019/01/17,2722.0,2724.817,2738.0,395300,2744.0,2708.0
1076,2019/01/18,2799.0,2779.696,2737.0,567200,2804.0,2722.0
1077,2019/01/21,2880.0,2873.595,2872.0,641700,2886.0,2849.0
1078,2019/01/22,2834.0,2839.024,2889.0,598900,2908.0,2820.0
1079,2019/01/23,2840.0,2841.964,2835.0,670400,2872.0,2817.0
1080,2019/01/24,2902.0,2874.303,2821.0,629400,2906.0,2811.0
1081,2019/01/25,3005.0,2994.253,2931.0,716700,3035.0,2928.0
1082,2019/01/28,3010.0,3012.986,3050.0,476700,3050.0,2981.0
1083,2019/01/29,2966.0,2946.838,2985.0,509600,2986.0,2904.0
1084,2019/01/30,2956.0,2966.303,2982.0,406900,2998.0,2954.0
1085,2019/01/31,2994.0,2993.313,3005.0,646800,3030.0,2960.0
1086,2019/02/01,2968.0,2985.413,3010.0,511800,3040.0,2955.0
1087,2019/02/04,3045.0,3034.024,3005.0,297900,3060.0,2978.0
1088,2019/02/05,3075.0,3079.214,3090.0,308600,3120.0,3060.0
1089,2019/02/06,3090.0,3076.411,3100.0,414700,3105.0,3035.0
1090,2019/02/07,3055.0,3045.225,3090.0,300400,3090.0,3020.0
1091,2019/02/08,2959.0,2968.588,2999.0,496700,3005.0,2940.0
1092,2019/02/12,3050.0,3046.662,3000.0,513100,3090.0,2994.0
1093,2019/02/13,3105.0,3101.564,3055.0,742400,3140.0,3050.0
1094,2019/02/14,3130.0,3195.181,3175.0,2380200,3310.0,3110.0
1095,2019/02/15,3110.0,3111.643,3080.0,662100,3145.0,3065.0
1096,2019/02/18,3170.0,3179.152,3180.0,498500,3200.0,3160.0
1097,2019/02/19,3195.0,3186.0,3155.0,447400,3210.0,3145.0
1098,2019/02/20,3185.0,3186.932,3195.0,504600,3210.0,3165.0
1099,2019/02/21,3170.0,3146.528,3160.0,736300,3185.0,3105.0
1100,2019/02/22,3165.0,3159.61,3150.0,421900,3175.0,3120.0
1101,2019/02/25,3140.0,3156.06,3155.0,595800,3200.0,3140.0
1102,2019/02/26,3195.0,3199.364,3180.0,664600,3245.0,3170.0
1103,2019/02/27,3205.0,3202.406,3180.0,528500,3225.0,3170.0
1104,2019/02/28,3160.0,3175.505,3220.0,487000,3225.0,3155.0
1105,2019/03/01,3185.0,3185.156,3175.0,399500,3205.0,3160.0
1106,2019/03/04,3210.0,3209.871,3205.0,559400,3250.0,3185.0
1107,2019/03/05,3175.0,3173.807,3200.0,465500,3210.0,3155.0
1108,2019/03/06,3150.0,3149.701,3140.0,464300,3165.0,3115.0
1109,2019/03/07,3105.0,3114.069,3105.0,673900,3165.0,3095.0
1110,2019/03/08,3055.0,3080.253,3100.0,781700,3115.0,3045.0
1111,2019/03/11,3075.0,3062.117,3070.0,255600,3085.0,3015.0
1112,2019/03/12,3125.0,3132.164,3110.0,408200,3160.0,3110.0
1113,2019/03/13,3035.0,3053.139,3090.0,385100,3115.0,3030.0
1114,2019/03/14,3035.0,3045.852,3075.0,392600,3090.0,3025.0
1115,2019/03/15,3040.0,3052.626,3040.0,453300,3090.0,3035.0
1116,2019/03/18,3025.0,3020.749,3055.0,481800,3065.0,3000.0
1117,2019/03/19,3035.0,3027.329,3035.0,370700,3040.0,2990.0
1118,2019/03/20,3040.0,3041.356,3050.0,330100,3070.0,3020.0
1119,2019/03/22,3060.0,3027.204,3040.0,838900,3060.0,2978.0
1120,2019/03/25,3000.0,2985.203,3005.0,697500,3020.0,2940.0
1121,2019/03/26,3095.0,3077.997,3040.0,586800,3110.0,3025.0
1122,2019/03/27,3095.0,3083.06,3110.0,428300,3115.0,3055.0
1123,2019/03/28,3050.0,3040.463,3030.0,537700,3065.0,3005.0
1124,2019/03/29,3120.0,3108.976,3105.0,399400,3120.0,3080.0
1125,2019/04/01,3205.0,3210.493,3185.0,495400,3240.0,3185.0
1126,2019/04/02,3240.0,3239.952,3265.0,494600,3265.0,3210.0
1127,2019/04/03,3310.0,3294.716,3235.0,648700,3330.0,3235.0
1128,2019/04/04,3305.0,3311.962,3310.0,438100,3330.0,3280.0
1129,2019/04/05,3315.0,3297.804,3275.0,400800,3315.0,3265.0
1130,2019/04/08,3295.0,3308.051,3350.0,489800,3360.0,3285.0
1131,2019/04/09,3310.0,3296.176,3290.0,276000,3310.0,3255.0
1132,2019/04/10,3260.0,3260.983,3265.0,569000,3275.0,3235.0
1133,2019/04/11,3285.0,3259.837,3230.0,658200,3300.0,3205.0
1134,2019/04/12,3300.0,3297.829,3285.0,615700,3315.0,3250.0
1135,2019/04/15,3405.0,3401.399,3390.0,698900,3420.0,3375.0
1136,2019/04/16,3370.0,3363.829,3365.0,462300,3385.0,3345.0
1137,2019/04/17,3400.0,3388.419,3395.0,552000,3415.0,3355.0
1138,2019/04/18,3360.0,3374.107,3410.0,436900,3420.0,3355.0
1139,2019/04/19,3455.0,3433.469,3415.0,381000,3455.0,3400.0
1140,2019/04/22,3405.0,3415.771,3455.0,260000,3455.0,3390.0
1141,2019/04/23,3390.0,3383.673,3405.0,326700,3415.0,3360.0
1142,2019/04/24,3360.0,3378.814,3420.0,410300,3425.0,3360.0
1143,2019/04/25,3425.0,3413.323,3405.0,435800,3430.0,3375.0
1144,2019/04/26,3405.0,3377.903,3385.0,501200,3405.0,3340.0
1145,2019/05/07,3340.0,3351.65,3385.0,721000,3420.0,3325.0
1146,2019/05/08,3210.0,3215.86,3270.0,635500,3275.0,3195.0
1147,2019/05/09,3155.0,3146.647,3160.0,625800,3185.0,3110.0
1148,2019/05/10,3145.0,3143.741,3150.0,530900,3175.0,3105.0
1149,2019/05/13,3100.0,3103.494,3095.0,362500,3145.0,3070.0
1150,2019/05/14,3030.0,3014.59,2997.0,818600,3070.0,2963.0
1151,2019/05/15,2965.0,2972.841,3030.0,794100,3040.0,2952.0
1152,2019/05/16,2896.0,2880.651,2940.0,1200400,2947.0,2841.0
1153,2019/05/17,2929.0,2932.878,2923.0,538300,2957.0,2916.0
1154,2019/05/20,2887.0,2908.991,2929.0,547400,2981.0,2880.0
1155,2019/05/21,2821.0,2823.884,2840.0,762800,2852.0,2798.0
1156,2019/05/22,2823.0,2827.121,2853.0,596000,2866.0,2804.0
1157,2019/05/23,2697.0,2716.626,2786.0,936700,2792.0,2694.0
1158,2019/05/24,2704.0,2667.765,2661.0,733200,2707.0,2624.0
1159,2019/05/27,2726.0,2731.911,2704.0,361500,2765.0,2703.0
1160,2019/05/28,2749.0,2741.029,2717.0,412900,2753.0,2713.0
1161,2019/05/29,2770.0,2748.309,2718.0,489400,2777.0,2699.0
1162,2019/05/30,2776.0,2757.077,2740.0,504000,2782.0,2728.0
1163,2019/05/31,2776.0,2772.44,2743.0,650300,2798.0,2736.0
1164,2019/06/03,2741.0,2738.356,2733.0,614600,2751.0,2717.0
1165,2019/06/04,2815.0,2797.906,2746.0,559900,2824.0,2734.0
1166,2019/06/05,2876.0,2875.818,2871.0,492000,2895.0,2854.0
1167,2019/06/06,2859.0,2874.777,2876.0,530200,2894.0,2859.0
1168,2019/06/07,2892.0,2891.725,2883.0,374200,2906.0,2873.0
1169,2019/06/10,2930.0,2929.005,2948.0,321200,2950.0,2912.0
1170,2019/06/11,2960.0,2958.547,2931.0,214700,2971.0,2923.0
1171,2019/06/12,2941.0,2952.492,2945.0,295300,2983.0,2929.0
1172,2019/06/13,2899.0,2896.327,2906.0,333400,2912.0,2879.0
1173,2019/06/14,2910.0,2907.143,2906.0,558600,2921.0,2887.0
1174,2019/06/17,2869.0,2862.551,2883.0,594600,2892.0,2830.0
1175,2019/06/18,2845.0,2854.743,2862.0,450600,2889.0,2830.0
1176,2019/06/19,2943.0,2946.055,2931.0,547800,2973.0,2918.0
1177,2019/06/20,2944.0,2936.21,2966.0,551300,2975.0,2909.0
1178,2019/06/21,2926.0,2928.588,2946.0,832900,2953.0,2910.0
1179,2019/06/24,2939.0,2935.905,2928.0,325300,2948.0,2913.0
1180,2019/06/25,2934.0,2935.865,2946.0,447400,2962.0,2915.0
1181,2019/06/26,2906.0,2912.997,2892.0,486400,2937.0,2880.0
1182,2019/06/27,2979.0,2969.339,2946.0,386900,2987.0,2934.0
1183,2019/06/28,2924.0,2926.358,2952.0,486000,2970.0,2901.0
1184,2019/07/01,3015.0,3002.212,2991.0,387700,3025.0,2977.0
1185,2019/07/02,2981.0,2989.766,3015.0,589000,3020.0,2980.0
1186,2019/07/03,2909.0,2905.97,2939.0,432500,2939.0,2887.0
1187,2019/07/04,2920.0,2918.04,2910.0,615300,2928.0,2905.0
1188,2019/07/05,2966.0,2965.504,2950.0,721600,2986.0,2945.0
1189,2019/07/08,2951.0,2953.153,2959.0,409500,2969.0,2942.0
1190,2019/07/09,2944.0,2947.462,2951.0,533700,2974.0,2922.0
1191,2019/07/10,2889.0,2902.224,2923.0,523900,2938.0,2888.0
1192,2019/07/11,2945.0,2925.932,2892.0,782100,2946.0,2885.0
1193,2019/07/12,2884.0,2903.99,2950.0,656100,2958.0,2883.0
1194,2019/07/16,2898.0,2899.323,2885.0,556900,2933.0,2880.0
1195,2019/07/17,2883.0,2884.288,2898.0,835400,2907.0,2859.0
1196,2019/07/18,2835.0,2843.737,2856.0,645100,2882.0,2825.0
1197,2019/07/19,2940.0,2924.961,2853.0,606100,2947.0,2843.0
1198,2019/07/22,2957.0,2953.291,2942.0,454100,2972.0,2942.0
1199,2019/07/23,3015.0,3010.669,2965.0,518200,3030.0,2954.0
1200,2019/07/24,3045.0,3042.17,3050.0,500200,3050.0,3030.0
1201,2019/07/25,3080.0,3069.179,3065.0,367100,3085.0,3050.0
1202,2019/07/26,3030.0,3035.979,3055.0,244700,3055.0,3025.0
1203,2019/07/29,2997.0,2991.885,3010.0,286400,3010.0,2971.0
1204,2019/07/30,2989.0,2999.955,3010.0,368200,3030.0,2979.0
1205,2019/07/31,2946.0,2941.869,2952.0,524700,2957.0,2923.0
1206,2019/08/01,2942.0,2927.602,2901.0,301000,2947.0,2889.0
1207,2019/08/02,2746.0,2772.1,2842.0,657600,2842.0,2736.0
1208,2019/08/05,2648.0,2645.098,2720.0,588100,2720.0,2612.0
1209,2019/08/06,2641.0,2610.085,2548.0,788100,2654.0,2523.0
1210,2019/08/07,2603.0,2612.893,2635.0,499000,2654.0,2596.0
1211,2019/08/08,2597.0,2596.292,2597.0,506900,2620.0,2563.0
1212,2019/08/09,2606.0,2609.118,2624.0,416100,2630.0,2581.0
1213,2019/08/13,2402.0,2437.418,2410.0,1353800,2546.0,2400.0
1214,2019/08/14,2388.0,2387.603,2430.0,685500,2441.0,2370.0
1215,2019/08/15,2370.0,2354.156,2340.0,593400,2371.0,2321.0
1216,2019/08/16,2381.0,2374.744,2359.0,618700,2390.0,2353.0
1217,2019/08/19,2379.0,2386.338,2384.0,655500,2404.0,2375.0
1218,2019/08/20,2421.0,2406.294,2395.0,413300,2421.0,2385.0
1219,2019/08/21,2441.0,2430.797,2385.0,376000,2451.0,2380.0
1220,2019/08/22,2461.0,2451.27,2448.0,459800,2464.0,2429.0
1221,2019/08/23,2473.0,2476.826,2470.0,480600,2504.0,2456.0
