,Date,Close,VWAP,Open,Volume,High,Low
0,2014/08/25,170.0,170.413,170.0,2031100,172.0,169.0
1,2014/08/26,169.0,169.13,171.0,3647900,171.0,168.0
2,2014/08/27,169.0,169.006,170.0,1721600,170.0,168.0
3,2014/08/28,167.0,167.879,168.0,2615900,169.0,167.0
4,2014/08/29,166.0,165.611,167.0,5620600,168.0,164.0
5,2014/09/01,169.0,168.578,167.0,1685000,170.0,166.0
6,2014/09/02,170.0,169.495,169.0,1290700,170.0,169.0
7,2014/09/03,169.0,169.698,170.0,2476900,171.0,169.0
8,2014/09/04,169.0,168.573,169.0,1581200,170.0,168.0
9,2014/09/05,169.0,169.498,170.0,1190200,170.0,169.0
10,2014/09/08,170.0,170.563,170.0,2148900,172.0,169.0
11,2014/09/09,170.0,169.892,170.0,1483800,171.0,169.0
12,2014/09/10,169.0,167.643,170.0,3120300,170.0,166.0
13,2014/09/11,168.0,167.337,169.0,2624800,169.0,166.0
14,2014/09/12,167.0,167.075,167.0,4515600,168.0,166.0
15,2014/09/16,165.0,165.437,167.0,2611500,167.0,164.0
16,2014/09/17,164.0,164.902,165.0,1632000,166.0,164.0
17,2014/09/18,166.0,165.956,165.0,1425800,167.0,164.0
18,2014/09/19,165.0,165.663,166.0,2875200,167.0,164.0
19,2014/09/22,164.0,165.263,166.0,1720100,167.0,164.0
20,2014/09/24,163.0,161.897,163.0,5523500,164.0,160.0
21,2014/09/25,162.0,161.573,164.0,4747900,164.0,160.0
22,2014/09/26,160.0,161.104,161.0,3441900,163.0,160.0
23,2014/09/29,160.0,159.677,161.0,3099500,161.0,158.0
24,2014/09/30,158.0,158.763,160.0,2957500,160.0,158.0
25,2014/10/01,157.0,158.594,159.0,2612900,160.0,157.0
26,2014/10/02,154.0,155.353,155.0,4896100,157.0,154.0
27,2014/10/03,154.0,153.876,154.0,4945900,156.0,152.0
28,2014/10/06,157.0,156.728,156.0,2871800,159.0,154.0
29,2014/10/07,154.0,154.912,157.0,2299000,157.0,153.0
30,2014/10/08,151.0,151.518,151.0,2408300,153.0,150.0
31,2014/10/09,151.0,153.181,154.0,4146500,155.0,151.0
32,2014/10/10,152.0,150.34,150.0,4149700,153.0,148.0
33,2014/10/14,146.0,147.604,148.0,5291800,150.0,145.0
34,2014/10/15,145.0,145.05,147.0,4447000,148.0,143.0
35,2014/10/16,142.0,142.811,143.0,7645900,145.0,141.0
36,2014/10/17,144.0,144.491,145.0,4496700,146.0,143.0
37,2014/10/20,147.0,146.984,147.0,4791700,149.0,145.0
38,2014/10/21,143.0,144.624,148.0,2818800,148.0,142.0
39,2014/10/22,147.0,146.008,147.0,3868600,148.0,144.0
40,2014/10/23,145.0,145.49,145.0,2772200,147.0,144.0
41,2014/10/24,146.0,146.146,147.0,3064100,148.0,145.0
42,2014/10/27,146.0,145.89,147.0,2126500,147.0,144.0
43,2014/10/28,145.0,145.646,146.0,2974900,147.0,144.0
44,2014/10/29,152.0,151.429,147.0,4191900,154.0,147.0
45,2014/10/30,159.0,156.169,153.0,6031100,160.0,152.0
46,2014/10/31,163.0,160.934,160.0,6554000,163.0,159.0
47,2014/11/04,167.0,165.909,167.0,6702600,168.0,163.0
48,2014/11/05,166.0,165.573,166.0,5451000,167.0,164.0
49,2014/11/06,165.0,165.157,167.0,3982300,167.0,163.0
50,2014/11/07,165.0,164.272,165.0,2915000,166.0,162.0
51,2014/11/10,166.0,164.504,163.0,3496000,166.0,162.0
52,2014/11/11,165.0,165.912,165.0,4349900,168.0,165.0
53,2014/11/12,164.0,165.211,166.0,3670100,167.0,164.0
54,2014/11/13,166.0,164.667,163.0,2990600,167.0,163.0
55,2014/11/14,168.0,166.014,166.0,5916100,168.0,164.0
56,2014/11/17,165.0,165.069,166.0,2695400,167.0,164.0
57,2014/11/18,166.0,165.626,165.0,2147200,167.0,164.0
58,2014/11/19,166.0,166.044,166.0,2639400,167.0,165.0
59,2014/11/20,165.0,165.243,167.0,1913200,167.0,164.0
60,2014/11/21,164.0,164.103,165.0,2590100,165.0,163.0
61,2014/11/25,168.0,167.585,165.0,6325100,170.0,165.0
62,2014/11/26,179.0,177.905,174.0,25877500,182.0,173.0
63,2014/11/27,180.0,181.503,180.0,13669000,185.0,179.0
64,2014/11/28,179.0,178.422,180.0,5085500,181.0,176.0
65,2014/12/01,178.0,177.983,179.0,2716900,180.0,177.0
66,2014/12/02,177.0,176.816,176.0,2544300,178.0,176.0
67,2014/12/03,177.0,176.957,177.0,2557000,178.0,176.0
68,2014/12/04,183.0,180.568,179.0,4792600,183.0,178.0
69,2014/12/05,181.0,182.582,183.0,4188300,184.0,181.0
70,2014/12/08,182.0,181.099,181.0,2324100,183.0,180.0
71,2014/12/09,180.0,180.699,181.0,2831000,183.0,180.0
72,2014/12/10,175.0,176.472,179.0,2833600,179.0,174.0
73,2014/12/11,175.0,174.732,174.0,4830100,177.0,172.0
74,2014/12/12,173.0,174.027,174.0,4152200,176.0,173.0
75,2014/12/15,170.0,170.676,169.0,3384500,173.0,169.0
76,2014/12/16,163.0,164.532,168.0,5563100,168.0,162.0
77,2014/12/17,164.0,163.502,160.0,4087800,166.0,160.0
78,2014/12/18,167.0,167.866,167.0,3126200,170.0,167.0
79,2014/12/19,171.0,170.029,170.0,2939600,171.0,169.0
80,2014/12/22,174.0,172.36,171.0,3087600,175.0,170.0
81,2014/12/24,177.0,176.23,176.0,1831000,177.0,175.0
82,2014/12/25,174.0,174.17,176.0,2196000,176.0,172.0
83,2014/12/26,170.0,172.132,173.0,4539400,175.0,170.0
84,2014/12/29,173.0,173.199,172.0,3400100,175.0,171.0
85,2014/12/30,173.0,173.606,174.0,2044300,175.0,172.0
86,2015/01/05,174.0,174.251,172.0,3016100,176.0,171.0
87,2015/01/06,168.0,169.419,172.0,3840400,173.0,167.0
88,2015/01/07,171.0,169.805,167.0,2583300,172.0,166.0
89,2015/01/08,172.0,172.031,172.0,1813200,174.0,170.0
90,2015/01/09,168.0,169.969,173.0,4209300,174.0,166.0
91,2015/01/13,165.0,165.243,167.0,3167700,167.0,163.0
92,2015/01/14,160.0,161.939,164.0,4948200,164.0,160.0
93,2015/01/15,163.0,161.26,161.0,4255500,163.0,159.0
94,2015/01/16,161.0,161.758,162.0,4875500,164.0,159.0
95,2015/01/19,163.0,163.92,164.0,3951300,166.0,162.0
96,2015/01/20,167.0,166.136,163.0,3192500,168.0,162.0
97,2015/01/21,162.0,163.006,165.0,2830400,166.0,161.0
98,2015/01/22,163.0,162.326,162.0,1878300,163.0,161.0
99,2015/01/23,169.0,166.399,163.0,2761600,169.0,163.0
100,2015/01/26,169.0,169.173,168.0,3447600,170.0,167.0
101,2015/01/27,172.0,172.009,172.0,3860400,174.0,170.0
102,2015/01/28,174.0,174.122,171.0,5953100,176.0,171.0
103,2015/01/29,173.0,173.771,174.0,3546100,175.0,172.0
104,2015/01/30,177.0,174.929,175.0,3422200,177.0,173.0
105,2015/02/02,174.0,174.685,177.0,2715100,177.0,173.0
106,2015/02/03,171.0,171.433,174.0,2314600,175.0,170.0
107,2015/02/04,175.0,174.578,172.0,2452500,176.0,172.0
108,2015/02/05,173.0,172.991,173.0,1360000,174.0,172.0
109,2015/02/06,174.0,173.344,174.0,1155800,175.0,172.0
110,2015/02/09,175.0,174.166,174.0,1291200,175.0,173.0
111,2015/02/10,175.0,174.425,175.0,1350300,175.0,173.0
112,2015/02/12,174.0,175.02,176.0,1921100,177.0,174.0
113,2015/02/13,174.0,174.036,174.0,2364900,175.0,173.0
114,2015/02/16,176.0,175.351,174.0,2125600,177.0,173.0
115,2015/02/17,177.0,177.944,176.0,4698800,180.0,176.0
116,2015/02/18,178.0,178.3,179.0,2107900,179.0,177.0
117,2015/02/19,179.0,178.703,178.0,2503600,180.0,178.0
118,2015/02/20,179.0,178.985,180.0,1893200,180.0,178.0
119,2015/02/23,179.0,179.57,180.0,1181000,180.0,179.0
120,2015/02/24,182.0,181.339,181.0,5286300,183.0,180.0
121,2015/02/25,179.0,180.921,183.0,2518100,183.0,179.0
122,2015/02/26,182.0,180.697,180.0,2274900,182.0,179.0
123,2015/02/27,181.0,180.328,181.0,2028900,182.0,179.0
124,2015/03/02,179.0,178.954,181.0,4909900,182.0,177.0
125,2015/03/03,175.0,175.739,178.0,4626600,179.0,173.0
126,2015/03/04,176.0,174.974,174.0,1617300,176.0,174.0
127,2015/03/05,175.0,175.211,175.0,1014700,176.0,174.0
128,2015/03/06,177.0,175.742,174.0,3835600,178.0,173.0
129,2015/03/09,177.0,176.42,176.0,2366900,178.0,175.0
130,2015/03/10,176.0,176.058,177.0,1439300,178.0,175.0
131,2015/03/11,176.0,176.36,177.0,2713100,178.0,175.0
132,2015/03/12,176.0,176.204,176.0,3038500,178.0,175.0
133,2015/03/13,177.0,177.801,178.0,4049400,179.0,176.0
134,2015/03/16,178.0,178.146,176.0,4014800,180.0,176.0
135,2015/03/17,178.0,179.299,180.0,3386600,181.0,178.0
136,2015/03/18,180.0,178.998,178.0,2019900,181.0,177.0
137,2015/03/19,182.0,181.88,181.0,6198800,184.0,180.0
138,2015/03/20,184.0,182.731,182.0,3437000,185.0,181.0
139,2015/03/23,190.0,187.669,186.0,5601000,190.0,185.0
140,2015/03/24,192.0,191.745,193.0,6692100,193.0,190.0
141,2015/03/25,192.0,190.976,190.0,2875500,193.0,190.0
142,2015/03/26,191.0,191.602,193.0,4576600,193.0,190.0
143,2015/03/27,184.0,185.491,186.0,4767900,189.0,182.0
144,2015/03/30,181.0,179.671,178.0,4288500,182.0,177.0
145,2015/03/31,178.0,179.714,182.0,4125500,183.0,178.0
146,2015/04/01,173.0,173.549,177.0,8223100,178.0,171.0
147,2015/04/02,173.0,174.193,173.0,3537600,176.0,172.0
148,2015/04/03,174.0,174.17,174.0,1779600,175.0,173.0
149,2015/04/06,176.0,174.788,174.0,2412200,177.0,172.0
150,2015/04/07,187.0,184.172,178.0,9416300,188.0,178.0
151,2015/04/08,187.0,186.451,187.0,4188500,189.0,184.0
152,2015/04/09,184.0,184.367,187.0,2345800,187.0,183.0
153,2015/04/10,184.0,184.009,184.0,2468900,185.0,183.0
154,2015/04/13,184.0,182.987,183.0,1912100,184.0,181.0
155,2015/04/14,187.0,186.281,183.0,3908700,188.0,183.0
156,2015/04/15,189.0,188.195,188.0,2523900,189.0,187.0
157,2015/04/16,188.0,189.28,188.0,3415800,191.0,188.0
158,2015/04/17,188.0,187.51,187.0,2843300,189.0,185.0
159,2015/04/20,187.0,187.788,187.0,2354200,189.0,186.0
160,2015/04/21,186.0,187.918,189.0,2095500,190.0,186.0
161,2015/04/22,186.0,186.074,186.0,1512900,187.0,185.0
162,2015/04/23,188.0,187.257,186.0,1833700,188.0,186.0
163,2015/04/24,188.0,187.652,188.0,2049400,189.0,186.0
164,2015/04/27,187.0,189.511,189.0,4073000,192.0,187.0
165,2015/04/28,189.0,189.245,189.0,1733100,191.0,188.0
166,2015/04/30,186.0,186.848,187.0,2673300,188.0,186.0
167,2015/05/01,185.0,185.219,186.0,1555100,187.0,184.0
168,2015/05/07,184.0,185.524,184.0,2576200,188.0,184.0
169,2015/05/08,184.0,184.283,184.0,1850100,186.0,183.0
170,2015/05/11,192.0,190.261,188.0,4619500,194.0,186.0
171,2015/05/12,194.0,193.721,192.0,6994400,196.0,189.0
172,2015/05/13,203.0,200.375,196.0,10872100,204.0,196.0
173,2015/05/14,203.0,205.546,207.0,9312400,210.0,203.0
174,2015/05/15,212.0,208.975,205.0,14959300,214.0,203.0
175,2015/05/18,217.0,216.74,214.0,13429500,219.0,213.0
176,2015/05/19,213.0,215.443,218.0,7881300,220.0,212.0
177,2015/05/20,209.0,209.191,213.0,6655100,213.0,207.0
178,2015/05/21,208.0,207.759,208.0,4625800,210.0,206.0
179,2015/05/22,207.0,207.514,207.0,4991400,210.0,206.0
180,2015/05/25,212.0,211.974,210.0,4878000,214.0,209.0
181,2015/05/26,216.0,215.593,214.0,8425000,218.0,213.0
182,2015/05/27,219.0,216.654,217.0,7842800,219.0,213.0
183,2015/05/28,217.0,218.702,221.0,8358100,222.0,216.0
184,2015/05/29,219.0,219.29,217.0,7962200,222.0,216.0
185,2015/06/01,220.0,221.261,219.0,7045600,223.0,218.0
186,2015/06/02,221.0,223.303,224.0,8982700,226.0,221.0
187,2015/06/03,230.0,227.438,224.0,10235100,231.0,223.0
188,2015/06/04,233.0,234.382,233.0,12112800,237.0,232.0
189,2015/06/05,229.0,228.585,230.0,6774200,233.0,226.0
190,2015/06/08,229.0,228.466,229.0,3960900,232.0,226.0
191,2015/06/09,223.0,225.766,226.0,4547500,229.0,223.0
192,2015/06/10,221.0,221.953,221.0,6491100,225.0,218.0
193,2015/06/11,228.0,227.278,229.0,6076500,230.0,225.0
194,2015/06/12,226.0,226.977,229.0,6278600,229.0,224.0
195,2015/06/15,224.0,223.987,224.0,2631000,226.0,223.0
196,2015/06/16,222.0,221.407,222.0,4119800,224.0,219.0
197,2015/06/17,220.0,220.66,221.0,3613100,224.0,219.0
198,2015/06/18,215.0,216.885,219.0,4114300,219.0,215.0
199,2015/06/19,219.0,217.625,217.0,5217400,220.0,215.0
200,2015/06/22,215.0,215.3,219.0,3782900,220.0,212.0
201,2015/06/23,223.0,220.672,216.0,4545300,224.0,215.0
202,2015/06/24,222.0,222.3,223.0,3151100,225.0,220.0
203,2015/06/25,217.0,218.785,221.0,4229700,222.0,216.0
204,2015/06/26,215.0,215.839,217.0,2908000,218.0,213.0
205,2015/06/29,210.0,209.733,210.0,4381100,212.0,208.0
206,2015/06/30,211.0,208.851,207.0,3695200,212.0,206.0
207,2015/07/01,211.0,211.558,212.0,1338400,213.0,211.0
208,2015/07/02,212.0,212.971,214.0,1264100,215.0,212.0
209,2015/07/03,208.0,208.956,211.0,3254800,212.0,207.0
210,2015/07/06,205.0,205.146,205.0,3302300,207.0,204.0
211,2015/07/07,206.0,207.281,208.0,1859200,209.0,205.0
212,2015/07/08,199.0,201.436,206.0,4795500,207.0,199.0
213,2015/07/09,200.0,194.455,194.0,6786700,200.0,187.0
214,2015/07/10,197.0,199.314,199.0,5514200,202.0,197.0
215,2015/07/13,201.0,201.186,200.0,1756200,204.0,200.0
216,2015/07/14,206.0,207.202,205.0,3356100,209.0,205.0
217,2015/07/15,205.0,206.743,208.0,1839300,209.0,205.0
218,2015/07/16,209.0,206.522,207.0,2882400,209.0,204.0
219,2015/07/17,210.0,208.854,209.0,2540100,210.0,206.0
220,2015/07/21,208.0,209.525,213.0,3377900,213.0,207.0
221,2015/07/22,206.0,206.424,206.0,2321800,208.0,205.0
222,2015/07/23,206.0,204.773,205.0,1966400,206.0,203.0
223,2015/07/24,204.0,203.865,206.0,2279900,207.0,202.0
224,2015/07/27,201.0,200.613,202.0,2238900,203.0,199.0
225,2015/07/28,199.0,198.724,198.0,3917900,201.0,197.0
226,2015/07/29,199.0,199.373,201.0,3255400,202.0,197.0
227,2015/07/30,211.0,208.282,201.0,6194400,215.0,201.0
228,2015/07/31,206.0,206.363,209.0,2721700,209.0,204.0
229,2015/08/03,203.0,203.584,205.0,3260100,206.0,201.0
230,2015/08/04,196.0,197.223,201.0,6734700,202.0,195.0
231,2015/08/05,197.0,197.938,197.0,4065400,201.0,195.0
232,2015/08/06,199.0,198.922,197.0,4040200,202.0,196.0
233,2015/08/07,205.0,202.58,197.0,3343400,206.0,197.0
234,2015/08/10,200.0,200.734,202.0,2910500,203.0,199.0
235,2015/08/11,206.0,204.767,203.0,6699000,207.0,202.0
236,2015/08/12,199.0,200.279,203.0,4716800,204.0,197.0
237,2015/08/13,198.0,199.618,199.0,3620100,202.0,198.0
238,2015/08/14,198.0,197.534,199.0,2914500,200.0,196.0
239,2015/08/17,198.0,197.844,198.0,1869200,199.0,196.0
240,2015/08/18,202.0,201.554,198.0,2677400,204.0,198.0
241,2015/08/19,202.0,203.433,201.0,4665900,206.0,201.0
242,2015/08/20,201.0,200.484,201.0,3841000,203.0,198.0
243,2015/08/21,196.0,196.759,196.0,5333200,200.0,195.0
244,2015/08/24,179.0,183.344,190.0,7266300,191.0,178.0
245,2015/08/25,173.0,174.165,171.0,9366200,181.0,167.0
246,2015/08/26,177.0,176.477,175.0,5697000,180.0,174.0
247,2015/08/27,178.0,179.798,180.0,3732800,182.0,178.0
248,2015/08/28,188.0,186.765,182.0,5483900,190.0,182.0
249,2015/08/31,187.0,186.479,186.0,3530500,190.0,184.0
250,2015/09/01,180.0,182.041,185.0,6035200,185.0,180.0
251,2015/09/02,179.0,179.592,176.0,6779900,184.0,175.0
252,2015/09/03,182.0,183.747,184.0,4280100,187.0,181.0
253,2015/09/04,175.0,176.63,181.0,4852300,181.0,174.0
254,2015/09/07,173.0,173.69,174.0,3003500,177.0,171.0
255,2015/09/08,176.0,178.194,176.0,5944800,182.0,175.0
256,2015/09/09,185.0,182.729,181.0,4261100,186.0,179.0
257,2015/09/10,184.0,182.432,181.0,3286800,185.0,179.0
258,2015/09/11,186.0,188.3,189.0,6871900,190.0,186.0
259,2015/09/14,182.0,181.96,185.0,2425100,187.0,179.0
260,2015/09/15,179.0,182.037,183.0,3598800,185.0,179.0
261,2015/09/16,182.0,181.847,181.0,1377000,183.0,180.0
262,2015/09/17,186.0,185.124,184.0,2126900,187.0,183.0
263,2015/09/18,184.0,183.735,186.0,1839400,186.0,182.0
264,2015/09/24,177.0,177.904,181.0,2987600,182.0,176.0
265,2015/09/25,180.0,176.951,178.0,4899200,180.0,172.0
266,2015/09/28,186.0,185.865,185.0,5144300,189.0,183.0
267,2015/09/29,176.0,176.705,182.0,4964400,182.0,174.0
268,2015/09/30,178.0,178.634,179.0,2745100,181.0,177.0
269,2015/10/01,183.0,182.361,181.0,4065600,185.0,179.0
270,2015/10/02,188.0,185.652,184.0,2930700,188.0,182.0
271,2015/10/05,190.0,191.699,190.0,5810700,195.0,189.0
272,2015/10/06,194.0,194.334,193.0,4132600,196.0,193.0
273,2015/10/07,199.0,197.856,195.0,4498700,200.0,194.0
274,2015/10/08,198.0,197.724,199.0,4381000,201.0,194.0
275,2015/10/09,205.0,202.604,200.0,4233600,205.0,199.0
276,2015/10/13,206.0,205.705,204.0,2982300,208.0,202.0
277,2015/10/14,195.0,197.757,204.0,5615800,205.0,194.0
278,2015/10/15,199.0,197.495,193.0,5045500,201.0,192.0
279,2015/10/16,200.0,199.856,199.0,3316400,203.0,198.0
280,2015/10/19,197.0,196.738,200.0,3179300,200.0,194.0
281,2015/10/20,196.0,196.741,199.0,2209200,199.0,195.0
282,2015/10/21,207.0,205.179,197.0,7077300,209.0,197.0
283,2015/10/22,205.0,205.133,204.0,2669800,209.0,203.0
284,2015/10/23,207.0,207.862,210.0,3854200,210.0,206.0
285,2015/10/26,207.0,207.67,209.0,2356300,209.0,206.0
286,2015/10/27,202.0,202.16,204.0,2845900,204.0,201.0
287,2015/10/28,202.0,200.97,203.0,3627000,204.0,198.0
288,2015/10/29,202.0,201.33,202.0,3624200,204.0,199.0
289,2015/10/30,208.0,205.732,202.0,6481900,211.0,198.0
290,2015/11/02,205.0,204.966,205.0,4498400,208.0,202.0
291,2015/11/04,211.0,210.657,209.0,6825500,213.0,208.0
292,2015/11/05,215.0,213.336,211.0,2416100,215.0,211.0
293,2015/11/06,213.0,214.125,215.0,3138400,218.0,211.0
294,2015/11/09,216.0,214.626,215.0,2768300,216.0,213.0
295,2015/11/10,216.0,214.209,214.0,1736500,216.0,212.0
296,2015/11/11,218.0,215.164,216.0,3721600,218.0,213.0
297,2015/11/12,214.0,213.733,215.0,1309300,215.0,213.0
298,2015/11/13,215.0,212.96,213.0,2398400,215.0,210.0
299,2015/11/16,210.0,210.406,210.0,1875500,212.0,209.0
300,2015/11/17,214.0,214.074,214.0,3124800,215.0,213.0
301,2015/11/18,213.0,214.103,216.0,3642500,216.0,212.0
302,2015/11/19,215.0,215.482,217.0,1788700,217.0,214.0
303,2015/11/20,216.0,214.077,215.0,2458300,216.0,212.0
304,2015/11/24,215.0,214.712,216.0,1498900,216.0,214.0
305,2015/11/25,216.0,215.263,216.0,2905200,216.0,214.0
306,2015/11/26,218.0,217.121,216.0,7069900,219.0,215.0
307,2015/11/27,221.0,220.589,219.0,8747300,222.0,219.0
308,2015/11/30,220.0,220.225,223.0,3602900,224.0,217.0
309,2015/12/01,224.0,222.591,221.0,2759300,224.0,220.0
310,2015/12/02,224.0,224.34,224.0,3675000,226.0,223.0
311,2015/12/03,223.0,221.756,223.0,1976500,223.0,220.0
312,2015/12/04,216.0,217.7,219.0,2678600,220.0,216.0
313,2015/12/07,217.0,217.511,218.0,2010800,219.0,216.0
314,2015/12/08,210.0,210.351,216.0,4665700,216.0,207.0
315,2015/12/09,206.0,207.039,207.0,4464500,209.0,205.0
316,2015/12/10,206.0,207.02,205.0,4085300,210.0,205.0
317,2015/12/11,208.0,205.844,204.0,6916900,209.0,204.0
318,2015/12/14,207.0,205.497,204.0,2735600,208.0,203.0
319,2015/12/15,204.0,204.974,208.0,1914400,208.0,203.0
320,2015/12/16,213.0,210.3,207.0,2542500,213.0,206.0
321,2015/12/17,215.0,214.837,214.0,3979800,218.0,212.0
322,2015/12/18,212.0,213.611,213.0,5531200,219.0,210.0
323,2015/12/21,213.0,210.546,211.0,3629900,214.0,207.0
324,2015/12/22,214.0,213.783,214.0,2721000,216.0,210.0
325,2015/12/24,215.0,216.607,216.0,2805900,219.0,214.0
326,2015/12/25,213.0,213.69,217.0,2545000,217.0,211.0
327,2015/12/28,217.0,216.306,213.0,2712500,219.0,211.0
328,2015/12/29,217.0,215.731,215.0,1587600,218.0,213.0
329,2015/12/30,216.0,215.742,217.0,3844200,219.0,213.0
330,2016/01/04,212.0,214.575,216.0,4676900,219.0,211.0
331,2016/01/05,211.0,210.871,210.0,4348100,214.0,209.0
332,2016/01/06,207.0,208.591,213.0,3484700,214.0,206.0
333,2016/01/07,201.0,203.048,203.0,4475300,207.0,200.0
334,2016/01/08,201.0,201.525,200.0,4700600,204.0,199.0
335,2016/01/12,194.0,195.032,197.0,3620200,197.0,192.0
336,2016/01/13,196.0,196.085,196.0,2040400,198.0,195.0
337,2016/01/14,193.0,191.042,192.0,4025800,194.0,188.0
338,2016/01/15,193.0,193.718,195.0,2584200,197.0,191.0
339,2016/01/18,190.0,189.935,188.0,3224000,192.0,188.0
340,2016/01/19,195.0,193.919,191.0,3937400,196.0,190.0
341,2016/01/20,189.0,190.611,196.0,3349100,196.0,187.0
342,2016/01/21,185.0,189.311,189.0,4355900,194.0,184.0
343,2016/01/22,193.0,191.361,190.0,4669300,195.0,188.0
344,2016/01/25,197.0,194.942,195.0,4316600,198.0,190.0
345,2016/01/26,192.0,192.428,193.0,2706200,194.0,191.0
346,2016/01/27,198.0,196.882,195.0,3968300,199.0,194.0
347,2016/01/28,194.0,195.173,196.0,3114200,199.0,192.0
348,2016/01/29,206.0,201.085,195.0,7354300,207.0,193.0
349,2016/02/01,208.0,207.215,208.0,4345600,210.0,205.0
350,2016/02/02,199.0,202.152,206.0,3141600,207.0,198.0
351,2016/02/03,190.0,191.318,198.0,4589300,198.0,189.0
352,2016/02/04,188.0,189.775,191.0,6429000,195.0,186.0
353,2016/02/05,189.0,187.936,187.0,4687100,191.0,186.0
354,2016/02/08,185.0,184.708,184.0,5888000,187.0,182.0
355,2016/02/09,176.0,177.497,180.0,6401000,181.0,174.0
356,2016/02/10,171.0,170.773,176.0,8830600,177.0,166.0
357,2016/02/12,162.0,163.03,163.0,9397100,166.0,161.0
358,2016/02/15,170.0,169.14,171.0,4695300,172.0,165.0
359,2016/02/16,171.0,172.111,169.0,5154500,175.0,168.0
360,2016/02/17,169.0,170.054,170.0,3765700,173.0,167.0
361,2016/02/18,173.0,171.033,173.0,6778900,175.0,168.0
362,2016/02/19,168.0,168.806,170.0,4433600,173.0,167.0
363,2016/02/22,168.0,167.792,166.0,2969900,170.0,165.0
364,2016/02/23,169.0,170.576,171.0,4108400,174.0,168.0
365,2016/02/24,166.0,167.422,168.0,2944100,171.0,166.0
366,2016/02/25,176.0,173.666,169.0,5427800,178.0,167.0
367,2016/02/26,175.0,178.094,178.0,3389400,181.0,175.0
368,2016/02/29,176.0,178.446,178.0,2894800,181.0,176.0
369,2016/03/01,178.0,176.605,176.0,3089100,178.0,174.0
370,2016/03/02,182.0,180.638,182.0,4566100,183.0,178.0
371,2016/03/03,184.0,184.92,181.0,5444200,189.0,181.0
372,2016/03/04,189.0,187.636,184.0,4716100,191.0,183.0
373,2016/03/07,193.0,192.223,193.0,5252600,194.0,190.0
374,2016/03/08,191.0,191.552,193.0,4607300,195.0,188.0
375,2016/03/09,190.0,188.145,189.0,7430500,190.0,185.0
376,2016/03/10,187.0,187.346,190.0,3912800,190.0,186.0
377,2016/03/11,189.0,189.239,185.0,7240700,194.0,185.0
378,2016/03/14,193.0,193.395,195.0,4714200,195.0,191.0
379,2016/03/15,191.0,191.649,192.0,4865800,194.0,190.0
380,2016/03/16,190.0,191.426,192.0,3535400,193.0,190.0
381,2016/03/17,189.0,191.968,192.0,6281400,196.0,188.0
382,2016/03/18,194.0,192.317,190.0,5416500,194.0,189.0
383,2016/03/22,194.0,194.338,196.0,4556300,198.0,192.0
384,2016/03/23,193.0,193.702,194.0,1035700,195.0,193.0
385,2016/03/24,190.0,191.135,193.0,2926200,194.0,189.0
386,2016/03/25,192.0,192.256,191.0,1706100,193.0,191.0
387,2016/03/28,194.0,193.358,193.0,4469400,195.0,192.0
388,2016/03/29,187.0,187.611,187.0,2632800,190.0,186.0
389,2016/03/30,183.0,183.87,188.0,2656700,188.0,182.0
390,2016/03/31,185.0,185.848,185.0,2600000,188.0,183.0
391,2016/04/01,177.0,179.487,185.0,4522800,186.0,176.0
392,2016/04/04,182.0,180.349,177.0,3529900,183.0,175.0
393,2016/04/05,174.0,175.625,181.0,3132700,181.0,173.0
394,2016/04/06,173.0,174.481,173.0,2283800,177.0,172.0
395,2016/04/07,169.0,170.622,173.0,3803400,175.0,167.0
396,2016/04/08,175.0,172.482,168.0,4809800,177.0,166.0
397,2016/04/11,175.0,174.116,174.0,2335800,176.0,171.0
398,2016/04/12,180.0,179.735,175.0,3015900,182.0,175.0
399,2016/04/13,185.0,183.871,182.0,3444600,186.0,181.0
400,2016/04/14,191.0,189.743,186.0,3964500,192.0,186.0
401,2016/04/15,189.0,189.465,189.0,2451100,191.0,188.0
402,2016/04/18,185.0,185.689,186.0,2277700,187.0,184.0
403,2016/04/19,191.0,190.161,190.0,2213200,191.0,189.0
404,2016/04/20,193.0,192.483,192.0,3561600,194.0,191.0
405,2016/04/21,199.0,195.879,196.0,4420000,199.0,193.0
406,2016/04/22,199.0,197.52,197.0,5151000,200.0,195.0
407,2016/04/25,198.0,197.355,198.0,4524600,199.0,195.0
408,2016/04/26,196.0,195.358,199.0,3072400,199.0,193.0
409,2016/04/27,198.0,198.232,198.0,2791500,200.0,196.0
410,2016/04/28,194.0,197.896,199.0,3963000,202.0,194.0
411,2016/05/02,190.0,189.205,187.0,3121200,192.0,187.0
412,2016/05/06,188.0,188.576,189.0,3600100,191.0,186.0
413,2016/05/09,187.0,188.875,190.0,2999500,192.0,187.0
414,2016/05/10,191.0,189.415,188.0,3102600,192.0,186.0
415,2016/05/11,191.0,192.843,194.0,2429700,195.0,191.0
416,2016/05/12,199.0,196.375,191.0,4101400,199.0,191.0
417,2016/05/13,206.0,202.158,198.0,8229500,208.0,196.0
418,2016/05/16,209.0,209.421,207.0,6968300,213.0,206.0
419,2016/05/17,212.0,211.342,210.0,4765300,213.0,208.0
420,2016/05/18,213.0,212.3,212.0,4607200,215.0,209.0
421,2016/05/19,211.0,210.819,211.0,4262700,213.0,208.0
422,2016/05/20,215.0,214.216,211.0,4529000,216.0,210.0
423,2016/05/23,217.0,215.472,215.0,6420800,218.0,212.0
424,2016/05/24,216.0,215.5,215.0,3013000,217.0,214.0
425,2016/05/25,220.0,219.731,219.0,3940500,221.0,217.0
426,2016/05/26,218.0,219.416,221.0,3657700,222.0,218.0
427,2016/05/27,220.0,218.937,218.0,2655400,220.0,218.0
428,2016/05/30,219.0,219.145,220.0,1360800,221.0,218.0
429,2016/05/31,219.0,218.653,218.0,3574200,220.0,217.0
430,2016/06/01,213.0,215.918,218.0,4155300,219.0,213.0
431,2016/06/02,214.0,213.861,212.0,5858900,216.0,211.0
432,2016/06/03,216.0,215.148,214.0,3632200,217.0,214.0
433,2016/06/06,218.0,216.892,212.0,3816400,219.0,212.0
434,2016/06/07,228.0,227.296,220.0,12242000,232.0,219.0
435,2016/06/08,227.0,227.863,228.0,4721200,231.0,226.0
436,2016/06/09,231.0,229.396,226.0,6769400,232.0,226.0
437,2016/06/10,229.0,228.176,229.0,6160700,230.0,225.0
438,2016/06/13,222.0,223.155,224.0,3289400,226.0,222.0
439,2016/06/14,221.0,220.729,222.0,3303400,225.0,219.0
440,2016/06/15,219.0,220.407,219.0,2300400,222.0,219.0
441,2016/06/16,216.0,217.811,220.0,4797600,222.0,215.0
442,2016/06/17,219.0,219.897,217.0,5804900,224.0,217.0
443,2016/06/20,229.0,227.2,225.0,5363100,231.0,224.0
444,2016/06/21,227.0,226.048,225.0,3988600,229.0,222.0
445,2016/06/22,224.0,224.0,226.0,3313500,226.0,222.0
446,2016/06/23,222.0,222.594,223.0,2682300,225.0,221.0
447,2016/06/24,211.0,215.764,224.0,6814200,225.0,207.0
448,2016/06/27,218.0,216.417,213.0,4861600,220.0,213.0
449,2016/06/28,220.0,219.668,217.0,5502600,223.0,216.0
450,2016/06/29,222.0,222.502,222.0,4729100,224.0,221.0
451,2016/06/30,226.0,225.923,224.0,4351000,228.0,224.0
452,2016/07/01,226.0,227.829,228.0,2738000,230.0,226.0
453,2016/07/04,225.0,225.469,223.0,5710400,229.0,223.0
454,2016/07/05,223.0,224.344,223.0,5162100,228.0,222.0
455,2016/07/06,215.0,216.918,221.0,6339000,221.0,213.0
456,2016/07/07,211.0,212.406,215.0,5859400,215.0,209.0
457,2016/07/08,216.0,214.751,210.0,4073200,217.0,210.0
458,2016/07/11,224.0,221.872,220.0,4121300,225.0,219.0
459,2016/07/12,229.0,229.2,227.0,6235800,232.0,227.0
460,2016/07/13,234.0,233.663,234.0,7445500,236.0,231.0
461,2016/07/14,234.0,233.635,234.0,3735000,235.0,232.0
462,2016/07/15,231.0,235.675,235.0,9758900,242.0,229.0
463,2016/07/19,233.0,232.606,235.0,3540000,235.0,231.0
464,2016/07/20,233.0,231.588,233.0,3054300,233.0,230.0
465,2016/07/21,237.0,236.817,236.0,4748600,239.0,235.0
466,2016/07/22,231.0,233.223,234.0,4413300,237.0,230.0
467,2016/07/25,228.0,229.367,232.0,3126900,233.0,227.0
468,2016/07/26,232.0,232.441,232.0,4913400,234.0,231.0
469,2016/07/27,236.0,235.082,234.0,3524400,237.0,233.0
470,2016/07/28,230.0,232.947,236.0,4643000,240.0,230.0
471,2016/07/29,234.0,230.428,231.0,4693000,234.0,226.0
472,2016/08/01,228.0,229.556,229.0,2682400,232.0,228.0
473,2016/08/02,225.0,225.369,226.0,2378200,228.0,224.0
474,2016/08/03,216.0,218.835,222.0,5136100,224.0,216.0
475,2016/08/04,222.0,220.716,219.0,3175300,223.0,218.0
476,2016/08/05,218.0,219.814,220.0,1990900,224.0,217.0
477,2016/08/08,221.0,219.853,219.0,2474600,221.0,218.0
478,2016/08/09,222.0,221.059,221.0,1836500,223.0,219.0
479,2016/08/10,224.0,223.867,222.0,2563700,226.0,221.0
480,2016/08/12,228.0,229.061,229.0,3466900,231.0,228.0
481,2016/08/15,222.0,223.118,226.0,2135400,227.0,222.0
482,2016/08/16,222.0,223.427,222.0,3081400,227.0,220.0
483,2016/08/17,221.0,221.579,221.0,2101500,223.0,220.0
484,2016/08/18,222.0,221.377,219.0,1866200,225.0,218.0
485,2016/08/19,219.0,219.566,223.0,3160300,224.0,217.0
486,2016/08/22,223.0,223.391,225.0,2151700,225.0,221.0
487,2016/08/23,217.0,218.39,221.0,2902100,221.0,216.0
488,2016/08/24,220.0,218.896,218.0,1486800,220.0,217.0
489,2016/08/25,217.0,217.546,217.0,1987100,219.0,217.0
490,2016/08/26,222.0,221.682,219.0,4472000,225.0,217.0
491,2016/08/29,222.0,222.339,222.0,1961400,224.0,221.0
492,2016/08/30,221.0,221.386,222.0,1206200,224.0,220.0
493,2016/08/31,220.0,219.587,220.0,2309800,222.0,218.0
494,2016/09/01,221.0,220.114,221.0,1964600,221.0,219.0
495,2016/09/02,219.0,219.798,222.0,1421500,222.0,219.0
496,2016/09/05,222.0,220.476,220.0,2138200,222.0,218.0
497,2016/09/06,221.0,220.97,221.0,1469600,222.0,220.0
498,2016/09/07,224.0,222.922,220.0,2577100,224.0,220.0
499,2016/09/08,222.0,223.015,224.0,1902400,225.0,221.0
500,2016/09/09,223.0,223.52,224.0,2278900,224.0,222.0
501,2016/09/12,222.0,222.003,220.0,2806200,224.0,220.0
502,2016/09/13,217.0,218.723,222.0,2752900,222.0,217.0
503,2016/09/14,218.0,216.571,216.0,3295400,219.0,214.0
504,2016/09/15,216.0,216.41,216.0,1448100,218.0,215.0
505,2016/09/16,216.0,216.166,216.0,2027200,217.0,215.0
506,2016/09/20,216.0,216.981,216.0,1433300,219.0,215.0
507,2016/09/21,219.0,217.488,217.0,2088700,220.0,215.0
508,2016/09/23,218.0,218.766,219.0,1540100,220.0,218.0
509,2016/09/26,216.0,216.732,218.0,1437500,219.0,215.0
510,2016/09/27,220.0,218.345,216.0,2403900,220.0,215.0
511,2016/09/28,210.0,211.227,216.0,6747500,217.0,207.0
512,2016/09/29,221.0,218.143,212.0,4781800,222.0,212.0
513,2016/09/30,217.0,217.345,218.0,1861200,219.0,216.0
514,2016/10/03,216.0,217.278,219.0,1614100,219.0,216.0
515,2016/10/04,221.0,219.545,218.0,1469900,221.0,216.0
516,2016/10/05,219.0,219.644,220.0,1525800,221.0,218.0
517,2016/10/06,220.0,220.885,221.0,1624100,222.0,220.0
518,2016/10/07,220.0,219.9,219.0,1443500,221.0,219.0
519,2016/10/11,219.0,219.922,220.0,2157700,222.0,218.0
520,2016/10/12,218.0,218.696,217.0,2046100,221.0,216.0
521,2016/10/13,219.0,218.383,220.0,2020900,220.0,217.0
522,2016/10/14,220.0,219.312,219.0,2282500,221.0,218.0
523,2016/10/17,221.0,220.772,219.0,1797400,222.0,219.0
524,2016/10/18,225.0,223.21,222.0,2836000,225.0,221.0
525,2016/10/19,227.0,227.207,226.0,3369700,229.0,225.0
526,2016/10/20,228.0,227.878,228.0,2544400,229.0,226.0
527,2016/10/21,228.0,229.024,229.0,3083900,231.0,227.0
528,2016/10/24,227.0,225.965,226.0,1830300,228.0,223.0
529,2016/10/25,234.0,233.06,232.0,5040800,236.0,230.0
530,2016/10/26,237.0,235.964,233.0,4087200,238.0,232.0
531,2016/10/27,236.0,235.135,238.0,3391900,238.0,233.0
532,2016/10/28,238.0,238.465,235.0,7816800,244.0,234.0
533,2016/10/31,239.0,239.062,239.0,2789400,241.0,237.0
534,2016/11/01,237.0,236.488,239.0,2491000,239.0,235.0
535,2016/11/02,234.0,234.383,237.0,3607100,237.0,233.0
536,2016/11/04,234.0,234.484,235.0,4322400,238.0,232.0
537,2016/11/07,237.0,236.536,237.0,1744700,238.0,235.0
538,2016/11/08,238.0,237.042,237.0,1796100,239.0,235.0
539,2016/11/09,225.0,230.184,237.0,5245800,239.0,223.0
540,2016/11/10,238.0,237.49,235.0,4623500,240.0,234.0
541,2016/11/11,238.0,240.349,240.0,5533900,245.0,237.0
542,2016/11/14,243.0,243.198,240.0,2779200,245.0,240.0
543,2016/11/15,243.0,243.865,244.0,3514700,248.0,242.0
544,2016/11/16,244.0,244.246,246.0,1609200,247.0,243.0
545,2016/11/17,244.0,244.333,244.0,2846300,247.0,243.0
546,2016/11/18,247.0,245.823,247.0,3444200,247.0,244.0
547,2016/11/21,245.0,246.866,249.0,2756300,250.0,245.0
548,2016/11/22,245.0,243.214,245.0,2443600,245.0,241.0
549,2016/11/24,251.0,251.502,248.0,7141000,255.0,248.0
550,2016/11/25,254.0,254.867,253.0,6258500,259.0,251.0
551,2016/11/28,250.0,250.585,255.0,5026200,255.0,248.0
552,2016/11/29,257.0,256.295,253.0,5328600,259.0,253.0
553,2016/11/30,255.0,255.399,258.0,4084900,259.0,254.0
554,2016/12/01,257.0,258.012,258.0,4102100,260.0,256.0
555,2016/12/02,255.0,255.313,256.0,3078700,257.0,254.0
556,2016/12/05,253.0,251.719,254.0,3250100,255.0,249.0
557,2016/12/06,254.0,253.353,254.0,3817700,255.0,251.0
558,2016/12/07,256.0,254.784,254.0,3185500,256.0,254.0
559,2016/12/08,263.0,261.727,256.0,8077500,265.0,256.0
560,2016/12/09,264.0,265.053,266.0,4477900,268.0,263.0
561,2016/12/12,262.0,262.963,267.0,3273700,267.0,260.0
562,2016/12/13,260.0,259.949,259.0,3574400,263.0,258.0
563,2016/12/14,261.0,260.022,260.0,3092600,262.0,257.0
564,2016/12/15,257.0,257.86,261.0,3508100,262.0,256.0
565,2016/12/16,261.0,260.429,260.0,2459600,261.0,259.0
566,2016/12/19,252.0,254.086,260.0,4371600,260.0,252.0
567,2016/12/20,255.0,255.167,255.0,4843900,258.0,253.0
568,2016/12/21,249.0,249.817,256.0,3552500,256.0,247.0
569,2016/12/22,247.0,246.347,249.0,3146300,249.0,244.0
570,2016/12/26,248.0,249.071,247.0,2630200,251.0,247.0
571,2016/12/27,252.0,252.109,250.0,3428200,254.0,249.0
572,2016/12/28,254.0,255.445,253.0,2955700,258.0,253.0
573,2016/12/29,249.0,249.108,252.0,2691100,253.0,246.0
574,2016/12/30,247.0,246.618,246.0,1973800,249.0,243.0
575,2017/01/04,260.0,258.913,254.0,7034900,263.0,253.0
576,2017/01/05,260.0,261.865,264.0,4133800,266.0,260.0
577,2017/01/06,261.0,262.215,258.0,4355000,264.0,257.0
578,2017/01/10,260.0,260.718,259.0,2793000,264.0,258.0
579,2017/01/11,262.0,264.224,263.0,3350600,267.0,261.0
580,2017/01/12,261.0,262.794,261.0,6653000,265.0,260.0
581,2017/01/13,259.0,258.95,260.0,3389500,261.0,258.0
582,2017/01/16,258.0,259.144,260.0,2643800,262.0,257.0
583,2017/01/17,255.0,255.787,257.0,2526100,258.0,253.0
584,2017/01/18,260.0,257.066,256.0,3481200,260.0,252.0
585,2017/01/19,258.0,260.673,260.0,3767400,265.0,258.0
586,2017/01/20,263.0,262.934,261.0,4986400,265.0,260.0
587,2017/01/23,265.0,264.906,261.0,7154900,268.0,260.0
588,2017/01/24,269.0,269.484,268.0,5154300,272.0,267.0
589,2017/01/25,274.0,273.861,276.0,5591400,281.0,270.0
590,2017/01/26,281.0,279.695,278.0,5637900,282.0,276.0
591,2017/01/27,280.0,279.234,278.0,3519500,282.0,276.0
592,2017/01/30,284.0,281.456,276.0,8897200,287.0,274.0
593,2017/01/31,276.0,279.979,282.0,5852900,287.0,275.0
594,2017/02/01,278.0,276.547,276.0,3654500,279.0,271.0
595,2017/02/02,273.0,274.523,277.0,3460400,278.0,273.0
596,2017/02/03,274.0,274.265,273.0,2855500,278.0,272.0
597,2017/02/06,274.0,273.248,277.0,2782200,277.0,272.0
598,2017/02/07,273.0,272.623,270.0,2681300,275.0,270.0
599,2017/02/08,274.0,273.184,271.0,3167200,275.0,271.0
600,2017/02/09,270.0,270.587,272.0,3531700,274.0,268.0
601,2017/02/10,276.0,274.605,274.0,4521500,276.0,272.0
602,2017/02/13,281.0,279.925,279.0,4667800,282.0,278.0
603,2017/02/14,284.0,285.575,283.0,5532400,288.0,283.0
604,2017/02/15,288.0,288.151,286.0,4745400,290.0,286.0
605,2017/02/16,290.0,289.08,290.0,5088400,291.0,285.0
606,2017/02/17,287.0,287.426,287.0,2700800,290.0,286.0
607,2017/02/20,286.0,285.486,287.0,3064400,287.0,284.0
608,2017/02/21,288.0,287.823,287.0,2417300,290.0,285.0
609,2017/02/22,284.0,284.779,289.0,4321400,289.0,282.0
610,2017/02/23,287.0,285.63,285.0,4980400,288.0,282.0
611,2017/02/24,282.0,283.613,288.0,5570800,288.0,281.0
612,2017/02/27,278.0,277.604,281.0,6408500,281.0,275.0
613,2017/02/28,276.0,277.903,279.0,4469400,283.0,276.0
614,2017/03/01,277.0,274.572,276.0,5726300,277.0,271.0
615,2017/03/02,277.0,277.769,278.0,5931800,281.0,275.0
616,2017/03/03,276.0,275.633,277.0,3778500,277.0,274.0
617,2017/03/06,274.0,274.206,277.0,6007200,277.0,273.0
618,2017/03/07,268.0,268.005,271.0,7409900,272.0,265.0
619,2017/03/08,263.0,260.95,266.0,9197700,266.0,257.0
620,2017/03/09,266.0,267.075,265.0,6954400,270.0,264.0
621,2017/03/10,263.0,265.755,270.0,8965600,270.0,262.0
622,2017/03/13,262.0,261.421,263.0,5593100,263.0,259.0
623,2017/03/14,262.0,262.698,262.0,4229400,265.0,261.0
624,2017/03/15,259.0,259.243,261.0,3034500,261.0,257.0
625,2017/03/16,262.0,260.844,259.0,6263400,263.0,258.0
626,2017/03/17,260.0,260.114,260.0,3676700,262.0,259.0
627,2017/03/21,258.0,258.856,260.0,3250900,261.0,257.0
628,2017/03/22,253.0,252.025,252.0,4683800,254.0,249.0
629,2017/03/23,253.0,253.437,253.0,4035800,257.0,251.0
630,2017/03/24,253.0,252.917,253.0,3389700,255.0,251.0
631,2017/03/27,250.0,250.387,250.0,4290900,252.0,249.0
632,2017/03/28,250.0,250.114,250.0,5523500,252.0,249.0
633,2017/03/29,248.0,248.224,252.0,5202200,253.0,246.0
634,2017/03/30,247.0,248.616,249.0,4593000,252.0,246.0
635,2017/03/31,245.0,246.739,247.0,3697000,250.0,244.0
636,2017/04/03,243.0,243.09,248.0,3867200,249.0,241.0
637,2017/04/04,239.0,239.353,243.0,5598700,244.0,237.0
638,2017/04/05,242.0,241.076,241.0,4760000,243.0,238.0
639,2017/04/06,236.0,236.802,238.0,4817100,240.0,234.0
640,2017/04/07,236.0,235.109,235.0,6244500,237.0,232.0
641,2017/04/10,243.0,241.04,238.0,4223300,243.0,237.0
642,2017/04/11,241.0,240.045,241.0,3702400,242.0,237.0
643,2017/04/12,238.0,236.801,239.0,3613800,239.0,235.0
644,2017/04/13,234.0,232.798,235.0,3081600,236.0,230.0
645,2017/04/14,232.0,231.455,229.0,4750300,235.0,228.0
646,2017/04/17,232.0,231.38,229.0,1930700,234.0,229.0
647,2017/04/18,233.0,233.778,234.0,2713500,238.0,231.0
648,2017/04/19,231.0,230.668,232.0,4175900,233.0,228.0
649,2017/04/20,231.0,231.572,231.0,3838300,234.0,229.0
650,2017/04/21,233.0,232.922,234.0,2905200,235.0,231.0
651,2017/04/24,235.0,234.779,235.0,2625300,237.0,233.0
652,2017/04/25,240.0,238.89,235.0,3450600,241.0,235.0
653,2017/04/26,244.0,243.762,245.0,3780300,245.0,242.0
654,2017/04/27,244.0,242.393,242.0,3664500,244.0,240.0
655,2017/04/28,249.0,245.998,242.0,10481100,250.0,240.0
656,2017/05/01,252.0,252.571,254.0,8390300,256.0,250.0
657,2017/05/02,251.0,251.404,253.0,5099200,253.0,249.0
658,2017/05/08,255.0,254.175,255.0,6625500,256.0,252.0
659,2017/05/09,251.0,251.221,254.0,4665000,255.0,250.0
660,2017/05/10,248.0,249.614,250.0,3987500,252.0,248.0
661,2017/05/11,256.0,253.483,251.0,5452600,256.0,250.0
662,2017/05/12,256.0,255.007,257.0,4332500,258.0,252.0
663,2017/05/15,259.0,255.767,255.0,9804400,261.0,250.0
664,2017/05/16,271.0,267.344,261.0,10138500,272.0,261.0
665,2017/05/17,267.0,266.397,269.0,6213600,270.0,264.0
666,2017/05/18,259.0,259.215,260.0,3288100,262.0,257.0
667,2017/05/19,260.0,257.518,261.0,4687300,261.0,254.0
668,2017/05/22,262.0,261.928,263.0,3319900,264.0,260.0
669,2017/05/23,258.0,259.375,262.0,3257200,262.0,257.0
670,2017/05/24,259.0,257.899,260.0,3266900,261.0,256.0
671,2017/05/25,257.0,257.128,258.0,2804800,259.0,255.0
672,2017/05/26,254.0,253.635,254.0,4570200,256.0,251.0
673,2017/05/29,251.0,251.305,253.0,2508800,254.0,249.0
674,2017/05/30,255.0,252.582,250.0,2889700,256.0,249.0
675,2017/05/31,259.0,258.093,256.0,6135800,260.0,255.0
676,2017/06/01,261.0,260.925,261.0,4082200,263.0,259.0
677,2017/06/02,267.0,265.08,263.0,6206100,268.0,262.0
678,2017/06/05,263.0,262.542,265.0,3553700,266.0,260.0
679,2017/06/06,262.0,262.205,265.0,3520700,265.0,260.0
680,2017/06/07,270.0,267.161,262.0,6193700,270.0,262.0
681,2017/06/08,269.0,268.385,268.0,4011900,270.0,266.0
682,2017/06/09,271.0,270.542,271.0,4301300,273.0,268.0
683,2017/06/12,272.0,272.17,271.0,2713600,274.0,270.0
684,2017/06/13,268.0,269.123,272.0,4828200,273.0,267.0
685,2017/06/14,263.0,265.342,270.0,4076400,270.0,263.0
686,2017/06/15,261.0,261.213,262.0,3676500,264.0,259.0
687,2017/06/16,258.0,258.427,260.0,5068000,262.0,256.0
688,2017/06/19,255.0,255.643,259.0,3769900,259.0,253.0
689,2017/06/20,256.0,257.106,257.0,2552800,259.0,256.0
690,2017/06/21,253.0,253.112,254.0,3453300,255.0,252.0
691,2017/06/22,253.0,252.585,251.0,2146500,254.0,250.0
692,2017/06/23,257.0,256.645,256.0,3032800,258.0,254.0
693,2017/06/26,259.0,259.671,259.0,1462100,262.0,258.0
694,2017/06/27,264.0,262.984,262.0,2498000,264.0,260.0
695,2017/06/28,266.0,266.304,264.0,2561000,268.0,264.0
696,2017/06/29,269.0,268.417,268.0,3587100,270.0,267.0
697,2017/06/30,267.0,267.479,267.0,2993100,270.0,265.0
698,2017/07/03,274.0,271.814,267.0,4267900,275.0,267.0
699,2017/07/04,270.0,271.756,276.0,4082800,277.0,268.0
700,2017/07/05,274.0,271.453,270.0,3018500,274.0,268.0
701,2017/07/06,277.0,276.671,273.0,4381700,279.0,272.0
702,2017/07/07,278.0,277.094,276.0,3298000,278.0,274.0
703,2017/07/10,277.0,278.089,280.0,3193800,281.0,276.0
704,2017/07/11,281.0,278.966,276.0,2573400,281.0,276.0
705,2017/07/12,279.0,278.914,281.0,2681300,281.0,277.0
706,2017/07/13,282.0,281.41,281.0,2411500,283.0,278.0
707,2017/07/14,285.0,284.53,282.0,2868800,286.0,282.0
708,2017/07/18,289.0,286.905,287.0,4005900,289.0,285.0
709,2017/07/19,285.0,285.284,288.0,2900500,288.0,283.0
710,2017/07/20,286.0,285.894,287.0,3462800,288.0,284.0
711,2017/07/21,283.0,282.442,284.0,1818700,285.0,281.0
712,2017/07/24,282.0,279.907,277.0,2036200,283.0,276.0
713,2017/07/25,283.0,282.009,280.0,1552400,284.0,279.0
714,2017/07/26,285.0,283.347,281.0,3106700,285.0,280.0
715,2017/07/27,297.0,295.543,286.0,9742000,310.0,285.0
716,2017/07/28,298.0,298.32,303.0,6263100,306.0,293.0
717,2017/07/31,297.0,296.432,295.0,4655400,298.0,294.0
718,2017/08/01,295.0,294.335,294.0,4777100,297.0,291.0
719,2017/08/02,295.0,295.228,297.0,3152100,298.0,293.0
720,2017/08/03,293.0,292.23,295.0,5331300,296.0,290.0
721,2017/08/04,295.0,295.529,294.0,5769300,299.0,293.0
722,2017/08/07,295.0,295.701,298.0,3554500,299.0,294.0
723,2017/08/08,297.0,298.744,298.0,3085400,302.0,297.0
724,2017/08/09,298.0,298.428,297.0,4905000,302.0,296.0
725,2017/08/10,298.0,298.367,298.0,1883800,300.0,297.0
726,2017/08/14,295.0,293.882,290.0,4677300,298.0,287.0
727,2017/08/15,299.0,298.686,298.0,2595700,300.0,296.0
728,2017/08/16,305.0,306.229,304.0,7686400,310.0,303.0
729,2017/08/17,311.0,310.281,307.0,6335100,314.0,306.0
730,2017/08/18,307.0,306.614,306.0,5165700,309.0,305.0
731,2017/08/21,310.0,310.069,311.0,4417900,312.0,306.0
732,2017/08/22,316.0,313.748,309.0,4336200,317.0,307.0
733,2017/08/23,318.0,318.928,321.0,4865800,322.0,316.0
734,2017/08/24,321.0,321.123,316.0,3641400,324.0,316.0
735,2017/08/25,326.0,323.714,322.0,3483900,326.0,321.0
736,2017/08/28,322.0,322.015,326.0,5033700,328.0,319.0
737,2017/08/29,321.0,319.781,315.0,3768500,322.0,314.0
738,2017/08/30,322.0,322.23,325.0,8597800,327.0,320.0
739,2017/08/31,324.0,325.728,323.0,4981400,330.0,323.0
740,2017/09/01,325.0,323.097,324.0,4555200,326.0,320.0
741,2017/09/04,322.0,321.865,325.0,3016400,326.0,319.0
742,2017/09/05,319.0,318.969,321.0,4253500,323.0,316.0
743,2017/09/06,323.0,321.35,314.0,4419400,324.0,313.0
744,2017/09/07,327.0,326.083,325.0,6189100,330.0,321.0
745,2017/09/08,324.0,326.068,328.0,4839000,329.0,323.0
746,2017/09/11,322.0,322.705,324.0,3328300,325.0,321.0
747,2017/09/12,320.0,321.48,324.0,4329400,324.0,319.0
748,2017/09/13,328.0,327.042,323.0,4083200,329.0,322.0
749,2017/09/14,323.0,323.399,328.0,4346700,328.0,321.0
750,2017/09/15,324.0,323.393,321.0,3510100,325.0,321.0
751,2017/09/19,331.0,329.827,327.0,4535400,333.0,325.0
752,2017/09/20,334.0,335.406,334.0,4300300,338.0,333.0
753,2017/09/21,322.0,325.756,334.0,6484100,335.0,322.0
754,2017/09/22,324.0,322.726,324.0,5311300,326.0,319.0
755,2017/09/25,325.0,326.118,327.0,2888000,329.0,323.0
756,2017/09/26,325.0,324.51,325.0,2614300,326.0,321.0
757,2017/09/27,321.0,321.34,321.0,2444500,324.0,320.0
758,2017/09/28,323.0,321.33,321.0,4326700,324.0,318.0
759,2017/09/29,320.0,319.8,321.0,2946700,321.0,318.0
760,2017/10/02,318.0,317.25,319.0,3416500,320.0,315.0
761,2017/10/03,327.0,322.522,316.0,5180100,327.0,315.0
762,2017/10/04,326.0,326.728,328.0,3745800,328.0,324.0
763,2017/10/05,329.0,327.396,324.0,4202600,330.0,323.0
764,2017/10/06,336.0,333.845,330.0,6554900,337.0,330.0
765,2017/10/10,349.0,346.041,348.0,14509400,353.0,339.0
766,2017/10/11,343.0,345.039,348.0,5713700,349.0,341.0
767,2017/10/12,340.0,340.648,343.0,4219600,343.0,339.0
768,2017/10/13,344.0,342.936,341.0,5809800,346.0,338.0
769,2017/10/16,343.0,344.04,347.0,3407100,347.0,342.0
770,2017/10/17,345.0,345.67,345.0,4362600,349.0,343.0
771,2017/10/18,339.0,339.677,344.0,6122000,345.0,338.0
772,2017/10/19,335.0,335.971,336.0,5362100,339.0,334.0
773,2017/10/20,335.0,335.417,335.0,3243900,338.0,334.0
774,2017/10/23,343.0,343.172,340.0,3543600,345.0,339.0
775,2017/10/24,344.0,343.507,341.0,3903300,346.0,339.0
776,2017/10/25,349.0,349.519,348.0,6963400,352.0,346.0
777,2017/10/26,344.0,345.415,347.0,3268000,349.0,343.0
778,2017/10/27,332.0,336.288,347.0,12268800,352.0,320.0
779,2017/10/30,334.0,332.573,334.0,10730700,335.0,329.0
780,2017/10/31,332.0,332.581,335.0,4987900,336.0,331.0
781,2017/11/01,334.0,335.023,334.0,3565400,337.0,333.0
782,2017/11/02,333.0,333.268,335.0,6381400,338.0,331.0
783,2017/11/06,327.0,327.852,333.0,6073700,333.0,326.0
784,2017/11/07,329.0,328.223,327.0,4620500,331.0,326.0
785,2017/11/08,331.0,328.826,328.0,3064400,332.0,325.0
786,2017/11/09,331.0,331.241,331.0,8688600,336.0,326.0
787,2017/11/10,329.0,328.683,326.0,6002300,332.0,326.0
788,2017/11/13,319.0,322.351,328.0,6137300,328.0,318.0
789,2017/11/14,316.0,315.783,316.0,6036900,318.0,313.0
790,2017/11/15,306.0,307.466,313.0,6976800,314.0,304.0
791,2017/11/16,312.0,310.91,305.0,4456300,314.0,305.0
792,2017/11/17,313.0,315.373,318.0,5605300,319.0,312.0
793,2017/11/20,307.0,309.751,310.0,4846700,314.0,307.0
794,2017/11/21,310.0,310.564,310.0,3359700,314.0,309.0
795,2017/11/22,311.0,311.946,315.0,2465900,316.0,311.0
796,2017/11/24,307.0,307.013,309.0,3347700,309.0,305.0
797,2017/11/27,304.0,305.148,310.0,3699300,310.0,303.0
798,2017/11/28,295.0,296.57,300.0,7064600,300.0,294.0
799,2017/11/29,298.0,297.311,297.0,3240400,299.0,294.0
800,2017/11/30,300.0,299.504,300.0,4054400,301.0,297.0
801,2017/12/01,295.0,297.132,300.0,3942600,302.0,294.0
802,2017/12/04,297.0,297.806,300.0,3165600,301.0,296.0
803,2017/12/05,296.0,295.286,296.0,2307500,296.0,294.0
804,2017/12/06,292.0,293.064,296.0,4410400,296.0,290.0
805,2017/12/07,299.0,297.936,295.0,3860800,301.0,294.0
806,2017/12/08,302.0,301.127,303.0,6675700,305.0,297.0
807,2017/12/11,305.0,304.534,303.0,3453600,306.0,301.0
808,2017/12/12,310.0,308.977,307.0,4532200,311.0,305.0
809,2017/12/13,303.0,306.279,312.0,4012800,312.0,303.0
810,2017/12/14,302.0,301.697,302.0,4344100,304.0,300.0
811,2017/12/15,307.0,306.516,304.0,5374000,309.0,303.0
812,2017/12/18,311.0,309.497,310.0,3469600,312.0,306.0
813,2017/12/19,314.0,312.12,312.0,2944800,314.0,309.0
814,2017/12/20,315.0,315.837,316.0,3336300,318.0,314.0
815,2017/12/21,315.0,313.725,315.0,3188300,315.0,312.0
816,2017/12/22,319.0,317.43,314.0,3210700,320.0,313.0
817,2017/12/25,319.0,319.382,320.0,1504100,321.0,318.0
818,2017/12/26,317.0,317.422,319.0,1411500,320.0,315.0
819,2017/12/27,320.0,320.416,319.0,2319700,322.0,318.0
820,2017/12/28,321.0,321.913,320.0,2734200,324.0,320.0
821,2017/12/29,321.0,322.622,322.0,2261000,325.0,321.0
822,2018/01/04,326.0,324.977,325.0,3267400,327.0,323.0
823,2018/01/05,333.0,331.211,328.0,3848400,334.0,328.0
824,2018/01/09,330.0,329.607,334.0,6152900,335.0,327.0
825,2018/01/10,327.0,327.533,327.0,2854600,329.0,326.0
826,2018/01/11,324.0,323.872,323.0,3841600,326.0,321.0
827,2018/01/12,322.0,323.97,326.0,3304300,328.0,322.0
828,2018/01/15,318.0,319.062,323.0,4246300,324.0,314.0
829,2018/01/16,318.0,316.906,317.0,2536300,318.0,315.0
830,2018/01/17,311.0,311.173,314.0,5207900,315.0,309.0
831,2018/01/18,306.0,306.242,308.0,5786300,309.0,304.0
832,2018/01/19,307.0,304.691,304.0,4572100,308.0,300.0
833,2018/01/22,307.0,306.021,305.0,3117400,307.0,304.0
834,2018/01/23,309.0,308.799,309.0,2604200,310.0,307.0
835,2018/01/24,308.0,308.552,308.0,2018000,310.0,307.0
836,2018/01/25,307.0,307.456,307.0,3117900,310.0,305.0
837,2018/01/26,319.0,317.773,315.0,9069000,321.0,312.0
838,2018/01/29,316.0,316.442,320.0,4914600,321.0,314.0
839,2018/01/30,326.0,319.859,317.0,13290400,327.0,300.0
840,2018/01/31,321.0,323.174,323.0,5396800,326.0,320.0
841,2018/02/01,325.0,323.617,325.0,5102000,327.0,320.0
842,2018/02/02,324.0,323.486,325.0,3024600,326.0,321.0
843,2018/02/05,314.0,314.399,316.0,2873000,318.0,312.0
844,2018/02/06,295.0,295.349,300.0,8694100,302.0,289.0
845,2018/02/07,294.0,300.363,305.0,6259900,308.0,294.0
846,2018/02/08,292.0,291.519,293.0,6887500,294.0,288.0
847,2018/02/09,280.0,280.607,282.0,5602400,284.0,278.0
848,2018/02/13,277.0,280.362,287.0,5856100,288.0,276.0
849,2018/02/14,275.0,275.341,278.0,4697500,279.0,272.0
850,2018/02/15,281.0,280.106,279.0,4095400,282.0,278.0
851,2018/02/16,284.0,283.581,282.0,3708700,285.0,281.0
852,2018/02/19,293.0,291.266,286.0,2841800,294.0,286.0
853,2018/02/20,291.0,291.434,293.0,2448900,293.0,290.0
854,2018/02/21,289.0,288.638,290.0,2818800,291.0,286.0
855,2018/02/22,283.0,282.964,285.0,2924000,286.0,281.0
856,2018/02/23,292.0,287.99,284.0,2999300,292.0,282.0
857,2018/02/26,293.0,293.421,295.0,2402100,296.0,292.0
858,2018/02/27,296.0,296.532,298.0,2497600,299.0,294.0
859,2018/02/28,291.0,292.437,293.0,3422000,295.0,290.0
860,2018/03/01,292.0,291.156,286.0,4200600,294.0,286.0
861,2018/03/02,279.0,280.302,285.0,6108900,285.0,278.0
862,2018/03/05,275.0,275.246,276.0,4117300,278.0,273.0
863,2018/03/06,280.0,280.698,280.0,3302400,283.0,279.0
864,2018/03/07,278.0,277.852,278.0,3271900,281.0,275.0
865,2018/03/08,280.0,278.33,279.0,3104300,280.0,275.0
866,2018/03/09,281.0,280.696,279.0,5503400,285.0,278.0
867,2018/03/12,288.0,287.642,287.0,3233300,290.0,285.0
868,2018/03/13,289.0,286.792,286.0,2403800,290.0,283.0
869,2018/03/14,292.0,291.157,288.0,4180600,294.0,287.0
870,2018/03/15,291.0,290.681,290.0,2803800,293.0,287.0
871,2018/03/16,288.0,288.954,291.0,3377500,291.0,287.0
872,2018/03/19,281.0,283.135,285.0,3239600,289.0,280.0
873,2018/03/20,285.0,283.718,278.0,3372700,286.0,277.0
874,2018/03/22,283.0,283.683,286.0,3218100,287.0,282.0
875,2018/03/23,272.0,273.19,276.0,5361100,278.0,270.0
876,2018/03/26,269.0,267.97,270.0,4130400,271.0,264.0
877,2018/03/27,279.0,276.468,272.0,4206800,279.0,271.0
878,2018/03/28,273.0,270.736,268.0,5376200,274.0,266.0
879,2018/03/29,274.0,273.607,274.0,3503300,277.0,272.0
880,2018/03/30,285.0,283.291,278.0,4738400,286.0,278.0
881,2018/04/02,284.0,284.999,283.0,2768300,287.0,283.0
882,2018/04/03,285.0,284.257,280.0,3495400,287.0,280.0
883,2018/04/04,279.0,280.034,285.0,4032700,285.0,278.0
884,2018/04/05,277.0,277.829,279.0,4806000,280.0,276.0
885,2018/04/06,276.0,276.599,277.0,3973900,279.0,275.0
886,2018/04/09,275.0,274.933,275.0,3828700,277.0,272.0
887,2018/04/10,281.0,278.149,275.0,4496500,282.0,274.0
888,2018/04/11,285.0,285.852,285.0,3997700,288.0,283.0
889,2018/04/12,278.0,280.039,284.0,1900300,284.0,278.0
890,2018/04/13,285.0,283.377,280.0,2645900,285.0,279.0
891,2018/04/16,284.0,283.744,285.0,2572700,287.0,281.0
892,2018/04/17,281.0,280.701,283.0,3049900,285.0,278.0
893,2018/04/18,288.0,285.503,284.0,4216100,288.0,282.0
894,2018/04/19,290.0,291.709,290.0,5177900,295.0,289.0
895,2018/04/20,287.0,287.562,287.0,4678900,291.0,285.0
896,2018/04/23,289.0,287.559,286.0,2580100,290.0,284.0
897,2018/04/24,286.0,284.254,286.0,6171700,287.0,281.0
898,2018/04/25,291.0,288.739,283.0,4818100,292.0,282.0
899,2018/04/26,290.0,289.438,292.0,3561300,292.0,287.0
900,2018/04/27,294.0,293.053,292.0,4397700,296.0,289.0
901,2018/05/01,295.0,294.706,291.0,2580100,297.0,291.0
902,2018/05/02,297.0,298.088,296.0,3655500,302.0,295.0
903,2018/05/07,299.0,298.572,300.0,2708400,300.0,297.0
904,2018/05/08,297.0,297.515,298.0,3766500,300.0,296.0
905,2018/05/09,292.0,293.612,295.0,2352400,296.0,292.0
906,2018/05/10,296.0,295.157,292.0,4401400,298.0,288.0
907,2018/05/11,301.0,299.119,298.0,3706800,301.0,297.0
908,2018/05/14,299.0,298.728,300.0,2589600,301.0,297.0
909,2018/05/15,296.0,297.556,298.0,7547200,305.0,293.0
910,2018/05/16,292.0,292.118,293.0,2149500,294.0,291.0
911,2018/05/17,286.0,285.749,289.0,4717700,290.0,283.0
912,2018/05/18,282.0,283.528,287.0,4290500,287.0,281.0
913,2018/05/21,278.0,278.338,280.0,6353100,281.0,277.0
914,2018/05/22,275.0,275.979,280.0,4914800,281.0,274.0
915,2018/05/23,272.0,273.254,275.0,5221900,277.0,271.0
916,2018/05/24,263.0,265.675,270.0,5689200,270.0,263.0
917,2018/05/25,260.0,261.519,263.0,4559400,265.0,259.0
918,2018/05/28,261.0,259.101,259.0,3111300,261.0,257.0
919,2018/05/29,259.0,258.817,261.0,3766100,262.0,256.0
920,2018/05/30,255.0,253.547,255.0,6076400,255.0,251.0
921,2018/05/31,254.0,254.554,257.0,5171400,258.0,252.0
922,2018/06/01,258.0,258.569,254.0,5527300,261.0,254.0
923,2018/06/04,261.0,261.604,263.0,3325500,264.0,260.0
924,2018/06/05,259.0,258.9,261.0,2956000,262.0,257.0
925,2018/06/06,262.0,261.874,257.0,3076300,265.0,257.0
926,2018/06/07,262.0,262.095,264.0,4402700,264.0,260.0
927,2018/06/08,260.0,261.042,260.0,3515000,265.0,259.0
928,2018/06/11,263.0,262.325,261.0,3153800,265.0,259.0
929,2018/06/12,261.0,261.94,264.0,4549300,264.0,260.0
930,2018/06/13,263.0,260.752,260.0,3153900,263.0,257.0
931,2018/06/14,259.0,259.467,259.0,3317200,262.0,258.0
932,2018/06/15,254.0,255.228,258.0,4208400,259.0,253.0
933,2018/06/18,246.0,246.586,250.0,4406100,250.0,244.0
934,2018/06/19,242.0,243.399,243.0,4301500,248.0,242.0
935,2018/06/20,241.0,237.84,238.0,6907800,242.0,233.0
936,2018/06/21,238.0,239.064,239.0,4514300,243.0,237.0
937,2018/06/22,245.0,243.411,237.0,7971500,246.0,236.0
938,2018/06/25,245.0,245.331,246.0,3210900,248.0,243.0
939,2018/06/26,245.0,243.366,242.0,3148500,246.0,239.0
940,2018/06/27,242.0,244.135,249.0,2523900,250.0,241.0
941,2018/06/28,245.0,244.142,244.0,2746700,246.0,242.0
942,2018/06/29,249.0,248.104,250.0,3802800,250.0,244.0
943,2018/07/02,245.0,246.067,248.0,4291000,251.0,243.0
944,2018/07/03,246.0,245.359,245.0,4203100,247.0,243.0
945,2018/07/04,245.0,246.612,246.0,2719500,251.0,245.0
946,2018/07/05,240.0,240.341,243.0,3065300,243.0,238.0
947,2018/07/06,243.0,242.318,239.0,3087800,244.0,239.0
948,2018/07/09,244.0,242.352,242.0,1816600,244.0,240.0
949,2018/07/10,246.0,246.98,246.0,3266700,249.0,245.0
950,2018/07/11,240.0,240.532,243.0,3826800,243.0,239.0
951,2018/07/12,238.0,238.214,239.0,2239600,240.0,236.0
952,2018/07/13,241.0,239.277,238.0,3626800,242.0,236.0
953,2018/07/17,243.0,241.859,239.0,3131800,244.0,238.0
954,2018/07/18,243.0,244.215,245.0,1514300,246.0,242.0
955,2018/07/19,244.0,244.97,244.0,2592200,247.0,243.0
956,2018/07/20,242.0,241.158,242.0,3470100,243.0,239.0
957,2018/07/23,240.0,239.271,239.0,3290000,241.0,237.0
958,2018/07/24,245.0,243.295,241.0,2854500,246.0,240.0
959,2018/07/25,246.0,246.289,247.0,3898900,248.0,245.0
960,2018/07/26,246.0,246.332,247.0,3090400,248.0,245.0
961,2018/07/27,245.0,244.542,246.0,3688000,246.0,243.0
962,2018/07/30,251.0,250.217,248.0,11455800,256.0,245.0
963,2018/07/31,252.0,253.996,256.0,6127200,257.0,252.0
964,2018/08/01,250.0,250.175,251.0,3788100,252.0,249.0
965,2018/08/02,243.0,244.347,247.0,5338900,247.0,242.0
966,2018/08/03,241.0,240.634,242.0,2994500,242.0,239.0
967,2018/08/06,237.0,237.023,239.0,5009100,239.0,235.0
968,2018/08/07,238.0,236.169,235.0,4611700,239.0,233.0
969,2018/08/08,236.0,236.25,236.0,3817600,238.0,235.0
970,2018/08/09,232.0,233.256,235.0,4574700,236.0,231.0
971,2018/08/10,236.0,234.566,231.0,6258200,237.0,230.0
972,2018/08/13,230.0,231.436,233.0,2945000,234.0,230.0
973,2018/08/14,234.0,232.42,230.0,2696300,234.0,229.0
974,2018/08/15,230.0,231.14,233.0,1793500,234.0,230.0
975,2018/08/16,226.0,227.421,228.0,4402800,229.0,226.0
976,2018/08/17,228.0,226.768,227.0,3716600,228.0,225.0
977,2018/08/20,231.0,230.265,231.0,5127500,232.0,227.0
978,2018/08/21,233.0,231.503,229.0,4481800,234.0,228.0
979,2018/08/22,239.0,236.563,232.0,4047800,240.0,232.0
980,2018/08/23,239.0,238.511,238.0,4408700,241.0,235.0
981,2018/08/24,235.0,235.656,239.0,2832400,239.0,234.0
982,2018/08/27,239.0,238.675,237.0,2831700,240.0,236.0
983,2018/08/28,240.0,241.643,243.0,2587000,244.0,240.0
984,2018/08/29,245.0,243.55,240.0,2801000,245.0,239.0
985,2018/08/30,246.0,246.563,248.0,3234600,248.0,245.0
986,2018/08/31,245.0,245.147,245.0,4107100,248.0,244.0
987,2018/09/03,243.0,242.597,245.0,2444800,246.0,241.0
988,2018/09/04,240.0,240.926,242.0,1983800,243.0,239.0
989,2018/09/05,241.0,240.595,238.0,2378300,243.0,238.0
990,2018/09/06,238.0,239.4,239.0,2157800,243.0,237.0
991,2018/09/07,238.0,236.85,236.0,2445100,238.0,235.0
992,2018/09/10,238.0,238.463,238.0,1653900,241.0,237.0
993,2018/09/11,238.0,238.637,241.0,2211700,241.0,237.0
994,2018/09/12,235.0,235.699,237.0,3047900,238.0,235.0
995,2018/09/13,241.0,239.276,234.0,3054200,241.0,234.0
996,2018/09/14,238.0,238.441,240.0,6269300,242.0,236.0
997,2018/09/18,245.0,243.356,238.0,6361000,248.0,236.0
998,2018/09/19,247.0,247.568,248.0,5823600,249.0,246.0
999,2018/09/20,249.0,248.977,250.0,4377900,251.0,247.0
1000,2018/09/21,258.0,255.851,251.0,6081700,258.0,251.0
1001,2018/09/25,259.0,259.824,259.0,5302400,263.0,257.0
1002,2018/09/26,252.0,252.624,256.0,4284400,256.0,251.0
1003,2018/09/27,252.0,251.758,253.0,3596300,253.0,250.0
1004,2018/09/28,254.0,253.27,253.0,2970300,255.0,250.0
1005,2018/10/01,253.0,254.17,254.0,2439200,257.0,252.0
1006,2018/10/02,255.0,254.86,254.0,3516400,256.0,253.0
1007,2018/10/03,251.0,252.993,255.0,3452400,257.0,250.0
1008,2018/10/04,252.0,251.828,251.0,2683300,253.0,250.0
1009,2018/10/05,244.0,245.795,248.0,3989900,249.0,243.0
1010,2018/10/09,240.0,240.787,242.0,2828500,243.0,239.0
1011,2018/10/10,241.0,240.981,241.0,2525300,244.0,239.0
1012,2018/10/11,233.0,232.701,233.0,4760800,234.0,231.0
1013,2018/10/12,235.0,233.224,231.0,2944300,235.0,230.0
1014,2018/10/15,233.0,233.1,234.0,3718200,235.0,231.0
1015,2018/10/16,236.0,235.37,232.0,2974600,238.0,232.0
1016,2018/10/17,240.0,239.019,240.0,2170100,240.0,237.0
1017,2018/10/18,238.0,238.458,240.0,2579600,241.0,236.0
1018,2018/10/19,235.0,235.117,234.0,2697300,237.0,233.0
1019,2018/10/22,237.0,236.167,236.0,1951600,238.0,233.0
1020,2018/10/23,231.0,232.494,236.0,2559900,236.0,231.0
1021,2018/10/24,229.0,229.611,231.0,3042100,232.0,227.0
1022,2018/10/25,220.0,221.954,222.0,4138000,225.0,220.0
1023,2018/10/26,218.0,219.468,222.0,3885300,224.0,216.0
1024,2018/10/29,221.0,220.733,219.0,2537700,223.0,218.0
1025,2018/10/30,225.0,223.571,219.0,6217800,227.0,219.0
1026,2018/10/31,238.0,233.798,230.0,4438800,238.0,228.0
1027,2018/11/01,241.0,239.791,237.0,3987400,242.0,235.0
1028,2018/11/02,249.0,246.187,243.0,5430600,250.0,242.0
1029,2018/11/05,248.0,247.578,247.0,3540500,249.0,244.0
1030,2018/11/06,251.0,250.53,247.0,3200100,253.0,246.0
1031,2018/11/07,249.0,250.22,252.0,4889400,253.0,248.0
1032,2018/11/08,248.0,249.921,252.0,3158100,253.0,247.0
1033,2018/11/09,248.0,248.305,246.0,2839700,251.0,246.0
1034,2018/11/12,247.0,245.636,246.0,1562600,248.0,243.0
1035,2018/11/13,242.0,240.852,241.0,3256800,243.0,239.0
1036,2018/11/14,244.0,243.794,243.0,2380100,245.0,241.0
1037,2018/11/15,242.0,241.689,242.0,2716100,243.0,240.0
1038,2018/11/16,243.0,242.579,244.0,2767300,244.0,241.0
1039,2018/11/19,248.0,246.378,244.0,3048900,248.0,244.0
1040,2018/11/20,242.0,245.684,248.0,6077400,251.0,242.0
1041,2018/11/21,232.0,234.319,238.0,5707500,238.0,232.0
1042,2018/11/22,233.0,235.336,234.0,5544800,239.0,232.0
1043,2018/11/26,233.0,233.611,233.0,5648600,237.0,231.0
1044,2018/11/27,240.0,238.319,239.0,3636600,241.0,236.0
1045,2018/11/28,245.0,243.96,243.0,3297100,246.0,241.0
1046,2018/11/29,249.0,248.808,249.0,2920100,251.0,247.0
1047,2018/11/30,254.0,252.808,250.0,4405900,255.0,249.0
1048,2018/12/03,252.0,253.574,254.0,3574600,256.0,252.0
1049,2018/12/04,247.0,248.815,254.0,3078000,254.0,246.0
1050,2018/12/05,245.0,243.988,242.0,3243700,246.0,241.0
1051,2018/12/06,241.0,241.216,244.0,3541400,246.0,239.0
1052,2018/12/07,239.0,239.508,240.0,2682900,243.0,237.0
1053,2018/12/10,236.0,235.753,238.0,3081200,238.0,234.0
1054,2018/12/11,236.0,233.638,235.0,4221200,236.0,231.0
1055,2018/12/12,233.0,233.593,235.0,4583500,236.0,232.0
1056,2018/12/13,237.0,237.664,235.0,3793100,240.0,235.0
1057,2018/12/14,233.0,235.466,237.0,5170100,239.0,232.0
1058,2018/12/17,232.0,233.353,232.0,3058800,237.0,232.0
1059,2018/12/18,232.0,230.99,230.0,2859800,233.0,227.0
1060,2018/12/19,226.0,227.948,227.0,3697400,231.0,226.0
1061,2018/12/20,219.0,221.787,227.0,4039400,227.0,218.0
1062,2018/12/21,216.0,216.359,220.0,4852700,221.0,214.0
1063,2018/12/25,204.0,205.389,204.0,4345000,208.0,200.0
1064,2018/12/26,212.0,211.553,211.0,5361200,215.0,209.0
1065,2018/12/27,222.0,222.848,224.0,4862800,225.0,221.0
1066,2018/12/28,223.0,223.746,222.0,5098000,227.0,221.0
1067,2019/01/04,217.0,215.729,216.0,2541700,219.0,211.0
1068,2019/01/07,224.0,225.216,225.0,3155800,228.0,223.0
1069,2019/01/08,227.0,226.913,223.0,3398000,229.0,223.0
1070,2019/01/09,227.0,227.627,230.0,2281300,230.0,226.0
1071,2019/01/10,221.0,221.021,222.0,4500400,223.0,219.0
1072,2019/01/11,221.0,220.8,220.0,2775500,223.0,220.0
1073,2019/01/15,228.0,224.725,218.0,3660000,228.0,218.0
1074,2019/01/16,223.0,224.872,227.0,2704900,229.0,223.0
1075,2019/01/17,226.0,226.383,225.0,3386300,229.0,224.0
1076,2019/01/18,229.0,228.727,226.0,2268300,230.0,226.0
1077,2019/01/21,229.0,230.624,233.0,2158500,234.0,229.0
1078,2019/01/22,225.0,226.047,228.0,2655800,229.0,224.0
1079,2019/01/23,223.0,222.856,222.0,2634400,225.0,221.0
1080,2019/01/24,224.0,224.375,224.0,1764600,227.0,222.0
1081,2019/01/25,228.0,226.966,227.0,1534400,228.0,225.0
1082,2019/01/28,227.0,227.37,228.0,1225200,229.0,226.0
1083,2019/01/29,231.0,230.683,230.0,2990100,233.0,228.0
1084,2019/01/30,231.0,231.803,232.0,4659600,235.0,228.0
1085,2019/01/31,241.0,239.737,234.0,5281500,243.0,234.0
1086,2019/02/01,237.0,238.158,241.0,3106700,242.0,237.0
1087,2019/02/04,239.0,239.328,238.0,2514400,241.0,238.0
1088,2019/02/05,242.0,240.951,239.0,2494200,243.0,236.0
1089,2019/02/06,246.0,244.677,243.0,3704500,247.0,241.0
1090,2019/02/07,239.0,241.353,244.0,2245100,245.0,239.0
1091,2019/02/08,232.0,233.871,235.0,2537500,237.0,232.0
1092,2019/02/12,238.0,237.89,235.0,2551400,240.0,234.0
1093,2019/02/13,244.0,242.963,243.0,3114300,245.0,240.0
1094,2019/02/14,241.0,242.676,244.0,1768000,244.0,241.0
1095,2019/02/15,239.0,238.42,238.0,2576100,241.0,235.0
1096,2019/02/18,244.0,243.64,244.0,1604700,245.0,242.0
1097,2019/02/19,244.0,244.904,244.0,2382900,247.0,243.0
1098,2019/02/20,245.0,245.057,246.0,3009600,246.0,244.0
1099,2019/02/21,247.0,247.27,246.0,3511100,250.0,246.0
1100,2019/02/22,246.0,244.221,244.0,2688100,246.0,241.0
1101,2019/02/25,244.0,244.827,246.0,2297700,247.0,244.0
1102,2019/02/26,245.0,246.093,247.0,3611200,248.0,245.0
1103,2019/02/27,247.0,246.865,246.0,2650300,248.0,245.0
1104,2019/02/28,246.0,245.393,247.0,2956300,248.0,242.0
1105,2019/03/01,243.0,242.142,243.0,3932800,245.0,240.0
1106,2019/03/04,244.0,244.758,246.0,2255700,246.0,244.0
1107,2019/03/05,240.0,241.328,243.0,2520500,244.0,240.0
1108,2019/03/06,239.0,239.985,239.0,2299700,242.0,238.0
1109,2019/03/07,233.0,234.84,238.0,3154700,238.0,233.0
1110,2019/03/08,226.0,227.852,229.0,5569500,230.0,226.0
1111,2019/03/11,230.0,228.946,227.0,2287500,231.0,227.0
1112,2019/03/12,238.0,237.162,235.0,3868000,239.0,233.0
1113,2019/03/13,238.0,238.431,239.0,3441800,242.0,235.0
1114,2019/03/14,238.0,239.553,242.0,2557000,243.0,238.0
1115,2019/03/15,240.0,239.678,240.0,2939100,241.0,238.0
1116,2019/03/18,242.0,241.178,242.0,1995000,242.0,239.0
1117,2019/03/19,244.0,243.226,241.0,3412300,245.0,240.0
1118,2019/03/20,246.0,245.676,245.0,1764600,246.0,244.0
1119,2019/03/22,251.0,248.426,247.0,4854800,251.0,245.0
1120,2019/03/25,247.0,245.977,247.0,3987600,248.0,244.0
1121,2019/03/26,255.0,252.927,250.0,4909900,256.0,249.0
1122,2019/03/27,249.0,248.543,253.0,4585100,253.0,246.0
1123,2019/03/28,242.0,242.589,245.0,4669800,247.0,241.0
1124,2019/03/29,243.0,242.223,244.0,2462300,246.0,239.0
1125,2019/04/01,247.0,248.583,246.0,3651800,252.0,245.0
1126,2019/04/02,249.0,251.268,252.0,3386400,254.0,249.0
1127,2019/04/03,254.0,252.409,249.0,2405100,254.0,248.0
1128,2019/04/04,250.0,251.633,253.0,2661800,254.0,250.0
1129,2019/04/05,256.0,255.09,254.0,4372100,256.0,252.0
1130,2019/04/08,250.0,251.183,256.0,2884400,256.0,249.0
1131,2019/04/09,250.0,248.869,249.0,1885100,251.0,246.0
1132,2019/04/10,248.0,247.801,247.0,1800200,249.0,246.0
1133,2019/04/11,248.0,247.274,249.0,2019300,249.0,245.0
1134,2019/04/12,246.0,247.515,250.0,1907400,250.0,246.0
1135,2019/04/15,252.0,252.127,251.0,2560400,254.0,251.0
1136,2019/04/16,250.0,250.397,250.0,1893900,253.0,249.0
1137,2019/04/17,254.0,253.897,254.0,1746600,255.0,252.0
1138,2019/04/18,249.0,251.035,255.0,2429800,255.0,248.0
1139,2019/04/19,251.0,251.195,251.0,1708000,253.0,250.0
1140,2019/04/22,250.0,250.945,252.0,1363900,253.0,249.0
1141,2019/04/23,252.0,252.789,252.0,2914100,255.0,252.0
1142,2019/04/24,248.0,248.739,252.0,3033200,252.0,247.0
1143,2019/04/25,247.0,247.372,246.0,2795200,251.0,244.0
1144,2019/04/26,245.0,244.83,246.0,2098500,247.0,243.0
1145,2019/05/07,240.0,242.614,247.0,2868100,248.0,240.0
1146,2019/05/08,237.0,236.528,235.0,2532200,238.0,234.0
1147,2019/05/09,231.0,232.925,236.0,4100500,237.0,231.0
1148,2019/05/10,233.0,232.762,230.0,4168800,237.0,230.0
1149,2019/05/13,230.0,230.774,231.0,1497300,232.0,230.0
1150,2019/05/14,226.0,229.153,226.0,4656500,237.0,224.0
1151,2019/05/15,236.0,234.917,233.0,3511800,237.0,232.0
1152,2019/05/16,231.0,231.665,234.0,2546600,235.0,229.0
1153,2019/05/17,243.0,241.356,237.0,4492400,245.0,236.0
1154,2019/05/20,240.0,241.043,241.0,2219800,244.0,240.0
1155,2019/05/21,240.0,239.113,239.0,2868500,242.0,237.0
1156,2019/05/22,242.0,242.717,242.0,3167700,244.0,241.0
1157,2019/05/23,242.0,242.155,240.0,2533900,244.0,240.0
1158,2019/05/24,240.0,239.779,239.0,2207900,242.0,237.0
1159,2019/05/27,239.0,239.026,242.0,1675800,242.0,237.0
1160,2019/05/28,232.0,234.286,237.0,4966600,237.0,232.0
1161,2019/05/29,233.0,234.092,232.0,2735000,238.0,232.0
1162,2019/05/30,232.0,232.53,231.0,2197600,235.0,231.0
1163,2019/05/31,230.0,230.329,231.0,2764900,232.0,229.0
1164,2019/06/03,224.0,224.559,226.0,2143900,227.0,222.0
1165,2019/06/04,232.0,229.58,227.0,2712400,232.0,226.0
1166,2019/06/05,238.0,237.011,234.0,2976800,239.0,234.0
1167,2019/06/06,232.0,234.787,239.0,2075000,239.0,232.0
1168,2019/06/07,237.0,236.416,235.0,2579500,238.0,234.0
1169,2019/06/10,238.0,238.548,238.0,1972500,241.0,237.0
1170,2019/06/11,238.0,237.745,237.0,1496900,239.0,236.0
1171,2019/06/12,237.0,237.568,238.0,1268400,239.0,236.0
1172,2019/06/13,235.0,234.776,236.0,2412100,237.0,233.0
1173,2019/06/14,234.0,235.682,237.0,2448600,237.0,234.0
1174,2019/06/17,234.0,232.468,233.0,2008600,234.0,230.0
1175,2019/06/18,231.0,232.398,233.0,2272900,236.0,230.0
1176,2019/06/19,238.0,237.307,234.0,2045200,239.0,234.0
1177,2019/06/20,242.0,239.893,239.0,2385400,242.0,238.0
1178,2019/06/21,236.0,239.023,241.0,3514000,243.0,236.0
1179,2019/06/24,236.0,236.695,238.0,2858400,239.0,235.0
1180,2019/06/25,232.0,233.744,236.0,3415400,237.0,231.0
1181,2019/06/26,231.0,232.547,232.0,2949500,234.0,231.0
1182,2019/06/27,235.0,234.886,234.0,3166500,236.0,233.0
1183,2019/06/28,233.0,233.567,233.0,2563000,235.0,232.0
1184,2019/07/01,237.0,236.538,239.0,2470700,239.0,234.0
1185,2019/07/02,235.0,234.957,236.0,3889300,237.0,233.0
1186,2019/07/03,232.0,231.426,233.0,3419900,234.0,230.0
1187,2019/07/04,230.0,231.088,233.0,3184200,233.0,230.0
1188,2019/07/05,233.0,232.188,231.0,1706400,233.0,231.0
1189,2019/07/08,228.0,229.654,231.0,2783800,233.0,228.0
1190,2019/07/09,230.0,229.236,230.0,3145500,230.0,228.0
1191,2019/07/10,228.0,228.621,228.0,2662100,230.0,227.0
1192,2019/07/11,230.0,229.858,228.0,2088800,232.0,228.0
1193,2019/07/12,232.0,231.64,232.0,2081700,233.0,229.0
1194,2019/07/16,230.0,229.669,232.0,2048700,232.0,228.0
1195,2019/07/17,231.0,230.491,228.0,1924800,232.0,228.0
1196,2019/07/18,223.0,226.008,230.0,2602000,231.0,223.0
1197,2019/07/19,227.0,225.082,224.0,3222300,227.0,222.0
1198,2019/07/22,222.0,222.665,225.0,3832400,226.0,221.0
1199,2019/07/23,226.0,224.395,223.0,3544800,226.0,222.0
1200,2019/07/24,221.0,222.867,225.0,2420300,226.0,221.0
1201,2019/07/25,221.0,221.53,223.0,2483600,223.0,220.0
1202,2019/07/26,218.0,219.588,223.0,3029600,223.0,218.0
1203,2019/07/29,218.0,217.055,218.0,2407600,219.0,215.0
1204,2019/07/30,205.0,210.182,218.0,7460900,221.0,204.0
1205,2019/07/31,200.0,201.882,205.0,5019800,207.0,200.0
1206,2019/08/01,197.0,200.113,200.0,6604400,203.0,197.0
1207,2019/08/02,190.0,191.566,194.0,4225900,195.0,190.0
1208,2019/08/05,184.0,185.12,189.0,3454300,190.0,183.0
1209,2019/08/06,188.0,183.256,177.0,6816500,188.0,177.0
1210,2019/08/07,183.0,184.446,185.0,3416500,187.0,183.0
1211,2019/08/08,183.0,182.939,182.0,1679300,184.0,181.0
1212,2019/08/09,183.0,183.212,184.0,1909700,184.0,182.0
1213,2019/08/13,180.0,179.576,181.0,2588600,182.0,178.0
1214,2019/08/14,183.0,182.464,183.0,2819100,184.0,181.0
1215,2019/08/15,180.0,179.096,177.0,2948100,181.0,177.0
1216,2019/08/16,181.0,180.485,178.0,2940500,182.0,178.0
1217,2019/08/19,183.0,182.475,183.0,2198200,184.0,181.0
1218,2019/08/20,184.0,184.947,188.0,3459300,188.0,182.0
1219,2019/08/21,181.0,182.162,182.0,1744000,184.0,181.0
1220,2019/08/22,181.0,180.342,181.0,3580900,182.0,179.0
1221,2019/08/23,183.0,182.178,181.0,1505500,184.0,180.0
