ds,yhat
2019-08-19,1116.953929995467
2019-08-20,1123.7864313771108
2019-08-21,1135.7570665559872
2019-08-22,1149.9724789949803
2019-08-23,1161.993636678533
2019-08-26,1184.620778065298
2019-08-27,1196.492704586251
2019-08-28,1210.7036042827124
2019-08-29,1224.5879486736621
2019-08-30,1236.41892239066
2019-09-02,1255.2246461493771
2019-09-03,1252.3265959194619
2019-09-04,1244.9957493610648
2019-09-05,1237.6761625156066
2019-09-06,1235.665621611843
2019-09-09,1252.6141145823142
2019-09-10,1247.5161370673304
2019-09-11,1236.0087446817474
2019-09-12,1226.5468907066345
2019-09-13,1227.3571579148
