,Date,Close,VWAP,Open,Volume,High,Low
0,2014/08/25,152.0,151.147,153.0,377500,153.0,150.0
1,2014/08/26,154.0,154.902,152.0,374000,158.0,152.0
2,2014/08/27,154.0,154.842,157.0,148600,157.0,154.0
3,2014/08/28,160.0,157.927,153.0,893600,165.0,152.0
4,2014/08/29,154.0,155.179,158.0,508800,158.0,153.0
5,2014/09/01,157.0,156.779,155.0,234900,159.0,155.0
6,2014/09/02,154.0,156.336,158.0,379600,160.0,154.0
7,2014/09/03,157.0,156.564,155.0,256000,159.0,155.0
8,2014/09/04,155.0,155.638,157.0,93400,157.0,155.0
9,2014/09/05,151.0,152.654,155.0,519000,156.0,150.0
10,2014/09/08,152.0,152.021,153.0,229500,154.0,151.0
11,2014/09/09,154.0,154.852,155.0,484900,157.0,152.0
12,2014/09/10,161.0,156.586,154.0,1123400,162.0,150.0
13,2014/09/11,157.0,159.48,163.0,427000,163.0,156.0
14,2014/09/12,156.0,156.27,157.0,234300,158.0,155.0
15,2014/09/16,153.0,154.006,155.0,178800,155.0,153.0
16,2014/09/17,154.0,153.79,153.0,176100,155.0,153.0
17,2014/09/18,154.0,155.185,157.0,285900,157.0,153.0
18,2014/09/19,155.0,155.076,156.0,134800,156.0,154.0
19,2014/09/22,154.0,154.887,156.0,94600,156.0,154.0
20,2014/09/24,152.0,153.225,154.0,185100,155.0,152.0
21,2014/09/25,153.0,152.618,152.0,120700,154.0,152.0
22,2014/09/26,152.0,152.343,152.0,178300,154.0,152.0
23,2014/09/29,157.0,155.732,154.0,346000,160.0,152.0
24,2014/09/30,154.0,154.654,154.0,161900,157.0,154.0
25,2014/10/01,152.0,153.172,154.0,237100,155.0,152.0
26,2014/10/02,144.0,145.794,148.0,903800,150.0,141.0
27,2014/10/03,148.0,146.124,145.0,226600,149.0,144.0
28,2014/10/06,151.0,150.416,149.0,228500,153.0,149.0
29,2014/10/07,148.0,148.635,151.0,243000,151.0,146.0
30,2014/10/08,144.0,143.397,145.0,329600,146.0,141.0
31,2014/10/09,142.0,143.171,146.0,305200,147.0,141.0
32,2014/10/10,138.0,136.305,137.0,511300,139.0,134.0
33,2014/10/14,135.0,135.302,134.0,348900,139.0,133.0
34,2014/10/15,137.0,136.321,135.0,85600,137.0,135.0
35,2014/10/16,130.0,131.85,134.0,732900,135.0,128.0
36,2014/10/17,131.0,130.746,130.0,330000,133.0,130.0
37,2014/10/20,138.0,136.262,134.0,247000,139.0,133.0
38,2014/10/21,135.0,136.433,136.0,337000,139.0,135.0
39,2014/10/22,140.0,139.181,136.0,243800,142.0,136.0
40,2014/10/23,144.0,143.474,139.0,333400,147.0,139.0
41,2014/10/24,145.0,145.925,146.0,144600,148.0,144.0
42,2014/10/27,147.0,145.683,144.0,162200,148.0,143.0
43,2014/10/28,148.0,148.094,145.0,299700,150.0,145.0
44,2014/10/29,149.0,148.724,150.0,133800,150.0,147.0
45,2014/10/30,145.0,144.113,147.0,476200,148.0,142.0
46,2014/10/31,146.0,144.688,145.0,271700,146.0,142.0
47,2014/11/04,149.0,147.827,148.0,256200,149.0,147.0
48,2014/11/05,148.0,150.207,148.0,324500,154.0,147.0
49,2014/11/06,146.0,146.849,148.0,516900,151.0,141.0
50,2014/11/07,147.0,147.477,146.0,250800,150.0,146.0
51,2014/11/10,142.0,141.589,142.0,197900,143.0,140.0
52,2014/11/11,144.0,143.158,143.0,133900,145.0,141.0
53,2014/11/12,143.0,143.408,143.0,132700,145.0,142.0
54,2014/11/13,152.0,152.306,145.0,1191200,158.0,144.0
55,2014/11/14,148.0,147.521,149.0,440300,151.0,145.0
56,2014/11/17,144.0,144.248,147.0,448300,147.0,141.0
57,2014/11/18,148.0,147.944,144.0,440200,151.0,143.0
58,2014/11/19,155.0,152.609,148.0,798900,156.0,148.0
59,2014/11/20,151.0,158.764,158.0,2887700,167.0,150.0
60,2014/11/21,161.0,154.189,150.0,1182100,161.0,148.0
61,2014/11/25,158.0,160.173,159.0,678300,164.0,157.0
62,2014/11/26,157.0,156.589,157.0,282600,159.0,155.0
63,2014/11/27,154.0,154.997,157.0,445500,158.0,153.0
64,2014/11/28,161.0,159.905,155.0,1088200,163.0,154.0
65,2014/12/01,167.0,165.162,160.0,1514900,169.0,158.0
66,2014/12/02,163.0,167.35,167.0,1416100,172.0,163.0
67,2014/12/03,155.0,159.215,165.0,1270500,166.0,154.0
68,2014/12/04,152.0,152.901,156.0,1011100,157.0,150.0
69,2014/12/05,151.0,151.351,152.0,370800,153.0,150.0
70,2014/12/08,151.0,151.945,151.0,283300,153.0,151.0
71,2014/12/09,150.0,152.886,153.0,497900,156.0,150.0
72,2014/12/10,147.0,147.24,147.0,369900,149.0,146.0
73,2014/12/11,148.0,146.263,144.0,232100,150.0,144.0
74,2014/12/12,149.0,148.79,149.0,121900,150.0,148.0
75,2014/12/15,149.0,149.22,149.0,122100,151.0,147.0
76,2014/12/16,139.0,142.333,147.0,702800,148.0,139.0
77,2014/12/17,142.0,140.209,138.0,352000,144.0,137.0
78,2014/12/18,150.0,152.463,148.0,3160300,165.0,146.0
79,2014/12/19,149.0,149.102,151.0,533400,152.0,147.0
80,2014/12/22,147.0,146.853,148.0,284900,148.0,146.0
81,2014/12/24,142.0,143.81,147.0,485100,147.0,142.0
82,2014/12/25,142.0,145.224,145.0,1437300,153.0,141.0
83,2014/12/26,146.0,144.492,142.0,384200,146.0,141.0
84,2014/12/29,146.0,145.617,147.0,262600,147.0,145.0
85,2014/12/30,146.0,145.042,145.0,238900,147.0,143.0
86,2015/01/05,147.0,145.703,146.0,123400,147.0,145.0
87,2015/01/06,143.0,144.224,145.0,168000,145.0,143.0
88,2015/01/07,142.0,142.565,143.0,181900,144.0,142.0
89,2015/01/08,145.0,143.992,144.0,87800,145.0,143.0
90,2015/01/09,143.0,143.463,146.0,244200,147.0,141.0
91,2015/01/13,145.0,142.989,142.0,162400,145.0,142.0
92,2015/01/14,147.0,146.141,144.0,329100,149.0,143.0
93,2015/01/15,147.0,146.733,146.0,161600,148.0,145.0
94,2015/01/16,142.0,143.316,145.0,283700,146.0,142.0
95,2015/01/19,153.0,152.817,145.0,2594100,159.0,145.0
96,2015/01/20,156.0,155.545,152.0,1494900,161.0,149.0
97,2015/01/21,150.0,153.414,157.0,566000,157.0,150.0
98,2015/01/22,152.0,152.048,151.0,321800,155.0,150.0
99,2015/01/23,152.0,153.528,154.0,344600,157.0,152.0
100,2015/01/26,152.0,152.797,152.0,232200,155.0,151.0
101,2015/01/27,149.0,149.142,153.0,535100,153.0,147.0
102,2015/01/28,148.0,146.724,146.0,585900,149.0,146.0
103,2015/01/29,144.0,145.644,148.0,537400,149.0,144.0
104,2015/01/30,146.0,145.687,146.0,908500,149.0,144.0
105,2015/02/02,146.0,146.341,146.0,172200,148.0,145.0
106,2015/02/03,142.0,145.231,146.0,793100,150.0,141.0
107,2015/02/04,144.0,143.884,144.0,303400,146.0,142.0
108,2015/02/05,142.0,143.181,144.0,182500,145.0,142.0
109,2015/02/06,146.0,144.353,144.0,273100,147.0,142.0
110,2015/02/09,150.0,152.911,153.0,1201900,157.0,149.0
111,2015/02/10,150.0,151.817,150.0,646100,155.0,148.0
112,2015/02/12,152.0,151.908,153.0,347100,154.0,150.0
113,2015/02/13,150.0,150.55,152.0,157200,152.0,149.0
114,2015/02/16,152.0,151.07,150.0,415100,154.0,149.0
115,2015/02/17,153.0,152.054,152.0,208000,153.0,151.0
116,2015/02/18,153.0,154.397,153.0,700400,157.0,151.0
117,2015/02/19,156.0,158.058,154.0,1104900,161.0,154.0
118,2015/02/20,156.0,157.672,156.0,432800,160.0,155.0
119,2015/02/23,159.0,157.612,159.0,288200,159.0,156.0
120,2015/02/24,166.0,166.497,164.0,3795100,173.0,161.0
121,2015/02/25,157.0,162.915,166.0,1189700,169.0,156.0
122,2015/02/26,158.0,160.176,158.0,633300,163.0,157.0
123,2015/02/27,159.0,159.811,158.0,326600,162.0,158.0
124,2015/03/02,155.0,157.521,159.0,758200,163.0,153.0
125,2015/03/03,153.0,152.452,155.0,721900,156.0,151.0
126,2015/03/04,153.0,153.39,151.0,384100,156.0,151.0
127,2015/03/05,158.0,156.107,153.0,415600,159.0,153.0
128,2015/03/06,156.0,157.734,157.0,336300,161.0,155.0
129,2015/03/09,157.0,157.158,156.0,234800,159.0,155.0
130,2015/03/10,158.0,157.728,156.0,253300,160.0,156.0
131,2015/03/11,161.0,158.438,157.0,482700,162.0,154.0
132,2015/03/12,159.0,160.467,162.0,350600,163.0,159.0
133,2015/03/13,159.0,158.597,162.0,441100,163.0,156.0
134,2015/03/16,209.0,188.905,166.0,13353900,209.0,163.0
135,2015/03/17,247.0,265.014,241.0,66701600,289.0,236.0
136,2015/03/18,220.0,225.203,236.0,13386400,241.0,211.0
137,2015/03/19,271.0,265.886,226.0,50536200,294.0,224.0
138,2015/03/20,247.0,256.401,262.0,11390300,272.0,242.0
139,2015/03/23,223.0,240.185,259.0,7595500,263.0,222.0
140,2015/03/24,244.0,240.715,225.0,12622600,253.0,217.0
141,2015/03/25,231.0,232.354,236.0,3720600,242.0,223.0
142,2015/03/26,231.0,230.295,225.0,2727600,239.0,223.0
143,2015/03/27,259.0,273.586,255.0,42805900,299.0,247.0
144,2015/03/30,252.0,280.081,265.0,35560800,305.0,249.0
145,2015/03/31,251.0,255.597,260.0,8218300,270.0,247.0
146,2015/04/01,236.0,234.288,248.0,5840400,253.0,222.0
147,2015/04/02,243.0,243.685,237.0,6700100,261.0,228.0
148,2015/04/03,260.0,253.115,240.0,5034600,264.0,237.0
149,2015/04/06,340.0,329.557,300.0,32100700,340.0,298.0
150,2015/04/07,313.0,346.571,380.0,27895400,387.0,304.0
151,2015/04/08,287.0,302.617,311.0,11369300,325.0,283.0
152,2015/04/09,305.0,308.18,287.0,17855900,329.0,285.0
153,2015/04/10,302.0,306.527,313.0,6494400,316.0,296.0
154,2015/04/13,318.0,336.647,347.0,19290700,360.0,314.0
155,2015/04/14,390.0,368.973,330.0,35049700,398.0,320.0
156,2015/04/15,392.0,397.027,385.0,38748200,419.0,368.0
157,2015/04/16,472.0,437.065,389.0,44922400,472.0,381.0
158,2015/04/17,400.0,432.3,470.0,24051200,480.0,398.0
159,2015/04/20,373.0,382.885,408.0,10336100,417.0,361.0
160,2015/04/21,357.0,369.88,387.0,9083600,392.0,350.0
161,2015/04/22,371.0,370.51,355.0,8095000,386.0,350.0
162,2015/04/23,355.0,357.417,363.0,2689900,368.0,352.0
163,2015/04/24,360.0,358.674,353.0,3533100,372.0,345.0
164,2015/04/27,358.0,357.915,359.0,1863300,367.0,352.0
165,2015/04/28,356.0,362.733,366.0,3766300,376.0,352.0
166,2015/04/30,322.0,330.42,352.0,4538100,353.0,315.0
167,2015/05/01,326.0,313.692,323.0,4044700,332.0,300.0
168,2015/05/07,306.0,306.562,315.0,2710700,319.0,296.0
169,2015/05/08,314.0,327.076,314.0,8784400,347.0,310.0
170,2015/05/11,365.0,350.706,331.0,12286500,371.0,325.0
171,2015/05/12,367.0,366.47,361.0,10483700,381.0,349.0
172,2015/05/13,363.0,376.542,372.0,8844600,389.0,360.0
173,2015/05/14,337.0,344.805,363.0,3993500,366.0,333.0
174,2015/05/15,342.0,347.137,345.0,2588600,354.0,340.0
175,2015/05/18,325.0,331.988,344.0,2440500,346.0,320.0
176,2015/05/19,355.0,345.39,322.0,6034800,360.0,316.0
177,2015/05/20,375.0,370.123,365.0,7320500,379.0,357.0
178,2015/05/21,373.0,401.865,371.0,22895400,432.0,365.0
179,2015/05/22,397.0,394.248,373.0,14527000,407.0,372.0
180,2015/05/25,412.0,417.317,415.0,11166400,430.0,407.0
181,2015/05/26,395.0,398.546,406.0,3646600,413.0,389.0
182,2015/05/27,371.0,378.148,395.0,4272800,395.0,366.0
183,2015/05/28,393.0,381.824,376.0,3228000,397.0,371.0
184,2015/05/29,384.0,392.841,386.0,3613300,405.0,382.0
185,2015/06/01,384.0,385.316,384.0,1840100,394.0,377.0
186,2015/06/02,380.0,381.444,381.0,1495700,389.0,376.0
187,2015/06/03,367.0,367.826,380.0,2378500,380.0,362.0
188,2015/06/04,342.0,349.562,367.0,4815800,368.0,331.0
189,2015/06/05,346.0,360.913,380.0,12119400,383.0,337.0
190,2015/06/08,353.0,359.288,369.0,4621000,372.0,350.0
191,2015/06/09,369.0,370.389,360.0,9643500,384.0,358.0
192,2015/06/10,360.0,365.157,373.0,2432300,375.0,352.0
193,2015/06/11,348.0,351.083,365.0,3464200,368.0,338.0
194,2015/06/12,343.0,341.784,344.0,1891300,348.0,337.0
195,2015/06/15,335.0,333.14,338.0,1655400,339.0,329.0
196,2015/06/16,317.0,319.647,324.0,2215700,330.0,313.0
197,2015/06/17,334.0,328.472,321.0,2001700,335.0,320.0
198,2015/06/18,330.0,331.56,340.0,1645200,342.0,319.0
199,2015/06/19,332.0,330.49,325.0,1893100,340.0,316.0
200,2015/06/22,323.0,325.574,331.0,1184200,334.0,321.0
201,2015/06/23,329.0,331.08,331.0,2014100,339.0,321.0
202,2015/06/24,335.0,332.389,331.0,1106400,337.0,328.0
203,2015/06/25,333.0,335.343,331.0,1377300,342.0,330.0
204,2015/06/26,335.0,335.454,332.0,667500,340.0,331.0
205,2015/06/29,325.0,343.53,336.0,8209900,358.0,323.0
206,2015/06/30,316.0,318.575,318.0,2525800,331.0,312.0
207,2015/07/01,317.0,310.768,320.0,1827600,320.0,302.0
208,2015/07/02,312.0,315.132,320.0,1059500,322.0,309.0
209,2015/07/03,307.0,307.185,311.0,928400,313.0,304.0
210,2015/07/06,294.0,299.044,300.0,1324700,309.0,291.0
211,2015/07/07,297.0,295.618,296.0,790300,301.0,292.0
212,2015/07/08,279.0,285.584,299.0,2168800,305.0,272.0
213,2015/07/09,278.0,255.964,256.0,2339800,280.0,212.0
214,2015/07/10,279.0,299.256,310.0,8544200,318.0,278.0
215,2015/07/13,290.0,288.359,287.0,1409100,296.0,281.0
216,2015/07/14,298.0,298.972,296.0,2016200,305.0,292.0
217,2015/07/15,298.0,297.514,299.0,789000,303.0,295.0
218,2015/07/16,295.0,293.289,298.0,656400,298.0,290.0
219,2015/07/17,296.0,293.419,294.0,680800,298.0,291.0
220,2015/07/21,298.0,301.379,300.0,1269100,307.0,297.0
221,2015/07/22,301.0,299.72,298.0,768900,304.0,296.0
222,2015/07/23,295.0,298.773,302.0,1318700,306.0,294.0
223,2015/07/24,289.0,288.912,293.0,866400,294.0,286.0
224,2015/07/27,275.0,277.703,286.0,1089500,286.0,271.0
225,2015/07/28,278.0,270.975,262.0,869600,282.0,262.0
226,2015/07/29,272.0,277.19,281.0,663700,284.0,272.0
227,2015/07/30,310.0,301.891,280.0,5946300,313.0,276.0
228,2015/07/31,305.0,304.587,313.0,2164900,313.0,295.0
229,2015/08/03,285.0,289.918,305.0,1586600,305.0,280.0
230,2015/08/04,289.0,287.658,288.0,668900,292.0,280.0
231,2015/08/05,285.0,285.215,287.0,405700,289.0,283.0
232,2015/08/06,288.0,285.738,284.0,505800,290.0,283.0
233,2015/08/07,287.0,289.834,290.0,689500,295.0,285.0
234,2015/08/10,234.0,236.388,239.0,5202500,249.0,226.0
235,2015/08/11,226.0,228.641,234.0,2190200,234.0,224.0
236,2015/08/12,217.0,218.558,226.0,1887200,227.0,213.0
237,2015/08/13,217.0,219.195,225.0,2177000,230.0,210.0
238,2015/08/14,214.0,215.739,217.0,1093500,221.0,212.0
239,2015/08/17,215.0,217.984,216.0,806200,223.0,213.0
240,2015/08/18,221.0,224.833,215.0,1830000,235.0,214.0
241,2015/08/19,215.0,216.519,216.0,804700,220.0,214.0
242,2015/08/20,213.0,212.943,212.0,532200,216.0,212.0
243,2015/08/21,198.0,200.281,200.0,1408100,206.0,197.0
244,2015/08/24,174.0,180.326,188.0,2481000,195.0,171.0
245,2015/08/25,167.0,173.752,164.0,2413700,189.0,160.0
246,2015/08/26,196.0,198.468,180.0,5764900,215.0,175.0
247,2015/08/27,198.0,203.13,201.0,2670700,214.0,196.0
248,2015/08/28,200.0,201.968,205.0,1055800,207.0,198.0
249,2015/08/31,200.0,201.129,199.0,751400,206.0,198.0
250,2015/09/01,189.0,194.374,198.0,758700,199.0,187.0
251,2015/09/02,187.0,183.926,180.0,818700,192.0,178.0
252,2015/09/03,188.0,189.518,191.0,394800,192.0,187.0
253,2015/09/04,175.0,177.893,190.0,746000,190.0,173.0
254,2015/09/07,177.0,174.999,171.0,700600,186.0,168.0
255,2015/09/08,173.0,175.941,175.0,350200,180.0,172.0
256,2015/09/09,184.0,181.649,180.0,559400,186.0,178.0
257,2015/09/10,190.0,185.9,179.0,499400,191.0,178.0
258,2015/09/11,198.0,198.28,195.0,1243200,203.0,192.0
259,2015/09/14,205.0,213.033,218.0,3135800,222.0,201.0
260,2015/09/15,196.0,200.628,201.0,819200,207.0,196.0
261,2015/09/16,195.0,197.396,200.0,397000,200.0,194.0
262,2015/09/17,196.0,193.407,192.0,328300,198.0,190.0
263,2015/09/18,193.0,192.88,192.0,242300,196.0,191.0
264,2015/09/24,179.0,183.189,192.0,568200,192.0,178.0
265,2015/09/25,179.0,177.815,180.0,438000,184.0,174.0
266,2015/09/28,183.0,180.448,179.0,409500,184.0,176.0
267,2015/09/29,172.0,173.146,176.0,612600,179.0,169.0
268,2015/09/30,176.0,175.05,174.0,220500,177.0,173.0
269,2015/10/01,176.0,177.114,180.0,297800,180.0,175.0
270,2015/10/02,178.0,180.165,174.0,494900,187.0,173.0
271,2015/10/05,184.0,185.712,182.0,571600,189.0,182.0
272,2015/10/06,191.0,194.713,188.0,1824000,203.0,185.0
273,2015/10/07,196.0,194.244,187.0,857900,201.0,187.0
274,2015/10/08,195.0,194.015,199.0,519200,200.0,190.0
275,2015/10/09,191.0,191.638,192.0,360100,194.0,189.0
276,2015/10/13,188.0,190.555,193.0,334800,194.0,188.0
277,2015/10/14,181.0,183.738,187.0,484700,188.0,181.0
278,2015/10/15,181.0,180.904,178.0,389100,185.0,176.0
279,2015/10/16,185.0,184.09,180.0,579100,188.0,180.0
280,2015/10/19,183.0,183.863,187.0,346500,188.0,181.0
281,2015/10/20,180.0,179.983,184.0,318800,184.0,178.0
282,2015/10/21,181.0,180.944,178.0,322900,184.0,178.0
283,2015/10/22,183.0,182.455,182.0,308900,185.0,180.0
284,2015/10/23,188.0,186.153,184.0,491000,189.0,184.0
285,2015/10/26,190.0,191.26,193.0,629300,194.0,188.0
286,2015/10/27,185.0,185.73,188.0,359600,190.0,183.0
287,2015/10/28,180.0,181.701,184.0,457200,185.0,179.0
288,2015/10/29,180.0,180.67,181.0,151000,183.0,179.0
289,2015/10/30,180.0,179.579,180.0,284000,183.0,178.0
290,2015/11/02,180.0,179.518,181.0,220200,181.0,178.0
291,2015/11/04,177.0,177.284,180.0,270600,180.0,176.0
292,2015/11/05,170.0,172.602,177.0,644600,179.0,169.0
293,2015/11/06,175.0,173.709,170.0,440400,176.0,170.0
294,2015/11/09,174.0,172.698,172.0,479500,178.0,168.0
295,2015/11/10,181.0,177.775,174.0,413700,181.0,174.0
296,2015/11/11,180.0,180.383,182.0,329500,184.0,178.0
297,2015/11/12,176.0,177.27,180.0,382700,182.0,175.0
298,2015/11/13,176.0,175.724,175.0,285500,178.0,174.0
299,2015/11/16,172.0,172.502,172.0,189200,175.0,171.0
300,2015/11/17,173.0,172.176,174.0,298400,175.0,171.0
301,2015/11/18,174.0,173.753,174.0,327800,177.0,172.0
302,2015/11/19,177.0,176.04,174.0,316500,178.0,173.0
303,2015/11/20,184.0,181.23,174.0,1013700,185.0,174.0
304,2015/11/24,190.0,187.82,184.0,1034500,191.0,184.0
305,2015/11/25,201.0,209.791,200.0,11837100,224.0,195.0
306,2015/11/26,200.0,198.582,201.0,1863500,203.0,195.0
307,2015/11/27,198.0,199.849,200.0,1052700,204.0,197.0
308,2015/11/30,212.0,211.594,202.0,3655800,218.0,199.0
309,2015/12/01,208.0,212.791,212.0,1536700,219.0,208.0
310,2015/12/02,226.0,220.309,214.0,4202400,228.0,211.0
311,2015/12/03,229.0,232.649,228.0,7747900,243.0,224.0
312,2015/12/04,220.0,222.05,223.0,1397800,226.0,219.0
313,2015/12/07,230.0,227.919,227.0,1630300,233.0,222.0
314,2015/12/08,223.0,228.372,235.0,1975800,237.0,220.0
315,2015/12/09,217.0,220.421,218.0,2015400,230.0,213.0
316,2015/12/10,210.0,211.182,211.0,1025800,217.0,206.0
317,2015/12/11,205.0,209.674,211.0,650500,214.0,205.0
318,2015/12/14,203.0,200.989,204.0,637400,204.0,197.0
319,2015/12/15,191.0,198.518,201.0,1060100,207.0,191.0
320,2015/12/16,228.0,225.319,196.0,11991100,235.0,195.0
321,2015/12/17,225.0,227.998,236.0,7866300,240.0,216.0
322,2015/12/18,217.0,224.006,229.0,2572300,233.0,212.0
323,2015/12/21,210.0,211.987,213.0,1296300,221.0,206.0
324,2015/12/22,207.0,213.911,213.0,1174400,220.0,207.0
325,2015/12/24,191.0,197.754,210.0,1528700,210.0,191.0
326,2015/12/25,182.0,186.147,192.0,1723800,192.0,182.0
327,2015/12/28,193.0,191.26,188.0,883200,194.0,188.0
328,2015/12/29,194.0,192.13,192.0,805500,196.0,188.0
329,2015/12/30,202.0,199.037,194.0,1283600,203.0,193.0
330,2016/01/04,210.0,209.346,201.0,2175600,220.0,200.0
331,2016/01/05,209.0,206.447,209.0,1290700,211.0,201.0
332,2016/01/06,227.0,227.698,212.0,7094900,241.0,208.0
333,2016/01/07,222.0,231.991,234.0,9792600,244.0,217.0
334,2016/01/08,213.0,211.717,217.0,2756400,218.0,206.0
335,2016/01/12,198.0,203.101,210.0,1847700,215.0,194.0
336,2016/01/13,203.0,203.762,205.0,851500,207.0,201.0
337,2016/01/14,193.0,188.669,194.0,2035600,194.0,184.0
338,2016/01/15,184.0,189.294,198.0,1282900,199.0,183.0
339,2016/01/18,180.0,175.13,171.0,1037000,183.0,170.0
340,2016/01/19,183.0,181.535,177.0,579800,186.0,176.0
341,2016/01/20,174.0,177.46,184.0,940000,186.0,172.0
342,2016/01/21,164.0,170.774,171.0,1413700,180.0,163.0
343,2016/01/22,176.0,171.641,170.0,670600,176.0,168.0
344,2016/01/25,177.0,177.643,180.0,622700,181.0,174.0
345,2016/01/26,174.0,175.214,173.0,681300,180.0,170.0
346,2016/01/27,177.0,177.67,179.0,636700,180.0,174.0
347,2016/01/28,177.0,178.617,176.0,678200,183.0,175.0
348,2016/01/29,179.0,177.38,177.0,701400,181.0,175.0
349,2016/02/01,183.0,182.228,182.0,598900,184.0,180.0
350,2016/02/02,182.0,182.328,182.0,352700,184.0,180.0
351,2016/02/03,184.0,190.736,187.0,3999200,201.0,182.0
352,2016/02/04,177.0,180.495,189.0,1316300,189.0,176.0
353,2016/02/05,168.0,168.731,172.0,859000,174.0,164.0
354,2016/02/08,170.0,168.429,163.0,420100,173.0,163.0
355,2016/02/09,158.0,161.274,163.0,564200,167.0,158.0
356,2016/02/10,149.0,150.251,160.0,1029200,162.0,143.0
357,2016/02/12,123.0,130.788,138.0,2088100,140.0,123.0
358,2016/02/15,133.0,133.714,138.0,874300,138.0,128.0
359,2016/02/16,135.0,135.502,130.0,1093600,141.0,129.0
360,2016/02/17,143.0,145.962,131.0,3362300,158.0,131.0
361,2016/02/18,146.0,147.526,149.0,1011100,151.0,145.0
362,2016/02/19,148.0,146.678,148.0,465600,149.0,144.0
363,2016/02/22,148.0,149.58,149.0,740000,155.0,146.0
364,2016/02/23,146.0,147.863,149.0,548900,151.0,146.0
365,2016/02/24,147.0,145.85,144.0,547000,150.0,141.0
366,2016/02/25,151.0,150.657,149.0,504000,154.0,148.0
367,2016/02/26,148.0,150.11,152.0,363100,154.0,148.0
368,2016/02/29,149.0,151.439,150.0,504300,154.0,149.0
369,2016/03/01,155.0,152.975,150.0,780400,158.0,147.0
370,2016/03/02,160.0,162.303,165.0,1299100,166.0,158.0
371,2016/03/03,160.0,163.432,159.0,795600,167.0,159.0
372,2016/03/04,165.0,164.339,161.0,605200,167.0,161.0
373,2016/03/07,168.0,166.993,170.0,671500,170.0,165.0
374,2016/03/08,167.0,165.278,168.0,741400,170.0,160.0
375,2016/03/09,163.0,163.268,165.0,406000,166.0,161.0
376,2016/03/10,167.0,166.564,164.0,498600,170.0,163.0
377,2016/03/11,167.0,167.301,163.0,374400,170.0,163.0
378,2016/03/14,179.0,178.104,172.0,2735700,183.0,169.0
379,2016/03/15,180.0,185.442,187.0,2677300,193.0,180.0
380,2016/03/16,187.0,181.282,180.0,1020500,187.0,175.0
381,2016/03/17,180.0,184.542,189.0,1790500,191.0,176.0
382,2016/03/18,179.0,178.92,177.0,314800,183.0,177.0
383,2016/03/22,182.0,182.091,179.0,927100,186.0,179.0
384,2016/03/23,181.0,182.546,184.0,617700,186.0,180.0
385,2016/03/24,180.0,179.786,181.0,340700,182.0,178.0
386,2016/03/25,177.0,178.141,179.0,346500,180.0,176.0
387,2016/03/28,172.0,173.51,176.0,488100,176.0,171.0
388,2016/03/29,178.0,179.785,182.0,835700,184.0,176.0
389,2016/03/30,177.0,179.275,175.0,685900,184.0,175.0
390,2016/03/31,181.0,179.882,177.0,388500,182.0,176.0
391,2016/04/01,173.0,178.137,185.0,832100,186.0,172.0
392,2016/04/04,168.0,170.718,171.0,477800,175.0,167.0
393,2016/04/05,157.0,160.144,165.0,842000,167.0,155.0
394,2016/04/06,155.0,155.31,152.0,408800,160.0,152.0
395,2016/04/07,163.0,162.677,158.0,523000,167.0,156.0
396,2016/04/08,166.0,161.791,158.0,358700,168.0,157.0
397,2016/04/11,171.0,167.839,168.0,484700,173.0,162.0
398,2016/04/12,169.0,171.246,171.0,372100,174.0,168.0
399,2016/04/13,174.0,172.039,169.0,381700,175.0,169.0
400,2016/04/14,172.0,174.185,176.0,719500,178.0,170.0
401,2016/04/15,170.0,170.875,171.0,305500,173.0,169.0
402,2016/04/18,166.0,166.086,167.0,393500,168.0,164.0
403,2016/04/19,170.0,169.235,168.0,447000,171.0,167.0
404,2016/04/20,170.0,170.392,172.0,319700,173.0,168.0
405,2016/04/21,178.0,175.733,171.0,820100,179.0,170.0
406,2016/04/22,185.0,180.944,175.0,1373100,186.0,175.0
407,2016/04/25,235.0,235.0,235.0,770100,235.0,235.0
408,2016/04/26,227.0,272.734,283.0,48228300,309.0,220.0
409,2016/04/27,220.0,230.476,238.0,10799500,250.0,216.0
410,2016/04/28,198.0,205.35,217.0,4710300,222.0,195.0
411,2016/05/02,195.0,197.171,193.0,2790500,205.0,191.0
412,2016/05/06,210.0,210.53,200.0,7549300,222.0,193.0
413,2016/05/09,204.0,206.582,208.0,1497500,213.0,200.0
414,2016/05/10,211.0,212.899,210.0,2606100,220.0,206.0
415,2016/05/11,204.0,207.536,209.0,1042400,213.0,204.0
416,2016/05/12,214.0,225.024,220.0,10921100,234.0,213.0
417,2016/05/13,214.0,216.984,216.0,2418700,229.0,210.0
418,2016/05/16,200.0,205.062,209.0,1515600,211.0,200.0
419,2016/05/17,202.0,200.211,196.0,1366600,208.0,195.0
420,2016/05/18,195.0,196.903,202.0,1158000,205.0,190.0
421,2016/05/19,201.0,199.67,199.0,1372000,205.0,195.0
422,2016/05/20,207.0,207.489,205.0,1738700,213.0,203.0
423,2016/05/23,215.0,209.504,207.0,1493400,215.0,203.0
424,2016/05/24,227.0,222.378,216.0,3904500,229.0,212.0
425,2016/05/25,217.0,222.579,231.0,2665200,232.0,217.0
426,2016/05/26,222.0,217.96,219.0,1084500,223.0,212.0
427,2016/05/27,216.0,217.918,219.0,578400,221.0,216.0
428,2016/05/30,220.0,219.084,215.0,761500,222.0,215.0
429,2016/05/31,219.0,218.621,220.0,426600,221.0,217.0
430,2016/06/01,214.0,216.56,219.0,536200,220.0,212.0
431,2016/06/02,210.0,211.001,216.0,749300,217.0,206.0
432,2016/06/03,214.0,214.875,210.0,528700,218.0,209.0
433,2016/06/06,204.0,205.581,207.0,880800,210.0,202.0
434,2016/06/07,212.0,208.881,206.0,387200,212.0,206.0
435,2016/06/08,208.0,208.93,210.0,473600,214.0,206.0
436,2016/06/09,209.0,210.564,208.0,527400,214.0,208.0
437,2016/06/10,208.0,206.983,208.0,320500,210.0,205.0
438,2016/06/13,199.0,199.352,204.0,862700,204.0,196.0
439,2016/06/14,192.0,191.194,196.0,1187100,198.0,186.0
440,2016/06/15,196.0,192.694,188.0,376200,197.0,188.0
441,2016/06/16,180.0,184.247,196.0,677400,196.0,179.0
442,2016/06/17,182.0,182.442,183.0,482700,187.0,178.0
443,2016/06/20,198.0,207.194,185.0,7627600,219.0,185.0
444,2016/06/21,207.0,203.079,200.0,1373900,208.0,198.0
445,2016/06/22,209.0,224.93,235.0,14417900,242.0,208.0
446,2016/06/23,201.0,203.013,208.0,2005700,210.0,199.0
447,2016/06/24,175.0,184.949,205.0,2979100,205.0,166.0
448,2016/06/27,182.0,182.125,180.0,1085200,186.0,179.0
449,2016/06/28,191.0,185.665,182.0,865400,191.0,180.0
450,2016/06/29,191.0,191.917,194.0,1370600,197.0,187.0
451,2016/06/30,189.0,190.543,193.0,756800,195.0,187.0
452,2016/07/01,192.0,190.917,189.0,831900,194.0,188.0
453,2016/07/04,199.0,196.335,191.0,829500,200.0,190.0
454,2016/07/05,195.0,195.183,198.0,581000,199.0,193.0
455,2016/07/06,193.0,191.309,190.0,655300,194.0,188.0
456,2016/07/07,188.0,191.263,195.0,489000,196.0,188.0
457,2016/07/08,183.0,186.098,188.0,710300,192.0,181.0
458,2016/07/11,188.0,187.221,185.0,497900,191.0,183.0
459,2016/07/12,193.0,194.214,191.0,1350400,200.0,191.0
460,2016/07/13,194.0,195.313,197.0,704000,198.0,193.0
461,2016/07/14,202.0,199.275,193.0,1048200,203.0,193.0
462,2016/07/15,194.0,197.007,201.0,886900,203.0,194.0
463,2016/07/19,191.0,194.244,197.0,977100,201.0,190.0
464,2016/07/20,190.0,191.322,192.0,484100,195.0,189.0
465,2016/07/21,191.0,190.145,191.0,328900,192.0,189.0
466,2016/07/22,189.0,188.548,190.0,313200,191.0,187.0
467,2016/07/25,189.0,190.99,190.0,397200,194.0,188.0
468,2016/07/26,188.0,189.116,190.0,624100,194.0,186.0
469,2016/07/27,189.0,190.076,189.0,288200,192.0,188.0
470,2016/07/28,184.0,185.833,189.0,496200,189.0,184.0
471,2016/07/29,186.0,182.112,185.0,474800,186.0,179.0
472,2016/08/01,186.0,185.061,184.0,321600,188.0,182.0
473,2016/08/02,188.0,186.386,184.0,379500,189.0,183.0
474,2016/08/03,183.0,183.24,186.0,352500,187.0,180.0
475,2016/08/04,183.0,182.21,181.0,247400,185.0,181.0
476,2016/08/05,182.0,183.562,183.0,451600,186.0,182.0
477,2016/08/08,183.0,185.714,185.0,912700,193.0,182.0
478,2016/08/09,185.0,185.188,184.0,193500,186.0,183.0
479,2016/08/10,187.0,185.005,185.0,259900,187.0,183.0
480,2016/08/12,186.0,185.995,188.0,465000,189.0,184.0
481,2016/08/15,185.0,184.725,185.0,224900,187.0,183.0
482,2016/08/16,183.0,184.64,186.0,178800,186.0,183.0
483,2016/08/17,180.0,181.966,183.0,266200,184.0,180.0
484,2016/08/18,180.0,180.953,181.0,178800,183.0,180.0
485,2016/08/19,182.0,181.638,182.0,134900,183.0,181.0
486,2016/08/22,186.0,182.328,182.0,473100,188.0,180.0
487,2016/08/23,185.0,186.039,186.0,375400,189.0,183.0
488,2016/08/24,182.0,183.404,185.0,231300,186.0,182.0
489,2016/08/25,183.0,183.129,183.0,178000,185.0,182.0
490,2016/08/26,181.0,181.639,183.0,285600,185.0,180.0
491,2016/08/29,183.0,182.036,182.0,124100,183.0,181.0
492,2016/08/30,182.0,182.367,184.0,291400,184.0,181.0
493,2016/08/31,184.0,182.59,184.0,306500,185.0,181.0
494,2016/09/01,182.0,182.364,183.0,130500,184.0,182.0
495,2016/09/02,181.0,181.793,182.0,137700,184.0,181.0
496,2016/09/05,183.0,182.634,183.0,311300,185.0,181.0
497,2016/09/06,187.0,184.381,182.0,640300,187.0,181.0
498,2016/09/07,188.0,186.958,186.0,487600,190.0,184.0
499,2016/09/08,194.0,191.143,190.0,1019400,194.0,186.0
500,2016/09/09,201.0,196.289,193.0,1662500,202.0,190.0
501,2016/09/12,204.0,198.546,195.0,2585300,205.0,191.0
502,2016/09/13,201.0,202.011,206.0,1564300,207.0,198.0
503,2016/09/14,191.0,195.096,198.0,1401100,201.0,189.0
504,2016/09/15,191.0,189.774,189.0,360700,193.0,187.0
505,2016/09/16,196.0,193.533,189.0,814600,198.0,188.0
506,2016/09/20,193.0,195.816,195.0,931800,202.0,192.0
507,2016/09/21,194.0,191.204,192.0,406600,194.0,189.0
508,2016/09/23,203.0,199.348,197.0,1460500,203.0,195.0
509,2016/09/26,215.0,213.559,211.0,3953000,221.0,207.0
510,2016/09/27,215.0,212.355,210.0,1292000,217.0,207.0
511,2016/09/28,222.0,218.17,215.0,1807100,223.0,212.0
512,2016/09/29,217.0,219.053,222.0,933500,223.0,216.0
513,2016/09/30,211.0,211.843,214.0,1138700,216.0,209.0
514,2016/10/03,215.0,213.476,211.0,712500,218.0,209.0
515,2016/10/04,217.0,217.479,216.0,1193100,222.0,212.0
516,2016/10/05,217.0,216.284,216.0,656200,220.0,214.0
517,2016/10/06,224.0,222.092,217.0,2085700,226.0,217.0
518,2016/10/07,222.0,228.529,227.0,4365200,234.0,222.0
519,2016/10/11,224.0,221.836,219.0,794100,227.0,218.0
520,2016/10/12,222.0,223.581,224.0,573100,227.0,221.0
521,2016/10/13,214.0,215.6,222.0,1427200,223.0,211.0
522,2016/10/14,210.0,212.865,213.0,615100,218.0,210.0
523,2016/10/17,217.0,214.483,211.0,635400,219.0,210.0
524,2016/10/18,218.0,215.692,215.0,736500,219.0,213.0
525,2016/10/19,219.0,219.143,219.0,849700,222.0,217.0
526,2016/10/20,219.0,218.754,220.0,443000,221.0,217.0
527,2016/10/21,233.0,231.375,222.0,4256600,240.0,220.0
528,2016/10/24,237.0,235.944,239.0,3091100,240.0,229.0
529,2016/10/25,226.0,228.492,236.0,1845500,237.0,225.0
530,2016/10/26,222.0,227.269,226.0,3043900,237.0,220.0
531,2016/10/27,224.0,223.254,223.0,1091000,227.0,218.0
532,2016/10/28,222.0,222.858,226.0,760100,227.0,220.0
533,2016/10/31,224.0,223.575,222.0,472100,226.0,221.0
534,2016/11/01,214.0,217.877,223.0,1085100,224.0,214.0
535,2016/11/02,205.0,206.272,208.0,1271800,211.0,203.0
536,2016/11/04,202.0,201.241,200.0,650400,204.0,200.0
537,2016/11/07,215.0,216.467,216.0,2470100,223.0,212.0
538,2016/11/08,211.0,213.89,215.0,596800,219.0,210.0
539,2016/11/09,201.0,210.713,217.0,2636300,225.0,194.0
540,2016/11/10,215.0,215.227,216.0,774300,218.0,212.0
541,2016/11/11,212.0,213.133,214.0,560700,216.0,211.0
542,2016/11/14,214.0,215.054,217.0,834000,217.0,212.0
543,2016/11/15,214.0,213.032,215.0,840500,217.0,211.0
544,2016/11/16,222.0,220.562,220.0,1842800,223.0,217.0
545,2016/11/17,221.0,219.254,220.0,653400,221.0,218.0
546,2016/11/18,220.0,221.21,223.0,860400,224.0,219.0
547,2016/11/21,226.0,224.672,222.0,1443100,228.0,219.0
548,2016/11/22,224.0,223.322,223.0,1219500,226.0,221.0
549,2016/11/24,224.0,223.601,224.0,800200,226.0,222.0
550,2016/11/25,217.0,219.709,223.0,1239300,226.0,214.0
551,2016/11/28,218.0,218.944,220.0,593300,222.0,216.0
552,2016/11/29,221.0,221.757,218.0,1140600,226.0,217.0
553,2016/11/30,224.0,224.706,226.0,1126800,228.0,222.0
554,2016/12/01,225.0,228.574,228.0,2796300,233.0,224.0
555,2016/12/02,220.0,221.767,225.0,1223500,228.0,218.0
556,2016/12/05,220.0,219.428,222.0,463600,222.0,218.0
557,2016/12/06,220.0,220.326,222.0,353700,222.0,219.0
558,2016/12/07,222.0,223.286,223.0,808800,226.0,221.0
559,2016/12/08,220.0,220.594,223.0,625300,224.0,218.0
560,2016/12/09,237.0,229.96,222.0,2553400,237.0,220.0
561,2016/12/12,233.0,237.483,242.0,2436000,244.0,231.0
562,2016/12/13,240.0,236.414,230.0,1460800,241.0,228.0
563,2016/12/14,245.0,246.893,242.0,4869900,253.0,236.0
564,2016/12/15,243.0,246.305,245.0,1737800,253.0,241.0
565,2016/12/16,237.0,241.935,250.0,1535300,250.0,234.0
566,2016/12/19,237.0,236.765,235.0,613700,241.0,233.0
567,2016/12/20,240.0,238.337,237.0,815500,242.0,234.0
568,2016/12/21,234.0,236.475,240.0,1062200,241.0,230.0
569,2016/12/22,229.0,229.82,230.0,1140800,234.0,228.0
570,2016/12/26,232.0,233.75,233.0,805400,237.0,230.0
571,2016/12/27,229.0,229.859,232.0,736800,233.0,226.0
572,2016/12/28,232.0,233.708,231.0,668300,236.0,230.0
573,2016/12/29,227.0,228.685,233.0,708600,233.0,226.0
574,2016/12/30,230.0,228.197,225.0,980800,233.0,223.0
575,2017/01/04,244.0,239.877,232.0,2606700,246.0,232.0
576,2017/01/05,249.0,247.14,245.0,2379900,250.0,241.0
577,2017/01/06,243.0,250.893,257.0,2772400,258.0,243.0
578,2017/01/10,266.0,263.76,248.0,19131900,284.0,245.0
579,2017/01/11,257.0,258.58,262.0,3868800,265.0,254.0
580,2017/01/12,268.0,266.87,271.0,8864900,281.0,257.0
581,2017/01/13,274.0,277.06,279.0,9081900,287.0,270.0
582,2017/01/16,268.0,271.903,273.0,2427900,280.0,268.0
583,2017/01/17,260.0,259.951,265.0,2952100,269.0,252.0
584,2017/01/18,265.0,257.279,255.0,1612700,265.0,253.0
585,2017/01/19,259.0,268.158,273.0,5179600,276.0,258.0
586,2017/01/20,260.0,260.558,259.0,992800,265.0,257.0
587,2017/01/23,264.0,262.946,262.0,1022600,266.0,260.0
588,2017/01/24,273.0,268.212,264.0,1772100,273.0,261.0
589,2017/01/25,282.0,278.118,275.0,3901000,284.0,271.0
590,2017/01/26,279.0,282.301,284.0,2741900,288.0,276.0
591,2017/01/27,271.0,273.569,279.0,1805400,279.0,269.0
592,2017/01/30,279.0,275.99,271.0,1490100,281.0,269.0
593,2017/01/31,272.0,273.987,278.0,1144900,278.0,271.0
594,2017/02/01,272.0,271.828,269.0,1067600,277.0,266.0
595,2017/02/02,264.0,267.346,270.0,1218200,273.0,263.0
596,2017/02/03,264.0,265.154,265.0,681200,269.0,262.0
597,2017/02/06,277.0,272.556,268.0,1615900,278.0,265.0
598,2017/02/07,279.0,276.153,273.0,1991900,282.0,270.0
599,2017/02/08,276.0,278.338,280.0,1872700,283.0,273.0
600,2017/02/09,283.0,283.041,279.0,4418800,287.0,278.0
601,2017/02/10,274.0,279.484,288.0,3280700,288.0,272.0
602,2017/02/13,300.0,293.017,278.0,10033900,304.0,277.0
603,2017/02/14,304.0,302.957,301.0,6008300,310.0,294.0
604,2017/02/15,310.0,303.229,303.0,3009300,310.0,297.0
605,2017/02/16,304.0,311.761,314.0,4796600,318.0,304.0
606,2017/02/17,308.0,305.297,305.0,2061300,312.0,297.0
607,2017/02/20,314.0,314.418,312.0,2546000,318.0,311.0
608,2017/02/21,324.0,325.251,319.0,5834400,332.0,316.0
609,2017/02/22,320.0,321.858,323.0,2385700,329.0,317.0
610,2017/02/23,313.0,313.927,320.0,1918700,321.0,310.0
611,2017/02/24,312.0,311.157,310.0,1128200,314.0,308.0
612,2017/02/27,305.0,302.216,304.0,2470000,309.0,297.0
613,2017/02/28,309.0,308.752,306.0,1603300,312.0,306.0
614,2017/03/01,304.0,305.95,312.0,1527500,313.0,298.0
615,2017/03/02,309.0,306.382,307.0,1182300,310.0,303.0
616,2017/03/03,305.0,306.312,305.0,675000,309.0,304.0
617,2017/03/06,321.0,316.315,309.0,2353900,321.0,308.0
618,2017/03/07,316.0,319.26,324.0,1994400,326.0,315.0
619,2017/03/08,321.0,318.855,317.0,1469600,322.0,313.0
620,2017/03/09,314.0,316.485,321.0,1147200,321.0,313.0
621,2017/03/10,310.0,312.021,314.0,1393700,318.0,309.0
622,2017/03/13,293.0,300.558,311.0,2660000,312.0,292.0
623,2017/03/14,298.0,294.059,289.0,1455200,300.0,286.0
624,2017/03/15,284.0,287.011,296.0,1747200,297.0,279.0
625,2017/03/16,290.0,288.176,285.0,857500,291.0,285.0
626,2017/03/17,288.0,294.939,300.0,2812800,305.0,286.0
627,2017/03/21,290.0,290.669,291.0,820400,294.0,288.0
628,2017/03/22,283.0,284.032,285.0,696200,286.0,282.0
629,2017/03/23,279.0,279.621,283.0,1003100,285.0,277.0
630,2017/03/24,279.0,278.567,277.0,602800,282.0,275.0
631,2017/03/27,272.0,275.19,279.0,674000,282.0,271.0
632,2017/03/28,271.0,272.22,272.0,609200,275.0,269.0
633,2017/03/29,282.0,278.381,271.0,637400,283.0,271.0
634,2017/03/30,276.0,278.31,279.0,1030500,285.0,273.0
635,2017/03/31,269.0,272.682,274.0,1074300,278.0,268.0
636,2017/04/03,264.0,265.384,266.0,875000,270.0,262.0
637,2017/04/04,254.0,256.021,260.0,1443400,264.0,250.0
638,2017/04/05,255.0,252.477,254.0,827900,260.0,247.0
639,2017/04/06,241.0,243.066,250.0,1626900,252.0,236.0
640,2017/04/07,248.0,245.105,243.0,1234300,250.0,237.0
641,2017/04/10,245.0,245.71,246.0,572100,249.0,243.0
642,2017/04/11,240.0,240.033,242.0,707100,244.0,236.0
643,2017/04/12,227.0,227.338,233.0,1387200,235.0,222.0
644,2017/04/13,229.0,225.239,219.0,846300,233.0,219.0
645,2017/04/14,222.0,225.21,222.0,613300,230.0,221.0
646,2017/04/17,234.0,231.805,226.0,1317200,241.0,222.0
647,2017/04/18,237.0,235.871,239.0,918100,240.0,232.0
648,2017/04/19,237.0,237.014,235.0,442300,240.0,235.0
649,2017/04/20,235.0,236.359,240.0,460400,240.0,234.0
650,2017/04/21,231.0,234.554,238.0,719000,238.0,231.0
651,2017/04/24,227.0,230.447,235.0,749500,238.0,227.0
652,2017/04/25,232.0,230.359,226.0,592100,234.0,226.0
653,2017/04/26,239.0,237.581,235.0,818600,242.0,233.0
654,2017/04/27,244.0,241.692,239.0,709500,246.0,237.0
655,2017/04/28,239.0,242.537,247.0,765800,248.0,238.0
656,2017/05/01,243.0,242.748,239.0,374400,245.0,239.0
657,2017/05/02,249.0,247.394,249.0,849200,250.0,244.0
658,2017/05/08,251.0,251.053,252.0,986700,253.0,249.0
659,2017/05/09,250.0,250.836,254.0,533800,254.0,248.0
660,2017/05/10,256.0,250.873,250.0,804200,256.0,246.0
661,2017/05/11,259.0,255.83,264.0,4164100,268.0,247.0
662,2017/05/12,250.0,253.154,256.0,1723900,259.0,249.0
663,2017/05/15,248.0,245.836,250.0,1229000,251.0,241.0
664,2017/05/16,249.0,248.331,249.0,376800,251.0,247.0
665,2017/05/17,251.0,252.038,254.0,1335700,256.0,248.0
666,2017/05/18,248.0,244.391,244.0,853100,248.0,240.0
667,2017/05/19,247.0,248.725,249.0,406100,251.0,247.0
668,2017/05/22,247.0,248.901,249.0,453400,252.0,247.0
669,2017/05/23,254.0,252.684,248.0,1762700,257.0,246.0
670,2017/05/24,254.0,252.926,257.0,1135400,257.0,250.0
671,2017/05/25,251.0,253.089,256.0,743500,256.0,251.0
672,2017/05/26,247.0,248.574,251.0,1074800,253.0,245.0
673,2017/05/29,243.0,244.103,247.0,789600,248.0,242.0
674,2017/05/30,245.0,242.848,243.0,685900,246.0,240.0
675,2017/05/31,241.0,242.419,245.0,605300,246.0,240.0
676,2017/06/01,245.0,244.349,242.0,540600,247.0,242.0
677,2017/06/02,245.0,249.194,249.0,1989000,255.0,245.0
678,2017/06/05,246.0,246.68,247.0,599400,249.0,245.0
679,2017/06/06,243.0,247.718,253.0,1645800,254.0,242.0
680,2017/06/07,244.0,242.643,243.0,1174300,245.0,241.0
681,2017/06/08,240.0,242.37,244.0,633300,246.0,240.0
682,2017/06/09,240.0,238.87,240.0,707400,241.0,237.0
683,2017/06/12,239.0,237.876,240.0,905100,240.0,235.0
684,2017/06/13,236.0,237.517,239.0,757600,241.0,235.0
685,2017/06/14,241.0,237.856,237.0,977700,242.0,235.0
686,2017/06/15,237.0,238.416,239.0,533700,240.0,236.0
687,2017/06/16,238.0,237.689,237.0,389100,240.0,236.0
688,2017/06/19,243.0,240.899,240.0,875100,244.0,238.0
689,2017/06/20,243.0,242.756,245.0,825700,245.0,241.0
690,2017/06/21,246.0,244.536,242.0,592400,247.0,241.0
691,2017/06/22,254.0,251.017,247.0,1480100,254.0,246.0
692,2017/06/23,243.0,248.416,255.0,1721300,256.0,241.0
693,2017/06/26,261.0,271.077,275.0,12868600,280.0,261.0
694,2017/06/27,257.0,258.312,261.0,3594500,265.0,251.0
695,2017/06/28,251.0,251.321,253.0,1517000,258.0,247.0
696,2017/06/29,253.0,254.236,256.0,1095400,257.0,251.0
697,2017/06/30,253.0,249.662,250.0,942900,254.0,246.0
698,2017/07/03,251.0,250.187,251.0,604000,253.0,248.0
699,2017/07/04,246.0,248.927,251.0,965900,252.0,246.0
700,2017/07/05,258.0,252.969,247.0,1700400,259.0,246.0
701,2017/07/06,250.0,253.292,258.0,1169700,258.0,250.0
702,2017/07/07,253.0,250.147,250.0,724000,253.0,248.0
703,2017/07/10,253.0,252.28,254.0,580100,254.0,251.0
704,2017/07/11,252.0,251.973,253.0,537400,253.0,250.0
705,2017/07/12,261.0,257.376,253.0,1607200,261.0,252.0
706,2017/07/13,257.0,265.323,264.0,4377700,272.0,257.0
707,2017/07/14,266.0,261.512,258.0,1570600,266.0,256.0
708,2017/07/18,256.0,258.366,265.0,1544800,265.0,255.0
709,2017/07/19,255.0,253.751,255.0,921700,256.0,252.0
710,2017/07/20,256.0,256.698,257.0,785200,259.0,255.0
711,2017/07/21,259.0,257.474,256.0,850300,262.0,253.0
712,2017/07/24,256.0,256.305,258.0,716000,258.0,255.0
713,2017/07/25,256.0,255.969,256.0,564700,258.0,255.0
714,2017/07/26,272.0,269.838,257.0,6363800,279.0,257.0
715,2017/07/27,270.0,277.5,283.0,8222600,286.0,267.0
716,2017/07/28,260.0,264.191,272.0,3221900,273.0,258.0
717,2017/07/31,268.0,266.985,266.0,2251700,273.0,262.0
718,2017/08/01,251.0,257.332,266.0,2983800,267.0,251.0
719,2017/08/02,254.0,253.669,252.0,1254300,257.0,251.0
720,2017/08/03,245.0,247.983,255.0,2319700,255.0,245.0
721,2017/08/04,252.0,246.48,243.0,1466300,252.0,240.0
722,2017/08/07,251.0,252.113,253.0,634700,254.0,250.0
723,2017/08/08,253.0,252.993,250.0,1055800,256.0,250.0
724,2017/08/09,254.0,251.824,255.0,1411100,257.0,247.0
725,2017/08/10,195.0,195.224,198.0,10853700,201.0,188.0
726,2017/08/14,191.0,189.436,190.0,1879100,193.0,186.0
727,2017/08/15,194.0,193.854,193.0,1082000,196.0,192.0
728,2017/08/16,198.0,197.344,194.0,1162300,201.0,194.0
729,2017/08/17,205.0,209.955,208.0,3465200,217.0,205.0
730,2017/08/18,219.0,225.913,220.0,12239700,237.0,217.0
731,2017/08/21,211.0,218.262,223.0,2610000,228.0,210.0
732,2017/08/22,208.0,210.018,213.0,1218400,214.0,207.0
733,2017/08/23,209.0,211.94,214.0,1066800,216.0,208.0
734,2017/08/24,211.0,209.069,211.0,894700,212.0,207.0
735,2017/08/25,209.0,211.784,214.0,902700,215.0,209.0
736,2017/08/28,213.0,212.049,210.0,733100,215.0,210.0
737,2017/08/29,210.0,210.414,210.0,558800,212.0,208.0
738,2017/08/30,211.0,212.097,213.0,454200,215.0,210.0
739,2017/08/31,217.0,216.345,212.0,1103800,220.0,212.0
740,2017/09/01,221.0,220.844,216.0,1210200,223.0,216.0
741,2017/09/04,213.0,215.721,219.0,963800,219.0,213.0
742,2017/09/05,208.0,208.563,217.0,1028200,217.0,204.0
743,2017/09/06,205.0,204.368,201.0,950300,210.0,199.0
744,2017/09/07,207.0,206.417,209.0,562000,210.0,204.0
745,2017/09/08,205.0,204.395,205.0,480700,207.0,203.0
746,2017/09/11,206.0,206.331,206.0,460600,209.0,204.0
747,2017/09/12,209.0,207.516,208.0,633300,210.0,205.0
748,2017/09/13,213.0,211.551,208.0,678600,214.0,208.0
749,2017/09/14,207.0,209.64,212.0,561500,213.0,206.0
750,2017/09/15,208.0,206.486,203.0,322800,209.0,203.0
751,2017/09/19,213.0,212.365,210.0,657700,214.0,210.0
752,2017/09/20,218.0,216.06,213.0,885000,219.0,211.0
753,2017/09/21,217.0,218.196,220.0,533500,220.0,216.0
754,2017/09/22,212.0,214.001,217.0,503900,218.0,212.0
755,2017/09/25,223.0,219.169,215.0,875700,223.0,213.0
756,2017/09/26,221.0,219.482,220.0,570600,222.0,217.0
757,2017/09/27,221.0,221.731,221.0,581900,225.0,219.0
758,2017/09/28,225.0,224.012,223.0,680600,227.0,221.0
759,2017/09/29,228.0,227.114,225.0,707500,229.0,224.0
760,2017/10/02,227.0,230.399,233.0,1168200,235.0,226.0
761,2017/10/03,222.0,223.721,229.0,882900,230.0,220.0
762,2017/10/04,220.0,220.007,224.0,706800,224.0,217.0
763,2017/10/05,218.0,217.723,218.0,481000,222.0,215.0
764,2017/10/06,209.0,211.52,216.0,1085800,217.0,209.0
765,2017/10/10,216.0,212.511,208.0,563900,216.0,208.0
766,2017/10/11,215.0,215.329,216.0,229100,217.0,214.0
767,2017/10/12,215.0,216.942,216.0,303600,219.0,215.0
768,2017/10/13,213.0,213.59,216.0,356900,216.0,212.0
769,2017/10/16,215.0,213.534,215.0,311800,216.0,212.0
770,2017/10/17,213.0,214.205,215.0,276700,217.0,212.0
771,2017/10/18,213.0,212.318,212.0,345200,214.0,211.0
772,2017/10/19,212.0,212.691,213.0,324700,215.0,210.0
773,2017/10/20,213.0,214.25,212.0,375600,216.0,212.0
774,2017/10/23,220.0,217.053,214.0,632100,220.0,213.0
775,2017/10/24,216.0,215.567,216.0,468300,217.0,214.0
776,2017/10/25,214.0,215.712,217.0,332500,218.0,214.0
777,2017/10/26,216.0,215.87,216.0,152000,217.0,214.0
778,2017/10/27,216.0,216.356,216.0,512500,220.0,213.0
779,2017/10/30,214.0,215.243,216.0,255000,218.0,214.0
780,2017/10/31,219.0,215.653,214.0,515400,219.0,212.0
781,2017/11/01,214.0,215.149,218.0,410300,218.0,213.0
782,2017/11/02,210.0,212.715,215.0,449400,215.0,210.0
783,2017/11/06,211.0,211.041,211.0,217700,213.0,210.0
784,2017/11/07,206.0,208.255,211.0,540400,212.0,206.0
785,2017/11/08,203.0,203.393,203.0,613500,206.0,202.0
786,2017/11/09,208.0,206.896,202.0,1047000,211.0,202.0
787,2017/11/10,210.0,208.063,204.0,614900,212.0,203.0
788,2017/11/13,215.0,212.639,212.0,472200,215.0,210.0
789,2017/11/14,216.0,215.411,215.0,456800,218.0,212.0
790,2017/11/15,210.0,211.921,215.0,368600,215.0,208.0
791,2017/11/16,210.0,210.771,210.0,194300,213.0,209.0
792,2017/11/17,212.0,210.784,212.0,230000,212.0,209.0
793,2017/11/20,210.0,211.458,211.0,152800,213.0,210.0
794,2017/11/21,220.0,215.166,211.0,758400,220.0,210.0
795,2017/11/22,217.0,217.472,218.0,386800,219.0,216.0
796,2017/11/24,212.0,212.957,215.0,387000,215.0,211.0
797,2017/11/27,211.0,209.886,212.0,559000,215.0,206.0
798,2017/11/28,209.0,208.304,211.0,439600,212.0,206.0
799,2017/11/29,209.0,209.586,208.0,278700,211.0,208.0
800,2017/11/30,212.0,209.911,211.0,327400,212.0,208.0
801,2017/12/01,211.0,210.403,211.0,194300,212.0,209.0
802,2017/12/04,209.0,208.285,209.0,269100,210.0,207.0
803,2017/12/05,207.0,207.384,207.0,347300,209.0,206.0
804,2017/12/06,209.0,206.683,207.0,448000,210.0,204.0
805,2017/12/07,207.0,207.25,209.0,168700,209.0,206.0
806,2017/12/08,206.0,205.961,206.0,202200,207.0,205.0
807,2017/12/11,205.0,205.239,206.0,419400,207.0,205.0
808,2017/12/12,205.0,205.781,205.0,530100,209.0,205.0
809,2017/12/13,206.0,205.687,206.0,271500,207.0,205.0
810,2017/12/14,205.0,205.489,206.0,264500,207.0,204.0
811,2017/12/15,204.0,204.86,205.0,395700,206.0,204.0
812,2017/12/18,202.0,202.738,204.0,513600,204.0,202.0
813,2017/12/19,201.0,202.25,202.0,498600,203.0,201.0
814,2017/12/20,196.0,197.261,200.0,774000,200.0,194.0
815,2017/12/21,198.0,196.218,196.0,666700,198.0,195.0
816,2017/12/22,196.0,197.115,196.0,1797900,202.0,194.0
817,2017/12/25,193.0,194.787,197.0,695000,198.0,193.0
818,2017/12/26,187.0,188.762,190.0,1462800,193.0,185.0
819,2017/12/27,191.0,190.23,186.0,590400,193.0,186.0
820,2017/12/28,187.0,189.112,194.0,457900,194.0,187.0
821,2017/12/29,189.0,188.934,188.0,325800,191.0,188.0
822,2018/01/04,193.0,191.874,191.0,391000,194.0,190.0
823,2018/01/05,195.0,193.27,192.0,472400,196.0,191.0
824,2018/01/09,194.0,194.121,194.0,357300,195.0,193.0
825,2018/01/10,198.0,196.845,195.0,512800,199.0,194.0
826,2018/01/11,203.0,200.783,200.0,868300,204.0,198.0
827,2018/01/12,207.0,206.502,205.0,922900,209.0,205.0
828,2018/01/15,208.0,205.319,207.0,1023100,209.0,200.0
829,2018/01/16,213.0,209.683,207.0,1054100,213.0,205.0
830,2018/01/17,209.0,210.094,212.0,1028400,213.0,206.0
831,2018/01/18,204.0,205.24,206.0,659900,209.0,203.0
832,2018/01/19,203.0,202.76,204.0,302400,205.0,201.0
833,2018/01/22,204.0,201.799,199.0,689500,207.0,198.0
834,2018/01/23,204.0,203.897,205.0,479700,206.0,202.0
835,2018/01/24,205.0,205.08,204.0,258900,206.0,204.0
836,2018/01/25,207.0,204.653,201.0,555900,208.0,201.0
837,2018/01/26,207.0,206.796,205.0,347800,209.0,205.0
838,2018/01/29,208.0,208.293,209.0,275600,209.0,207.0
839,2018/01/30,201.0,202.072,208.0,889700,208.0,199.0
840,2018/01/31,200.0,201.467,200.0,282300,204.0,199.0
841,2018/02/01,204.0,202.891,201.0,367100,205.0,201.0
842,2018/02/02,202.0,202.306,202.0,417800,205.0,201.0
843,2018/02/05,197.0,197.766,197.0,405700,200.0,197.0
844,2018/02/06,178.0,180.902,188.0,1976600,190.0,168.0
845,2018/02/07,178.0,182.228,183.0,793500,187.0,177.0
846,2018/02/08,178.0,178.597,179.0,416700,183.0,176.0
847,2018/02/09,175.0,172.019,170.0,492700,175.0,170.0
848,2018/02/13,182.0,182.028,179.0,678400,186.0,179.0
849,2018/02/14,176.0,178.368,181.0,671700,185.0,173.0
850,2018/02/15,177.0,177.089,177.0,291500,179.0,175.0
851,2018/02/16,178.0,178.738,178.0,436000,181.0,177.0
852,2018/02/19,189.0,185.391,179.0,762000,190.0,179.0
853,2018/02/20,190.0,189.534,190.0,456200,193.0,186.0
854,2018/02/21,190.0,190.256,190.0,372600,193.0,188.0
855,2018/02/22,191.0,188.579,190.0,236000,191.0,187.0
856,2018/02/23,189.0,190.006,191.0,156400,192.0,188.0
857,2018/02/26,189.0,190.383,190.0,119100,192.0,189.0
858,2018/02/27,190.0,191.025,192.0,477200,193.0,189.0
859,2018/02/28,192.0,191.775,190.0,341500,193.0,190.0
860,2018/03/01,190.0,190.428,190.0,332600,192.0,190.0
861,2018/03/02,188.0,186.311,187.0,435900,189.0,185.0
862,2018/03/05,182.0,185.075,188.0,445500,189.0,182.0
863,2018/03/06,186.0,186.849,187.0,178800,189.0,185.0
864,2018/03/07,193.0,195.034,195.0,2064100,200.0,190.0
865,2018/03/08,192.0,192.688,196.0,446300,196.0,190.0
866,2018/03/09,194.0,193.203,193.0,238500,195.0,191.0
867,2018/03/12,197.0,195.289,196.0,405500,197.0,193.0
868,2018/03/13,205.0,201.286,196.0,1003500,205.0,194.0
869,2018/03/14,207.0,204.825,204.0,568500,207.0,202.0
870,2018/03/15,205.0,204.646,208.0,530300,208.0,201.0
871,2018/03/16,198.0,199.392,203.0,637900,205.0,196.0
872,2018/03/19,195.0,195.307,197.0,464200,198.0,193.0
873,2018/03/20,192.0,192.033,194.0,664700,196.0,190.0
874,2018/03/22,196.0,194.278,192.0,252300,196.0,192.0
875,2018/03/23,188.0,189.814,189.0,595400,193.0,187.0
876,2018/03/26,189.0,184.777,184.0,723800,190.0,181.0
877,2018/03/27,190.0,191.149,191.0,227600,194.0,190.0
878,2018/03/28,188.0,190.217,192.0,230600,193.0,188.0
879,2018/03/29,195.0,193.103,190.0,419600,196.0,190.0
880,2018/03/30,196.0,196.397,194.0,347400,199.0,194.0
881,2018/04/02,200.0,199.759,198.0,465900,203.0,196.0
882,2018/04/03,191.0,194.17,195.0,669800,199.0,191.0
883,2018/04/04,189.0,189.317,193.0,552500,193.0,187.0
884,2018/04/05,190.0,190.056,191.0,297200,192.0,187.0
885,2018/04/06,189.0,188.696,190.0,188500,191.0,187.0
886,2018/04/09,189.0,188.093,189.0,124100,190.0,187.0
887,2018/04/10,186.0,186.909,190.0,231300,190.0,185.0
888,2018/04/11,185.0,186.632,187.0,133300,188.0,185.0
889,2018/04/12,185.0,187.063,185.0,266300,190.0,185.0
890,2018/04/13,186.0,186.094,187.0,119800,188.0,185.0
891,2018/04/16,180.0,182.536,186.0,375300,186.0,180.0
892,2018/04/17,180.0,181.483,183.0,275200,184.0,180.0
893,2018/04/18,181.0,181.642,181.0,198600,184.0,180.0
894,2018/04/19,184.0,183.189,182.0,189200,185.0,182.0
895,2018/04/20,183.0,183.238,183.0,81200,184.0,182.0
896,2018/04/23,184.0,185.167,184.0,133800,186.0,183.0
897,2018/04/24,183.0,184.834,184.0,176200,187.0,183.0
898,2018/04/25,184.0,183.74,183.0,71600,185.0,183.0
899,2018/04/26,186.0,185.045,185.0,98300,186.0,184.0
900,2018/04/27,185.0,184.98,186.0,119700,186.0,184.0
901,2018/05/01,183.0,182.953,185.0,124500,185.0,182.0
902,2018/05/02,186.0,184.73,183.0,113500,187.0,183.0
903,2018/05/07,189.0,187.065,187.0,223200,189.0,185.0
904,2018/05/08,193.0,191.017,189.0,345900,193.0,187.0
905,2018/05/09,193.0,192.991,193.0,196300,195.0,191.0
906,2018/05/10,193.0,192.112,194.0,190200,195.0,190.0
907,2018/05/11,193.0,192.316,192.0,184000,195.0,191.0
908,2018/05/14,192.0,189.14,188.0,320300,192.0,185.0
909,2018/05/15,188.0,189.684,190.0,149300,192.0,188.0
910,2018/05/16,192.0,191.481,187.0,658400,196.0,187.0
911,2018/05/17,189.0,189.082,190.0,173800,191.0,188.0
912,2018/05/18,187.0,188.128,189.0,160000,190.0,187.0
913,2018/05/21,191.0,190.04,187.0,277100,193.0,187.0
914,2018/05/22,189.0,190.332,193.0,89000,193.0,189.0
915,2018/05/23,185.0,186.481,189.0,413200,189.0,184.0
916,2018/05/24,188.0,187.235,185.0,178500,189.0,185.0
917,2018/05/25,189.0,187.734,187.0,109300,189.0,186.0
918,2018/05/28,192.0,190.648,191.0,210700,192.0,189.0
919,2018/05/29,188.0,189.159,190.0,253500,191.0,187.0
920,2018/05/30,186.0,185.328,185.0,193200,187.0,184.0
921,2018/05/31,186.0,187.278,187.0,71700,188.0,186.0
922,2018/06/01,188.0,185.891,186.0,186400,188.0,185.0
923,2018/06/04,187.0,188.771,190.0,474200,191.0,186.0
924,2018/06/05,185.0,186.174,188.0,140200,188.0,185.0
925,2018/06/06,185.0,184.822,185.0,143900,186.0,184.0
926,2018/06/07,186.0,185.749,185.0,123000,188.0,184.0
927,2018/06/08,186.0,185.697,186.0,108500,187.0,185.0
928,2018/06/11,184.0,184.285,186.0,165300,186.0,183.0
929,2018/06/12,184.0,184.811,184.0,64700,186.0,184.0
930,2018/06/13,186.0,185.979,185.0,102000,187.0,184.0
931,2018/06/14,185.0,185.615,186.0,129000,187.0,185.0
932,2018/06/15,185.0,186.288,185.0,430300,188.0,184.0
933,2018/06/18,184.0,182.915,184.0,200100,184.0,182.0
934,2018/06/19,181.0,184.569,185.0,915700,188.0,181.0
935,2018/06/20,178.0,177.628,179.0,1009800,182.0,173.0
936,2018/06/21,175.0,177.734,179.0,412700,182.0,175.0
937,2018/06/22,173.0,173.093,175.0,399000,175.0,172.0
938,2018/06/25,169.0,170.639,173.0,388500,174.0,168.0
939,2018/06/26,168.0,168.012,167.0,218100,170.0,167.0
940,2018/06/27,167.0,167.978,169.0,166800,170.0,167.0
941,2018/06/28,164.0,164.736,166.0,232500,167.0,163.0
942,2018/06/29,169.0,166.428,164.0,184000,169.0,164.0
943,2018/07/02,167.0,168.08,167.0,158700,170.0,166.0
944,2018/07/03,166.0,166.956,165.0,101500,169.0,165.0
945,2018/07/04,161.0,163.188,165.0,215600,165.0,161.0
946,2018/07/05,156.0,158.657,163.0,360500,163.0,155.0
947,2018/07/06,167.0,161.9,156.0,392500,167.0,156.0
948,2018/07/09,167.0,167.475,167.0,524000,171.0,164.0
949,2018/07/10,168.0,167.763,165.0,207400,170.0,165.0
950,2018/07/11,169.0,168.517,168.0,232800,170.0,166.0
951,2018/07/12,169.0,168.234,166.0,163400,170.0,166.0
952,2018/07/13,176.0,173.498,167.0,574000,178.0,167.0
953,2018/07/17,179.0,179.339,177.0,487200,182.0,177.0
954,2018/07/18,184.0,183.013,179.0,607800,185.0,179.0
955,2018/07/19,186.0,186.628,184.0,428200,189.0,184.0
956,2018/07/20,184.0,185.625,187.0,183600,188.0,184.0
957,2018/07/23,185.0,183.301,183.0,68800,186.0,182.0
958,2018/07/24,182.0,183.582,185.0,118700,186.0,182.0
959,2018/07/25,182.0,183.282,183.0,128200,185.0,182.0
960,2018/07/26,190.0,188.201,185.0,364600,190.0,182.0
961,2018/07/27,189.0,189.067,188.0,254300,190.0,187.0
962,2018/07/30,192.0,189.42,188.0,330100,192.0,187.0
963,2018/07/31,193.0,192.367,190.0,296000,195.0,189.0
964,2018/08/01,191.0,189.405,192.0,289000,192.0,187.0
965,2018/08/02,191.0,190.626,190.0,189900,192.0,189.0
966,2018/08/03,185.0,187.313,191.0,274900,193.0,184.0
967,2018/08/06,193.0,197.531,189.0,2579400,208.0,189.0
968,2018/08/07,185.0,188.684,191.0,395400,193.0,185.0
969,2018/08/08,187.0,187.674,188.0,208900,190.0,185.0
970,2018/08/09,192.0,186.887,180.0,664100,194.0,179.0
971,2018/08/10,185.0,186.57,189.0,323800,191.0,183.0
972,2018/08/13,181.0,183.045,188.0,263400,188.0,181.0
973,2018/08/14,184.0,182.776,181.0,141200,185.0,181.0
974,2018/08/15,182.0,183.457,184.0,222700,186.0,181.0
975,2018/08/16,185.0,182.991,181.0,195500,185.0,180.0
976,2018/08/17,203.0,200.709,185.0,2490700,210.0,185.0
977,2018/08/20,228.0,221.786,217.0,7686200,229.0,209.0
978,2018/08/21,252.0,248.13,241.0,12009700,257.0,237.0
979,2018/08/22,258.0,245.86,241.0,4822200,258.0,231.0
980,2018/08/23,274.0,267.485,266.0,5892100,274.0,259.0
981,2018/08/24,300.0,287.827,280.0,9008600,300.0,276.0
982,2018/08/27,354.0,335.449,321.0,18729400,358.0,310.0
983,2018/08/28,274.0,303.096,322.0,16282400,330.0,274.0
984,2018/08/29,284.0,281.442,290.0,20471000,306.0,264.0
985,2018/08/30,303.0,300.991,297.0,10474200,310.0,291.0
986,2018/08/31,293.0,289.494,291.0,4884500,295.0,283.0
987,2018/09/03,294.0,297.43,303.0,3871500,306.0,288.0
988,2018/09/04,271.0,272.398,283.0,4920700,283.0,267.0
989,2018/09/05,244.0,254.578,268.0,7229400,271.0,240.0
990,2018/09/06,256.0,246.068,240.0,4179200,259.0,236.0
991,2018/09/07,281.0,265.596,250.0,4702800,282.0,247.0
992,2018/09/10,275.0,283.993,277.0,5046100,296.0,273.0
993,2018/09/11,276.0,276.316,279.0,2327800,284.0,269.0
994,2018/09/12,294.0,282.265,271.0,3004300,296.0,269.0
995,2018/09/13,300.0,298.554,301.0,3738500,304.0,291.0
996,2018/09/14,314.0,312.312,299.0,5374100,324.0,296.0
997,2018/09/18,314.0,315.678,306.0,3789600,328.0,305.0
998,2018/09/19,323.0,322.372,317.0,3071000,329.0,315.0
999,2018/09/20,392.0,374.264,329.0,23464500,403.0,327.0
1000,2018/09/21,388.0,387.46,386.0,10094600,405.0,370.0
1001,2018/09/25,387.0,373.953,378.0,5834400,389.0,353.0
1002,2018/09/26,353.0,365.465,373.0,3548000,384.0,351.0
1003,2018/09/27,329.0,341.132,342.0,4170300,360.0,328.0
1004,2018/09/28,339.0,342.874,336.0,5817700,362.0,330.0
1005,2018/10/01,360.0,355.154,352.0,2664100,365.0,345.0
1006,2018/10/02,335.0,343.03,353.0,2957900,358.0,329.0
1007,2018/10/03,350.0,336.453,328.0,2838300,354.0,321.0
1008,2018/10/04,405.0,387.253,366.0,13617800,414.0,360.0
1009,2018/10/05,395.0,401.657,398.0,10731000,423.0,382.0
1010,2018/10/09,377.0,382.854,394.0,9670000,417.0,344.0
1011,2018/10/10,359.0,369.844,374.0,3472000,386.0,357.0
1012,2018/10/11,345.0,342.975,330.0,3389700,359.0,325.0
1013,2018/10/12,378.0,369.364,350.0,3881200,388.0,342.0
1014,2018/10/15,360.0,374.312,390.0,2688100,392.0,353.0
1015,2018/10/16,348.0,353.928,360.0,3925700,375.0,343.0
1016,2018/10/17,339.0,348.459,353.0,6849000,367.0,331.0
1017,2018/10/18,292.0,307.027,335.0,10224700,342.0,285.0
1018,2018/10/19,312.0,304.852,293.0,6000600,319.0,288.0
1019,2018/10/22,300.0,304.865,310.0,2548800,313.0,300.0
1020,2018/10/23,303.0,296.152,295.0,2139600,306.0,288.0
1021,2018/10/24,298.0,305.068,309.0,1726700,313.0,298.0
1022,2018/10/25,287.0,285.218,279.0,2730800,302.0,276.0
1023,2018/10/26,275.0,284.783,297.0,2229100,300.0,274.0
1024,2018/10/29,275.0,280.223,279.0,2100700,290.0,272.0
1025,2018/10/30,293.0,289.324,276.0,2323900,299.0,272.0
1026,2018/10/31,301.0,302.034,298.0,2155100,312.0,295.0
1027,2018/11/01,285.0,294.907,301.0,1836800,303.0,285.0
1028,2018/11/02,289.0,283.937,284.0,2217500,294.0,276.0
1029,2018/11/05,288.0,287.609,286.0,1414600,293.0,279.0
1030,2018/11/06,281.0,282.869,289.0,1222600,289.0,279.0
1031,2018/11/07,283.0,286.416,281.0,1300200,292.0,277.0
1032,2018/11/08,326.0,334.832,307.0,15809300,358.0,304.0
1033,2018/11/09,319.0,328.142,334.0,4361100,342.0,312.0
1034,2018/11/12,341.0,333.851,323.0,4027900,342.0,322.0
1035,2018/11/13,346.0,346.859,335.0,6220200,365.0,326.0
1036,2018/11/14,352.0,355.418,359.0,3341100,364.0,350.0
1037,2018/11/15,328.0,336.697,342.0,2797300,348.0,325.0
1038,2018/11/16,302.0,314.915,327.0,3973700,336.0,298.0
1039,2018/11/19,325.0,320.296,309.0,3290100,333.0,306.0
1040,2018/11/20,329.0,328.587,319.0,2027600,338.0,318.0
1041,2018/11/21,318.0,324.688,325.0,2391100,337.0,314.0
1042,2018/11/22,315.0,316.726,325.0,1433600,325.0,310.0
1043,2018/11/26,309.0,311.806,314.0,1361300,320.0,307.0
1044,2018/11/27,325.0,316.857,315.0,1597900,326.0,310.0
1045,2018/11/28,357.0,342.817,331.0,4253000,358.0,325.0
1046,2018/11/29,353.0,365.551,357.0,12287500,383.0,338.0
1047,2018/11/30,336.0,344.175,356.0,4449000,363.0,333.0
1048,2018/12/03,338.0,342.595,344.0,2763400,350.0,337.0
1049,2018/12/04,341.0,356.968,351.0,9345700,371.0,338.0
1050,2018/12/05,342.0,338.254,338.0,2417700,343.0,333.0
1051,2018/12/06,328.0,332.146,344.0,3206700,347.0,322.0
1052,2018/12/07,311.0,319.242,331.0,2853900,333.0,310.0
1053,2018/12/10,289.0,297.968,310.0,3520000,319.0,284.0
1054,2018/12/11,291.0,296.377,298.0,2659500,305.0,288.0
1055,2018/12/12,311.0,303.027,298.0,2182200,312.0,294.0
1056,2018/12/13,309.0,311.836,317.0,1915200,318.0,307.0
1057,2018/12/14,303.0,302.693,306.0,1545200,309.0,295.0
1058,2018/12/17,292.0,293.914,295.0,1753700,300.0,288.0
1059,2018/12/18,276.0,279.776,280.0,2522700,291.0,272.0
1060,2018/12/19,289.0,289.16,284.0,2218400,299.0,283.0
1061,2018/12/20,278.0,279.195,292.0,1843300,292.0,272.0
1062,2018/12/21,250.0,249.067,270.0,5704400,272.0,229.0
1063,2018/12/25,266.0,251.976,231.0,4513600,275.0,229.0
1064,2018/12/26,255.0,258.87,264.0,3272700,275.0,242.0
1065,2018/12/27,264.0,266.101,271.0,1934700,272.0,260.0
1066,2018/12/28,282.0,292.43,280.0,5056300,307.0,279.0
1067,2019/01/04,284.0,279.868,274.0,2121500,288.0,273.0
1068,2019/01/07,287.0,293.157,298.0,2381600,302.0,286.0
1069,2019/01/08,287.0,289.019,288.0,1307500,293.0,285.0
1070,2019/01/09,271.0,277.918,288.0,1911800,290.0,269.0
1071,2019/01/10,273.0,267.92,268.0,1086300,274.0,261.0
1072,2019/01/11,267.0,271.125,272.0,1554100,279.0,263.0
1073,2019/01/15,264.0,265.43,263.0,1035800,271.0,262.0
1074,2019/01/16,266.0,269.832,270.0,1196100,277.0,265.0
1075,2019/01/17,265.0,266.419,273.0,1001000,273.0,262.0
1076,2019/01/18,270.0,267.114,266.0,677100,270.0,264.0
1077,2019/01/21,260.0,269.605,278.0,1526500,280.0,260.0
1078,2019/01/22,253.0,254.989,257.0,1329200,263.0,251.0
1079,2019/01/23,264.0,257.11,252.0,1881600,268.0,246.0
1080,2019/01/24,260.0,261.744,267.0,656500,268.0,259.0
1081,2019/01/25,257.0,257.865,260.0,755700,262.0,255.0
1082,2019/01/28,320.0,315.874,300.0,32165300,334.0,295.0
1083,2019/01/29,321.0,310.62,313.0,14559100,324.0,297.0
1084,2019/01/30,332.0,339.695,351.0,15252500,357.0,324.0
1085,2019/01/31,341.0,347.188,339.0,14174400,361.0,332.0
1086,2019/02/01,331.0,337.516,338.0,6732400,350.0,327.0
1087,2019/02/04,328.0,329.909,333.0,3334500,338.0,322.0
1088,2019/02/05,311.0,314.892,320.0,3681300,325.0,308.0
1089,2019/02/06,313.0,313.507,315.0,1949800,318.0,308.0
1090,2019/02/07,316.0,320.314,318.0,4485300,327.0,311.0
1091,2019/02/08,313.0,313.46,307.0,2902700,322.0,306.0
1092,2019/02/12,320.0,318.26,314.0,2743900,322.0,313.0
1093,2019/02/13,293.0,295.884,316.0,6285200,317.0,282.0
1094,2019/02/14,278.0,282.112,288.0,2419400,290.0,278.0
1095,2019/02/15,278.0,279.882,276.0,2349300,286.0,274.0
1096,2019/02/18,286.0,285.966,288.0,1213800,290.0,282.0
1097,2019/02/19,283.0,283.371,283.0,1025300,287.0,280.0
1098,2019/02/20,282.0,283.468,284.0,871000,287.0,281.0
1099,2019/02/21,279.0,280.717,282.0,784700,284.0,279.0
1100,2019/02/22,300.0,294.101,279.0,4543500,313.0,275.0
1101,2019/02/25,321.0,309.259,305.0,5540500,323.0,295.0
1102,2019/02/26,311.0,325.497,329.0,5272100,337.0,309.0
1103,2019/02/27,321.0,316.76,315.0,1970400,323.0,309.0
1104,2019/02/28,331.0,344.636,335.0,12742300,365.0,321.0
1105,2019/03/01,320.0,323.396,326.0,4232400,333.0,315.0
1106,2019/03/04,314.0,318.907,325.0,1957100,326.0,313.0
1107,2019/03/05,328.0,320.011,312.0,2355300,330.0,308.0
1108,2019/03/06,324.0,325.088,325.0,1628800,329.0,320.0
1109,2019/03/07,340.0,341.839,318.0,10389000,355.0,317.0
1110,2019/03/08,331.0,338.848,344.0,6263100,354.0,330.0
1111,2019/03/11,356.0,342.221,335.0,5130600,357.0,331.0
1112,2019/03/12,355.0,362.028,364.0,9955500,378.0,350.0
1113,2019/03/13,369.0,363.705,351.0,5428300,375.0,351.0
1114,2019/03/14,370.0,368.726,371.0,3895100,379.0,362.0
1115,2019/03/15,346.0,358.768,372.0,4312600,373.0,344.0
1116,2019/03/18,346.0,349.599,343.0,2304100,358.0,340.0
1117,2019/03/19,343.0,346.138,353.0,1390600,353.0,342.0
1118,2019/03/20,334.0,339.33,344.0,1824600,348.0,334.0
1119,2019/03/22,335.0,336.247,335.0,1179900,342.0,332.0
1120,2019/03/25,317.0,319.642,322.0,2535700,328.0,313.0
1121,2019/03/26,313.0,318.473,323.0,1225300,324.0,313.0
1122,2019/03/27,325.0,321.469,317.0,1126900,326.0,314.0
1123,2019/03/28,319.0,320.548,325.0,1049000,325.0,317.0
1124,2019/03/29,336.0,324.328,318.0,2132400,337.0,313.0
1125,2019/04/01,339.0,338.115,334.0,1980400,347.0,328.0
1126,2019/04/02,334.0,339.563,344.0,1779500,345.0,333.0
1127,2019/04/03,334.0,334.183,332.0,1097900,343.0,327.0
1128,2019/04/04,335.0,334.349,333.0,739600,338.0,329.0
1129,2019/04/05,342.0,340.559,336.0,1359900,345.0,336.0
1130,2019/04/08,313.0,315.069,323.0,5857800,329.0,304.0
1131,2019/04/09,289.0,294.252,310.0,5170800,311.0,285.0
1132,2019/04/10,294.0,293.754,285.0,3400500,303.0,284.0
1133,2019/04/11,288.0,289.904,292.0,1640700,297.0,287.0
1134,2019/04/12,288.0,290.481,293.0,957500,294.0,288.0
1135,2019/04/15,288.0,290.031,291.0,843200,294.0,288.0
1136,2019/04/16,289.0,294.482,300.0,1407600,302.0,289.0
1137,2019/04/17,280.0,281.715,286.0,1795000,288.0,277.0
1138,2019/04/18,286.0,277.611,278.0,1682800,286.0,272.0
1139,2019/04/19,284.0,285.646,285.0,897500,290.0,283.0
1140,2019/04/22,276.0,278.677,280.0,621700,283.0,276.0
1141,2019/04/23,274.0,276.053,275.0,593800,280.0,274.0
1142,2019/04/24,282.0,280.205,275.0,742300,284.0,274.0
1143,2019/04/25,278.0,279.33,283.0,492300,283.0,277.0
1144,2019/04/26,285.0,282.585,278.0,1034600,288.0,277.0
1145,2019/05/07,284.0,284.771,281.0,652200,289.0,280.0
1146,2019/05/08,280.0,281.333,280.0,734300,285.0,277.0
1147,2019/05/09,283.0,280.712,283.0,845800,286.0,276.0
1148,2019/05/10,289.0,284.862,283.0,1290700,290.0,279.0
1149,2019/05/13,287.0,288.744,285.0,1262100,293.0,284.0
1150,2019/05/14,276.0,278.608,276.0,1123300,283.0,275.0
1151,2019/05/15,268.0,269.218,273.0,951000,274.0,265.0
1152,2019/05/16,256.0,261.282,265.0,1158000,269.0,254.0
1153,2019/05/17,264.0,260.811,257.0,896400,266.0,256.0
1154,2019/05/20,260.0,261.286,262.0,673500,266.0,258.0
1155,2019/05/21,253.0,255.197,260.0,804500,261.0,251.0
1156,2019/05/22,258.0,257.509,255.0,637600,261.0,254.0
1157,2019/05/23,259.0,259.372,270.0,1947300,270.0,254.0
1158,2019/05/24,259.0,259.493,255.0,687700,262.0,255.0
1159,2019/05/27,257.0,258.444,262.0,448600,262.0,256.0
1160,2019/05/28,257.0,255.84,256.0,421100,258.0,254.0
1161,2019/05/29,255.0,255.776,253.0,369300,258.0,253.0
1162,2019/05/30,254.0,255.035,255.0,370600,259.0,253.0
1163,2019/05/31,254.0,254.545,254.0,427400,256.0,253.0
1164,2019/06/03,238.0,244.847,252.0,1155000,253.0,238.0
1165,2019/06/04,238.0,236.532,235.0,1142500,241.0,232.0
1166,2019/06/05,242.0,241.096,243.0,727500,243.0,238.0
1167,2019/06/06,241.0,246.215,243.0,1127800,253.0,240.0
1168,2019/06/07,248.0,247.692,246.0,979600,252.0,243.0
1169,2019/06/10,251.0,253.048,250.0,892900,257.0,249.0
1170,2019/06/11,253.0,257.38,253.0,2418500,267.0,250.0
1171,2019/06/12,248.0,251.041,254.0,1012700,256.0,247.0
1172,2019/06/13,241.0,242.783,246.0,753100,247.0,239.0
1173,2019/06/14,247.0,242.113,238.0,814900,247.0,237.0
1174,2019/06/17,249.0,248.009,252.0,704300,252.0,243.0
1175,2019/06/18,243.0,245.043,246.0,904100,248.0,243.0
1176,2019/06/19,240.0,241.236,243.0,824500,245.0,238.0
1177,2019/06/20,245.0,242.285,241.0,441900,246.0,239.0
1178,2019/06/21,237.0,239.44,243.0,744700,245.0,237.0
1179,2019/06/24,241.0,239.845,239.0,343000,242.0,238.0
1180,2019/06/25,243.0,252.373,246.0,5016400,267.0,242.0
1181,2019/06/26,240.0,241.303,243.0,875200,245.0,239.0
1182,2019/06/27,243.0,241.357,244.0,810900,244.0,239.0
1183,2019/06/28,244.0,242.028,241.0,728600,245.0,239.0
1184,2019/07/01,252.0,249.09,246.0,1216700,253.0,244.0
1185,2019/07/02,250.0,250.069,251.0,622600,252.0,248.0
1186,2019/07/03,251.0,250.069,250.0,970500,253.0,247.0
1187,2019/07/04,256.0,253.539,254.0,778700,256.0,250.0
1188,2019/07/05,262.0,261.152,256.0,1744300,266.0,255.0
1189,2019/07/08,256.0,259.728,264.0,897100,265.0,256.0
1190,2019/07/09,246.0,249.358,253.0,1148600,255.0,246.0
1191,2019/07/10,252.0,249.18,246.0,743800,252.0,245.0
1192,2019/07/11,248.0,249.226,251.0,402000,252.0,248.0
1193,2019/07/12,246.0,245.078,249.0,1040100,250.0,243.0
1194,2019/07/16,243.0,243.508,246.0,500200,247.0,242.0
1195,2019/07/17,245.0,244.309,245.0,474200,247.0,242.0
1196,2019/07/18,240.0,241.901,247.0,817700,247.0,239.0
1197,2019/07/19,243.0,241.907,240.0,422900,244.0,240.0
1198,2019/07/22,238.0,239.613,243.0,630500,244.0,238.0
1199,2019/07/23,237.0,237.78,238.0,775600,241.0,235.0
1200,2019/07/24,233.0,233.843,237.0,1291700,242.0,231.0
1201,2019/07/25,237.0,235.309,232.0,658900,238.0,232.0
1202,2019/07/26,235.0,233.897,235.0,570900,236.0,232.0
1203,2019/07/29,231.0,233.009,233.0,448400,235.0,231.0
1204,2019/07/30,225.0,227.864,231.0,1374500,233.0,224.0
1205,2019/07/31,229.0,225.632,223.0,912700,231.0,221.0
1206,2019/08/01,229.0,227.271,225.0,734700,230.0,224.0
1207,2019/08/02,228.0,227.29,226.0,740400,230.0,225.0
1208,2019/08/05,220.0,220.842,225.0,1227700,226.0,217.0
1209,2019/08/06,223.0,215.787,212.0,1274000,224.0,210.0
1210,2019/08/07,229.0,224.886,222.0,994700,230.0,220.0
1211,2019/08/08,231.0,229.477,230.0,747500,232.0,227.0
1212,2019/08/09,223.0,228.851,232.0,2326500,236.0,217.0
1213,2019/08/13,231.0,228.46,226.0,704200,232.0,222.0
1214,2019/08/14,233.0,232.323,237.0,878300,238.0,228.0
1215,2019/08/15,231.0,229.958,225.0,799100,237.0,225.0
1216,2019/08/16,233.0,233.148,232.0,533700,236.0,230.0
1217,2019/08/19,237.0,234.529,234.0,958900,237.0,231.0
1218,2019/08/20,244.0,241.642,238.0,951600,245.0,237.0
1219,2019/08/21,250.0,247.197,244.0,650600,251.0,241.0
1220,2019/08/22,250.0,252.065,252.0,999400,255.0,250.0
1221,2019/08/23,251.0,249.728,250.0,461200,252.0,248.0
