ds,yhat
2019-08-06,242.0590284428029
2019-08-07,242.307478379698
2019-08-08,242.3588611199021
2019-08-09,240.7571120536137
2019-08-13,227.50620604021873
2019-08-14,227.22147341928996
2019-08-15,227.17997730157606
2019-08-16,226.3527696306161
2019-08-19,220.54121128291325
2019-08-20,219.15020063650616
2019-08-21,218.17445454386367
2019-08-22,217.59327272771168
2019-08-23,217.5945301308468
2019-08-26,220.16867772520666
2019-08-27,220.21025905471325
2019-08-28,219.77138214934232
2019-08-29,219.76652451451315
2019-08-30,220.9895459131203
2019-09-02,227.18307686739746
2019-09-03,227.38816578619614
2019-09-04,227.36925560192185
