,Date,Close,VWAP,Open,Volume,High,Low
0,2014/08/25,2121.0,2106.705,2113.0,17858700,2158.0,2052.0
1,2014/08/26,2010.0,2059.05,2082.0,8958500,2140.0,1992.0
2,2014/08/27,2077.0,2066.856,2060.0,8619600,2112.0,2022.0
3,2014/08/28,1978.0,2017.714,2042.0,6308100,2070.0,1966.0
4,2014/08/29,2030.0,1988.475,1919.0,6442300,2053.0,1910.0
5,2014/09/01,1973.0,1981.135,2052.0,4694400,2052.0,1940.0
6,2014/09/02,1851.0,1881.078,1941.0,5919200,1954.0,1842.0
7,2014/09/03,1886.0,1891.505,1848.0,4709700,1940.0,1807.0
8,2014/09/04,1807.0,1850.525,1898.0,3632900,1928.0,1792.0
9,2014/09/05,1843.0,1784.093,1800.0,5330500,1846.0,1687.0
10,2014/09/08,1746.0,1767.793,1822.0,4392700,1840.0,1735.0
11,2014/09/09,1723.0,1765.832,1711.0,5486800,1839.0,1707.0
12,2014/09/10,1650.0,1673.863,1705.0,3465100,1729.0,1638.0
13,2014/09/11,1803.0,1764.932,1656.0,9802100,1836.0,1656.0
14,2014/09/12,1712.0,1752.591,1798.0,5875100,1830.0,1687.0
15,2014/09/16,1723.0,1743.595,1740.0,4412800,1798.0,1712.0
16,2014/09/17,1754.0,1761.885,1747.0,4490000,1809.0,1720.0
17,2014/09/18,1755.0,1754.115,1749.0,4471200,1794.0,1716.0
18,2014/09/19,1779.0,1764.385,1782.0,3961600,1803.0,1733.0
19,2014/09/22,1704.0,1723.159,1750.0,2928900,1765.0,1701.0
20,2014/09/24,1624.0,1639.37,1657.0,3010800,1676.0,1615.0
21,2014/09/25,1627.0,1630.274,1660.0,2804800,1672.0,1596.0
22,2014/09/26,1665.0,1661.45,1590.0,3645200,1705.0,1589.0
23,2014/09/29,1616.0,1630.838,1676.0,2683400,1684.0,1614.0
24,2014/09/30,1633.0,1635.659,1615.0,2875900,1674.0,1601.0
25,2014/10/01,1574.0,1607.461,1640.0,2115800,1642.0,1568.0
26,2014/10/02,1505.0,1515.432,1494.0,3171000,1570.0,1482.0
27,2014/10/03,1499.0,1472.214,1514.0,4743100,1544.0,1419.0
28,2014/10/06,1576.0,1546.303,1510.0,4060400,1601.0,1478.0
29,2014/10/07,1496.0,1533.81,1552.0,3053400,1592.0,1493.0
30,2014/10/08,1547.0,1524.273,1465.0,4070800,1564.0,1440.0
31,2014/10/09,1443.0,1491.065,1560.0,3716300,1562.0,1435.0
32,2014/10/10,1390.0,1396.127,1426.0,5129900,1478.0,1329.0
33,2014/10/14,1336.0,1357.983,1335.0,3491000,1393.0,1323.0
34,2014/10/15,1390.0,1376.853,1355.0,3400600,1408.0,1340.0
35,2014/10/16,1343.0,1360.426,1330.0,4020600,1415.0,1320.0
36,2014/10/17,1358.0,1378.271,1370.0,3929600,1417.0,1342.0
37,2014/10/20,1469.0,1456.046,1426.0,4108900,1498.0,1408.0
38,2014/10/21,1388.0,1419.898,1488.0,4573300,1490.0,1379.0
39,2014/10/22,1461.0,1430.309,1430.0,4646900,1482.0,1370.0
40,2014/10/23,1541.0,1502.928,1445.0,3473500,1547.0,1435.0
41,2014/10/24,1499.0,1518.88,1540.0,3380700,1567.0,1495.0
42,2014/10/27,1530.0,1527.078,1543.0,3941800,1560.0,1486.0
43,2014/10/28,1617.0,1581.4,1518.0,4224400,1628.0,1515.0
44,2014/10/29,1604.0,1600.289,1619.0,3550300,1639.0,1566.0
45,2014/10/30,1574.0,1600.968,1582.0,6502600,1673.0,1540.0
46,2014/10/31,1613.0,1600.04,1578.0,3404500,1624.0,1568.0
47,2014/11/04,1611.0,1630.261,1643.0,3278500,1657.0,1598.0
48,2014/11/05,1649.0,1633.422,1622.0,2231300,1650.0,1607.0
49,2014/11/06,1662.0,1694.205,1660.0,6400400,1750.0,1624.0
50,2014/11/07,1653.0,1671.659,1698.0,2875200,1707.0,1636.0
51,2014/11/10,1542.0,1545.712,1561.0,3613400,1572.0,1520.0
52,2014/11/11,1473.0,1510.399,1558.0,5846100,1569.0,1466.0
53,2014/11/12,1414.0,1428.876,1465.0,4122000,1473.0,1407.0
54,2014/11/13,1455.0,1466.424,1444.0,9153200,1550.0,1385.0
55,2014/11/14,1514.0,1525.038,1484.0,6374700,1585.0,1475.0
56,2014/11/17,1521.0,1557.122,1600.0,4390600,1618.0,1512.0
57,2014/11/18,1512.0,1527.333,1525.0,3301700,1553.0,1492.0
58,2014/11/19,1448.0,1465.545,1510.0,2933300,1522.0,1435.0
59,2014/11/20,1395.0,1411.712,1435.0,2513000,1438.0,1394.0
60,2014/11/21,1451.0,1426.328,1388.0,2968400,1454.0,1388.0
61,2014/11/25,1457.0,1446.41,1451.0,1874700,1460.0,1422.0
62,2014/11/26,1464.0,1465.597,1438.0,1242200,1483.0,1438.0
63,2014/11/27,1418.0,1424.584,1446.0,1561000,1452.0,1407.0
64,2014/11/28,1413.0,1416.099,1421.0,1187400,1435.0,1401.0
65,2014/12/01,1415.0,1403.279,1400.0,1068400,1417.0,1390.0
66,2014/12/02,1408.0,1404.917,1401.0,657900,1414.0,1395.0
67,2014/12/03,1397.0,1409.083,1409.0,1686800,1435.0,1385.0
68,2014/12/04,1348.0,1358.422,1388.0,2153200,1395.0,1345.0
69,2014/12/05,1394.0,1372.714,1351.0,1941300,1396.0,1334.0
70,2014/12/08,1372.0,1389.477,1405.0,1414800,1414.0,1357.0
71,2014/12/09,1351.0,1354.667,1351.0,1247700,1388.0,1340.0
72,2014/12/10,1293.0,1305.028,1330.0,1896100,1344.0,1278.0
73,2014/12/11,1320.0,1298.007,1263.0,1302600,1338.0,1263.0
74,2014/12/12,1343.0,1335.607,1326.0,896300,1354.0,1317.0
75,2014/12/15,1317.0,1340.674,1335.0,1745900,1375.0,1311.0
76,2014/12/16,1273.0,1284.097,1302.0,1174000,1321.0,1269.0
77,2014/12/17,1258.0,1268.568,1252.0,1363400,1300.0,1245.0
78,2014/12/18,1277.0,1278.717,1276.0,891700,1292.0,1264.0
79,2014/12/19,1328.0,1315.664,1270.0,1699900,1345.0,1270.0
80,2014/12/22,1293.0,1311.525,1351.0,2151200,1370.0,1260.0
81,2014/12/24,1308.0,1310.074,1318.0,1863100,1344.0,1275.0
82,2014/12/25,1310.0,1323.378,1301.0,1419200,1349.0,1297.0
83,2014/12/26,1335.0,1327.169,1300.0,1179600,1347.0,1293.0
84,2014/12/29,1319.0,1329.346,1340.0,1658100,1368.0,1300.0
85,2014/12/30,1305.0,1309.194,1308.0,1061300,1330.0,1298.0
86,2015/01/05,1424.0,1407.878,1321.0,5135900,1461.0,1314.0
87,2015/01/06,1427.0,1419.321,1380.0,3077600,1455.0,1378.0
88,2015/01/07,1388.0,1410.78,1440.0,3024400,1460.0,1367.0
89,2015/01/08,1323.0,1343.377,1390.0,2910000,1403.0,1316.0
90,2015/01/09,1300.0,1309.147,1328.0,1469200,1336.0,1286.0
91,2015/01/13,1302.0,1296.045,1276.0,938600,1315.0,1268.0
92,2015/01/14,1290.0,1304.857,1300.0,1974000,1342.0,1281.0
93,2015/01/15,1262.0,1260.588,1291.0,2148600,1298.0,1238.0
94,2015/01/16,1212.0,1216.021,1244.0,2020800,1258.0,1193.0
95,2015/01/19,1245.0,1271.781,1230.0,5382500,1330.0,1197.0
96,2015/01/20,1207.0,1214.415,1235.0,2272500,1240.0,1198.0
97,2015/01/21,1199.0,1204.045,1210.0,1582800,1225.0,1189.0
98,2015/01/22,1151.0,1146.971,1180.0,2906200,1181.0,1126.0
99,2015/01/23,1145.0,1146.194,1147.0,1144400,1162.0,1130.0
100,2015/01/26,1150.0,1156.32,1140.0,1023700,1190.0,1135.0
101,2015/01/27,1165.0,1162.578,1145.0,1307300,1182.0,1145.0
102,2015/01/28,1176.0,1168.164,1145.0,929700,1183.0,1145.0
103,2015/01/29,1222.0,1261.568,1184.0,8775900,1350.0,1160.0
104,2015/01/30,1234.0,1239.75,1250.0,2302800,1265.0,1216.0
105,2015/02/02,1207.0,1208.879,1215.0,1092700,1232.0,1192.0
106,2015/02/03,1169.0,1182.163,1210.0,1300200,1220.0,1157.0
107,2015/02/04,1173.0,1172.918,1176.0,974000,1192.0,1158.0
108,2015/02/05,1143.0,1145.452,1160.0,1170700,1166.0,1134.0
109,2015/02/06,1160.0,1152.698,1139.0,1245300,1170.0,1138.0
110,2015/02/09,1198.0,1169.926,1169.0,1528200,1198.0,1140.0
111,2015/02/10,1184.0,1171.604,1165.0,1652500,1195.0,1144.0
112,2015/02/12,1201.0,1209.473,1194.0,1961300,1243.0,1190.0
113,2015/02/13,1090.0,1113.649,1134.0,3431200,1159.0,1087.0
114,2015/02/16,1024.0,1034.234,1070.0,3150900,1070.0,1011.0
115,2015/02/17,1047.0,1040.619,1021.0,1526700,1062.0,1016.0
116,2015/02/18,1031.0,1034.706,1041.0,1870000,1050.0,1021.0
117,2015/02/19,1037.0,1043.014,1038.0,1359900,1058.0,1031.0
118,2015/02/20,1044.0,1054.422,1036.0,1629900,1088.0,1035.0
119,2015/02/23,1055.0,1052.77,1044.0,1153900,1073.0,1037.0
120,2015/02/24,1058.0,1059.826,1062.0,931500,1075.0,1048.0
121,2015/02/25,1075.0,1069.94,1054.0,1390600,1094.0,1050.0
122,2015/02/26,1061.0,1063.424,1066.0,934900,1077.0,1056.0
123,2015/02/27,1074.0,1068.87,1056.0,967500,1085.0,1056.0
124,2015/03/02,1140.0,1119.606,1081.0,2354900,1145.0,1081.0
125,2015/03/03,1133.0,1128.073,1132.0,1808400,1162.0,1091.0
126,2015/03/04,1160.0,1142.186,1133.0,1398800,1169.0,1107.0
127,2015/03/05,1165.0,1175.524,1154.0,1620600,1198.0,1153.0
128,2015/03/06,1186.0,1187.547,1174.0,1542900,1204.0,1171.0
129,2015/03/09,1224.0,1210.465,1193.0,1759800,1226.0,1183.0
130,2015/03/10,1235.0,1235.771,1246.0,1752200,1255.0,1210.0
131,2015/03/11,1230.0,1232.43,1211.0,994500,1247.0,1211.0
132,2015/03/12,1296.0,1278.682,1239.0,2154300,1310.0,1236.0
133,2015/03/13,1338.0,1335.643,1311.0,3182200,1366.0,1307.0
134,2015/03/16,1433.0,1401.008,1367.0,4794100,1442.0,1352.0
135,2015/03/17,1372.0,1422.527,1469.0,4407300,1494.0,1355.0
136,2015/03/18,1412.0,1396.545,1426.0,2560400,1432.0,1362.0
137,2015/03/19,1350.0,1368.482,1394.0,2748200,1415.0,1334.0
138,2015/03/20,1300.0,1309.69,1348.0,2889400,1350.0,1285.0
139,2015/03/23,1326.0,1318.145,1289.0,1439000,1342.0,1287.0
140,2015/03/24,1339.0,1343.196,1316.0,1154600,1360.0,1314.0
141,2015/03/25,1340.0,1335.456,1346.0,1391300,1357.0,1306.0
142,2015/03/26,1315.0,1331.847,1330.0,1124600,1354.0,1311.0
143,2015/03/27,1386.0,1359.929,1315.0,3084800,1393.0,1314.0
144,2015/03/30,1374.0,1371.694,1405.0,1881100,1414.0,1345.0
145,2015/03/31,1380.0,1383.828,1383.0,1367200,1405.0,1362.0
146,2015/04/01,1345.0,1351.137,1365.0,979100,1372.0,1335.0
147,2015/04/02,1321.0,1324.062,1338.0,1175400,1345.0,1315.0
148,2015/04/03,1342.0,1330.214,1327.0,912600,1344.0,1312.0
149,2015/04/06,1357.0,1348.202,1324.0,778900,1365.0,1323.0
150,2015/04/07,1366.0,1360.96,1364.0,723300,1372.0,1351.0
151,2015/04/08,1398.0,1389.443,1380.0,1243400,1400.0,1370.0
152,2015/04/09,1410.0,1407.536,1393.0,1365600,1423.0,1384.0
153,2015/04/10,1495.0,1468.601,1421.0,3961600,1506.0,1404.0
154,2015/04/13,1442.0,1470.281,1510.0,2658100,1514.0,1435.0
155,2015/04/14,1443.0,1439.795,1438.0,1228100,1460.0,1404.0
156,2015/04/15,1452.0,1463.808,1460.0,1557000,1490.0,1441.0
157,2015/04/16,1479.0,1463.527,1450.0,1040200,1480.0,1442.0
158,2015/04/17,1499.0,1512.179,1495.0,2966900,1546.0,1479.0
159,2015/04/20,1498.0,1500.96,1523.0,2084200,1532.0,1472.0
160,2015/04/21,1422.0,1442.193,1485.0,2251600,1490.0,1416.0
161,2015/04/22,1457.0,1445.33,1411.0,1413400,1473.0,1407.0
162,2015/04/23,1475.0,1469.488,1459.0,1084300,1492.0,1439.0
163,2015/04/24,1463.0,1462.484,1458.0,849300,1481.0,1446.0
164,2015/04/27,1475.0,1482.464,1485.0,1355100,1509.0,1456.0
165,2015/04/28,1500.0,1486.377,1483.0,1282000,1502.0,1460.0
166,2015/04/30,1436.0,1439.736,1470.0,1925400,1479.0,1411.0
167,2015/05/01,1396.0,1400.681,1406.0,1686800,1433.0,1375.0
168,2015/05/07,1329.0,1341.215,1352.0,1885400,1372.0,1313.0
169,2015/05/08,1401.0,1374.541,1330.0,1522200,1405.0,1325.0
170,2015/05/11,1404.0,1400.755,1411.0,961800,1421.0,1380.0
171,2015/05/12,1495.0,1484.469,1450.0,3922600,1517.0,1447.0
172,2015/05/13,1435.0,1421.336,1395.0,2396100,1444.0,1391.0
173,2015/05/14,1360.0,1361.529,1375.0,2491900,1392.0,1345.0
174,2015/05/15,1367.0,1363.761,1371.0,1144600,1377.0,1345.0
175,2015/05/18,1372.0,1365.232,1367.0,713500,1375.0,1349.0
176,2015/05/19,1400.0,1412.578,1410.0,1878100,1445.0,1390.0
177,2015/05/20,1412.0,1400.19,1410.0,1045000,1415.0,1378.0
178,2015/05/21,1399.0,1401.867,1397.0,728200,1415.0,1393.0
179,2015/05/22,1415.0,1408.075,1404.0,863800,1424.0,1397.0
180,2015/05/25,1439.0,1426.581,1417.0,831200,1442.0,1408.0
181,2015/05/26,1412.0,1419.306,1433.0,554900,1437.0,1412.0
182,2015/05/27,1404.0,1404.257,1410.0,511300,1412.0,1395.0
183,2015/05/28,1437.0,1424.655,1409.0,743300,1438.0,1406.0
184,2015/05/29,1464.0,1462.361,1433.0,1116200,1487.0,1429.0
185,2015/06/01,1445.0,1443.458,1456.0,569800,1461.0,1433.0
186,2015/06/02,1485.0,1483.145,1456.0,1276100,1505.0,1445.0
187,2015/06/03,1575.0,1572.888,1487.0,5973200,1633.0,1485.0
188,2015/06/04,1600.0,1596.326,1615.0,1847900,1621.0,1568.0
189,2015/06/05,1677.0,1642.156,1603.0,3273700,1677.0,1575.0
190,2015/06/08,1602.0,1641.175,1674.0,3067400,1712.0,1587.0
191,2015/06/09,1541.0,1582.92,1613.0,2194200,1641.0,1530.0
192,2015/06/10,1475.0,1495.866,1541.0,2541200,1554.0,1467.0
193,2015/06/11,1580.0,1544.836,1500.0,2174400,1584.0,1492.0
194,2015/06/12,1566.0,1579.617,1581.0,1769800,1608.0,1555.0
195,2015/06/15,1635.0,1620.229,1592.0,2320300,1652.0,1565.0
196,2015/06/16,1575.0,1614.778,1640.0,2443700,1676.0,1565.0
197,2015/06/17,1611.0,1602.52,1580.0,1474400,1634.0,1570.0
198,2015/06/18,1712.0,1710.653,1650.0,6470300,1767.0,1638.0
199,2015/06/19,1814.0,1775.481,1718.0,7547400,1835.0,1672.0
200,2015/06/22,1829.0,1829.274,1789.0,5057500,1864.0,1788.0
201,2015/06/23,1988.0,1931.859,1855.0,7471600,2000.0,1842.0
202,2015/06/24,1987.0,1971.012,1998.0,3660100,2014.0,1933.0
203,2015/06/25,1808.0,1883.513,1948.0,13821500,2095.0,1755.0
204,2015/06/26,1851.0,1835.509,1839.0,4460700,1885.0,1757.0
205,2015/06/29,1816.0,1826.263,1750.0,3995600,1903.0,1750.0
206,2015/06/30,1787.0,1811.162,1853.0,2949400,1868.0,1768.0
207,2015/07/01,1738.0,1737.113,1762.0,3468300,1777.0,1698.0
208,2015/07/02,1708.0,1744.307,1800.0,3998200,1818.0,1694.0
209,2015/07/03,1664.0,1652.168,1671.0,4652100,1691.0,1616.0
210,2015/07/06,1568.0,1587.652,1607.0,4233600,1631.0,1556.0
211,2015/07/07,1609.0,1608.43,1605.0,2580900,1629.0,1586.0
212,2015/07/08,1522.0,1546.03,1586.0,3847200,1595.0,1508.0
213,2015/07/09,1496.0,1426.823,1426.0,5167900,1520.0,1350.0
214,2015/07/10,1446.0,1465.203,1490.0,2152900,1503.0,1427.0
215,2015/07/13,1470.0,1485.235,1475.0,1901800,1518.0,1468.0
216,2015/07/14,1546.0,1544.583,1520.0,2877600,1584.0,1511.0
217,2015/07/15,1563.0,1569.019,1570.0,2396100,1594.0,1546.0
218,2015/07/16,1592.0,1589.576,1583.0,1978200,1606.0,1565.0
219,2015/07/17,1621.0,1602.99,1613.0,2475500,1621.0,1575.0
220,2015/07/21,1578.0,1598.389,1645.0,4068700,1655.0,1551.0
221,2015/07/22,1637.0,1610.95,1562.0,2439900,1645.0,1553.0
222,2015/07/23,1609.0,1616.619,1640.0,2260800,1649.0,1593.0
223,2015/07/24,1810.0,1740.354,1640.0,9211800,1811.0,1621.0
224,2015/07/27,1915.0,1968.086,2091.0,14981200,2091.0,1861.0
225,2015/07/28,1930.0,1933.841,1881.0,6446600,1976.0,1850.0
226,2015/07/29,2057.0,2000.123,1960.0,9023300,2085.0,1923.0
227,2015/07/30,2107.0,2092.869,2078.0,8611900,2142.0,2038.0
228,2015/07/31,2091.0,2078.194,2077.0,6600300,2157.0,1997.0
229,2015/08/03,1905.0,1959.857,1987.0,5391700,2018.0,1895.0
230,2015/08/04,1990.0,1992.674,1960.0,5379600,2054.0,1933.0
231,2015/08/05,1952.0,1965.363,1982.0,2526800,2013.0,1935.0
232,2015/08/06,1904.0,1932.209,1922.0,4254000,1996.0,1887.0
233,2015/08/07,2222.0,2142.168,2024.0,16637800,2251.0,1999.0
234,2015/08/10,2065.0,2099.531,2150.0,6671000,2160.0,2044.0
235,2015/08/11,1968.0,1985.667,2042.0,6213300,2089.0,1924.0
236,2015/08/12,1826.0,1873.717,1965.0,6626100,1969.0,1814.0
237,2015/08/13,1796.0,1823.087,1831.0,5400200,1888.0,1791.0
238,2015/08/14,1845.0,1797.173,1820.0,5074100,1859.0,1726.0
239,2015/08/17,1768.0,1775.247,1809.0,2847700,1818.0,1751.0
240,2015/08/18,1799.0,1796.656,1775.0,2750200,1832.0,1753.0
241,2015/08/19,1714.0,1727.67,1766.0,3358700,1781.0,1683.0
242,2015/08/20,1687.0,1717.671,1698.0,2015000,1753.0,1685.0
243,2015/08/21,1603.0,1632.008,1620.0,2995000,1676.0,1595.0
244,2015/08/24,1380.0,1453.982,1546.0,7682300,1570.0,1330.0
245,2015/08/25,1361.0,1396.264,1330.0,6959000,1485.0,1260.0
246,2015/08/26,1433.0,1417.92,1436.0,5362900,1449.0,1391.0
247,2015/08/27,1429.0,1456.576,1480.0,3667100,1512.0,1412.0
248,2015/08/28,1474.0,1466.772,1480.0,2942700,1494.0,1442.0
249,2015/08/31,1440.0,1434.117,1448.0,2270900,1466.0,1408.0
250,2015/09/01,1342.0,1379.696,1410.0,2485600,1424.0,1310.0
251,2015/09/02,1334.0,1332.855,1284.0,2473900,1384.0,1275.0
252,2015/09/03,1365.0,1368.861,1375.0,2031400,1400.0,1343.0
253,2015/09/04,1271.0,1295.415,1375.0,2788700,1392.0,1238.0
254,2015/09/07,1351.0,1302.028,1282.0,2571000,1356.0,1229.0
255,2015/09/08,1301.0,1325.501,1341.0,2576800,1375.0,1283.0
256,2015/09/09,1388.0,1385.205,1375.0,2333000,1410.0,1359.0
257,2015/09/10,1471.0,1421.055,1334.0,3399500,1473.0,1333.0
258,2015/09/11,1394.0,1408.426,1422.0,3490700,1446.0,1375.0
259,2015/09/14,1362.0,1365.864,1364.0,1916900,1399.0,1330.0
260,2015/09/15,1329.0,1346.747,1369.0,1319300,1384.0,1315.0
261,2015/09/16,1304.0,1318.648,1350.0,1080600,1356.0,1293.0
262,2015/09/17,1329.0,1322.657,1293.0,1213300,1355.0,1292.0
263,2015/09/18,1301.0,1303.477,1315.0,949200,1318.0,1294.0
264,2015/09/24,1247.0,1260.072,1256.0,1062800,1287.0,1243.0
265,2015/09/25,1297.0,1266.431,1252.0,1342800,1300.0,1232.0
266,2015/09/28,1293.0,1282.787,1278.0,744100,1302.0,1258.0
267,2015/09/29,1144.0,1188.384,1267.0,2921900,1280.0,1143.0
268,2015/09/30,1152.0,1148.008,1172.0,2010900,1178.0,1119.0
269,2015/10/01,1210.0,1214.122,1179.0,1996700,1235.0,1173.0
270,2015/10/02,1235.0,1231.389,1200.0,1301800,1259.0,1191.0
271,2015/10/05,1274.0,1272.589,1270.0,838400,1286.0,1255.0
272,2015/10/06,1226.0,1252.51,1278.0,1404800,1288.0,1225.0
273,2015/10/07,1235.0,1232.007,1235.0,847200,1247.0,1205.0
274,2015/10/08,1223.0,1231.976,1244.0,712700,1250.0,1215.0
275,2015/10/09,1220.0,1217.59,1220.0,644800,1232.0,1206.0
276,2015/10/13,1248.0,1242.869,1226.0,747300,1253.0,1220.0
277,2015/10/14,1195.0,1206.73,1236.0,1106600,1246.0,1186.0
278,2015/10/15,1221.0,1221.152,1190.0,787300,1243.0,1181.0
279,2015/10/16,1215.0,1229.356,1235.0,936400,1252.0,1212.0
280,2015/10/19,1226.0,1211.985,1201.0,697800,1230.0,1196.0
281,2015/10/20,1207.0,1204.713,1217.0,656300,1223.0,1197.0
282,2015/10/21,1247.0,1241.246,1216.0,1029900,1260.0,1208.0
283,2015/10/22,1259.0,1263.896,1233.0,906900,1282.0,1232.0
284,2015/10/23,1270.0,1277.471,1279.0,689100,1289.0,1267.0
285,2015/10/26,1315.0,1305.284,1273.0,969400,1325.0,1265.0
286,2015/10/27,1285.0,1307.157,1326.0,959800,1347.0,1283.0
287,2015/10/28,1269.0,1273.07,1285.0,672200,1299.0,1262.0
288,2015/10/29,1270.0,1273.604,1291.0,701300,1299.0,1243.0
289,2015/10/30,1232.0,1236.456,1256.0,826800,1263.0,1215.0
290,2015/11/02,1198.0,1212.966,1220.0,755500,1248.0,1196.0
291,2015/11/04,1197.0,1207.183,1215.0,659600,1236.0,1195.0
292,2015/11/05,1163.0,1162.522,1200.0,1019300,1207.0,1146.0
293,2015/11/06,1178.0,1169.873,1147.0,864200,1193.0,1140.0
294,2015/11/09,1154.0,1160.617,1178.0,987900,1181.0,1152.0
295,2015/11/10,944.0,964.465,995.0,7530900,1014.0,934.0
296,2015/11/11,952.0,949.664,962.0,2169800,962.0,938.0
297,2015/11/12,913.0,919.761,956.0,2980300,956.0,909.0
298,2015/11/13,939.0,937.302,920.0,2374800,959.0,918.0
299,2015/11/16,934.0,936.397,920.0,1151600,951.0,920.0
300,2015/11/17,941.0,935.348,932.0,1709300,949.0,923.0
301,2015/11/18,931.0,937.228,956.0,1286600,958.0,929.0
302,2015/11/19,947.0,944.222,950.0,1214700,953.0,937.0
303,2015/11/20,984.0,971.905,946.0,2205600,988.0,944.0
304,2015/11/24,1082.0,1069.898,998.0,5460700,1113.0,998.0
305,2015/11/25,1095.0,1082.704,1072.0,2057200,1105.0,1053.0
306,2015/11/26,1150.0,1152.317,1143.0,2597000,1175.0,1129.0
307,2015/11/27,1123.0,1140.916,1165.0,2172100,1175.0,1115.0
308,2015/11/30,1072.0,1094.335,1145.0,1733900,1145.0,1072.0
309,2015/12/01,1072.0,1079.574,1084.0,1246900,1103.0,1060.0
310,2015/12/02,1106.0,1081.588,1060.0,1537200,1106.0,1050.0
311,2015/12/03,1167.0,1152.6,1130.0,2385900,1169.0,1129.0
312,2015/12/04,1153.0,1144.831,1150.0,1310500,1162.0,1123.0
313,2015/12/07,1190.0,1191.658,1200.0,2309000,1209.0,1175.0
314,2015/12/08,1089.0,1113.623,1175.0,4175500,1191.0,1068.0
315,2015/12/09,1006.0,1023.17,1074.0,4322800,1079.0,999.0
316,2015/12/10,989.0,983.986,974.0,2342900,1002.0,963.0
317,2015/12/11,947.0,964.062,969.0,2790400,1008.0,942.0
318,2015/12/14,886.0,890.685,890.0,4257000,914.0,871.0
319,2015/12/15,869.0,887.434,896.0,1999000,915.0,867.0
320,2015/12/16,878.0,880.153,899.0,1251400,899.0,867.0
321,2015/12/17,882.0,888.068,884.0,1029000,897.0,880.0
322,2015/12/18,842.0,856.128,876.0,2595000,885.0,835.0
323,2015/12/21,821.0,814.365,830.0,1965000,834.0,801.0
324,2015/12/22,787.0,799.566,822.0,1921400,827.0,784.0
325,2015/12/24,783.0,790.903,800.0,1615300,811.0,774.0
326,2015/12/25,767.0,762.837,773.0,1861800,778.0,746.0
327,2015/12/28,789.0,799.14,776.0,1745500,815.0,775.0
328,2015/12/29,804.0,803.323,787.0,963900,814.0,787.0
329,2015/12/30,802.0,803.935,800.0,732900,812.0,800.0
330,2016/01/04,782.0,791.122,787.0,1129000,818.0,777.0
331,2016/01/05,762.0,764.921,769.0,1055100,778.0,751.0
332,2016/01/06,730.0,739.786,768.0,1431600,776.0,723.0
333,2016/01/07,723.0,732.724,736.0,1337600,752.0,717.0
334,2016/01/08,704.0,706.611,708.0,1649200,726.0,694.0
335,2016/01/12,713.0,750.63,740.0,4888100,791.0,705.0
336,2016/01/13,751.0,740.337,730.0,1254000,754.0,726.0
337,2016/01/14,711.0,706.723,710.0,1629400,722.0,692.0
338,2016/01/15,699.0,705.964,724.0,1109700,732.0,689.0
339,2016/01/18,670.0,670.763,662.0,1109600,685.0,659.0
340,2016/01/19,698.0,685.618,670.0,923900,702.0,665.0
341,2016/01/20,660.0,673.529,690.0,1011300,694.0,656.0
342,2016/01/21,647.0,665.885,653.0,1257600,696.0,644.0
343,2016/01/22,680.0,673.318,670.0,1063300,683.0,662.0
344,2016/01/25,681.0,676.747,680.0,895200,688.0,661.0
345,2016/01/26,686.0,684.198,675.0,798600,699.0,668.0
346,2016/01/27,719.0,706.656,700.0,1017500,719.0,694.0
347,2016/01/28,723.0,720.286,710.0,924800,740.0,700.0
348,2016/01/29,736.0,720.113,720.0,1448400,738.0,700.0
349,2016/02/01,805.0,783.397,747.0,1795100,809.0,746.0
350,2016/02/02,819.0,822.103,803.0,2133800,842.0,801.0
351,2016/02/03,827.0,808.12,791.0,1288200,832.0,779.0
352,2016/02/04,729.0,770.521,829.0,2133300,829.0,719.0
353,2016/02/05,681.0,686.869,710.0,1433700,728.0,664.0
354,2016/02/08,684.0,686.455,666.0,1927200,703.0,662.0
355,2016/02/09,584.0,584.0,584.0,165100,584.0,584.0
356,2016/02/10,505.0,506.593,534.0,6898900,552.0,484.0
357,2016/02/12,464.0,475.387,480.0,2539100,489.0,463.0
358,2016/02/15,468.0,475.217,504.0,2269800,504.0,460.0
359,2016/02/16,492.0,493.212,465.0,1987200,510.0,465.0
360,2016/02/17,495.0,496.366,490.0,1321900,514.0,481.0
361,2016/02/18,524.0,516.833,513.0,1486200,533.0,501.0
362,2016/02/19,495.0,497.116,512.0,1467700,515.0,485.0
363,2016/02/22,494.0,495.973,490.0,1238100,509.0,481.0
364,2016/02/23,491.0,492.238,503.0,1040700,505.0,481.0
365,2016/02/24,492.0,493.387,484.0,1863600,512.0,473.0
366,2016/02/25,494.0,493.956,490.0,732300,500.0,488.0
367,2016/02/26,483.0,491.076,492.0,1317700,503.0,481.0
368,2016/02/29,484.0,488.842,480.0,1062400,500.0,478.0
369,2016/03/01,489.0,485.714,490.0,907600,493.0,479.0
370,2016/03/02,495.0,499.223,496.0,1249400,510.0,493.0
371,2016/03/03,531.0,523.196,495.0,2375000,548.0,490.0
372,2016/03/04,604.0,589.946,529.0,4146400,628.0,526.0
373,2016/03/07,591.0,608.721,614.0,2558400,639.0,589.0
374,2016/03/08,567.0,568.237,580.0,1796400,583.0,551.0
375,2016/03/09,540.0,544.985,556.0,1296300,569.0,535.0
376,2016/03/10,552.0,551.478,550.0,723500,558.0,543.0
377,2016/03/11,546.0,546.66,548.0,770100,553.0,536.0
378,2016/03/14,587.0,576.352,548.0,2359300,596.0,542.0
379,2016/03/15,642.0,620.367,578.0,3906800,649.0,570.0
380,2016/03/16,610.0,620.639,625.0,2342900,642.0,607.0
381,2016/03/17,611.0,609.774,602.0,1229500,625.0,602.0
382,2016/03/18,621.0,612.999,615.0,905700,624.0,603.0
383,2016/03/22,628.0,627.127,628.0,1137300,642.0,617.0
384,2016/03/23,657.0,657.765,648.0,1961200,678.0,646.0
385,2016/03/24,640.0,641.193,648.0,1084200,656.0,631.0
386,2016/03/25,631.0,634.29,635.0,700700,649.0,628.0
387,2016/03/28,618.0,622.068,630.0,595500,635.0,613.0
388,2016/03/29,645.0,635.303,615.0,753800,646.0,614.0
389,2016/03/30,642.0,654.996,657.0,1224500,673.0,636.0
390,2016/03/31,639.0,641.988,644.0,668000,650.0,633.0
391,2016/04/01,613.0,617.349,641.0,967800,644.0,606.0
392,2016/04/04,619.0,617.269,613.0,703800,628.0,603.0
393,2016/04/05,569.0,577.779,605.0,1533300,612.0,558.0
394,2016/04/06,571.0,565.327,554.0,1101200,578.0,545.0
395,2016/04/07,575.0,572.125,569.0,723100,585.0,560.0
396,2016/04/08,588.0,575.463,560.0,668600,598.0,555.0
397,2016/04/11,611.0,594.62,586.0,580300,613.0,578.0
398,2016/04/12,620.0,622.304,612.0,826800,632.0,611.0
399,2016/04/13,640.0,632.16,630.0,1141800,645.0,617.0
400,2016/04/14,646.0,649.231,657.0,1133200,662.0,637.0
401,2016/04/15,627.0,632.972,638.0,700300,648.0,621.0
402,2016/04/18,605.0,605.292,607.0,622700,614.0,592.0
403,2016/04/19,635.0,628.641,615.0,857900,637.0,613.0
404,2016/04/20,638.0,640.431,643.0,811700,652.0,633.0
405,2016/04/21,679.0,670.016,649.0,1734800,686.0,644.0
406,2016/04/22,671.0,668.556,669.0,990400,685.0,653.0
407,2016/04/25,650.0,660.381,661.0,693100,679.0,646.0
408,2016/04/26,635.0,638.914,649.0,827500,665.0,618.0
409,2016/04/27,640.0,632.711,625.0,519700,641.0,620.0
410,2016/04/28,604.0,614.321,634.0,1297100,639.0,600.0
411,2016/05/02,585.0,584.72,580.0,738900,593.0,579.0
412,2016/05/06,579.0,577.973,586.0,629900,592.0,571.0
413,2016/05/09,597.0,595.023,582.0,458500,605.0,582.0
414,2016/05/10,585.0,587.2,595.0,664900,599.0,580.0
415,2016/05/11,612.0,609.555,602.0,929900,623.0,596.0
416,2016/05/12,647.0,662.238,672.0,3558400,688.0,631.0
417,2016/05/13,604.0,615.681,637.0,1206200,637.0,603.0
418,2016/05/16,582.0,589.723,600.0,800400,603.0,576.0
419,2016/05/17,607.0,601.591,585.0,672400,611.0,585.0
420,2016/05/18,588.0,596.673,606.0,921100,617.0,582.0
421,2016/05/19,599.0,596.099,595.0,563500,607.0,589.0
422,2016/05/20,614.0,607.903,600.0,562400,616.0,595.0
423,2016/05/23,642.0,629.765,619.0,913400,644.0,612.0
424,2016/05/24,637.0,643.132,645.0,1159900,656.0,626.0
425,2016/05/25,640.0,644.973,646.0,791000,653.0,637.0
426,2016/05/26,641.0,643.326,649.0,655800,650.0,635.0
427,2016/05/27,666.0,655.521,641.0,1049800,668.0,641.0
428,2016/05/30,712.0,708.333,680.0,4654700,740.0,673.0
429,2016/05/31,708.0,710.577,712.0,1963600,724.0,703.0
430,2016/06/01,741.0,735.467,720.0,2406800,759.0,706.0
431,2016/06/02,725.0,740.23,745.0,1995000,764.0,716.0
432,2016/06/03,763.0,753.643,740.0,2045100,772.0,728.0
433,2016/06/06,753.0,753.382,750.0,1372800,773.0,742.0
434,2016/06/07,764.0,758.662,764.0,1447600,772.0,748.0
435,2016/06/08,715.0,726.112,754.0,2132900,759.0,708.0
436,2016/06/09,713.0,718.709,715.0,917200,734.0,710.0
437,2016/06/10,709.0,707.393,710.0,778300,717.0,694.0
438,2016/06/13,681.0,683.48,711.0,1845800,711.0,659.0
439,2016/06/14,627.0,645.341,675.0,2486000,691.0,622.0
440,2016/06/15,622.0,623.084,624.0,1139500,639.0,603.0
441,2016/06/16,576.0,589.943,621.0,1422100,629.0,569.0
442,2016/06/17,579.0,577.24,600.0,1790700,605.0,557.0
443,2016/06/20,614.0,605.099,580.0,1103500,618.0,580.0
444,2016/06/21,614.0,607.071,601.0,908600,618.0,595.0
445,2016/06/22,600.0,606.826,617.0,1154000,632.0,591.0
446,2016/06/23,609.0,600.383,590.0,732600,610.0,588.0
447,2016/06/24,558.0,581.655,639.0,5690600,671.0,511.0
448,2016/06/27,579.0,574.062,568.0,1415000,590.0,558.0
449,2016/06/28,597.0,576.588,559.0,1301400,599.0,552.0
450,2016/06/29,630.0,630.197,627.0,1327500,645.0,611.0
451,2016/06/30,642.0,651.943,650.0,1599100,674.0,636.0
452,2016/07/01,679.0,669.672,657.0,1540500,688.0,652.0
453,2016/07/04,701.0,700.217,702.0,1167500,714.0,689.0
454,2016/07/05,694.0,688.001,693.0,1348600,709.0,661.0
455,2016/07/06,753.0,751.4,749.0,8700800,778.0,712.0
456,2016/07/07,903.0,894.706,890.0,2672100,903.0,878.0
457,2016/07/08,767.0,797.877,831.0,13062500,841.0,759.0
458,2016/07/11,743.0,733.391,781.0,7896400,784.0,695.0
459,2016/07/12,735.0,739.964,725.0,3864200,772.0,721.0
460,2016/07/13,693.0,705.174,743.0,3388300,743.0,687.0
461,2016/07/14,671.0,684.808,690.0,2355100,706.0,668.0
462,2016/07/15,691.0,684.538,684.0,2302900,702.0,667.0
463,2016/07/19,630.0,638.732,654.0,2250500,664.0,621.0
464,2016/07/20,634.0,635.918,636.0,1243400,646.0,626.0
465,2016/07/21,639.0,635.091,630.0,1047800,643.0,623.0
466,2016/07/22,616.0,621.517,629.0,1149900,638.0,613.0
467,2016/07/25,626.0,626.743,615.0,1009700,638.0,614.0
468,2016/07/26,608.0,612.452,617.0,779300,624.0,608.0
469,2016/07/27,620.0,620.262,618.0,782600,630.0,612.0
470,2016/07/28,605.0,606.738,620.0,1181600,623.0,599.0
471,2016/07/29,610.0,598.894,602.0,1038800,614.0,586.0
472,2016/08/01,598.0,600.925,595.0,653600,609.0,594.0
473,2016/08/02,605.0,602.287,593.0,656400,611.0,592.0
474,2016/08/03,593.0,596.556,598.0,526000,602.0,593.0
475,2016/08/04,636.0,623.033,623.0,1863400,640.0,600.0
476,2016/08/05,645.0,661.626,676.0,1984100,686.0,643.0
477,2016/08/08,641.0,649.76,648.0,904200,661.0,637.0
478,2016/08/09,647.0,645.501,645.0,531700,657.0,638.0
479,2016/08/10,647.0,645.237,649.0,494000,652.0,639.0
480,2016/08/12,660.0,654.351,649.0,779300,665.0,638.0
481,2016/08/15,693.0,679.028,667.0,1010100,694.0,662.0
482,2016/08/16,670.0,679.432,695.0,1186400,699.0,666.0
483,2016/08/17,656.0,659.806,668.0,799500,679.0,651.0
484,2016/08/18,651.0,653.122,652.0,627000,668.0,641.0
485,2016/08/19,663.0,660.488,651.0,383500,667.0,649.0
486,2016/08/22,674.0,665.888,665.0,558700,677.0,652.0
487,2016/08/23,670.0,669.066,674.0,406000,677.0,663.0
488,2016/08/24,662.0,667.074,665.0,395300,677.0,661.0
489,2016/08/25,657.0,654.091,655.0,506300,660.0,647.0
490,2016/08/26,637.0,642.697,648.0,594900,652.0,636.0
491,2016/08/29,662.0,654.956,646.0,545700,664.0,642.0
492,2016/08/30,659.0,660.414,666.0,327600,666.0,653.0
493,2016/08/31,673.0,665.075,659.0,559600,674.0,656.0
494,2016/09/01,672.0,669.1,670.0,407700,675.0,663.0
495,2016/09/02,671.0,669.48,674.0,330200,675.0,664.0
496,2016/09/05,689.0,684.602,675.0,812500,694.0,673.0
497,2016/09/06,714.0,705.055,690.0,1131400,719.0,688.0
498,2016/09/07,702.0,702.622,700.0,766600,714.0,692.0
499,2016/09/08,667.0,676.673,706.0,1558500,710.0,666.0
500,2016/09/09,661.0,660.476,657.0,886500,667.0,655.0
501,2016/09/12,643.0,645.62,646.0,756300,657.0,640.0
502,2016/09/13,645.0,645.532,648.0,634100,649.0,641.0
503,2016/09/14,621.0,632.759,641.0,799300,645.0,619.0
504,2016/09/15,608.0,607.744,619.0,753600,619.0,601.0
505,2016/09/16,613.0,614.813,615.0,500400,619.0,611.0
506,2016/09/20,608.0,609.939,609.0,409400,618.0,605.0
507,2016/09/21,622.0,618.165,616.0,969800,636.0,606.0
508,2016/09/23,638.0,632.992,625.0,559700,639.0,622.0
509,2016/09/26,617.0,621.369,633.0,549800,634.0,614.0
510,2016/09/27,621.0,614.08,610.0,516500,624.0,604.0
511,2016/09/28,628.0,624.875,624.0,361000,631.0,618.0
512,2016/09/29,637.0,635.404,632.0,417800,639.0,628.0
513,2016/09/30,626.0,628.385,631.0,329500,634.0,625.0
514,2016/10/03,632.0,646.089,630.0,1456700,664.0,628.0
515,2016/10/04,636.0,627.831,625.0,545400,637.0,618.0
516,2016/10/05,638.0,636.113,638.0,316200,642.0,632.0
517,2016/10/06,636.0,639.286,644.0,344000,647.0,633.0
518,2016/10/07,630.0,628.216,636.0,251000,636.0,623.0
519,2016/10/11,627.0,631.692,632.0,375100,641.0,623.0
520,2016/10/12,616.0,619.181,622.0,243800,624.0,615.0
521,2016/10/13,617.0,617.197,619.0,219500,623.0,613.0
522,2016/10/14,619.0,614.874,617.0,288800,621.0,610.0
523,2016/10/17,617.0,617.525,619.0,372300,626.0,613.0
524,2016/10/18,633.0,625.974,618.0,358200,633.0,616.0
525,2016/10/19,638.0,633.2,633.0,347300,639.0,625.0
526,2016/10/20,638.0,639.632,635.0,615400,644.0,633.0
527,2016/10/21,639.0,645.174,638.0,608700,653.0,636.0
528,2016/10/24,627.0,631.592,636.0,409100,640.0,626.0
529,2016/10/25,621.0,621.225,623.0,325400,627.0,618.0
530,2016/10/26,628.0,625.747,621.0,291400,630.0,620.0
531,2016/10/27,639.0,633.964,628.0,396000,641.0,626.0
532,2016/10/28,644.0,636.68,643.0,552000,644.0,627.0
533,2016/10/31,632.0,634.39,634.0,470900,644.0,628.0
534,2016/11/01,620.0,621.796,626.0,470800,632.0,618.0
535,2016/11/02,606.0,608.178,615.0,651800,615.0,603.0
536,2016/11/04,599.0,595.587,600.0,600900,603.0,585.0
537,2016/11/07,621.0,620.84,619.0,619300,634.0,611.0
538,2016/11/08,615.0,615.765,631.0,634400,631.0,608.0
539,2016/11/09,600.0,613.13,615.0,2495900,648.0,575.0
540,2016/11/10,638.0,630.489,633.0,1111100,640.0,620.0
541,2016/11/11,629.0,626.734,636.0,689200,640.0,617.0
542,2016/11/14,630.0,634.662,631.0,785600,647.0,627.0
543,2016/11/15,655.0,641.861,635.0,888100,655.0,625.0
544,2016/11/16,649.0,652.773,655.0,720300,663.0,644.0
545,2016/11/17,647.0,643.057,648.0,444400,650.0,637.0
546,2016/11/18,637.0,642.582,649.0,638700,655.0,637.0
547,2016/11/21,632.0,631.474,640.0,912000,643.0,623.0
548,2016/11/22,650.0,644.031,631.0,619500,653.0,631.0
549,2016/11/24,679.0,675.241,656.0,1089500,683.0,654.0
550,2016/11/25,662.0,672.728,684.0,1268500,698.0,650.0
551,2016/11/28,668.0,661.011,661.0,621900,673.0,648.0
552,2016/11/29,652.0,656.41,664.0,490500,667.0,650.0
553,2016/11/30,643.0,648.349,652.0,731400,658.0,640.0
554,2016/12/01,645.0,648.729,651.0,638800,660.0,640.0
555,2016/12/02,631.0,627.985,640.0,1124500,642.0,618.0
556,2016/12/05,634.0,628.916,623.0,427500,636.0,622.0
557,2016/12/06,639.0,637.265,634.0,523400,644.0,631.0
558,2016/12/07,662.0,654.229,643.0,826200,662.0,639.0
559,2016/12/08,647.0,649.611,662.0,634500,666.0,642.0
560,2016/12/09,645.0,642.727,640.0,508400,649.0,637.0
561,2016/12/12,653.0,650.245,647.0,560700,656.0,644.0
562,2016/12/13,642.0,642.975,645.0,410600,649.0,638.0
563,2016/12/14,658.0,651.65,643.0,691400,661.0,640.0
564,2016/12/15,649.0,652.998,665.0,592800,665.0,645.0
565,2016/12/16,657.0,656.138,653.0,661200,665.0,648.0
566,2016/12/19,650.0,650.898,657.0,479500,661.0,645.0
567,2016/12/20,644.0,642.729,648.0,419900,650.0,635.0
568,2016/12/21,632.0,636.219,638.0,540100,646.0,631.0
569,2016/12/22,650.0,641.281,626.0,762900,651.0,626.0
570,2016/12/26,664.0,684.327,689.0,3184500,718.0,654.0
571,2016/12/27,655.0,660.788,657.0,664400,669.0,654.0
572,2016/12/28,665.0,665.43,654.0,548100,673.0,654.0
573,2016/12/29,660.0,659.879,663.0,501400,667.0,652.0
574,2016/12/30,664.0,671.553,656.0,1120600,685.0,656.0
575,2017/01/04,679.0,673.393,666.0,844100,680.0,659.0
576,2017/01/05,695.0,689.403,677.0,1083700,704.0,672.0
577,2017/01/06,683.0,683.553,685.0,674200,695.0,676.0
578,2017/01/10,666.0,673.381,680.0,1006900,690.0,662.0
579,2017/01/11,663.0,667.569,666.0,532900,675.0,661.0
580,2017/01/12,654.0,656.411,662.0,617800,665.0,651.0
581,2017/01/13,659.0,658.957,651.0,460900,664.0,651.0
582,2017/01/16,649.0,649.321,654.0,594300,660.0,643.0
583,2017/01/17,629.0,634.472,649.0,1065400,650.0,627.0
584,2017/01/18,632.0,624.817,625.0,787400,632.0,617.0
585,2017/01/19,633.0,633.167,637.0,556500,637.0,629.0
586,2017/01/20,638.0,633.833,635.0,413200,641.0,626.0
587,2017/01/23,627.0,627.885,633.0,667400,635.0,623.0
588,2017/01/24,636.0,633.402,622.0,512100,641.0,621.0
589,2017/01/25,636.0,636.181,640.0,261200,644.0,632.0
590,2017/01/26,643.0,639.783,640.0,431700,643.0,635.0
591,2017/01/27,633.0,635.257,639.0,509100,646.0,631.0
592,2017/01/30,628.0,626.302,630.0,621100,632.0,622.0
593,2017/01/31,625.0,627.132,624.0,448500,635.0,622.0
594,2017/02/01,622.0,622.034,623.0,549600,628.0,619.0
595,2017/02/02,613.0,616.698,622.0,847100,622.0,610.0
596,2017/02/03,606.0,605.534,606.0,712300,613.0,602.0
597,2017/02/06,626.0,619.348,608.0,535900,626.0,608.0
598,2017/02/07,625.0,622.251,623.0,515400,628.0,617.0
599,2017/02/08,636.0,636.109,631.0,1555400,645.0,624.0
600,2017/02/09,627.0,629.966,633.0,717400,638.0,623.0
601,2017/02/10,669.0,661.734,643.0,2857600,692.0,637.0
602,2017/02/13,718.0,705.781,689.0,3987300,729.0,680.0
603,2017/02/14,723.0,724.744,733.0,1948200,738.0,711.0
604,2017/02/15,768.0,754.64,727.0,2388000,771.0,723.0
605,2017/02/16,800.0,798.213,777.0,3469400,824.0,775.0
606,2017/02/17,793.0,793.14,796.0,1441700,815.0,761.0
607,2017/02/20,808.0,796.88,789.0,1250800,811.0,777.0
608,2017/02/21,812.0,808.274,804.0,1119800,819.0,796.0
609,2017/02/22,827.0,819.731,812.0,1207400,828.0,805.0
610,2017/02/23,820.0,821.791,824.0,828800,829.0,812.0
611,2017/02/24,829.0,828.144,815.0,1568100,850.0,806.0
612,2017/02/27,893.0,865.07,830.0,2162600,895.0,822.0
613,2017/02/28,841.0,879.047,897.0,4634200,928.0,832.0
614,2017/03/01,856.0,847.008,830.0,1673700,864.0,825.0
615,2017/03/02,832.0,832.468,857.0,2449100,865.0,810.0
616,2017/03/03,833.0,838.193,840.0,1186200,858.0,827.0
617,2017/03/06,870.0,876.117,885.0,2416500,892.0,858.0
618,2017/03/07,872.0,871.548,870.0,983400,882.0,862.0
619,2017/03/08,912.0,908.441,879.0,2519000,925.0,876.0
620,2017/03/09,906.0,914.052,920.0,1897100,933.0,898.0
621,2017/03/10,898.0,898.669,912.0,1086000,913.0,890.0
622,2017/03/13,944.0,927.665,900.0,2407800,949.0,899.0
623,2017/03/14,934.0,955.128,968.0,3229300,995.0,920.0
624,2017/03/15,938.0,941.284,929.0,1554000,964.0,920.0
625,2017/03/16,1007.0,981.884,952.0,3173500,1010.0,946.0
626,2017/03/17,980.0,978.478,990.0,2727300,999.0,962.0
627,2017/03/21,1034.0,1015.3,973.0,2879800,1042.0,970.0
628,2017/03/22,1021.0,1017.359,1010.0,2533900,1047.0,997.0
629,2017/03/23,1040.0,1028.404,1037.0,2744200,1057.0,1002.0
630,2017/03/24,987.0,982.712,1037.0,3995700,1037.0,951.0
631,2017/03/27,837.0,875.645,927.0,8901400,941.0,837.0
632,2017/03/28,814.0,829.938,839.0,6162500,863.0,811.0
633,2017/03/29,821.0,816.021,813.0,3545100,837.0,795.0
634,2017/03/30,768.0,790.918,816.0,5011000,824.0,763.0
635,2017/03/31,740.0,757.494,776.0,4613400,786.0,734.0
636,2017/04/03,742.0,749.903,755.0,2582700,773.0,733.0
637,2017/04/04,710.0,713.91,740.0,2683800,744.0,699.0
638,2017/04/05,718.0,713.693,716.0,1438300,727.0,700.0
639,2017/04/06,710.0,702.319,715.0,1649900,716.0,688.0
640,2017/04/07,722.0,709.781,710.0,2767000,726.0,681.0
641,2017/04/10,725.0,729.522,726.0,2466300,744.0,717.0
642,2017/04/11,717.0,714.981,712.0,1151200,723.0,705.0
643,2017/04/12,694.0,694.595,694.0,1669700,705.0,688.0
644,2017/04/13,715.0,701.34,680.0,1647700,723.0,674.0
645,2017/04/14,710.0,712.53,706.0,1231200,728.0,701.0
646,2017/04/17,737.0,731.468,710.0,1610900,743.0,708.0
647,2017/04/18,781.0,762.939,750.0,4044000,793.0,728.0
648,2017/04/19,757.0,772.542,777.0,3100100,803.0,751.0
649,2017/04/20,738.0,746.494,758.0,1531300,765.0,736.0
650,2017/04/21,736.0,736.847,750.0,1349400,750.0,730.0
651,2017/04/24,725.0,728.293,741.0,1257200,743.0,721.0
652,2017/04/25,761.0,749.606,728.0,1512100,763.0,725.0
653,2017/04/26,792.0,782.238,788.0,1987900,796.0,765.0
654,2017/04/27,807.0,792.446,789.0,1459800,807.0,776.0
655,2017/04/28,813.0,810.589,815.0,1838200,827.0,796.0
656,2017/05/01,816.0,812.783,824.0,1110800,824.0,803.0
657,2017/05/02,856.0,841.974,814.0,3381800,860.0,810.0
658,2017/05/08,905.0,902.034,911.0,3566400,915.0,881.0
659,2017/05/09,946.0,915.065,905.0,4110400,946.0,876.0
660,2017/05/10,918.0,938.75,943.0,3333000,973.0,913.0
661,2017/05/11,935.0,925.992,910.0,2211000,942.0,903.0
662,2017/05/12,1085.0,1084.989,1085.0,2792900,1085.0,1082.0
663,2017/05/15,1200.0,1153.147,1125.0,14444200,1200.0,1085.0
664,2017/05/16,1250.0,1209.828,1189.0,8969400,1250.0,1150.0
665,2017/05/17,1259.0,1266.079,1268.0,7040800,1302.0,1226.0
666,2017/05/18,1236.0,1215.859,1199.0,5226200,1241.0,1190.0
667,2017/05/19,1198.0,1218.67,1248.0,4693300,1260.0,1177.0
668,2017/05/22,1320.0,1285.654,1225.0,10414300,1335.0,1186.0
669,2017/05/23,1278.0,1296.09,1299.0,4782300,1335.0,1273.0
670,2017/05/24,1335.0,1341.601,1300.0,7727400,1390.0,1283.0
671,2017/05/25,1318.0,1324.622,1326.0,3198600,1347.0,1307.0
672,2017/05/26,1360.0,1360.635,1327.0,5428100,1389.0,1311.0
673,2017/05/29,1352.0,1350.495,1348.0,3195400,1375.0,1328.0
674,2017/05/30,1385.0,1387.162,1357.0,6376400,1432.0,1341.0
675,2017/05/31,1325.0,1355.365,1373.0,3426800,1394.0,1300.0
676,2017/06/01,1373.0,1354.093,1350.0,4835300,1381.0,1318.0
677,2017/06/02,1363.0,1371.539,1372.0,3138800,1395.0,1348.0
678,2017/06/05,1540.0,1527.044,1395.0,14678000,1625.0,1382.0
679,2017/06/06,1540.0,1532.977,1532.0,6176600,1582.0,1462.0
680,2017/06/07,1574.0,1548.482,1531.0,3951400,1592.0,1501.0
681,2017/06/08,1571.0,1602.049,1588.0,5228700,1638.0,1569.0
682,2017/06/09,1700.0,1656.237,1590.0,6328400,1705.0,1590.0
683,2017/06/12,1655.0,1654.942,1660.0,6177000,1711.0,1600.0
684,2017/06/13,1622.0,1689.853,1667.0,11768500,1760.0,1612.0
685,2017/06/14,1454.0,1497.948,1619.0,15517400,1660.0,1398.0
686,2017/06/15,1591.0,1535.039,1500.0,8842900,1604.0,1430.0
687,2017/06/16,1599.0,1599.563,1595.0,6213400,1655.0,1556.0
688,2017/06/19,1877.0,1843.234,1719.0,18656400,1939.0,1711.0
689,2017/06/20,1857.0,1856.876,1863.0,8193300,1908.0,1803.0
690,2017/06/21,1799.0,1798.361,1813.0,6185200,1830.0,1774.0
691,2017/06/22,1816.0,1837.906,1885.0,5774000,1892.0,1805.0
692,2017/06/23,1815.0,1770.227,1823.0,7240700,1838.0,1703.0
693,2017/06/26,1871.0,1952.258,2000.0,14520000,2022.0,1855.0
694,2017/06/27,1851.0,1840.06,1851.0,5340300,1881.0,1800.0
695,2017/06/28,1749.0,1757.343,1806.0,6095300,1828.0,1710.0
696,2017/06/29,1782.0,1781.115,1756.0,6014600,1840.0,1719.0
697,2017/06/30,1776.0,1735.834,1710.0,4028300,1776.0,1702.0
698,2017/07/03,1789.0,1787.418,1810.0,2719000,1824.0,1756.0
699,2017/07/04,1764.0,1782.086,1777.0,4352300,1833.0,1728.0
700,2017/07/05,1767.0,1754.686,1752.0,3028700,1776.0,1733.0
701,2017/07/06,1813.0,1813.392,1792.0,3962900,1846.0,1784.0
702,2017/07/07,1920.0,1869.0,1785.0,6076500,1923.0,1777.0
703,2017/07/10,2129.0,2089.827,2000.0,15090400,2183.0,1968.0
704,2017/07/11,2139.0,2144.706,2101.0,9276700,2199.0,2088.0
705,2017/07/12,2218.0,2214.457,2156.0,10723600,2280.0,2128.0
706,2017/07/13,2325.0,2306.833,2260.0,11311100,2364.0,2246.0
707,2017/07/14,2306.0,2298.978,2355.0,7691900,2361.0,2238.0
708,2017/07/18,2174.0,2196.183,2224.0,7164200,2268.0,2131.0
709,2017/07/19,2077.0,2126.265,2200.0,6432000,2212.0,2059.0
710,2017/07/20,1991.0,2011.258,2070.0,8878600,2105.0,1936.0
711,2017/07/21,2075.0,2048.766,1991.0,7774100,2110.0,1964.0
712,2017/07/24,2189.0,2168.857,2149.0,6922500,2225.0,2115.0
713,2017/07/25,2155.0,2166.748,2180.0,3518300,2206.0,2134.0
714,2017/07/26,2191.0,2190.076,2180.0,4400400,2234.0,2136.0
715,2017/07/27,2124.0,2147.204,2172.0,3187300,2182.0,2113.0
716,2017/07/28,2010.0,2043.644,2074.0,4887100,2114.0,1993.0
717,2017/07/31,1882.0,1878.525,1971.0,7775400,1979.0,1808.0
718,2017/08/01,1777.0,1812.099,1930.0,8594700,1935.0,1715.0
719,2017/08/02,1806.0,1812.666,1777.0,3532400,1850.0,1763.0
720,2017/08/03,1752.0,1768.389,1766.0,3427600,1813.0,1736.0
721,2017/08/04,1802.0,1787.042,1714.0,4529600,1846.0,1705.0
722,2017/08/07,1735.0,1791.087,1828.0,3677400,1873.0,1735.0
723,2017/08/08,2022.0,2009.644,1909.0,21290800,2110.0,1890.0
724,2017/08/09,2094.0,2092.685,2165.0,18513400,2182.0,1999.0
725,2017/08/10,2122.0,2116.333,2060.0,10717400,2188.0,2048.0
726,2017/08/14,2141.0,2116.224,2100.0,6624200,2157.0,2056.0
727,2017/08/15,2251.0,2247.339,2170.0,12412300,2321.0,2164.0
728,2017/08/16,2338.0,2312.328,2265.0,10071800,2349.0,2251.0
729,2017/08/17,2297.0,2295.73,2320.0,5890800,2335.0,2269.0
730,2017/08/18,2323.0,2304.818,2245.0,6621200,2353.0,2235.0
731,2017/08/21,2170.0,2226.311,2320.0,7588300,2338.0,2134.0
732,2017/08/22,2179.0,2169.081,2152.0,5519900,2231.0,2111.0
733,2017/08/23,2180.0,2186.692,2213.0,3183500,2215.0,2157.0
734,2017/08/24,2150.0,2142.631,2146.0,2978900,2171.0,2116.0
735,2017/08/25,2209.0,2182.131,2166.0,3581300,2214.0,2144.0
736,2017/08/28,2312.0,2271.368,2250.0,14411200,2329.0,2195.0
737,2017/08/29,2250.0,2273.414,2270.0,10742600,2312.0,2226.0
738,2017/08/30,2025.0,1982.82,2276.0,34237800,2277.0,1807.0
739,2017/08/31,1928.0,1937.585,2000.0,11161400,2007.0,1890.0
740,2017/09/01,1778.0,1826.453,1910.0,12789200,1920.0,1760.0
741,2017/09/04,1701.0,1653.584,1618.0,13047400,1713.0,1601.0
742,2017/09/05,1545.0,1630.023,1725.0,14662700,1762.0,1534.0
743,2017/09/06,1553.0,1541.58,1505.0,13729800,1624.0,1448.0
744,2017/09/07,1550.0,1554.652,1605.0,8132100,1614.0,1501.0
745,2017/09/08,1571.0,1552.704,1550.0,5314800,1579.0,1530.0
746,2017/09/11,1616.0,1622.077,1643.0,6501500,1658.0,1595.0
747,2017/09/12,1596.0,1606.513,1600.0,4710100,1638.0,1577.0
748,2017/09/13,1588.0,1598.392,1605.0,4246000,1619.0,1577.0
749,2017/09/14,1573.0,1584.71,1598.0,3235300,1614.0,1554.0
750,2017/09/15,1665.0,1618.998,1561.0,4812000,1671.0,1561.0
751,2017/09/19,1750.0,1726.249,1700.0,6543000,1753.0,1693.0
752,2017/09/20,1789.0,1771.845,1755.0,6613700,1817.0,1716.0
753,2017/09/21,1785.0,1827.089,1800.0,16993000,1912.0,1759.0
754,2017/09/22,1693.0,1725.177,1750.0,6240900,1796.0,1685.0
755,2017/09/25,1654.0,1686.641,1693.0,3250400,1725.0,1650.0
756,2017/09/26,1566.0,1597.774,1639.0,4559100,1653.0,1554.0
757,2017/09/27,1643.0,1603.489,1588.0,3389800,1646.0,1567.0
758,2017/09/28,1633.0,1635.307,1661.0,2815600,1673.0,1611.0
759,2017/09/29,1618.0,1608.081,1633.0,2165100,1633.0,1587.0
760,2017/10/02,1682.0,1664.349,1631.0,3377700,1686.0,1628.0
761,2017/10/03,1743.0,1739.006,1715.0,4405600,1766.0,1703.0
762,2017/10/04,1703.0,1716.603,1755.0,2770900,1766.0,1689.0
763,2017/10/05,1636.0,1657.229,1690.0,2759800,1700.0,1628.0
764,2017/10/06,1663.0,1658.06,1650.0,1947500,1676.0,1634.0
765,2017/10/10,1707.0,1694.161,1680.0,2104800,1713.0,1667.0
766,2017/10/11,1713.0,1712.256,1717.0,1635000,1728.0,1692.0
767,2017/10/12,1727.0,1746.207,1730.0,3920400,1791.0,1713.0
768,2017/10/13,1716.0,1710.021,1717.0,2168500,1726.0,1694.0
769,2017/10/16,1783.0,1765.313,1740.0,3709600,1798.0,1715.0
770,2017/10/17,1784.0,1781.658,1809.0,3603800,1824.0,1734.0
771,2017/10/18,1732.0,1756.162,1774.0,2507900,1784.0,1725.0
772,2017/10/19,1818.0,1805.293,1746.0,7107000,1841.0,1737.0
773,2017/10/20,1816.0,1797.256,1790.0,3237800,1819.0,1769.0
774,2017/10/23,1808.0,1829.431,1837.0,3166800,1868.0,1803.0
775,2017/10/24,1854.0,1833.954,1811.0,4898700,1868.0,1804.0
776,2017/10/25,1887.0,1901.586,1870.0,6241600,1936.0,1858.0
777,2017/10/26,1986.0,1951.313,1885.0,6197000,1993.0,1881.0
778,2017/10/27,1985.0,1986.1,2000.0,4807500,2024.0,1953.0
779,2017/10/30,1993.0,1994.939,2010.0,2716400,2017.0,1976.0
780,2017/10/31,1977.0,1985.77,1990.0,2611300,2006.0,1959.0
781,2017/11/01,1981.0,1983.357,2002.0,1485400,2004.0,1971.0
782,2017/11/02,1923.0,1917.622,1975.0,3113800,1981.0,1873.0
783,2017/11/06,2004.0,1981.406,1926.0,3277200,2006.0,1922.0
784,2017/11/07,1829.0,1907.722,2049.0,10810200,2050.0,1815.0
785,2017/11/08,1874.0,1807.281,1760.0,8141400,1890.0,1715.0
786,2017/11/09,1862.0,1865.846,1860.0,3617100,1906.0,1796.0
787,2017/11/10,1768.0,1794.784,1820.0,4043500,1843.0,1761.0
788,2017/11/13,1917.0,1855.918,1800.0,3837800,1919.0,1775.0
789,2017/11/14,1884.0,1882.556,1884.0,1885200,1904.0,1863.0
790,2017/11/15,1716.0,1788.575,1881.0,5550300,1911.0,1710.0
791,2017/11/16,1844.0,1826.877,1814.0,5230000,1872.0,1786.0
792,2017/11/17,1914.0,1919.416,1917.0,8217700,1976.0,1872.0
793,2017/11/20,1944.0,1947.801,1934.0,4347200,1984.0,1910.0
794,2017/11/21,2027.0,1993.675,1962.0,5220300,2029.0,1942.0
795,2017/11/22,2022.0,2033.126,2025.0,5223400,2072.0,1978.0
796,2017/11/24,1920.0,1924.468,1975.0,5411800,1977.0,1882.0
797,2017/11/27,1924.0,1933.095,1940.0,1930200,1961.0,1910.0
798,2017/11/28,1895.0,1886.47,1912.0,2192700,1922.0,1853.0
799,2017/11/29,1878.0,1878.504,1904.0,2093000,1909.0,1848.0
800,2017/11/30,1898.0,1876.177,1851.0,2725700,1899.0,1835.0
801,2017/12/01,1829.0,1858.998,1902.0,2595000,1910.0,1823.0
802,2017/12/04,1777.0,1796.934,1823.0,2467700,1830.0,1775.0
803,2017/12/05,1743.0,1749.799,1760.0,2797800,1801.0,1726.0
804,2017/12/06,1723.0,1739.751,1780.0,3986600,1803.0,1685.0
805,2017/12/07,1800.0,1759.314,1736.0,2188000,1803.0,1725.0
806,2017/12/08,1791.0,1800.694,1823.0,2339500,1832.0,1768.0
807,2017/12/11,1845.0,1830.441,1800.0,2252700,1865.0,1786.0
808,2017/12/12,1855.0,1862.027,1862.0,1607200,1881.0,1848.0
809,2017/12/13,1908.0,1891.73,1865.0,2450200,1911.0,1861.0
810,2017/12/14,1837.0,1873.27,1919.0,2331500,1926.0,1822.0
811,2017/12/15,1845.0,1837.775,1820.0,1924900,1869.0,1804.0
812,2017/12/18,1871.0,1866.526,1863.0,1689700,1890.0,1840.0
813,2017/12/19,1890.0,1881.065,1870.0,1630600,1901.0,1855.0
814,2017/12/20,1867.0,1880.89,1897.0,1148400,1905.0,1859.0
815,2017/12/21,1832.0,1824.896,1850.0,1608600,1860.0,1804.0
816,2017/12/22,1871.0,1843.63,1823.0,2161300,1881.0,1787.0
817,2017/12/25,1821.0,1832.905,1855.0,1286500,1865.0,1815.0
818,2017/12/26,1784.0,1797.199,1808.0,1787100,1822.0,1780.0
819,2017/12/27,1840.0,1822.445,1788.0,1769700,1852.0,1777.0
820,2017/12/28,1820.0,1838.174,1838.0,1299500,1875.0,1815.0
821,2017/12/29,1790.0,1802.737,1818.0,1475200,1840.0,1785.0
822,2018/01/04,1797.0,1805.634,1819.0,1383000,1828.0,1790.0
823,2018/01/05,1803.0,1811.112,1810.0,1543000,1835.0,1795.0
824,2018/01/09,1830.0,1819.345,1815.0,1586400,1842.0,1799.0
825,2018/01/10,1884.0,1868.288,1833.0,1917500,1895.0,1824.0
826,2018/01/11,1882.0,1880.615,1876.0,1623000,1904.0,1862.0
827,2018/01/12,1918.0,1916.906,1888.0,1942900,1939.0,1886.0
828,2018/01/15,1936.0,1920.062,1928.0,1757700,1943.0,1887.0
829,2018/01/16,1956.0,1947.707,1945.0,2142000,1967.0,1918.0
830,2018/01/17,1951.0,1949.091,1947.0,1899200,1971.0,1928.0
831,2018/01/18,1962.0,1973.129,1965.0,1883100,1990.0,1955.0
832,2018/01/19,1939.0,1955.684,1967.0,1755200,1990.0,1928.0
833,2018/01/22,1883.0,1891.111,1930.0,2016500,1934.0,1868.0
834,2018/01/23,1921.0,1912.602,1900.0,1363700,1931.0,1883.0
835,2018/01/24,2015.0,1995.911,1932.0,3859500,2027.0,1925.0
836,2018/01/25,1988.0,1998.769,1994.0,1995200,2032.0,1974.0
837,2018/01/26,1906.0,1935.561,1990.0,2726700,1998.0,1902.0
838,2018/01/29,1896.0,1896.972,1910.0,1516600,1919.0,1869.0
839,2018/01/30,1883.0,1880.916,1905.0,1567200,1913.0,1856.0
840,2018/01/31,1878.0,1873.758,1850.0,1096100,1901.0,1837.0
841,2018/02/01,1933.0,1909.189,1899.0,1373300,1934.0,1871.0
842,2018/02/02,1948.0,1943.441,1930.0,1545100,1962.0,1915.0
843,2018/02/05,1860.0,1868.966,1889.0,2326600,1921.0,1841.0
844,2018/02/06,1641.0,1652.757,1700.0,5251000,1763.0,1483.0
845,2018/02/07,1657.0,1712.453,1770.0,2222500,1773.0,1646.0
846,2018/02/08,1748.0,1717.064,1680.0,2066300,1753.0,1671.0
847,2018/02/09,1671.0,1626.654,1588.0,2751100,1677.0,1585.0
848,2018/02/13,1608.0,1630.548,1700.0,3247700,1706.0,1601.0
849,2018/02/14,1470.0,1498.82,1532.0,4699700,1589.0,1411.0
850,2018/02/15,1500.0,1509.637,1500.0,2016300,1537.0,1480.0
851,2018/02/16,1513.0,1518.437,1521.0,1517500,1536.0,1502.0
852,2018/02/19,1597.0,1577.414,1538.0,1493900,1609.0,1532.0
853,2018/02/20,1605.0,1593.499,1590.0,1060800,1611.0,1575.0
854,2018/02/21,1626.0,1615.741,1600.0,1055100,1639.0,1583.0
855,2018/02/22,1638.0,1622.939,1610.0,1287500,1643.0,1592.0
856,2018/02/23,1632.0,1636.645,1638.0,874900,1648.0,1627.0
857,2018/02/26,1642.0,1653.172,1649.0,919600,1668.0,1640.0
858,2018/02/27,1612.0,1629.24,1658.0,1094800,1664.0,1606.0
859,2018/02/28,1648.0,1638.674,1598.0,1109700,1664.0,1598.0
860,2018/03/01,1648.0,1641.079,1643.0,772400,1653.0,1626.0
861,2018/03/02,1570.0,1573.811,1596.0,1744800,1611.0,1547.0
862,2018/03/05,1608.0,1657.13,1624.0,3480600,1722.0,1604.0
863,2018/03/06,1662.0,1645.898,1648.0,1306900,1671.0,1615.0
864,2018/03/07,1676.0,1684.73,1648.0,1291200,1714.0,1642.0
865,2018/03/08,1689.0,1696.063,1705.0,772600,1711.0,1681.0
866,2018/03/09,1700.0,1698.082,1701.0,1083600,1711.0,1680.0
867,2018/03/12,1691.0,1691.522,1720.0,1083400,1723.0,1668.0
868,2018/03/13,1738.0,1727.906,1673.0,1212100,1759.0,1671.0
869,2018/03/14,1740.0,1739.89,1734.0,827100,1753.0,1721.0
870,2018/03/15,1759.0,1755.552,1746.0,1148100,1773.0,1734.0
871,2018/03/16,1758.0,1777.156,1776.0,1149500,1809.0,1757.0
872,2018/03/19,1786.0,1754.579,1752.0,2930300,1802.0,1678.0
873,2018/03/20,1681.0,1711.977,1780.0,3518800,1815.0,1673.0
874,2018/03/22,1682.0,1692.279,1683.0,1047600,1710.0,1678.0
875,2018/03/23,1618.0,1613.261,1600.0,1530700,1637.0,1594.0
876,2018/03/26,1606.0,1577.031,1600.0,1292000,1612.0,1530.0
877,2018/03/27,1638.0,1648.943,1642.0,820300,1673.0,1630.0
878,2018/03/28,1673.0,1658.63,1613.0,746200,1675.0,1613.0
879,2018/03/29,1708.0,1706.946,1700.0,1482200,1732.0,1679.0
880,2018/03/30,1723.0,1740.383,1713.0,1492500,1765.0,1709.0
881,2018/04/02,1725.0,1733.706,1725.0,842100,1751.0,1711.0
882,2018/04/03,1698.0,1694.193,1696.0,917000,1713.0,1679.0
883,2018/04/04,1653.0,1686.359,1715.0,1225900,1738.0,1652.0
884,2018/04/05,1645.0,1658.762,1679.0,894100,1679.0,1643.0
885,2018/04/06,1628.0,1643.144,1645.0,891800,1674.0,1622.0
886,2018/04/09,1809.0,1821.227,1700.0,7387800,1899.0,1695.0
887,2018/04/10,1813.0,1809.448,1830.0,2498500,1842.0,1763.0
888,2018/04/11,1794.0,1788.355,1831.0,1795600,1842.0,1755.0
889,2018/04/12,1868.0,1886.849,1791.0,3768100,1930.0,1784.0
890,2018/04/13,1868.0,1858.25,1885.0,2296100,1905.0,1827.0
891,2018/04/16,1801.0,1843.707,1880.0,1712700,1892.0,1797.0
892,2018/04/17,1795.0,1766.587,1801.0,2069400,1812.0,1710.0
893,2018/04/18,1884.0,1876.377,1807.0,2856800,1909.0,1792.0
894,2018/04/19,1828.0,1899.94,1944.0,5388100,1975.0,1819.0
895,2018/04/20,1911.0,1906.552,1845.0,3660700,1945.0,1834.0
896,2018/04/23,1928.0,1903.774,1921.0,2292600,1935.0,1864.0
897,2018/04/24,1892.0,1924.935,1939.0,2305800,1970.0,1890.0
898,2018/04/25,1900.0,1895.826,1863.0,1602500,1917.0,1862.0
899,2018/04/26,1891.0,1887.918,1920.0,1433600,1925.0,1863.0
900,2018/04/27,1873.0,1880.896,1888.0,930200,1905.0,1860.0
901,2018/05/01,1919.0,1909.112,1870.0,1230100,1934.0,1868.0
902,2018/05/02,1937.0,1937.545,1919.0,1508600,1959.0,1913.0
903,2018/05/07,1903.0,1904.457,1931.0,1087500,1940.0,1882.0
904,2018/05/08,1894.0,1900.644,1899.0,1001700,1923.0,1865.0
905,2018/05/09,1924.0,1924.793,1900.0,1382000,1945.0,1890.0
906,2018/05/10,1871.0,1892.86,1928.0,1758700,1945.0,1856.0
907,2018/05/11,1838.0,1901.555,1900.0,3534800,1965.0,1832.0
908,2018/05/14,1766.0,1781.843,1810.0,2127600,1822.0,1758.0
909,2018/05/15,1719.0,1732.925,1767.0,1826800,1785.0,1706.0
910,2018/05/16,1731.0,1723.358,1729.0,1212200,1752.0,1692.0
911,2018/05/17,1760.0,1747.006,1722.0,1070600,1763.0,1712.0
912,2018/05/18,1769.0,1767.316,1751.0,936400,1788.0,1745.0
913,2018/05/21,1782.0,1776.224,1776.0,720300,1790.0,1753.0
914,2018/05/22,1763.0,1776.181,1789.0,614100,1798.0,1758.0
915,2018/05/23,1726.0,1739.603,1758.0,954900,1768.0,1720.0
916,2018/05/24,1718.0,1717.523,1723.0,687500,1736.0,1706.0
917,2018/05/25,1727.0,1707.885,1703.0,671700,1729.0,1681.0
918,2018/05/28,1704.0,1708.552,1730.0,632600,1730.0,1696.0
919,2018/05/29,1662.0,1666.245,1699.0,1068000,1700.0,1643.0
920,2018/05/30,1649.0,1639.386,1618.0,969400,1664.0,1611.0
921,2018/05/31,1657.0,1661.483,1660.0,621000,1686.0,1641.0
922,2018/06/01,1670.0,1667.801,1670.0,633400,1682.0,1651.0
923,2018/06/04,1662.0,1673.155,1686.0,920700,1704.0,1652.0
924,2018/06/05,1650.0,1664.274,1680.0,659800,1698.0,1643.0
925,2018/06/06,1609.0,1619.73,1650.0,807900,1653.0,1606.0
926,2018/06/07,1629.0,1628.582,1636.0,628200,1648.0,1613.0
927,2018/06/08,1632.0,1634.224,1624.0,524200,1645.0,1624.0
928,2018/06/11,1616.0,1618.713,1632.0,634200,1638.0,1606.0
929,2018/06/12,1637.0,1629.563,1626.0,478600,1639.0,1613.0
930,2018/06/13,1642.0,1640.357,1637.0,680600,1660.0,1628.0
931,2018/06/14,1643.0,1643.648,1640.0,603000,1659.0,1628.0
932,2018/06/15,1647.0,1649.303,1638.0,478700,1671.0,1638.0
933,2018/06/18,1582.0,1575.553,1625.0,1383800,1628.0,1541.0
934,2018/06/19,1541.0,1568.119,1582.0,1372700,1610.0,1530.0
935,2018/06/20,1575.0,1547.987,1541.0,1000600,1584.0,1510.0
936,2018/06/21,1559.0,1565.304,1566.0,478500,1586.0,1552.0
937,2018/06/22,1513.0,1519.957,1543.0,698200,1545.0,1507.0
938,2018/06/25,1461.0,1482.517,1513.0,942600,1530.0,1454.0
939,2018/06/26,1451.0,1440.546,1430.0,1023600,1473.0,1416.0
940,2018/06/27,1451.0,1456.192,1469.0,1093400,1490.0,1437.0
941,2018/06/28,1460.0,1437.419,1445.0,1499200,1467.0,1402.0
942,2018/06/29,1473.0,1465.19,1450.0,1398300,1502.0,1431.0
943,2018/07/02,1289.0,1343.506,1469.0,4362700,1469.0,1289.0
944,2018/07/03,1303.0,1306.171,1319.0,1715300,1340.0,1278.0
945,2018/07/04,1271.0,1270.664,1290.0,1709400,1290.0,1249.0
946,2018/07/05,1227.0,1243.514,1261.0,1653800,1292.0,1216.0
947,2018/07/06,1268.0,1250.058,1239.0,1631200,1273.0,1217.0
948,2018/07/09,1293.0,1278.501,1260.0,1017100,1300.0,1246.0
949,2018/07/10,1269.0,1282.884,1304.0,1368600,1321.0,1263.0
950,2018/07/11,1233.0,1237.408,1261.0,1212700,1261.0,1222.0
951,2018/07/12,1263.0,1256.18,1237.0,981200,1275.0,1226.0
952,2018/07/13,1259.0,1250.071,1276.0,1388800,1280.0,1225.0
953,2018/07/17,1257.0,1246.417,1246.0,1642400,1269.0,1226.0
954,2018/07/18,1284.0,1278.933,1268.0,1024600,1293.0,1259.0
955,2018/07/19,1277.0,1278.776,1292.0,1247500,1297.0,1258.0
956,2018/07/20,1275.0,1273.517,1265.0,854400,1291.0,1260.0
957,2018/07/23,1275.0,1269.45,1265.0,596200,1281.0,1256.0
958,2018/07/24,1315.0,1301.374,1276.0,1190700,1317.0,1269.0
959,2018/07/25,1280.0,1278.515,1309.0,1793500,1311.0,1258.0
960,2018/07/26,1320.0,1314.26,1286.0,1352100,1333.0,1272.0
961,2018/07/27,1321.0,1320.227,1332.0,1128000,1340.0,1306.0
962,2018/07/30,1279.0,1285.007,1319.0,1683500,1319.0,1266.0
963,2018/07/31,1286.0,1269.875,1260.0,948100,1292.0,1245.0
964,2018/08/01,1296.0,1289.25,1287.0,847700,1307.0,1272.0
965,2018/08/02,1296.0,1306.182,1294.0,845700,1319.0,1290.0
966,2018/08/03,1194.0,1232.265,1297.0,2985700,1308.0,1192.0
967,2018/08/06,1194.0,1182.702,1190.0,2115700,1209.0,1140.0
968,2018/08/07,1183.0,1184.776,1193.0,1613700,1222.0,1154.0
969,2018/08/08,957.0,956.178,973.0,8659500,990.0,925.0
970,2018/08/09,979.0,1011.318,1000.0,7210400,1064.0,966.0
971,2018/08/10,963.0,958.523,969.0,4739700,999.0,930.0
972,2018/08/13,914.0,923.052,941.0,2988600,961.0,907.0
973,2018/08/14,955.0,952.81,927.0,2519800,974.0,923.0
974,2018/08/15,933.0,943.316,941.0,1778800,964.0,926.0
975,2018/08/16,906.0,905.808,914.0,3001000,928.0,888.0
976,2018/08/17,905.0,897.789,900.0,1609600,908.0,885.0
977,2018/08/20,879.0,886.685,906.0,1634800,908.0,876.0
978,2018/08/21,886.0,880.105,880.0,1713400,896.0,861.0
979,2018/08/22,906.0,898.049,900.0,1659500,913.0,877.0
980,2018/08/23,934.0,931.153,907.0,1784400,943.0,907.0
981,2018/08/24,934.0,930.251,933.0,1278400,943.0,916.0
982,2018/08/27,970.0,963.676,950.0,1431000,974.0,950.0
983,2018/08/28,957.0,969.67,1005.0,2553400,1009.0,940.0
984,2018/08/29,1000.0,991.94,970.0,2560200,1014.0,962.0
985,2018/08/30,998.0,998.39,1020.0,2480400,1027.0,976.0
986,2018/08/31,990.0,982.152,980.0,1338600,997.0,965.0
987,2018/09/03,975.0,979.389,995.0,905000,998.0,971.0
988,2018/09/04,1002.0,1000.351,980.0,1765100,1013.0,969.0
989,2018/09/05,1004.0,999.251,995.0,1524500,1010.0,983.0
990,2018/09/06,977.0,968.778,988.0,2688500,996.0,941.0
991,2018/09/07,979.0,972.428,965.0,975800,988.0,955.0
992,2018/09/10,983.0,989.295,976.0,887700,997.0,975.0
993,2018/09/11,976.0,974.852,990.0,966500,994.0,965.0
994,2018/09/12,962.0,984.974,985.0,3158400,1022.0,955.0
995,2018/09/13,947.0,954.326,962.0,1248600,976.0,942.0
996,2018/09/14,987.0,977.471,957.0,1769600,990.0,952.0
997,2018/09/18,984.0,989.458,982.0,1123700,1003.0,973.0
998,2018/09/19,1046.0,1046.412,998.0,3564600,1087.0,995.0
999,2018/09/20,1019.0,1024.163,1046.0,3057200,1062.0,995.0
1000,2018/09/21,1023.0,1032.142,1030.0,1301200,1055.0,1016.0
1001,2018/09/25,1055.0,1047.596,1030.0,1323900,1063.0,1026.0
1002,2018/09/26,1071.0,1067.623,1058.0,1812700,1082.0,1048.0
1003,2018/09/27,1073.0,1080.423,1079.0,1609200,1095.0,1066.0
1004,2018/09/28,1119.0,1108.462,1083.0,1863700,1127.0,1081.0
1005,2018/10/01,1135.0,1130.891,1130.0,1788500,1159.0,1105.0
1006,2018/10/02,1110.0,1115.564,1146.0,1516100,1147.0,1096.0
1007,2018/10/03,1094.0,1099.635,1101.0,1517600,1120.0,1076.0
1008,2018/10/04,1076.0,1089.069,1105.0,1540500,1114.0,1068.0
1009,2018/10/05,1084.0,1075.955,1060.0,1410500,1090.0,1051.0
1010,2018/10/09,1040.0,1049.094,1078.0,1362300,1080.0,1031.0
1011,2018/10/10,1059.0,1050.051,1045.0,856300,1060.0,1032.0
1012,2018/10/11,998.0,997.463,999.0,1961200,1021.0,973.0
1013,2018/10/12,1055.0,1028.451,995.0,1344400,1056.0,994.0
1014,2018/10/15,1048.0,1049.81,1052.0,1206600,1065.0,1030.0
1015,2018/10/16,1068.0,1063.068,1048.0,853200,1073.0,1048.0
1016,2018/10/17,1104.0,1100.846,1088.0,1064400,1112.0,1086.0
1017,2018/10/18,1087.0,1098.211,1108.0,1418300,1112.0,1082.0
1018,2018/10/19,1050.0,1052.999,1064.0,1178200,1076.0,1038.0
1019,2018/10/22,1062.0,1049.503,1048.0,755700,1065.0,1026.0
1020,2018/10/23,1036.0,1048.072,1041.0,873800,1066.0,1036.0
1021,2018/10/24,1026.0,1035.885,1050.0,956400,1057.0,1021.0
1022,2018/10/25,960.0,980.576,989.0,1488000,1001.0,957.0
1023,2018/10/26,934.0,948.501,985.0,1680700,995.0,923.0
1024,2018/10/29,921.0,933.044,936.0,1368800,961.0,912.0
1025,2018/10/30,955.0,937.525,911.0,1785300,962.0,903.0
1026,2018/10/31,996.0,978.924,969.0,1018300,997.0,958.0
1027,2018/11/01,1019.0,1021.62,998.0,1342900,1045.0,990.0
1028,2018/11/02,1046.0,1039.275,1026.0,1251200,1053.0,1018.0
1029,2018/11/05,1091.0,1086.456,1042.0,1650600,1107.0,1034.0
1030,2018/11/06,1090.0,1091.759,1097.0,1415300,1113.0,1072.0
1031,2018/11/07,1078.0,1091.395,1090.0,1296900,1110.0,1072.0
1032,2018/11/08,1111.0,1108.497,1104.0,1927100,1130.0,1082.0
1033,2018/11/09,1128.0,1128.574,1100.0,3016400,1161.0,1070.0
1034,2018/11/12,1065.0,1091.95,1112.0,1871700,1125.0,1061.0
1035,2018/11/13,1062.0,1046.969,1022.0,1575400,1070.0,1018.0
1036,2018/11/14,1076.0,1081.775,1060.0,1363700,1100.0,1055.0
1037,2018/11/15,1081.0,1091.547,1080.0,1337800,1112.0,1071.0
1038,2018/11/16,1059.0,1080.129,1081.0,1178100,1101.0,1056.0
1039,2018/11/19,1077.0,1059.397,1063.0,1974300,1085.0,1017.0
1040,2018/11/20,986.0,1017.278,1047.0,1993200,1065.0,985.0
1041,2018/11/21,998.0,989.937,972.0,1793900,1010.0,956.0
1042,2018/11/22,1012.0,1014.335,1010.0,1333700,1032.0,996.0
1043,2018/11/26,1075.0,1057.082,1015.0,1729200,1079.0,1012.0
1044,2018/11/27,1175.0,1142.025,1087.0,4004800,1177.0,1087.0
1045,2018/11/28,1282.0,1243.095,1190.0,5128600,1285.0,1190.0
1046,2018/11/29,1289.0,1279.483,1300.0,4235800,1322.0,1239.0
1047,2018/11/30,1188.0,1222.382,1281.0,3253500,1289.0,1178.0
1048,2018/12/03,1208.0,1215.905,1226.0,1774200,1238.0,1197.0
1049,2018/12/04,1160.0,1169.901,1197.0,2095000,1222.0,1145.0
1050,2018/12/05,1167.0,1164.615,1139.0,1730900,1194.0,1134.0
1051,2018/12/06,1127.0,1129.812,1167.0,1349300,1172.0,1106.0
1052,2018/12/07,1138.0,1130.851,1148.0,1112800,1160.0,1111.0
1053,2018/12/10,1100.0,1112.535,1116.0,1236000,1140.0,1096.0
1054,2018/12/11,1078.0,1088.861,1100.0,1106200,1117.0,1065.0
1055,2018/12/12,1099.0,1083.655,1078.0,1493200,1104.0,1054.0
1056,2018/12/13,1094.0,1102.119,1111.0,975900,1129.0,1087.0
1057,2018/12/14,980.0,1008.844,1085.0,3387600,1087.0,969.0
1058,2018/12/17,929.0,948.424,971.0,2002500,978.0,928.0
1059,2018/12/18,878.0,897.591,911.0,2538900,928.0,876.0
1060,2018/12/19,876.0,882.441,891.0,2053200,904.0,860.0
1061,2018/12/20,844.0,856.075,861.0,2050800,882.0,835.0
1062,2018/12/21,825.0,818.001,829.0,2276400,834.0,792.0
1063,2018/12/25,753.0,768.084,786.0,2356600,802.0,745.0
1064,2018/12/26,790.0,787.874,780.0,2155100,804.0,768.0
1065,2018/12/27,848.0,847.018,850.0,2160800,865.0,822.0
1066,2018/12/28,831.0,833.98,836.0,1954800,856.0,820.0
1067,2019/01/04,819.0,805.873,792.0,1631000,825.0,788.0
1068,2019/01/07,867.0,867.603,849.0,1960900,886.0,843.0
1069,2019/01/08,873.0,872.193,874.0,1414000,885.0,852.0
1070,2019/01/09,878.0,904.977,888.0,2354100,936.0,876.0
1071,2019/01/10,896.0,879.188,868.0,1942400,899.0,854.0
1072,2019/01/11,904.0,909.472,906.0,1502800,927.0,898.0
1073,2019/01/15,935.0,922.066,890.0,1562900,938.0,890.0
1074,2019/01/16,939.0,943.259,950.0,1265400,960.0,931.0
1075,2019/01/17,1000.0,977.685,951.0,2051200,1008.0,940.0
1076,2019/01/18,976.0,988.406,1003.0,2140100,1019.0,965.0
1077,2019/01/21,969.0,978.042,1000.0,1697200,1012.0,958.0
1078,2019/01/22,947.0,957.192,972.0,1299100,976.0,941.0
1079,2019/01/23,957.0,955.478,941.0,1699300,973.0,928.0
1080,2019/01/24,958.0,953.599,958.0,900500,967.0,943.0
1081,2019/01/25,965.0,964.833,955.0,953200,977.0,952.0
1082,2019/01/28,960.0,974.198,980.0,941600,992.0,959.0
1083,2019/01/29,937.0,926.936,945.0,1890400,947.0,910.0
1084,2019/01/30,877.0,894.033,930.0,2839500,932.0,870.0
1085,2019/01/31,918.0,913.103,901.0,1878700,923.0,893.0
1086,2019/02/01,900.0,903.975,907.0,1326400,918.0,892.0
1087,2019/02/04,943.0,933.572,908.0,1175300,950.0,905.0
1088,2019/02/05,924.0,930.873,951.0,997200,953.0,920.0
1089,2019/02/06,906.0,907.061,926.0,1072900,929.0,897.0
1090,2019/02/07,853.0,866.465,899.0,1914000,900.0,847.0
1091,2019/02/08,818.0,824.433,832.0,1796100,839.0,812.0
1092,2019/02/12,822.0,828.048,815.0,1693000,844.0,814.0
1093,2019/02/13,828.0,829.635,840.0,1404000,853.0,814.0
1094,2019/02/14,847.0,825.71,813.0,3859300,864.0,770.0
1095,2019/02/15,807.0,808.928,840.0,2563800,844.0,793.0
1096,2019/02/18,819.0,823.273,823.0,1334800,842.0,811.0
1097,2019/02/19,814.0,815.882,819.0,796200,826.0,806.0
1098,2019/02/20,808.0,807.726,814.0,1132700,819.0,800.0
1099,2019/02/21,808.0,805.435,810.0,895400,816.0,795.0
1100,2019/02/22,803.0,805.81,805.0,827800,813.0,800.0
1101,2019/02/25,812.0,813.815,809.0,867800,821.0,807.0
1102,2019/02/26,803.0,800.416,813.0,996400,815.0,790.0
1103,2019/02/27,841.0,828.216,805.0,1488800,844.0,805.0
1104,2019/02/28,817.0,827.576,839.0,1043000,852.0,815.0
1105,2019/03/01,838.0,841.301,822.0,1142800,851.0,822.0
1106,2019/03/04,859.0,870.533,867.0,1528100,885.0,858.0
1107,2019/03/05,850.0,845.648,852.0,895000,856.0,838.0
1108,2019/03/06,866.0,855.682,844.0,779100,871.0,841.0
1109,2019/03/07,833.0,836.122,857.0,1282100,859.0,822.0
1110,2019/03/08,805.0,804.122,813.0,1343600,818.0,795.0
1111,2019/03/11,807.0,802.904,807.0,891700,816.0,788.0
1112,2019/03/12,822.0,825.387,819.0,1164300,833.0,813.0
1113,2019/03/13,835.0,829.019,821.0,1084000,837.0,816.0
1114,2019/03/14,835.0,833.219,848.0,914200,850.0,820.0
1115,2019/03/15,833.0,835.714,829.0,756100,842.0,826.0
1116,2019/03/18,853.0,850.303,836.0,851900,860.0,831.0
1117,2019/03/19,846.0,842.003,850.0,621700,851.0,835.0
1118,2019/03/20,864.0,859.875,850.0,994500,870.0,845.0
1119,2019/03/22,853.0,851.949,856.0,813600,860.0,839.0
1120,2019/03/25,846.0,837.419,828.0,936800,846.0,827.0
1121,2019/03/26,845.0,849.199,853.0,1064200,861.0,838.0
1122,2019/03/27,891.0,868.316,847.0,1533600,892.0,841.0
1123,2019/03/28,851.0,855.246,877.0,1481800,880.0,843.0
1124,2019/03/29,869.0,861.205,860.0,887300,870.0,851.0
1125,2019/04/01,882.0,892.571,884.0,1361400,903.0,881.0
1126,2019/04/02,844.0,858.157,886.0,1577300,886.0,843.0
1127,2019/04/03,910.0,920.788,872.0,10285600,966.0,870.0
1128,2019/04/04,858.0,877.498,905.0,3338400,913.0,856.0
1129,2019/04/05,847.0,849.732,860.0,1650600,867.0,842.0
1130,2019/04/08,849.0,850.434,854.0,1208300,858.0,845.0
1131,2019/04/09,820.0,824.733,848.0,1931200,848.0,816.0
1132,2019/04/10,820.0,819.503,808.0,990300,831.0,802.0
1133,2019/04/11,806.0,808.931,818.0,1162700,820.0,803.0
1134,2019/04/12,812.0,809.755,815.0,1051400,818.0,802.0
1135,2019/04/15,831.0,825.634,829.0,1149300,833.0,813.0
1136,2019/04/16,832.0,840.324,850.0,1271700,856.0,829.0
1137,2019/04/17,845.0,833.347,827.0,951300,845.0,823.0
1138,2019/04/18,849.0,843.21,849.0,821700,849.0,837.0
1139,2019/04/19,840.0,844.638,845.0,1243300,859.0,831.0
1140,2019/04/22,843.0,855.17,851.0,1763400,873.0,840.0
1141,2019/04/23,843.0,838.591,846.0,1326100,852.0,828.0
1142,2019/04/24,881.0,884.914,883.0,7414800,912.0,860.0
1143,2019/04/25,833.0,844.102,865.0,3714900,870.0,831.0
1144,2019/04/26,824.0,814.565,828.0,2593100,828.0,800.0
1145,2019/05/07,782.0,794.789,801.0,3313000,814.0,777.0
1146,2019/05/08,763.0,760.752,770.0,2467800,771.0,750.0
1147,2019/05/09,755.0,758.793,775.0,1853800,779.0,747.0
1148,2019/05/10,774.0,762.865,741.0,3108400,782.0,735.0
1149,2019/05/13,762.0,769.98,763.0,1421600,786.0,754.0
1150,2019/05/14,749.0,740.384,732.0,1223700,754.0,725.0
1151,2019/05/15,795.0,774.79,756.0,1358600,795.0,750.0
1152,2019/05/16,817.0,814.428,797.0,2164200,825.0,795.0
1153,2019/05/17,833.0,828.944,830.0,1515600,837.0,820.0
1154,2019/05/20,836.0,836.561,841.0,1029800,844.0,828.0
1155,2019/05/21,842.0,831.16,832.0,1485000,852.0,814.0
1156,2019/05/22,884.0,883.894,850.0,4021600,906.0,848.0
1157,2019/05/23,872.0,877.833,879.0,1494400,893.0,865.0
1158,2019/05/24,926.0,926.107,877.0,9114900,960.0,875.0
1159,2019/05/27,903.0,902.587,930.0,2947600,936.0,884.0
1160,2019/05/28,927.0,911.194,908.0,2426800,929.0,884.0
1161,2019/05/29,916.0,921.951,923.0,1774100,934.0,911.0
1162,2019/05/30,855.0,869.84,898.0,3162500,905.0,850.0
1163,2019/05/31,810.0,818.393,836.0,3620600,839.0,802.0
1164,2019/06/03,769.0,774.921,798.0,2919200,798.0,756.0
1165,2019/06/04,761.0,758.26,768.0,1930800,776.0,746.0
1166,2019/06/05,781.0,776.852,788.0,1603200,789.0,765.0
1167,2019/06/06,777.0,780.368,779.0,1248900,789.0,772.0
1168,2019/06/07,778.0,779.927,780.0,1060600,786.0,773.0
1169,2019/06/10,792.0,787.561,784.0,1370400,800.0,778.0
1170,2019/06/11,807.0,808.249,802.0,1448500,815.0,800.0
1171,2019/06/12,821.0,819.013,807.0,1433800,832.0,803.0
1172,2019/06/13,820.0,821.939,816.0,1056100,829.0,814.0
1173,2019/06/14,837.0,830.575,821.0,1038500,838.0,820.0
1174,2019/06/17,827.0,836.046,840.0,1088500,850.0,824.0
1175,2019/06/18,827.0,823.648,817.0,923200,832.0,810.0
1176,2019/06/19,855.0,851.239,845.0,1297000,862.0,836.0
1177,2019/06/20,863.0,860.201,859.0,1270300,874.0,843.0
1178,2019/06/21,878.0,871.187,862.0,1669700,885.0,852.0
1179,2019/06/24,887.0,877.801,885.0,1446300,889.0,862.0
1180,2019/06/25,904.0,903.688,889.0,1680900,914.0,882.0
1181,2019/06/26,896.0,882.873,893.0,1944900,900.0,865.0
1182,2019/06/27,894.0,895.834,890.0,1296900,906.0,880.0
1183,2019/06/28,916.0,920.089,900.0,2596400,934.0,897.0
1184,2019/07/01,940.0,933.565,927.0,1696100,943.0,919.0
1185,2019/07/02,945.0,941.396,935.0,1219800,949.0,927.0
1186,2019/07/03,937.0,945.879,951.0,2499500,969.0,921.0
1187,2019/07/04,980.0,969.045,946.0,2748100,985.0,941.0
1188,2019/07/05,1009.0,994.972,982.0,2449400,1010.0,968.0
1189,2019/07/08,1005.0,1009.262,1031.0,2152000,1037.0,997.0
1190,2019/07/09,1011.0,1008.43,997.0,1621700,1021.0,985.0
1191,2019/07/10,1012.0,1011.699,1012.0,1386300,1022.0,1001.0
1192,2019/07/11,973.0,981.549,1011.0,2835500,1022.0,955.0
1193,2019/07/12,958.0,956.957,968.0,2504500,973.0,943.0
1194,2019/07/16,887.0,915.979,945.0,2971300,951.0,885.0
1195,2019/07/17,866.0,869.579,902.0,2927100,906.0,856.0
1196,2019/07/18,827.0,835.617,857.0,3020600,857.0,820.0
1197,2019/07/19,857.0,849.79,838.0,2909300,867.0,827.0
1198,2019/07/22,836.0,839.484,847.0,1767300,854.0,831.0
1199,2019/07/23,847.0,847.169,837.0,1315200,858.0,836.0
1200,2019/07/24,886.0,882.865,861.0,3918400,908.0,852.0
1201,2019/07/25,874.0,885.7,896.0,2272400,905.0,870.0
1202,2019/07/26,871.0,863.038,865.0,1926700,878.0,848.0
1203,2019/07/29,877.0,875.71,871.0,1369600,889.0,868.0
1204,2019/07/30,891.0,886.855,879.0,1447600,894.0,879.0
1205,2019/07/31,900.0,890.767,891.0,1657200,901.0,876.0
1206,2019/08/01,909.0,904.887,891.0,1326600,915.0,889.0
1207,2019/08/02,916.0,905.712,894.0,1613500,917.0,886.0
1208,2019/08/05,891.0,896.889,919.0,2669900,928.0,868.0
1209,2019/08/06,907.0,885.651,850.0,2655000,913.0,842.0
1210,2019/08/07,901.0,914.94,910.0,2176100,932.0,901.0
1211,2019/08/08,941.0,931.63,915.0,3758700,955.0,903.0
1212,2019/08/09,850.0,880.464,928.0,8114100,932.0,849.0
1213,2019/08/13,911.0,879.098,842.0,5081900,917.0,827.0
1214,2019/08/14,934.0,919.162,921.0,4536600,939.0,898.0
1215,2019/08/15,920.0,913.966,910.0,3915100,928.0,900.0
1216,2019/08/16,894.0,901.022,928.0,4467300,931.0,884.0
1217,2019/08/19,1017.0,990.951,927.0,27056200,1043.0,921.0
1218,2019/08/20,1050.0,1034.863,1023.0,20246900,1064.0,1005.0
1219,2019/08/21,1023.0,1023.531,1041.0,10388900,1055.0,996.0
1220,2019/08/22,1109.0,1107.189,1053.0,23677000,1141.0,1053.0
1221,2019/08/23,1129.0,1105.348,1110.0,15485100,1133.0,1076.0
