ds,yhat
2019-08-22,2607.023608529507
2019-08-23,2620.8894733980464
2019-08-26,2600.428884166334
2019-08-27,2598.009339915484
2019-08-28,2609.395886039848
2019-08-29,2632.43653847068
2019-08-30,2660.2979785714524
2019-09-02,2704.573126815632
2019-09-03,2699.339399431715
2019-09-04,2692.133049124417
2019-09-05,2691.9237790216202
2019-09-06,2704.2033389377775
2019-09-09,2762.3977917802567
2019-09-10,2762.3820820149617
2019-09-11,2757.6039222656177
2019-09-12,2762.36179899701
2019-09-13,2786.67768540454
2019-09-17,2927.3886008917984
2019-09-18,2936.5806584234315
2019-09-19,2949.832145015225
2019-09-20,2975.882238506641
