{
    "asset" : {
        "generator" : "Khronos glTF Blender I/O v3.4.50",
        "version" : "2.0"
    },
    "scene" : 0,
    "scenes" : [
        {
            "name" : "Scene",
            "nodes" : [
                2
            ]
        }
    ],
    "nodes" : [
        {
            "mesh" : 0,
            "name" : "Object_2",
            "rotation" : [
                0,
                -0.7359645962715149,
                0,
                0.6770200133323669
            ],
            "scale" : [
                0.4000000059604645,
                0.4000000059604645,
                0.4000000059604645
            ],
            "translation" : [
                23.25,
                95.92000579833984,
                82.62999725341797
            ]
        },
        {
            "children" : [
                0
            ],
            "name" : "2aa581c29cd9432f83ace695b4db7cfa.stl.cleaner.gles",
            "translation" : [
                -2.507999897003174,
                0,
                -38.91536331176758
            ]
        },
        {
            "children" : [
                1
            ],
            "name" : "Sketchfab_model",
            "translation" : [
                0,
                -80.66284942626953,
                -44.255435943603516
            ]
        }
    ],
    "materials" : [
        {
            "doubleSided" : true,
            "name" : "Scene_-_Root",
            "pbrMetallicRoughness" : {
                "baseColorFactor" : [
                    0.01768334023654461,
                    0.6065215468406677,
                    0.9791519045829773,
                    1
                ],
                "metallicFactor" : 0,
                "roughnessFactor" : 0.6000000238418579
            }
        }
    ],
    "meshes" : [
        {
            "name" : "Object_0",
            "primitives" : [
                {
                    "attributes" : {
                        "POSITION" : 0,
                        "NORMAL" : 1
                    },
                    "indices" : 2,
                    "material" : 0
                }
            ]
        }
    ],
    "accessors" : [
        {
            "bufferView" : 0,
            "componentType" : 5126,
            "count" : 3288,
            "max" : [
                5.015999794006348,
                124.91831970214844,
                41.423362731933594
            ],
            "min" : [
                0,
                0,
                0
            ],
            "type" : "VEC3"
        },
        {
            "bufferView" : 1,
            "componentType" : 5126,
            "count" : 3288,
            "type" : "VEC3"
        },
        {
            "bufferView" : 2,
            "componentType" : 5123,
            "count" : 17664,
            "type" : "SCALAR"
        }
    ],
    "bufferViews" : [
        {
            "buffer" : 0,
            "byteLength" : 39456,
            "byteOffset" : 0,
            "target" : 34962
        },
        {
            "buffer" : 0,
            "byteLength" : 39456,
            "byteOffset" : 39456,
            "target" : 34962
        },
        {
            "buffer" : 0,
            "byteLength" : 35328,
            "byteOffset" : 78912,
            "target" : 34963
        }
    ],
    "buffers" : [
        {
            "byteLength" : 114240,
            "uri" : "rietjeGlas1.bin"
        }
    ]
}
