AntiFeatures:NonFreeNet
Categories:Internet
License:GPL-2.0-or-later
Web Site:https://github.com/indywidualny/FaceSlim/blob/HEAD/README.md
Source Code:https://github.com/indywidualny/FaceSlim
Issue Tracker:https://github.com/indywidualny/FaceSlim/issues
Changelog:https://github.com/indywidualny/FaceSlim/releases
Donate:https://www.paypal.com/cgi-bin/webscr?cmd=_donations&business=koras%2eevil%40gmail%2ecom&lc=GB&item_name=Krzysztof%20Grabowski&currency_code=USD&bn=PP%2dDonationsBF%3abtn_donateCC_LG%2egif%3aNonHosted
Bitcoin:1JUaZytkub2CP5jhRYQDDY6pibqrUUSp2y

Auto Name:Face Slim
Summary:Connect to Facebook
Description:
Unofficial app built around the mobile Facebook site.

''Face Slim'' is an unofficial Facebook application for Android devices that
resembles the Facebook Mobile Web Application before Facebook started removing
features. FaceSlim is free of spyware, unlike what is built into the official
Facebook and Facebook Messenger applications.
.

Repo Type:git
Repo:https://github.com/indywidualny/FaceSlim

Build:1.3.2,1
    commit=v1.3.2
    subdir=app
    gradle=yes

Build:1.4.0,2
    commit=v1.4.0
    subdir=app
    gradle=yes

Build:1.4.1,3
    commit=v1.4.1
    subdir=app
    gradle=yes

Build:1.5.0,4
    commit=v1.5.0
    subdir=app
    gradle=yes

Build:1.5.2,6
    commit=v1.5.2
    subdir=app
    gradle=yes

Build:1.6.0,7
    disable=play-services
    commit=v1.6.0
    subdir=app
    gradle=yes

Build:1.6.1,8
    commit=v1.6.1
    subdir=app
    gradle=yes

Build:1.6.2,9
    commit=v1.6.2
    subdir=app
    gradle=yes

Build:1.7.0,10
    commit=v1.7.0
    subdir=app
    gradle=yes

Build:1.7.1,11
    disable=request by upstream
    commit=v1.7.1
    subdir=app
    gradle=yes

Build:1.7.2,12
    commit=v1.7.2
    subdir=app
    gradle=yes

Build:1.7.3,13
    commit=v1.7.3
    subdir=app
    gradle=yes

Build:1.7.4,14
    commit=v1.7.4
    subdir=app
    gradle=yes

Build:1.7.5,15
    commit=v1.7.5
    subdir=app
    gradle=yes

Build:1.7.6,16
    commit=v1.7.6
    subdir=app
    gradle=yes

Build:1.8.0,17
    commit=v1.8.0
    subdir=app
    gradle=yes

Build:1.8.1,18
    commit=v1.8.1
    subdir=app
    gradle=yes

Build:1.8.2,19
    commit=v1.8.2
    subdir=app
    gradle=yes

Build:1.8.3,20
    commit=v1.8.3
    subdir=app
    gradle=yes

Build:1.8.4,21
    commit=v1.8.4
    subdir=app
    gradle=yes

Build:1.9.1,23
    commit=v1.9.1
    subdir=app
    gradle=yes

Build:2.0.0,24
    commit=v2.0.0
    subdir=app
    gradle=yes

Build:2.1.0,25
    commit=v2.1.0
    subdir=app
    gradle=yes

Build:2.2.0,26
    commit=v2.2.0
    subdir=app
    gradle=yes

Build:2.3.0,27
    commit=v2.3.0
    subdir=app
    gradle=yes

Build:2.3.1,28
    commit=v2.3.1
    subdir=app
    gradle=yes

Build:2.4.0,30
    commit=v2.4.0
    subdir=app
    gradle=yes

Build:2.4.1,31
    commit=v2.4.1
    subdir=app
    gradle=yes

Build:2.4.2,32
    commit=v2.4.2
    subdir=app
    gradle=yes

Build:2.5.0,33
    commit=v2.5.0
    subdir=app
    gradle=yes

Build:2.5.1,34
    commit=v2.5.1
    subdir=app
    gradle=yes

Build:2.5.2,35
    commit=v2.5.2
    subdir=app
    gradle=yes

Build:2.6.0,40
    commit=v2.6.0
    subdir=app
    gradle=yes

Build:2.7.0,41
    commit=v2.7.0
    subdir=app
    gradle=yes

Build:2.8.0,42
    commit=v2.8.0
    subdir=app
    gradle=yes

Build:2.9.0,43
    commit=v2.9.0
    subdir=app
    gradle=yes

Build:3.0.0,44
    commit=v3.0.0
    subdir=app
    gradle=yes

Build:3.0.1,45
    commit=v3.0.1
    subdir=app
    gradle=yes

Build:3.0.2,46
    commit=v3.0.2
    subdir=app
    gradle=yes

Build:3.0.3,48
    commit=v3.0.3
    subdir=app
    gradle=yes

Build:3.1.0,49
    commit=v3.1.0
    subdir=app
    gradle=yes

Build:3.2.0,50
    commit=v3.2.0
    subdir=app
    gradle=yes

Build:3.2.1,51
    commit=v3.2.1
    subdir=app
    gradle=yes

Build:3.3.0,52
    commit=v3.3.0
    subdir=app
    gradle=yes

Build:3.4.0,53
    commit=v3.4.0
    subdir=app
    gradle=yes

Auto Update Mode:Version v%v
Update Check Mode:Tags
Current Version:3.4.0
Current Version Code:53
