<svg width="24" height="24" viewBox="0 0 64 64" fill="none" xmlns="http://www.w3.org/2000/svg">
<path d="M34 47.876C34 48.9806 33.1046 49.876 32 49.876H28C26.8954 49.876 26 48.9806 26 47.876V37.876C26 36.7714 26.8954 35.876 28 35.876H32C33.1046 35.876 34 36.7714 34 37.876V47.876ZM32 45.876C32 44.7714 31.1046 43.876 30 43.876V43.876C28.8954 43.876 28 44.7714 28 45.876V45.876C28 46.9806 28.8954 47.876 30 47.876V47.876C31.1046 47.876 32 46.9806 32 45.876V45.876ZM34 32C34 33.1046 33.1046 34 32 34V34C30.8954 34 30 33.1046 30 32V30H32C33.1046 30 34 30.8954 34 32V32ZM28 30C26.8954 30 26 29.1046 26 28V28C26 26.8954 26.8954 26 28 26H30V30H28ZM26 20C26 18.8954 26.8954 18 28 18H30V22H28C26.8954 22 26 21.1046 26 20V20ZM26 12C26 10.8954 26.8954 10 28 10V10C29.1046 10 30 10.8954 30 12V14H28C26.8954 14 26 13.1046 26 12V12ZM32 14C33.1046 14 34 14.8954 34 16V16C34 17.1046 33.1046 18 32 18H30V14H32ZM32 22C33.1046 22 34 22.8954 34 24V24C34 25.1046 33.1046 26 32 26H30V22H32ZM12 60C10.8954 60 10 59.1046 10 58V8C10 6.89543 10.8954 6 12 6H38.009C39.1086 6 40 6.8914 40 7.991V7.991C40 9.0906 39.1086 9.982 38.009 9.982H16C14.8954 9.982 14 10.8774 14 11.982V54.018C14 55.1226 14.8954 56.018 16 56.018H46.036C47.1406 56.018 48.036 55.1226 48.036 54.018V19.982C48.036 18.8874 48.9234 18 50.018 18V18C51.1126 18 52 18.8874 52 19.982V58C52 59.1046 51.1046 60 50 60H12ZM42 6.17395C42 6.07788 42.0779 6 42.174 6V6C42.2201 6 42.2643 6.01832 42.2969 6.05094L51.9743 15.7263C51.9908 15.7428 52 15.7651 52 15.7883V15.7883C52 15.8367 51.9607 15.876 51.9123 15.876H44C42.8954 15.876 42 14.9806 42 13.876V6.17395Z" fill="black"/>
</svg>
