[
    {
        "name": "Create CRUD APP with Next Js",
        "description": "create with firebase is a plus!",
        "id": 1,
        "dateCreated": "2021-04-08T05:33:05.184Z",
        "dateUpdated": "2022-12-12T17:14:12.618Z"
    }
]