{
  "sntp": {
    "enable": true, 
    "server": "pool.ntp.org", 
    "retry_min": 1, 
    "retry_max": 30, 
    "update_interval": 7200
  }, 
  "wifi": {
    "sta": {
      "enable": false, 
      "ssid": "AndroidAP", 
      "pass": "swels4188", 
      "ip": "", 
      "netmask": "", 
      "gw": "", 
      "nameserver": "", 
      "dhcp_hostname": ""
    }, 
    "ap": {
      "enable": true, 
      "ssid": "Cockpit", 
      "pass": "Mongoose", 
      "hidden": false, 
      "channel": 6, 
      "max_connections": 10, 
      "ip": "192.168.4.1", 
      "netmask": "255.255.255.0", 
      "gw": "192.168.4.1", 
      "dhcp_start": "192.168.4.2", 
      "dhcp_end": "192.168.4.100", 
      "keep_enabled": true, 
      "trigger_on_gpio": -1
    }
  }, 
  "device": {
    "id": "esp8266_??????", 
    "password": ""
  }, 
  "debug": {
    "udp_log_addr": "", 
    "mbedtls_level": 0, 
    "level": 2, 
    "stdout_uart": 0, 
    "stderr_uart": 0, 
    "factory_reset_gpio": -1, 
    "mg_mgr_hexdump_file": ""
  }, 
  "sys": {
    "wdt_timeout": 30
  }, 
  "conf_acl": "*", 
  "http": {
    "enable": true, 
    "listen_addr": "80", 
    "ssl_cert": "", 
    "ssl_key": "", 
    "ssl_ca_cert": "", 
    "upload_acl": "*", 
    "hidden_files": "", 
    "auth_domain": "", 
    "auth_file": ""
  }, 
  "rpc": {
    "enable": true, 
    "max_frame_size": 4096, 
    "max_queue_length": 25, 
    "default_out_channel_idle_close_timeout": 10, 
    "ws": {
      "enable": true, 
      "server_address": "", 
      "reconnect_interval_min": 1, 
      "reconnect_interval_max": 60, 
      "ssl_server_name": "", 
      "ssl_ca_file": "", 
      "ssl_client_cert_file": ""
    }, 
    "uart": {
      "uart_no": 0, 
      "baud_rate": 115200, 
      "fc_type": 2, 
      "wait_for_start_frame": true
    }
  }
}