20.0,148,18,1
21.0,190,18,1
22.0,158,18,1
23.0,162,14,1
24.0,140,18,1
25.0,146,18,1
26.0,138,18,1
27.0,146,13,1
28.0,142,17,1
29.0,159,17,1
30.0,166,20,1
31.0,129,17,1
32.0,136,18,1
33.0,132,18,1
34.0,127,17,1
35.0,99,18,1
36.0,97,17,1
37.0,110,18,1
37.0,100,18,1
38.0,120,20,1
39.0,128,18,1
40.0,115,18,1
41.0,107,17,1
42.0,131,18,1
43.5,120,20,4
44.0,89,18,1
45.0,105,18,1
46.0,91,18,1
47.0,94,18,1
48.0,65,18,1
48.0,96,18,1
49.0,40,17,1
49.0,59,18,1
50.0,92,20,1
51.0,103,17,1
52.0,91,20,1
53.0,99,18,1
54.0,75,14,1
55.0,75,18,1
56.0,77,18,1
57.0,72,18,1
58.0,106,18,1
59.0,90,18,1
60.0,104,18,1
61.0,113,20,1
62.0,112,35,1
63.0,102,42,1
64.0,128,46,1
37.0,103,16,3
37.0,57,18,3
37.0,102,17,3
37.0,119,17,3
37.0,125,26,3
39.5,99,18,2
39.5,96,17,2
41.5,91,18,2
43.5,89,18,2
43.5,72,18,2
45.5,83,18,2
47.5,79,16,2
49.5,58,21,2
51.5,79,21,2
53.5,68,18,2
55.5,81,18,2
55.5,79,18,2
57.5,78,25,2
57.5,99,18,2
59.5,97,18,2
61.0,123,25,1
61.0,95,18,1
62.0,119,23,1
63.0,100,16,1
63.0,138,18,1
64.0,121,14,1
64.0,84,23,1
65.0,106,17,1
65.0,92,18,1
66.0,91,18,1
67.0,87,13,1
68.0,78,12,1
69.0,107,17,1
70.0,90,17,1
71.0,110,16,1
72.0,124,18,1
72.0,113,16,1
73.0,110,16,1
74.0,132,18,1
75.0,113,18,1
75.0,114,16,1
76.0,123,18,1
77.0,142,18,1
77.0,108,18,1
78.0,125,18,1
78.0,106,16,1
78.0,103,14,1
79.0,114,14,1
79.0,112,17,1
80.0,122,21,1
80.0,112,18,1
80.0,103,18,1
81.0,113,18,1
81.0,114,18,1
81.0,98,17,1
82.0,101,21,1
82.0,127,18,1
82.0,110,17,1
83.0,118,20,1
83.0,100,18,1
83.0,105,18,1
83.0,135,17,1
84.0,122,20,1
84.0,131,17,1
85.0,107,16,1
85.0,121,17,1
86.0,129,17,1
86.0,143,20,1
86.0,154,18,1
87.0,131,18,1
87.0,138,18,1
87.0,103,18,1
88.0,144,21,1
88.0,125,18,1
89.0,110,17,1
89.0,114,18,1
89.0,115,18,1
90.0,123,17,1
90.0,109,17,1
90.0,123,17,1
91.0,113,20,1
92.0,106,20,1
93.0,131,17,1
94.0,121,17,1
94.0,126,17,1
95.0,125,17,1
96.0,126,27,1
97.0,141,27,1
98.0,95,26,1
99.0,116,26,1
100.0,109,26,1
101.0,87,26,1
101.5,112,20,2
102.0,116,26,1
103.0,118,27,1
103.5,97,17,2
104.0,113,26,1
105.0,122,26,1
106.0,96,27,1
106.0,113,14,1
107.0,104,20,1
107.0,127,13,1
108.0,122,26,1
108.0,113,17,1
109.0,157,26,1
109.0,130,26,1
110.0,117,26,1
110.5,113,17,2
111.0,121,27,1
112.0,101,30,1
112.0,139,17,1
112.0,118,18,1
112.0,126,26,1
112.0,152,26,1
113.0,139,14,1
114.0,117,18,1
115.0,112,17,1
116.0,114,21,1
117.0,110,14,1
118.0,97,14,1
119.0,104,13,1
120.0,86,17,1
121.0,76,17,1
122.0,101,18,1
122.0,97,17,1
122.0,88,18,1
123.0,71,17,1
123.0,96,17,1
124.0,103,17,1
125.0,107,17,1
126.0,114,13,1
127.0,100,18,1
128.0,128,17,1
129.0,123,17,1
129.0,82,18,1
130.0,101,23,1
130.0,90,23,1
130.0,100,18,1
128.0,114,18,1
129.0,79,18,1
130.0,102,18,1
131.0,139,21,1
132.0,52,20,1
132.0,105,18,1
133.0,80,21,1
134.0,84,18,1
135.0,118,18,1
136.0,126,21,1
137.0,125,18,1
137.0,118,18,1
138.0,114,21,1
139.0,122,21,1
140.0,119,20,1
141.0,138,20,1
142.0,183,18,1
143.0,148,22,1
143.0,152,18,1
144.0,170,18,1
145.0,153,18,1
146.0,154,18,1
147.0,170,18,1
148.0,166,20,1
148.0,162,18,1
149.0,194,20,1
149.0,177,18,1
150.0,147,18,1
151.0,155,18,1
152.0,192,18,1
152.0,170,18,1
153.0,189,18,1
154.0,225,18,1
155.0,229,21,1
156.0,227,18,1
157.0,215,18,1
158.0,240,20,1
159.0,212,20,1
160.0,214,18,1
161.0,209,18,1
162.0,240,20,1
163.0,224,18,1
164.0,222,25,1
165.0,219,16,1
166.0,224,18,1
191.0,137,18,1
192.0,111,20,1
192.0,171,18,1
193.0,151,18,1
194.0,171,21,1
195.0,165,22,1
225.0,121,18,1
226.0,148,17,1
226.0,108,18,1
227.0,125,18,1
228.0,132,17,1
229.0,121,18,1
230.0,108,18,1
231.0,106,18,1
232.0,89,17,1
232.0,110,17,1
233.0,91,18,1
234.0,105,18,1
235.0,111,18,1
236.0,84,18,1
237.0,88,18,1
238.0,128,18,1
239.0,90,18,1
239.0,82,18,1
240.0,117,18,1
241.0,122,20,1
242.0,122,17,1
243.0,149,18,1
243.0,124,18,1
244.0,126,20,1
245.0,109,20,1
246.0,119,16,1
247.0,107,14,1
247.0,90,17,1
248.0,165,23,1
248.0,149,18,1
248.0,123,18,1
249.0,95,21,1
250.0,98,23,1
250.0,84,18,1
251.0,81,20,1
252.0,116,21,1
253.0,95,20,1
254.0,125,18,1
255.0,104,18,1
256.0,116,20,1
257.0,125,20,1
258.0,126,18,1
259.0,140,14,1
260.0,142,14,1
-4.0,179,30,1
-3.0,193,20,1
-2.0,208,18,1
-1.0,207,18,1
0.0,210,18,1
1.0,213,18,1
2.0,182,20,1
3.0,178,17,1
5.0,187,21,1
6.0,174,21,1
6.0,209,18,1
7.0,185,17,1
7.0,230,21,1
8.0,178,17,1
8.0,169,18,1
9.0,170,21,1
10.0,197,21,1
11.0,174,20,1
12.0,145,18,1
12.0,141,18,1
13.0,152,17,1
14.0,147,18,1
15.0,150,20,1
16.0,141,20,1
17.0,167,18,1
18.0,181,18,1
18.0,191,20,1
19.0,153,20,1
20.0,140,18,1
21.0,154,18,1
21.0,172,18,1
22.0,151,18,1
23.0,153,22,1
24.0,158,17,1
25.0,115,17,1
26.0,111,18,1
27.0,153,17,1
28.0,123,20,1
29.0,118,20,1
30.0,135,20,1
31.0,126,18,1
32.0,124,17,1
32.0,121,18,1
33.0,93,17,1
33.0,123,20,1
34.0,133,20,1
35.0,83,42,1
169.0,198,18,1
169.0,212,18,1
170.0,182,18,1
170.0,171,17,1
171.0,169,18,1
172.0,165,18,1
173.0,157,13,1
174.0,150,18,1
174.0,147,18,1
175.0,161,18,1
176.0,181,17,1
177.0,128,18,1
177.0,192,18,1
178.0,174,14,1
179.0,164,18,1
180.0,175,18,1
181.0,175,18,1
182.0,183,18,1
183.0,183,18,1
184.0,167,18,1
185.0,163,18,1
186.0,157,18,1
187.0,187,17,1
188.0,162,18,1
189.0,147,18,1
189.0,147,18,1
190.0,156,18,1
190.0,138,21,1
191.0,150,18,1
192.0,129,18,1
193.0,157,21,1
194.0,155,13,1
195.0,156,16,1
196.0,155,18,1
197.0,159,18,1
197.0,125,20,1
197.0,141,21,1
198.0,155,18,1
199.0,173,14,1
200.0,157,18,1
200.0,151,17,1
202.0,160,18,1
203.0,142,18,1
204.0,143,18,1
204.0,135,18,1
205.0,149,18,1
205.0,180,21,1
206.0,178,18,1
207.0,168,14,1
207.0,145,22,1
208.0,158,18,1
209.0,196,17,1
209.0,192,21,1
210.0,159,18,1
211.0,161,17,1
211.0,144,21,1
212.0,148,18,1
213.0,149,21,1
214.0,149,21,1
215.0,150,20,1
216.0,138,23,1
217.0,140,20,1
218.0,155,16,1
219.0,168,14,1
220.0,129,20,1
221.0,113,18,1
222.0,123,20,1
223.0,103,20,1
224.0,75,16,1
225.0,109,14,1
226.0,91,18,1
227.0,101,18,1
228.0,108,17,1
229.0,107,18,1
230.0,104,17,1
230.0,104,17,1
231.0,117,17,1
231.0,58,18,1
232.0,82,17,1
232.0,79,17,1
233.0,103,17,1
233.0,107,17,1
234.0,66,21,1
235.0,80,18,1
236.0,90,18,1
237.0,92,18,1
238.0,113,18,1
239.0,96,17,1
239.0,71,18,1
240.0,95,17,1
240.0,70,18,1
241.0,77,20,1
242.0,101,18,1
243.0,108,17,1
243.0,87,17,1
244.0,120,18,1
245.0,105,17,1
246.0,81,17,1
246.0,51,18,1
247.0,95,18,1
248.0,100,17,1
248.0,86,17,1
249.0,113,17,1
249.0,61,18,1
250.0,115,20,1
250.0,111,20,1
251.0,92,18,1
252.0,77,18,1
253.0,106,18,1
254.0,90,17,1
255.0,96,18,1
256.0,107,18,1
257.0,119,18,1
258.0,106,18,1
259.0,127,18,1
260.0,129,18,1
261.0,139,21,1
262.0,134,18,1
263.0,138,18,1
264.0,117,17,1
264.0,118,21,1
250.0,110,20,1
251.0,130,20,1
252.0,132,20,1
253.0,101,20,1
254.0,135,18,1
255.0,132,13,1
255.0,148,18,1
256.0,141,16,1
256.0,103,20,1
257.0,130,18,1
258.0,131,18,1
259.0,132,21,1
260.0,158,21,1
261.0,119,20,1
262.0,110,18,1
263.0,155,21,1
263.0,136,23,1
264.0,113,18,1
264.0,118,25,1
265.0,150,25,1
266.0,153,18,1
267.0,167,18,1
268.0,163,20,1
269.0,166,18,1
270.0,159,17,1
272.0,197,18,1
273.0,173,17,1
273.0,200,18,1
274.0,189,18,1
274.0,162,18,1
275.0,172,18,1
276.0,222,21,1
276.0,169,20,1
277.0,136,18,1
277.0,158,18,1
278.0,183,18,1
279.0,166,18,1
279.0,131,21,1
280.0,194,18,1
281.0,183,20,1
282.0,179,21,1
283.0,194,20,1
284.0,209,18,1
285.0,223,14,1
286.0,218,18,1
286.0,236,14,1
287.0,209,20,1
288.0,220,20,1
289.0,209,20,1
290.0,249,18,1
290.0,252,20,1
291.0,233,21,1
292.0,209,20,1
293.0,249,16,1
294.0,249,17,1
295.0,236,17,1
296.0,247,18,1
296.0,210,20,1
297.0,256,20,1
299.0,251,20,1
300.0,248,18,1
300.0,243,20,1
301.0,276,18,1
301.0,242,20,1
302.0,267,18,1
303.0,263,21,1
304.0,274,18,1
305.0,279,18,1
306.0,289,13,1
306.0,265,17,1
307.0,268,20,1
308.0,287,18,1
309.0,283,22,1
310.0,311,17,1
310.0,338,22,1
311.0,311,13,1
311.0,267,20,1
312.0,324,18,1
313.0,299,22,1
314.0,308,17,1
314.0,273,20,1
315.0,317,17,1
315.0,268,20,1
316.0,334,20,1
317.0,310,20,1
318.0,338,20,1
319.0,337,20,1
320.0,343,20,1
321.0,349,17,1
321.0,280,20,1
322.0,350,20,1
323.0,317,20,1
324.0,366,20,1
325.0,320,20,1
325.0,323,14,1
326.0,349,14,1
327.0,302,21,1
328.0,342,20,1
328.0,337,18,1
329.0,338,18,1
330.0,305,18,1
330.0,352,21,1
331.0,324,18,1
332.0,335,18,1
333.0,357,20,1
334.0,368,18,1
335.0,332,18,1
335.0,393,20,1
336.0,337,20,1
337.0,369,18,1
338.0,340,20,1
339.0,379,20,1
339.0,383,20,1
340.0,352,20,1
341.0,356,17,1
342.0,332,20,1
342.0,390,22,1
343.0,372,21,1
344.0,374,21,1
344.0,355,20,1
344.0,391,22,1
345.0,356,21,1
345.0,401,21,1
346.0,365,20,1
346.0,420,18,1
347.0,372,20,1
348.0,354,20,1
349.0,365,21,1
349.0,340,18,1
350.0,344,18,1
350.0,324,18,1
351.0,349,18,1
352.0,338,18,1
353.0,355,20,1
354.0,347,18,1
355.0,327,18,1
356.0,326,18,1
357.0,343,17,1
358.0,351,21,1
359.0,319,18,1
360.0,314,18,1
361.0,321,18,1
362.0,343,18,1
363.0,342,18,1
364.0,334,18,1
365.0,325,20,1
366.0,349,18,1
367.0,324,17,1
368.0,333,18,1
369.0,361,18,1
370.0,331,18,1
371.0,341,18,1
372.0,320,18,1
373.0,336,20,1
374.0,349,18,1
375.0,333,18,1
376.0,333,18,1
377.0,303,20,1
378.0,317,18,1
379.0,325,20,1
380.0,317,20,1
381.0,325,18,1
382.0,336,20,1
383.0,313,18,1
383.0,370,20,1
384.0,329,18,1
384.0,287,18,1
385.0,318,20,1
386.0,331,21,1
387.0,335,18,1
388.0,330,18,1
389.0,323,20,1
390.0,354,20,1
391.0,320,18,1
392.0,313,18,1
393.0,337,20,1
394.0,310,20,1
395.0,309,17,1
396.0,311,18,1
397.0,327,18,1
398.0,281,21,1
399.0,310,21,1
400.0,317,18,1
400.0,330,18,1
400.0,287,22,1
401.0,297,22,1
402.0,294,18,1
403.0,291,18,1
404.0,322,20,1
405.0,306,18,1
406.0,325,18,1
407.0,314,17,1
408.0,308,18,1
408.0,326,18,1
409.0,282,17,1
409.0,318,17,1
410.0,294,18,1
410.0,340,18,1
411.0,280,18,1
411.0,326,21,1
412.0,300,20,1
412.0,303,18,1
413.0,285,18,1
413.0,270,17,1
414.0,303,20,1
414.0,319,18,1
415.0,299,18,1
415.0,311,18,1
416.0,297,20,1
416.0,332,18,1
417.0,298,17,1
417.0,317,18,1
418.0,288,20,1
418.0,293,18,1
419.0,293,17,1
420.0,316,18,1
421.0,307,18,1
422.0,310,17,1
423.0,319,18,1
424.0,313,18,1
425.0,365,20,1
425.0,293,18,1
426.0,334,18,1
427.0,334,18,1
428.0,343,21,1
429.0,329,21,1
430.0,350,18,1
431.0,367,21,1
433.0,328,18,1
434.0,348,18,1
435.0,355,17,1
436.0,344,18,1
437.0,341,18,1
438.0,346,18,1
439.0,371,17,1
440.0,359,18,1
15.5,100,18,10
25.5,89,18,10
35.5,89,18,10
45.5,32,18,10
135.5,113,18,10
145.5,135,20,10
155.5,225,20,10
165.5,207,18,10
175.5,195,20,10
185.5,177,18,10
195.5,191,20,10
195.5,214,20,10
205.5,183,20,10
215.5,155,18,10
225.5,130,20,10
235.5,103,21,10
235.5,91,18,10
245.5,108,14,10
255.5,116,18,10
265.5,164,20,10
275.5,156,17,10
285.5,216,18,10
285.5,196,18,10
295.5,237,18,10
305.5,259,18,10
315.5,279,20,10
325.5,338,20,10
335.5,356,18,10
345.5,332,20,10
355.5,360,18,10
365.5,317,17,10
375.5,327,18,10
385.5,331,20,10
395.5,322,18,10
405.5,312,20,10
415.5,276,20,10
425.5,312,21,10
435.5,345,18,10
445.5,340,18,10
814.5,896,20,10
834.5,952,20,10
844.5,943,18,10
854.5,942,20,10
864.5,920,18,10
874.5,878,18,10
874.5,928,16,10
884.5,928,14,10
894.5,918,16,10
904.5,931,20,10
914.5,942,18,10
1015.5,1154,21,10
1025.5,1148,20,10
1035.5,1106,20,10
1045.5,1103,21,10
1055.5,1137,21,10
1065.5,1175,22,10
1075.5,1175,20,10
1085.5,1188,21,10
1095.5,1184,20,10
1095.5,1237,22,10
1105.5,1211,21,10
1115.5,1184,20,10
1125.5,1206,20,10
1135.5,1186,20,10
1145.5,1198,21,10
1155.5,1221,21,10
1155.5,1255,20,10
1155.5,1221,21,10
1165.5,1170,17,10
1175.5,1245,21,10
1185.5,1284,20,10
1195.5,1317,20,10
1195.5,1311,21,10
1205.5,1245,21,10
1215.5,1229,17,10
1225.5,1245,20,10
1235.5,1275,18,10
1245.5,1296,21,10
1255.5,1262,21,10
1265.5,1331,23,10
1275.5,1324,22,10
1285.5,1342,22,10
1295.5,1371,21,10
1305.5,1397,22,10
1315.5,1467,21,10
1315.5,1453,22,10
1325.5,1444,21,10
1335.5,1442,42,10
1345.5,1452,20,10
1355.5,1489,22,10
1365.5,1475,21,10
1375.5,1497,22,10
1385.5,1491,21,10
1395.5,1509,22,10
1405.5,1480,20,10
1405.5,1517,21,10
1415.5,1559,21,10
1425.5,1577,21,10
1425.5,1600,17,10
1435.5,1573,18,10
1445.5,1580,20,10
1455.5,1561,17,10
1465.5,1561,22,10
1475.5,1560,20,10
1485.5,1578,21,10
1495.5,1579,21,10
1505.5,1556,21,10
1515.5,1560,21,10
1525.5,1618,17,10
1535.5,1639,21,10
1545.5,1666,20,10
1555.5,1666,17,10
1565.5,1681,14,10
1575.5,1702,14,10
1575.5,1726,21,10
1585.5,1675,20,10
1595.5,1699,21,10
1605.5,1698,20,10
1615.5,1729,21,10
1625.5,1723,22,10
1635.5,1775,21,10
1645.5,1773,21,10
1655.5,1726,20,10
1665.5,1762,21,10
1675.5,1713,20,10
1685.5,1698,21,10
1695.5,1741,20,10
1695.5,1795,21,10
1705.5,1772,22,10
1705.5,1767,20,10
1715.5,1807,22,10
1685.5,1708,21,10
1695.5,1785,20,10
1705.5,1781,17,10
1715.5,1818,21,10
1725.5,1819,22,10
1735.5,1834,22,10
1745.5,1833,21,10
1745.5,1868,21,10
1755.5,1820,22,10
1765.5,1808,20,10
1775.5,1831,21,10
1785.5,1841,23,10
1795.5,1841,20,10
1805.5,1837,21,10
1815.5,1818,20,10
1815.5,1848,20,10
1825.5,1907,20,10
1825.5,1895,18,10
1825.5,1903,23,10
1835.5,1901,23,10
1845.5,1902,22,10
1855.5,1844,20,10
1855.5,1897,17,10
1865.5,1888,21,10
1875.5,1930,21,10
1875.5,1901,20,10
1885.5,1936,14,10
1895.5,1972,16,10
1895.5,1917,20,10
1905.5,1972,21,10
1915.5,1927,25,10
1925.5,1987,20,10
1935.5,2005,14,10
1945.5,1970,16,10
1945.5,2005,21,10
1953.5,2034,21,10
1953.5,2059,22,10
1963.5,1981,21,10
1963.5,2009,16,10
1973.5,2021,21,10
1983.5,1974,21,10
1983.5,2033,14,10
1993.5,2067,22,10
1993.5,2049,17,10
2003.5,2029,20,10
2003.5,2087,21,10
2013.5,2084,21,10
2013.5,2086,22,10
2023.5,2085,22,10
2033.5,2043,21,10
2033.5,2054,21,10
2043.5,2096,20,10
2053.5,2066,21,10
2063.5,2073,22,10
2073.5,2097,22,10
2083.5,2083,22,10
2093.5,2080,17,10
635.5,619,20,10
645.5,621,18,10
645.5,613,17,10
655.5,661,20,10
665.5,713,18,10
675.5,767,20,10
685.5,755,18,10
695.5,811,18,10
705.5,803,18,10
715.5,804,18,10
725.5,777,18,10
725.5,812,18,10
735.5,832,18,10
745.5,867,18,10
755.5,857,18,10
765.5,887,17,10
775.5,881,18,10
785.5,848,18,10
785.5,867,20,10
795.5,907,18,10
805.5,960,18,10
805.5,975,20,10
815.5,911,22,10
825.5,914,20,10
835.5,937,21,10
845.5,949,18,10
855.5,940,20,10
865.5,898,20,10
865.5,925,14,10
875.5,897,20,10
885.5,915,18,10
895.5,936,20,10
905.5,918,18,10
915.5,956,20,10
925.5,974,18,10
935.5,1029,20,10
945.5,1002,20,10
955.5,1047,17,10
965.5,1066,17,10
975.5,1123,20,10
985.5,1116,20,10
995.5,1121,21,10
1005.5,1119,20,10
1020.5,1133,20,20
1040.5,1073,20,20
1040.5,1092,20,20
1060.5,1154,20,20
1080.5,1201,17,20
1100.5,1185,17,20
1120.5,1182,18,20
1140.5,1195,20,20
1160.5,1179,18,20
1160.5,1153,18,20
1175.5,1248,21,10
1185.5,1280,20,10
1195.5,1262,18,10
1205.5,1277,20,10
1215.5,1268,20,10
445.5,374,17,10
445.5,325,18,10
455.5,373,18,10
455.5,333,18,10
465.5,380,17,10
475.5,390,18,10
485.5,395,18,10
495.5,388,18,10
495.5,390,18,10
505.5,418,16,10
515.5,468,18,10
525.5,500,17,10
535.5,520,18,10
545.5,565,17,10
555.5,575,18,10
565.5,638,18,10
565.5,628,20,10
575.5,658,21,10
575.5,647,21,10
585.5,607,20,10
585.5,601,20,10
595.5,622,22,10
595.5,612,21,10
605.5,584,22,10
605.5,580,21,10
615.5,567,18,10
615.5,552,18,10
625.5,602,20,10
625.5,623,20,10
635.5,629,17,10
645.0,651,20,9
2464.5,2419,18,10
2474.5,2479,18,10
2484.5,2425,18,10
2484.5,2450,21,10
2494.5,2486,21,10
2494.5,2470,23,10
2504.5,2482,18,10
2514.5,2491,23,10
2524.5,2489,23,10
2534.5,2456,23,10
2544.5,2513,18,10
2554.5,2515,20,10
2564.5,2492,17,10
2574.5,2509,18,10
2584.5,2489,22,10
2594.5,2483,21,10
2604.5,2483,22,10
2604.5,2470,18,10
8425.0,7620,23,5
8447.5,7684,31,4
8447.5,7674,31,4
8463.0,7714,31,5
8463.0,7791,31,5
8486.5,7766,31,8
8503.5,7691,29,8
8503.5,7662,30,8
8525.5,7796,31,6
8548.5,7778,31,4
8577.5,7826,27,10
8595.0,7833,30,5
8610.5,7900,32,6
8624.5,7815,31,6
8624.5,7855,32,6
8642.5,7910,31,10
8650.0,7934,30,3
8664.5,7916,31,6
8670.0,7932,31,5
8690.0,7911,30,5
8704.5,7948,31,6
8705.0,7914,32,5
8710.0,7926,30,5
8716.0,7945,32,5
8736.0,7944,32,3
8753.0,7939,32,3
8765.0,7974,29,5
8779.5,8028,34,4
8801.5,8023,32,4
8820.0,8052,31,5
8825.0,8010,26,5
8845.0,7973,65,5
8850.0,7993,31,5
8870.0,7988,31,5
8882.5,7967,47,10
8888.5,7964,31,6
8910.0,7976,34,5
8912.5,7944,44,10
8912.5,8058,46,10
8935.0,8013,35,5
8950.0,7964,42,5
8962.5,8025,31,10
8962.5,7916,31,10
8962.5,8020,29,10
8965.0,7872,32,5
8980.0,8048,31,5
9000.0,8041,31,5
9010.0,8113,31,5
9035.0,8148,30,5
9060.0,8196,31,5
9084.5,8138,30,6
9095.0,8208,31,5
9115.0,8169,32,5
9125.0,8168,32,5
9138.5,8200,31,4
9148.5,8275,53,2
1905.5,1987,14,10
1905.5,2006,21,10
1915.5,1950,22,10
1925.5,1979,21,10
1935.5,1987,22,10
1945.5,1980,22,10
1954.5,2049,21,10
1964.5,2003,21,10
1974.5,2035,20,10
1984.5,1993,22,10
1984.5,1980,21,10
1984.5,2015,16,10
1994.5,2019,21,10
2004.5,2068,21,10
2004.5,2107,20,10
2014.5,2088,20,10
2024.5,2074,22,10
2034.5,2083,21,10
2044.5,2090,21,10
2054.5,2097,17,10
2064.5,2113,16,10
2074.5,2128,16,10
2084.5,2102,21,10
2094.5,2113,21,10
2104.5,2090,22,10
2114.5,2114,21,10
2114.5,2093,21,10
2124.5,2161,22,10
2134.5,2159,22,10
2144.5,2134,20,10
2144.5,2122,21,10
2154.5,2177,20,10
2164.5,2207,21,10
2164.5,2240,20,10
2164.5,2238,20,10
2174.5,2177,16,10
2184.5,2225,20,10
2184.5,2255,16,10
2194.5,2233,16,10
2204.5,2218,21,10
2214.5,2263,21,10
2224.5,2226,21,10
2224.5,2223,21,10
2234.5,2242,20,10
2244.5,2245,20,10
2244.5,2178,21,10
2254.5,2192,21,10
2264.5,2200,21,10
2274.5,2181,21,10
2274.5,2157,21,10
2284.5,2162,21,10
2294.5,2173,21,10
2294.5,2178,21,10
2304.5,2224,21,10
2304.5,2234,21,10
2314.5,2271,21,10
2314.5,2258,21,10
2324.5,2247,21,10
2324.5,2272,21,10
2334.5,2278,21,10
2344.5,2319,21,10
2344.5,2330,22,10
2354.5,2372,16,10
2354.5,2382,17,10
2364.5,2434,21,10
2374.5,2418,22,10
2384.5,2452,21,10
2394.5,2455,35,10
2404.5,2466,34,10
2404.5,2519,34,10
2414.5,2443,26,10
2424.5,2405,22,10
2424.5,2407,22,10
2434.5,2435,22,10
2444.5,2427,16,10
2454.5,2432,22,10
2464.5,2483,34,10
2474.5,2446,51,10
2555.5,2499,22,10
2565.5,2501,22,10
2565.5,2463,22,10
2580.5,2467,21,20
2595.5,2472,22,10
2610.5,2429,21,20
2645.5,2455,34,10
2655.5,2458,35,10
2665.5,2464,35,10
2680.5,2461,21,20
2680.5,2428,21,20
2700.5,2451,22,20
2720.5,2550,21,20
2735.5,2548,16,10
2745.5,2608,16,10
2755.5,2647,17,10
2765.5,2670,22,10
2775.5,2673,17,10
2785.5,2737,17,10
2795.5,2749,17,10
2805.5,2748,22,10
2815.5,2740,21,10
2825.5,2738,22,10
2835.5,2708,22,10
2845.5,2741,22,10
2855.5,2778,21,10
2865.5,2781,22,10
2875.5,2791,22,10
2885.5,2804,17,10
2895.5,2827,16,10
2905.5,2824,17,10
2915.5,2761,22,10
2925.5,2844,16,10
2935.5,2834,21,10
2945.5,2818,21,10
2955.5,2835,22,10
2965.5,2871,21,10
2975.5,2889,23,10
2985.5,2880,22,10
2995.5,2850,22,10
3005.5,2926,21,10
3015.5,2876,23,10
3025.5,2889,22,10
3035.5,2920,32,10
3035.5,2909,34,10
3045.5,2933,21,10
3045.5,2904,22,10
3055.5,2917,32,10
3055.5,2965,34,10
3055.5,2882,22,10
3065.5,2964,25,10
3075.5,2909,22,10
3085.5,3001,21,10
3085.5,3001,21,10
3095.5,2915,22,10
3105.5,2947,22,10
3115.5,2946,22,10
3125.5,2949,27,10
3135.5,2901,22,10
3145.5,3027,27,10
3145.5,2970,34,10
3155.5,2918,23,10
3165.5,3005,21,10
3165.5,3040,21,10
3165.5,2924,22,10
3175.5,3002,22,10
3185.5,2965,23,10
3195.5,2990,22,10
3205.5,2985,18,10
3215.5,3038,23,10
3225.5,3032,22,10
3235.5,2994,23,10
3245.5,3035,22,10
3255.5,3027,23,10
3265.5,3040,23,10
3275.5,3079,32,10
3275.5,3079,34,10
3275.5,3154,35,10
3285.5,3059,22,10
3295.5,3043,23,10
3305.5,3071,22,10
3315.5,3030,21,10
3325.5,3087,21,10
3335.5,3091,21,10
3345.5,3117,16,10
3355.5,3099,21,10
3365.5,3168,21,10
3375.5,3118,22,10
3385.5,3204,21,10
3385.5,3147,22,10
3395.5,3177,16,10
3405.5,3250,21,10
3405.5,3155,21,10
3415.5,3244,21,10
3415.5,3196,22,10
3425.5,3213,16,10
3435.5,3185,17,10
3445.5,3199,32,10
3445.5,3265,34,10
3455.5,3248,21,10
3465.5,3251,22,10
3475.5,3273,21,10
3485.5,3308,22,10
3495.5,3304,22,10
3505.5,3304,22,10
3515.5,3321,53,10
3515.5,3308,52,10
3525.5,3244,52,10
3525.5,3336,53,10
3535.5,3302,23,10
3545.5,3276,18,10
3555.5,3326,17,10
3565.5,3327,18,10
3575.5,3350,17,10
3585.5,3355,23,10
3595.5,3415,22,10
3595.5,3350,22,10
3595.5,3397,23,10
3605.5,3344,17,10
3615.5,3391,34,10
3615.5,3421,34,10
3625.5,3320,22,10
3635.5,3360,22,10
3645.5,3442,22,10
3645.5,3425,23,10
3655.5,3427,23,10
3665.5,3398,22,10
3675.5,3407,22,10
3685.5,3430,22,10
3695.5,3469,23,10
3705.5,3485,17,10
3715.5,3459,18,10
3725.5,3498,17,10
3735.5,3530,21,10
3735.5,3497,22,10
3745.5,3474,22,10
3745.5,3527,22,10
3755.5,3502,21,10
3755.5,3448,23,10
3765.5,3525,22,10
3765.5,3491,22,10
3775.5,3491,23,10
3785.5,3553,22,10
3795.5,3487,23,10
3805.5,3481,22,10
3815.5,3501,23,10
3825.5,3523,22,10
3825.5,3480,23,10
3835.5,3558,22,10
3845.5,3580,23,10
3855.5,3555,22,10
3865.5,3557,22,10
3875.5,3599,18,10
3885.5,3594,26,10
3885.5,3596,34,10
3895.5,3622,34,10
3895.5,3595,34,10
3905.5,3612,23,10
3915.5,3619,22,10
3925.5,3638,22,10
3935.5,3670,22,10
3945.5,3607,22,10
3955.5,3591,23,10
3965.5,3645,22,10
3975.5,3636,22,10
3985.5,3682,27,10
3985.5,3703,22,10
3985.5,3654,25,10
3995.5,3735,21,10
3995.5,3665,23,10
4005.5,3742,22,10
4005.5,3686,23,10
4015.5,3678,22,10
4025.5,3739,22,10
4025.5,3745,22,10
4035.5,3666,22,10
4045.5,3693,22,10
4055.5,3682,22,10
4055.5,3646,22,10
4065.5,3697,22,10
4075.5,3684,22,10
4085.5,3716,22,10
4095.5,3780,18,10
4095.5,3736,22,10
4105.5,3771,20,10
4105.5,3736,22,10
4115.5,3743,23,10
4125.5,3735,20,10
4125.5,3737,23,10
4135.5,3760,20,10
4135.5,3707,17,10
4145.5,3765,20,10
4145.5,3730,17,10
4155.5,3800,20,10
4165.5,3833,22,10
4165.5,3787,22,10
4175.5,3798,17,10
4175.5,3766,23,10
4185.5,3839,25,10
4195.5,3836,25,10
4195.5,3825,22,10
4205.5,3827,22,10
4205.5,3763,22,10
4215.5,3782,22,10
4225.5,3820,27,10
4235.5,3774,32,10
4235.5,3844,23,10
4245.5,3870,22,10
4245.5,3829,25,10
4255.5,3833,25,10
4265.5,3864,22,10
4275.5,3849,23,10
4275.5,3843,22,10
4285.5,3859,22,10
4295.5,3895,23,10
4295.5,3855,23,10
4305.5,3897,23,10
4315.5,3921,23,10
4315.5,3876,23,10
4325.5,3896,23,10
4335.5,3899,23,10
4335.5,3828,23,10
4345.5,3849,36,10
4345.5,3814,36,10
4355.5,3900,17,10
4365.5,3914,18,10
4375.5,3882,22,10
4385.5,3904,22,10
4385.5,3953,23,10
4385.5,3870,17,10
4395.5,3893,23,10
4415.5,3916,23,10
4425.5,4010,23,10
4425.5,4006,23,10
4435.5,4000,23,10
4435.5,3973,23,10
4445.5,4039,25,10
4455.5,4088,25,10
4455.5,4045,25,10
4465.5,4008,22,10
4465.5,4031,26,10
4475.5,3999,17,10
4475.5,3998,22,10
4475.5,4001,23,10
4485.5,3990,22,10
4485.5,3974,23,10
4495.5,4002,22,10
4495.5,3973,23,10
4505.5,3998,23,10
4505.5,4007,20,10
4515.5,4038,18,10
4515.5,4001,23,10
4525.5,4049,26,10
4525.5,4057,23,10
4535.5,4071,22,10
4535.5,4100,18,10
4545.5,4049,22,10
4545.5,4049,23,10
4555.5,4110,25,10
4565.5,4056,21,10
4565.5,4035,23,10
4575.5,4073,23,10
4575.5,4104,23,10
4585.5,4110,17,10
4585.5,4105,23,10
4595.5,4158,23,10
4604.5,4078,23,10
4614.5,4098,22,10
4614.5,4087,23,10
4624.5,4112,22,10
4624.5,4126,23,10
4634.5,4134,22,10
4634.5,4108,23,10
4644.5,4136,23,10
4654.5,4177,22,10
4654.5,4179,22,10
4654.5,4088,23,10
4664.5,4177,25,10
4674.5,4137,25,10
4684.5,4161,20,10
4694.5,4139,23,10
4704.5,4145,23,10
4714.5,4210,26,10
4724.5,4166,21,10
4734.5,4144,22,10
4734.5,4164,25,10
4744.5,4188,22,10
4744.5,4161,25,10
4754.5,4200,22,10
4764.5,4134,22,10
4764.5,4089,25,10
4774.5,4079,25,10
4784.5,4124,22,10
4794.5,4153,22,10
4804.5,4151,23,10
4814.5,4163,21,10
4824.5,4188,22,10
4824.5,4176,22,10
4834.5,4220,22,10
4844.5,4277,23,10
4854.5,4292,23,10
4864.5,4310,22,10
4874.5,4361,23,10
4884.5,4379,26,10
4894.5,4401,22,10
4904.5,4379,22,10
4904.5,4331,22,10
4914.5,4367,22,10
4924.5,4392,23,10
4934.5,4352,23,10
4934.5,4352,22,10
4944.5,4339,23,10
4954.5,4359,23,10
4964.5,4376,23,10
4974.5,4372,23,10
4984.5,4382,23,10
4994.5,4398,23,10
4994.5,4433,21,10
5004.5,4452,23,10
5004.5,4419,22,10
5014.5,4432,23,10
5024.5,4424,23,10
5024.5,4347,22,10
5024.5,4399,18,10
5034.5,4434,23,10
5044.5,4428,23,10
5054.5,4503,23,10
5064.5,4482,23,10
5064.5,4479,23,10
5074.5,4512,23,10
5084.5,4510,22,10
5094.5,4544,23,10
5104.5,4501,23,10
5114.5,4469,23,10
5114.5,4464,23,10
5124.5,4520,23,10
5134.5,4508,23,10
5134.5,4490,23,10
5144.5,4526,22,10
5144.5,4513,23,10
5154.5,4528,23,10
5164.5,4508,23,10
5164.5,4509,25,10
5164.5,4473,25,10
5174.5,4495,23,10
5184.5,4461,23,10
5194.5,4435,23,10
5204.5,4455,23,10
5214.5,4486,21,10
5224.5,4480,25,10
5234.5,4469,23,10
5244.5,4468,23,10
5254.5,4480,23,10
5264.5,4505,23,10
5264.5,4516,25,10
5274.5,4498,23,10
5274.5,4453,23,10
5284.5,4485,38,10
5284.5,4469,38,10
5284.5,4548,18,10
5294.5,4505,23,10
5294.5,4575,25,10
5294.5,4531,34,10
5304.5,4575,25,10
5314.5,4606,23,10
5324.5,4644,23,10
5334.5,4688,23,10
5344.5,4740,25,10
5344.5,4694,26,10
5354.5,4684,23,10
5364.5,4703,26,10
5374.5,4651,36,10
5374.5,4678,36,10
5374.5,4683,30,10
5384.5,4662,23,10
5384.5,4666,25,10
5394.5,4670,27,10
5404.5,4679,26,10
5414.5,4628,23,10
5414.5,4660,25,10
5424.5,4628,22,10
5424.5,4580,23,10
5434.5,4635,23,10
5434.5,4586,23,10
5444.5,4659,23,10
5444.5,4594,25,10
5454.5,4706,23,10
5454.5,4657,25,10
5464.5,4743,23,10
5464.5,4697,23,10
5474.5,4730,23,10
5474.5,4714,25,10
5484.5,4730,22,10
5484.5,4717,25,10
5494.5,4782,23,10
5494.5,4763,25,10
5504.5,4772,23,10
5504.5,4765,26,10
5514.5,4747,25,10
5514.5,4740,23,10
5524.5,4752,23,10
5524.5,4758,26,10
5534.5,4771,25,10
5534.5,4710,25,10
5544.5,4684,25,10
5544.5,4754,16,10
5554.5,4726,20,10
5554.5,4710,23,10
5564.5,4729,22,10
5564.5,4688,22,10
5564.5,4701,23,10
5574.5,4730,25,10
5584.5,4799,22,10
5584.5,4778,25,10
5594.5,4865,23,10
5594.5,4806,25,10
5604.5,4913,23,10
5604.5,4839,25,10
5614.5,4885,23,10
5614.5,4863,23,10
5624.5,4954,17,10
5624.5,4863,25,10
5634.5,4904,22,10
5634.5,4884,25,10
5644.5,4898,23,10
5644.5,4877,23,10
5654.5,4929,23,10
5654.5,4901,25,10
5664.5,4975,22,10
5664.5,4919,25,10
5674.5,4922,38,10
5674.5,4998,36,10
5684.5,4954,25,10
5684.5,4919,25,10
5694.5,4973,23,10
5694.5,4927,20,10
5704.5,4971,22,10
5704.5,4922,25,10
5714.5,5007,23,10
5714.5,4969,25,10
5724.5,4991,23,10
5724.5,5000,25,10
5734.5,4994,22,10
5734.5,4997,22,10
5734.5,4981,29,10
5744.5,5027,27,10
5744.5,4973,23,10
5754.5,5083,17,10
5764.5,5092,22,10
5774.5,5058,22,10
5784.5,5055,23,10
5794.5,5077,23,10
5804.5,5074,22,10
5804.5,5089,17,10
5814.5,5056,25,10
5814.5,5031,23,10
5814.5,5050,18,10
5824.5,4993,32,10
5824.5,5017,26,10
5824.5,5131,23,10
5824.5,5147,23,10
5834.5,5028,34,10
5834.5,4915,26,10
5834.5,5048,22,10
5844.5,5053,23,10
5844.5,5023,34,10
5854.5,5059,22,10
5854.5,5044,23,10
5864.5,5059,22,10
5864.5,5075,23,10
5874.5,5064,27,10
5879.5,5058,23,20
5884.5,5066,23,10
5894.5,5103,22,10
5899.5,5118,25,20
5899.5,5081,25,20
5904.5,5113,30,10
5914.5,5159,14,10
5919.5,5157,18,20
5919.5,5162,23,20
5924.5,5192,14,10
5934.5,5192,23,10
5934.5,5243,21,10
5944.5,5209,23,10
5944.5,5268,25,10
5954.5,5249,25,10
5954.5,5253,25,10
5964.5,5237,23,10
5974.5,5194,23,10
5974.5,5205,35,10
5974.5,5215,26,10
5974.5,5225,29,10
5984.5,5195,23,10
5984.5,5187,25,10
5984.5,5186,25,10
5984.5,5250,21,10
5994.5,5243,23,10
5994.5,5266,23,10
6044.5,5285,23,10
6044.5,5326,35,10
6054.5,5289,23,10
6054.5,5304,25,10
6064.5,5278,23,10
6074.5,5324,23,10
6074.5,5387,25,10
6084.5,5283,25,10
6094.5,5297,23,10
6094.5,5261,25,10
6114.5,5273,25,10
6124.5,5323,23,10
6134.5,5369,25,10
6144.5,5333,25,10
6154.5,5305,23,10
6154.5,5330,23,10
6164.5,5269,23,10
6174.5,5269,25,10
6184.5,5370,25,10
6184.5,5373,25,10
6194.5,5382,23,10
6194.5,5379,23,10
6204.5,5355,23,10
6204.5,5354,25,10
6214.5,5419,29,10
6224.5,5460,25,10
6224.5,5460,27,10
6224.5,5433,29,10
6234.5,5418,23,10
6234.5,5447,25,10
6244.5,5409,26,10
6254.5,5374,25,10
6264.5,5380,25,10
6274.5,5430,25,10
6284.5,5476,25,10
6284.5,5492,25,10
6294.5,5498,25,10
6294.5,5528,25,10
6304.5,5553,25,10
6314.5,5564,23,10
6324.5,5543,23,10
6324.5,5611,25,10
6334.5,5547,26,10
6344.5,5582,26,10
6354.5,5595,36,10
6354.5,5554,35,10
6364.5,5616,25,10
6374.5,5542,26,10
6384.5,5527,26,10
6394.5,5569,25,10
6404.5,5608,26,10
6414.5,5661,25,10
6414.5,5696,25,10
6424.5,5675,25,10
6434.5,5663,26,10
6444.5,5678,25,10
6454.5,5681,25,10
6464.5,5684,25,10
6474.5,5684,27,10
6484.5,5690,25,10
6494.5,5748,27,10
6504.5,5756,25,10
6514.5,5764,25,10
6514.5,5770,27,10
6524.5,5736,25,10
6524.5,5770,25,10
6534.5,5731,23,10
6534.5,5780,26,10
6544.5,5768,25,10
6554.5,5767,25,10
6564.5,5764,27,10
6574.5,5794,23,10
6574.5,5823,21,10
6584.5,5788,21,10
6594.5,5790,23,10
6594.5,5770,21,10
6594.5,5767,22,10
6604.5,5800,25,10
6604.5,5767,25,10
6614.5,5754,25,10
6624.5,5764,27,10
6634.5,5762,18,10
6634.5,5819,25,10
6644.5,5842,25,10
6644.5,5830,27,10
6654.5,5807,23,10
6654.5,5836,25,10
6664.5,5859,25,10
6674.5,5879,25,10
6684.5,5877,25,10
6737.5,5902,25,10
6747.5,5954,21,10
6754.5,5936,35,10
6754.5,5941,38,10
6757.5,5934,25,10
6764.5,5926,26,10
6767.5,5914,27,10
6774.5,5961,25,10
6777.5,5932,26,10
6784.5,5955,25,10
6787.5,5976,27,10
6794.5,5974,26,10
6797.5,6008,25,10
6804.5,5999,25,10
6804.5,6006,25,10
6807.5,5995,25,10
6814.5,5994,25,10
6817.5,5927,26,10
6824.5,6029,26,10
6827.5,5954,25,10
6834.5,5926,26,10
6837.5,6011,27,10
6844.5,5985,18,10
6847.5,6044,29,10
6854.5,5944,25,10
6854.5,6005,18,10
6864.5,6015,20,10
6874.5,6033,25,10
6884.5,6010,25,10
6884.5,5985,26,10
6894.5,6070,16,10
6894.5,5991,25,10
6904.5,6065,25,10
6904.5,6016,26,10
6914.5,6104,26,10
6914.5,6027,26,10
6924.5,6073,25,10
6924.5,6032,25,10
6934.5,6058,18,10
6944.5,6092,25,10
6954.5,6115,25,10
6964.5,6087,26,10
6974.5,6117,25,10
6984.5,6115,26,10
6994.5,6138,26,10
7004.5,6119,26,10
7014.5,6172,25,10
7024.5,6189,26,10
7034.5,6215,25,10
7044.5,6175,25,10
7044.5,6176,26,10
7054.5,6215,25,10
7064.5,6153,25,10
7074.5,6219,25,10
7084.5,6157,23,10
7094.5,6160,18,10
7114.5,6202,25,10
7124.5,6164,25,10
7134.5,6129,25,10
7134.5,6107,26,10
7144.5,6103,27,10
7144.5,6236,57,10
7154.5,6106,38,10
7154.5,6137,36,10
7215.5,6281,27,10
7225.5,6230,26,10
7235.5,6263,25,10
7235.5,6245,26,10
7245.5,6269,25,10
7245.5,6242,26,10
7255.5,6300,25,10
7265.5,6321,17,10
7275.5,6389,17,10
7285.5,6352,26,10
7295.5,6381,26,10
7305.5,6366,25,10
7305.5,6356,26,10
7315.5,6364,26,10
7315.5,6400,26,10
7325.5,6422,25,10
7335.5,6444,27,10
7335.5,6412,26,10
7345.5,6423,25,10
7345.5,6505,27,10
7355.5,6408,26,10
7365.5,6390,27,10
7375.5,6412,30,10
7385.5,6400,26,10
7395.5,6416,26,10
7405.5,6392,25,10
7405.5,6374,27,10
7415.5,6414,27,10
7415.5,6390,27,10
7425.5,6485,25,10
7435.5,6555,27,10
7435.5,6580,27,10
7445.5,6564,26,10
7455.5,6534,26,10
7455.5,6534,26,10
7465.5,6568,26,10
7475.5,6554,27,10
7485.5,6593,26,10
7495.5,6612,27,10
7505.5,6583,26,10
7515.5,6678,26,10
7525.5,6659,27,10
7535.5,6680,27,10
7545.5,6580,26,10
7555.5,6596,27,10
7565.5,6690,25,10
7565.5,6609,27,10
7575.5,6722,26,10
7585.5,6746,29,10
7595.5,6763,22,10
7595.5,6797,27,10
7605.5,6725,25,10
7605.5,6735,26,10
7615.5,6787,27,10
7625.5,6770,22,10
7625.5,6853,26,10
7635.5,6790,25,10
7645.5,6782,27,10
7655.5,6768,26,10
7655.5,6798,26,10
7665.5,6812,27,10
7675.5,6850,42,10
7685.5,6892,26,10
7695.5,6879,26,10
7695.5,6929,25,10
7705.5,6917,27,10
7715.5,6902,25,10
7725.5,6917,23,10
7735.5,6918,25,10
7745.5,6928,27,10
7755.5,6907,27,10
7755.5,6931,29,10
7765.5,6955,27,10
7775.5,6960,26,10
7775.5,6891,26,10
7785.5,6916,26,10
7785.5,6894,29,10
7795.5,6975,27,10
7805.5,6980,20,10
7815.5,6959,27,10
7815.5,6957,23,10
7825.5,6958,26,10
7825.5,6978,26,10
7835.5,6946,26,10
7835.5,6995,26,10
7845.5,7035,29,10
7855.5,7005,23,10
7865.5,7012,26,10
7875.5,7077,26,10
7885.5,7094,29,10
7895.5,7038,26,10
7895.5,7069,27,10
7905.5,6968,26,10
7905.5,7015,31,10
7915.5,6975,26,10
7915.5,6989,27,10
7925.5,7032,32,10
7935.5,7088,26,10
7945.5,7097,25,10
7955.5,7118,27,10
7965.5,7155,31,10
7972.5,7198,27,10
7975.5,7167,27,10
7975.5,7180,40,10
7985.5,7212,27,10
7992.5,7142,27,10
7992.5,7141,26,10
8125.5,7266,21,10
8125.5,7248,27,10
8135.5,7285,26,10
8145.5,7254,26,10
8145.5,7239,34,10
8155.5,7289,26,10
8155.5,7258,34,10
8165.5,7299,35,10
8175.5,7330,27,10
8185.5,7433,36,10
8195.5,7389,27,10
8205.5,7426,35,10
8215.5,7412,29,10
8225.5,7475,38,10
8235.5,7392,29,10
8245.5,7405,27,10
8245.5,7422,34,10
8255.5,7444,26,10
8255.5,7440,29,10
8265.5,7388,26,10
8265.5,7387,36,10
8275.5,7386,27,10
8275.5,7399,32,10
8285.5,7397,27,10
8295.5,7431,26,10
8295.5,7402,29,10
8345.5,7489,34,10
8355.5,7549,27,10
8355.5,7457,27,10
8365.5,7512,27,10
8365.5,7488,27,10
8375.5,7524,21,10
8375.5,7508,32,10
8385.5,7564,29,10
8395.5,7580,27,10
8395.5,7571,29,10
8405.5,7586,21,10
8415.5,7657,29,10
8415.5,7603,27,10
8425.5,7689,23,10
8435.5,7703,30,10
8445.5,7663,31,10
8455.5,7662,27,10
8465.5,7707,27,10
8465.5,7679,27,10
8475.5,7715,27,10
8475.5,7659,30,10
8485.5,7736,27,10
8495.5,7688,29,10
8495.5,7686,30,10
8505.5,7711,30,10
8505.5,7688,29,10
8515.5,7681,30,10
8525.5,7704,29,10
8525.5,7740,30,10
8535.5,7686,21,10
8535.5,7665,29,10
8545.5,7743,27,10
8555.5,7763,27,10
8555.5,7771,26,10
8565.5,7765,26,10
8565.5,7834,32,10
8575.5,7716,27,10
8575.5,7779,32,10
8585.5,7754,27,10
8585.5,7774,31,10
8595.5,7850,21,10
8595.5,7790,29,10
8605.5,7860,32,10
8615.5,7844,32,10
8625.5,7849,29,10
8635.5,7854,30,10
8645.5,7859,34,10
8655.5,7910,30,10
8665.5,7926,32,10
8675.5,7876,27,10
8685.5,7915,31,10
8695.5,8015,40,10
8695.5,7905,30,10
8695.5,7803,29,10
8705.5,7899,35,10
8715.5,7969,30,10
8715.5,7867,22,10
8725.5,7925,30,10
8735.5,7984,31,10
8735.5,7897,29,10
8745.5,7922,35,10
8755.5,7922,29,10
8765.5,7885,48,10
8765.5,7883,35,10
8775.5,8007,39,10
8775.5,7916,29,10
8785.5,7938,35,10
8795.5,8008,29,10
8805.5,7936,35,10
8815.5,8026,27,10
8825.5,7962,34,10
8835.5,7956,29,10
8845.5,7954,29,10
8845.5,7942,35,10
8855.5,7937,29,10
8865.5,7935,35,10
8875.5,8018,22,10
8875.5,8015,21,10
8885.5,7946,27,10
8895.5,7930,27,10
8905.5,7975,39,10
8905.5,7992,35,10
8915.5,7908,36,10
8915.5,8003,27,10
8925.5,7925,35,10
8935.5,7955,29,10
8945.5,7941,31,10
8955.5,7955,26,10
8955.5,7997,26,10
8965.5,8005,27,10
8975.5,7969,31,10
8975.5,7993,32,10
8985.5,8007,31,10
8995.5,7988,30,10
9005.5,7996,29,10
9015.5,8113,22,10
9025.5,8093,27,10
9025.5,8115,31,10
9035.5,8187,30,10
9045.5,8162,36,10
9055.5,8105,27,10
9065.5,8104,27,10
9075.5,8150,39,10
9085.5,8129,31,10
9095.5,8176,29,10
9105.5,8109,29,10
9115.5,8152,27,10
9125.5,8155,27,10
9135.5,8216,29,10
9135.5,8247,29,10
9145.5,8236,21,10
9145.5,8244,32,10
9275.5,8272,32,10
9285.5,8291,40,10
9295.5,8289,29,10
9305.5,8324,29,10
9326.0,8315,29,9
9336.0,8360,34,9
9336.0,8416,39,9
9346.0,8289,31,9
9356.0,8356,44,9
9366.0,8258,31,9
9376.0,8366,35,9
9386.0,8311,32,9
9396.0,8230,36,9
9406.0,8444,34,9
9406.0,8382,29,9
9416.0,8324,30,9
9426.0,8328,29,9
9436.0,8392,29,9
9453.5,8412,29,10
9463.5,8398,22,10
9473.5,8455,27,10
9483.5,8460,29,10
9493.5,8501,31,10
9503.5,8502,29,10
9513.5,8477,29,10
9525.5,8504,32,10
9535.5,8543,30,10
9536.0,8607,32,9
9546.0,8597,31,9
9556.0,8662,29,9
9566.0,8727,29,9
9576.0,8625,31,9
9586.0,8683,32,9
9596.0,8642,32,9
9606.0,8692,32,9
9626.0,8609,44,9
9636.0,8762,42,9
9636.0,8721,36,9
9646.0,8712,32,9
9656.0,8694,49,9
9666.0,8728,40,9
9676.0,8716,40,9
9686.0,8774,40,9
9696.0,8677,43,9
9966.5,8907,29,10
9966.5,8927,30,10
9981.5,8884,30,20
9981.5,8901,30,20
10001.5,8886,30,20
10016.5,8853,29,10
10026.5,8873,38,10
10026.5,8893,39,10
10036.5,8871,30,10
10046.5,8886,30,10
10046.5,8919,26,10
10056.5,8896,31,10
10066.5,8842,29,10
10076.5,8866,29,10
10086.5,8908,35,10
10096.5,8898,34,10
10106.5,8841,31,10
10116.5,8835,23,10
10126.5,8874,31,10
10136.5,8903,30,10
10146.5,8853,30,10
10156.5,8877,31,10
10166.5,8905,32,10
10176.5,8952,31,10
10186.5,8977,31,10
10196.5,8974,26,10
10206.5,9015,26,10
10216.5,8942,36,10
10216.5,9005,31,10
10226.5,9003,31,10
10226.5,9078,31,10
10236.5,9096,23,10
10236.5,9091,31,10
10246.5,9137,34,10
10256.5,9155,31,10
10266.5,9168,32,10
10266.5,9171,30,10
10276.5,9194,31,10
10276.5,9183,31,10
10286.5,9185,32,10
10296.5,9216,38,10
10306.5,9227,25,10
10306.5,9280,31,10
10316.5,9180,36,10
10326.5,9231,31,10
10336.5,9161,30,10
10346.5,9222,30,10
10356.5,9169,32,10
10366.5,9153,30,10
10376.5,9194,30,10
10386.5,9194,30,10
10396.5,9209,31,10
10406.5,9204,30,10
10416.5,9234,30,10
10426.5,9241,31,10
10436.5,9245,30,10
10446.5,9294,32,10
10446.5,9327,31,10
10456.5,9229,29,10
10466.5,9230,31,10
10476.5,9235,30,10
10486.5,9254,22,10
10496.5,9268,32,10
10496.5,9291,32,10
10506.5,9277,31,10
10516.5,9300,29,10
10526.5,9336,30,10
10536.5,9306,23,10
10546.5,9327,30,10
10556.5,9314,23,10
10566.5,9304,36,10
10576.5,9349,35,10
10586.5,9350,32,10
10596.5,9352,31,10
10606.5,9376,30,10
10606.5,9413,31,10
10616.5,9419,48,10
10626.5,9352,30,10
10633.5,9385,30,10
10636.5,9342,31,10
10643.5,9411,31,10
10646.5,9389,30,10
10646.5,9352,30,10
10653.5,9360,30,10
10656.5,9450,31,10
10663.5,9417,31,10
10666.5,9415,31,10
10673.5,9448,30,10
10676.5,9391,31,10
10683.5,9443,34,10
10686.5,9416,30,10
10693.5,9449,31,10
10696.5,9457,31,10
10696.5,9395,35,10
10703.5,9458,31,10
10706.5,9460,32,10
10836.5,9559,30,10
10846.5,9578,30,10
10846.5,9526,32,10
10856.5,9505,31,10
10856.5,9543,31,10
10866.5,9595,35,10
10876.5,9636,32,10
10886.5,9613,32,10
10896.5,9638,32,10
10906.5,9623,32,10
10916.5,9655,31,10
10926.5,9599,30,10
10936.5,9617,32,10
10946.5,9625,32,10
10956.5,9560,29,10
10966.5,9576,31,10
10966.5,9550,32,10
10976.5,9542,38,10
10976.5,9540,31,10
11026.5,9567,30,10
11036.5,9586,31,10
11036.5,9464,31,10
11046.5,9511,30,10
11056.5,9552,31,10
11060.5,9522,30,10
11066.5,9541,30,10
11070.5,9600,32,10
11076.5,9577,31,10
11080.5,9578,30,10
11086.5,9611,30,10
11090.5,9629,32,10
11096.5,9604,31,10
11106.5,9652,30,10
11116.5,9648,30,10
11116.5,9594,31,10
11131.5,9660,30,10
11141.5,9637,32,10
11151.5,9649,31,10
11161.5,9655,32,10
11171.5,9690,31,10
11181.5,9753,31,10
11191.5,9735,30,10
11227.5,9800,32,10
11237.5,9836,31,10
11247.5,9857,32,10
11251.5,9904,32,10
11257.5,9909,31,10
11261.5,9889,31,10
11261.5,9834,32,10
11267.5,9908,23,10
11267.5,9901,34,10
11271.5,9977,32,10
11281.5,9919,34,10
11371.5,10008,31,10
11371.5,10006,32,10
11381.5,9942,32,10
11391.5,9959,31,10
11397.5,10027,30,10
11401.5,9994,31,10
11407.5,10042,32,10
11417.5,10049,32,10
11427.5,10065,31,10
11437.5,10013,25,10
11447.5,9987,29,10
11457.5,9999,29,10
11467.5,10001,29,10
11477.5,10036,36,10
11487.5,10017,32,10
11497.5,10069,38,10
11507.5,10068,29,10
11517.5,10072,25,10
11527.5,9987,32,10
11537.5,10026,32,10
11547.5,10066,31,10
11557.5,9999,32,10
11567.5,9992,31,10
11577.5,9982,31,10
11587.5,9982,31,10
11597.5,9995,31,10
11607.5,10055,30,10
11617.5,10066,25,10
11627.5,10126,34,10
11637.5,10111,35,10
11647.5,10091,36,10
11647.5,10094,25,10
11657.5,10122,31,10
11667.5,10112,30,10
