C:\Pragma\Crecimiento\AWS\Java\GetCustomerByIdLambda\src\main\java\co\com\pragma\amazonaws\lambda\Handler.java
C:\Pragma\Crecimiento\AWS\Java\GetCustomerByIdLambda\src\main\java\co\com\pragma\amazonaws\lambda\Request.java
C:\Pragma\Crecimiento\AWS\Java\GetCustomerByIdLambda\src\main\java\co\com\pragma\service\impl\CustomerService.java
C:\Pragma\Crecimiento\AWS\Java\GetCustomerByIdLambda\src\main\java\co\com\pragma\entity\Customer.java
