{
  "lambdaLayers": [],
  "environmentVariableList": [
    {
      "cloudFormationParameterName": "databaseHost",
      "environmentVariableName": "DATABASE_HOST"
    },
    {
      "cloudFormationParameterName": "databasePort",
      "environmentVariableName": "DATABASE_PORT"
    },
    {
      "cloudFormationParameterName": "databaseUser",
      "environmentVariableName": "DATABASE_USER"
    },
    {
      "cloudFormationParameterName": "databasePassword",
      "environmentVariableName": "DATABASE_PASSWORD"
    },
    {
      "cloudFormationParameterName": "databaseName",
      "environmentVariableName": "DATABASE_NAME"
    }
  ]
}