{
  "version": 1,
  "paths": {
    "/centers": {
      "name": "/centers",
      "lambdaFunction": "centerFetch",
      "permissions": {
        "setting": "open"
      }
    },
    "/cities": {
      "name": "/cities",
      "lambdaFunction": "citiesFetch",
      "permissions": {
        "setting": "open"
      }
    },
    "/substances": {
      "name": "/substances",
      "lambdaFunction": "substancesFetch",
      "permissions": {
        "setting": "open"
      }
    }
  }
}