Place,Name,Division,BirthDate,BirthYear,Sex,BodyweightKg,Squat1Kg,Squat2Kg,Squat3Kg,Best3SquatKg,Bench1Kg,Bench2Kg,Bench3Kg,Best3BenchKg,Deadlift1Kg,Deadlift2Kg,Deadlift3Kg,Best3DeadliftKg,TotalKg,Equipment,WeightClassKg,Event
1,Jenelle Schultz,Masters 40-44,,1977,F,56.95,-117,119,122,122,72,74,-76,74,146,152,156,156,352,Raw,58,SBD
2,Helen Frank,Masters 40-44,,1978,F,57.25,113,121,126,126,65,70,-73,70,120,132,138,138,334,Raw,58,SBD
3,Kara Lamond,Masters 40-44,,1978,F,56.05,82,92,100,100,50,55,58,58,122,132,142,142,300,Raw,58,SBD
1,Zoe Deeks,Masters 40-44,,1975,F,63.4,125,132,135,135,80,83,85,85,148,155,161,161,381,Raw,64,SBD
2,Suzanne Smith #1,Masters 40-44,,1976,F,62.85,106,113,117,117,72,78,-81,78,120,128,133,133,328,Raw,64,SBD
3,Julia Higgs,Masters 40-44,,1975,F,63.5,-116,116,118,118,58,60,61,61,132,136,-138,136,315,Raw,64,SBD
4,Sally Mitchell,Masters 40-44,,1979,F,62.35,70,75,78,78,48,-50,-50,48,87,92,100,100,226,Raw,64,SBD
1,Zoë Winter,Masters 40-44,,1977,F,71.9,123,133,136,136,73,77,80,80,136,148,156,156,372,Raw,72,SBD
2,Sarah Wheal,Masters 40-44,,1977,F,69.3,125,132,137,137,70,75,-77,75,140,150,153,153,365,Raw,72,SBD
3,Meaghan Trovato,Masters 40-44,,1979,F,69.45,118,123,127,127,66,70,74,74,138,143,-149,143,344,Raw,72,SBD
1,Jane Morris,Masters 40-44,,1978,F,83.95,135,147,152,152,76,82,86,86,157,172,-173,172,410,Raw,84,SBD
2,Kaye Mercer,Masters 40-44,,1976,F,79.5,120,128,135,135,60,63,66,66,132,142,150,150,351,Raw,84,SBD
3,Nicky Burns,Masters 40-44,,1977,F,83.9,-105,105,107,107,65,68,-71,68,110,116,-120,116,291,Raw,84,SBD
1,Georgina McLaren,Masters 40-44,,1979,F,95.75,128,140,-147,140,77,84,90,90,130,145,155,155,385,Raw,100,SBD
1,Victoria Hamblin,Masters 40-44,1979-01-22,1979,F,111.25,132,140,145,145,67,-74,74,74,130,137,140,140,359,Raw,100+,SBD
2,Kylie Greaves,Masters 40-44,,1976,F,113.25,103,111,117,117,58,64,67,67,110,122,130,130,314,Raw,100+,SBD
1,Kara King,Masters 45-49,,1970,F,52.2,90,96,101,101,62,65,68,68,120,125,-127,125,294,Raw,53,SBD
1,Mary Giffin,Masters 45-49,,1972,F,63.65,137,141,143,143,78,82,84,84,140,144,148,148,375,Raw,64,SBD
2,Rikki Flanders,Masters 45-49,,1970,F,63.85,100,106,110,110,60,63,-66,63,115,123,130,130,303,Raw,64,SBD
1,Leanne Knox,Masters 45-49,,1972,F,68.65,148,153,156,156,70,75,77,77,160,167,-172,167,400,Raw,72,SBD
2,Libby Fava,Masters 45-49,,1974,F,71.25,107,110,-112,110,63,65,-70,65,-120,-120,120,120,295,Raw,72,SBD
3,Joanna Birch,Masters 45-49,,1971,F,72,86,94,-96,94,42,45,47,47,98,108,112,112,253,Raw,72,SBD
1,Tannya Follington,Masters 45-49,,1970,F,83.1,129,138,143,143,65,69,71,71,155,166,171,171,385,Raw,84,SBD
2,Tasha Page,Masters 45-49,,1971,F,80.3,90,100,110,110,65,70,-75,70,-135,145,164,164,344,Raw,84,SBD
3,Joanne Paine,Masters 45-49,,1970,F,78.6,112,122,-132,122,78,-84,84,84,120,130,137,137,343,Raw,84,SBD
1,Melanie Lihou,Masters 45-49,,1974,F,96.6,125,130,-133,130,60,63,-66,63,142,152,-157,152,345,Raw,100,SBD
1,Danielle Senyschyn,Masters 45-49,,1973,F,117.1,142,152,161,161,65,69,72,72,121,133,143,143,376,Raw,100+,SBD
2,Esther Cawthorn,Masters 45-49,,1971,F,110.45,-120,120,127,127,63,-67,67,67,129,138,143,143,337,Raw,100+,SBD
3,Katrina Evans,Masters 45-49,,1973,F,110.7,120,127,133,133,78,81,84,84,100,110,118,118,335,Raw,100+,SBD
1,Dolores Foster,Masters 50-54,,1967,F,51.25,82,88,93,93,38,42,45,45,120,128,133,133,271,Raw,53,SBD
1,Voula Athanassiou,Masters 50-54,,1967,F,61.85,54,60,65,65,47,52,55,55,98,110,115,115,235,Raw,64,SBD
1,Carole Condon,Masters 50-54,,1965,F,66.9,85,90,93,93,55,58,-60,58,120,128,131,131,282,Raw,72,SBD
1,Lucille Ruggeri,Masters 50-54,,1969,F,78.05,64,70,73,73,36,39,42,42,95,102,107,107,222,Raw,84,SBD
1,Stephanie Horlyck,Masters 50-54,,1966,F,97.5,125,136,-145,136,65,70,74,74,141,150,160,160,370,Raw,100,SBD
2,Marina Anthony,Masters 50-54,,1965,F,96.75,114,-122,127,127,64,69,73,73,130,140,147,147,347,Raw,100,SBD
3,Fiona Creed,Masters 50-54,,1969,F,96.95,65,-73,-73,65,53,-56,-56,53,145,153,-156,153,271,Raw,100,SBD
1,Clair Angel,Masters 55-59,,1963,F,57.6,98,-105,105,105,53,56,-58,56,133,141,148,148,309,Raw,58,SBD
2,Cristina Ciraudo,Masters 55-59,,1961,F,57.45,96,102,-105,102,57,-60,61,61,125,135,-145,135,298,Raw,58,SBD
1,Julie Bailey,Masters 55-59,,1961,F,71.95,71,78,83,83,46,51,54,54,90,98,-105,98,235,Raw,72,SBD
1,Janine Blake,Masters 60-64,,1956,F,52.2,82,-86,-86,82,-48,48,-50,48,110,120,126,126,256,Raw,53,SBD
1,Glenda Presutti,Masters 60-64,,1956,F,60.65,100,110,116,116,52,55,57,57,130,140,149,149,322,Raw,64,SBD
2,Nancy Bellew,Masters 60-64,,1955,F,62.75,60,67,72,72,50,52,-53,52,85,95,-105,95,219,Raw,64,SBD
3,Dianne Weick,Masters 60-64,,1956,F,59,50,55,58,58,33,36,37,37,80,87,92,92,187,Raw,64,SBD
1,Peta Day,Masters 60-64,,1959,F,71.4,102,105,-107,105,61,63,-65,63,138,143,147,147,315,Raw,72,SBD
2,Jane Smedley,Masters 60-64,,1957,F,68.75,-88,88,97,97,58,62,65,65,130,140,-150,140,302,Raw,72,SBD
1,Marion Baird,Masters 60-64,,1957,F,97.7,70,75,-80,75,52,55,-57,55,120,130,-136,130,260,Raw,100,SBD
1,Margaret Pukallus,Masters 65-69,,1950,F,77.9,-70,70,76,76,40,43,-44,43,100,110,113,113,232,Raw,84,SBD
1,Ellen Brown,Masters 70-74,,1948,F,62.25,37,40,43,43,25,,,25,65,71,76,76,144,Raw,64,SBD
1,Matthew Bolonis,Masters 40-44,,1975,M,81.8,168,180,185,185,108,115,120,120,205,222,230,230,535,Raw,85,SBD
1,Paul Speering,Masters 40-44,1979-02-06,1979,M,93,195,210,215,215,115,125,-128,125,205,225,-240,225,565,Raw,94,SBD
1,Clyde Butler,Masters 40-44,,1978,M,104.55,220,230,240,240,162,170,-175,170,240,-252,,240,650,Raw,105,SBD
2,Darrin King,Masters 40-44,,1979,M,101.95,205,215,-225,215,125,-135,135,135,220,235,250,250,600,Raw,105,SBD
1,Markus Mueller,Masters 40-44,,1975,M,113.25,180,195,205,205,135,142,147,147,195,207,220,220,572,Raw,120,SBD
1,Michael Campbell,Masters 40-44,,1978,M,160.6,230,240,-245,240,190,200,-210,200,250,265,-275,265,705,Raw,120+,SBD
1,Daniel Buzer,Masters 45-49,,1974,M,75.7,100,110,-115,110,74,77,80,80,160,170,180,180,370,Raw,77,SBD
1,Alexander Le,Masters 45-49,,1971,M,83.15,172,182,190,190,110,115,118,118,200,210,-220,210,518,Raw,85,SBD
2,Adrian Brogan,Masters 45-49,,1973,M,84.25,140,147,152,152,135,141,144,144,180,195,-201,195,491,Raw,85,SBD
1,Nigel Bell,Masters 45-49,,1973,M,93.45,195,210,-220,210,112,118,120,120,208,228,-235,228,558,Raw,94,SBD
1,Brendon Mainey,Masters 45-49,,1974,M,102.1,137,147,155,155,107,114,118,118,163,176,182,182,455,Raw,105,SBD
1,Dave Keong,Masters 45-49,,1973,M,113.65,185,200,215,215,143,148,-155,148,215,230,246,246,609,Raw,120,SBD
2,Stuart Mitchell,Masters 45-49,,1974,M,109.2,150,160,170,170,110,115,-120,115,170,180,190,190,475,Raw,120,SBD
1,Richard Faasee,Masters 45-49,,1970,M,121.2,160,170,180,180,115,122,125,125,240,260,270,270,575,Raw,120+,SBD
1,David Brearley,Masters 50-54,,1965,M,54.15,68,72,75,75,42,44,-46,44,110,120,125,125,244,Raw,62,SBD
1,Phil Menzie,Masters 50-54,,1968,M,73.4,-150,150,160,160,97,105,110,110,165,175,-185,175,445,Raw,77,SBD
1,Kelvin Kenney,Masters 50-54,,1969,M,84.75,175,185,-190,185,120,125,130,130,210,220,-223,220,535,Raw,85,SBD
2,Mark Lum,Masters 50-54,,1967,M,82.65,156,168,-178,168,110,118,-122,118,210,228,-249,228,514,Raw,85,SBD
3,Pat Le Plastrier,Masters 50-54,,1966,M,84.5,120,132,140,140,82,90,95,95,150,160,170,170,405,Raw,85,SBD
1,Jason Clarke #2,Masters 50-54,,1967,M,102.95,130,145,155,155,-120,125,-130,125,185,200,-205,200,480,Raw,105,SBD
1,Mauro Soto,Masters 50-54,,1965,M,117.25,210,-220,-220,210,125,129,-132,129,192,205,212,212,551,Raw,120,SBD
2,Glenn Baxter,Masters 50-54,,1966,M,112.55,175,188,195,195,125,135,145,145,190,210,-220,210,550,Raw,120,SBD
1,Owen Cuthbert,Masters 50-54,,1968,M,120.55,145,155,165,165,100,105,110,110,180,195,205,205,480,Raw,120+,SBD
1,Keijo Sulo Stenholm,Masters 55-59,,1964,M,82.8,155,-164,-164,155,125,133,-137,133,160,175,-181,175,463,Raw,85,SBD
1,Rodney Wecker,Masters 60-64,,1957,M,74.55,112,117,-122,117,70,75,80,80,147,155,160,160,357,Raw,77,SBD
2,Ian Gibson,Masters 60-64,,1956,M,75.55,82,89,-93,89,59,64,66,66,112,123,132,132,287,Raw,77,SBD
1,Nick Davey,Masters 60-64,,1955,M,84.3,90,-100,100,100,70,75,80,80,110,-120,120,120,300,Raw,85,SBD
1,Simon Butterworth,Masters 60-64,,1958,M,93,110,120,130,130,80,88,92,92,160,170,180,180,402,Raw,94,SBD
2,Colin Gwyther,Masters 60-64,,1955,M,88.25,115,-120,-120,115,70,75,80,80,140,-150,-150,140,335,Raw,94,SBD
1,Scott Wood #1,Masters 60-64,,1956,M,130.4,150,160,165,165,95,100,105,105,150,160,170,170,440,Raw,120+,SBD
1,Bernie Dowling,Masters 65-69,,1954,M,99.5,55,60,-65,60,49,51,53,53,95,100,105,105,218,Raw,105,SBD
1,Ravi Sood,Masters 75-79,,1943,M,65.7,50,56,62,62,45,-47,-47,45,110,116,121,121,228,Raw,69,SBD
1,Derek Mason,Masters 80+,,1939,M,58.95,55,64,68,68,55,64,-68,64,-90,103,105,105,237,Raw,62,SBD
1,Bryan McMaster,Masters 80+,,1939,M,73.65,-110,-110,110,110,-62,62,-65,62,135,142,150,150,322,Raw,77,SBD
1,Zoe Deeks,Masters 40-44,,1975,F,64,,,,,82,-88,-88,82,,,,,82,Raw,64,B
1,Nicky Burns,Masters 40-44,,1977,F,83.55,,,,,65,68,70,70,,,,,70,Raw,84,B
2,Emma Quayle,Masters 40-44,,1976,F,83.2,,,,,60,63,65,65,,,,,65,Raw,84,B
1,Joanne Paine,Masters 45-49,,1970,F,78.7,,,,,80,85,-88,85,,,,,85,Raw,84,B
1,Leonie Hannah,Masters 45-49,,1973,F,86,,,,,60,62,-65,62,,,,,62,Raw,100,B
1,Vicki O'Brien,Masters 55-59,,1962,F,63.8,,,,,70,-74,,70,,,,,70,Raw,64,B
1,Bonny Darby,Masters 55-59,,1960,F,77.15,,,,,69,71,74,74,,,,,74,Raw,84,B
1,Nancy Bellew,Masters 60-64,,1955,F,63.35,,,,,49,50,51,51,,,,,51,Raw,64,B
1,Karen White,Masters 60-64,,1959,F,109.45,,,,,59,62,-63,62,,,,,62,Raw,100+,B
1,Michael Campbell,Masters 40-44,,1978,M,161.45,,,,,120,160,190,190,,,,,190,Raw,120+,B
1,Adrian Brogan,Masters 45-49,,1973,M,84.1,,,,,130,140,,140,,,,,140,Raw,85,B
1,Antony Taylor,Masters 50-54,,1967,M,67.85,,,,,123,126,130,130,,,,,130,Raw,69,B
1,John Ross,Masters 50-54,,1966,M,116.45,,,,,140,145,-148,145,,,,,145,Raw,120,B
2,Glenn Baxter,Masters 50-54,,1966,M,112.65,,,,,125,135,140,140,,,,,140,Raw,120,B
1,Keijo Sulo Stenholm,Masters 55-59,,1964,M,82.15,,,,,124,130,-134,130,,,,,130,Raw,85,B
1,Darrell Saul,Masters 55-59,,1964,M,104.15,,,,,-135,135,-137,135,,,,,135,Raw,105,B
1,Nick Davey,Masters 60-64,,1955,M,83.7,,,,,-75,80,85,85,,,,,85,Raw,85,B
1,Robert Murchie,Masters 60-64,,1958,M,103.75,,,,,152,159,-162,159,,,,,159,Raw,105,B
1,Iven Hewett,Masters 70-74,,1945,M,81.5,,,,,79,83,85,85,,,,,85,Raw,85,B
1,Derek Mason,Masters 80+,,1939,M,59.15,,,,,55,60,65,65,,,,,65,Raw,62,B
