Division,WeightClassKg,Place,Name,Team,BodyweightKg,Best3SquatKg,Best3BenchKg,Best3DeadliftKg,TotalKg,Equipment,Event,Sex
Boys,51.71,1,Axel Banks,Denison,47.17,68.04,43.09,86.18,197.31,Single-ply,SBD,M
Boys,51.71,2,Blake Weaver,Frisco Heritage,46.08,52.16,36.29,65.77,154.22,Single-ply,SBD,M
Boys,59.87,1,Allan Morales,Frisco Centennial,55.93,174.63,77.11,170.1,421.84,Single-ply,SBD,M
Boys,55.79,2,Haif Martinez,Lewisville The Colony,52.39,142.88,88.45,145.15,376.48,Single-ply,SBD,M
Boys,55.79,3,Stephen Nelson,Denison,55.11,138.35,74.84,142.88,356.07,Single-ply,SBD,M
Boys,55.79,4,Dimitri Sommer,Lewisville The Colony,54.93,131.54,68.04,142.88,342.46,Single-ply,SBD,M
Boys,55.79,5,Mark Bresnahan,McKinney North,55.79,104.33,61.23,113.4,278.96,Single-ply,SBD,M
Boys,59.87,1,Sonny Khokar,Frisco Wakeland,57.61,183.7,106.59,206.38,496.68,Single-ply,SBD,M
Boys,59.87,2,Carlos Bravo,Lewisville The Colony,58.92,163.29,92.99,156.49,412.77,Single-ply,SBD,M
Boys,67.13,3,Zack Stevens,McKinney Boyd,60.01,129.27,74.84,154.22,358.34,Single-ply,SBD,M
Boys,59.87,4,Dennis Lyons,McKinney Boyd,58.97,113.4,65.77,113.4,292.57,Single-ply,SBD,M
Boys,67.13,5,Derek Yu,Frisco Centennial,60.1,149.69,,,149.69,Single-ply,S,M
Boys,74.84,1,Andrew Beckman,Lewisville The Colony,67.36,215.46,124.74,204.12,544.31,Single-ply,SBD,M
Boys,67.13,2,Stanley Lu,Frisco Centennial,64.36,176.9,111.13,190.51,478.54,Single-ply,SBD,M
Boys,67.13,3,Tim Sanders,Lewisville The Colony,66.04,190.51,111.13,174.63,476.27,Single-ply,SBD,M
Boys,67.13,4,Stefan Sommer,Lewisville The Colony,62.82,190.51,88.45,181.44,460.4,Single-ply,SBD,M
Boys,74.84,5,James Driskell,McKinney Boyd,67.31,151.95,92.99,163.29,408.23,Single-ply,SBD,M
Boys,67.13,6,Chris Gautier,Frisco Centennial,65.18,161.03,97.52,145.15,403.7,Single-ply,SBD,M
Boys,67.13,7,Austin Turturro,Frisco Liberty,67.13,145.15,113.4,140.61,399.16,Single-ply,SBD,M
Boys,67.13,8,Kenny Munyer,McKinney Boyd,64.5,142.88,102.06,151.95,396.89,Single-ply,SBD,M
Boys,67.13,9,Jelani Howell,Sherman,66.95,149.69,88.45,156.49,394.63,Single-ply,SBD,M
Boys,67.13,10,Bradley Beck,McKinney,62.73,136.08,83.91,151.95,371.95,Single-ply,SBD,M
Boys,67.13,11,Jonathan Farrington,McKinney North,65.86,108.86,65.77,136.08,310.71,Single-ply,SBD,M
Boys,74.84,1,Cory Sayler,Lewisville The Colony,74.39,240.4,131.54,217.72,589.67,Single-ply,SBD,M
Boys,74.84,2,Vincent Chavez,Frisco Centennial,73.98,185.97,113.4,158.76,458.13,Single-ply,SBD,M
Boys,74.84,3,Matt Munoz,McKinney,73.84,174.63,97.52,174.63,446.79,Single-ply,SBD,M
Boys,74.84,4,Seth Pratt,McKinney Boyd,71.44,149.69,97.52,183.7,430.91,Single-ply,SBD,M
Boys,74.84,5,Armani Edwards,Frisco Liberty,71.62,170.1,104.33,136.08,410.5,Single-ply,SBD,M
Boys,74.84,6,Austin Zada,Frisco,73.03,151.95,90.72,142.88,385.55,Single-ply,SBD,M
Boys,74.84,7,Taylor DeWitt,McKinney North,74.75,142.88,79.38,158.76,381.02,Single-ply,SBD,M
Boys,74.84,8,Anthony Mitchell,Frisco Wakeland,72.98,133.81,70.31,147.42,351.53,Single-ply,SBD,M
Boys,74.84,9,Daniel Broadus,McKinney North,72.26,120.2,90.72,131.54,342.46,Single-ply,SBD,M
Boys,74.84,10,Juan Washington,Frisco Heritage,69.17,102.06,70.31,102.06,274.42,Single-ply,SBD,M
Boys,74.84,11,Michael Silvosa,Frisco Heritage,70.03,102.06,68.04,90.72,260.82,Single-ply,SBD,M
Boys,74.84,12,Jarred Askis,Frisco,73.71,158.76,102.06,,260.82,Single-ply,SB,M
Boys,82.1,1,Blake Kozeny,Frisco Liberty,79.33,238.14,136.08,199.58,573.79,Single-ply,SBD,M
Boys,82.1,2,Tanner Haynie,Lewisville The Colony,80.69,226.8,106.59,197.31,530.7,Single-ply,SBD,M
Boys,82.1,3,Trez Robinson,Frisco Wakeland,79.83,192.78,117.93,208.65,519.36,Single-ply,SBD,M
Boys,82.1,4,Austin Arnold,Denison,79.38,179.17,136.08,183.7,498.95,Single-ply,SBD,M
Boys,82.1,5,Josh Tristah,Lewisville The Colony,78.93,183.7,117.93,192.78,494.42,Single-ply,SBD,M
Boys,82.1,6,Josh Panton,Lewisville The Colony,79.02,172.37,92.99,197.31,462.66,Single-ply,SBD,M
Boys,82.1,7,Shay McConic,Frisco Heritage,81.69,183.7,108.86,149.69,442.25,Single-ply,SBD,M
Boys,82.1,8,Quay McConic,Frisco Heritage,79.06,183.7,104.33,149.69,437.72,Single-ply,SBD,M
Boys,82.1,9,Tim Bolen,Denison,79.83,163.29,102.06,163.29,428.64,Single-ply,SBD,M
Boys,82.1,10,Johnny Le,Frisco Centennial,75.98,154.22,86.18,145.15,385.55,Single-ply,SBD,M
Boys,82.1,11,Kyle Nylec,McKinney Boyd,80.24,136.08,83.91,142.88,362.87,Single-ply,SBD,M
Boys,82.1,12,Garrett Garbelman,McKinney,77.84,131.54,65.77,149.69,347,Single-ply,SBD,M
Boys,82.1,13,Garrett Garner,McKinney,80.06,124.74,77.11,142.88,344.73,Single-ply,SBD,M
Boys,82.1,14,Steven Obiselu,Frisco Heritage,81.92,92.99,70.31,90.72,254.01,Single-ply,SBD,M
Boys,82.1,15,ShaCody Williams,Sherman,75.3,172.37,,,172.37,Single-ply,S,M
Boys,89.81,1,Tanner Anglin,Frisco Centennial,88.18,226.8,145.15,233.6,605.55,Single-ply,SBD,M
Boys,89.81,2,Justin Murphy,Lewisville The Colony,86.91,233.6,142.88,226.8,603.28,Single-ply,SBD,M
Boys,89.81,3,Corbin Boettger,Denison,87.72,208.65,115.67,195.04,519.36,Single-ply,SBD,M
Boys,89.81,4,Devin Smith,McKinney North,88.31,181.44,131.54,201.85,514.83,Single-ply,SBD,M
Boys,89.81,5,Aaron Bailey,Frisco Wakeland,85.09,190.51,115.67,204.12,510.29,Single-ply,SBD,M
Boys,89.81,6,Bo Davis,McKinney Boyd,89.72,167.83,113.4,183.7,464.93,Single-ply,SBD,M
Boys,89.81,7,Alex Zywicki,McKinney,83.28,176.9,102.06,181.44,460.4,Single-ply,SBD,M
Boys,89.81,8,Taylor Ray #2,McKinney North,88.41,163.29,97.52,158.76,419.57,Single-ply,SBD,M
Boys,89.81,9,Agustine Zavala,McKinney,87.27,149.69,90.72,151.95,392.36,Single-ply,SBD,M
Boys,89.81,10,Jacob Kohlschmidt,McKinney,88.81,142.88,77.11,149.69,369.68,Single-ply,SBD,M
Boys,89.81,11,Alex Hicks #1,Frisco Heritage,87.18,104.33,86.18,142.88,333.39,Single-ply,SBD,M
Boys,89.81,12,Nick Sprenger,Sherman,87.82,190.51,,,190.51,Single-ply,S,M
Boys,89.81,13,Chris Hendricks,Frisco Wakeland,83.64,147.42,,,147.42,Single-ply,S,M
Boys,89.81,14,Lohit Odusumilli,Frisco Heritage,88.99,86.18,,,86.18,Single-ply,S,M
Boys,99.79,1,Reggie Wilcox,Frisco Wakeland,97.7,254.01,140.61,249.48,644.1,Single-ply,SBD,M
Boys,109.77,2,Andrew Allen #1,Frisco Liberty,99.88,188.24,117.93,210.92,517.1,Single-ply,SBD,M
Boys,99.79,3,Robert Gay,Sherman,97.98,208.65,104.33,201.85,514.83,Single-ply,SBD,M
Boys,99.79,4,Derek Lauham,Lewisville The Colony,90.72,215.46,90.72,181.44,487.61,Single-ply,SBD,M
Boys,99.79,5,Cameron Gschwerd,Frisco Centennial,91.35,208.65,86.18,170.1,464.93,Single-ply,SBD,M
Boys,99.79,6,Clay Eppler,Denison,99.25,179.17,102.06,181.44,462.66,Single-ply,SBD,M
Boys,99.79,7,Spencer McDuffy,Frisco Liberty,90.9,179.17,106.59,174.63,460.4,Single-ply,SBD,M
Boys,99.79,8,Fizz Hossain,Frisco,93.08,181.44,97.52,181.44,460.4,Single-ply,SBD,M
Boys,99.79,9,Ryan Joyce,Frisco Centennial,95.98,167.83,115.67,176.9,460.4,Single-ply,SBD,M
Boys,99.79,10,Adam Borne,Frisco Liberty,94.8,174.63,117.93,158.76,451.32,Single-ply,SBD,M
Boys,99.79,11,Matt Oberlin,McKinney Boyd,99.34,167.83,97.52,156.49,421.84,Single-ply,SBD,M
Boys,99.79,12,Dj Shelby,Frisco Heritage,94.98,149.69,102.06,149.69,401.43,Single-ply,SBD,M
Boys,99.79,13,Matt Spradling,McKinney,97.25,136.08,81.65,124.74,342.46,Single-ply,SBD,M
Boys,99.79,14,Travis Tarver,McKinney,91.13,219.99,,,219.99,Single-ply,S,M
Boys,124.74,1,Robbie Murray,Lewisville The Colony,109.95,240.4,138.35,217.72,596.47,Single-ply,SBD,M
Boys,124.74,2,Max Milks,Sherman,109.95,226.8,145.15,208.65,580.6,Single-ply,SBD,M
Boys,109.77,3,Abel Palma,McKinney North,106.59,181.44,113.4,201.85,496.68,Single-ply,SBD,M
Boys,109.77,4,Kyle Flowers,Frisco Wakeland,102.97,174.63,129.27,190.51,494.42,Single-ply,SBD,M
Boys,109.77,5,Jacob Emery,Denison,104.33,176.9,104.33,192.78,474,Single-ply,SBD,M
Boys,109.77,6,Austin Vela,Frisco Wakeland,107.95,260.82,172.37,,433.18,Single-ply,SB,M
Boys,109.77,7,Devonte Fields,McKinney North,105.23,158.76,86.18,167.83,412.77,Single-ply,SBD,M
Boys,109.77,8,Brandon Ramsey,McKinney North,103.69,151.95,90.72,158.76,401.43,Single-ply,SBD,M
Boys,109.77,9,Drew Percle,Frisco Liberty,104.51,154.22,106.59,140.61,401.43,Single-ply,SBD,M
Boys,109.77,10,Jonathan Shuster,McKinney,106.96,136.08,77.11,136.08,349.27,Single-ply,SBD,M
Boys,124.74,1,Josh Morrison,Lewisville The Colony,111.95,272.16,161.03,226.8,659.98,Single-ply,SBD,M
Boys,124.74,2,Taylor Laseki,Frisco,111.4,204.12,158.76,199.58,562.45,Single-ply,SBD,M
Boys,124.74,3,Chase Appleby,Frisco Centennial,120.2,226.8,131.54,172.37,530.7,Single-ply,SBD,M
Boys,124.74,4,Connor Lambring,Frisco,119.11,210.92,117.93,181.44,510.29,Single-ply,SBD,M
Boys,124.74,5,Tai Nguyen,Frisco,120.66,204.12,124.74,158.76,487.61,Single-ply,SBD,M
Boys,124.74,6,Damarcus Henderson,Lewisville The Colony,120.84,190.51,90.72,192.78,474,Single-ply,SBD,M
Boys,124.74,7,Laride Connerly,McKinney Boyd,122.2,172.37,90.72,154.22,417.3,Single-ply,SBD,M
Boys,124.74,8,Connor Counce,Denison,111.86,235.87,,,235.87,Single-ply,S,M
Boys,124.74,9,Carter Flemmer,Frisco,120.75,170.1,,,170.1,Single-ply,S,M
Boys,124.74+,1,Davidson Venancio,Frisco Liberty,126.55,294.84,165.56,249.48,709.87,Single-ply,SBD,M
Boys,124.74+,2,Josh Burkham,Lewisville The Colony,139.25,278.96,170.1,251.74,700.8,Single-ply,SBD,M
Boys,124.74+,3,DJ Willis,Lewisville The Colony,135.81,242.67,142.88,244.94,630.49,Single-ply,SBD,M
Boys,124.74+,4,Steven Jackson #2,Lewisville The Colony,135.26,240.4,131.54,254.01,625.96,Single-ply,SBD,M
Boys,124.74+,5,Hunter Clark,Frisco Liberty,125.65,192.78,138.35,172.37,503.49,Single-ply,SBD,M
Boys,124.74+,6,Mitch Grimes,McKinney North,168.28,190.51,115.67,183.7,489.88,Single-ply,SBD,M
Boys,124.74+,7,Ryan Clark #8,Frisco Liberty,127.82,172.37,138.35,167.83,478.54,Single-ply,SBD,M
