{
    "SSH": [
        {
        "TAG": "linux_ping_demo",
        "ROLE": "DUT",
        "IP": "127.0.0.1",
        "PORT": "22",
        "USERNAME": "",
        "PASS": "",
        "SSHKEY_PATH": "",
        "CLI_START": "",
        "CLI_ATTACH_2.4GHZ": "",
        "CLI_ATTACH_SUBGHZ": "",
        "SUCCESS_STRING": "0% packet loss",
        "FAIL_STRING": "100% packet loss"
        }
    ]
}