
{
    "SNIFFER": [
        {
            "APP_PATH": "/home/user/work/bin/zb-sniff",
            "DEV_PATH": "/dev/ttyACM3",
            "PAGE": "0",
            "CHANNEL": "11",
            "TSHARK_INTERFACE": "/tmp/packet_stream"
        }
    ],
    "SERIAL": [
        {
            "ROLE": "d",
            "PATH": "/dev/ttyACM0",
            "2.4GHZ": "Y",
            "SUBGHZ": "N",
            "SUCCESS_STRING": "COMMAND=SUCCESS",
            "FAIL_STRING": "COMMAND=FAIL"
        }
    ],
    "SSH": [
        {
            "TAG": "bbg-gu",
            "ROLE": "g",
            "IP": "192.168.121.2",
            "PORT": "22",
            "USERNAME": "debian",
            "PASS": "temppwd",
            "SSHKEY_PATH": "",
            "CLI_START": "./zbcli",
            "CLI_ATTACH_2.4GHZ": "wpan serial /dev/ttyACM0",
            "CLI_ATTACH_SUBGHZ": "",
            "SUCCESS_STRING": "COMMAND=SUCCESS",
            "FAIL_STRING": "COMMAND=FAIL"
        },
        {
            "TAG": "bbg-gu",
            "ROLE": "g",
            "IP": "192.168.122.2",
            "PORT": "22",
            "USERNAME": "debian",
            "PASS": "temppwd",
            "SSHKEY_PATH": "",
            "CLI_START": "./zbcli",
            "CLI_ATTACH_2.4GHZ": "wpan serial /dev/ttyACM0",
            "CLI_ATTACH_SUBGHZ": "",
            "SUCCESS_STRING": "COMMAND=SUCCESS",
            "FAIL_STRING": "COMMAND=FAIL"
        }
    ]
}
