<?xml version="1.0" encoding="UTF-8"?>
<!DOCTYPE svg PUBLIC "-//W3C//DTD SVG 1.1//EN" "http://www.w3.org/Graphics/SVG/1.1/DTD/svg11.dtd">
<!-- Creator: CorelDRAW -->
<svg xmlns="http://www.w3.org/2000/svg" xml:space="preserve" width="266px" height="100px" style="shape-rendering:geometricPrecision; text-rendering:geometricPrecision; image-rendering:optimizeQuality; fill-rule:evenodd; clip-rule:evenodd"
viewBox="0 0 266 99.9971"
 xmlns:xlink="http://www.w3.org/1999/xlink"
 version="1.0">
 <defs>
  <style type="text/css">
   <![CDATA[
    .str0 {stroke:white;stroke-width:0.636601}
    .fil0 {fill:#2EA4E7}
   ]]>
  </style>
 </defs>
 <g id="Слой_x0020_1">
  <metadata id="CorelCorpID_0Corel-Layer"/>
  <g id="_262705496">
   <path id="_261666384" class="fil0" d="M59.5842 3.25977c-1.60981,7.18568 -2.01138,10.0604 -2.12712,15.4072l-0.114565 5.54752 2.3279 0c2.21334,0 2.32909,-0.0295269 2.32909,-0.633058 0,-1.03462 -1.40903,-16.2977 -1.72555,-18.5973 -0.316529,-2.35743 -0.459439,-2.73065 -0.689749,-1.72437l0 0z"/>
   <path id="_261666072" class="fil0" d="M148.319 24.5593c-0.890533,0.287002 -0.948406,0.373221 -0.948406,1.72437l0 1.40903 0.833841 -0.431093c2.09878,-1.0925 4.74321,-0.805495 5.08808,0.575185 0.459439,1.78107 -0.575185,2.70113 -3.04718,2.70113l-1.43737 0 0 1.29328 0 1.29446 1.86847 0c1.63816,0 1.98303,0.0862187 2.58774,0.718095 1.26375,1.23659 0.660223,3.01884 -1.17872,3.47827 -1.03462,0.258656 -3.36371,-0.0578728 -4.39833,-0.603531l-0.890533 -0.459439 0 1.43619c0,1.38068 0.0283459,1.43737 1.0925,1.78225 0.574004,0.201964 2.03972,0.374402 3.24796,0.374402 3.79362,0 6.12271,-1.66768 6.12271,-4.34046 0,-1.7539 -0.661404,-2.78852 -2.21334,-3.39206l-1.20824 -0.488966 0.92006 -0.373221c1.81059,-0.775968 2.61609,-3.21962 1.66768,-5.03021 -0.719276,-1.3795 -2.32909,-2.01256 -4.94399,-1.98303 -1.23659,0.0283459 -2.67396,0.172437 -3.16293,0.315348l0 0 0 0z"/>
   <polygon id="_261667272" class="fil0" points="94.7673,32.1194 94.7673,39.7362 99.396,39.7362 103.995,39.7362 103.909,38.3567 103.823,37.0055 100.89,36.9193 97.9303,36.8331 97.9303,35.1371 97.9303,33.4127 100.517,33.4127 103.103,33.4127 103.103,31.9753 103.103,30.5379 100.517,30.5379 97.9303,30.5379 97.9303,28.8136 97.9303,27.0892 100.66,27.0892 103.392,27.0892 103.392,25.7947 103.392,24.5015 99.0794,24.5015 94.7673,24.5015 94.7673,32.1194 "/>
   <path id="_261667296" class="fil0" d="M106.094 26.5719c0.545658,1.14919 1.63816,3.50662 2.44365,5.20265 0.804314,1.69603 1.46572,3.21962 1.46572,3.33418 0,0.144092 -0.402748,0.661404 -0.862187,1.17872 -0.777149,0.833841 -0.977932,0.918879 -2.01256,0.746441l-1.15037 -0.172437 0 1.40903c0,1.35115 0.0295269,1.40903 0.949587,1.58146 2.38578,0.431093 4.42668,-0.92006 5.92074,-3.96724 0.977932,-2.01256 5.20265,-11.1813 5.20265,-11.297 0,-0.0566917 -0.775968,-0.0862187 -1.69603,-0.0862187l-1.69603 0 -1.46572 3.65071c-1.06297,2.70231 -1.49406,3.5078 -1.60981,3.10505 -0.114565,-0.316529 -0.746441,-1.92634 -1.43737,-3.59284l-1.23541 -3.01884 -1.89681 -0.0862187 -1.89799 -0.0862187 0.977932 2.09878 0 0 0 0z"/>
   <path id="_261667320" class="fil0" d="M120.064 32.1194l0 7.61677 1.58028 0c1.06415,0 1.58146,-0.114565 1.60981,-0.373221 0,-0.172437 0.0295269,-1.3795 0.0578728,-2.64443l0.0578728 -2.29956 2.01138 -0.172437c3.30584,-0.258656 4.97352,-1.38068 5.63374,-3.7948 0.604712,-2.27121 -0.287002,-4.45503 -2.18381,-5.37509 -1.00628,-0.488966 -1.78225,-0.575185 -4.97352,-0.575185l-3.79362 0 0 7.61795 0 0 0 0zm6.98489 -4.48455c0.862187,0.833841 0.804314,2.81687 -0.0578728,3.50662 -0.689749,0.546839 -2.96096,1.00628 -3.44875,0.689749 -0.344875,-0.200783 -0.431093,-4.51172 -0.0862187,-4.85777 0.401566,-0.459439 2.95978,0.0295269 3.59284,0.661404l0 0z"/>
   <path id="_261667368" class="fil0" d="M136.016 24.8463c-0.0578728,0.201964 -1.29328,3.56449 -2.73065,7.47386 -1.40903,3.90937 -2.58774,7.18686 -2.58774,7.2719 0,0.0873998 0.805495,0.144092 1.78225,0.0873998l1.78225 -0.0873998 0.488966 -1.58028 0.459439 -1.58146 2.90309 -0.0862187 2.90427 -0.0862187 0.487785 1.7539 0.488966 1.72437 1.84012 0c1.63816,0 1.83894,-0.0566917 1.6665,-0.517312 -0.0862187,-0.258656 -1.29328,-3.65071 -2.67278,-7.53055l-2.50152 -7.04277 -2.09759 -0.0862187c-1.49524,-0.0578728 -2.12712,0.0283459 -2.21334,0.287002l0 0 0 0zm2.44365 3.07553c0,0.259837 0.401566,1.63934 0.862187,3.04718 0.487785,1.40903 0.862187,2.58774 0.862187,2.64443 0,0.0578728 -0.92006,0.0862187 -2.0409,0.0862187 -1.81059,0 -2.0409,-0.0566917 -1.92634,-0.517312 1.20706,-4.54124 2.24287,-6.98489 2.24287,-5.26052z"/>
   <path id="_261667872" class="fil0" d="M160.018 32.1194l0 7.6463 1.78225 -0.0862187 1.7539 -0.0862187 3.47709 -5.37627c1.92634,-2.95978 3.53615,-5.37509 3.62237,-5.37509 0.0862187,-0.0283459 0.114565,2.4153 0.0578728,5.43296l-0.115746 5.4613 1.60981 0 1.60981 0 0 -7.61677 0 -7.61795 -1.83894 0 -1.81177 0 -3.4204 5.23218 -3.4204 5.26052 -0.0862187 -5.26052 -0.0578728 -5.23218 -1.58028 0 -1.58146 0 0 7.61795 0 0 0 0z"/>
   <path id="_261667656" class="fil0" d="M179.335 25.105c-1.43737,0.719276 -2.12712,1.84012 -2.15547,3.62237 0,1.49406 0.660223,2.52987 2.15547,3.39206l1.00628 0.575185 -0.863368 0.718095c-0.689749,0.545658 -3.36253,5.4613 -3.36253,6.1794 0,0.0873998 0.833841,0.144092 1.84012,0.144092l1.81059 0 1.0925 -2.61609c1.14919,-2.73065 1.78225,-3.4204 3.07553,-3.4204l0.804314 0 0 3.01884 0 3.01765 1.58146 0 1.58028 0 0 -7.61677 0 -7.61795 -3.64953 0c-3.16293,0 -3.85268,0.0862187 -4.91565,0.603531l0 0 0 0zm5.40343 3.85268l0 2.15547 -1.3795 0c-1.72437,0 -2.64443,-0.747622 -2.64443,-2.09878 0,-1.55194 0.833841,-2.18499 2.81687,-2.21334l1.20706 0 0 2.15547 0 0 0 0.00118108z"/>
   <path id="_261667848" class="fil0" d="M55.7032 26.1396c-0.0862187,1.55312 -0.0862187,1.81177 0.144092,3.27749 0.172437,1.20706 0.288183,1.3795 1.03462,1.52359 0.862187,0.172437 0.862187,0.200783 0.747622,1.46572 -0.172437,1.52359 0.23031,1.69603 1.49524,0.603531 0.459439,-0.373221 1.40784,-0.833841 2.15547,-1.06297 1.32281,-0.402748 1.32281,-0.402748 1.14919,-1.40903 -0.0862187,-0.545658 -0.431093,-1.20706 -0.746441,-1.43737 -1.52359,-1.12084 -2.93262,-2.472 -3.30584,-3.21962 -0.344875,-0.661404 -0.603531,-0.804314 -1.49524,-0.804314 -1.06297,0 -1.0925,0.0283459 -1.17872,1.06297l0 0z"/>
   <path id="_261667776" class="fil0" d="M59.2972 25.9388c0.661404,1.12084 2.472,2.4153 3.99559,2.8464 0.775968,0.200783 2.81687,0.258656 6.26562,0.114565 4.74321,-0.172437 5.08808,-0.200783 5.08808,-0.718095 0,-0.517312 -0.258656,-0.546839 -5.95027,-0.488966 -5.26052,0.0578728 -6.09318,0.0283459 -7.07111,-0.431093 -0.603531,-0.288183 -1.29328,-0.805495 -1.58028,-1.15037 -0.863368,-1.0925 -1.35115,-1.20706 -0.747622,-0.172437l0 0 0 0z"/>
   <path id="_261669072" class="fil0" d="M61.194 26.0534c0.488966,0.432275 1.32281,0.777149 2.06925,0.891714 1.58146,0.258656 10.6935,0.0862187 10.9521,-0.201964 0.114565,-0.114565 0.114565,-0.344875 -0.0283459,-0.545658 -0.144092,-0.258656 -1.63934,-0.316529 -6.29515,-0.172437 -5.23218,0.172437 -6.15223,0.114565 -6.78411,-0.258656 -0.603531,-0.402748 -0.603531,-0.373221 0.0862187,0.287002l0 0 0 0z"/>
   <path id="_261668832" class="fil0" d="M83.7868 25.6802c-1.49406,0.23031 -3.01765,1.32281 -5.14478,3.70858 -1.00628,1.12084 -2.21334,2.27003 -2.70231,2.55821 -0.459439,0.287002 -2.09759,0.747622 -3.62118,1.00628 -2.73065,0.459439 -4.34046,0.401566 -9.65885,-0.288183 -1.60981,-0.200783 -2.64443,0.201964 -3.24796,1.29328 -0.258656,0.517312 -0.23031,0.517312 0.575185,0.23031 0.661404,-0.258656 1.63816,-0.200783 4.34046,0.200783 5.03021,0.719276 10.2329,0.92006 11.9289,0.46062 0.718095,-0.201964 2.29956,-1.00628 3.44993,-1.78225 4.48337,-2.90309 4.65581,-2.96096 9.11202,-2.93262l3.93771 0 0 -2.29838 0 -2.32909 -3.96724 0c-2.15547,0 -4.42668,0.0578728 -5.00068,0.172437l-0.00118108 0 0 0z"/>
   <path id="_261668520" class="fil0" d="M30.3797 29.9628c0,3.70858 0.0283459,4.02511 0.517312,4.02511 0.459439,0 0.603531,-0.546839 1.12084,-3.82315 0.633058,-4.08181 0.603531,-4.2259 -0.833841,-4.2259l-0.804314 0 0 4.02393 0 0 0 0z"/>
   <path id="_261668784" class="fil0" d="M32.7076 30.3076c-0.200783,1.4669 -0.431093,2.96096 -0.517312,3.27749 -0.114565,0.545658 0.0295269,0.631877 0.92006,0.747622 1.17872,0.14291 1.23541,0.0283459 2.61609,-3.88102l0.661404 -1.95468 -0.977932 -0.431093c-0.545658,-0.23031 -1.29328,-0.402748 -1.6665,-0.402748 -0.661404,0 -0.719276,0.144092 -1.03462,2.64443l0 0 -0.00118108 0z"/>
   <path id="_261668616" class="fil0" d="M36.0418 31.6883c-0.603531,1.60981 -1.06297,2.95978 -1.0051,2.98931 0.0283459,0.0578728 0.401566,0.258656 0.775968,0.459439 0.833841,0.431093 0.92006,0.344875 2.64443,-2.93144 1.29328,-2.52987 1.23541,-2.93262 -0.459439,-3.24796 -0.862187,-0.172437 -0.862187,-0.172437 -1.95468,2.73065l-0.00118108 0z"/>
   <path id="_262705568" class="fil0" d="M38.802 33.0678l-1.49524 2.81687 0.805495 0.488966 0.833841 0.487785 1.6665 -2.759 1.66768 -2.76018 -0.661404 -0.545658c-0.373221,-0.316529 -0.804314,-0.545658 -1.00628,-0.545658 -0.172437,0 -0.976751,1.26375 -1.81059,2.81687l0 0 0 0z"/>
   <path id="_262705352" class="fil0" d="M85.5986 30.825c-0.689749,0.144092 -1.95468,0.690931 -2.78852,1.20824 -0.833841,0.517312 -2.41412,1.49406 -3.50662,2.18381 -3.04718,1.86847 -5.97862,2.09878 -13.8257,1.00628 -1.20824,-0.144092 -1.23659,-0.144092 -1.03581,0.517312 0.374402,1.29328 0.747622,1.40903 5.63492,1.86847 5.40343,0.517312 7.12781,0.402748 9.57146,-0.631877 0.976751,-0.402748 3.19009,-1.12084 4.91565,-1.60981 2.78734,-0.747622 3.44875,-0.833841 5.69161,-0.689749l2.50034 0.200783 0 -1.86847c0,-1.52359 -0.0862187,-1.89681 -0.488966,-2.01256 -1.09132,-0.287002 -5.4613,-0.401566 -6.66837,-0.172437l0 0z"/>
   <path id="_262705856" class="fil0" d="M41.1877 34.5914c-1.29328,2.06925 -1.58146,2.70231 -1.29328,3.01765 0.172437,0.23031 0.488966,0.402748 0.661404,0.402748 0.172437,0 1.34997,-0.976751 2.61491,-2.18499l2.29956 -2.15547 -1.00628 -0.862187c-0.545658,-0.459439 -1.14919,-0.833841 -1.32163,-0.833841 -0.200783,0 -1.06415,1.17872 -1.95468,2.61609l0 0 0 0z"/>
   <path id="_262706528" class="fil0" d="M43.5452 36.4882c-2.472,2.21334 -2.50152,2.24169 -1.95468,2.78852 0.517312,0.545658 0.574004,0.517312 3.046,-1.15037 1.38068,-0.92006 2.55821,-1.83894 2.61609,-2.01138 0.0578728,-0.201964 -0.172437,-0.690931 -0.545658,-1.0925l-0.661404 -0.775968 -2.50034 2.24169 0 0 0 0z"/>
   <path id="_262706600" class="fil0" d="M59.6988 35.1949c-0.545658,0.373221 -1.60863,1.78225 -2.50034,3.24796 -1.32281,2.21334 -1.49524,2.58656 -1.03462,2.67278 0.287002,0.0295269 2.27121,-0.172437 4.39715,-0.459439 3.88102,-0.517312 3.88102,-0.517312 3.96724,-1.29328 0.172437,-1.40903 -0.775968,-3.62237 -1.78225,-4.25424 -1.17872,-0.719276 -1.89681,-0.689749 -3.04718,0.0862187l0 0z"/>
   <path id="_262706456" class="fil0" d="M25.5798 35.339c-1.63934,0.83266 -2.35743,3.21844 -2.38696,7.64512 0,1.55312 -0.200783,3.7948 -0.459439,4.97352 -0.402748,2.01138 -0.402748,2.24169 0.0295269,2.70231 0.258656,0.287002 0.574004,0.890533 0.689749,1.32163 0.287002,1.12084 0.660223,1.03462 1.03462,-0.172437 0.459439,-1.49406 1.06297,-2.58656 1.32163,-2.41412 0.115746,0.0566917 0.173618,0.315348 0.0578728,0.545658 -0.114565,0.374402 0.948406,0.431093 7.84708,0.431093 4.36999,0 7.90495,-0.0566917 7.84826,-0.114565 -0.0578728,-0.0862187 -3.39206,-0.201964 -7.38764,-0.258656 -3.99559,-0.0578728 -7.32977,-0.201964 -7.44552,-0.288183 -0.0862187,-0.114565 0.0578728,-0.258656 0.316529,-0.373221 0.258656,-0.114565 0.747622,-0.689749 1.03462,-1.29328 0.316529,-0.603531 1.03462,-1.43737 1.58146,-1.86847 1.12084,-0.833841 1.86847,-2.0409 1.86847,-2.96096 0,-0.316529 -0.316529,-0.948406 -0.719276,-1.40784 -0.401566,-0.488966 -0.718095,-0.949587 -0.718095,-1.03581 0,-0.114565 0.661404,-1.06297 1.46572,-2.12712 1.55194,-2.01138 2.18499,-3.10387 1.92634,-3.36253 -0.0862187,-0.0862187 -1.69603,-0.23031 -3.56449,-0.316529 -2.81687,-0.0862187 -3.59284,-0.0283459 -4.34046,0.374402l0 0 0 0z"/>
   <path id="_262706576" class="fil0" d="M85.7711 35.4253c-0.575185,0.14291 -2.52987,0.890533 -4.31212,1.63816 -2.93144,1.20706 -3.47827,1.35115 -6.03649,1.46572 -2.52987,0.114565 -8.42227,-0.316529 -9.77342,-0.718095 -0.431093,-0.115746 -0.517312,0 -0.431093,0.545658 0.0862187,0.603531 0.344875,0.718095 3.53615,1.29328 1.89681,0.374402 4.68534,0.747622 6.1794,0.833841 2.50152,0.172437 3.10505,0.0862187 7.18686,-0.890533 4.48337,-1.06415 7.15733,-1.32281 9.42854,-0.92006l1.20706 0.200783 0 -1.55194c0,-1.3795 -0.0862187,-1.55194 -0.633058,-1.69603 -1.3795,-0.344875 -5.31721,-0.459439 -6.35184,-0.200783l0 0 0 0z"/>
   <path id="_262706984" class="fil0" d="M33.8001 36.6323c-0.344875,0.689749 -1.06297,1.78225 -1.58028,2.44247 -1.06415,1.29446 -1.20824,1.7539 -0.546839,1.98421 0.201964,0.0862187 0.603531,0.718095 0.891714,1.40784 0.517312,1.40903 0.315348,3.01884 -0.719276,5.31839 -0.316529,0.689749 -0.487785,1.3795 -0.431093,1.49406 0.0862187,0.115746 2.32909,0.23031 5.03021,0.23031 4.48455,0 4.91565,-0.0578728 5.43296,-0.575185 0.316529,-0.315348 0.948406,-0.575185 1.40903,-0.575185l0.804314 0 -0.23031 -1.3795c-0.92006,-4.91447 -3.16175,-8.33605 -6.86915,-10.4632 -2.24287,-1.29328 -2.472,-1.29328 -3.19127,0.115746l0 0 0 0z"/>
   <path id="_262706912" class="fil0" d="M45.155 38.6153c-1.40903,0.977932 -2.58774,1.81059 -2.64443,1.84012 -0.23031,0.172437 0.660223,1.58028 0.918879,1.49406 0.172437,-0.0566917 1.52359,-0.574004 2.96096,-1.09132 2.55821,-0.949587 2.67278,-1.00628 2.67278,-1.84012 0,-0.862187 -0.660223,-2.15547 -1.12084,-2.15547 -0.114565,0 -1.3795,0.804314 -2.78734,1.75272l0 0 0 0z"/>
   <path id="_262706816" class="fil0" d="M83.4136 40.0244c-5.1743,1.40784 -6.2668,1.52241 -10.5494,1.0051 -2.06925,-0.229129 -4.25424,-0.545658 -4.80108,-0.689749 -2.15547,-0.545658 -2.78734,-0.631877 -2.29956,-0.316529 0.719276,0.402748 8.16361,2.21334 10.1762,2.4153 1.03462,0.114565 3.01884,0.0283459 5.00186,-0.258656 5.40343,-0.719276 6.78293,-0.603531 13.0214,0.976751 6.38136,1.63816 8.6514,1.98421 9.28445,1.46572 0.258656,-0.229129 0.431093,-0.862187 0.431093,-1.60981l0 -1.23541 -4.91565 -0.0862187c-5.28887,-0.0862187 -5.08808,-0.0283459 -6.15105,-1.78225 -0.23031,-0.373221 -0.891714,-0.517312 -3.16175,-0.603531 -2.55821,-0.144092 -3.21962,-0.0578728 -6.03649,0.718095l0 0.00118108z"/>
   <path id="_262707032" class="fil0" d="M48.6321 40.8287c-0.315348,0.0578728 -1.58028,0.488966 -2.78734,0.977932 -2.27121,0.862187 -2.58774,1.23541 -1.98421,2.21334 0.23031,0.373221 0.633058,0.373221 2.96096,0 2.67396,-0.402748 2.67396,-0.402748 2.76018,-1.26493 0.114565,-1.26493 -0.258656,-2.0409 -0.948406,-1.92634l-0.00118108 0z"/>
   <path id="_262708160" class="fil0" d="M59.8429 41.3755c-4.19637,0.487785 -4.85777,0.660223 -4.97234,1.32163 -0.0862187,0.459439 0.287002,0.488966 4.54124,0.488966l4.59912 0 0.287002 -0.747622c0.661404,-1.72437 0.833841,-1.69603 -4.45503,-1.06297l0 0z"/>
   <path id="_262707560" class="fil0" d="M65.5061 41.2019c0.0862187,0.23031 2.18381,1.12202 4.71368,1.98421l4.57077 1.58028 6.03649 0.0295269c5.92074,0 6.09318,0.0283459 8.19196,0.83266 1.7539,0.661404 2.78852,0.833841 5.6054,0.977932l3.44875 0.172437 0.575185 1.06297c0.747622,1.40903 1.40903,1.38068 2.15547,-0.0566917 1.03581,-2.0409 1.0925,-1.98421 -2.95978,-2.73065 -1.3795,-0.258656 -3.96724,-0.891714 -5.69161,-1.43737 -4.11133,-1.29328 -6.20893,-1.46572 -10.1183,-0.891714 -4.7999,0.719276 -6.72624,0.603531 -11.297,-0.574004 -5.40343,-1.43737 -5.40343,-1.43737 -5.23099,-0.949587l0 0z"/>
   <path id="_262707944" class="fil0" d="M64.9309 43.042c-0.200783,0.431093 -0.287002,0.891714 -0.172437,1.03462 0.373221,0.633058 6.29515,3.33418 9.77342,4.42668 3.33418,1.06415 3.90937,1.17872 5.31721,0.977932 0.862187,-0.115746 2.73065,-0.23031 4.13968,-0.23031 2.84522,-0.0283459 4.45503,0.488966 7.30142,2.21334l1.46572 0.92006 -0.891714 -1.78225c-0.603531,-1.17872 -0.833841,-2.0409 -0.746441,-2.61609 0.0850376,-0.747622 0,-0.890533 -0.891714,-1.26493 -2.27121,-0.948406 -5.23099,-1.29328 -9.54311,-1.12084 -4.68534,0.200783 -5.95027,0 -11.5557,-1.98303 -1.63816,-0.575185 -3.16175,-1.12084 -3.4204,-1.20706 -0.258656,-0.0862187 -0.575185,0.14291 -0.775968,0.631877l0 0z"/>
   <path id="_262707824" class="fil0" d="M54.6981 45.8872c-0.431093,1.03581 -1.23659,2.32909 -1.78225,2.87474 -0.546839,0.575185 -0.862187,1.03462 -0.689749,1.03462 0.172437,0 1.0051,0.719276 1.83894,1.58146l1.52359 1.60981 1.58146 -1.69603c1.26493,-1.3795 4.25424,-6.32349 4.25424,-7.07111 0,-0.0862187 -1.32281,-0.172437 -2.96096,-0.172437l-2.96096 0 -0.804314 1.83894 0 0 0 0z"/>
   <path id="_262708424" class="fil0" d="M61.5968 45.6865c-1.3795,2.87474 -3.27749,5.69161 -4.62864,6.95655l-1.29328 1.17872 2.98931 0 2.96096 0 0.201964 -2.09878c0.114565,-1.12084 0.517312,-3.21962 0.948406,-4.62746 0.603531,-2.09878 0.660223,-2.58774 0.344875,-2.78852 -0.633058,-0.402748 -0.661404,-0.344875 -1.52359,1.3795l0 0z"/>
   <path id="_262708496" class="fil0" d="M93.043 48.5033c0,0.0862187 1.0925,2.35743 2.44365,5.03021 1.35115,2.67396 2.44365,5.00186 2.44365,5.1743 0,0.144092 -0.46062,0.287002 -1.00628,0.287002 -1.00628,0 -1.00628,0 -1.00628,1.29446 0,1.29328 0,1.29328 1.00628,1.29328 0.976751,0 1.00628,0.0283459 1.00628,1.14919l0 1.15037 1.58028 0 1.58146 0 0 -1.15037 0 -1.14919 1.26493 0 1.29328 0 -0.0578728 -1.29328 -0.0283459 -1.29446 -1.23659 0c-0.747622,0 -1.23541,-0.14291 -1.23541,-0.315348 0,-0.201964 1.0925,-2.44365 2.44365,-5.00186 1.34997,-2.58774 2.44247,-4.82943 2.44247,-5.00186 0,-0.200783 -0.603531,-0.316529 -1.58028,-0.316529 -1.81177,0 -1.58146,-0.258656 -3.47827,4.11133 -0.948406,2.27003 -1.29328,2.78734 -1.43737,2.35625 -0.114565,-0.315348 -0.775968,-1.86847 -1.43737,-3.44875l-1.20706 -2.87474 -1.89681 -0.0862187c-1.03581,-0.0578728 -1.89799,0 -1.89799,0.0862187l0 0z"/>
   <path id="_262709024" class="fil0" d="M111.325 48.7053c-0.0862187,0.200783 -0.258656,1.40784 -0.459439,2.67278 -0.518493,3.59284 -1.66768,8.47896 -2.18499,9.25611 -0.344875,0.574004 -0.633058,0.689749 -1.29328,0.603531 -0.863368,-0.144092 -0.863368,-0.115746 -0.777149,1.17872l0.0862187 1.32163 1.43737 0.0862187c2.99049,0.144092 3.88102,-1.23541 5.00186,-7.70299 0.374402,-1.98421 0.689749,-3.88102 0.775968,-4.25424 0.115746,-0.575185 0.288183,-0.633058 1.69603,-0.633058l1.58146 0 0 6.32467 0 6.32349 1.72437 0 1.72437 0 0 -7.76086 0 -7.76204 -4.59912 0c-3.44875,0 -4.65581,0.0862187 -4.71368,0.346056l0 0 0 0z"/>
   <polygon id="_262709216" class="fil0" points="122.938,49.7966 122.938,51.234 125.094,51.234 127.249,51.234 127.249,57.5575 127.249,63.8821 128.831,63.8821 130.411,63.8821 130.411,57.5575 130.411,51.234 132.711,51.234 135.01,51.234 135.01,49.7966 135.01,48.3592 128.974,48.3592 122.938,48.3592 "/>
   <polygon id="_262709336" class="fil0" points="136.161,49.7966 136.161,51.234 138.316,51.234 140.471,51.234 140.471,57.5575 140.471,63.8821 142.197,63.8821 143.921,63.8821 143.921,57.5575 143.921,51.234 146.078,51.234 148.234,51.234 148.234,49.7966 148.234,48.3592 142.197,48.3592 136.161,48.3592 "/>
   <path id="_262677512" class="fil0" d="M150.533 56.1201l0 7.76204 2.70231 0c3.19009,0 5.518,-0.402748 6.49593,-1.0925 1.23541,-0.891714 2.06925,-2.87474 1.89681,-4.48455 -0.315348,-2.78852 -1.49406,-3.70858 -5.1743,-3.90937l-2.61491 -0.144092 -0.0862187 -2.95978 -0.0862187 -2.93262 -1.55194 0 -1.58146 0 0 7.76086 0 0zm6.58215 0.948406c0.92006,0.46062 1.32281,1.72555 0.890533,2.76018 -0.401566,1.00628 -1.34997,1.46572 -3.01765,1.46572l-1.29328 0 0 -2.29956 0 -2.29956 1.3795 0c0.747622,0 1.66768,0.172437 2.0409,0.373221l0 0 0 0z"/>
   <polygon id="_262677392" class="fil0" points="163.468,56.1201 163.468,63.8821 165.049,63.8821 166.629,63.8821 166.629,56.1201 166.629,48.3604 165.049,48.3604 163.468,48.3604 "/>
   <path id="_262676960" class="fil0" d="M170.367 56.1201l0 7.76204 1.58028 0 1.58146 0 0 -3.73693c0,-2.07043 0.0862187,-3.73693 0.229129,-3.70858 0.115746,0 1.29446,1.66768 2.61609,3.73693 2.38578,3.70858 2.38578,3.70858 3.50662,3.70858 1.0925,0 1.12202,0.0283459 1.12202,1.0051 0,1.00628 0,1.00628 1.29328,1.00628l1.29328 0 0 -2.15547 0 -2.15547 -1.12084 0c-1.0925,0 -1.17872,-0.0862187 -3.19127,-2.87474 -1.20706,-1.72437 -1.9535,-3.01884 -1.83894,-3.24796 0.114565,-0.172437 1.20706,-1.69603 2.41412,-3.36371 1.20706,-1.6665 2.29956,-3.19009 2.4153,-3.39206 0.14291,-0.258656 -0.259837,-0.344875 -1.7539,-0.344875l-1.95468 0 -2.29956 3.59402c-1.26493,1.9535 -2.38578,3.56331 -2.50034,3.56331 -0.144092,0.0295269 -0.23031,-1.58028 -0.23031,-3.56331l0 -3.59402 -1.58146 0 -1.58028 0 0 7.76086 0 0z"/>
   <path id="_262677608" class="fil0" d="M48.6321 49.9407c-0.14291,0.0578728 -0.862187,0.172437 -1.58028,0.287002l-1.29328 0.172437 -0.0578728 1.23659 -0.0578728 1.23541 1.35115 0.201964c2.61609,0.373221 7.81874,0.545658 7.81874,0.287002 0,-0.344875 -2.18499,-2.44365 -3.21962,-3.07553 -0.689749,-0.431093 -2.18499,-0.603531 -2.96096,-0.344875l0 0z"/>
   <path id="_262678328" class="fil0" d="M28.5396 53.3044c-0.890533,1.32163 -2.27003,3.27631 -3.046,4.39715 -1.52359,2.15665 -3.30584,5.28887 -3.10505,5.46249 0.200783,0.229129 7.79039,-1.35115 11.4116,-2.32909 2.09878,-0.575185 5.05974,-1.69603 7.18686,-2.70231 1.98303,-0.918879 3.96606,-1.78107 4.39715,-1.89681l0.805495 -0.172437 -0.833841 -0.775968c-0.431093,-0.402748 -0.891714,-1.03462 -1.00628,-1.40903 -0.172437,-0.517312 -0.431093,-0.631877 -1.49524,-0.631877 -1.09132,0 -1.46572,-0.172437 -2.52869,-1.15037l-1.23659 -1.14919 -4.45503 0 -4.42668 0 -1.66768 2.35743 0 -0.00118108 0 0.00118108z"/>
   <path id="_262677704" class="fil0" d="M51.6509 54.9142c0,0.401566 0.92006,1.60863 2.27121,3.01765 1.92516,1.98303 2.93144,2.21334 9.77224,2.21334 6.46758,0 6.9282,-0.0862187 6.9282,-1.03462l0 -0.689749 -6.98489 0c-8.39392,0 -9.08367,-0.144092 -10.7514,-2.32909 -1.0925,-1.43737 -1.23541,-1.58028 -1.23541,-1.17753l0 0z"/>
   <path id="_262677752" class="fil0" d="M12.96 55.6028c-0.344875,0.374402 -1.0925,1.58146 -1.69603,2.73065 -0.603531,1.12084 -1.86847,3.1334 -2.81687,4.45621 -0.948406,1.32163 -2.0409,3.10387 -2.41412,3.96606 -0.373221,0.862187 -0.862187,1.92634 -1.0925,2.32909 -0.431093,0.775968 -0.316529,3.21844 0.144092,4.02393 0.316529,0.459439 3.30584,-0.719276 3.87984,-1.58146 0.546839,-0.775968 0.546839,-2.01138 0,-2.472 -0.660223,-0.545658 -0.517312,-1.40784 0.288183,-1.72437 0.948406,-0.344875 1.17872,-1.00628 0.689749,-1.89681 -0.488966,-0.948406 0,-1.86847 2.50034,-4.57077 1.69603,-1.84012 1.89799,-1.95468 2.24287,-1.52359 0.200783,0.287002 1.06297,2.61609 1.89681,5.1743 1.20706,3.73693 1.66768,4.82943 2.38578,5.4613 0.459439,0.459439 0.891714,0.775968 0.948406,0.747622 0.0578728,-0.0578728 0.23031,-1.23659 0.402748,-2.64443 0.172437,-1.3795 0.545658,-3.19127 0.862187,-3.99559l0.546839 -1.43737 -1.63934 -1.86847c-0.890533,-1.03462 -2.24169,-2.70231 -2.95978,-3.76528 -1.20824,-1.7539 -1.38068,-1.89799 -2.44365,-1.98421 -0.891714,-0.0566917 -1.26493,0.0578728 -1.72437,0.575185l0 0 -0.00118108 0z"/>
   <path id="_262678856" class="fil0" d="M49.4659 55.6028l-1.46572 0.575185 -0.144092 1.89681c-0.114565,1.17872 -0.487785,2.70231 -0.976751,3.88102 -1.0925,2.61609 -0.977932,2.70231 2.96096,2.27121 3.07553,-0.316529 8.88171,-1.92634 10.0309,-2.78852 0.488966,-0.344875 0.374402,-0.402748 -0.890533,-0.575185 -3.01884,-0.373221 -3.96606,-0.775968 -5.48965,-2.29956 -0.833841,-0.804314 -1.72555,-1.92634 -2.01256,-2.50034l-0.546839 -1.03462 -1.46572 0.574004 0 0 0 0z"/>
   <path id="_262678664" class="fil0" d="M53.0883 55.2012c0,0.488966 1.92634,1.98421 3.01765,2.35743 0.777149,0.258656 2.55821,0.316529 6.29515,0.172437 2.8464,-0.0862187 5.80736,-0.172437 6.58333,-0.172437 0.746441,0 1.34997,-0.144092 1.34997,-0.287002 0,-0.172437 -2.38578,-0.288183 -6.52427,-0.288183 -6.98489,0 -8.22148,-0.172437 -9.77342,-1.35115 -0.517312,-0.401566 -0.948406,-0.603531 -0.948406,-0.431093l0 0.00118108 0 -0.00118108z"/>
   <path id="_262679072" class="fil0" d="M44.6365 57.2705c-3.79362,1.35115 -4.28259,1.84012 -6.35184,6.38136 -1.78225,3.90937 -1.78225,3.93889 -1.12084,4.08181 1.83894,0.46062 6.20893,-1.86847 7.90495,-4.22472 1.03462,-1.40903 2.06925,-4.62864 1.92516,-6.03649l-0.0862187 -1.00628 -2.27003 0.804314 -0.00118108 0z"/>
   <path id="_262678448" class="fil0" d="M71.4269 59.7425l-0.0862187 0.833841 -4.74321 0.172437c-4.48337,0.172437 -4.7999,0.23031 -5.83452,0.92006 -2.18499,1.49524 -8.56636,3.36371 -11.4116,3.36371 -2.64443,0 -2.93144,0.200783 -3.70858,2.61491 -0.603531,1.92634 -1.0051,2.50152 -3.99559,5.95027 -1.81059,2.09878 -3.21844,3.88102 -3.13222,3.96724 0.0862187,0.0862187 2.27003,0.200783 4.85777,0.200783 5.66209,0.0578728 6.43806,-0.114565 12.7627,-2.96096 4.71368,-2.09759 6.20893,-2.472 3.65071,-0.890533 -0.833841,0.517312 -1.78225,1.35115 -2.09878,1.89681 -0.575185,0.949587 -2.29956,7.07111 -2.29956,8.22148 0,0.287002 -0.144092,0.862187 -0.344875,1.26493 -0.374402,0.862187 -0.46062,0.862187 -7.24355,-0.288183l-3.76646 -0.631877 -2.52869 2.3279c-2.73065,2.50152 -4.31212,4.85777 -3.47827,5.1743 0.718095,0.258656 3.73693,0.201964 4.54124,-0.114565 1.03462,-0.374402 1.00628,-1.49524 -0.0283459,-2.27121l-0.805495 -0.575185 0.891714 -0.315348c0.517312,-0.172437 0.976751,-0.575185 1.06297,-0.891714 0.258656,-0.948406 1.03462,-0.631877 1.55312,0.633058l0.459439 1.17872 0.92006 -1.06415 0.890533 -1.0925 2.73065 0.316529c1.49524,0.172437 4.25424,0.402748 6.15105,0.517312l3.44993 0.172437 -0.0862187 -1.29328c-0.144092,-1.7539 0.373221,-4.05346 1.14919,-5.08808 0.833841,-1.14919 2.01256,-1.43737 5.9798,-1.43737 4.54124,-0.0283459 6.92702,-0.373221 8.73761,-1.29328 3.1334,-1.58028 6.03649,-4.88612 6.9282,-7.81874 0.545658,-1.81059 0.545658,-5.05856 0,-6.09318 -0.661404,-1.29328 -4.11133,-4.28377 -6.06602,-5.23218 -1.0051,-0.487785 -2.44247,-0.948406 -3.36253,-1.03462 -1.58146,-0.172437 -1.58146,-0.172437 -1.69603,0.661404l0 0 0 -0.00118108z"/>
   <path id="_262679264" class="fil0" d="M35.554 61.0641c-1.81059,0.633058 -4.80108,1.38068 -6.61167,1.69603 -1.81059,0.316529 -4.19637,0.775968 -5.31721,1.06415l-1.98421 0.488966 -0.373221 1.72437c-0.546839,2.67278 -0.488966,4.54124 0.200783,5.40343 0.546839,0.661404 3.70858,2.12712 5.83571,2.64443 0.718095,0.201964 0.775968,0.144092 0.775968,-0.689749 0,-1.17872 0.862187,-1.6665 1.81059,-1.03462 0.374402,0.23031 1.17872,0.459439 1.78225,0.517312l1.12084 0.0578728 3.1334 -6.20893c1.72437,-3.44875 3.10505,-6.35302 3.04718,-6.52546 -0.0578728,-0.14291 -1.60981,0.258656 -3.4204,0.862187l0 0z"/>
   <path id="_262679864" class="fil0" d="M90.3123 63.3353c-0.316529,0.172437 -1.29328,1.0925 -2.15547,2.01256l-1.60981 1.69603 -1.49524 -0.200783 -1.49406 -0.173618 0 1.03581c0,0.976751 0.0850376,1.06297 1.17753,1.34997 1.7539,0.488966 2.90309,-0.0283459 4.36999,-1.86847 0.661404,-0.862187 1.40784,-1.60863 1.63816,-1.69485 0.258656,-0.115746 1.14919,0.0862187 2.01138,0.373221 1.15037,0.402748 1.72555,0.488966 2.27121,0.258656 2.0409,-0.775968 1.72437,-1.49524 -1.12084,-2.41412 -2.3279,-0.777149 -2.759,-0.805495 -3.59284,-0.374402l0 0z"/>
   <path id="_262679600" class="fil0" d="M44.464 65.3479c-0.545658,0.488966 -2.03972,1.3795 -3.27631,2.01256 -1.78225,0.862187 -2.64443,1.12084 -3.7948,1.12084l-1.49406 0 -1.03462 2.01138c-0.689749,1.29328 -1.00628,2.21334 -0.891714,2.58774 0.258656,0.804314 3.59402,4.1385 3.88102,3.85149 0.114565,-0.144092 1.63816,-1.89681 3.36253,-3.90937 2.81687,-3.27749 3.19127,-3.85149 3.7948,-5.77783 0.373221,-1.17872 0.631877,-2.27121 0.575185,-2.44365 -0.0578728,-0.172437 -0.575185,0.0862187 -1.12084,0.546839l-0.00118108 0 0 0z"/>
   <path id="_262679552" class="fil0" d="M102.04 65.9797c-2.38578,1.60981 -3.16175,1.98421 -4.5129,2.21334 -0.805495,0.144092 -2.18499,0.46062 -3.04718,0.719276 -1.63816,0.459439 -2.73065,0.373221 -4.13968,-0.344875 -0.574004,-0.288183 -0.890533,-0.344875 -1.12084,-0.115746 -0.431093,0.431093 1.92634,1.46572 3.39206,1.46572 0.631877,0 2.09878,-0.258656 3.24796,-0.574004 1.12084,-0.316529 2.64443,-0.575185 3.36371,-0.575185 1.60981,0 3.27631,-0.805495 4.28259,-2.06925 0.661404,-0.862187 0.689749,-0.977932 0.23031,-1.15037 -0.661404,-0.258656 -0.661404,-0.258656 -1.69603,0.431093l0 0z"/>
   <path id="_262680632" class="fil0" d="M95.7748 66.4108c-1.40903,0.719276 -1.4669,0.719276 -3.16293,0.258656 -1.69603,-0.459439 -1.72437,-0.431093 -2.24169,0.172437 -0.488966,0.575185 -0.517312,0.633058 -0.0283459,0.977932 0.948406,0.689749 2.78734,0.747622 4.82825,0.114565 1.0925,-0.344875 2.27121,-0.603531 2.67396,-0.603531 0.747622,0 2.38578,-1.00628 2.38578,-1.46572 0,-0.545658 -3.01884,-0.172437 -4.45621,0.546839l0.00118108 0 0 -0.00118108z"/>
   <path id="_262680392" class="fil0" d="M107.186 66.5266c-0.288183,0.316529 -1.12202,0.633058 -1.81177,0.719276 -0.746441,0.114565 -1.78225,0.545658 -2.50034,1.06297 -1.03462,0.719276 -1.63816,0.92006 -3.44993,1.06415 -2.15547,0.200783 -4.02393,0.689749 -3.7074,1.00628 0.344875,0.344875 3.07553,0.114565 5.20265,-0.432275 1.26493,-0.344875 2.87474,-0.603531 3.59284,-0.603531 0.775968,0 1.63816,-0.200783 2.0409,-0.487785 1.15037,-0.747622 2.29956,-1.89799 2.29956,-2.27121 0,-0.603531 -1.06297,-0.631877 -1.66768,-0.0578728l0.00118108 0z"/>
   <path id="_262680080" class="fil0" d="M111.641 66.8998c-0.431093,0.402748 -1.15037,0.719276 -1.55194,0.719276 -0.402748,0 -1.23659,0.401566 -1.86847,0.890533 -1.3795,1.12084 -2.8464,1.66768 -4.45503,1.69603 -1.55312,0 -4.13968,0.603531 -3.93889,0.92006 0.23031,0.373221 1.49524,0.287002 2.21334,-0.172437 0.402748,-0.23031 1.95468,-0.46062 4.08181,-0.575185 4.02393,-0.201964 5.28887,-0.689749 6.69789,-2.52987 0.833841,-1.0925 0.890533,-1.23541 0.431093,-1.43737 -0.747622,-0.287002 -0.719276,-0.287002 -1.60981,0.488966l0 0 0 0z"/>
   <path id="_262680200" class="fil0" d="M15.5194 73.3674c-2.70231,1.03462 -5.11761,2.06925 -5.37627,2.27121 -0.545658,0.459439 -0.603531,1.75272 -0.0862187,2.38578 0.172437,0.229129 1.69603,1.17872 3.36371,2.09759 1.6665,0.92006 4.02393,2.29956 5.23099,3.10505 1.43737,0.890533 2.67396,1.46572 3.44993,1.55194 0.689749,0.0862187 1.58028,0.344875 2.0409,0.575185 0.631877,0.316529 1.12084,0.316529 2.64443,0.0578728 1.12084,-0.201964 1.86847,-0.46062 1.86847,-0.689749 0,-0.546839 -1.60981,-2.64561 -2.472,-3.19127 -0.948406,-0.631877 -2.38578,-0.631877 -2.8464,0 -0.517312,0.689749 -1.81059,0.316529 -2.0409,-0.575185 -0.229129,-0.92006 -1.3795,-1.20706 -2.12594,-0.545658 -0.518493,0.459439 -0.604712,0.459439 -1.63934,-0.172437 -2.01138,-1.20706 -3.90937,-2.93262 -3.47827,-3.16175 0.201964,-0.115746 3.10505,-0.288183 6.41089,-0.402748 4.39715,-0.144092 6.29515,-0.316529 6.98489,-0.633058 1.12084,-0.545658 1.17872,-0.83266 0.144092,-1.09132 -1.89799,-0.46062 -6.03649,-2.27121 -6.5538,-2.8464l-0.575185 -0.631877 -4.94399 1.89681 0 0 0 0z"/>
   <path id="_262680896" class="fil0" d="M187.354 72.5052c-2.55821,0.546839 -4.59912,2.27121 -5.66327,4.77274 -0.689749,1.60863 -0.631877,5.0869 0.0862187,6.75458 0.719276,1.58028 2.55821,3.27631 4.02511,3.67906 1.40784,0.402748 4.7999,0.402748 6.20893,0l1.06297 -0.287002 0 -1.58146 0 -1.58028 -0.775968 0.401566c-1.95468,0.977932 -4.74321,0.775968 -6.06483,-0.459439 -1.06415,-0.976751 -1.49524,-2.06925 -1.49524,-3.7948 0,-2.78734 1.0925,-4.36881 3.50662,-5.0869 1.0925,-0.316529 2.93262,-0.115746 4.34046,0.487785 0.431093,0.172437 0.488966,0.0295269 0.488966,-1.3795 0,-1.40784 -0.0862187,-1.58028 -0.631877,-1.72437 -1.43737,-0.344875 -3.88102,-0.431093 -5.08808,-0.200783l0 -0.00118108z"/>
   <path id="_262681184" class="fil0" d="M93.4174 72.8501c0.0578728,0.200783 1.20706,2.61609 2.50034,5.34674 2.27121,4.68534 2.35743,5.00186 1.98421,5.69161 -0.661404,1.26493 -1.55312,1.69603 -2.73183,1.32163l-0.976751 -0.287002 0 1.58146 0 1.58028 2.01256 -0.114565c3.10387,-0.172437 3.44875,-0.633058 7.41599,-9.25611 1.46572,-3.16175 2.64443,-5.83571 2.64443,-5.97862 0,-0.114565 -0.747622,-0.23031 -1.66768,-0.23031l-1.63816 0 -1.46572 3.70858 -1.43737 3.73693 -1.52359 -3.73693 -1.52359 -3.70858 -1.86847 0c-1.3795,0 -1.83894,0.0862187 -1.72437,0.344875l0 0 0 0z"/>
   <polygon id="_262680752" class="fil0" points="108.278,80.1231 108.278,87.7411 110.002,87.7411 111.728,87.7411 111.728,84.7211 111.728,81.7034 115.033,81.7034 118.338,81.7034 118.338,84.7211 118.338,87.7411 119.92,87.7411 121.501,87.7411 121.501,80.1231 121.501,72.5052 119.92,72.5052 118.366,72.5052 118.281,75.5807 118.195,78.6858 114.976,78.7708 111.728,78.8582 111.728,75.6669 111.728,72.5052 110.002,72.5052 108.278,72.5052 "/>
   <polygon id="_262681952" class="fil0" points="125.237,80.1231 125.237,87.7411 126.962,87.7411 128.715,87.7411 132.223,82.3648 135.729,77.0181 135.816,82.3648 135.872,87.7411 137.454,87.7411 139.034,87.7411 139.034,80.1231 139.034,72.5052 137.224,72.5052 135.385,72.5052 131.963,77.7941 128.543,83.1125 128.456,77.7941 128.4,72.5052 126.818,72.5052 125.237,72.5052 "/>
   <path id="_262682024" class="fil0" d="M142.771 80.1231l0 7.61677 3.88102 0c4.36881,0 5.31721,-0.258656 6.5538,-1.69603 0.631877,-0.775968 0.775968,-1.20706 0.775968,-2.472 0,-1.84012 -0.862187,-3.07553 -2.50034,-3.62118l-1.03462 -0.344875 0.862187 -0.344875c1.32163,-0.575185 2.09759,-1.7539 2.09759,-3.21962 0,-2.58774 -2.0409,-3.53615 -7.61677,-3.53615l-3.01884 0 0 7.61795 0 0zm6.66955 -4.54243c0.517312,0.46062 0.689749,1.69603 0.287002,2.27121 -0.373221,0.575185 -1.43737,0.976751 -2.61609,0.976751l-1.17872 0 0 -1.86847 0 -1.86847 1.49524 0c0.977932,0 1.66768,0.172437 2.01256,0.488966l0 0 0 0zm0.545658 6.29515c0.546839,0.488966 0.747622,1.98421 0.316529,2.58774 -0.402748,0.631877 -1.46572,0.976751 -2.90309,0.976751l-1.46572 0 0 -1.95468c0,-1.0925 0.0862187,-2.06925 0.229129,-2.18499 0.344875,-0.401566 3.24796,0.0578728 3.82315,0.575185l0 0z"/>
   <polygon id="_262681736" class="fil0" points="156.857,80.1231 156.857,87.7411 161.456,87.7411 166.055,87.7411 166.055,86.4466 166.055,85.1522 163.036,85.1522 159.99,85.1522 160.076,83.3428 160.161,81.5605 162.691,81.4743 165.191,81.3881 165.191,80.1231 165.191,78.8299 162.605,78.8299 160.018,78.8299 160.018,77.1043 160.018,75.3799 162.749,75.3799 165.48,75.3799 165.48,73.9426 165.48,72.5052 161.168,72.5052 156.855,72.5052 156.855,80.1231 "/>
   <path id="_262681784" class="fil0" d="M168.641 80.0936l0 7.6463 1.58146 0 1.58028 0 0 -2.58656 0 -2.58774 1.52359 0c3.33418,0 5.66209,-1.49406 6.20893,-3.96606 0.517312,-2.44365 -0.258656,-4.31212 -2.12712,-5.28887 -0.948406,-0.517312 -1.84012,-0.633058 -4.94399,-0.747622l-3.82315 -0.144092 0 7.67464 0 0 0 0zm6.72624 -4.39715c0.603531,0.459439 0.747622,0.83266 0.747622,1.83894 0,1.78225 -0.747622,2.44365 -2.78852,2.44365l-1.52359 0 0 -2.44365 0 -2.44365 1.40903 0c0.976751,0 1.60981,0.173618 2.15547,0.604712l0 0z"/>
   <path id="_262682816" class="fil0" d="M195.949 80.1231l0 7.61677 1.69603 0 1.69603 0 3.53615 -5.40343 3.56331 -5.37627 0.0862187 5.37627 0.0578728 5.40343 1.43737 0 1.43737 0 0 -7.61677 0 -7.61795 -1.69603 0 -1.69603 0 -3.47827 5.31839c-1.89681,2.93144 -3.50662,5.31721 -3.56449,5.31721 -0.0283459,0 0,-2.38578 0.0578728,-5.31721l0.0862187 -5.31839 -1.60981 0 -1.60981 0 0 7.61795 0 0z"/>
   <polygon id="_262682840" class="fil0" points="211.816,73.8563 211.902,75.2358 214.145,75.3221 216.358,75.4083 216.358,81.5605 216.358,87.7399 217.938,87.7399 219.52,87.7399 219.52,81.5605 219.52,75.4083 221.762,75.3221 223.975,75.2358 224.061,73.8563 224.147,72.5052 217.938,72.5052 211.731,72.5052 "/>
   <polygon id="_262682504" class="fil0" points="226.188,80.1231 226.188,87.7411 230.759,87.7411 235.33,87.7411 235.33,86.4466 235.33,85.1522 232.455,85.1522 229.58,85.1522 229.58,83.2837 229.58,81.4164 232.167,81.4164 234.755,81.4164 234.755,80.1231 234.755,78.8287 232.167,78.8287 229.58,78.8287 229.58,77.1043 229.58,75.3799 232.312,75.3799 235.042,75.3799 235.042,73.9426 235.042,72.5052 230.615,72.5052 226.188,72.5052 "/>
   <polygon id="_262683464" class="fil0" points="236.537,73.8563 236.623,75.2358 238.865,75.3221 241.078,75.4083 241.078,81.5605 241.078,87.7399 242.66,87.7399 244.24,87.7399 244.24,81.5605 244.24,75.4083 246.483,75.3221 248.696,75.2358 248.782,73.8563 248.868,72.5052 242.66,72.5052 236.451,72.5052 "/>
   <path id="_262683560" class="fil0" d="M249.702 73.7985c0,1.0925 0.0862187,1.29328 0.574004,1.29328 0.546839,0 0.575185,0.201964 0.575185,5.1743 0,4.97352 -0.0283459,5.1743 -0.575185,5.1743 -0.487785,0 -0.574004,0.200783 -0.574004,1.15037l0 1.14919 2.87356 0 2.87474 0 0 -1.14919c0,-0.949587 -0.0862187,-1.15037 -0.575185,-1.15037 -0.545658,0 -0.574004,-0.200783 -0.574004,-5.1743 0,-4.97234 0.0283459,-5.1743 0.574004,-5.1743 0.488966,0 0.575185,-0.200783 0.575185,-1.29328l0 -1.29328 -2.87474 0 -2.87356 0 0 1.29328z"/>
   <path id="_262683632" class="fil0" d="M28.7982 73.052c-0.258656,0.459439 1.00628,3.47827 1.63934,3.79362 0.315348,0.172437 1.49406,0.633058 2.61491,1.00628 2.12712,0.719276 2.09878,0.719276 2.81687,-0.545658 0.23031,-0.402748 0.0295269,-0.805495 -1.09132,-2.07043 -1.26493,-1.43737 -1.4669,-1.55194 -2.67396,-1.58028 -0.718095,0 -1.6665,-0.201964 -2.12712,-0.431093 -0.948406,-0.517312 -0.948406,-0.517312 -1.17872,-0.172437l0.00118108 0 -0.00118108 0z"/>
   <path id="_262683680" class="fil0" d="M51.9379 79.4039c-0.172437,0.316529 -1.12084,1.17872 -2.06925,1.89799 -2.58656,1.89681 -3.1334,2.78852 -1.86847,3.07553 0.344875,0.0862187 1.3795,0.258656 2.29956,0.344875 1.35115,0.172437 1.63816,0.144092 1.63816,-0.23031 0,-0.229129 -0.344875,-0.689749 -0.775968,-1.0051l-0.804314 -0.604712 0.775968 -0.287002c0.431093,-0.144092 0.92006,-0.545658 1.0925,-0.862187 0.401566,-0.775968 1.09132,-0.459439 1.3795,0.661404 0.144092,0.487785 0.344875,0.890533 0.517312,0.890533 0.373221,0 0.92006,-1.26493 1.14919,-2.64443 0.201964,-1.29328 0.172437,-1.29328 -1.95468,-1.6665 -0.890533,-0.173618 -1.09132,-0.115746 -1.3795,0.431093l0 0 0 -0.00118108z"/>
   <path id="_262684088" class="fil0" d="M66.0234 81.5605c0,0.373221 -0.201964,0.401566 -1.06415,0.229129 -1.81059,-0.373221 -2.70113,-0.229129 -3.27631,0.517312 -0.288183,0.374402 -0.431093,0.775968 -0.316529,0.862187 0.114565,0.115746 2.3279,0.805495 4.94399,1.55312 2.61609,0.746441 4.8873,1.43737 5.08808,1.49406 0.661404,0.258656 0.689749,-1.0925 0.0578728,-3.07553l-0.661404 -2.01138 -2.38578 0c-1.95468,0 -2.38578,0.0850376 -2.38578,0.431093l0 0z"/>
   <path id="_262683752" class="fil0" d="M27.812 29.9096c0,3.7074 0.0283459,4.02393 0.517312,4.02393 0.459439,0 0.603531,-0.546839 1.12084,-3.82315 0.631877,-4.08181 0.603531,-4.2259 -0.833841,-4.2259l-0.805495 0 0 4.02511 0.00118108 -0.00118108 0 0.00118108z"/>
   <path id="_262683872" class="fil0" d="M22.1936 31.706c1.88264,3.19482 2.06807,3.45229 2.48853,3.20426 0.396842,-0.233853 0.243302,-0.777149 -0.974389,-3.86331 -1.52713,-3.83732 -1.62516,-3.94598 -2.86293,-3.21608l-0.694474 0.408653 2.04326 3.46646 0 0z"/>
   <path id="_262684664" class="fil0" d="M25.0448 30.5238c0.858644,3.60701 0.960216,3.90819 1.43619,3.7948 0.447629,-0.106297 0.46062,-0.670852 0.204326,-3.97787 -0.330702,-4.11724 -0.392118,-4.2507 -1.78933,-3.91764l-0.783055 0.18661 0.93187 3.91409 0 0 0 0z"/>
   <path id="_262684880" class="fil0" d="M55.0252 13.4147c0.191335,9.58681 0.236216,10.4006 0.724001,10.3344 0.459439,-0.0614161 0.574004,-1.4917 0.922422,-10.0333 0.640144,-10.6356 0.87636,-11.101 -1.04998,-10.8128l-0.804314 0.107478 0.20787 10.4041 0 0z"/>
   <path id="_262684712" class="fil0 str0" d="M25.1121 32.6993c0.858644,1.80351 0.960216,1.9535 1.43619,1.89681 0.447629,-0.0531485 0.46062,-0.335426 0.204326,-1.98894 -0.330702,-2.05862 -0.392118,-2.12594 -1.78933,-1.95941l-0.783055 0.0933052 0.93187 1.95705 0 0 0 0.00118108z"/>
   <path id="_262685264" class="fil0" d="M60.796 24.8015c0.487785,0.431093 1.32163,0.775968 2.06925,0.890533 1.58028,0.258656 10.6935,0.0862187 10.951,-0.200783 0.115746,-0.115746 0.115746,-0.344875 -0.0283459,-0.546839 -0.144092,-0.258656 -1.63816,-0.315348 -6.29515,-0.172437 -5.23099,0.172437 -6.15105,0.114565 -6.78293,-0.258656 -0.604712,-0.402748 -0.604712,-0.373221 0.0850376,0.288183l0.00118108 0 0 0z"/>
   <path id="_262685672" class="fil0" d="M53.2843 54.0922c0,0.488966 1.92634,1.98303 3.01884,2.35743 0.775968,0.258656 2.55821,0.316529 6.29515,0.172437 2.84522,-0.0862187 5.80618,-0.172437 6.58215,-0.172437 0.747622,0 1.35115,-0.144092 1.35115,-0.288183 0,-0.172437 -2.38578,-0.287002 -6.52546,-0.287002 -6.98489,0 -8.2203,-0.172437 -9.77342,-1.35115 -0.517312,-0.401566 -0.948406,-0.603531 -0.948406,-0.431093l0 0 0 0z"/>
   <path id="_262685792" class="fil0 str0" d="M41.959 49.2096c1.15628,2.4968 -0.578728,2.77199 -2.25113,2.31255 -1.00274,1.49997 -0.74526,1.62634 -0.42755,1.70075 0.199602,0.0295269 1.58973,-0.046062 3.08379,-0.177162 2.72475,-0.233853 2.72475,-0.233853 2.81333,-0.772425 0.171256,-0.97557 -0.411015,-2.54995 -1.09013,-3.02356 -0.796046,-0.539753 -1.298,-0.543296 -2.1283,-0.0401566l0 0z"/>
   <path id="_262685408" class="fil0" d="M56.5807 37.2087c-1.26139,2.7401 -1.43619,3.20072 -1.30391,3.47237 0.090943,0.192516 0.222043,-0.0295269 1.62871,-2.65624l1.52123 -2.84049 -0.0968484 -0.40511c-0.226767,-0.93187 -0.162989,-1.02872 -1.74918,2.42948l0 0 0 0z"/>
   <path id="_262685456" class="fil0" d="M49.6301 44.1428c-0.321253,-0.00590539 -1.64524,0.170075 -2.92553,0.414558 -2.39523,0.401566 -2.7779,0.706285 -2.37633,1.78343 0.152359,0.411015 0.546839,0.488966 2.90309,0.577547 2.70113,0.127556 2.70113,0.127556 2.95388,-0.70156 0.359048,-1.21887 0.144092,-2.05271 -0.555107,-2.07397z"/>
   <path id="_262686800" class="fil0" d="M48.4029 48.0899c-0.201964,-0.0708647 -1.07832,-0.233853 -1.93933,-0.344875 -1.60036,-0.242121 -1.90626,-0.128737 -1.87555,0.636601 0.0118108,0.292907 0.245664,0.424007 1.71965,0.968484 1.68422,0.641325 1.68422,0.641325 2.0161,0.168894 0.480699,-0.696836 0.517312,-1.27084 0.0791322,-1.4291z"/>
  </g>
 </g>
 <g id="Слой_x0020_1_0">
  <metadata id="CorelCorpID_1Corel-Layer"/>
 </g>
</svg>
