<svg width="8" height="7" viewBox="0 0 8 7" fill="none" xmlns="http://www.w3.org/2000/svg">
<path d="M1.55273 1.63174L3.24447 3.60542L1.55273 5.5791" stroke="#3A57E8" stroke-width="1.5" stroke-linecap="round" stroke-linejoin="round"/>
<path d="M4.59766 1.63174L6.28939 3.60542L4.59766 5.5791" stroke="#3A57E8" stroke-width="1.5" stroke-linecap="round" stroke-linejoin="round"/>
</svg>
