<svg width="20" height="20" viewBox="0 0 20 20" fill="none" xmlns="http://www.w3.org/2000/svg">
<path d="M16.1935 10.8166C16.2268 10.55 16.2518 10.2833 16.2518 9.99996C16.2518 9.71663 16.2268 9.44996 16.1935 9.18329L17.9518 7.80829C18.1102 7.68329 18.1518 7.45829 18.0518 7.27496L16.3852 4.39163C16.3102 4.25829 16.1685 4.18329 16.0185 4.18329C15.9685 4.18329 15.9185 4.19163 15.8768 4.20829L13.8018 5.04163C13.3685 4.70829 12.9018 4.43329 12.3935 4.22496L12.0768 2.01663C12.0518 1.81663 11.8768 1.66663 11.6685 1.66663H8.33515C8.12682 1.66663 7.95182 1.81663 7.92682 2.01663L7.61015 4.22496C7.10182 4.43329 6.63515 4.71663 6.20182 5.04163L4.12682 4.20829C4.07682 4.19163 4.02682 4.18329 3.97682 4.18329C3.83515 4.18329 3.69349 4.25829 3.61849 4.39163L1.95182 7.27496C1.84349 7.45829 1.89349 7.68329 2.05182 7.80829L3.81015 9.18329C3.77682 9.44996 3.75182 9.72496 3.75182 9.99996C3.75182 10.275 3.77682 10.55 3.81015 10.8166L2.05182 12.1916C1.89349 12.3166 1.85182 12.5416 1.95182 12.725L3.61849 15.6083C3.69349 15.7416 3.83515 15.8166 3.98515 15.8166C4.03515 15.8166 4.08515 15.8083 4.12682 15.7916L6.20182 14.9583C6.63515 15.2916 7.10182 15.5666 7.61015 15.775L7.92682 17.9833C7.95182 18.1833 8.12682 18.3333 8.33515 18.3333H11.6685C11.8768 18.3333 12.0518 18.1833 12.0768 17.9833L12.3935 15.775C12.9018 15.5666 13.3685 15.2833 13.8018 14.9583L15.8768 15.7916C15.9268 15.8083 15.9768 15.8166 16.0268 15.8166C16.1685 15.8166 16.3102 15.7416 16.3852 15.6083L18.0518 12.725C18.1518 12.5416 18.1102 12.3166 17.9518 12.1916L16.1935 10.8166ZM14.5435 9.39163C14.5768 9.64996 14.5852 9.82496 14.5852 9.99996C14.5852 10.175 14.5685 10.3583 14.5435 10.6083L14.4268 11.55L15.1685 12.1333L16.0685 12.8333L15.4852 13.8416L14.4268 13.4166L13.5602 13.0666L12.8102 13.6333C12.4518 13.9 12.1102 14.1 11.7685 14.2416L10.8852 14.6L10.7518 15.5416L10.5852 16.6666H9.41849L9.12682 14.6L8.24349 14.2416C7.88515 14.0916 7.55182 13.9 7.21849 13.65L6.46015 13.0666L5.57682 13.425L4.51849 13.85L3.93515 12.8416L4.83515 12.1416L5.57682 11.5583L5.46015 10.6166C5.43515 10.3583 5.41849 10.1666 5.41849 9.99996C5.41849 9.83329 5.43515 9.64163 5.46015 9.39163L5.57682 8.44996L4.83515 7.86663L3.93515 7.16663L4.51849 6.15829L5.57682 6.58329L6.44349 6.93329L7.19349 6.36663C7.55182 6.09996 7.89349 5.89996 8.23515 5.75829L9.11849 5.39996L9.25182 4.45829L9.41849 3.33329H10.5768L10.8685 5.39996L11.7518 5.75829C12.1102 5.90829 12.4435 6.09996 12.7768 6.34996L13.5352 6.93329L14.4185 6.57496L15.4768 6.14996L16.0602 7.15829L15.1685 7.86663L14.4268 8.44996L14.5435 9.39163ZM10.0018 6.66663C8.16015 6.66663 6.66849 8.15829 6.66849 9.99996C6.66849 11.8416 8.16015 13.3333 10.0018 13.3333C11.8435 13.3333 13.3352 11.8416 13.3352 9.99996C13.3352 8.15829 11.8435 6.66663 10.0018 6.66663ZM10.0018 11.6666C9.08515 11.6666 8.33515 10.9166 8.33515 9.99996C8.33515 9.08329 9.08515 8.33329 10.0018 8.33329C10.9185 8.33329 11.6685 9.08329 11.6685 9.99996C11.6685 10.9166 10.9185 11.6666 10.0018 11.6666Z" fill="#71839B"/>
</svg>
