Cours - Cha3mlt - Niveau Algo 
Partie 1 : 
    0/ Intro & Basics : Region,AZ,etc ... 
    1/ IAM  - Lacune .. Résolution en cours INCHALAH 
    2/ EC2  - 
        Thérique: Kol sauf: AMI/Hibernate/Placement Group/Instance Type Deep Dive / MetaData 
        Pratique:Commandét Cli - 5 Modules Ansible
    3/ ASG  - Overview - GUI - Anwe3 Les Policy (Sans Démo & Captures)
    4/ ELB  - Kol sauf Connection Draining + Terraform - Niveau 2  
    5/ RDS  - Overview - GUI - Maarek kol - ChatGPT kol - 
    6/ ElasticCache - Maarek kol 
    7/ Route53  - Kol Sauf Routing Policy 3mélt kén simple .. 

    -> Pret pour Pratique inchalah .. 
    
Partie 2 : 
    8/ S3       - 9bal fl Data Eng en details - 3 Modules Ansible 
    9/ CloudFront - Maarek kol
    10/ SQS - Overview
    11/ SNS - Maarek kol
    12/ Kinesis - Fl Data Engineering en details ...
    13/ Lambda        Overview-GUI- Kmélét maarek kol - 3 Modules Ansible
    14/ DynamoDB      Overview-GUI- Maarek kol 
    15/ APIGateway    Overview- 
    16/ Cognito       Overview (Déjà fih kén Overview -> Maarek kol 
    17/ CloudWatch    Overview-GUI 
    18/ EKS           Wsélna ll AutoScaler (Vidéo 1+ 10 min fl vidéo ta3 35min) + Terraform
    19/ VPC           Chwaya Terraform fl démoét khw .. na3rf li howa réseau privé mte3i w khw 
    20/ EFS           Overview 

    

