-------------------------------------------------------------------------------
Test set: com.journey.testng.runner.TestRunner
-------------------------------------------------------------------------------
Tests run: 0, Failures: 0, Errors: 0, Skipped: 0, Time elapsed: 0.272 s - in com.journey.testng.runner.TestRunner
