<?xml version="1.0" encoding="UTF-8" standalone="yes"?>
<svg xmlns="http://www.w3.org/2000/svg" viewBox="0 0 50 50" width="50" height="50" fill="#000000">
  <path d="M 25 0 C 21.144531 0 18 3.144531 18 7 C 18 10.855469 21.144531 14 25 14 C 28.855469 14 32 10.855469 32 7 C 32 3.144531 28.855469 0 25 0 Z M 25 2 C 27.773438 2 30 4.226563 30 7 C 30 9.773438 27.773438 12 25 12 C 22.226563 12 20 9.773438 20 7 C 20 4.226563 22.226563 2 25 2 Z M 45.15625 13.03125 C 44.644531 13.03125 44.109375 13.160156 43.625 13.46875 C 42.785156 14.007813 40.59375 15.695313 38.46875 17.3125 C 36.621094 18.71875 35.320313 19.710938 34.90625 20.03125 C 34.257813 19.710938 30.03125 17.644531 27.75 16.46875 C 26.695313 15.925781 25.40625 15.03125 23.625 15.03125 C 22.050781 15.03125 20.542969 16.183594 20.15625 18 C 19.789063 19.734375 20.726563 21.769531 23.125 22.875 C 25.652344 24.042969 28.203125 25.21875 33.15625 27.375 C 34.070313 27.773438 34.777344 28.054688 35.59375 27.84375 C 36.410156 27.632813 36.859375 27.117188 37.625 26.4375 C 39.183594 25.054688 45.023438 19.625 47 17.78125 C 47.601563 17.21875 47.964844 16.515625 48 15.8125 C 48.035156 15.109375 47.765625 14.453125 47.34375 13.96875 C 46.921875 13.484375 46.316406 13.171875 45.65625 13.0625 C 45.492188 13.035156 45.328125 13.03125 45.15625 13.03125 Z M 16.65625 13.0625 C 16.65625 13.0625 13.886719 13.433594 10.9375 13.84375 C 9.464844 14.050781 7.964844 14.25 6.71875 14.4375 C 5.472656 14.625 4.566406 14.777344 4.0625 14.90625 C 2.925781 15.195313 2.128906 16.023438 1.96875 16.90625 C 1.808594 17.789063 2.109375 18.566406 2.5 19.15625 C 3.15625 20.144531 6.585938 24.773438 7.84375 26.125 C 8.398438 26.722656 8.953125 27.179688 9.5625 27.46875 C 10.171875 27.757813 10.929688 27.871094 11.59375 27.5625 C 12.226563 27.269531 12.578125 26.65625 12.6875 26.0625 C 12.796875 25.46875 12.707031 24.84375 12.46875 24.21875 C 12.054688 23.125 11.464844 21.898438 11 20.90625 C 12.480469 20.800781 15.316406 20.585938 16.25 20.5 C 16.765625 20.453125 17.160156 20.019531 17.15625 19.5 C 17.113281 17.027344 17.75 14.28125 17.75 14.28125 C 17.824219 13.964844 17.738281 13.628906 17.519531 13.386719 C 17.300781 13.144531 16.980469 13.023438 16.65625 13.0625 Z M 45.0625 15 C 45.171875 14.976563 45.28125 14.980469 45.375 15 C 45.5625 15.039063 45.722656 15.144531 45.84375 15.28125 C 45.964844 15.417969 46.007813 15.574219 46 15.71875 C 45.992188 15.863281 45.949219 16.070313 45.65625 16.34375 C 43.6875 18.179688 37.753906 23.632813 36.28125 24.9375 C 35.5 25.628906 35.152344 25.890625 35.09375 25.90625 C 35.035156 25.921875 34.792969 25.90625 33.9375 25.53125 C 29.003906 23.382813 26.5 22.230469 23.96875 21.0625 C 22.136719 20.214844 21.910156 19.265625 22.09375 18.40625 C 22.300781 17.4375 23.023438 17.03125 23.625 17.03125 C 24.726563 17.03125 25.613281 17.601563 26.8125 18.21875 C 29.304688 19.503906 34.5625 22.125 34.5625 22.125 L 35.125 22.40625 L 35.625 22 C 35.625 22 37.570313 20.519531 39.6875 18.90625 C 41.804688 17.292969 44.167969 15.507813 44.71875 15.15625 C 44.835938 15.082031 44.953125 15.023438 45.0625 15 Z M 15.53125 15.21875 C 15.367188 16.09375 15.277344 17.207031 15.21875 18.5625 C 13.433594 18.703125 9.4375 19 9.4375 19 C 9.101563 19.019531 8.800781 19.203125 8.628906 19.492188 C 8.460938 19.78125 8.445313 20.136719 8.59375 20.4375 C 8.59375 20.4375 10.101563 23.609375 10.59375 24.90625 C 10.722656 25.242188 10.746094 25.539063 10.71875 25.6875 C 10.710938 25.738281 10.691406 25.738281 10.6875 25.75 C 10.640625 25.742188 10.574219 25.71875 10.4375 25.65625 C 10.167969 25.527344 9.75 25.21875 9.3125 24.75 C 8.4375 23.808594 4.554688 18.632813 4.15625 18.03125 C 3.992188 17.785156 3.910156 17.441406 3.9375 17.28125 C 3.964844 17.121094 3.917969 17 4.53125 16.84375 C 4.75 16.789063 5.769531 16.59375 7 16.40625 C 8.230469 16.21875 9.75 16.015625 11.21875 15.8125 C 13.4375 15.503906 14.625 15.339844 15.53125 15.21875 Z M 16.125 24.125 C 15.777344 24.171875 15.484375 24.398438 15.34375 24.71875 C 15.34375 24.71875 7.179688 42.621094 6.21875 44.75 C 5.808594 45.65625 5.539063 46.511719 5.65625 47.40625 C 5.773438 48.300781 6.375 49.136719 7.25 49.59375 C 8.210938 50.09375 9.3125 49.941406 10.0625 49.5 C 10.8125 49.058594 11.371094 48.40625 11.84375 47.84375 C 12.417969 47.164063 13.921875 45.082031 15.40625 43.03125 C 16.78125 41.132813 17.851563 39.59375 18.03125 39.34375 C 18.417969 39.238281 25.417969 37.320313 29.5 36.28125 C 31.296875 35.824219 32.582031 34.71875 32.96875 33.34375 C 33.164063 32.65625 33.109375 31.898438 32.75 31.25 C 32.390625 30.601563 31.757813 30.109375 30.96875 29.8125 C 29.550781 29.277344 29.710938 29.367188 16.625 24.21875 C 16.496094 24.160156 16.359375 24.128906 16.21875 24.125 C 16.1875 24.125 16.15625 24.125 16.125 24.125 Z M 16.78125 26.40625 C 27.609375 30.664063 28.933594 31.191406 30.25 31.6875 C 30.691406 31.855469 30.902344 32.042969 31 32.21875 C 31.097656 32.394531 31.132813 32.570313 31.0625 32.8125 C 30.925781 33.300781 30.296875 34.019531 29.03125 34.34375 C 24.792969 35.421875 17.1875 37.5 17.1875 37.5 C 16.957031 37.5625 16.757813 37.707031 16.625 37.90625 C 16.625 37.90625 15.261719 39.800781 13.78125 41.84375 C 12.300781 43.886719 10.664063 46.148438 10.3125 46.5625 C 9.882813 47.074219 9.394531 47.535156 9.03125 47.75 C 8.667969 47.964844 8.550781 48.003906 8.1875 47.8125 C 7.738281 47.578125 7.664063 47.453125 7.625 47.15625 C 7.585938 46.859375 7.703125 46.292969 8.03125 45.5625 C 8.933594 43.566406 16.148438 27.792969 16.78125 26.40625 Z"/>
</svg>