[gd_resource type="SpatialMaterial" load_steps=5 format=2]

[ext_resource path="res://textures/Floor_tiles/alt_flloor_1/altfloor1_albedo.png" type="Texture" id=1]
[ext_resource path="res://textures/Floor_tiles/alt_flloor_1/altfloor1_orm.png" type="Texture" id=2]
[ext_resource path="res://textures/Floor_tiles/alt_flloor_1/altfloor1_normal.png" type="Texture" id=3]
[ext_resource path="res://textures/Floor_tiles/alt_flloor_1/altfloor1_depth.png" type="Texture" id=4]

[resource]
albedo_color = Color( 0.824219, 0.66839, 0.66839, 1 )
albedo_texture = ExtResource( 1 )
metallic_specular = 0.25
roughness_texture = ExtResource( 2 )
roughness_texture_channel = 1
normal_enabled = true
normal_scale = 1.0
normal_texture = ExtResource( 3 )
depth_enabled = true
depth_scale = 0.05
depth_deep_parallax = false
depth_flip_tangent = false
depth_flip_binormal = false
depth_texture = ExtResource( 4 )
