Library\Bee\artifacts\movedfrom\UnityEditor.TestRunner.ref.dll_12107268224522658521.movedfrom
Library\Bee\artifacts\movedfrom\UnityEditor.UI.ref.dll_104955431402218779.movedfrom
Library\Bee\artifacts\movedfrom\UnityEngine.TestRunner.ref.dll_8368799695770714308.movedfrom
Library\Bee\artifacts\movedfrom\UnityEngine.UI.ref.dll_13680447769613716870.movedfrom
Library\Bee\artifacts\movedfrom\Unity.Plastic.Antlr3.Runtime.dll_1886846938677173882.movedfrom
Library\Bee\artifacts\movedfrom\Unity.Plastic.Newtonsoft.Json.dll_4089280645982761499.movedfrom
Library\Bee\artifacts\movedfrom\Unity.VisualScripting.IonicZip.dll_13602727763352875738.movedfrom
Library\Bee\artifacts\movedfrom\Unity.VisualScripting.YamlDotNet.dll_2292226043636025282.movedfrom
Library\Bee\artifacts\movedfrom\Unity.VisualScripting.Antlr3.Runtime.dll_15077143709438711777.movedfrom
Library\Bee\artifacts\movedfrom\UnityEditor.Graphs.dll_6607713298525473548.movedfrom
Library\Bee\artifacts\movedfrom\UnityEditor.CoreModule.dll_16934160762436655834.movedfrom
Library\Bee\artifacts\movedfrom\UnityEditor.DeviceSimulatorModule.dll_13094687698615492615.movedfrom
Library\Bee\artifacts\movedfrom\UnityEditor.dll_14286279262388934555.movedfrom
Library\Bee\artifacts\movedfrom\UnityEditor.GraphViewModule.dll_12190063111948868556.movedfrom
Library\Bee\artifacts\movedfrom\UnityEditor.PackageManagerUIModule.dll_4123269912229567414.movedfrom
Library\Bee\artifacts\movedfrom\UnityEditor.QuickSearchModule.dll_12629305079382979822.movedfrom
Library\Bee\artifacts\movedfrom\UnityEditor.SceneTemplateModule.dll_8524394576715709743.movedfrom
Library\Bee\artifacts\movedfrom\UnityEditor.UIBuilderModule.dll_18281371945662846208.movedfrom
Library\Bee\artifacts\movedfrom\UnityEditor.UIElementsModule.dll_2114934261371330518.movedfrom
Library\Bee\artifacts\movedfrom\UnityEditor.UIElementsSamplesModule.dll_4086141052712505591.movedfrom
Library\Bee\artifacts\movedfrom\UnityEditor.UIServiceModule.dll_3937989198958421274.movedfrom
Library\Bee\artifacts\movedfrom\UnityEditor.UnityConnectModule.dll_9367660688676042384.movedfrom
Library\Bee\artifacts\movedfrom\UnityEngine.AccessibilityModule.dll_12173835946061341900.movedfrom
Library\Bee\artifacts\movedfrom\UnityEngine.AIModule.dll_17773897880819274222.movedfrom
Library\Bee\artifacts\movedfrom\UnityEngine.AndroidJNIModule.dll_11214713302635957932.movedfrom
Library\Bee\artifacts\movedfrom\UnityEngine.AnimationModule.dll_8624756096859041906.movedfrom
Library\Bee\artifacts\movedfrom\UnityEngine.ARModule.dll_12690113469709185207.movedfrom
Library\Bee\artifacts\movedfrom\UnityEngine.AssetBundleModule.dll_17522803561817139680.movedfrom
Library\Bee\artifacts\movedfrom\UnityEngine.AudioModule.dll_5555645272107771108.movedfrom
Library\Bee\artifacts\movedfrom\UnityEngine.ClothModule.dll_12970924291044197320.movedfrom
Library\Bee\artifacts\movedfrom\UnityEngine.ClusterInputModule.dll_116269890183432534.movedfrom
Library\Bee\artifacts\movedfrom\UnityEngine.ClusterRendererModule.dll_13503603157260987787.movedfrom
Library\Bee\artifacts\movedfrom\UnityEngine.CoreModule.dll_1018672031269029381.movedfrom
Library\Bee\artifacts\movedfrom\UnityEngine.CrashReportingModule.dll_8083072214630960829.movedfrom
Library\Bee\artifacts\movedfrom\UnityEngine.DirectorModule.dll_16655916106826493282.movedfrom
Library\Bee\artifacts\movedfrom\UnityEngine.dll_17935398755577390208.movedfrom
Library\Bee\artifacts\movedfrom\UnityEngine.DSPGraphModule.dll_17039110655648104067.movedfrom
Library\Bee\artifacts\movedfrom\UnityEngine.GameCenterModule.dll_14262887304291401629.movedfrom
Library\Bee\artifacts\movedfrom\UnityEngine.GIModule.dll_10296876922272741896.movedfrom
Library\Bee\artifacts\movedfrom\UnityEngine.GridModule.dll_16975237695443770364.movedfrom
Library\Bee\artifacts\movedfrom\UnityEngine.HotReloadModule.dll_17940660858436586484.movedfrom
Library\Bee\artifacts\movedfrom\UnityEngine.ImageConversionModule.dll_2835136049536509311.movedfrom
Library\Bee\artifacts\movedfrom\UnityEngine.IMGUIModule.dll_9617785924779866309.movedfrom
Library\Bee\artifacts\movedfrom\UnityEngine.InputLegacyModule.dll_9543862215212343249.movedfrom
Library\Bee\artifacts\movedfrom\UnityEngine.InputModule.dll_12938671996963129736.movedfrom
Library\Bee\artifacts\movedfrom\UnityEngine.JSONSerializeModule.dll_651245715235374422.movedfrom
Library\Bee\artifacts\movedfrom\UnityEngine.LocalizationModule.dll_4605455274842586191.movedfrom
Library\Bee\artifacts\movedfrom\UnityEngine.ParticleSystemModule.dll_14068999661972757067.movedfrom
Library\Bee\artifacts\movedfrom\UnityEngine.PerformanceReportingModule.dll_16581068622966775748.movedfrom
Library\Bee\artifacts\movedfrom\UnityEngine.Physics2DModule.dll_14147840431670945799.movedfrom
Library\Bee\artifacts\movedfrom\UnityEngine.PhysicsModule.dll_8906500044986569781.movedfrom
Library\Bee\artifacts\movedfrom\UnityEngine.ProfilerModule.dll_1831817890046882927.movedfrom
Library\Bee\artifacts\movedfrom\UnityEngine.RuntimeInitializeOnLoadManagerInitializerModule.dll_9738109610314426064.movedfrom
Library\Bee\artifacts\movedfrom\UnityEngine.ScreenCaptureModule.dll_2517897072888623544.movedfrom
Library\Bee\artifacts\movedfrom\UnityEngine.SharedInternalsModule.dll_12351592623695536335.movedfrom
Library\Bee\artifacts\movedfrom\UnityEngine.SpriteMaskModule.dll_12618073503756145943.movedfrom
Library\Bee\artifacts\movedfrom\UnityEngine.SpriteShapeModule.dll_904852279414333930.movedfrom
Library\Bee\artifacts\movedfrom\UnityEngine.StreamingModule.dll_3190298175717156784.movedfrom
Library\Bee\artifacts\movedfrom\UnityEngine.SubstanceModule.dll_644379316398171582.movedfrom
Library\Bee\artifacts\movedfrom\UnityEngine.SubsystemsModule.dll_1858242139296578858.movedfrom
Library\Bee\artifacts\movedfrom\UnityEngine.TerrainModule.dll_10799836454305078563.movedfrom
Library\Bee\artifacts\movedfrom\UnityEngine.TerrainPhysicsModule.dll_14103525233746842840.movedfrom
Library\Bee\artifacts\movedfrom\UnityEngine.TextCoreModule.dll_9214513676695379314.movedfrom
Library\Bee\artifacts\movedfrom\UnityEngine.TextRenderingModule.dll_5490116742325547437.movedfrom
Library\Bee\artifacts\movedfrom\UnityEngine.TilemapModule.dll_3809237736865922604.movedfrom
Library\Bee\artifacts\movedfrom\UnityEngine.TLSModule.dll_10214718101289406409.movedfrom
Library\Bee\artifacts\movedfrom\UnityEngine.UIElementsModule.dll_2164031063362074913.movedfrom
Library\Bee\artifacts\movedfrom\UnityEngine.UIElementsNativeModule.dll_9489788897165069272.movedfrom
Library\Bee\artifacts\movedfrom\UnityEngine.UIModule.dll_17446153450610235290.movedfrom
Library\Bee\artifacts\movedfrom\UnityEngine.UmbraModule.dll_14406533661244952663.movedfrom
Library\Bee\artifacts\movedfrom\UnityEngine.UNETModule.dll_11585884674286254974.movedfrom
Library\Bee\artifacts\movedfrom\UnityEngine.UnityAnalyticsModule.dll_16347663609924512839.movedfrom
Library\Bee\artifacts\movedfrom\UnityEngine.UnityConnectModule.dll_8025451724610549563.movedfrom
Library\Bee\artifacts\movedfrom\UnityEngine.UnityCurlModule.dll_12307751925847089759.movedfrom
Library\Bee\artifacts\movedfrom\UnityEngine.UnityTestProtocolModule.dll_17615717335783253581.movedfrom
Library\Bee\artifacts\movedfrom\UnityEngine.UnityWebRequestAssetBundleModule.dll_1418902834603027544.movedfrom
Library\Bee\artifacts\movedfrom\UnityEngine.UnityWebRequestAudioModule.dll_6780202149104724572.movedfrom
Library\Bee\artifacts\movedfrom\UnityEngine.UnityWebRequestModule.dll_4104878096387915774.movedfrom
Library\Bee\artifacts\movedfrom\UnityEngine.UnityWebRequestTextureModule.dll_13187993707209417649.movedfrom
Library\Bee\artifacts\movedfrom\UnityEngine.UnityWebRequestWWWModule.dll_3776062596023903085.movedfrom
Library\Bee\artifacts\movedfrom\UnityEngine.VehiclesModule.dll_6838906195017956605.movedfrom
Library\Bee\artifacts\movedfrom\UnityEngine.VFXModule.dll_1054001111075715382.movedfrom
Library\Bee\artifacts\movedfrom\UnityEngine.VideoModule.dll_8224455120367255689.movedfrom
Library\Bee\artifacts\movedfrom\UnityEngine.VirtualTexturingModule.dll_12123467167444683875.movedfrom
Library\Bee\artifacts\movedfrom\UnityEngine.VRModule.dll_4967284188505873682.movedfrom
Library\Bee\artifacts\movedfrom\UnityEngine.WindModule.dll_9543664143209399406.movedfrom
Library\Bee\artifacts\movedfrom\UnityEngine.XRModule.dll_8623858560226880112.movedfrom
Library\Bee\artifacts\movedfrom\UnityEditor.Android.Extensions.dll_16247048979340733250.movedfrom
Library\Bee\artifacts\movedfrom\UnityEditor.WindowsStandalone.Extensions.dll_15207587581977759334.movedfrom