Library\Bee\artifacts\movedfrom\UnityEngine.AccessibilityModule.dll_9094557127703463135.movedfrom
Library\Bee\artifacts\movedfrom\UnityEngine.AIModule.dll_17855599702079706475.movedfrom
Library\Bee\artifacts\movedfrom\UnityEngine.AndroidJNIModule.dll_14620030449544499369.movedfrom
Library\Bee\artifacts\movedfrom\UnityEngine.AnimationModule.dll_1047303658091910085.movedfrom
Library\Bee\artifacts\movedfrom\UnityEngine.ARModule.dll_12771815290969617460.movedfrom
Library\Bee\artifacts\movedfrom\UnityEngine.AssetBundleModule.dll_12793911381128807827.movedfrom
Library\Bee\artifacts\movedfrom\UnityEngine.AudioModule.dll_16434049511137246071.movedfrom
Library\Bee\artifacts\movedfrom\UnityEngine.ClothModule.dll_5402584456364120667.movedfrom
Library\Bee\artifacts\movedfrom\UnityEngine.CoreModule.dll_12364489435835042594.movedfrom
Library\Bee\artifacts\movedfrom\UnityEngine.CrashReportingModule.dll_9186094630497708026.movedfrom
Library\Bee\artifacts\movedfrom\UnityEngine.DirectorModule.dll_11747255562211660223.movedfrom
Library\Bee\artifacts\movedfrom\UnityEngine.dll_8247094618724463827.movedfrom
Library\Bee\artifacts\movedfrom\UnityEngine.DSPGraphModule.dll_12130450111033271008.movedfrom
Library\Bee\artifacts\movedfrom\UnityEngine.GameCenterModule.dll_17668204451199943066.movedfrom
Library\Bee\artifacts\movedfrom\UnityEngine.GIModule.dll_10378578743533174149.movedfrom
Library\Bee\artifacts\movedfrom\UnityEngine.GridModule.dll_9874311026300231961.movedfrom
Library\Bee\artifacts\movedfrom\UnityEngine.HotReloadModule.dll_10363208419669454663.movedfrom
Library\Bee\artifacts\movedfrom\UnityEngine.ImageConversionModule.dll_13406561541617882610.movedfrom
Library\Bee\artifacts\movedfrom\UnityEngine.IMGUIModule.dll_2049446090099789656.movedfrom
Library\Bee\artifacts\movedfrom\UnityEngine.InputLegacyModule.dll_4814970034524011396.movedfrom
Library\Bee\artifacts\movedfrom\UnityEngine.InputModule.dll_5370332162283053083.movedfrom
Library\Bee\artifacts\movedfrom\UnityEngine.JSONSerializeModule.dll_16018710970587047273.movedfrom
Library\Bee\artifacts\movedfrom\UnityEngine.LocalizationModule.dll_13875780879935639532.movedfrom
Library\Bee\artifacts\movedfrom\UnityEngine.ParticleSystemModule.dll_15172022077839504264.movedfrom
Library\Bee\artifacts\movedfrom\UnityEngine.PerformanceReportingModule.dll_318895886758035937.movedfrom
Library\Bee\artifacts\movedfrom\UnityEngine.Physics2DModule.dll_6570387992903813978.movedfrom
Library\Bee\artifacts\movedfrom\UnityEngine.PhysicsModule.dll_4950995184401861416.movedfrom
Library\Bee\artifacts\movedfrom\UnityEngine.ProfilerModule.dll_15369901419141601484.movedfrom
Library\Bee\artifacts\movedfrom\UnityEngine.RuntimeInitializeOnLoadManagerInitializerModule.dll_2761032665087946787.movedfrom
Library\Bee\artifacts\movedfrom\UnityEngine.ScreenCaptureModule.dll_17885362328240296395.movedfrom
Library\Bee\artifacts\movedfrom\UnityEngine.SharedInternalsModule.dll_4476274042067358018.movedfrom
Library\Bee\artifacts\movedfrom\UnityEngine.SpriteMaskModule.dll_16023390650664687380.movedfrom
Library\Bee\artifacts\movedfrom\UnityEngine.SpriteShapeModule.dll_14622704172435553693.movedfrom
Library\Bee\artifacts\movedfrom\UnityEngine.StreamingModule.dll_14059589810659576579.movedfrom
Library\Bee\artifacts\movedfrom\UnityEngine.SubstanceModule.dll_11513670951340591377.movedfrom
Library\Bee\artifacts\movedfrom\UnityEngine.SubsystemsModule.dll_5263559286205120295.movedfrom
Library\Bee\artifacts\movedfrom\UnityEngine.TerrainModule.dll_6844331593720370198.movedfrom
Library\Bee\artifacts\movedfrom\UnityEngine.TerrainPhysicsModule.dll_15206547649613590037.movedfrom
Library\Bee\artifacts\movedfrom\UnityEngine.TextCoreModule.dll_4305853132080546255.movedfrom
Library\Bee\artifacts\movedfrom\UnityEngine.TextRenderingModule.dll_2410837923967668672.movedfrom
Library\Bee\artifacts\movedfrom\UnityEngine.TilemapModule.dll_18300476949990765855.movedfrom
Library\Bee\artifacts\movedfrom\UnityEngine.TLSModule.dll_10883222280662979068.movedfrom
Library\Bee\artifacts\movedfrom\UnityEngine.UIElementsModule.dll_5569348210270616350.movedfrom
Library\Bee\artifacts\movedfrom\UnityEngine.UIElementsNativeModule.dll_3605370858913619637.movedfrom
Library\Bee\artifacts\movedfrom\UnityEngine.UIModule.dll_17527855271870667543.movedfrom
Library\Bee\artifacts\movedfrom\UnityEngine.UmbraModule.dll_6838193826564876010.movedfrom
Library\Bee\artifacts\movedfrom\UnityEngine.UNETModule.dll_4484958005142716571.movedfrom
Library\Bee\artifacts\movedfrom\UnityEngine.UnityAnalyticsModule.dll_17450686025791260036.movedfrom
Library\Bee\artifacts\movedfrom\UnityEngine.UnityConnectModule.dll_17295777329703602904.movedfrom
Library\Bee\artifacts\movedfrom\UnityEngine.UnityCurlModule.dll_4730299487079957938.movedfrom
Library\Bee\artifacts\movedfrom\UnityEngine.UnityTestProtocolModule.dll_2931984383455916832.movedfrom
Library\Bee\artifacts\movedfrom\UnityEngine.UnityWebRequestAssetBundleModule.dll_9442664802635606869.movedfrom
Library\Bee\artifacts\movedfrom\UnityEngine.UnityWebRequestAudioModule.dll_8964773486605536377.movedfrom
Library\Bee\artifacts\movedfrom\UnityEngine.UnityWebRequestModule.dll_14676303588469289073.movedfrom
Library\Bee\artifacts\movedfrom\UnityEngine.UnityWebRequestTextureModule.dll_18136098260913052526.movedfrom
Library\Bee\artifacts\movedfrom\UnityEngine.UnityWebRequestWWWModule.dll_13934188515871466474.movedfrom
Library\Bee\artifacts\movedfrom\UnityEngine.VehiclesModule.dll_1930245650403123546.movedfrom
Library\Bee\artifacts\movedfrom\UnityEngine.VFXModule.dll_1722505290449288041.movedfrom
Library\Bee\artifacts\movedfrom\UnityEngine.VideoModule.dll_656115285687179036.movedfrom
Library\Bee\artifacts\movedfrom\UnityEngine.VRModule.dll_5048986009766305935.movedfrom
Library\Bee\artifacts\movedfrom\UnityEngine.WindModule.dll_2442737474065861003.movedfrom
Library\Bee\artifacts\movedfrom\UnityEngine.XRModule.dll_8705560381487312365.movedfrom