,اقتصاد:اقتصاد,191,اقتصاد:سیاسی,16,اقتصاد:ادب و هنر,1,اقتصاد:اجتماعی,3,اقتصاد:ورزش,0
,سیاسی:اقتصاد,26,سیاسی:سیاسی,156,سیاسی:ادب و هنر,4,سیاسی:اجتماعی,14,سیاسی:ورزش,0
,ادب و هنر:اقتصاد,2,ادب و هنر:سیاسی,0,ادب و هنر:ادب و هنر,56,ادب و هنر:اجتماعی,0,ادب و هنر:ورزش,0
,اجتماعی:اقتصاد,18,اجتماعی:سیاسی,25,اجتماعی:ادب و هنر,19,اجتماعی:اجتماعی,100,اجتماعی:ورزش,1
,ورزش:اقتصاد,2,ورزش:سیاسی,3,ورزش:ادب و هنر,5,ورزش:اجتماعی,0,ورزش:ورزش,218
