alembic==1.0.11
Click==7.0
Flask==1.1.1
Flask-Login==0.4.1
Flask-Migrate==2.5.2
Flask-SQLAlchemy==2.4.0
Flask-WTF==0.14.2
inflect==2.1.0
itsdangerous==1.1.0
Jinja2==2.10.1
Mako==1.0.13
MarkupSafe==1.1.1
pkg-resources==0.0.0
python-dateutil==2.8.0
python-editor==1.0.4
six==1.12.0
sqlacodegen==2.0.1
SQLAlchemy==1.3.5
Werkzeug==0.15.4
WTForms==2.2.1
