{
	"info": {
		"_postman_id": "ccceda7e-5a4d-4d9f-9f8f-a183f1ce1b7e",
		"name": "First MS",
		"schema": "https://schema.getpostman.com/json/collection/v2.1.0/collection.json"
	},
	"item": [
		{
			"name": "Get All Employees",
			"request": {
				"auth": {
					"type": "bearer",
					"bearer": [
						{
							"key": "token",
							"value": "tk1",
							"type": "string"
						}
					]
				},
				"method": "GET",
				"header": [],
				"url": {
					"raw": "http://localhost:8080/employees?sortby=name",
					"protocol": "http",
					"host": [
						"localhost"
					],
					"port": "8080",
					"path": [
						"employees"
					],
					"query": [
						{
							"key": "sortby",
							"value": "name"
						}
					]
				}
			},
			"response": []
		},
		{
			"name": "Get Particular Employee",
			"request": {
				"method": "GET",
				"header": [],
				"url": {
					"raw": "http://localhost:8080/employees/2",
					"protocol": "http",
					"host": [
						"localhost"
					],
					"port": "8080",
					"path": [
						"employees",
						"2"
					]
				}
			},
			"response": []
		},
		{
			"name": "Create Employee",
			"request": {
				"method": "POST",
				"header": [],
				"body": {
					"mode": "raw",
					"raw": "{\r\n    \"name\": \"fox\",\r\n    \"age\": 3,\r\n    \"email\": \"fox@gmail.com\",\r\n    \"standard\": \"VII\",\r\n    \"section\": \"D\"\r\n}",
					"options": {
						"raw": {
							"language": "json"
						}
					}
				},
				"url": {
					"raw": "http://localhost:8182/firstms/employees",
					"protocol": "http",
					"host": [
						"localhost"
					],
					"port": "8182",
					"path": [
						"firstms",
						"employees"
					]
				}
			},
			"response": []
		},
		{
			"name": "Update Employee",
			"request": {
				"method": "PUT",
				"header": [],
				"body": {
					"mode": "raw",
					"raw": "{\r\n    \"name\": \"rabbit\",\r\n    \"age\": 2,\r\n    \"email\": \"rabbit@gmail.com\",\r\n    \"standard\": \"VII\",\r\n    \"section\": \"C\"\r\n}",
					"options": {
						"raw": {
							"language": "json"
						}
					}
				},
				"url": {
					"raw": "http://localhost:8080/employees/2",
					"protocol": "http",
					"host": [
						"localhost"
					],
					"port": "8080",
					"path": [
						"employees",
						"2"
					]
				}
			},
			"response": []
		},
		{
			"name": "Delete Employee",
			"request": {
				"method": "DELETE",
				"header": [],
				"url": {
					"raw": "http://localhost:8182/firstms/employees/6",
					"protocol": "http",
					"host": [
						"localhost"
					],
					"port": "8182",
					"path": [
						"firstms",
						"employees",
						"6"
					]
				}
			},
			"response": []
		}
	],
	"event": [
		{
			"listen": "prerequest",
			"script": {
				"type": "text/javascript",
				"exec": [
					""
				]
			}
		},
		{
			"listen": "test",
			"script": {
				"type": "text/javascript",
				"exec": [
					""
				]
			}
		}
	]
}