MWS Result File Version 20150206
size=i:3

type=s:FOLDER
problemclass=s::8:1000
visibility=s:visible
creation=s:internal
lifetime=s:persistent
result=s:0
treepath=s:1D Results

type=s:XYSIGNAL2
subtype=s:user
problemclass=s:Low Frequency:4:3
visibility=s:visible
creation=s:internal
lifetime=s:persistent
result=s:0
treepath=s:Excitation Signals\default
files=s:signal_default_lf.sig

type=s:XYSIGNAL2
subtype=s:user
problemclass=s:High Frequency:0:0
visibility=s:visible
creation=s:internal
lifetime=s:persistent
result=s:0
treepath=s:Excitation Signals\default
files=s:signal_default.sig

