{
    "anchorpoints": [],
    "portpins": [
        {
            "name": "1",
            "position": [
                3.939882271127332e-17,
                0.0,
                0.0
            ],
            "rotation": [
                0.0,
                0.0,
                1.0,
                0.0,
                1.0,
                -0.0,
                -1.0,
                0.0,
                0.0
            ]
        }
    ],
    "version": 6
}