MWS Result File Version 20150206
size=i:69

type=s:HIDDENITEM
problemclass=s::8:1000
visibility=s:hidden
creation=s:internal
lifetime=s:rebuild
result=s:1
files=s:farfield (broadband)_b7_1[0].mft

type=s:HIDDENITEM
problemclass=s::8:1000
visibility=s:hidden
creation=s:internal
lifetime=s:rebuild
result=s:1
files=s:farfield (broadband)_a7_1[0].mft

type=s:HIDDENITEM
problemclass=s::8:1000
visibility=s:hidden
creation=s:internal
lifetime=s:rebuild
result=s:1
files=s:farfield (broadband)_b6_1[0].mft

type=s:HIDDENITEM
problemclass=s::8:1000
visibility=s:hidden
creation=s:internal
lifetime=s:rebuild
result=s:1
files=s:farfield (broadband)_a6_1[0].mft

type=s:HIDDENITEM
problemclass=s::8:1000
visibility=s:hidden
creation=s:internal
lifetime=s:rebuild
result=s:1
files=s:farfield (broadband)_b5_1[0].mft

type=s:HIDDENITEM
problemclass=s::8:1000
visibility=s:hidden
creation=s:internal
lifetime=s:rebuild
result=s:1
files=s:farfield (broadband)_a5_1[0].mft

type=s:HIDDENITEM
problemclass=s::8:1000
visibility=s:hidden
creation=s:internal
lifetime=s:rebuild
result=s:1
files=s:farfield (broadband)_b4_1[0].mft

type=s:HIDDENITEM
problemclass=s::8:1000
visibility=s:hidden
creation=s:internal
lifetime=s:rebuild
result=s:1
files=s:farfield (broadband)_a4_1[0].mft

type=s:HIDDENITEM
problemclass=s::8:1000
visibility=s:hidden
creation=s:internal
lifetime=s:rebuild
result=s:1
files=s:farfield (broadband)_b3_1[0].mft

type=s:HIDDENITEM
problemclass=s::8:1000
visibility=s:hidden
creation=s:internal
lifetime=s:rebuild
result=s:1
files=s:farfield (broadband)_a3_1[0].mft

type=s:HIDDENITEM
problemclass=s::8:1000
visibility=s:hidden
creation=s:internal
lifetime=s:rebuild
result=s:1
files=s:farfield (broadband)_b2_1[0].mft

type=s:HIDDENITEM
problemclass=s::8:1000
visibility=s:hidden
creation=s:internal
lifetime=s:rebuild
result=s:1
files=s:farfield (broadband)_a2_1[0].mft

type=s:HIDDENITEM
problemclass=s::8:1000
visibility=s:hidden
creation=s:internal
lifetime=s:rebuild
result=s:1
files=s:farfield (broadband)_b1_1[0].mft

type=s:HIDDENITEM
problemclass=s::8:1000
visibility=s:hidden
creation=s:internal
lifetime=s:rebuild
result=s:1
files=s:farfield (broadband)_a1_1[0].mft

type=s:HIDDENITEM
problemclass=s::8:1000
visibility=s:hidden
creation=s:internal
lifetime=s:rebuild
result=s:1
files=s:farfield (broadband)_tdss_1.mft

type=s:DATA_FOLDER
problemclass=s::8:1000
visibility=s:hidden
creation=s:internal
lifetime=s:rebuild
result=s:1
files=s:raw_data

type=s:HIDDENITEM
problemclass=s::8:1000
visibility=s:hidden
creation=s:internal
lifetime=s:rebuild
result=s:1
files=s:RefSpectrum_1.sig

type=s:HIDDENITEM
problemclass=s::8:1000
visibility=s:hidden
creation=s:internal
lifetime=s:solverstart
result=s:0
files=s:PBAMeshFeedback.axg

type=s:HIDDENITEM
problemclass=s::8:1000
visibility=s:hidden
creation=s:internal
lifetime=s:rebuild
result=s:1
files=s:World.fid

type=s:HIDDENITEM
problemclass=s::8:1000
visibility=s:hidden
creation=s:internal
lifetime=s:survivemeshadapt
result=s:1
files=s:model.gex

type=s:HIDDENITEM
problemclass=s::8:1000
visibility=s:hidden
creation=s:internal
lifetime=s:survivemeshadapt
result=s:1
files=s:PP.sid

type=s:HIDDENITEM
problemclass=s::8:1000
visibility=s:hidden
creation=s:internal
lifetime=s:survivemeshadapt
result=s:1
files=s:PP.fmm

type=s:HIDDENITEM
problemclass=s::8:1000
visibility=s:hidden
creation=s:internal
lifetime=s:rebuild
result=s:1
files=s:ml_info.dat

type=s:HIDDENITEM
problemclass=s::8:1000
visibility=s:hidden
creation=s:internal
lifetime=s:persistent
result=s:0
files=s:MCalcAccess.log

type=s:FOLDER
problemclass=s::8:1000
visibility=s:visible
creation=s:internal
lifetime=s:persistent
result=s:0
treepath=s:1D Results

type=s:XYSIGNAL2
subtype=s:user
problemclass=s::8:1000
visibility=s:visible
creation=s:internal
lifetime=s:surviveparchange
result=s:1
parametric=s:P
treepath=s:1D Results\Discrete Ports\Voltages\Signals\Port 1 [1]
files=s:pus1(1).sig

type=s:XYSIGNAL2
subtype=s:user
problemclass=s::8:1000
visibility=s:visible
creation=s:internal
lifetime=s:surviveparchange
result=s:1
parametric=s:P
treepath=s:1D Results\Discrete Ports\Currents\Signals\Port 1 [1]
files=s:pis1(1).sig

type=s:XYSIGNAL2
subtype=s:complex
problemclass=s::8:1000
visibility=s:visible
creation=s:internal
lifetime=s:surviveparchange
result=s:1
parametric=s:P
treepath=s:1D Results\Discrete Ports\Voltages\Port 1 [1]
files=s:puc1(1).sig

type=s:XYSIGNAL2
subtype=s:complex
problemclass=s::8:1000
visibility=s:visible
creation=s:internal
lifetime=s:surviveparchange
result=s:1
parametric=s:P
treepath=s:1D Results\Discrete Ports\Currents\Port 1 [1]
files=s:pic1(1).sig

type=s:XYSIGNAL2
subtype=s:complex
problemclass=s::8:1000
visibility=s:visible
creation=s:internal
lifetime=s:surviveparchange
result=s:1
parametric=s:P
treepath=s:1D Results\Discrete Ports\Impedances\Port 1 [1]
files=s:pzc1(1).sig

type=s:XYSIGNAL2
subtype=s:time
problemclass=s::8:1000
visibility=s:visible
creation=s:internal
lifetime=s:surviveparchange
result=s:1
parametric=s:P
treepath=s:1D Results\Port signals\i1
files=s:i1(1).sig

type=s:XYSIGNAL2
subtype=s:time
problemclass=s::8:1000
visibility=s:visible
creation=s:internal
lifetime=s:surviveparchange
result=s:1
parametric=s:P
treepath=s:1D Results\Port signals\o1,1
files=s:o1(1)1(1).sig

type=s:XYSIGNAL2
subtype=s:complex
problemclass=s::8:1000
visibility=s:visible
creation=s:internal
lifetime=s:surviveparchange
result=s:1
parametric=s:P
treepath=s:1D Results\S-Parameters\S1,1
files=s:cS1(1)1(1).sig

type=s:XYSIGNAL2
subtype=s:balance
problemclass=s::8:1000
visibility=s:visible
creation=s:internal
lifetime=s:surviveparchange
result=s:1
parametric=s:P
treepath=s:1D Results\Balance\Balance [1]
files=s:1.bil

type=s:XYSIGNAL2
subtype=s:complex
problemclass=s::8:1000
visibility=s:visible
creation=s:internal
lifetime=s:surviveparchange
result=s:1
parametric=s:P
treepath=s:1D Results\Power\Excitation [1]\Power Stimulated
files=s:StimulatedPower_1.sig

type=s:XYSIGNAL2
subtype=s:complex
problemclass=s::8:1000
visibility=s:visible
creation=s:internal
lifetime=s:surviveparchange
result=s:1
parametric=s:P
treepath=s:1D Results\Power\Excitation [1]\Power Outgoing all Ports
files=s:ReflectedPower_1.sig

type=s:XYSIGNAL2
subtype=s:complex
problemclass=s::8:1000
visibility=s:visible
creation=s:internal
lifetime=s:surviveparchange
result=s:1
parametric=s:P
treepath=s:1D Results\Power\Excitation [1]\Power Accepted
files=s:AcceptedPower_1.sig

type=s:XYSIGNAL2
subtype=s:complex
problemclass=s::8:1000
visibility=s:visible
creation=s:internal
lifetime=s:surviveparchange
result=s:1
parametric=s:P
treepath=s:1D Results\Power\Excitation [1]\Power Accepted per Port\Port 1
files=s:AcceptedPower_1(1).sig

type=s:XYSIGNAL2
subtype=s:energy
problemclass=s::8:1000
visibility=s:visible
creation=s:internal
lifetime=s:surviveparchange
result=s:1
parametric=s:P
treepath=s:1D Results\Energy\Energy [1]
files=s:1.eng

type=s:XYSIGNAL2
subtype=s:complex
problemclass=s::8:1000
visibility=s:visible
creation=s:internal
lifetime=s:surviveparchange
result=s:1
parametric=s:P
treepath=s:1D Results\Power\Excitation [1]\Power Radiated
files=s:RadiatedPower_1.sig

type=s:XYSIGNAL2
subtype=s:complex
problemclass=s::8:1000
visibility=s:visible
creation=s:internal
lifetime=s:surviveparchange
result=s:1
parametric=s:P
treepath=s:1D Results\Efficiencies\Rad. Efficiency [1]
files=s:FarfieldMetaData_1_RadEff.sig

type=s:XYSIGNAL2
subtype=s:complex
problemclass=s::8:1000
visibility=s:visible
creation=s:internal
lifetime=s:surviveparchange
result=s:1
parametric=s:P
treepath=s:1D Results\Efficiencies\Tot. Efficiency [1]
files=s:FarfieldMetaData_1_TotEff.sig

type=s:XYSIGNAL2
subtype=s:complex
problemclass=s::8:1000
visibility=s:visible
creation=s:internal
lifetime=s:surviveparchange
result=s:1
parametric=s:P
treepath=s:1D Results\Reference Impedance\ZRef 1(1)
files=s:ZRef1(1).sig

type=s:RESULT_0D
problemclass=s::8:1000
visibility=s:hidden
creation=s:internal
lifetime=s:surviveparchange
result=s:1
parametric=s:P
treepath=s:1D Results\AutomaticRunInformation
files=s:AutomaticRunInformation

type=s:XYSIGNAL2
subtype=s:user
problemclass=s:Low Frequency:4:3
visibility=s:visible
creation=s:internal
lifetime=s:persistent
result=s:0
treepath=s:Excitation Signals\default
files=s:signal_default_lf.sig

type=s:XYSIGNAL2
subtype=s:user
problemclass=s:High Frequency:0:0
visibility=s:visible
creation=s:internal
lifetime=s:persistent
result=s:0
treepath=s:Excitation Signals\default
files=s:signal_default.sig

type=s:MESH_FEEDBACK
problemclass=s::8:1000
visibility=s:visible
creation=s:internal
lifetime=s:solverstart
result=s:0
treepath=s:Mesh\Information\PBA
files=s:PBAMeshFeedback.rex
ylabel=s:Mesh Feedback

type=s:XYSIGNAL2
subtype=s:user
problemclass=s::8:1000
visibility=s:visible
creation=s:internal
lifetime=s:rebuild
result=s:1
treepath=s:1D Results\Discrete Ports\Voltages\Signals\Port 1 [1]
files=s:pus1(1).sig

type=s:XYSIGNAL2
subtype=s:user
problemclass=s::8:1000
visibility=s:visible
creation=s:internal
lifetime=s:rebuild
result=s:1
treepath=s:1D Results\Discrete Ports\Currents\Signals\Port 1 [1]
files=s:pis1(1).sig

type=s:XYSIGNAL2
subtype=s:complex
problemclass=s::8:1000
visibility=s:visible
creation=s:internal
lifetime=s:rebuild
result=s:1
treepath=s:1D Results\Discrete Ports\Voltages\Port 1 [1]
files=s:puc1(1).sig

type=s:XYSIGNAL2
subtype=s:complex
problemclass=s::8:1000
visibility=s:visible
creation=s:internal
lifetime=s:rebuild
result=s:1
treepath=s:1D Results\Discrete Ports\Currents\Port 1 [1]
files=s:pic1(1).sig

type=s:XYSIGNAL2
subtype=s:complex
problemclass=s::8:1000
visibility=s:visible
creation=s:internal
lifetime=s:rebuild
result=s:1
treepath=s:1D Results\Discrete Ports\Impedances\Port 1 [1]
files=s:pzc1(1).sig

type=s:XYSIGNAL2
subtype=s:time
problemclass=s::8:1000
visibility=s:visible
creation=s:internal
lifetime=s:rebuild
result=s:1
treepath=s:1D Results\Port signals\i1
files=s:i1(1).sig

type=s:XYSIGNAL2
subtype=s:time
problemclass=s::8:1000
visibility=s:visible
creation=s:internal
lifetime=s:rebuild
result=s:1
treepath=s:1D Results\Port signals\o1,1
files=s:o1(1)1(1).sig

type=s:XYSIGNAL2
subtype=s:complex
problemclass=s::8:1000
visibility=s:visible
creation=s:internal
lifetime=s:rebuild
result=s:1
treepath=s:1D Results\S-Parameters\S1,1
files=s:cS1(1)1(1).sig

type=s:XYSIGNAL2
subtype=s:balance
problemclass=s::8:1000
visibility=s:visible
creation=s:internal
lifetime=s:rebuild
result=s:1
treepath=s:1D Results\Balance\Balance [1]
files=s:1.bil

type=s:XYSIGNAL2
subtype=s:complex
problemclass=s::8:1000
visibility=s:visible
creation=s:internal
lifetime=s:rebuild
result=s:1
treepath=s:1D Results\Power\Excitation [1]\Power Stimulated
files=s:StimulatedPower_1.sig

type=s:XYSIGNAL2
subtype=s:complex
problemclass=s::8:1000
visibility=s:visible
creation=s:internal
lifetime=s:rebuild
result=s:1
treepath=s:1D Results\Power\Excitation [1]\Power Outgoing all Ports
files=s:ReflectedPower_1.sig

type=s:XYSIGNAL2
subtype=s:complex
problemclass=s::8:1000
visibility=s:visible
creation=s:internal
lifetime=s:rebuild
result=s:1
treepath=s:1D Results\Power\Excitation [1]\Power Accepted
files=s:AcceptedPower_1.sig

type=s:XYSIGNAL2
subtype=s:complex
problemclass=s::8:1000
visibility=s:visible
creation=s:internal
lifetime=s:rebuild
result=s:1
treepath=s:1D Results\Power\Excitation [1]\Power Accepted per Port\Port 1
files=s:AcceptedPower_1(1).sig

type=s:XYSIGNAL2
subtype=s:energy
problemclass=s::8:1000
visibility=s:visible
creation=s:internal
lifetime=s:rebuild
result=s:1
treepath=s:1D Results\Energy\Energy [1]
files=s:1.eng

type=s:FARFIELD
problemclass=s::8:1000
visibility=s:visible
creation=s:internal
lifetime=s:rebuild
result=s:1
treepath=s:Farfields\farfield (f=0.8) [1]
files=s:farfield (f=0.8)_1.ffm
ylabel=s:farfield (f=0.8) [1]

type=s:FARFIELD
problemclass=s::8:1000
visibility=s:visible
creation=s:internal
lifetime=s:rebuild
result=s:1
treepath=s:Farfields\farfield (broadband) [1]
files=s:farfield (broadband)_1.ffm
ylabel=s:farfield (broadband) [1]

type=s:FARFIELD
problemclass=s::8:1000
visibility=s:visible
creation=s:internal
lifetime=s:rebuild
result=s:1
treepath=s:Farfields\farfield (f=1.2) [1]
files=s:farfield (f=1.2)_1.ffm
ylabel=s:farfield (f=1.2) [1]

type=s:XYSIGNAL2
subtype=s:complex
problemclass=s::8:1000
visibility=s:visible
creation=s:internal
lifetime=s:rebuild
result=s:1
treepath=s:1D Results\Power\Excitation [1]\Power Radiated
files=s:RadiatedPower_1.sig

type=s:XYSIGNAL2
subtype=s:complex
problemclass=s::8:1000
visibility=s:visible
creation=s:internal
lifetime=s:rebuild
result=s:1
treepath=s:1D Results\Efficiencies\Rad. Efficiency [1]
files=s:FarfieldMetaData_1_RadEff.sig

type=s:XYSIGNAL2
subtype=s:complex
problemclass=s::8:1000
visibility=s:visible
creation=s:internal
lifetime=s:rebuild
result=s:1
treepath=s:1D Results\Efficiencies\Tot. Efficiency [1]
files=s:FarfieldMetaData_1_TotEff.sig

type=s:XYSIGNAL2
subtype=s:complex
problemclass=s::8:1000
visibility=s:visible
creation=s:internal
lifetime=s:rebuild
result=s:1
treepath=s:1D Results\Reference Impedance\ZRef 1(1)
files=s:ZRef1(1).sig

type=s:RESULT_0D
problemclass=s::8:1000
visibility=s:hidden
creation=s:internal
lifetime=s:rebuild
result=s:1
treepath=s:1D Results\AutomaticRunInformation
files=s:AutomaticRunInformation

