{
   "execution": {
      "classname": "SMAPowerByEmagHPCFrame",
      "libname": "SMAPowerByEmagUI"
   },
   "inputVariables": [
      {
         "name": "Freqss",
         "type": "float",
         "value": 1000000000.0
      },
      {
         "name": "DipLenLam",
         "type": "float",
         "value": 0.46
      },
      {
         "name": "DemoPapam1",
         "type": "float",
         "value": 1.0
      }
   ],
   "outputVariables": []
}