{
    "parameters": [
        {
            "expr": "1",
            "name": "Er",
            "value": "1"
        },
        {
            "expr": "7",
            "name": "Mue",
            "value": "7"
        },
        {
            "expr": "-10",
            "name": "x1",
            "value": "-10"
        },
        {
            "expr": "5",
            "name": "x2",
            "value": "5"
        },
        {
            "expr": "-5",
            "name": "y1",
            "value": "-5"
        },
        {
            "expr": "5",
            "name": "z2",
            "value": "5"
        },
        {
            "expr": "27",
            "name": "xshift",
            "value": "27"
        },
        {
            "expr": "45",
            "name": "rot",
            "value": "45"
        }
    ],
    "version": 1
}