{
  "parent": "fantasy_mobs:custom/genericprofessionsign",
  "textures": {
    "all": "fantasy_mobs:blocks/blacksmithsign",
    "particle": "fantasy_mobs:blocks/blacksmithsign",
    "1": "fantasy_mobs:blocks/blacksmithsign_sign",
    "2": "fantasy_mobs:blocks/blacksmithsign_marco"
  }
}