{
	"credit": "JJ",
	"textures": {
		"0": "Arm/Armtexture",
		"particle": "Arm/Armtexture"
	},
	"elements": [
		{
			"from": [8, 11, 7],
			"to": [9, 13, 10],
			"rotation": {"angle": 0, "axis": "y", "origin": [16, 19, 15]},
			"faces": {
				"north": {"uv": [12, 10.5, 13.5, 14.5], "texture": "#0"},
				"east": {"uv": [8, 5, 15, 10], "texture": "#0"},
				"south": {"uv": [14.5, 10, 16, 14.5], "texture": "#0"},
				"west": {"uv": [8, 0, 15.5, 5], "texture": "#0"},
				"up": {"uv": [8.5, 10.5, 11.5, 13.5], "texture": "#0"},
				"down": {"uv": [14.5, 10, 16, 13], "texture": "#0"}
			}
		},
		{
			"from": [7.1, 13, 8.2],
			"to": [10.1, 16, 11.2],
			"rotation": {"angle": 0, "axis": "y", "origin": [15.1, 21, 16.2]},
			"faces": {
				"north": {"uv": [0, 0, 3, 5], "texture": "#0"},
				"east": {"uv": [0, 0, 3, 3], "texture": "#0"},
				"south": {"uv": [0, 0, 3, 4], "texture": "#0"},
				"west": {"uv": [0, 0, 3, 3], "texture": "#0"},
				"up": {"uv": [0, 0, 3, 3], "texture": "#0"},
				"down": {"uv": [0, 0, 3, 3], "texture": "#0"}
			}
		},
		{
			"from": [8, 9, 6],
			"to": [9, 11, 9],
			"rotation": {"angle": 0, "axis": "y", "origin": [16, 17, 14]},
			"faces": {
				"north": {"uv": [12, 10.5, 13.5, 14.5], "texture": "#0"},
				"east": {"uv": [8, 5, 14.5, 10], "texture": "#0"},
				"south": {"uv": [14.5, 10, 16, 15], "texture": "#0"},
				"west": {"uv": [8.5, 0, 15.5, 5], "texture": "#0"},
				"up": {"uv": [8.5, 10.5, 11.5, 12.5], "texture": "#0"},
				"down": {"uv": [14, 3.5, 15.5, 5], "texture": "#0"}
			}
		},
		{
			"from": [8, 7, 5],
			"to": [9, 9, 8],
			"rotation": {"angle": 0, "axis": "y", "origin": [16, 15, 13]},
			"faces": {
				"north": {"uv": [12, 10, 13.5, 14.5], "texture": "#0"},
				"east": {"uv": [8, 5, 15, 10], "texture": "#0"},
				"south": {"uv": [14.5, 10, 16, 15], "texture": "#0"},
				"west": {"uv": [8.5, 0, 15.5, 5], "texture": "#0"},
				"up": {"uv": [8.5, 10.5, 11.5, 12], "texture": "#0"},
				"down": {"uv": [9, 1, 10, 4], "texture": "#0"}
			}
		},
		{
			"from": [8, 5, 6],
			"to": [9, 7, 9],
			"rotation": {"angle": 0, "axis": "y", "origin": [16, 13, 14]},
			"faces": {
				"north": {"uv": [12, 10, 13.5, 15], "texture": "#0"},
				"east": {"uv": [8, 5, 14.5, 10], "texture": "#0"},
				"south": {"uv": [14.5, 10, 16, 15], "texture": "#0"},
				"west": {"uv": [8.5, 0, 15.5, 5], "texture": "#0"},
				"up": {"uv": [8, 5, 9.5, 7], "texture": "#0"},
				"down": {"uv": [4.5, 7, 6, 9.5], "texture": "#0"}
			}
		},
		{
			"from": [8.1, 16, 9.3],
			"to": [9.1, 17, 10.3],
			"rotation": {"angle": 0, "axis": "y", "origin": [16.1, 24, 17.3]},
			"faces": {
				"north": {"uv": [3.5, 7, 6, 9.5], "texture": "#0"},
				"east": {"uv": [3.5, 7, 6, 9.5], "texture": "#0"},
				"south": {"uv": [3.5, 7, 6, 9.5], "texture": "#0"},
				"west": {"uv": [3.5, 7, 6, 9.5], "texture": "#0"},
				"up": {"uv": [5.5, 11, 7, 12.5], "texture": "#0"},
				"down": {"uv": [0, 0, 1, 1], "texture": "#0"}
			}
		}
	],
	"display": {
		"thirdperson_righthand": {
			"rotation": [-180, -180, 0],
			"translation": [0.75, 5.5, 0.25]
		},
		"thirdperson_lefthand": {
			"rotation": [-180, -180, 0],
			"translation": [-0.75, 6.5, 0.5]
		},
		"firstperson_righthand": {
			"rotation": [17, -53, 0],
			"translation": [0, -1.5, 0]
		},
		"gui": {
			"rotation": [-180, -83, 0],
			"translation": [0, 3.25, 0]
		},
		"fixed": {
			"rotation": [-174, -89, 5],
			"translation": [0, 3.75, 0]
		}
	}
}