{
  "_fv": 10,
  "_type": "loottable",
  "definition": {
    "type": "Chest",
    "pools": [
      {
        "minrolls": 5,
        "maxrolls": 15,
        "minbonusrolls": 1,
        "maxbonusrolls": 1,
        "hasbonusrolls": false,
        "entries": [
          {
            "type": "item",
            "item": {
              "value": "Items.IRON_SWORD"
            },
            "weight": 9
          },
          {
            "type": "item",
            "item": {
              "value": "Items.IRON_HELMET"
            },
            "weight": 9
          },
          {
            "type": "item",
            "item": {
              "value": "Items.IRON_CHESTPLATE"
            },
            "weight": 9
          },
          {
            "type": "item",
            "item": {
              "value": "Items.IRON_LEGGINGS"
            },
            "weight": 9
          },
          {
            "type": "item",
            "item": {
              "value": "Items.IRON_BOOTS"
            },
            "weight": 9
          },
          {
            "type": "item",
            "item": {
              "value": "Items.BOW"
            },
            "weight": 9
          },
          {
            "type": "item",
            "item": {
              "value": "Items.CROSSBOW"
            },
            "weight": 9
          },
          {
            "type": "item",
            "item": {
              "value": "CUSTOM:DrowMageWand"
            },
            "weight": 1
          },
          {
            "type": "item",
            "item": {
              "value": "Items.TIPPED_ARROW"
            },
            "weight": 1
          },
          {
            "type": "item",
            "item": {
              "value": "Items.DIAMOND_HELMET"
            },
            "weight": 1
          },
          {
            "type": "item",
            "item": {
              "value": "Items.DIAMOND_CHESTPLATE"
            },
            "weight": 1
          },
          {
            "type": "item",
            "item": {
              "value": "Items.DIAMOND_LEGGINGS"
            },
            "weight": 1
          },
          {
            "type": "item",
            "item": {
              "value": "Items.DIAMOND_BOOTS"
            },
            "weight": 1
          },
          {
            "type": "item",
            "item": {
              "value": "Items.DIAMOND_SWORD"
            },
            "weight": 1
          },
          {
            "type": "item",
            "item": {
              "value": "Items.SHIELD"
            },
            "weight": 9
          },
          {
            "type": "item",
            "item": {
              "value": "Items.TOTEM_OF_UNDYING"
            },
            "weight": 1
          },
          {
            "type": "item",
            "item": {
              "value": "Blocks.BELL"
            },
            "weight": 9
          }
        ]
      }
    ],
    "name": "drow_armory_chest",
    "namespace": "minecraft"
  }
}