{
  "_fv": 10,
  "_type": "procedure",
  "definition": {
    "procedurexml": "<xml xmlns=\"https://developers.google.com/blockly/xml\"><block type=\"event_trigger\" deletable=\"false\" x=\"141\" y=\"55\"><field name=\"trigger\">no_ext_trigger</field><next><block type=\"entity_nbt_num_set\"><value name=\"entity\"><block type=\"entity_from_deps\"/></value><value name=\"tagName\"><block type=\"text\"><field name=\"TEXT\">baseX</field></block></value><value name=\"tagValue\"><block type=\"coord_x\"/></value><next><block type=\"entity_nbt_num_set\"><value name=\"entity\"><block type=\"entity_from_deps\"/></value><value name=\"tagName\"><block type=\"text\"><field name=\"TEXT\">baseY</field></block></value><value name=\"tagValue\"><block type=\"math_dual_ops\"><field name=\"OP\">ADD</field><value name=\"A\"><block type=\"coord_y\"/></value><value name=\"B\"><block type=\"math_number\"><field name=\"NUM\">2</field></block></value></block></value><next><block type=\"entity_nbt_num_set\"><value name=\"entity\"><block type=\"entity_from_deps\"/></value><value name=\"tagName\"><block type=\"text\"><field name=\"TEXT\">baseZ</field></block></value><value name=\"tagValue\"><block type=\"coord_z\"/></value></block></next></block></next></block></next></block></xml>"
  }
}