{
  "_fv": 10,
  "_type": "structure",
  "definition": {
    "structure": "narbondel",
    "randomlyRotateStructure": false,
    "surfaceDetectionType": "First motion blocking block",
    "spawnProbability": 2500,
    "minCountPerChunk": 1,
    "maxCountPerChunk": 1,
    "spawnLocation": "Underground",
    "spawnHeightOffset": 0,
    "spawnWorldTypes": [
      "CUSTOM:Underdark"
    ],
    "restrictionBlocks": [
      {
        "value": "CUSTOM:Underdirt"
      },
      {
        "value": "CUSTOM:Understone"
      }
    ],
    "restrictionBiomes": [
      {
        "value": "CUSTOM:UnderdarkVault"
      }
    ],
    "ignoreBlocks": "STRUCTURE_BLOCK",
    "onStructureGenerated": {
      "name": "DrowCityGeneration"
    }
  }
}