{
  "group": "fantasy_mobs",
  "type": "minecraft:crafting_shaped",
  "pattern": [
    "012",
    "345"
  ],
  "key": {
    "0": {
      "item": "minecraft:iron_ingot"
    },
    "1": {
      "item": "minecraft:diamond"
    },
    "2": {
      "item": "minecraft:iron_ingot"
    },
    "3": {
      "item": "minecraft:coal_block"
    },
    "4": {
      "item": "minecraft:diamond"
    },
    "5": {
      "item": "minecraft:coal_block"
    }
  },
  "result": {
    "item": "fantasy_mobs:underdark",
    "count": 2
  }
}