# Made in Blockbench 3.5.4
mtllib horrorLeg_v1.mtl
o leg
v -0.11898490279201895 0.11591940805429224 0.04600881183666508
v -0.03280490294113392 0.11718145449871592 0.11831140421393449
v -0.06405121914620587 -0.1333839801197714 -0.015116968698505734
v 0.02212878070467922 -0.13212193367534772 0.057185623678763675
v 0.035568954885283055 0.15238018780854964 0.03619980491568603
v -0.050611044965601926 0.15111814136412596 -0.03610278746158338
v 0.09050263853109614 -0.096923200365514 -0.02492597561948484
v 0.004322638680211155 -0.09818524680993768 -0.09722856799675425
vt 0 1
vt 0 0.046875
vt 0.953125 1
vt 0 0.046875
vt 0.953125 0.046875
vt 0.953125 1
vt 0 1
vt 0 0.046875
vt 0.953125 1
vt 0 0.046875
vt 0.953125 0.046875
vt 0.953125 1
vt 0 1
vt 0 0.046875
vt 0.953125 1
vt 0 0.046875
vt 0.953125 0.046875
vt 0.953125 1
vt 0 1
vt 0 0.046875
vt 0.953125 1
vt 0 0.046875
vt 0.953125 0.046875
vt 0.953125 1
vt 0 1
vt 0 0.046875
vt 0.953125 1
vt 0 0.046875
vt 0.953125 0.046875
vt 0.953125 1
vt 0 1
vt 0 0.046875
vt 0.953125 1
vt 0 0.046875
vt 0.953125 0.046875
vt 0.953125 1
vn -1.0129460418728438 -0.5214627157012401 1.2164681377518294
vn -1.0129460418728438 -0.5214627157012401 1.2164681377518294
vn -1.0129460418728438 -0.5214627157012401 1.2164681377518294
vn -1.0129460418728438 -0.5214627157012401 1.2164681377518294
vn -1.0129460418728438 -0.5214627157012401 1.2164681377518294
vn -1.0129460418728438 -0.5214627157012401 1.2164681377518294
vn 1.0129460418728438 0.5214627157012401 -1.2164681377518294
vn 1.0129460418728438 0.5214627157012401 -1.2164681377518294
vn 1.0129460418728438 0.5214627157012401 -1.2164681377518294
vn 1.0129460418728438 0.5214627157012401 -1.2164681377518294
vn 1.0129460418728438 0.5214627157012401 -1.2164681377518294
vn 1.0129460418728438 0.5214627157012401 -1.2164681377518294
vn -0.34878529298928973 1.5828786550734202 0.38810019387410055
vn -0.34878529298928973 1.5828786550734202 0.38810019387410055
vn -0.34878529298928973 1.5828786550734202 0.38810019387410055
vn -0.34878529298928973 1.5828786550734202 0.38810019387410055
vn -0.34878529298928973 1.5828786550734202 0.38810019387410055
vn -0.34878529298928973 1.5828786550734202 0.38810019387410055
vn 0.34878529298928973 -1.5828786550734202 -0.38810019387410055
vn 0.34878529298928973 -1.5828786550734202 -0.38810019387410055
vn 0.34878529298928973 -1.5828786550734202 -0.38810019387410055
vn 0.34878529298928973 -1.5828786550734202 -0.38810019387410055
vn 0.34878529298928973 -1.5828786550734202 -0.38810019387410055
vn 0.34878529298928973 -1.5828786550734202 -0.38810019387410055
vn -1.2767407385316298 -0.01869698436183238 -1.0711495167002871
vn -1.2767407385316298 -0.01869698436183238 -1.0711495167002871
vn -1.2767407385316298 -0.01869698436183238 -1.0711495167002871
vn -1.2767407385316298 -0.01869698436183238 -1.0711495167002871
vn -1.2767407385316298 -0.01869698436183238 -1.0711495167002871
vn -1.2767407385316298 -0.01869698436183238 -1.0711495167002871
vn 1.2767407385316298 0.01869698436183238 1.0711495167002871
vn 1.2767407385316298 0.01869698436183238 1.0711495167002871
vn 1.2767407385316298 0.01869698436183238 1.0711495167002871
vn 1.2767407385316298 0.01869698436183238 1.0711495167002871
vn 1.2767407385316298 0.01869698436183238 1.0711495167002871
vn 1.2767407385316298 0.01869698436183238 1.0711495167002871
usemtl 0
f 1/1/1 3/2/2 2/3/3
f 3/4/4 4/5/5 2/6/6
usemtl 0
f 5/7/7 7/8/8 6/9/9
f 7/10/10 8/11/11 6/12/12
usemtl 0
f 5/13/13 6/14/14 2/15/15
f 6/16/16 1/17/17 2/18/18
usemtl 0
f 8/19/19 7/20/20 3/21/21
f 7/22/22 4/23/23 3/24/24
usemtl 0
f 6/25/25 8/26/26 1/27/27
f 8/28/28 3/29/29 1/30/30
usemtl 0
f 2/31/31 4/32/32 5/33/33
f 4/34/34 7/35/35 5/36/36
o rToe
v -0.001814811226186451 -0.08868246238289212 0.019539199240065322
v 0.010776032546085682 -0.112679323796428 0.1287265212852634
v 0.0060328578660725635 -0.12429723212204406 0.010806944877898059
v 0.018623701638344693 -0.14829409353557993 0.11999426692309614
v 0.04720472615347261 -0.10408543559256647 0.12641451618175337
v 0.03461388238120048 -0.08008857417903059 0.017227194136555296
v 0.055052395245731627 -0.13970020533171842 0.1176822618195861
v 0.042461551473459494 -0.11570334391818254 0.008494939774388033
vt 0 1
vt 0 0.046875
vt 0.953125 1
vt 0 0.046875
vt 0.953125 0.046875
vt 0.953125 1
vt 0 1
vt 0 0.046875
vt 0.953125 1
vt 0 0.046875
vt 0.953125 0.046875
vt 0.953125 1
vt 0 1
vt 0 0.046875
vt 0.953125 1
vt 0 0.046875
vt 0.953125 0.046875
vt 0.953125 1
vt 0 1
vt 0 0.046875
vt 0.953125 1
vt 0 0.046875
vt 0.953125 0.046875
vt 0.953125 1
vt 0 1
vt 0 0.046875
vt 0.953125 1
vt 0 0.046875
vt 0.953125 0.046875
vt 0.953125 1
vt 0 1
vt 0 0.046875
vt 0.953125 1
vt 0 0.046875
vt 0.953125 0.046875
vt 0.953125 1
vn -1.6190530492171968 -0.3819505868382902 0.10275578237822365
vn -1.6190530492171968 -0.3819505868382902 0.10275578237822365
vn -1.6190530492171968 -0.3819505868382902 0.10275578237822365
vn -1.6190530492171968 -0.3819505868382902 0.10275578237822365
vn -1.6190530492171968 -0.3819505868382902 0.10275578237822365
vn -1.6190530492171968 -0.3819505868382902 0.10275578237822365
vn 1.6190530492171968 0.3819505868382902 -0.10275578237822365
vn 1.6190530492171968 0.3819505868382902 -0.10275578237822365
vn 1.6190530492171968 0.3819505868382902 -0.10275578237822365
vn 1.6190530492171968 0.3819505868382902 -0.10275578237822365
vn 1.6190530492171968 0.3819505868382902 -0.10275578237822365
vn 1.6190530492171968 0.3819505868382902 -0.10275578237822365
vn -0.34878529298928973 1.5828786550734204 0.3881001938741006
vn -0.34878529298928973 1.5828786550734204 0.3881001938741006
vn -0.34878529298928973 1.5828786550734204 0.3881001938741006
vn -0.34878529298928973 1.5828786550734204 0.3881001938741006
vn -0.34878529298928973 1.5828786550734204 0.3881001938741006
vn -0.34878529298928973 1.5828786550734204 0.3881001938741006
vn 0.34878529298928973 -1.5828786550734204 -0.3881001938741006
vn 0.34878529298928973 -1.5828786550734204 -0.3881001938741006
vn 0.34878529298928973 -1.5828786550734204 -0.3881001938741006
vn 0.34878529298928973 -1.5828786550734204 -0.3881001938741006
vn 0.34878529298928973 -1.5828786550734204 -0.3881001938741006
vn 0.34878529298928973 -1.5828786550734204 -0.3881001938741006
vn -0.18653101884847578 0.35550905797830923 -1.6175899562251557
vn -0.18653101884847578 0.35550905797830923 -1.6175899562251557
vn -0.18653101884847578 0.35550905797830923 -1.6175899562251557
vn -0.18653101884847578 0.35550905797830923 -1.6175899562251557
vn -0.18653101884847578 0.35550905797830923 -1.6175899562251557
vn -0.18653101884847578 0.35550905797830923 -1.6175899562251557
vn 0.18653101884847578 -0.35550905797830923 1.6175899562251557
vn 0.18653101884847578 -0.35550905797830923 1.6175899562251557
vn 0.18653101884847578 -0.35550905797830923 1.6175899562251557
vn 0.18653101884847578 -0.35550905797830923 1.6175899562251557
vn 0.18653101884847578 -0.35550905797830923 1.6175899562251557
vn 0.18653101884847578 -0.35550905797830923 1.6175899562251557
usemtl 0
f 9/37/37 11/38/38 10/39/39
f 11/40/40 12/41/41 10/42/42
usemtl 0
f 13/43/43 15/44/44 14/45/45
f 15/46/46 16/47/47 14/48/48
usemtl 0
f 13/49/49 14/50/50 10/51/51
f 14/52/52 9/53/53 10/54/54
usemtl 0
f 16/55/55 15/56/56 11/57/57
f 15/58/58 12/59/59 11/60/60
usemtl 0
f 14/61/61 16/62/62 9/63/63
f 16/64/64 11/65/65 9/66/66
usemtl 0
f 10/67/67 12/68/68 13/69/69
f 12/70/70 15/71/71 13/72/72
o cToe
v 0.00834573093759755 -0.08519493498105905 0.01444648081575825
v 0.1232523974054443 -0.08351220638849412 0.11084993731878412
v 0.01619340002985653 -0.120809704720211 0.005714226453591015
v 0.13110006649770328 -0.11912697612764607 0.10211768295661688
v 0.14604368334758328 -0.07177929528521622 0.08347940421936795
v 0.031137016879736523 -0.07346202387778115 -0.012924052283657922
v 0.15389135243984225 -0.10739406502436817 0.07474714985720071
v 0.0389846859719955 -0.10907679361693311 -0.021656306645825157
vt 0 1
vt 0 0.046875
vt 0.953125 1
vt 0 0.046875
vt 0.953125 0.046875
vt 0.953125 1
vt 0 1
vt 0 0.046875
vt 0.953125 1
vt 0 0.046875
vt 0.953125 0.046875
vt 0.953125 1
vt 0 1
vt 0 0.046875
vt 0.953125 1
vt 0 0.046875
vt 0.953125 0.046875
vt 0.953125 1
vt 0 1
vt 0 0.046875
vt 0.953125 1
vt 0 0.046875
vt 0.953125 0.046875
vt 0.953125 1
vt 0 1
vt 0 0.046875
vt 0.953125 1
vt 0 0.046875
vt 0.953125 0.046875
vt 0.953125 1
vt 0 1
vt 0 0.046875
vt 0.953125 1
vt 0 0.046875
vt 0.953125 0.046875
vt 0.953125 1
vn -1.0129460418728438 -0.5214627157012401 1.2164681377518294
vn -1.0129460418728438 -0.5214627157012401 1.2164681377518294
vn -1.0129460418728438 -0.5214627157012401 1.2164681377518294
vn -1.0129460418728438 -0.5214627157012401 1.2164681377518294
vn -1.0129460418728438 -0.5214627157012401 1.2164681377518294
vn -1.0129460418728438 -0.5214627157012401 1.2164681377518294
vn 1.0129460418728438 0.5214627157012401 -1.2164681377518294
vn 1.0129460418728438 0.5214627157012401 -1.2164681377518294
vn 1.0129460418728438 0.5214627157012401 -1.2164681377518294
vn 1.0129460418728438 0.5214627157012401 -1.2164681377518294
vn 1.0129460418728438 0.5214627157012401 -1.2164681377518294
vn 1.0129460418728438 0.5214627157012401 -1.2164681377518294
vn -0.34878529298928973 1.5828786550734202 0.38810019387410055
vn -0.34878529298928973 1.5828786550734202 0.38810019387410055
vn -0.34878529298928973 1.5828786550734202 0.38810019387410055
vn -0.34878529298928973 1.5828786550734202 0.38810019387410055
vn -0.34878529298928973 1.5828786550734202 0.38810019387410055
vn -0.34878529298928973 1.5828786550734202 0.38810019387410055
vn 0.34878529298928973 -1.5828786550734202 -0.38810019387410055
vn 0.34878529298928973 -1.5828786550734202 -0.38810019387410055
vn 0.34878529298928973 -1.5828786550734202 -0.38810019387410055
vn 0.34878529298928973 -1.5828786550734202 -0.38810019387410055
vn 0.34878529298928973 -1.5828786550734202 -0.38810019387410055
vn 0.34878529298928973 -1.5828786550734202 -0.38810019387410055
vn -1.2767407385316298 -0.01869698436183238 -1.0711495167002871
vn -1.2767407385316298 -0.01869698436183238 -1.0711495167002871
vn -1.2767407385316298 -0.01869698436183238 -1.0711495167002871
vn -1.2767407385316298 -0.01869698436183238 -1.0711495167002871
vn -1.2767407385316298 -0.01869698436183238 -1.0711495167002871
vn -1.2767407385316298 -0.01869698436183238 -1.0711495167002871
vn 1.2767407385316298 0.01869698436183238 1.0711495167002871
vn 1.2767407385316298 0.01869698436183238 1.0711495167002871
vn 1.2767407385316298 0.01869698436183238 1.0711495167002871
vn 1.2767407385316298 0.01869698436183238 1.0711495167002871
vn 1.2767407385316298 0.01869698436183238 1.0711495167002871
vn 1.2767407385316298 0.01869698436183238 1.0711495167002871
usemtl 0
f 17/73/73 19/74/74 18/75/75
f 19/76/76 20/77/77 18/78/78
usemtl 0
f 21/79/79 23/80/80 22/81/81
f 23/82/82 24/83/83 22/84/84
usemtl 0
f 21/85/85 22/86/86 18/87/87
f 22/88/88 17/89/89 18/90/90
usemtl 0
f 24/91/91 23/92/92 19/93/93
f 23/94/94 20/95/95 19/96/96
usemtl 0
f 22/97/97 24/98/98 17/99/99
f 24/100/100 19/101/101 17/102/102
usemtl 0
f 18/103/103 20/104/104 21/105/105
f 20/106/106 23/107/107 21/108/108
o lToe
v 0.038524248841024955 -0.07807552488594387 0.012531153075458969
v 0.14781032966318575 -0.05229386027435927 0.00559513776492886
v 0.046371917933283976 -0.1136902946250958 0.003798898713291707
v 0.15565799875544475 -0.08790863001351121 -0.0031371165972384017
v 0.14361338173909505 -0.044294906469847316 -0.030800636250137167
v 0.03432730091693424 -0.07007657108143191 -0.023864620939607055
v 0.15146105083135405 -0.07990967620899926 -0.03953289061230443
v 0.04217497000919326 -0.10569134082058385 -0.03259687530177432
vt 0 1
vt 0 0.046875
vt 0.953125 1
vt 0 0.046875
vt 0.953125 0.046875
vt 0.953125 1
vt 0 1
vt 0 0.046875
vt 0.953125 1
vt 0 0.046875
vt 0.953125 0.046875
vt 0.953125 1
vt 0.953125 1
vt 0 1
vt 0.953125 0.046875
vt 0 1
vt 0 0.046875
vt 0.953125 0.046875
vt 0 0.046875
vt 0.953125 0.046875
vt 0 1
vt 0.953125 0.046875
vt 0.953125 1
vt 0 1
vt 0 1
vt 0 0.046875
vt 0.953125 1
vt 0 0.046875
vt 0.953125 0.046875
vt 0.953125 1
vt 0 1
vt 0 0.046875
vt 0.953125 1
vt 0 0.046875
vt 0.953125 0.046875
vt 0.953125 1
vn 0.1865310188484761 -0.3555090579783091 1.6175899562251557
vn 0.1865310188484761 -0.3555090579783091 1.6175899562251557
vn 0.1865310188484761 -0.3555090579783091 1.6175899562251557
vn 0.1865310188484761 -0.3555090579783091 1.6175899562251557
vn 0.1865310188484761 -0.3555090579783091 1.6175899562251557
vn 0.1865310188484761 -0.3555090579783091 1.6175899562251557
vn -0.1865310188484761 0.3555090579783091 -1.6175899562251557
vn -0.1865310188484761 0.3555090579783091 -1.6175899562251557
vn -0.1865310188484761 0.3555090579783091 -1.6175899562251557
vn -0.1865310188484761 0.3555090579783091 -1.6175899562251557
vn -0.1865310188484761 0.3555090579783091 -1.6175899562251557
vn -0.1865310188484761 0.3555090579783091 -1.6175899562251557
vn -0.34878529298928973 1.5828786550734204 0.38810019387410055
vn -0.34878529298928973 1.5828786550734204 0.38810019387410055
vn -0.34878529298928973 1.5828786550734204 0.38810019387410055
vn -0.34878529298928973 1.5828786550734204 0.38810019387410055
vn -0.34878529298928973 1.5828786550734204 0.38810019387410055
vn -0.34878529298928973 1.5828786550734204 0.38810019387410055
vn 0.34878529298928973 -1.5828786550734204 -0.38810019387410055
vn 0.34878529298928973 -1.5828786550734204 -0.38810019387410055
vn 0.34878529298928973 -1.5828786550734204 -0.38810019387410055
vn 0.34878529298928973 -1.5828786550734204 -0.38810019387410055
vn 0.34878529298928973 -1.5828786550734204 -0.38810019387410055
vn 0.34878529298928973 -1.5828786550734204 -0.38810019387410055
vn -1.6190530492171968 -0.3819505868382902 0.1027557823782238
vn -1.6190530492171968 -0.3819505868382902 0.1027557823782238
vn -1.6190530492171968 -0.3819505868382902 0.1027557823782238
vn -1.6190530492171968 -0.3819505868382902 0.1027557823782238
vn -1.6190530492171968 -0.3819505868382902 0.1027557823782238
vn -1.6190530492171968 -0.3819505868382902 0.1027557823782238
vn 1.6190530492171968 0.3819505868382902 -0.1027557823782238
vn 1.6190530492171968 0.3819505868382902 -0.1027557823782238
vn 1.6190530492171968 0.3819505868382902 -0.1027557823782238
vn 1.6190530492171968 0.3819505868382902 -0.1027557823782238
vn 1.6190530492171968 0.3819505868382902 -0.1027557823782238
vn 1.6190530492171968 0.3819505868382902 -0.1027557823782238
usemtl 0
f 25/109/109 27/110/110 26/111/111
f 27/112/112 28/113/113 26/114/114
usemtl 0
f 29/115/115 31/116/116 30/117/117
f 31/118/118 32/119/119 30/120/120
usemtl 0
f 29/121/121 30/122/122 26/123/123
f 30/124/124 25/125/125 26/126/126
usemtl 0
f 32/127/127 31/128/128 27/129/129
f 31/130/130 28/131/131 27/132/132
usemtl 0
f 30/133/133 32/134/134 25/135/135
f 32/136/136 27/137/137 25/138/138
usemtl 0
f 26/139/139 28/140/140 29/141/141
f 28/142/142 31/143/143 29/144/144
o cube
v -0.0753146193251773 0.16368777104486337 0.051471397225172716
v -0.04658795270821564 0.1641084531930046 0.0755722613509292
v -0.06746695023291827 0.12807300130571142 0.04273914286300548
v -0.038740283615956606 0.12849368345385265 0.06684000698876197
v -0.02379666676607667 0.1758413642962825 0.04820172825151303
v -0.05252333338303833 0.17542068214814127 0.024100864125756544
v -0.015948997673817633 0.14022659455713055 0.039469473889345796
v -0.04467566429077929 0.13980591240898932 0.015368609763589308
vt 0 1
vt 0 0.046875
vt 0.953125 1
vt 0 0.046875
vt 0.953125 0.046875
vt 0.953125 1
vt 0 1
vt 0 0.046875
vt 0.953125 1
vt 0 0.046875
vt 0.953125 0.046875
vt 0.953125 1
vt 0 1
vt 0 0.046875
vt 0.953125 1
vt 0 0.046875
vt 0.953125 0.046875
vt 0.953125 1
vt 0 1
vt 0 0.046875
vt 0.953125 1
vt 0 0.046875
vt 0.953125 0.046875
vt 0.953125 1
vt 0 1
vt 0 0.046875
vt 0.953125 1
vt 0 0.046875
vt 0.953125 0.046875
vt 0.953125 1
vt 0 1
vt 0 0.046875
vt 0.953125 1
vt 0 0.046875
vt 0.953125 0.046875
vt 0.953125 1
vn -1.0129460418728438 -0.5214627157012401 1.2164681377518294
vn -1.0129460418728438 -0.5214627157012401 1.2164681377518294
vn -1.0129460418728438 -0.5214627157012401 1.2164681377518294
vn -1.0129460418728438 -0.5214627157012401 1.2164681377518294
vn -1.0129460418728438 -0.5214627157012401 1.2164681377518294
vn -1.0129460418728438 -0.5214627157012401 1.2164681377518294
vn 1.0129460418728438 0.5214627157012401 -1.2164681377518294
vn 1.0129460418728438 0.5214627157012401 -1.2164681377518294
vn 1.0129460418728438 0.5214627157012401 -1.2164681377518294
vn 1.0129460418728438 0.5214627157012401 -1.2164681377518294
vn 1.0129460418728438 0.5214627157012401 -1.2164681377518294
vn 1.0129460418728438 0.5214627157012401 -1.2164681377518294
vn -0.34878529298928973 1.5828786550734202 0.38810019387410055
vn -0.34878529298928973 1.5828786550734202 0.38810019387410055
vn -0.34878529298928973 1.5828786550734202 0.38810019387410055
vn -0.34878529298928973 1.5828786550734202 0.38810019387410055
vn -0.34878529298928973 1.5828786550734202 0.38810019387410055
vn -0.34878529298928973 1.5828786550734202 0.38810019387410055
vn 0.34878529298928973 -1.5828786550734202 -0.38810019387410055
vn 0.34878529298928973 -1.5828786550734202 -0.38810019387410055
vn 0.34878529298928973 -1.5828786550734202 -0.38810019387410055
vn 0.34878529298928973 -1.5828786550734202 -0.38810019387410055
vn 0.34878529298928973 -1.5828786550734202 -0.38810019387410055
vn 0.34878529298928973 -1.5828786550734202 -0.38810019387410055
vn -1.2767407385316298 -0.01869698436183238 -1.0711495167002871
vn -1.2767407385316298 -0.01869698436183238 -1.0711495167002871
vn -1.2767407385316298 -0.01869698436183238 -1.0711495167002871
vn -1.2767407385316298 -0.01869698436183238 -1.0711495167002871
vn -1.2767407385316298 -0.01869698436183238 -1.0711495167002871
vn -1.2767407385316298 -0.01869698436183238 -1.0711495167002871
vn 1.2767407385316298 0.01869698436183238 1.0711495167002871
vn 1.2767407385316298 0.01869698436183238 1.0711495167002871
vn 1.2767407385316298 0.01869698436183238 1.0711495167002871
vn 1.2767407385316298 0.01869698436183238 1.0711495167002871
vn 1.2767407385316298 0.01869698436183238 1.0711495167002871
vn 1.2767407385316298 0.01869698436183238 1.0711495167002871
usemtl 0
f 33/145/145 35/146/146 34/147/147
f 35/148/148 36/149/149 34/150/150
usemtl 0
f 37/151/151 39/152/152 38/153/153
f 39/154/154 40/155/155 38/156/156
usemtl 0
f 37/157/157 38/158/158 34/159/159
f 38/160/160 33/161/161 34/162/162
usemtl 0
f 40/163/163 39/164/164 35/165/165
f 39/166/166 36/167/167 35/168/168
usemtl 0
f 38/169/169 40/170/170 33/171/171
f 40/172/172 35/173/173 33/174/174
usemtl 0
f 34/175/175 36/176/176 37/177/177
f 36/178/178 39/179/179 37/180/180
