{
    "boxShadow": "{{appsmith.theme.boxShadow.appBoxShadow}}",
    "borderColor": "#E0DEDE",
    "isVisibleDownload": true,
    "iconSVG": "https://appcdn.appsmith.com/static/media/icon.e6911f8bb94dc6c4a102a74740c41763.svg",
    "topRow": 6,
    "isSortable": true,
    "type": "TABLE_WIDGET_V2",
    "inlineEditingSaveOption": "ROW_LEVEL",
    "animateLoading": true,
    "dynamicBindingPathList": [
        {"key": "accentColor"},
        {"key": "borderRadius"},
        {"key": "boxShadow"},
        {"key": "tableData"},
        {"key": "primaryColumns.id.computedValue"},
        {"key": "primaryColumns.gender.computedValue"},
        {"key": "primaryColumns.latitude.computedValue"},
        {"key": "primaryColumns.longitude.computedValue"},
        {"key": "primaryColumns.dob.computedValue"},
        {"key": "primaryColumns.email.computedValue"},
        {"key": "primaryColumns.image.computedValue"},
        {"key": "primaryColumns.country.computedValue"},
        {"key": "primaryColumns.name.computedValue"},
        {"key": "primaryColumns.created_at.computedValue"},
        {"key": "primaryColumns.updated_at.computedValue"},
        {"key": "primaryColumns.phone.computedValue"}
    ],
    "needsHeightForContent": true,
    "leftColumn": 1,
    "delimiter": ",",
    "defaultSelectedRowIndex": 0,
    "flexVerticalAlignment": "start",
    "accentColor": "{{appsmith.theme.colors.primaryColor}}",
    "isVisibleFilters": true,
    "isVisible": true,
    "enableClientSideSearch": true,
    "version": 2,
    "totalRecordsCount": 0,
    "tags": [
        "Suggested",
        "Display"
    ],
    "isLoading": false,
    "childStylesheet": {
        "button": {
            "boxShadow": "none",
            "borderRadius": "{{appsmith.theme.borderRadius.appBorderRadius}}",
            "buttonColor": "{{appsmith.theme.colors.primaryColor}}"
        },
        "iconButton": {
            "boxShadow": "none",
            "borderRadius": "{{appsmith.theme.borderRadius.appBorderRadius}}",
            "buttonColor": "{{appsmith.theme.colors.primaryColor}}"
        },
        "menuButton": {
            "boxShadow": "none",
            "borderRadius": "{{appsmith.theme.borderRadius.appBorderRadius}}",
            "menuColor": "{{appsmith.theme.colors.primaryColor}}"
        },
        "editActions": {
            "saveButtonColor": "{{appsmith.theme.colors.primaryColor}}",
            "saveBorderRadius": "{{appsmith.theme.borderRadius.appBorderRadius}}",
            "discardBorderRadius": "{{appsmith.theme.borderRadius.appBorderRadius}}",
            "discardButtonColor": "{{appsmith.theme.colors.primaryColor}}"
        }
    },
    "borderRadius": "{{appsmith.theme.borderRadius.appBorderRadius}}",
    "columnUpdatedAt": 1699355659063,
    "primaryColumnId": "id",
    "defaultSelectedRowIndices": [0],
    "mobileBottomRow": 34,
    "widgetName": "tbl_userInfo",
    "defaultPageSize": 0,
    "columnOrder": [
        "image",
        "name",
        "email",
        "id",
        "phone",
        "gender",
        "country",
        "latitude",
        "longitude",
        "dob",
        "created_at",
        "updated_at"
    ],
    "dynamicPropertyPathList": [],
    "displayName": "Table",
    "bottomRow": 67,
    "columnWidthMap": {
        "image": 82,
        "id": 60
    },
    "parentRowSpace": 10,
    "hideCard": false,
    "mobileRightColumn": 35,
    "parentColumnSpace": 19.8125,
    "dynamicTriggerPathList": [],
    "borderWidth": "1",
    "primaryColumns": {
        "image": {
            "computedValue": "{{tbl_userInfo.processedTableData.map((currentRow, currentIndex) => ( currentRow[\"image\"]))}}",
            "isEditable": false,
            "alias": "image",
            "enableSort": true,
            "isSaveVisible": true,
            "id": "image",
            "isDisabled": false,
            "allowSameOptionsInNewRow": true,
            "validation": {},
            "isCellVisible": true,
            "isDerived": false,
            "textSize": "0.875rem",
            "allowCellWrapping": false,
            "index": 7,
            "isDiscardVisible": true,
            "isVisible": true,
            "label": "image",
            "columnType": "image",
            "horizontalAlignment": "LEFT",
            "isCellEditable": false,
            "width": 150,
            "enableFilter": true,
            "sticky": "",
            "originalId": "image",
            "verticalAlignment": "CENTER"
        },
        "country": {
            "computedValue": "{{tbl_userInfo.processedTableData.map((currentRow, currentIndex) => ( currentRow[\"country\"]))}}",
            "isEditable": false,
            "alias": "country",
            "enableSort": true,
            "isSaveVisible": true,
            "id": "country",
            "isDisabled": false,
            "allowSameOptionsInNewRow": true,
            "validation": {},
            "isCellVisible": true,
            "isDerived": false,
            "textSize": "0.875rem",
            "allowCellWrapping": false,
            "index": 8,
            "isDiscardVisible": true,
            "isVisible": true,
            "label": "country",
            "columnType": "text",
            "horizontalAlignment": "LEFT",
            "isCellEditable": false,
            "width": 150,
            "enableFilter": true,
            "sticky": "",
            "originalId": "country",
            "verticalAlignment": "CENTER"
        },
        "gender": {
            "computedValue": "{{tbl_userInfo.processedTableData.map((currentRow, currentIndex) => ( currentRow[\"gender\"]))}}",
            "isEditable": false,
            "alias": "gender",
            "enableSort": true,
            "isSaveVisible": true,
            "id": "gender",
            "isDisabled": false,
            "allowSameOptionsInNewRow": true,
            "validation": {},
            "isCellVisible": true,
            "isDerived": false,
            "textSize": "0.875rem",
            "allowCellWrapping": false,
            "index": 1,
            "isDiscardVisible": true,
            "isVisible": true,
            "label": "gender",
            "columnType": "text",
            "horizontalAlignment": "LEFT",
            "isCellEditable": false,
            "width": 150,
            "enableFilter": true,
            "sticky": "",
            "originalId": "gender",
            "verticalAlignment": "CENTER"
        },
        "updated_at": {
            "computedValue": "{{tbl_userInfo.processedTableData.map((currentRow, currentIndex) => ( currentRow[\"updated_at\"]))}}",
            "isEditable": false,
            "alias": "updated_at",
            "enableSort": true,
            "isSaveVisible": true,
            "id": "updated_at",
            "isDisabled": false,
            "allowSameOptionsInNewRow": true,
            "validation": {},
            "isCellVisible": true,
            "isDerived": false,
            "textSize": "0.875rem",
            "allowCellWrapping": false,
            "index": 11,
            "isDiscardVisible": true,
            "isVisible": false,
            "label": "updated_at",
            "columnType": "text",
            "horizontalAlignment": "LEFT",
            "isCellEditable": false,
            "width": 150,
            "enableFilter": true,
            "sticky": "",
            "originalId": "updated_at",
            "verticalAlignment": "CENTER"
        },
        "phone": {
            "computedValue": "{{tbl_userInfo.processedTableData.map((currentRow, currentIndex) => ( currentRow[\"phone\"]))}}",
            "isEditable": false,
            "alias": "phone",
            "enableSort": true,
            "isSaveVisible": true,
            "id": "phone",
            "isDisabled": false,
            "allowSameOptionsInNewRow": true,
            "validation": {},
            "isCellVisible": true,
            "isDerived": false,
            "textSize": "0.875rem",
            "allowCellWrapping": false,
            "index": 5,
            "isDiscardVisible": true,
            "isVisible": true,
            "label": "phone",
            "columnType": "text",
            "horizontalAlignment": "LEFT",
            "isCellEditable": false,
            "width": 150,
            "enableFilter": true,
            "sticky": "",
            "originalId": "phone",
            "verticalAlignment": "CENTER"
        },
        "dob": {
            "computedValue": "{{tbl_userInfo.processedTableData.map((currentRow, currentIndex) => ( currentRow[\"dob\"]))}}",
            "isEditable": false,
            "alias": "dob",
            "enableSort": true,
            "isSaveVisible": true,
            "id": "dob",
            "isDisabled": false,
            "allowSameOptionsInNewRow": true,
            "outputFormat": "LL",
            "validation": {},
            "isCellVisible": true,
            "isDerived": false,
            "textSize": "0.875rem",
            "allowCellWrapping": false,
            "index": 4,
            "isDiscardVisible": true,
            "isVisible": true,
            "label": "dob",
            "inputFormat": "YYYY-MM-DD",
            "columnType": "date",
            "horizontalAlignment": "LEFT",
            "isCellEditable": false,
            "width": 150,
            "enableFilter": true,
            "sticky": "",
            "originalId": "dob",
            "verticalAlignment": "CENTER"
        },
        "latitude": {
            "computedValue": "{{tbl_userInfo.processedTableData.map((currentRow, currentIndex) => ( currentRow[\"latitude\"]))}}",
            "isEditable": false,
            "alias": "latitude",
            "enableSort": true,
            "isSaveVisible": true,
            "id": "latitude",
            "isDisabled": false,
            "allowSameOptionsInNewRow": true,
            "validation": {},
            "isCellVisible": true,
            "isDerived": false,
            "textSize": "0.875rem",
            "allowCellWrapping": false,
            "index": 2,
            "isDiscardVisible": true,
            "isVisible": false,
            "label": "latitude",
            "columnType": "text",
            "horizontalAlignment": "LEFT",
            "isCellEditable": false,
            "width": 150,
            "enableFilter": true,
            "sticky": "",
            "originalId": "latitude",
            "verticalAlignment": "CENTER"
        },
        "name": {
            "computedValue": "{{tbl_userInfo.processedTableData.map((currentRow, currentIndex) => ( currentRow[\"name\"]))}}",
            "isEditable": false,
            "alias": "name",
            "enableSort": true,
            "isSaveVisible": true,
            "id": "name",
            "isDisabled": false,
            "allowSameOptionsInNewRow": true,
            "validation": {},
            "isCellVisible": true,
            "isDerived": false,
            "textSize": "0.875rem",
            "allowCellWrapping": false,
            "index": 9,
            "isDiscardVisible": true,
            "isVisible": true,
            "label": "name",
            "columnType": "text",
            "horizontalAlignment": "LEFT",
            "isCellEditable": false,
            "width": 150,
            "enableFilter": true,
            "sticky": "",
            "originalId": "name",
            "verticalAlignment": "CENTER"
        },
        "created_at": {
            "computedValue": "{{tbl_userInfo.processedTableData.map((currentRow, currentIndex) => ( currentRow[\"created_at\"]))}}",
            "isEditable": false,
            "alias": "created_at",
            "enableSort": true,
            "isSaveVisible": true,
            "id": "created_at",
            "isDisabled": false,
            "allowSameOptionsInNewRow": true,
            "validation": {},
            "isCellVisible": true,
            "isDerived": false,
            "textSize": "0.875rem",
            "allowCellWrapping": false,
            "index": 10,
            "isDiscardVisible": true,
            "isVisible": false,
            "label": "created_at",
            "columnType": "text",
            "horizontalAlignment": "LEFT",
            "isCellEditable": false,
            "width": 150,
            "enableFilter": true,
            "sticky": "",
            "originalId": "created_at",
            "verticalAlignment": "CENTER"
        },
        "id": {
            "computedValue": "{{tbl_userInfo.processedTableData.map((currentRow, currentIndex) => ( currentRow[\"id\"]))}}",
            "isEditable": false,
            "alias": "id",
            "enableSort": true,
            "isSaveVisible": true,
            "id": "id",
            "isDisabled": false,
            "allowSameOptionsInNewRow": true,
            "validation": {},
            "isCellVisible": true,
            "isDerived": false,
            "textSize": "0.875rem",
            "allowCellWrapping": false,
            "index": 0,
            "isDiscardVisible": true,
            "isVisible": false,
            "label": "id",
            "columnType": "number",
            "horizontalAlignment": "LEFT",
            "isCellEditable": false,
            "width": 150,
            "enableFilter": true,
            "sticky": "",
            "originalId": "id",
            "verticalAlignment": "CENTER"
        },
        "email": {
            "computedValue": "{{tbl_userInfo.processedTableData.map((currentRow, currentIndex) => ( currentRow[\"email\"]))}}",
            "isEditable": false,
            "alias": "email",
            "enableSort": true,
            "isSaveVisible": true,
            "id": "email",
            "isDisabled": false,
            "allowSameOptionsInNewRow": true,
            "validation": {},
            "isCellVisible": true,
            "isDerived": false,
            "textSize": "0.875rem",
            "allowCellWrapping": false,
            "index": 6,
            "isDiscardVisible": true,
            "isVisible": true,
            "label": "email",
            "columnType": "text",
            "horizontalAlignment": "LEFT",
            "isCellEditable": false,
            "width": 150,
            "enableFilter": true,
            "sticky": "",
            "originalId": "email",
            "verticalAlignment": "CENTER"
        },
        "longitude": {
            "computedValue": "{{tbl_userInfo.processedTableData.map((currentRow, currentIndex) => ( currentRow[\"longitude\"]))}}",
            "isEditable": false,
            "alias": "longitude",
            "enableSort": true,
            "isSaveVisible": true,
            "id": "longitude",
            "isDisabled": false,
            "allowSameOptionsInNewRow": true,
            "validation": {},
            "isCellVisible": true,
            "isDerived": false,
            "textSize": "0.875rem",
            "allowCellWrapping": false,
            "index": 3,
            "isDiscardVisible": true,
            "isVisible": false,
            "label": "longitude",
            "columnType": "text",
            "horizontalAlignment": "LEFT",
            "isCellEditable": false,
            "width": 150,
            "enableFilter": true,
            "sticky": "",
            "originalId": "longitude",
            "verticalAlignment": "CENTER"
        }
    },
    "key": "gs6c2a0j5x",
    "canFreezeColumn": true,
    "isDeprecated": false,
    "rightColumn": 42,
    "textSize": "0.875rem",
    "widgetId": "xvfpvcg9jd",
    "enableServerSideFiltering": false,
    "minWidth": 450,
    "tableData": "{{getUsers.data}}",
    "label": "Data",
    "searchKey": "",
    "parentId": "0",
    "renderMode": "CANVAS",
    "mobileTopRow": 6,
    "horizontalAlignment": "LEFT",
    "isVisibleSearch": true,
    "responsiveBehavior": "fill",
    "mobileLeftColumn": 1,
    "isVisiblePagination": true,
    "verticalAlignment": "CENTER"
}