{
  "pages": [
    {
      "id": "Page1",
      "isDefault": true
    }
  ],
  "viewMode": false,
  "appIsExample": false,
  "unreadCommentThreads": 0,
  "unpublishedApplicationDetail": {
    "appPositioning": {
      "type": "FIXED"
    }
  },
  "color": "#F5D1D1",
  "icon": "system",
  "unpublishedCustomJSLibs": [],
  "publishedCustomJSLibs": [],
  "evaluationVersion": 2,
  "applicationVersion": 2,
  "collapseInvisibleWidgets": true,
  "isManualUpdate": false,
  "deleted": false
}