{
    "boxShadow": "{{appsmith.theme.boxShadow.appBoxShadow}}",
    "mobileBottomRow": 101,
    "widgetName": "Chart1",
    "allowScroll": false,
    "displayName": "Chart",
    "iconSVG": "/static/media/icon.8eea39845729f7f4bfadeecd3810a09d.svg",
    "searchTags": [
        "graph",
        "visuals",
        "visualisations"
    ],
    "topRow": 67,
    "bottomRow": 99,
    "parentRowSpace": 10,
    "type": "CHART_WIDGET",
    "hideCard": false,
    "mobileRightColumn": 20,
    "chartData": {"e42t1h8lqd": {
        "data": [
            {
                "x": "Product1",
                "y": 20000
            },
            {
                "x": "Product2",
                "y": 22000
            },
            {
                "x": "Product3",
                "y": 32000
            }
        ],
        "seriesName": "2023"
    }},
    "animateLoading": true,
    "fontFamily": "{{appsmith.theme.fontFamily.appFont}}",
    "parentColumnSpace": 19.21875,
    "dynamicTriggerPathList": [],
    "dynamicBindingPathList": [
        {"key": "customEChartConfig"},
        {"key": "borderRadius"},
        {"key": "boxShadow"},
        {"key": "accentColor"},
        {"key": "fontFamily"}
    ],
    "leftColumn": 1,
    "customFusionChartConfig": {
        "type": "column2d",
        "dataSource": {
            "data": [
                {
                    "label": "Product1",
                    "value": 20000
                },
                {
                    "label": "Product2",
                    "value": 22000
                },
                {
                    "label": "Product3",
                    "value": 32000
                }
            ],
            "chart": {
                "legendIconSides": "4",
                "canvasPadding": "0",
                "captionAlignment": "center",
                "yAxisNameFontSize": "14",
                "caption": "Sales Report",
                "labelFontColor": "#716e6e",
                "chartLeftMargin": "20",
                "captionFontSize": "24",
                "chartTopMargin": "10",
                "theme": "fusion",
                "legendIconAlpha": "100",
                "chartBottomMargin": "10",
                "labelFontSize": "12",
                "xAxisNameFontColor": "#716e6e",
                "yAxisNameFontColor": "#716e6e",
                "captionFontColor": "#231F20",
                "yAxisValueFontColor": "#716e6e",
                "captionPadding": "20",
                "yAxisName": "Revenue($)",
                "legendIconBgAlpha": "100",
                "xAxisName": "Product Line",
                "alignCaptionWithCanvas": 1,
                "chartRightMargin": "40",
                "legendPosition": "top",
                "xAxisNameFontSize": "14",
                "yAxisValueFontSize": "12"
            }
        }
    },
    "customEChartConfig": "{{\n{\n  \"dataset\": {\n    \"source\": [\n      [\n        \"Day\",\n        \"Baidu\",\n        \"Google\",\n        \"Bing\"\n      ],\n      [\n        \"Mon\",\n        620,\n        120,\n        60\n      ],\n      [\n        \"Tue\",\n        732,\n        132,\n        72\n      ],\n      [\n        \"Wed\",\n        701,\n        101,\n        71\n      ],\n      [\n        \"Thu\",\n        734,\n        134,\n        74\n      ],\n      [\n        \"Fri\",\n        1090,\n        290,\n        190\n      ],\n      [\n        \"Sat\",\n        1130,\n        230,\n        130\n      ],\n      [\n        \"Sun\",\n        1120,\n        220,\n        110\n      ]\n    ]\n  },\n  \"tooltip\": {\n    \"trigger\": \"axis\",\n    \"axisPointer\": {\n      \"type\": \"shadow\"\n    }\n  },\n  \"title\": {\n    \"text\": \"Search Engine Usage\",\n    \"left\": \"center\",\n    \"textStyle\": {\n      \"width\": 200,\n      \"overflow\": \"truncate\"\n    }\n  },\n  \"legend\": {\n    \"top\": 40,\n    \"type\": \"scroll\"\n  },\n  \"grid\": {\n    \"left\": 15,\n    \"right\": 15,\n    \"bottom\": 30,\n    \"top\": 100,\n    \"containLabel\": true\n  },\n  \"xAxis\": [\n    {\n      \"type\": \"category\"\n    }\n  ],\n  \"yAxis\": [\n    {\n      \"type\": \"value\"\n    }\n  ],\n  \"series\": [\n    {\n      \"type\": \"bar\",\n      \"stack\": \"Search Engine\"\n    },\n    {\n      \"type\": \"bar\",\n      \"stack\": \"Search Engine\"\n    },\n    {\n      \"type\": \"bar\",\n      \"stack\": \"Search Engine\"\n    }\n  ]\n}\n}}",
    "flexVerticalAlignment": "start",
    "showDataPointLabel": false,
    "key": "05ocx3jdbn",
    "isDeprecated": false,
    "rightColumn": 21,
    "widgetId": "urn8lbeki1",
    "accentColor": "{{appsmith.theme.colors.primaryColor}}",
    "minWidth": 450,
    "isVisible": true,
    "version": 1,
    "parentId": "0",
    "labelOrientation": "auto",
    "tags": ["Display"],
    "renderMode": "CANVAS",
    "isLoading": false,
    "mobileTopRow": 69,
    "responsiveBehavior": "fill",
    "yAxisName": "Revenue($)",
    "chartName": "Sales Report",
    "borderRadius": "{{appsmith.theme.borderRadius.appBorderRadius}}",
    "mobileLeftColumn": 0,
    "xAxisName": "Product Line",
    "chartType": "CUSTOM_ECHART"
}