/Users/ahmed/Downloads/acmeair-monolithic-java-master/src/main/java/com/acmeair/config/AcmeAirConfiguration.java
/Users/ahmed/Downloads/acmeair-monolithic-java-master/src/main/java/com/acmeair/config/LoaderREST.java
/Users/ahmed/Downloads/acmeair-monolithic-java-master/src/main/java/com/acmeair/web/dto/AddressInfo.java
/Users/ahmed/Downloads/acmeair-monolithic-java-master/src/main/java/com/acmeair/web/RESTCookieSessionFilter.java
/Users/ahmed/Downloads/acmeair-monolithic-java-master/src/main/java/com/acmeair/loader/BookingLoader.java
/Users/ahmed/Downloads/acmeair-monolithic-java-master/src/main/java/com/acmeair/web/FlightsREST.java
/Users/ahmed/Downloads/acmeair-monolithic-java-master/src/main/java/com/acmeair/service/FlightService.java
/Users/ahmed/Downloads/acmeair-monolithic-java-master/src/main/java/com/acmeair/web/AppConfig.java
/Users/ahmed/Downloads/acmeair-monolithic-java-master/src/main/java/com/acmeair/service/BookingService.java
/Users/ahmed/Downloads/acmeair-monolithic-java-master/src/main/java/com/acmeair/AcmeAirConstants.java
/Users/ahmed/Downloads/acmeair-monolithic-java-master/src/main/java/com/acmeair/web/DateParam.java
/Users/ahmed/Downloads/acmeair-monolithic-java-master/src/main/java/com/acmeair/web/SupportWebSocket.java
/Users/ahmed/Downloads/acmeair-monolithic-java-master/src/main/java/com/acmeair/web/AcmeAirApp.java
/Users/ahmed/Downloads/acmeair-monolithic-java-master/src/main/java/com/acmeair/service/AuthService.java
/Users/ahmed/Downloads/acmeair-monolithic-java-master/src/main/java/com/acmeair/service/ServiceLocator.java
/Users/ahmed/Downloads/acmeair-monolithic-java-master/src/main/java/com/acmeair/mongo/ConnectionManager.java
/Users/ahmed/Downloads/acmeair-monolithic-java-master/src/main/java/com/acmeair/service/KeyGenerator.java
/Users/ahmed/Downloads/acmeair-monolithic-java-master/src/main/java/com/acmeair/loader/SessionLoader.java
/Users/ahmed/Downloads/acmeair-monolithic-java-master/src/main/java/com/acmeair/service/DataService.java
/Users/ahmed/Downloads/acmeair-monolithic-java-master/src/main/java/com/acmeair/AirportCodeMapping.java
/Users/ahmed/Downloads/acmeair-monolithic-java-master/src/main/java/com/acmeair/util/ServiceRegister.java
/Users/ahmed/Downloads/acmeair-monolithic-java-master/src/main/java/com/acmeair/loader/Loader.java
/Users/ahmed/Downloads/acmeair-monolithic-java-master/src/main/java/com/acmeair/web/LoginREST.java
/Users/ahmed/Downloads/acmeair-monolithic-java-master/src/main/java/com/acmeair/mongo/services/CustomerServiceImpl.java
/Users/ahmed/Downloads/acmeair-monolithic-java-master/src/main/java/com/acmeair/mongo/services/BookingServiceImpl.java
/Users/ahmed/Downloads/acmeair-monolithic-java-master/src/main/java/com/acmeair/web/BookingsREST.java
/Users/ahmed/Downloads/acmeair-monolithic-java-master/src/main/java/com/acmeair/loader/FlightLoader.java
/Users/ahmed/Downloads/acmeair-monolithic-java-master/src/main/java/com/acmeair/loader/CustomerLoader.java
/Users/ahmed/Downloads/acmeair-monolithic-java-master/src/main/java/com/acmeair/mongo/MongoConstants.java
/Users/ahmed/Downloads/acmeair-monolithic-java-master/src/main/java/com/acmeair/service/CustomerService.java
/Users/ahmed/Downloads/acmeair-monolithic-java-master/src/main/java/com/acmeair/mongo/services/FlightServiceImpl.java
/Users/ahmed/Downloads/acmeair-monolithic-java-master/src/main/java/com/acmeair/util/Util.java
/Users/ahmed/Downloads/acmeair-monolithic-java-master/src/main/java/com/acmeair/service/TransactionService.java
/Users/ahmed/Downloads/acmeair-monolithic-java-master/src/main/java/com/acmeair/mongo/services/AuthServiceImpl.java
/Users/ahmed/Downloads/acmeair-monolithic-java-master/src/main/java/com/acmeair/web/CustomerREST.java
/Users/ahmed/Downloads/acmeair-monolithic-java-master/src/main/java/com/acmeair/web/dto/CustomerInfo.java
