com/acmeair/service/DataService.class
com/acmeair/loader/BookingLoader.class
com/acmeair/mongo/services/CustomerServiceImpl.class
com/acmeair/web/CustomerREST.class
com/acmeair/loader/SessionLoader.class
com/acmeair/loader/FlightLoader.class
com/acmeair/web/AppConfig.class
com/acmeair/web/LoginREST.class
com/acmeair/web/FlightsREST.class
com/acmeair/service/TransactionService.class
com/acmeair/service/AuthService.class
com/acmeair/web/RESTCookieSessionFilter.class
com/acmeair/web/SupportWebSocket.class
com/acmeair/web/AcmeAirApp.class
com/acmeair/config/AcmeAirConfiguration.class
com/acmeair/mongo/MongoConstants.class
com/acmeair/service/KeyGenerator.class
com/acmeair/mongo/services/AuthServiceImpl.class
com/acmeair/util/ServiceRegister$1.class
com/acmeair/service/ServiceLocator.class
com/acmeair/AirportCodeMapping.class
com/acmeair/loader/CustomerLoader.class
com/acmeair/service/FlightService.class
com/acmeair/web/dto/CustomerInfo.class
com/acmeair/loader/Loader.class
com/acmeair/util/Util$Not200Exception.class
com/acmeair/web/DateParam.class
com/acmeair/service/ServiceLocator$1.class
com/acmeair/mongo/ConnectionManager.class
com/acmeair/service/BookingService.class
com/acmeair/web/dto/AddressInfo.class
com/acmeair/mongo/services/FlightServiceImpl.class
com/acmeair/service/CustomerService.class
com/acmeair/config/AcmeAirConfiguration$ServiceData.class
com/acmeair/util/Util.class
com/acmeair/web/BookingsREST.class
com/acmeair/mongo/services/BookingServiceImpl.class
com/acmeair/AcmeAirConstants.class
com/acmeair/service/ServiceLocator$2.class
com/acmeair/util/ServiceRegister.class
com/acmeair/config/LoaderREST.class
