; ModuleID = 'compressed_assemblies.x86_64.ll'
source_filename = "compressed_assemblies.x86_64.ll"
target datalayout = "e-m:e-p270:32:32-p271:32:32-p272:64:64-i64:64-f80:128-n8:16:32:64-S128"
target triple = "x86_64-unknown-linux-android21"

%struct.CompressedAssemblies = type {
	i32, ; uint32_t count
	ptr ; CompressedAssemblyDescriptor descriptors
}

%struct.CompressedAssemblyDescriptor = type {
	i32, ; uint32_t uncompressed_file_size
	i8, ; bool loaded
	ptr ; uint8_t data
}

@compressed_assemblies = dso_local local_unnamed_addr global %struct.CompressedAssemblies zeroinitializer, align 8

; Metadata
!llvm.module.flags = !{!0, !1}
!0 = !{i32 1, !"wchar_size", i32 4}
!1 = !{i32 7, !"PIC Level", i32 2}
!llvm.ident = !{!2}
!2 = !{!"Xamarin.Android remotes/origin/release/8.0.1xx @ f1b7113872c8db3dfee70d11925e81bb752dc8d0"}
!3 = !{!4, !4, i64 0}
!4 = !{!"any pointer", !5, i64 0}
!5 = !{!"omnipotent char", !6, i64 0}
!6 = !{!"Simple C++ TBAA"}
