; ModuleID = 'compressed_assemblies.arm64-v8a.ll'
source_filename = "compressed_assemblies.arm64-v8a.ll"
target datalayout = "e-m:e-i8:8:32-i16:16:32-i64:64-i128:128-n32:64-S128"
target triple = "aarch64-unknown-linux-android21"

%struct.CompressedAssemblies = type {
	i32, ; uint32_t count
	ptr ; CompressedAssemblyDescriptor descriptors
}

%struct.CompressedAssemblyDescriptor = type {
	i32, ; uint32_t uncompressed_file_size
	i8, ; bool loaded
	ptr ; uint8_t data
}

@compressed_assemblies = dso_local local_unnamed_addr global %struct.CompressedAssemblies {
	i32 130, ; uint32_t count (0x82)
	ptr @compressed_assembly_descriptors; CompressedAssemblyDescriptor* descriptors
}, align 8

@compressed_assembly_descriptors = internal dso_local global [130 x %struct.CompressedAssemblyDescriptor] [
	%struct.CompressedAssemblyDescriptor {
		i32 151040, ; uint32_t uncompressed_file_size (0x24e00)
		i8 0, ; bool loaded
		ptr @__compressedAssemblyData_0; uint8_t* data (0x0)
	}, ; 0
	%struct.CompressedAssemblyDescriptor {
		i32 5120, ; uint32_t uncompressed_file_size (0x1400)
		i8 0, ; bool loaded
		ptr @__compressedAssemblyData_1; uint8_t* data (0x0)
	}, ; 1
	%struct.CompressedAssemblyDescriptor {
		i32 12800, ; uint32_t uncompressed_file_size (0x3200)
		i8 0, ; bool loaded
		ptr @__compressedAssemblyData_2; uint8_t* data (0x0)
	}, ; 2
	%struct.CompressedAssemblyDescriptor {
		i32 20992, ; uint32_t uncompressed_file_size (0x5200)
		i8 0, ; bool loaded
		ptr @__compressedAssemblyData_3; uint8_t* data (0x0)
	}, ; 3
	%struct.CompressedAssemblyDescriptor {
		i32 40960, ; uint32_t uncompressed_file_size (0xa000)
		i8 0, ; bool loaded
		ptr @__compressedAssemblyData_4; uint8_t* data (0x0)
	}, ; 4
	%struct.CompressedAssemblyDescriptor {
		i32 16384, ; uint32_t uncompressed_file_size (0x4000)
		i8 0, ; bool loaded
		ptr @__compressedAssemblyData_5; uint8_t* data (0x0)
	}, ; 5
	%struct.CompressedAssemblyDescriptor {
		i32 15872, ; uint32_t uncompressed_file_size (0x3e00)
		i8 0, ; bool loaded
		ptr @__compressedAssemblyData_6; uint8_t* data (0x0)
	}, ; 6
	%struct.CompressedAssemblyDescriptor {
		i32 14848, ; uint32_t uncompressed_file_size (0x3a00)
		i8 0, ; bool loaded
		ptr @__compressedAssemblyData_7; uint8_t* data (0x0)
	}, ; 7
	%struct.CompressedAssemblyDescriptor {
		i32 7680, ; uint32_t uncompressed_file_size (0x1e00)
		i8 0, ; bool loaded
		ptr @__compressedAssemblyData_8; uint8_t* data (0x0)
	}, ; 8
	%struct.CompressedAssemblyDescriptor {
		i32 55808, ; uint32_t uncompressed_file_size (0xda00)
		i8 0, ; bool loaded
		ptr @__compressedAssemblyData_9; uint8_t* data (0x0)
	}, ; 9
	%struct.CompressedAssemblyDescriptor {
		i32 125888, ; uint32_t uncompressed_file_size (0x1ebc0)
		i8 0, ; bool loaded
		ptr @__compressedAssemblyData_10; uint8_t* data (0x0)
	}, ; 10
	%struct.CompressedAssemblyDescriptor {
		i32 1702320, ; uint32_t uncompressed_file_size (0x19f9b0)
		i8 0, ; bool loaded
		ptr @__compressedAssemblyData_11; uint8_t* data (0x0)
	}, ; 11
	%struct.CompressedAssemblyDescriptor {
		i32 42496, ; uint32_t uncompressed_file_size (0xa600)
		i8 0, ; bool loaded
		ptr @__compressedAssemblyData_12; uint8_t* data (0x0)
	}, ; 12
	%struct.CompressedAssemblyDescriptor {
		i32 204832, ; uint32_t uncompressed_file_size (0x32020)
		i8 0, ; bool loaded
		ptr @__compressedAssemblyData_13; uint8_t* data (0x0)
	}, ; 13
	%struct.CompressedAssemblyDescriptor {
		i32 634800, ; uint32_t uncompressed_file_size (0x9afb0)
		i8 0, ; bool loaded
		ptr @__compressedAssemblyData_14; uint8_t* data (0x0)
	}, ; 14
	%struct.CompressedAssemblyDescriptor {
		i32 18976, ; uint32_t uncompressed_file_size (0x4a20)
		i8 0, ; bool loaded
		ptr @__compressedAssemblyData_15; uint8_t* data (0x0)
	}, ; 15
	%struct.CompressedAssemblyDescriptor {
		i32 1705472, ; uint32_t uncompressed_file_size (0x1a0600)
		i8 0, ; bool loaded
		ptr @__compressedAssemblyData_16; uint8_t* data (0x0)
	}, ; 16
	%struct.CompressedAssemblyDescriptor {
		i32 6656, ; uint32_t uncompressed_file_size (0x1a00)
		i8 0, ; bool loaded
		ptr @__compressedAssemblyData_17; uint8_t* data (0x0)
	}, ; 17
	%struct.CompressedAssemblyDescriptor {
		i32 51200, ; uint32_t uncompressed_file_size (0xc800)
		i8 0, ; bool loaded
		ptr @__compressedAssemblyData_18; uint8_t* data (0x0)
	}, ; 18
	%struct.CompressedAssemblyDescriptor {
		i32 1525248, ; uint32_t uncompressed_file_size (0x174600)
		i8 0, ; bool loaded
		ptr @__compressedAssemblyData_19; uint8_t* data (0x0)
	}, ; 19
	%struct.CompressedAssemblyDescriptor {
		i32 172032, ; uint32_t uncompressed_file_size (0x2a000)
		i8 0, ; bool loaded
		ptr @__compressedAssemblyData_20; uint8_t* data (0x0)
	}, ; 20
	%struct.CompressedAssemblyDescriptor {
		i32 13824, ; uint32_t uncompressed_file_size (0x3600)
		i8 0, ; bool loaded
		ptr @__compressedAssemblyData_21; uint8_t* data (0x0)
	}, ; 21
	%struct.CompressedAssemblyDescriptor {
		i32 9216, ; uint32_t uncompressed_file_size (0x2400)
		i8 0, ; bool loaded
		ptr @__compressedAssemblyData_22; uint8_t* data (0x0)
	}, ; 22
	%struct.CompressedAssemblyDescriptor {
		i32 19968, ; uint32_t uncompressed_file_size (0x4e00)
		i8 0, ; bool loaded
		ptr @__compressedAssemblyData_23; uint8_t* data (0x0)
	}, ; 23
	%struct.CompressedAssemblyDescriptor {
		i32 10240, ; uint32_t uncompressed_file_size (0x2800)
		i8 0, ; bool loaded
		ptr @__compressedAssemblyData_24; uint8_t* data (0x0)
	}, ; 24
	%struct.CompressedAssemblyDescriptor {
		i32 83456, ; uint32_t uncompressed_file_size (0x14600)
		i8 0, ; bool loaded
		ptr @__compressedAssemblyData_25; uint8_t* data (0x0)
	}, ; 25
	%struct.CompressedAssemblyDescriptor {
		i32 4608, ; uint32_t uncompressed_file_size (0x1200)
		i8 0, ; bool loaded
		ptr @__compressedAssemblyData_26; uint8_t* data (0x0)
	}, ; 26
	%struct.CompressedAssemblyDescriptor {
		i32 10752, ; uint32_t uncompressed_file_size (0x2a00)
		i8 0, ; bool loaded
		ptr @__compressedAssemblyData_27; uint8_t* data (0x0)
	}, ; 27
	%struct.CompressedAssemblyDescriptor {
		i32 14848, ; uint32_t uncompressed_file_size (0x3a00)
		i8 0, ; bool loaded
		ptr @__compressedAssemblyData_28; uint8_t* data (0x0)
	}, ; 28
	%struct.CompressedAssemblyDescriptor {
		i32 25600, ; uint32_t uncompressed_file_size (0x6400)
		i8 0, ; bool loaded
		ptr @__compressedAssemblyData_29; uint8_t* data (0x0)
	}, ; 29
	%struct.CompressedAssemblyDescriptor {
		i32 9728, ; uint32_t uncompressed_file_size (0x2600)
		i8 0, ; bool loaded
		ptr @__compressedAssemblyData_30; uint8_t* data (0x0)
	}, ; 30
	%struct.CompressedAssemblyDescriptor {
		i32 4096, ; uint32_t uncompressed_file_size (0x1000)
		i8 0, ; bool loaded
		ptr @__compressedAssemblyData_31; uint8_t* data (0x0)
	}, ; 31
	%struct.CompressedAssemblyDescriptor {
		i32 19968, ; uint32_t uncompressed_file_size (0x4e00)
		i8 0, ; bool loaded
		ptr @__compressedAssemblyData_32; uint8_t* data (0x0)
	}, ; 32
	%struct.CompressedAssemblyDescriptor {
		i32 29696, ; uint32_t uncompressed_file_size (0x7400)
		i8 0, ; bool loaded
		ptr @__compressedAssemblyData_33; uint8_t* data (0x0)
	}, ; 33
	%struct.CompressedAssemblyDescriptor {
		i32 343552, ; uint32_t uncompressed_file_size (0x53e00)
		i8 0, ; bool loaded
		ptr @__compressedAssemblyData_34; uint8_t* data (0x0)
	}, ; 34
	%struct.CompressedAssemblyDescriptor {
		i32 34816, ; uint32_t uncompressed_file_size (0x8800)
		i8 0, ; bool loaded
		ptr @__compressedAssemblyData_35; uint8_t* data (0x0)
	}, ; 35
	%struct.CompressedAssemblyDescriptor {
		i32 6656, ; uint32_t uncompressed_file_size (0x1a00)
		i8 0, ; bool loaded
		ptr @__compressedAssemblyData_36; uint8_t* data (0x0)
	}, ; 36
	%struct.CompressedAssemblyDescriptor {
		i32 119296, ; uint32_t uncompressed_file_size (0x1d200)
		i8 0, ; bool loaded
		ptr @__compressedAssemblyData_37; uint8_t* data (0x0)
	}, ; 37
	%struct.CompressedAssemblyDescriptor {
		i32 34816, ; uint32_t uncompressed_file_size (0x8800)
		i8 0, ; bool loaded
		ptr @__compressedAssemblyData_38; uint8_t* data (0x0)
	}, ; 38
	%struct.CompressedAssemblyDescriptor {
		i32 6144, ; uint32_t uncompressed_file_size (0x1800)
		i8 0, ; bool loaded
		ptr @__compressedAssemblyData_39; uint8_t* data (0x0)
	}, ; 39
	%struct.CompressedAssemblyDescriptor {
		i32 4608, ; uint32_t uncompressed_file_size (0x1200)
		i8 0, ; bool loaded
		ptr @__compressedAssemblyData_40; uint8_t* data (0x0)
	}, ; 40
	%struct.CompressedAssemblyDescriptor {
		i32 15872, ; uint32_t uncompressed_file_size (0x3e00)
		i8 0, ; bool loaded
		ptr @__compressedAssemblyData_41; uint8_t* data (0x0)
	}, ; 41
	%struct.CompressedAssemblyDescriptor {
		i32 67584, ; uint32_t uncompressed_file_size (0x10800)
		i8 0, ; bool loaded
		ptr @__compressedAssemblyData_42; uint8_t* data (0x0)
	}, ; 42
	%struct.CompressedAssemblyDescriptor {
		i32 378368, ; uint32_t uncompressed_file_size (0x5c600)
		i8 0, ; bool loaded
		ptr @__compressedAssemblyData_43; uint8_t* data (0x0)
	}, ; 43
	%struct.CompressedAssemblyDescriptor {
		i32 8192, ; uint32_t uncompressed_file_size (0x2000)
		i8 0, ; bool loaded
		ptr @__compressedAssemblyData_44; uint8_t* data (0x0)
	}, ; 44
	%struct.CompressedAssemblyDescriptor {
		i32 12288, ; uint32_t uncompressed_file_size (0x3000)
		i8 0, ; bool loaded
		ptr @__compressedAssemblyData_45; uint8_t* data (0x0)
	}, ; 45
	%struct.CompressedAssemblyDescriptor {
		i32 12800, ; uint32_t uncompressed_file_size (0x3200)
		i8 0, ; bool loaded
		ptr @__compressedAssemblyData_46; uint8_t* data (0x0)
	}, ; 46
	%struct.CompressedAssemblyDescriptor {
		i32 4096, ; uint32_t uncompressed_file_size (0x1000)
		i8 0, ; bool loaded
		ptr @__compressedAssemblyData_47; uint8_t* data (0x0)
	}, ; 47
	%struct.CompressedAssemblyDescriptor {
		i32 11264, ; uint32_t uncompressed_file_size (0x2c00)
		i8 0, ; bool loaded
		ptr @__compressedAssemblyData_48; uint8_t* data (0x0)
	}, ; 48
	%struct.CompressedAssemblyDescriptor {
		i32 4608, ; uint32_t uncompressed_file_size (0x1200)
		i8 0, ; bool loaded
		ptr @__compressedAssemblyData_49; uint8_t* data (0x0)
	}, ; 49
	%struct.CompressedAssemblyDescriptor {
		i32 4608, ; uint32_t uncompressed_file_size (0x1200)
		i8 0, ; bool loaded
		ptr @__compressedAssemblyData_50; uint8_t* data (0x0)
	}, ; 50
	%struct.CompressedAssemblyDescriptor {
		i32 4096, ; uint32_t uncompressed_file_size (0x1000)
		i8 0, ; bool loaded
		ptr @__compressedAssemblyData_51; uint8_t* data (0x0)
	}, ; 51
	%struct.CompressedAssemblyDescriptor {
		i32 119296, ; uint32_t uncompressed_file_size (0x1d200)
		i8 0, ; bool loaded
		ptr @__compressedAssemblyData_52; uint8_t* data (0x0)
	}, ; 52
	%struct.CompressedAssemblyDescriptor {
		i32 50176, ; uint32_t uncompressed_file_size (0xc400)
		i8 0, ; bool loaded
		ptr @__compressedAssemblyData_53; uint8_t* data (0x0)
	}, ; 53
	%struct.CompressedAssemblyDescriptor {
		i32 14336, ; uint32_t uncompressed_file_size (0x3800)
		i8 0, ; bool loaded
		ptr @__compressedAssemblyData_54; uint8_t* data (0x0)
	}, ; 54
	%struct.CompressedAssemblyDescriptor {
		i32 504320, ; uint32_t uncompressed_file_size (0x7b200)
		i8 0, ; bool loaded
		ptr @__compressedAssemblyData_55; uint8_t* data (0x0)
	}, ; 55
	%struct.CompressedAssemblyDescriptor {
		i32 31232, ; uint32_t uncompressed_file_size (0x7a00)
		i8 0, ; bool loaded
		ptr @__compressedAssemblyData_56; uint8_t* data (0x0)
	}, ; 56
	%struct.CompressedAssemblyDescriptor {
		i32 15360, ; uint32_t uncompressed_file_size (0x3c00)
		i8 0, ; bool loaded
		ptr @__compressedAssemblyData_57; uint8_t* data (0x0)
	}, ; 57
	%struct.CompressedAssemblyDescriptor {
		i32 17920, ; uint32_t uncompressed_file_size (0x4600)
		i8 0, ; bool loaded
		ptr @__compressedAssemblyData_58; uint8_t* data (0x0)
	}, ; 58
	%struct.CompressedAssemblyDescriptor {
		i32 69120, ; uint32_t uncompressed_file_size (0x10e00)
		i8 0, ; bool loaded
		ptr @__compressedAssemblyData_59; uint8_t* data (0x0)
	}, ; 59
	%struct.CompressedAssemblyDescriptor {
		i32 466432, ; uint32_t uncompressed_file_size (0x71e00)
		i8 0, ; bool loaded
		ptr @__compressedAssemblyData_60; uint8_t* data (0x0)
	}, ; 60
	%struct.CompressedAssemblyDescriptor {
		i32 22016, ; uint32_t uncompressed_file_size (0x5600)
		i8 0, ; bool loaded
		ptr @__compressedAssemblyData_61; uint8_t* data (0x0)
	}, ; 61
	%struct.CompressedAssemblyDescriptor {
		i32 7680, ; uint32_t uncompressed_file_size (0x1e00)
		i8 0, ; bool loaded
		ptr @__compressedAssemblyData_62; uint8_t* data (0x0)
	}, ; 62
	%struct.CompressedAssemblyDescriptor {
		i32 39936, ; uint32_t uncompressed_file_size (0x9c00)
		i8 0, ; bool loaded
		ptr @__compressedAssemblyData_63; uint8_t* data (0x0)
	}, ; 63
	%struct.CompressedAssemblyDescriptor {
		i32 188928, ; uint32_t uncompressed_file_size (0x2e200)
		i8 0, ; bool loaded
		ptr @__compressedAssemblyData_64; uint8_t* data (0x0)
	}, ; 64
	%struct.CompressedAssemblyDescriptor {
		i32 18944, ; uint32_t uncompressed_file_size (0x4a00)
		i8 0, ; bool loaded
		ptr @__compressedAssemblyData_65; uint8_t* data (0x0)
	}, ; 65
	%struct.CompressedAssemblyDescriptor {
		i32 15872, ; uint32_t uncompressed_file_size (0x3e00)
		i8 0, ; bool loaded
		ptr @__compressedAssemblyData_66; uint8_t* data (0x0)
	}, ; 66
	%struct.CompressedAssemblyDescriptor {
		i32 23552, ; uint32_t uncompressed_file_size (0x5c00)
		i8 0, ; bool loaded
		ptr @__compressedAssemblyData_67; uint8_t* data (0x0)
	}, ; 67
	%struct.CompressedAssemblyDescriptor {
		i32 11264, ; uint32_t uncompressed_file_size (0x2c00)
		i8 0, ; bool loaded
		ptr @__compressedAssemblyData_68; uint8_t* data (0x0)
	}, ; 68
	%struct.CompressedAssemblyDescriptor {
		i32 33792, ; uint32_t uncompressed_file_size (0x8400)
		i8 0, ; bool loaded
		ptr @__compressedAssemblyData_69; uint8_t* data (0x0)
	}, ; 69
	%struct.CompressedAssemblyDescriptor {
		i32 80896, ; uint32_t uncompressed_file_size (0x13c00)
		i8 0, ; bool loaded
		ptr @__compressedAssemblyData_70; uint8_t* data (0x0)
	}, ; 70
	%struct.CompressedAssemblyDescriptor {
		i32 16896, ; uint32_t uncompressed_file_size (0x4200)
		i8 0, ; bool loaded
		ptr @__compressedAssemblyData_71; uint8_t* data (0x0)
	}, ; 71
	%struct.CompressedAssemblyDescriptor {
		i32 51200, ; uint32_t uncompressed_file_size (0xc800)
		i8 0, ; bool loaded
		ptr @__compressedAssemblyData_72; uint8_t* data (0x0)
	}, ; 72
	%struct.CompressedAssemblyDescriptor {
		i32 26624, ; uint32_t uncompressed_file_size (0x6800)
		i8 0, ; bool loaded
		ptr @__compressedAssemblyData_73; uint8_t* data (0x0)
	}, ; 73
	%struct.CompressedAssemblyDescriptor {
		i32 393728, ; uint32_t uncompressed_file_size (0x60200)
		i8 0, ; bool loaded
		ptr @__compressedAssemblyData_74; uint8_t* data (0x0)
	}, ; 74
	%struct.CompressedAssemblyDescriptor {
		i32 10240, ; uint32_t uncompressed_file_size (0x2800)
		i8 0, ; bool loaded
		ptr @__compressedAssemblyData_75; uint8_t* data (0x0)
	}, ; 75
	%struct.CompressedAssemblyDescriptor {
		i32 35328, ; uint32_t uncompressed_file_size (0x8a00)
		i8 0, ; bool loaded
		ptr @__compressedAssemblyData_76; uint8_t* data (0x0)
	}, ; 76
	%struct.CompressedAssemblyDescriptor {
		i32 52736, ; uint32_t uncompressed_file_size (0xce00)
		i8 0, ; bool loaded
		ptr @__compressedAssemblyData_77; uint8_t* data (0x0)
	}, ; 77
	%struct.CompressedAssemblyDescriptor {
		i32 27136, ; uint32_t uncompressed_file_size (0x6a00)
		i8 0, ; bool loaded
		ptr @__compressedAssemblyData_78; uint8_t* data (0x0)
	}, ; 78
	%struct.CompressedAssemblyDescriptor {
		i32 547840, ; uint32_t uncompressed_file_size (0x85c00)
		i8 0, ; bool loaded
		ptr @__compressedAssemblyData_79; uint8_t* data (0x0)
	}, ; 79
	%struct.CompressedAssemblyDescriptor {
		i32 23040, ; uint32_t uncompressed_file_size (0x5a00)
		i8 0, ; bool loaded
		ptr @__compressedAssemblyData_80; uint8_t* data (0x0)
	}, ; 80
	%struct.CompressedAssemblyDescriptor {
		i32 14848, ; uint32_t uncompressed_file_size (0x3a00)
		i8 0, ; bool loaded
		ptr @__compressedAssemblyData_81; uint8_t* data (0x0)
	}, ; 81
	%struct.CompressedAssemblyDescriptor {
		i32 5120, ; uint32_t uncompressed_file_size (0x1400)
		i8 0, ; bool loaded
		ptr @__compressedAssemblyData_82; uint8_t* data (0x0)
	}, ; 82
	%struct.CompressedAssemblyDescriptor {
		i32 15392, ; uint32_t uncompressed_file_size (0x3c20)
		i8 0, ; bool loaded
		ptr @__compressedAssemblyData_83; uint8_t* data (0x0)
	}, ; 83
	%struct.CompressedAssemblyDescriptor {
		i32 19968, ; uint32_t uncompressed_file_size (0x4e00)
		i8 0, ; bool loaded
		ptr @__compressedAssemblyData_84; uint8_t* data (0x0)
	}, ; 84
	%struct.CompressedAssemblyDescriptor {
		i32 1861632, ; uint32_t uncompressed_file_size (0x1c6800)
		i8 0, ; bool loaded
		ptr @__compressedAssemblyData_85; uint8_t* data (0x0)
	}, ; 85
	%struct.CompressedAssemblyDescriptor {
		i32 298496, ; uint32_t uncompressed_file_size (0x48e00)
		i8 0, ; bool loaded
		ptr @__compressedAssemblyData_86; uint8_t* data (0x0)
	}, ; 86
	%struct.CompressedAssemblyDescriptor {
		i32 19968, ; uint32_t uncompressed_file_size (0x4e00)
		i8 0, ; bool loaded
		ptr @__compressedAssemblyData_87; uint8_t* data (0x0)
	}, ; 87
	%struct.CompressedAssemblyDescriptor {
		i32 1847808, ; uint32_t uncompressed_file_size (0x1c3200)
		i8 0, ; bool loaded
		ptr @__compressedAssemblyData_88; uint8_t* data (0x0)
	}, ; 88
	%struct.CompressedAssemblyDescriptor {
		i32 297984, ; uint32_t uncompressed_file_size (0x48c00)
		i8 0, ; bool loaded
		ptr @__compressedAssemblyData_89; uint8_t* data (0x0)
	}, ; 89
	%struct.CompressedAssemblyDescriptor {
		i32 15280, ; uint32_t uncompressed_file_size (0x3bb0)
		i8 0, ; bool loaded
		ptr @__compressedAssemblyData_90; uint8_t* data (0x0)
	}, ; 90
	%struct.CompressedAssemblyDescriptor {
		i32 15280, ; uint32_t uncompressed_file_size (0x3bb0)
		i8 0, ; bool loaded
		ptr @__compressedAssemblyData_91; uint8_t* data (0x0)
	}, ; 91
	%struct.CompressedAssemblyDescriptor {
		i32 15392, ; uint32_t uncompressed_file_size (0x3c20)
		i8 0, ; bool loaded
		ptr @__compressedAssemblyData_92; uint8_t* data (0x0)
	}, ; 92
	%struct.CompressedAssemblyDescriptor {
		i32 15288, ; uint32_t uncompressed_file_size (0x3bb8)
		i8 0, ; bool loaded
		ptr @__compressedAssemblyData_93; uint8_t* data (0x0)
	}, ; 93
	%struct.CompressedAssemblyDescriptor {
		i32 15392, ; uint32_t uncompressed_file_size (0x3c20)
		i8 0, ; bool loaded
		ptr @__compressedAssemblyData_94; uint8_t* data (0x0)
	}, ; 94
	%struct.CompressedAssemblyDescriptor {
		i32 15296, ; uint32_t uncompressed_file_size (0x3bc0)
		i8 0, ; bool loaded
		ptr @__compressedAssemblyData_95; uint8_t* data (0x0)
	}, ; 95
	%struct.CompressedAssemblyDescriptor {
		i32 15296, ; uint32_t uncompressed_file_size (0x3bc0)
		i8 0, ; bool loaded
		ptr @__compressedAssemblyData_96; uint8_t* data (0x0)
	}, ; 96
	%struct.CompressedAssemblyDescriptor {
		i32 15288, ; uint32_t uncompressed_file_size (0x3bb8)
		i8 0, ; bool loaded
		ptr @__compressedAssemblyData_97; uint8_t* data (0x0)
	}, ; 97
	%struct.CompressedAssemblyDescriptor {
		i32 15288, ; uint32_t uncompressed_file_size (0x3bb8)
		i8 0, ; bool loaded
		ptr @__compressedAssemblyData_98; uint8_t* data (0x0)
	}, ; 98
	%struct.CompressedAssemblyDescriptor {
		i32 15808, ; uint32_t uncompressed_file_size (0x3dc0)
		i8 0, ; bool loaded
		ptr @__compressedAssemblyData_99; uint8_t* data (0x0)
	}, ; 99
	%struct.CompressedAssemblyDescriptor {
		i32 15408, ; uint32_t uncompressed_file_size (0x3c30)
		i8 0, ; bool loaded
		ptr @__compressedAssemblyData_100; uint8_t* data (0x0)
	}, ; 100
	%struct.CompressedAssemblyDescriptor {
		i32 15400, ; uint32_t uncompressed_file_size (0x3c28)
		i8 0, ; bool loaded
		ptr @__compressedAssemblyData_101; uint8_t* data (0x0)
	}, ; 101
	%struct.CompressedAssemblyDescriptor {
		i32 15392, ; uint32_t uncompressed_file_size (0x3c20)
		i8 0, ; bool loaded
		ptr @__compressedAssemblyData_102; uint8_t* data (0x0)
	}, ; 102
	%struct.CompressedAssemblyDescriptor {
		i32 15280, ; uint32_t uncompressed_file_size (0x3bb0)
		i8 0, ; bool loaded
		ptr @__compressedAssemblyData_103; uint8_t* data (0x0)
	}, ; 103
	%struct.CompressedAssemblyDescriptor {
		i32 15904, ; uint32_t uncompressed_file_size (0x3e20)
		i8 0, ; bool loaded
		ptr @__compressedAssemblyData_104; uint8_t* data (0x0)
	}, ; 104
	%struct.CompressedAssemblyDescriptor {
		i32 15392, ; uint32_t uncompressed_file_size (0x3c20)
		i8 0, ; bool loaded
		ptr @__compressedAssemblyData_105; uint8_t* data (0x0)
	}, ; 105
	%struct.CompressedAssemblyDescriptor {
		i32 15296, ; uint32_t uncompressed_file_size (0x3bc0)
		i8 0, ; bool loaded
		ptr @__compressedAssemblyData_106; uint8_t* data (0x0)
	}, ; 106
	%struct.CompressedAssemblyDescriptor {
		i32 15408, ; uint32_t uncompressed_file_size (0x3c30)
		i8 0, ; bool loaded
		ptr @__compressedAssemblyData_107; uint8_t* data (0x0)
	}, ; 107
	%struct.CompressedAssemblyDescriptor {
		i32 7168, ; uint32_t uncompressed_file_size (0x1c00)
		i8 0, ; bool loaded
		ptr @__compressedAssemblyData_108; uint8_t* data (0x0)
	}, ; 108
	%struct.CompressedAssemblyDescriptor {
		i32 15288, ; uint32_t uncompressed_file_size (0x3bb8)
		i8 0, ; bool loaded
		ptr @__compressedAssemblyData_109; uint8_t* data (0x0)
	}, ; 109
	%struct.CompressedAssemblyDescriptor {
		i32 15296, ; uint32_t uncompressed_file_size (0x3bc0)
		i8 0, ; bool loaded
		ptr @__compressedAssemblyData_110; uint8_t* data (0x0)
	}, ; 110
	%struct.CompressedAssemblyDescriptor {
		i32 15392, ; uint32_t uncompressed_file_size (0x3c20)
		i8 0, ; bool loaded
		ptr @__compressedAssemblyData_111; uint8_t* data (0x0)
	}, ; 111
	%struct.CompressedAssemblyDescriptor {
		i32 15296, ; uint32_t uncompressed_file_size (0x3bc0)
		i8 0, ; bool loaded
		ptr @__compressedAssemblyData_112; uint8_t* data (0x0)
	}, ; 112
	%struct.CompressedAssemblyDescriptor {
		i32 15392, ; uint32_t uncompressed_file_size (0x3c20)
		i8 0, ; bool loaded
		ptr @__compressedAssemblyData_113; uint8_t* data (0x0)
	}, ; 113
	%struct.CompressedAssemblyDescriptor {
		i32 15296, ; uint32_t uncompressed_file_size (0x3bc0)
		i8 0, ; bool loaded
		ptr @__compressedAssemblyData_114; uint8_t* data (0x0)
	}, ; 114
	%struct.CompressedAssemblyDescriptor {
		i32 15400, ; uint32_t uncompressed_file_size (0x3c28)
		i8 0, ; bool loaded
		ptr @__compressedAssemblyData_115; uint8_t* data (0x0)
	}, ; 115
	%struct.CompressedAssemblyDescriptor {
		i32 15392, ; uint32_t uncompressed_file_size (0x3c20)
		i8 0, ; bool loaded
		ptr @__compressedAssemblyData_116; uint8_t* data (0x0)
	}, ; 116
	%struct.CompressedAssemblyDescriptor {
		i32 15904, ; uint32_t uncompressed_file_size (0x3e20)
		i8 0, ; bool loaded
		ptr @__compressedAssemblyData_117; uint8_t* data (0x0)
	}, ; 117
	%struct.CompressedAssemblyDescriptor {
		i32 15280, ; uint32_t uncompressed_file_size (0x3bb0)
		i8 0, ; bool loaded
		ptr @__compressedAssemblyData_118; uint8_t* data (0x0)
	}, ; 118
	%struct.CompressedAssemblyDescriptor {
		i32 15296, ; uint32_t uncompressed_file_size (0x3bc0)
		i8 0, ; bool loaded
		ptr @__compressedAssemblyData_119; uint8_t* data (0x0)
	}, ; 119
	%struct.CompressedAssemblyDescriptor {
		i32 15392, ; uint32_t uncompressed_file_size (0x3c20)
		i8 0, ; bool loaded
		ptr @__compressedAssemblyData_120; uint8_t* data (0x0)
	}, ; 120
	%struct.CompressedAssemblyDescriptor {
		i32 19968, ; uint32_t uncompressed_file_size (0x4e00)
		i8 0, ; bool loaded
		ptr @__compressedAssemblyData_121; uint8_t* data (0x0)
	}, ; 121
	%struct.CompressedAssemblyDescriptor {
		i32 1847808, ; uint32_t uncompressed_file_size (0x1c3200)
		i8 0, ; bool loaded
		ptr @__compressedAssemblyData_122; uint8_t* data (0x0)
	}, ; 122
	%struct.CompressedAssemblyDescriptor {
		i32 297984, ; uint32_t uncompressed_file_size (0x48c00)
		i8 0, ; bool loaded
		ptr @__compressedAssemblyData_123; uint8_t* data (0x0)
	}, ; 123
	%struct.CompressedAssemblyDescriptor {
		i32 19968, ; uint32_t uncompressed_file_size (0x4e00)
		i8 0, ; bool loaded
		ptr @__compressedAssemblyData_124; uint8_t* data (0x0)
	}, ; 124
	%struct.CompressedAssemblyDescriptor {
		i32 1905664, ; uint32_t uncompressed_file_size (0x1d1400)
		i8 0, ; bool loaded
		ptr @__compressedAssemblyData_125; uint8_t* data (0x0)
	}, ; 125
	%struct.CompressedAssemblyDescriptor {
		i32 298496, ; uint32_t uncompressed_file_size (0x48e00)
		i8 0, ; bool loaded
		ptr @__compressedAssemblyData_126; uint8_t* data (0x0)
	}, ; 126
	%struct.CompressedAssemblyDescriptor {
		i32 15280, ; uint32_t uncompressed_file_size (0x3bb0)
		i8 0, ; bool loaded
		ptr @__compressedAssemblyData_127; uint8_t* data (0x0)
	}, ; 127
	%struct.CompressedAssemblyDescriptor {
		i32 15296, ; uint32_t uncompressed_file_size (0x3bc0)
		i8 0, ; bool loaded
		ptr @__compressedAssemblyData_128; uint8_t* data (0x0)
	}, ; 128
	%struct.CompressedAssemblyDescriptor {
		i32 15384, ; uint32_t uncompressed_file_size (0x3c18)
		i8 0, ; bool loaded
		ptr @__compressedAssemblyData_129; uint8_t* data (0x0)
	} ; 129
], align 8

@__compressedAssemblyData_0 = internal dso_local global [151040 x i8] zeroinitializer, align 1
@__compressedAssemblyData_1 = internal dso_local global [5120 x i8] zeroinitializer, align 1
@__compressedAssemblyData_2 = internal dso_local global [12800 x i8] zeroinitializer, align 1
@__compressedAssemblyData_3 = internal dso_local global [20992 x i8] zeroinitializer, align 1
@__compressedAssemblyData_4 = internal dso_local global [40960 x i8] zeroinitializer, align 1
@__compressedAssemblyData_5 = internal dso_local global [16384 x i8] zeroinitializer, align 1
@__compressedAssemblyData_6 = internal dso_local global [15872 x i8] zeroinitializer, align 1
@__compressedAssemblyData_7 = internal dso_local global [14848 x i8] zeroinitializer, align 1
@__compressedAssemblyData_8 = internal dso_local global [7680 x i8] zeroinitializer, align 1
@__compressedAssemblyData_9 = internal dso_local global [55808 x i8] zeroinitializer, align 1
@__compressedAssemblyData_10 = internal dso_local global [125888 x i8] zeroinitializer, align 1
@__compressedAssemblyData_11 = internal dso_local global [1702320 x i8] zeroinitializer, align 1
@__compressedAssemblyData_12 = internal dso_local global [42496 x i8] zeroinitializer, align 1
@__compressedAssemblyData_13 = internal dso_local global [204832 x i8] zeroinitializer, align 1
@__compressedAssemblyData_14 = internal dso_local global [634800 x i8] zeroinitializer, align 1
@__compressedAssemblyData_15 = internal dso_local global [18976 x i8] zeroinitializer, align 1
@__compressedAssemblyData_16 = internal dso_local global [1705472 x i8] zeroinitializer, align 1
@__compressedAssemblyData_17 = internal dso_local global [6656 x i8] zeroinitializer, align 1
@__compressedAssemblyData_18 = internal dso_local global [51200 x i8] zeroinitializer, align 1
@__compressedAssemblyData_19 = internal dso_local global [1525248 x i8] zeroinitializer, align 1
@__compressedAssemblyData_20 = internal dso_local global [172032 x i8] zeroinitializer, align 1
@__compressedAssemblyData_21 = internal dso_local global [13824 x i8] zeroinitializer, align 1
@__compressedAssemblyData_22 = internal dso_local global [9216 x i8] zeroinitializer, align 1
@__compressedAssemblyData_23 = internal dso_local global [19968 x i8] zeroinitializer, align 1
@__compressedAssemblyData_24 = internal dso_local global [10240 x i8] zeroinitializer, align 1
@__compressedAssemblyData_25 = internal dso_local global [83456 x i8] zeroinitializer, align 1
@__compressedAssemblyData_26 = internal dso_local global [4608 x i8] zeroinitializer, align 1
@__compressedAssemblyData_27 = internal dso_local global [10752 x i8] zeroinitializer, align 1
@__compressedAssemblyData_28 = internal dso_local global [14848 x i8] zeroinitializer, align 1
@__compressedAssemblyData_29 = internal dso_local global [25600 x i8] zeroinitializer, align 1
@__compressedAssemblyData_30 = internal dso_local global [9728 x i8] zeroinitializer, align 1
@__compressedAssemblyData_31 = internal dso_local global [4096 x i8] zeroinitializer, align 1
@__compressedAssemblyData_32 = internal dso_local global [19968 x i8] zeroinitializer, align 1
@__compressedAssemblyData_33 = internal dso_local global [29696 x i8] zeroinitializer, align 1
@__compressedAssemblyData_34 = internal dso_local global [343552 x i8] zeroinitializer, align 1
@__compressedAssemblyData_35 = internal dso_local global [34816 x i8] zeroinitializer, align 1
@__compressedAssemblyData_36 = internal dso_local global [6656 x i8] zeroinitializer, align 1
@__compressedAssemblyData_37 = internal dso_local global [119296 x i8] zeroinitializer, align 1
@__compressedAssemblyData_38 = internal dso_local global [34816 x i8] zeroinitializer, align 1
@__compressedAssemblyData_39 = internal dso_local global [6144 x i8] zeroinitializer, align 1
@__compressedAssemblyData_40 = internal dso_local global [4608 x i8] zeroinitializer, align 1
@__compressedAssemblyData_41 = internal dso_local global [15872 x i8] zeroinitializer, align 1
@__compressedAssemblyData_42 = internal dso_local global [67584 x i8] zeroinitializer, align 1
@__compressedAssemblyData_43 = internal dso_local global [378368 x i8] zeroinitializer, align 1
@__compressedAssemblyData_44 = internal dso_local global [8192 x i8] zeroinitializer, align 1
@__compressedAssemblyData_45 = internal dso_local global [12288 x i8] zeroinitializer, align 1
@__compressedAssemblyData_46 = internal dso_local global [12800 x i8] zeroinitializer, align 1
@__compressedAssemblyData_47 = internal dso_local global [4096 x i8] zeroinitializer, align 1
@__compressedAssemblyData_48 = internal dso_local global [11264 x i8] zeroinitializer, align 1
@__compressedAssemblyData_49 = internal dso_local global [4608 x i8] zeroinitializer, align 1
@__compressedAssemblyData_50 = internal dso_local global [4608 x i8] zeroinitializer, align 1
@__compressedAssemblyData_51 = internal dso_local global [4096 x i8] zeroinitializer, align 1
@__compressedAssemblyData_52 = internal dso_local global [119296 x i8] zeroinitializer, align 1
@__compressedAssemblyData_53 = internal dso_local global [50176 x i8] zeroinitializer, align 1
@__compressedAssemblyData_54 = internal dso_local global [14336 x i8] zeroinitializer, align 1
@__compressedAssemblyData_55 = internal dso_local global [504320 x i8] zeroinitializer, align 1
@__compressedAssemblyData_56 = internal dso_local global [31232 x i8] zeroinitializer, align 1
@__compressedAssemblyData_57 = internal dso_local global [15360 x i8] zeroinitializer, align 1
@__compressedAssemblyData_58 = internal dso_local global [17920 x i8] zeroinitializer, align 1
@__compressedAssemblyData_59 = internal dso_local global [69120 x i8] zeroinitializer, align 1
@__compressedAssemblyData_60 = internal dso_local global [466432 x i8] zeroinitializer, align 1
@__compressedAssemblyData_61 = internal dso_local global [22016 x i8] zeroinitializer, align 1
@__compressedAssemblyData_62 = internal dso_local global [7680 x i8] zeroinitializer, align 1
@__compressedAssemblyData_63 = internal dso_local global [39936 x i8] zeroinitializer, align 1
@__compressedAssemblyData_64 = internal dso_local global [188928 x i8] zeroinitializer, align 1
@__compressedAssemblyData_65 = internal dso_local global [18944 x i8] zeroinitializer, align 1
@__compressedAssemblyData_66 = internal dso_local global [15872 x i8] zeroinitializer, align 1
@__compressedAssemblyData_67 = internal dso_local global [23552 x i8] zeroinitializer, align 1
@__compressedAssemblyData_68 = internal dso_local global [11264 x i8] zeroinitializer, align 1
@__compressedAssemblyData_69 = internal dso_local global [33792 x i8] zeroinitializer, align 1
@__compressedAssemblyData_70 = internal dso_local global [80896 x i8] zeroinitializer, align 1
@__compressedAssemblyData_71 = internal dso_local global [16896 x i8] zeroinitializer, align 1
@__compressedAssemblyData_72 = internal dso_local global [51200 x i8] zeroinitializer, align 1
@__compressedAssemblyData_73 = internal dso_local global [26624 x i8] zeroinitializer, align 1
@__compressedAssemblyData_74 = internal dso_local global [393728 x i8] zeroinitializer, align 1
@__compressedAssemblyData_75 = internal dso_local global [10240 x i8] zeroinitializer, align 1
@__compressedAssemblyData_76 = internal dso_local global [35328 x i8] zeroinitializer, align 1
@__compressedAssemblyData_77 = internal dso_local global [52736 x i8] zeroinitializer, align 1
@__compressedAssemblyData_78 = internal dso_local global [27136 x i8] zeroinitializer, align 1
@__compressedAssemblyData_79 = internal dso_local global [547840 x i8] zeroinitializer, align 1
@__compressedAssemblyData_80 = internal dso_local global [23040 x i8] zeroinitializer, align 1
@__compressedAssemblyData_81 = internal dso_local global [14848 x i8] zeroinitializer, align 1
@__compressedAssemblyData_82 = internal dso_local global [5120 x i8] zeroinitializer, align 1
@__compressedAssemblyData_83 = internal dso_local global [15392 x i8] zeroinitializer, align 1
@__compressedAssemblyData_84 = internal dso_local global [19968 x i8] zeroinitializer, align 1
@__compressedAssemblyData_85 = internal dso_local global [1861632 x i8] zeroinitializer, align 1
@__compressedAssemblyData_86 = internal dso_local global [298496 x i8] zeroinitializer, align 1
@__compressedAssemblyData_87 = internal dso_local global [19968 x i8] zeroinitializer, align 1
@__compressedAssemblyData_88 = internal dso_local global [1847808 x i8] zeroinitializer, align 1
@__compressedAssemblyData_89 = internal dso_local global [297984 x i8] zeroinitializer, align 1
@__compressedAssemblyData_90 = internal dso_local global [15280 x i8] zeroinitializer, align 1
@__compressedAssemblyData_91 = internal dso_local global [15280 x i8] zeroinitializer, align 1
@__compressedAssemblyData_92 = internal dso_local global [15392 x i8] zeroinitializer, align 1
@__compressedAssemblyData_93 = internal dso_local global [15288 x i8] zeroinitializer, align 1
@__compressedAssemblyData_94 = internal dso_local global [15392 x i8] zeroinitializer, align 1
@__compressedAssemblyData_95 = internal dso_local global [15296 x i8] zeroinitializer, align 1
@__compressedAssemblyData_96 = internal dso_local global [15296 x i8] zeroinitializer, align 1
@__compressedAssemblyData_97 = internal dso_local global [15288 x i8] zeroinitializer, align 1
@__compressedAssemblyData_98 = internal dso_local global [15288 x i8] zeroinitializer, align 1
@__compressedAssemblyData_99 = internal dso_local global [15808 x i8] zeroinitializer, align 1
@__compressedAssemblyData_100 = internal dso_local global [15408 x i8] zeroinitializer, align 1
@__compressedAssemblyData_101 = internal dso_local global [15400 x i8] zeroinitializer, align 1
@__compressedAssemblyData_102 = internal dso_local global [15392 x i8] zeroinitializer, align 1
@__compressedAssemblyData_103 = internal dso_local global [15280 x i8] zeroinitializer, align 1
@__compressedAssemblyData_104 = internal dso_local global [15904 x i8] zeroinitializer, align 1
@__compressedAssemblyData_105 = internal dso_local global [15392 x i8] zeroinitializer, align 1
@__compressedAssemblyData_106 = internal dso_local global [15296 x i8] zeroinitializer, align 1
@__compressedAssemblyData_107 = internal dso_local global [15408 x i8] zeroinitializer, align 1
@__compressedAssemblyData_108 = internal dso_local global [7168 x i8] zeroinitializer, align 1
@__compressedAssemblyData_109 = internal dso_local global [15288 x i8] zeroinitializer, align 1
@__compressedAssemblyData_110 = internal dso_local global [15296 x i8] zeroinitializer, align 1
@__compressedAssemblyData_111 = internal dso_local global [15392 x i8] zeroinitializer, align 1
@__compressedAssemblyData_112 = internal dso_local global [15296 x i8] zeroinitializer, align 1
@__compressedAssemblyData_113 = internal dso_local global [15392 x i8] zeroinitializer, align 1
@__compressedAssemblyData_114 = internal dso_local global [15296 x i8] zeroinitializer, align 1
@__compressedAssemblyData_115 = internal dso_local global [15400 x i8] zeroinitializer, align 1
@__compressedAssemblyData_116 = internal dso_local global [15392 x i8] zeroinitializer, align 1
@__compressedAssemblyData_117 = internal dso_local global [15904 x i8] zeroinitializer, align 1
@__compressedAssemblyData_118 = internal dso_local global [15280 x i8] zeroinitializer, align 1
@__compressedAssemblyData_119 = internal dso_local global [15296 x i8] zeroinitializer, align 1
@__compressedAssemblyData_120 = internal dso_local global [15392 x i8] zeroinitializer, align 1
@__compressedAssemblyData_121 = internal dso_local global [19968 x i8] zeroinitializer, align 1
@__compressedAssemblyData_122 = internal dso_local global [1847808 x i8] zeroinitializer, align 1
@__compressedAssemblyData_123 = internal dso_local global [297984 x i8] zeroinitializer, align 1
@__compressedAssemblyData_124 = internal dso_local global [19968 x i8] zeroinitializer, align 1
@__compressedAssemblyData_125 = internal dso_local global [1905664 x i8] zeroinitializer, align 1
@__compressedAssemblyData_126 = internal dso_local global [298496 x i8] zeroinitializer, align 1
@__compressedAssemblyData_127 = internal dso_local global [15280 x i8] zeroinitializer, align 1
@__compressedAssemblyData_128 = internal dso_local global [15296 x i8] zeroinitializer, align 1
@__compressedAssemblyData_129 = internal dso_local global [15384 x i8] zeroinitializer, align 1

; Metadata
!llvm.module.flags = !{!0, !1, !7, !8, !9, !10}
!0 = !{i32 1, !"wchar_size", i32 4}
!1 = !{i32 7, !"PIC Level", i32 2}
!llvm.ident = !{!2}
!2 = !{!"Xamarin.Android remotes/origin/release/8.0.1xx @ f1b7113872c8db3dfee70d11925e81bb752dc8d0"}
!3 = !{!4, !4, i64 0}
!4 = !{!"any pointer", !5, i64 0}
!5 = !{!"omnipotent char", !6, i64 0}
!6 = !{!"Simple C++ TBAA"}
!7 = !{i32 1, !"branch-target-enforcement", i32 0}
!8 = !{i32 1, !"sign-return-address", i32 0}
!9 = !{i32 1, !"sign-return-address-all", i32 0}
!10 = !{i32 1, !"sign-return-address-with-bkey", i32 0}
