-- Merging decision tree log ---
manifest
ADDED from C:\Users\AlumDAM2M\proyectos\PM\AndroidStudio\Ejercicio04\app\src\main\AndroidManifest.xml:2:1-28:12
INJECTED from C:\Users\AlumDAM2M\proyectos\PM\AndroidStudio\Ejercicio04\app\src\main\AndroidManifest.xml:2:1-28:12
INJECTED from C:\Users\AlumDAM2M\proyectos\PM\AndroidStudio\Ejercicio04\app\src\main\AndroidManifest.xml:2:1-28:12
INJECTED from C:\Users\AlumDAM2M\proyectos\PM\AndroidStudio\Ejercicio04\app\src\main\AndroidManifest.xml:2:1-28:12
MERGED from [androidx.compose.material3:material3:1.0.0] C:\Users\AlumDAM2M\.gradle\caches\transforms-3\9cc0b765caf38179c734d10b72e03aed\transformed\material3-1.0.0\AndroidManifest.xml:17:1-22:12
MERGED from [androidx.compose.material:material-ripple:1.4.0] C:\Users\AlumDAM2M\.gradle\caches\transforms-3\d23830491b6806af6f77c717ffd6179e\transformed\material-ripple-1.4.0\AndroidManifest.xml:17:1-22:12
MERGED from [androidx.compose.material:material-icons-core:1.4.0] C:\Users\AlumDAM2M\.gradle\caches\transforms-3\ea2673629ee76fcba0352185df3969eb\transformed\material-icons-core-1.4.0\AndroidManifest.xml:17:1-22:12
MERGED from [androidx.compose.material:material:1.4.0] C:\Users\AlumDAM2M\.gradle\caches\transforms-3\ab737578b2a070f073f57980964fb8ac\transformed\material-1.4.0\AndroidManifest.xml:17:1-22:12
MERGED from [androidx.compose.animation:animation-core:1.4.0] C:\Users\AlumDAM2M\.gradle\caches\transforms-3\8ca8b09e4a3d1aef6abc1b9f92ab3521\transformed\animation-core-1.4.0\AndroidManifest.xml:17:1-22:12
MERGED from [androidx.compose.animation:animation:1.4.0] C:\Users\AlumDAM2M\.gradle\caches\transforms-3\e2dcad74c7e042a4aea35d281060be0d\transformed\animation-1.4.0\AndroidManifest.xml:17:1-22:12
MERGED from [androidx.compose.foundation:foundation-layout:1.4.0] C:\Users\AlumDAM2M\.gradle\caches\transforms-3\488bfd71c19367c80263c61ba1329692\transformed\foundation-layout-1.4.0\AndroidManifest.xml:17:1-22:12
MERGED from [androidx.compose.foundation:foundation:1.4.0] C:\Users\AlumDAM2M\.gradle\caches\transforms-3\f40b1fdd670e64002a1819cbe3c6897b\transformed\foundation-1.4.0\AndroidManifest.xml:17:1-22:12
MERGED from [androidx.compose.ui:ui-tooling-data:1.4.0] C:\Users\AlumDAM2M\.gradle\caches\transforms-3\0654fed0a5614bce2421d4eb049e54db\transformed\ui-tooling-data-1.4.0\AndroidManifest.xml:17:1-22:12
MERGED from [androidx.compose.ui:ui-unit:1.4.0] C:\Users\AlumDAM2M\.gradle\caches\transforms-3\eb642c1e493b8600e8623d5094fed37a\transformed\ui-unit-1.4.0\AndroidManifest.xml:17:1-22:12
MERGED from [androidx.compose.ui:ui-geometry:1.4.0] C:\Users\AlumDAM2M\.gradle\caches\transforms-3\1ebcb8aa9cf4973f7fe5f2a2aca7fcb0\transformed\ui-geometry-1.4.0\AndroidManifest.xml:17:1-22:12
MERGED from [androidx.compose.ui:ui-util:1.4.0] C:\Users\AlumDAM2M\.gradle\caches\transforms-3\20db215bfafb5de069abf6d54db08771\transformed\ui-util-1.4.0\AndroidManifest.xml:17:1-22:12
MERGED from [androidx.compose.ui:ui-text:1.4.0] C:\Users\AlumDAM2M\.gradle\caches\transforms-3\863aa29d65d1fab407dab9e365454909\transformed\ui-text-1.4.0\AndroidManifest.xml:17:1-22:12
MERGED from [androidx.compose.ui:ui-tooling-preview:1.4.0] C:\Users\AlumDAM2M\.gradle\caches\transforms-3\8879ed9dc8d581673ae843c1e47754d0\transformed\ui-tooling-preview-1.4.0\AndroidManifest.xml:17:1-22:12
MERGED from [androidx.compose.ui:ui-test-manifest:1.4.0] C:\Users\AlumDAM2M\.gradle\caches\transforms-3\c05bb655987317b0f5fe533f652e4f49\transformed\ui-test-manifest-1.4.0\AndroidManifest.xml:17:1-28:12
MERGED from [androidx.compose.ui:ui-graphics:1.4.0] C:\Users\AlumDAM2M\.gradle\caches\transforms-3\008cbb88db884fd8f6b6aabf71a8efd4\transformed\ui-graphics-1.4.0\AndroidManifest.xml:17:1-22:12
MERGED from [androidx.compose.ui:ui-tooling:1.4.0] C:\Users\AlumDAM2M\.gradle\caches\transforms-3\c1a2611cf67705436456e1dc50643a60\transformed\ui-tooling-1.4.0\AndroidManifest.xml:17:1-28:12
MERGED from [androidx.activity:activity:1.7.2] C:\Users\AlumDAM2M\.gradle\caches\transforms-3\5a4514359bda7f91836967d103903068\transformed\activity-1.7.2\AndroidManifest.xml:17:1-22:12
MERGED from [androidx.activity:activity-ktx:1.7.2] C:\Users\AlumDAM2M\.gradle\caches\transforms-3\bb2ae7194fbdc11b50a90028db194cea\transformed\activity-ktx-1.7.2\AndroidManifest.xml:17:1-22:12
MERGED from [androidx.activity:activity-compose:1.7.2] C:\Users\AlumDAM2M\.gradle\caches\transforms-3\bea7969d082ddf803bc334d76a2cb680\transformed\activity-compose-1.7.2\AndroidManifest.xml:17:1-22:12
MERGED from [androidx.compose.ui:ui:1.4.0] C:\Users\AlumDAM2M\.gradle\caches\transforms-3\83cf593ad36391ee132da6f44330026f\transformed\ui-1.4.0\AndroidManifest.xml:17:1-22:12
MERGED from [androidx.customview:customview-poolingcontainer:1.0.0] C:\Users\AlumDAM2M\.gradle\caches\transforms-3\e2a90f7868dcb77c8c0e760062b7a301\transformed\customview-poolingcontainer-1.0.0\AndroidManifest.xml:17:1-23:12
MERGED from [androidx.emoji2:emoji2:1.3.0] C:\Users\AlumDAM2M\.gradle\caches\transforms-3\32ee973b89dcb2d4fbd1151f1e51dc48\transformed\emoji2-1.3.0\AndroidManifest.xml:17:1-35:12
MERGED from [androidx.lifecycle:lifecycle-livedata-core:2.6.2] C:\Users\AlumDAM2M\.gradle\caches\transforms-3\e2d11119b5e76bd52c77f0c80f978234\transformed\lifecycle-livedata-core-2.6.2\AndroidManifest.xml:17:1-22:12
MERGED from [androidx.lifecycle:lifecycle-process:2.6.2] C:\Users\AlumDAM2M\.gradle\caches\transforms-3\05706c52ae833ebf0f1eeda857ac0c6e\transformed\lifecycle-process-2.6.2\AndroidManifest.xml:17:1-35:12
MERGED from [androidx.lifecycle:lifecycle-viewmodel-ktx:2.6.2] C:\Users\AlumDAM2M\.gradle\caches\transforms-3\248471151cc92eae9372be4a1ffc94f3\transformed\lifecycle-viewmodel-ktx-2.6.2\AndroidManifest.xml:17:1-22:12
MERGED from [androidx.savedstate:savedstate-ktx:1.2.1] C:\Users\AlumDAM2M\.gradle\caches\transforms-3\e032710a0e004f8c9606c8fd2d070ac1\transformed\savedstate-ktx-1.2.1\AndroidManifest.xml:17:1-22:12
MERGED from [androidx.savedstate:savedstate:1.2.1] C:\Users\AlumDAM2M\.gradle\caches\transforms-3\fcccc118d8639218088b447db6d2456f\transformed\savedstate-1.2.1\AndroidManifest.xml:17:1-22:12
MERGED from [androidx.lifecycle:lifecycle-viewmodel:2.6.2] C:\Users\AlumDAM2M\.gradle\caches\transforms-3\6e51e97be5c64ec8ffb271cca9700799\transformed\lifecycle-viewmodel-2.6.2\AndroidManifest.xml:17:1-22:12
MERGED from [androidx.lifecycle:lifecycle-viewmodel-savedstate:2.6.2] C:\Users\AlumDAM2M\.gradle\caches\transforms-3\075083eaab25aa43c7573c4725bb49b5\transformed\lifecycle-viewmodel-savedstate-2.6.2\AndroidManifest.xml:17:1-22:12
MERGED from [androidx.core:core-ktx:1.9.0] C:\Users\AlumDAM2M\.gradle\caches\transforms-3\52f2d00f51eec33951703ca7c7f672e0\transformed\core-ktx-1.9.0\AndroidManifest.xml:2:1-7:12
MERGED from [androidx.autofill:autofill:1.0.0] C:\Users\AlumDAM2M\.gradle\caches\transforms-3\3aecff7474dc9f624300046773deb6dd\transformed\autofill-1.0.0\AndroidManifest.xml:17:1-24:12
MERGED from [androidx.core:core:1.9.0] C:\Users\AlumDAM2M\.gradle\caches\transforms-3\0e2111bda17921a3e330548840228749\transformed\core-1.9.0\AndroidManifest.xml:17:1-30:12
MERGED from [androidx.lifecycle:lifecycle-runtime:2.6.2] C:\Users\AlumDAM2M\.gradle\caches\transforms-3\54d1e8efaadf0cf56acd3bc116ee75f0\transformed\lifecycle-runtime-2.6.2\AndroidManifest.xml:2:1-7:12
MERGED from [androidx.lifecycle:lifecycle-runtime-ktx:2.6.2] C:\Users\AlumDAM2M\.gradle\caches\transforms-3\2af8601215dfaa1fc5d6dc1ad96e14bc\transformed\lifecycle-runtime-ktx-2.6.2\AndroidManifest.xml:17:1-22:12
MERGED from [androidx.compose.runtime:runtime-saveable:1.4.0] C:\Users\AlumDAM2M\.gradle\caches\transforms-3\a473d362ca1a38c4da1c390a4e5c7f62\transformed\runtime-saveable-1.4.0\AndroidManifest.xml:17:1-22:12
MERGED from [androidx.compose.runtime:runtime:1.4.0] C:\Users\AlumDAM2M\.gradle\caches\transforms-3\0fc235a5af360833f00322421e70953b\transformed\runtime-1.4.0\AndroidManifest.xml:17:1-22:12
MERGED from [androidx.profileinstaller:profileinstaller:1.3.0] C:\Users\AlumDAM2M\.gradle\caches\transforms-3\94fdbf6b73f70b7cd36ac41b7050cd94\transformed\profileinstaller-1.3.0\AndroidManifest.xml:17:1-55:12
MERGED from [androidx.versionedparcelable:versionedparcelable:1.1.1] C:\Users\AlumDAM2M\.gradle\caches\transforms-3\b53d04a8cf38a8fc32b71bb6ed7f55c3\transformed\versionedparcelable-1.1.1\AndroidManifest.xml:17:1-27:12
MERGED from [androidx.arch.core:core-runtime:2.2.0] C:\Users\AlumDAM2M\.gradle\caches\transforms-3\a1aa9146127683506f2c4043e0dfbe3f\transformed\core-runtime-2.2.0\AndroidManifest.xml:17:1-22:12
MERGED from [androidx.startup:startup-runtime:1.1.1] C:\Users\AlumDAM2M\.gradle\caches\transforms-3\1e0ff56ea543286fa582405adc1aec1a\transformed\startup-runtime-1.1.1\AndroidManifest.xml:17:1-33:12
MERGED from [androidx.tracing:tracing:1.0.0] C:\Users\AlumDAM2M\.gradle\caches\transforms-3\09265b5939e53acc57b8ffeaf281b1bc\transformed\tracing-1.0.0\AndroidManifest.xml:17:1-24:12
MERGED from [androidx.annotation:annotation-experimental:1.3.0] C:\Users\AlumDAM2M\.gradle\caches\transforms-3\29bd92abbe0000738280b240e0f0b698\transformed\annotation-experimental-1.3.0\AndroidManifest.xml:17:1-22:12
	package
		INJECTED from C:\Users\AlumDAM2M\proyectos\PM\AndroidStudio\Ejercicio04\app\src\main\AndroidManifest.xml
	android:versionName
		INJECTED from C:\Users\AlumDAM2M\proyectos\PM\AndroidStudio\Ejercicio04\app\src\main\AndroidManifest.xml
	xmlns:tools
		ADDED from C:\Users\AlumDAM2M\proyectos\PM\AndroidStudio\Ejercicio04\app\src\main\AndroidManifest.xml:3:5-51
	android:versionCode
		INJECTED from C:\Users\AlumDAM2M\proyectos\PM\AndroidStudio\Ejercicio04\app\src\main\AndroidManifest.xml
	xmlns:android
		ADDED from C:\Users\AlumDAM2M\proyectos\PM\AndroidStudio\Ejercicio04\app\src\main\AndroidManifest.xml:2:11-69
application
ADDED from C:\Users\AlumDAM2M\proyectos\PM\AndroidStudio\Ejercicio04\app\src\main\AndroidManifest.xml:5:5-26:19
INJECTED from C:\Users\AlumDAM2M\proyectos\PM\AndroidStudio\Ejercicio04\app\src\main\AndroidManifest.xml:5:5-26:19
MERGED from [androidx.compose.ui:ui-test-manifest:1.4.0] C:\Users\AlumDAM2M\.gradle\caches\transforms-3\c05bb655987317b0f5fe533f652e4f49\transformed\ui-test-manifest-1.4.0\AndroidManifest.xml:22:5-26:19
MERGED from [androidx.compose.ui:ui-test-manifest:1.4.0] C:\Users\AlumDAM2M\.gradle\caches\transforms-3\c05bb655987317b0f5fe533f652e4f49\transformed\ui-test-manifest-1.4.0\AndroidManifest.xml:22:5-26:19
MERGED from [androidx.compose.ui:ui-tooling:1.4.0] C:\Users\AlumDAM2M\.gradle\caches\transforms-3\c1a2611cf67705436456e1dc50643a60\transformed\ui-tooling-1.4.0\AndroidManifest.xml:22:5-26:19
MERGED from [androidx.compose.ui:ui-tooling:1.4.0] C:\Users\AlumDAM2M\.gradle\caches\transforms-3\c1a2611cf67705436456e1dc50643a60\transformed\ui-tooling-1.4.0\AndroidManifest.xml:22:5-26:19
MERGED from [androidx.emoji2:emoji2:1.3.0] C:\Users\AlumDAM2M\.gradle\caches\transforms-3\32ee973b89dcb2d4fbd1151f1e51dc48\transformed\emoji2-1.3.0\AndroidManifest.xml:23:5-33:19
MERGED from [androidx.emoji2:emoji2:1.3.0] C:\Users\AlumDAM2M\.gradle\caches\transforms-3\32ee973b89dcb2d4fbd1151f1e51dc48\transformed\emoji2-1.3.0\AndroidManifest.xml:23:5-33:19
MERGED from [androidx.lifecycle:lifecycle-process:2.6.2] C:\Users\AlumDAM2M\.gradle\caches\transforms-3\05706c52ae833ebf0f1eeda857ac0c6e\transformed\lifecycle-process-2.6.2\AndroidManifest.xml:23:5-33:19
MERGED from [androidx.lifecycle:lifecycle-process:2.6.2] C:\Users\AlumDAM2M\.gradle\caches\transforms-3\05706c52ae833ebf0f1eeda857ac0c6e\transformed\lifecycle-process-2.6.2\AndroidManifest.xml:23:5-33:19
MERGED from [androidx.core:core:1.9.0] C:\Users\AlumDAM2M\.gradle\caches\transforms-3\0e2111bda17921a3e330548840228749\transformed\core-1.9.0\AndroidManifest.xml:28:5-89
MERGED from [androidx.core:core:1.9.0] C:\Users\AlumDAM2M\.gradle\caches\transforms-3\0e2111bda17921a3e330548840228749\transformed\core-1.9.0\AndroidManifest.xml:28:5-89
MERGED from [androidx.profileinstaller:profileinstaller:1.3.0] C:\Users\AlumDAM2M\.gradle\caches\transforms-3\94fdbf6b73f70b7cd36ac41b7050cd94\transformed\profileinstaller-1.3.0\AndroidManifest.xml:23:5-53:19
MERGED from [androidx.profileinstaller:profileinstaller:1.3.0] C:\Users\AlumDAM2M\.gradle\caches\transforms-3\94fdbf6b73f70b7cd36ac41b7050cd94\transformed\profileinstaller-1.3.0\AndroidManifest.xml:23:5-53:19
MERGED from [androidx.versionedparcelable:versionedparcelable:1.1.1] C:\Users\AlumDAM2M\.gradle\caches\transforms-3\b53d04a8cf38a8fc32b71bb6ed7f55c3\transformed\versionedparcelable-1.1.1\AndroidManifest.xml:24:5-25:19
MERGED from [androidx.versionedparcelable:versionedparcelable:1.1.1] C:\Users\AlumDAM2M\.gradle\caches\transforms-3\b53d04a8cf38a8fc32b71bb6ed7f55c3\transformed\versionedparcelable-1.1.1\AndroidManifest.xml:24:5-25:19
MERGED from [androidx.startup:startup-runtime:1.1.1] C:\Users\AlumDAM2M\.gradle\caches\transforms-3\1e0ff56ea543286fa582405adc1aec1a\transformed\startup-runtime-1.1.1\AndroidManifest.xml:25:5-31:19
MERGED from [androidx.startup:startup-runtime:1.1.1] C:\Users\AlumDAM2M\.gradle\caches\transforms-3\1e0ff56ea543286fa582405adc1aec1a\transformed\startup-runtime-1.1.1\AndroidManifest.xml:25:5-31:19
	android:extractNativeLibs
		INJECTED from C:\Users\AlumDAM2M\proyectos\PM\AndroidStudio\Ejercicio04\app\src\main\AndroidManifest.xml
	android:appComponentFactory
		ADDED from [androidx.core:core:1.9.0] C:\Users\AlumDAM2M\.gradle\caches\transforms-3\0e2111bda17921a3e330548840228749\transformed\core-1.9.0\AndroidManifest.xml:28:18-86
	android:supportsRtl
		ADDED from C:\Users\AlumDAM2M\proyectos\PM\AndroidStudio\Ejercicio04\app\src\main\AndroidManifest.xml:12:9-35
	android:label
		ADDED from C:\Users\AlumDAM2M\proyectos\PM\AndroidStudio\Ejercicio04\app\src\main\AndroidManifest.xml:10:9-41
	android:fullBackupContent
		ADDED from C:\Users\AlumDAM2M\proyectos\PM\AndroidStudio\Ejercicio04\app\src\main\AndroidManifest.xml:8:9-54
	android:roundIcon
		ADDED from C:\Users\AlumDAM2M\proyectos\PM\AndroidStudio\Ejercicio04\app\src\main\AndroidManifest.xml:11:9-54
	tools:targetApi
		ADDED from C:\Users\AlumDAM2M\proyectos\PM\AndroidStudio\Ejercicio04\app\src\main\AndroidManifest.xml:14:9-29
	android:icon
		ADDED from C:\Users\AlumDAM2M\proyectos\PM\AndroidStudio\Ejercicio04\app\src\main\AndroidManifest.xml:9:9-43
	android:allowBackup
		ADDED from C:\Users\AlumDAM2M\proyectos\PM\AndroidStudio\Ejercicio04\app\src\main\AndroidManifest.xml:6:9-35
	android:theme
		ADDED from C:\Users\AlumDAM2M\proyectos\PM\AndroidStudio\Ejercicio04\app\src\main\AndroidManifest.xml:13:9-49
	android:dataExtractionRules
		ADDED from C:\Users\AlumDAM2M\proyectos\PM\AndroidStudio\Ejercicio04\app\src\main\AndroidManifest.xml:7:9-65
activity#com.gjs.ejercicio04.MainActivity
ADDED from C:\Users\AlumDAM2M\proyectos\PM\AndroidStudio\Ejercicio04\app\src\main\AndroidManifest.xml:15:9-25:20
	android:label
		ADDED from C:\Users\AlumDAM2M\proyectos\PM\AndroidStudio\Ejercicio04\app\src\main\AndroidManifest.xml:18:13-45
	android:exported
		ADDED from C:\Users\AlumDAM2M\proyectos\PM\AndroidStudio\Ejercicio04\app\src\main\AndroidManifest.xml:17:13-36
	android:theme
		ADDED from C:\Users\AlumDAM2M\proyectos\PM\AndroidStudio\Ejercicio04\app\src\main\AndroidManifest.xml:19:13-53
	android:name
		ADDED from C:\Users\AlumDAM2M\proyectos\PM\AndroidStudio\Ejercicio04\app\src\main\AndroidManifest.xml:16:13-41
intent-filter#action:name:android.intent.action.MAIN+category:name:android.intent.category.LAUNCHER
ADDED from C:\Users\AlumDAM2M\proyectos\PM\AndroidStudio\Ejercicio04\app\src\main\AndroidManifest.xml:20:13-24:29
action#android.intent.action.MAIN
ADDED from C:\Users\AlumDAM2M\proyectos\PM\AndroidStudio\Ejercicio04\app\src\main\AndroidManifest.xml:21:17-69
	android:name
		ADDED from C:\Users\AlumDAM2M\proyectos\PM\AndroidStudio\Ejercicio04\app\src\main\AndroidManifest.xml:21:25-66
category#android.intent.category.LAUNCHER
ADDED from C:\Users\AlumDAM2M\proyectos\PM\AndroidStudio\Ejercicio04\app\src\main\AndroidManifest.xml:23:17-77
	android:name
		ADDED from C:\Users\AlumDAM2M\proyectos\PM\AndroidStudio\Ejercicio04\app\src\main\AndroidManifest.xml:23:27-74
uses-sdk
INJECTED from C:\Users\AlumDAM2M\proyectos\PM\AndroidStudio\Ejercicio04\app\src\main\AndroidManifest.xml reason: use-sdk injection requested
INJECTED from C:\Users\AlumDAM2M\proyectos\PM\AndroidStudio\Ejercicio04\app\src\main\AndroidManifest.xml
INJECTED from C:\Users\AlumDAM2M\proyectos\PM\AndroidStudio\Ejercicio04\app\src\main\AndroidManifest.xml
MERGED from [androidx.compose.material3:material3:1.0.0] C:\Users\AlumDAM2M\.gradle\caches\transforms-3\9cc0b765caf38179c734d10b72e03aed\transformed\material3-1.0.0\AndroidManifest.xml:20:5-44
MERGED from [androidx.compose.material3:material3:1.0.0] C:\Users\AlumDAM2M\.gradle\caches\transforms-3\9cc0b765caf38179c734d10b72e03aed\transformed\material3-1.0.0\AndroidManifest.xml:20:5-44
MERGED from [androidx.compose.material:material-ripple:1.4.0] C:\Users\AlumDAM2M\.gradle\caches\transforms-3\d23830491b6806af6f77c717ffd6179e\transformed\material-ripple-1.4.0\AndroidManifest.xml:20:5-44
MERGED from [androidx.compose.material:material-ripple:1.4.0] C:\Users\AlumDAM2M\.gradle\caches\transforms-3\d23830491b6806af6f77c717ffd6179e\transformed\material-ripple-1.4.0\AndroidManifest.xml:20:5-44
MERGED from [androidx.compose.material:material-icons-core:1.4.0] C:\Users\AlumDAM2M\.gradle\caches\transforms-3\ea2673629ee76fcba0352185df3969eb\transformed\material-icons-core-1.4.0\AndroidManifest.xml:20:5-44
MERGED from [androidx.compose.material:material-icons-core:1.4.0] C:\Users\AlumDAM2M\.gradle\caches\transforms-3\ea2673629ee76fcba0352185df3969eb\transformed\material-icons-core-1.4.0\AndroidManifest.xml:20:5-44
MERGED from [androidx.compose.material:material:1.4.0] C:\Users\AlumDAM2M\.gradle\caches\transforms-3\ab737578b2a070f073f57980964fb8ac\transformed\material-1.4.0\AndroidManifest.xml:20:5-44
MERGED from [androidx.compose.material:material:1.4.0] C:\Users\AlumDAM2M\.gradle\caches\transforms-3\ab737578b2a070f073f57980964fb8ac\transformed\material-1.4.0\AndroidManifest.xml:20:5-44
MERGED from [androidx.compose.animation:animation-core:1.4.0] C:\Users\AlumDAM2M\.gradle\caches\transforms-3\8ca8b09e4a3d1aef6abc1b9f92ab3521\transformed\animation-core-1.4.0\AndroidManifest.xml:20:5-44
MERGED from [androidx.compose.animation:animation-core:1.4.0] C:\Users\AlumDAM2M\.gradle\caches\transforms-3\8ca8b09e4a3d1aef6abc1b9f92ab3521\transformed\animation-core-1.4.0\AndroidManifest.xml:20:5-44
MERGED from [androidx.compose.animation:animation:1.4.0] C:\Users\AlumDAM2M\.gradle\caches\transforms-3\e2dcad74c7e042a4aea35d281060be0d\transformed\animation-1.4.0\AndroidManifest.xml:20:5-44
MERGED from [androidx.compose.animation:animation:1.4.0] C:\Users\AlumDAM2M\.gradle\caches\transforms-3\e2dcad74c7e042a4aea35d281060be0d\transformed\animation-1.4.0\AndroidManifest.xml:20:5-44
MERGED from [androidx.compose.foundation:foundation-layout:1.4.0] C:\Users\AlumDAM2M\.gradle\caches\transforms-3\488bfd71c19367c80263c61ba1329692\transformed\foundation-layout-1.4.0\AndroidManifest.xml:20:5-44
MERGED from [androidx.compose.foundation:foundation-layout:1.4.0] C:\Users\AlumDAM2M\.gradle\caches\transforms-3\488bfd71c19367c80263c61ba1329692\transformed\foundation-layout-1.4.0\AndroidManifest.xml:20:5-44
MERGED from [androidx.compose.foundation:foundation:1.4.0] C:\Users\AlumDAM2M\.gradle\caches\transforms-3\f40b1fdd670e64002a1819cbe3c6897b\transformed\foundation-1.4.0\AndroidManifest.xml:20:5-44
MERGED from [androidx.compose.foundation:foundation:1.4.0] C:\Users\AlumDAM2M\.gradle\caches\transforms-3\f40b1fdd670e64002a1819cbe3c6897b\transformed\foundation-1.4.0\AndroidManifest.xml:20:5-44
MERGED from [androidx.compose.ui:ui-tooling-data:1.4.0] C:\Users\AlumDAM2M\.gradle\caches\transforms-3\0654fed0a5614bce2421d4eb049e54db\transformed\ui-tooling-data-1.4.0\AndroidManifest.xml:20:5-44
MERGED from [androidx.compose.ui:ui-tooling-data:1.4.0] C:\Users\AlumDAM2M\.gradle\caches\transforms-3\0654fed0a5614bce2421d4eb049e54db\transformed\ui-tooling-data-1.4.0\AndroidManifest.xml:20:5-44
MERGED from [androidx.compose.ui:ui-unit:1.4.0] C:\Users\AlumDAM2M\.gradle\caches\transforms-3\eb642c1e493b8600e8623d5094fed37a\transformed\ui-unit-1.4.0\AndroidManifest.xml:20:5-44
MERGED from [androidx.compose.ui:ui-unit:1.4.0] C:\Users\AlumDAM2M\.gradle\caches\transforms-3\eb642c1e493b8600e8623d5094fed37a\transformed\ui-unit-1.4.0\AndroidManifest.xml:20:5-44
MERGED from [androidx.compose.ui:ui-geometry:1.4.0] C:\Users\AlumDAM2M\.gradle\caches\transforms-3\1ebcb8aa9cf4973f7fe5f2a2aca7fcb0\transformed\ui-geometry-1.4.0\AndroidManifest.xml:20:5-44
MERGED from [androidx.compose.ui:ui-geometry:1.4.0] C:\Users\AlumDAM2M\.gradle\caches\transforms-3\1ebcb8aa9cf4973f7fe5f2a2aca7fcb0\transformed\ui-geometry-1.4.0\AndroidManifest.xml:20:5-44
MERGED from [androidx.compose.ui:ui-util:1.4.0] C:\Users\AlumDAM2M\.gradle\caches\transforms-3\20db215bfafb5de069abf6d54db08771\transformed\ui-util-1.4.0\AndroidManifest.xml:20:5-44
MERGED from [androidx.compose.ui:ui-util:1.4.0] C:\Users\AlumDAM2M\.gradle\caches\transforms-3\20db215bfafb5de069abf6d54db08771\transformed\ui-util-1.4.0\AndroidManifest.xml:20:5-44
MERGED from [androidx.compose.ui:ui-text:1.4.0] C:\Users\AlumDAM2M\.gradle\caches\transforms-3\863aa29d65d1fab407dab9e365454909\transformed\ui-text-1.4.0\AndroidManifest.xml:20:5-44
MERGED from [androidx.compose.ui:ui-text:1.4.0] C:\Users\AlumDAM2M\.gradle\caches\transforms-3\863aa29d65d1fab407dab9e365454909\transformed\ui-text-1.4.0\AndroidManifest.xml:20:5-44
MERGED from [androidx.compose.ui:ui-tooling-preview:1.4.0] C:\Users\AlumDAM2M\.gradle\caches\transforms-3\8879ed9dc8d581673ae843c1e47754d0\transformed\ui-tooling-preview-1.4.0\AndroidManifest.xml:20:5-44
MERGED from [androidx.compose.ui:ui-tooling-preview:1.4.0] C:\Users\AlumDAM2M\.gradle\caches\transforms-3\8879ed9dc8d581673ae843c1e47754d0\transformed\ui-tooling-preview-1.4.0\AndroidManifest.xml:20:5-44
MERGED from [androidx.compose.ui:ui-test-manifest:1.4.0] C:\Users\AlumDAM2M\.gradle\caches\transforms-3\c05bb655987317b0f5fe533f652e4f49\transformed\ui-test-manifest-1.4.0\AndroidManifest.xml:20:5-44
MERGED from [androidx.compose.ui:ui-test-manifest:1.4.0] C:\Users\AlumDAM2M\.gradle\caches\transforms-3\c05bb655987317b0f5fe533f652e4f49\transformed\ui-test-manifest-1.4.0\AndroidManifest.xml:20:5-44
MERGED from [androidx.compose.ui:ui-graphics:1.4.0] C:\Users\AlumDAM2M\.gradle\caches\transforms-3\008cbb88db884fd8f6b6aabf71a8efd4\transformed\ui-graphics-1.4.0\AndroidManifest.xml:20:5-44
MERGED from [androidx.compose.ui:ui-graphics:1.4.0] C:\Users\AlumDAM2M\.gradle\caches\transforms-3\008cbb88db884fd8f6b6aabf71a8efd4\transformed\ui-graphics-1.4.0\AndroidManifest.xml:20:5-44
MERGED from [androidx.compose.ui:ui-tooling:1.4.0] C:\Users\AlumDAM2M\.gradle\caches\transforms-3\c1a2611cf67705436456e1dc50643a60\transformed\ui-tooling-1.4.0\AndroidManifest.xml:20:5-44
MERGED from [androidx.compose.ui:ui-tooling:1.4.0] C:\Users\AlumDAM2M\.gradle\caches\transforms-3\c1a2611cf67705436456e1dc50643a60\transformed\ui-tooling-1.4.0\AndroidManifest.xml:20:5-44
MERGED from [androidx.activity:activity:1.7.2] C:\Users\AlumDAM2M\.gradle\caches\transforms-3\5a4514359bda7f91836967d103903068\transformed\activity-1.7.2\AndroidManifest.xml:20:5-44
MERGED from [androidx.activity:activity:1.7.2] C:\Users\AlumDAM2M\.gradle\caches\transforms-3\5a4514359bda7f91836967d103903068\transformed\activity-1.7.2\AndroidManifest.xml:20:5-44
MERGED from [androidx.activity:activity-ktx:1.7.2] C:\Users\AlumDAM2M\.gradle\caches\transforms-3\bb2ae7194fbdc11b50a90028db194cea\transformed\activity-ktx-1.7.2\AndroidManifest.xml:20:5-44
MERGED from [androidx.activity:activity-ktx:1.7.2] C:\Users\AlumDAM2M\.gradle\caches\transforms-3\bb2ae7194fbdc11b50a90028db194cea\transformed\activity-ktx-1.7.2\AndroidManifest.xml:20:5-44
MERGED from [androidx.activity:activity-compose:1.7.2] C:\Users\AlumDAM2M\.gradle\caches\transforms-3\bea7969d082ddf803bc334d76a2cb680\transformed\activity-compose-1.7.2\AndroidManifest.xml:20:5-44
MERGED from [androidx.activity:activity-compose:1.7.2] C:\Users\AlumDAM2M\.gradle\caches\transforms-3\bea7969d082ddf803bc334d76a2cb680\transformed\activity-compose-1.7.2\AndroidManifest.xml:20:5-44
MERGED from [androidx.compose.ui:ui:1.4.0] C:\Users\AlumDAM2M\.gradle\caches\transforms-3\83cf593ad36391ee132da6f44330026f\transformed\ui-1.4.0\AndroidManifest.xml:20:5-44
MERGED from [androidx.compose.ui:ui:1.4.0] C:\Users\AlumDAM2M\.gradle\caches\transforms-3\83cf593ad36391ee132da6f44330026f\transformed\ui-1.4.0\AndroidManifest.xml:20:5-44
MERGED from [androidx.customview:customview-poolingcontainer:1.0.0] C:\Users\AlumDAM2M\.gradle\caches\transforms-3\e2a90f7868dcb77c8c0e760062b7a301\transformed\customview-poolingcontainer-1.0.0\AndroidManifest.xml:20:5-21:38
MERGED from [androidx.customview:customview-poolingcontainer:1.0.0] C:\Users\AlumDAM2M\.gradle\caches\transforms-3\e2a90f7868dcb77c8c0e760062b7a301\transformed\customview-poolingcontainer-1.0.0\AndroidManifest.xml:20:5-21:38
MERGED from [androidx.emoji2:emoji2:1.3.0] C:\Users\AlumDAM2M\.gradle\caches\transforms-3\32ee973b89dcb2d4fbd1151f1e51dc48\transformed\emoji2-1.3.0\AndroidManifest.xml:21:5-44
MERGED from [androidx.emoji2:emoji2:1.3.0] C:\Users\AlumDAM2M\.gradle\caches\transforms-3\32ee973b89dcb2d4fbd1151f1e51dc48\transformed\emoji2-1.3.0\AndroidManifest.xml:21:5-44
MERGED from [androidx.lifecycle:lifecycle-livedata-core:2.6.2] C:\Users\AlumDAM2M\.gradle\caches\transforms-3\e2d11119b5e76bd52c77f0c80f978234\transformed\lifecycle-livedata-core-2.6.2\AndroidManifest.xml:20:5-44
MERGED from [androidx.lifecycle:lifecycle-livedata-core:2.6.2] C:\Users\AlumDAM2M\.gradle\caches\transforms-3\e2d11119b5e76bd52c77f0c80f978234\transformed\lifecycle-livedata-core-2.6.2\AndroidManifest.xml:20:5-44
MERGED from [androidx.lifecycle:lifecycle-process:2.6.2] C:\Users\AlumDAM2M\.gradle\caches\transforms-3\05706c52ae833ebf0f1eeda857ac0c6e\transformed\lifecycle-process-2.6.2\AndroidManifest.xml:21:5-44
MERGED from [androidx.lifecycle:lifecycle-process:2.6.2] C:\Users\AlumDAM2M\.gradle\caches\transforms-3\05706c52ae833ebf0f1eeda857ac0c6e\transformed\lifecycle-process-2.6.2\AndroidManifest.xml:21:5-44
MERGED from [androidx.lifecycle:lifecycle-viewmodel-ktx:2.6.2] C:\Users\AlumDAM2M\.gradle\caches\transforms-3\248471151cc92eae9372be4a1ffc94f3\transformed\lifecycle-viewmodel-ktx-2.6.2\AndroidManifest.xml:20:5-44
MERGED from [androidx.lifecycle:lifecycle-viewmodel-ktx:2.6.2] C:\Users\AlumDAM2M\.gradle\caches\transforms-3\248471151cc92eae9372be4a1ffc94f3\transformed\lifecycle-viewmodel-ktx-2.6.2\AndroidManifest.xml:20:5-44
MERGED from [androidx.savedstate:savedstate-ktx:1.2.1] C:\Users\AlumDAM2M\.gradle\caches\transforms-3\e032710a0e004f8c9606c8fd2d070ac1\transformed\savedstate-ktx-1.2.1\AndroidManifest.xml:20:5-44
MERGED from [androidx.savedstate:savedstate-ktx:1.2.1] C:\Users\AlumDAM2M\.gradle\caches\transforms-3\e032710a0e004f8c9606c8fd2d070ac1\transformed\savedstate-ktx-1.2.1\AndroidManifest.xml:20:5-44
MERGED from [androidx.savedstate:savedstate:1.2.1] C:\Users\AlumDAM2M\.gradle\caches\transforms-3\fcccc118d8639218088b447db6d2456f\transformed\savedstate-1.2.1\AndroidManifest.xml:20:5-44
MERGED from [androidx.savedstate:savedstate:1.2.1] C:\Users\AlumDAM2M\.gradle\caches\transforms-3\fcccc118d8639218088b447db6d2456f\transformed\savedstate-1.2.1\AndroidManifest.xml:20:5-44
MERGED from [androidx.lifecycle:lifecycle-viewmodel:2.6.2] C:\Users\AlumDAM2M\.gradle\caches\transforms-3\6e51e97be5c64ec8ffb271cca9700799\transformed\lifecycle-viewmodel-2.6.2\AndroidManifest.xml:20:5-44
MERGED from [androidx.lifecycle:lifecycle-viewmodel:2.6.2] C:\Users\AlumDAM2M\.gradle\caches\transforms-3\6e51e97be5c64ec8ffb271cca9700799\transformed\lifecycle-viewmodel-2.6.2\AndroidManifest.xml:20:5-44
MERGED from [androidx.lifecycle:lifecycle-viewmodel-savedstate:2.6.2] C:\Users\AlumDAM2M\.gradle\caches\transforms-3\075083eaab25aa43c7573c4725bb49b5\transformed\lifecycle-viewmodel-savedstate-2.6.2\AndroidManifest.xml:20:5-44
MERGED from [androidx.lifecycle:lifecycle-viewmodel-savedstate:2.6.2] C:\Users\AlumDAM2M\.gradle\caches\transforms-3\075083eaab25aa43c7573c4725bb49b5\transformed\lifecycle-viewmodel-savedstate-2.6.2\AndroidManifest.xml:20:5-44
MERGED from [androidx.core:core-ktx:1.9.0] C:\Users\AlumDAM2M\.gradle\caches\transforms-3\52f2d00f51eec33951703ca7c7f672e0\transformed\core-ktx-1.9.0\AndroidManifest.xml:5:5-44
MERGED from [androidx.core:core-ktx:1.9.0] C:\Users\AlumDAM2M\.gradle\caches\transforms-3\52f2d00f51eec33951703ca7c7f672e0\transformed\core-ktx-1.9.0\AndroidManifest.xml:5:5-44
MERGED from [androidx.autofill:autofill:1.0.0] C:\Users\AlumDAM2M\.gradle\caches\transforms-3\3aecff7474dc9f624300046773deb6dd\transformed\autofill-1.0.0\AndroidManifest.xml:20:5-22:41
MERGED from [androidx.autofill:autofill:1.0.0] C:\Users\AlumDAM2M\.gradle\caches\transforms-3\3aecff7474dc9f624300046773deb6dd\transformed\autofill-1.0.0\AndroidManifest.xml:20:5-22:41
MERGED from [androidx.core:core:1.9.0] C:\Users\AlumDAM2M\.gradle\caches\transforms-3\0e2111bda17921a3e330548840228749\transformed\core-1.9.0\AndroidManifest.xml:20:5-44
MERGED from [androidx.core:core:1.9.0] C:\Users\AlumDAM2M\.gradle\caches\transforms-3\0e2111bda17921a3e330548840228749\transformed\core-1.9.0\AndroidManifest.xml:20:5-44
MERGED from [androidx.lifecycle:lifecycle-runtime:2.6.2] C:\Users\AlumDAM2M\.gradle\caches\transforms-3\54d1e8efaadf0cf56acd3bc116ee75f0\transformed\lifecycle-runtime-2.6.2\AndroidManifest.xml:5:5-44
MERGED from [androidx.lifecycle:lifecycle-runtime:2.6.2] C:\Users\AlumDAM2M\.gradle\caches\transforms-3\54d1e8efaadf0cf56acd3bc116ee75f0\transformed\lifecycle-runtime-2.6.2\AndroidManifest.xml:5:5-44
MERGED from [androidx.lifecycle:lifecycle-runtime-ktx:2.6.2] C:\Users\AlumDAM2M\.gradle\caches\transforms-3\2af8601215dfaa1fc5d6dc1ad96e14bc\transformed\lifecycle-runtime-ktx-2.6.2\AndroidManifest.xml:20:5-44
MERGED from [androidx.lifecycle:lifecycle-runtime-ktx:2.6.2] C:\Users\AlumDAM2M\.gradle\caches\transforms-3\2af8601215dfaa1fc5d6dc1ad96e14bc\transformed\lifecycle-runtime-ktx-2.6.2\AndroidManifest.xml:20:5-44
MERGED from [androidx.compose.runtime:runtime-saveable:1.4.0] C:\Users\AlumDAM2M\.gradle\caches\transforms-3\a473d362ca1a38c4da1c390a4e5c7f62\transformed\runtime-saveable-1.4.0\AndroidManifest.xml:20:5-44
MERGED from [androidx.compose.runtime:runtime-saveable:1.4.0] C:\Users\AlumDAM2M\.gradle\caches\transforms-3\a473d362ca1a38c4da1c390a4e5c7f62\transformed\runtime-saveable-1.4.0\AndroidManifest.xml:20:5-44
MERGED from [androidx.compose.runtime:runtime:1.4.0] C:\Users\AlumDAM2M\.gradle\caches\transforms-3\0fc235a5af360833f00322421e70953b\transformed\runtime-1.4.0\AndroidManifest.xml:20:5-44
MERGED from [androidx.compose.runtime:runtime:1.4.0] C:\Users\AlumDAM2M\.gradle\caches\transforms-3\0fc235a5af360833f00322421e70953b\transformed\runtime-1.4.0\AndroidManifest.xml:20:5-44
MERGED from [androidx.profileinstaller:profileinstaller:1.3.0] C:\Users\AlumDAM2M\.gradle\caches\transforms-3\94fdbf6b73f70b7cd36ac41b7050cd94\transformed\profileinstaller-1.3.0\AndroidManifest.xml:21:5-44
MERGED from [androidx.profileinstaller:profileinstaller:1.3.0] C:\Users\AlumDAM2M\.gradle\caches\transforms-3\94fdbf6b73f70b7cd36ac41b7050cd94\transformed\profileinstaller-1.3.0\AndroidManifest.xml:21:5-44
MERGED from [androidx.versionedparcelable:versionedparcelable:1.1.1] C:\Users\AlumDAM2M\.gradle\caches\transforms-3\b53d04a8cf38a8fc32b71bb6ed7f55c3\transformed\versionedparcelable-1.1.1\AndroidManifest.xml:20:5-22:41
MERGED from [androidx.versionedparcelable:versionedparcelable:1.1.1] C:\Users\AlumDAM2M\.gradle\caches\transforms-3\b53d04a8cf38a8fc32b71bb6ed7f55c3\transformed\versionedparcelable-1.1.1\AndroidManifest.xml:20:5-22:41
MERGED from [androidx.arch.core:core-runtime:2.2.0] C:\Users\AlumDAM2M\.gradle\caches\transforms-3\a1aa9146127683506f2c4043e0dfbe3f\transformed\core-runtime-2.2.0\AndroidManifest.xml:20:5-44
MERGED from [androidx.arch.core:core-runtime:2.2.0] C:\Users\AlumDAM2M\.gradle\caches\transforms-3\a1aa9146127683506f2c4043e0dfbe3f\transformed\core-runtime-2.2.0\AndroidManifest.xml:20:5-44
MERGED from [androidx.startup:startup-runtime:1.1.1] C:\Users\AlumDAM2M\.gradle\caches\transforms-3\1e0ff56ea543286fa582405adc1aec1a\transformed\startup-runtime-1.1.1\AndroidManifest.xml:21:5-23:41
MERGED from [androidx.startup:startup-runtime:1.1.1] C:\Users\AlumDAM2M\.gradle\caches\transforms-3\1e0ff56ea543286fa582405adc1aec1a\transformed\startup-runtime-1.1.1\AndroidManifest.xml:21:5-23:41
MERGED from [androidx.tracing:tracing:1.0.0] C:\Users\AlumDAM2M\.gradle\caches\transforms-3\09265b5939e53acc57b8ffeaf281b1bc\transformed\tracing-1.0.0\AndroidManifest.xml:20:5-22:41
MERGED from [androidx.tracing:tracing:1.0.0] C:\Users\AlumDAM2M\.gradle\caches\transforms-3\09265b5939e53acc57b8ffeaf281b1bc\transformed\tracing-1.0.0\AndroidManifest.xml:20:5-22:41
MERGED from [androidx.annotation:annotation-experimental:1.3.0] C:\Users\AlumDAM2M\.gradle\caches\transforms-3\29bd92abbe0000738280b240e0f0b698\transformed\annotation-experimental-1.3.0\AndroidManifest.xml:20:5-44
MERGED from [androidx.annotation:annotation-experimental:1.3.0] C:\Users\AlumDAM2M\.gradle\caches\transforms-3\29bd92abbe0000738280b240e0f0b698\transformed\annotation-experimental-1.3.0\AndroidManifest.xml:20:5-44
	android:targetSdkVersion
		INJECTED from C:\Users\AlumDAM2M\proyectos\PM\AndroidStudio\Ejercicio04\app\src\main\AndroidManifest.xml
	android:minSdkVersion
		INJECTED from C:\Users\AlumDAM2M\proyectos\PM\AndroidStudio\Ejercicio04\app\src\main\AndroidManifest.xml
activity#androidx.activity.ComponentActivity
ADDED from [androidx.compose.ui:ui-test-manifest:1.4.0] C:\Users\AlumDAM2M\.gradle\caches\transforms-3\c05bb655987317b0f5fe533f652e4f49\transformed\ui-test-manifest-1.4.0\AndroidManifest.xml:23:9-25:39
	android:exported
		ADDED from [androidx.compose.ui:ui-test-manifest:1.4.0] C:\Users\AlumDAM2M\.gradle\caches\transforms-3\c05bb655987317b0f5fe533f652e4f49\transformed\ui-test-manifest-1.4.0\AndroidManifest.xml:25:13-36
	android:name
		ADDED from [androidx.compose.ui:ui-test-manifest:1.4.0] C:\Users\AlumDAM2M\.gradle\caches\transforms-3\c05bb655987317b0f5fe533f652e4f49\transformed\ui-test-manifest-1.4.0\AndroidManifest.xml:24:13-63
activity#androidx.compose.ui.tooling.PreviewActivity
ADDED from [androidx.compose.ui:ui-tooling:1.4.0] C:\Users\AlumDAM2M\.gradle\caches\transforms-3\c1a2611cf67705436456e1dc50643a60\transformed\ui-tooling-1.4.0\AndroidManifest.xml:23:9-25:39
	android:exported
		ADDED from [androidx.compose.ui:ui-tooling:1.4.0] C:\Users\AlumDAM2M\.gradle\caches\transforms-3\c1a2611cf67705436456e1dc50643a60\transformed\ui-tooling-1.4.0\AndroidManifest.xml:25:13-36
	android:name
		ADDED from [androidx.compose.ui:ui-tooling:1.4.0] C:\Users\AlumDAM2M\.gradle\caches\transforms-3\c1a2611cf67705436456e1dc50643a60\transformed\ui-tooling-1.4.0\AndroidManifest.xml:24:13-71
provider#androidx.startup.InitializationProvider
ADDED from [androidx.emoji2:emoji2:1.3.0] C:\Users\AlumDAM2M\.gradle\caches\transforms-3\32ee973b89dcb2d4fbd1151f1e51dc48\transformed\emoji2-1.3.0\AndroidManifest.xml:24:9-32:20
MERGED from [androidx.lifecycle:lifecycle-process:2.6.2] C:\Users\AlumDAM2M\.gradle\caches\transforms-3\05706c52ae833ebf0f1eeda857ac0c6e\transformed\lifecycle-process-2.6.2\AndroidManifest.xml:24:9-32:20
MERGED from [androidx.lifecycle:lifecycle-process:2.6.2] C:\Users\AlumDAM2M\.gradle\caches\transforms-3\05706c52ae833ebf0f1eeda857ac0c6e\transformed\lifecycle-process-2.6.2\AndroidManifest.xml:24:9-32:20
MERGED from [androidx.profileinstaller:profileinstaller:1.3.0] C:\Users\AlumDAM2M\.gradle\caches\transforms-3\94fdbf6b73f70b7cd36ac41b7050cd94\transformed\profileinstaller-1.3.0\AndroidManifest.xml:24:9-32:20
MERGED from [androidx.profileinstaller:profileinstaller:1.3.0] C:\Users\AlumDAM2M\.gradle\caches\transforms-3\94fdbf6b73f70b7cd36ac41b7050cd94\transformed\profileinstaller-1.3.0\AndroidManifest.xml:24:9-32:20
MERGED from [androidx.startup:startup-runtime:1.1.1] C:\Users\AlumDAM2M\.gradle\caches\transforms-3\1e0ff56ea543286fa582405adc1aec1a\transformed\startup-runtime-1.1.1\AndroidManifest.xml:26:9-30:34
MERGED from [androidx.startup:startup-runtime:1.1.1] C:\Users\AlumDAM2M\.gradle\caches\transforms-3\1e0ff56ea543286fa582405adc1aec1a\transformed\startup-runtime-1.1.1\AndroidManifest.xml:26:9-30:34
	tools:node
		ADDED from [androidx.emoji2:emoji2:1.3.0] C:\Users\AlumDAM2M\.gradle\caches\transforms-3\32ee973b89dcb2d4fbd1151f1e51dc48\transformed\emoji2-1.3.0\AndroidManifest.xml:28:13-31
	android:authorities
		ADDED from [androidx.emoji2:emoji2:1.3.0] C:\Users\AlumDAM2M\.gradle\caches\transforms-3\32ee973b89dcb2d4fbd1151f1e51dc48\transformed\emoji2-1.3.0\AndroidManifest.xml:26:13-68
	android:exported
		ADDED from [androidx.emoji2:emoji2:1.3.0] C:\Users\AlumDAM2M\.gradle\caches\transforms-3\32ee973b89dcb2d4fbd1151f1e51dc48\transformed\emoji2-1.3.0\AndroidManifest.xml:27:13-37
	android:name
		ADDED from [androidx.emoji2:emoji2:1.3.0] C:\Users\AlumDAM2M\.gradle\caches\transforms-3\32ee973b89dcb2d4fbd1151f1e51dc48\transformed\emoji2-1.3.0\AndroidManifest.xml:25:13-67
meta-data#androidx.emoji2.text.EmojiCompatInitializer
ADDED from [androidx.emoji2:emoji2:1.3.0] C:\Users\AlumDAM2M\.gradle\caches\transforms-3\32ee973b89dcb2d4fbd1151f1e51dc48\transformed\emoji2-1.3.0\AndroidManifest.xml:29:13-31:52
	android:value
		ADDED from [androidx.emoji2:emoji2:1.3.0] C:\Users\AlumDAM2M\.gradle\caches\transforms-3\32ee973b89dcb2d4fbd1151f1e51dc48\transformed\emoji2-1.3.0\AndroidManifest.xml:31:17-49
	android:name
		ADDED from [androidx.emoji2:emoji2:1.3.0] C:\Users\AlumDAM2M\.gradle\caches\transforms-3\32ee973b89dcb2d4fbd1151f1e51dc48\transformed\emoji2-1.3.0\AndroidManifest.xml:30:17-75
meta-data#androidx.lifecycle.ProcessLifecycleInitializer
ADDED from [androidx.lifecycle:lifecycle-process:2.6.2] C:\Users\AlumDAM2M\.gradle\caches\transforms-3\05706c52ae833ebf0f1eeda857ac0c6e\transformed\lifecycle-process-2.6.2\AndroidManifest.xml:29:13-31:52
	android:value
		ADDED from [androidx.lifecycle:lifecycle-process:2.6.2] C:\Users\AlumDAM2M\.gradle\caches\transforms-3\05706c52ae833ebf0f1eeda857ac0c6e\transformed\lifecycle-process-2.6.2\AndroidManifest.xml:31:17-49
	android:name
		ADDED from [androidx.lifecycle:lifecycle-process:2.6.2] C:\Users\AlumDAM2M\.gradle\caches\transforms-3\05706c52ae833ebf0f1eeda857ac0c6e\transformed\lifecycle-process-2.6.2\AndroidManifest.xml:30:17-78
permission#${applicationId}.DYNAMIC_RECEIVER_NOT_EXPORTED_PERMISSION
ADDED from [androidx.core:core:1.9.0] C:\Users\AlumDAM2M\.gradle\caches\transforms-3\0e2111bda17921a3e330548840228749\transformed\core-1.9.0\AndroidManifest.xml:22:5-24:47
	android:protectionLevel
		ADDED from [androidx.core:core:1.9.0] C:\Users\AlumDAM2M\.gradle\caches\transforms-3\0e2111bda17921a3e330548840228749\transformed\core-1.9.0\AndroidManifest.xml:24:9-44
	android:name
		ADDED from [androidx.core:core:1.9.0] C:\Users\AlumDAM2M\.gradle\caches\transforms-3\0e2111bda17921a3e330548840228749\transformed\core-1.9.0\AndroidManifest.xml:23:9-81
permission#com.gjs.ejercicio04.DYNAMIC_RECEIVER_NOT_EXPORTED_PERMISSION
ADDED from [androidx.core:core:1.9.0] C:\Users\AlumDAM2M\.gradle\caches\transforms-3\0e2111bda17921a3e330548840228749\transformed\core-1.9.0\AndroidManifest.xml:22:5-24:47
	android:protectionLevel
		ADDED from [androidx.core:core:1.9.0] C:\Users\AlumDAM2M\.gradle\caches\transforms-3\0e2111bda17921a3e330548840228749\transformed\core-1.9.0\AndroidManifest.xml:24:9-44
	android:name
		ADDED from [androidx.core:core:1.9.0] C:\Users\AlumDAM2M\.gradle\caches\transforms-3\0e2111bda17921a3e330548840228749\transformed\core-1.9.0\AndroidManifest.xml:23:9-81
uses-permission#${applicationId}.DYNAMIC_RECEIVER_NOT_EXPORTED_PERMISSION
ADDED from [androidx.core:core:1.9.0] C:\Users\AlumDAM2M\.gradle\caches\transforms-3\0e2111bda17921a3e330548840228749\transformed\core-1.9.0\AndroidManifest.xml:26:5-97
	android:name
		ADDED from [androidx.core:core:1.9.0] C:\Users\AlumDAM2M\.gradle\caches\transforms-3\0e2111bda17921a3e330548840228749\transformed\core-1.9.0\AndroidManifest.xml:26:22-94
uses-permission#com.gjs.ejercicio04.DYNAMIC_RECEIVER_NOT_EXPORTED_PERMISSION
ADDED from [androidx.core:core:1.9.0] C:\Users\AlumDAM2M\.gradle\caches\transforms-3\0e2111bda17921a3e330548840228749\transformed\core-1.9.0\AndroidManifest.xml:26:5-97
	android:name
		ADDED from [androidx.core:core:1.9.0] C:\Users\AlumDAM2M\.gradle\caches\transforms-3\0e2111bda17921a3e330548840228749\transformed\core-1.9.0\AndroidManifest.xml:26:22-94
meta-data#androidx.profileinstaller.ProfileInstallerInitializer
ADDED from [androidx.profileinstaller:profileinstaller:1.3.0] C:\Users\AlumDAM2M\.gradle\caches\transforms-3\94fdbf6b73f70b7cd36ac41b7050cd94\transformed\profileinstaller-1.3.0\AndroidManifest.xml:29:13-31:52
	android:value
		ADDED from [androidx.profileinstaller:profileinstaller:1.3.0] C:\Users\AlumDAM2M\.gradle\caches\transforms-3\94fdbf6b73f70b7cd36ac41b7050cd94\transformed\profileinstaller-1.3.0\AndroidManifest.xml:31:17-49
	android:name
		ADDED from [androidx.profileinstaller:profileinstaller:1.3.0] C:\Users\AlumDAM2M\.gradle\caches\transforms-3\94fdbf6b73f70b7cd36ac41b7050cd94\transformed\profileinstaller-1.3.0\AndroidManifest.xml:30:17-85
receiver#androidx.profileinstaller.ProfileInstallReceiver
ADDED from [androidx.profileinstaller:profileinstaller:1.3.0] C:\Users\AlumDAM2M\.gradle\caches\transforms-3\94fdbf6b73f70b7cd36ac41b7050cd94\transformed\profileinstaller-1.3.0\AndroidManifest.xml:34:9-52:20
	android:enabled
		ADDED from [androidx.profileinstaller:profileinstaller:1.3.0] C:\Users\AlumDAM2M\.gradle\caches\transforms-3\94fdbf6b73f70b7cd36ac41b7050cd94\transformed\profileinstaller-1.3.0\AndroidManifest.xml:37:13-35
	android:exported
		ADDED from [androidx.profileinstaller:profileinstaller:1.3.0] C:\Users\AlumDAM2M\.gradle\caches\transforms-3\94fdbf6b73f70b7cd36ac41b7050cd94\transformed\profileinstaller-1.3.0\AndroidManifest.xml:38:13-36
	android:permission
		ADDED from [androidx.profileinstaller:profileinstaller:1.3.0] C:\Users\AlumDAM2M\.gradle\caches\transforms-3\94fdbf6b73f70b7cd36ac41b7050cd94\transformed\profileinstaller-1.3.0\AndroidManifest.xml:39:13-57
	android:directBootAware
		ADDED from [androidx.profileinstaller:profileinstaller:1.3.0] C:\Users\AlumDAM2M\.gradle\caches\transforms-3\94fdbf6b73f70b7cd36ac41b7050cd94\transformed\profileinstaller-1.3.0\AndroidManifest.xml:36:13-44
	android:name
		ADDED from [androidx.profileinstaller:profileinstaller:1.3.0] C:\Users\AlumDAM2M\.gradle\caches\transforms-3\94fdbf6b73f70b7cd36ac41b7050cd94\transformed\profileinstaller-1.3.0\AndroidManifest.xml:35:13-76
intent-filter#action:name:androidx.profileinstaller.action.INSTALL_PROFILE
ADDED from [androidx.profileinstaller:profileinstaller:1.3.0] C:\Users\AlumDAM2M\.gradle\caches\transforms-3\94fdbf6b73f70b7cd36ac41b7050cd94\transformed\profileinstaller-1.3.0\AndroidManifest.xml:40:13-42:29
action#androidx.profileinstaller.action.INSTALL_PROFILE
ADDED from [androidx.profileinstaller:profileinstaller:1.3.0] C:\Users\AlumDAM2M\.gradle\caches\transforms-3\94fdbf6b73f70b7cd36ac41b7050cd94\transformed\profileinstaller-1.3.0\AndroidManifest.xml:41:17-91
	android:name
		ADDED from [androidx.profileinstaller:profileinstaller:1.3.0] C:\Users\AlumDAM2M\.gradle\caches\transforms-3\94fdbf6b73f70b7cd36ac41b7050cd94\transformed\profileinstaller-1.3.0\AndroidManifest.xml:41:25-88
intent-filter#action:name:androidx.profileinstaller.action.SKIP_FILE
ADDED from [androidx.profileinstaller:profileinstaller:1.3.0] C:\Users\AlumDAM2M\.gradle\caches\transforms-3\94fdbf6b73f70b7cd36ac41b7050cd94\transformed\profileinstaller-1.3.0\AndroidManifest.xml:43:13-45:29
action#androidx.profileinstaller.action.SKIP_FILE
ADDED from [androidx.profileinstaller:profileinstaller:1.3.0] C:\Users\AlumDAM2M\.gradle\caches\transforms-3\94fdbf6b73f70b7cd36ac41b7050cd94\transformed\profileinstaller-1.3.0\AndroidManifest.xml:44:17-85
	android:name
		ADDED from [androidx.profileinstaller:profileinstaller:1.3.0] C:\Users\AlumDAM2M\.gradle\caches\transforms-3\94fdbf6b73f70b7cd36ac41b7050cd94\transformed\profileinstaller-1.3.0\AndroidManifest.xml:44:25-82
intent-filter#action:name:androidx.profileinstaller.action.SAVE_PROFILE
ADDED from [androidx.profileinstaller:profileinstaller:1.3.0] C:\Users\AlumDAM2M\.gradle\caches\transforms-3\94fdbf6b73f70b7cd36ac41b7050cd94\transformed\profileinstaller-1.3.0\AndroidManifest.xml:46:13-48:29
action#androidx.profileinstaller.action.SAVE_PROFILE
ADDED from [androidx.profileinstaller:profileinstaller:1.3.0] C:\Users\AlumDAM2M\.gradle\caches\transforms-3\94fdbf6b73f70b7cd36ac41b7050cd94\transformed\profileinstaller-1.3.0\AndroidManifest.xml:47:17-88
	android:name
		ADDED from [androidx.profileinstaller:profileinstaller:1.3.0] C:\Users\AlumDAM2M\.gradle\caches\transforms-3\94fdbf6b73f70b7cd36ac41b7050cd94\transformed\profileinstaller-1.3.0\AndroidManifest.xml:47:25-85
intent-filter#action:name:androidx.profileinstaller.action.BENCHMARK_OPERATION
ADDED from [androidx.profileinstaller:profileinstaller:1.3.0] C:\Users\AlumDAM2M\.gradle\caches\transforms-3\94fdbf6b73f70b7cd36ac41b7050cd94\transformed\profileinstaller-1.3.0\AndroidManifest.xml:49:13-51:29
action#androidx.profileinstaller.action.BENCHMARK_OPERATION
ADDED from [androidx.profileinstaller:profileinstaller:1.3.0] C:\Users\AlumDAM2M\.gradle\caches\transforms-3\94fdbf6b73f70b7cd36ac41b7050cd94\transformed\profileinstaller-1.3.0\AndroidManifest.xml:50:17-95
	android:name
		ADDED from [androidx.profileinstaller:profileinstaller:1.3.0] C:\Users\AlumDAM2M\.gradle\caches\transforms-3\94fdbf6b73f70b7cd36ac41b7050cd94\transformed\profileinstaller-1.3.0\AndroidManifest.xml:50:25-92
