{
  "project_info": {
    "project_number": "1063075971906",
    "project_id": "ejercicioe05-4d151",
    "storage_bucket": "ejercicioe05-4d151.appspot.com"
  },
  "client": [
    {
      "client_info": {
        "mobilesdk_app_id": "1:1063075971906:android:55d26088e1ab4d4aa7bedb",
        "android_client_info": {
          "package_name": "com.gjs.ejercicioe05"
        }
      },
      "oauth_client": [
        {
          "client_id": "1063075971906-u2oi09v10cr2g5n5ced1rv62gn2bd3iv.apps.googleusercontent.com",
          "client_type": 1,
          "android_info": {
            "package_name": "com.gjs.ejercicioe05",
            "certificate_hash": "695953ba989cb5852d896a8e195acf12bfe7f631"
          }
        },
        {
          "client_id": "1063075971906-f1le5ofrm5fv776k9qgkfle5vcglsbln.apps.googleusercontent.com",
          "client_type": 3
        }
      ],
      "api_key": [
        {
          "current_key": "AIzaSyDv_ExDlX1RPlmXbBlPkQLBRfT-lMXayFI"
        }
      ],
      "services": {
        "appinvite_service": {
          "other_platform_oauth_client": [
            {
              "client_id": "1063075971906-f1le5ofrm5fv776k9qgkfle5vcglsbln.apps.googleusercontent.com",
              "client_type": 3
            }
          ]
        }
      }
    }
  ],
  "configuration_version": "1"
}