{
  "_comment": "Build with `packer build -var-file=windows-2019-us-west-2.json windows.json`",
  "aws_region": "us-west-2",
  "ami_filter": "Windows_Server-2019-English-Full-Base-*",
  "ami_owner": "801119661308",
  "ami_name_prefix": "saltstack",
  "ami_name_suffix": "windows/2019",
  "instance_type": "c5.large",
  "build_type": "base",
  "os_name": "Windows",
  "os_version": "2019",
  "user_data_file": "AWS/windows/scripts/SetUpWinRM.ps1"
}
