 NOTA 4,5


==================================
1.
4.5
- FileNotFoundError: [Errno 2] No such file or directory: 'Montecarlo/Seguimiento2/Problema1.png'
==================================
2.

4.5
-FileNotFoundError: [Errno 2] No such file or directory: 'Montecarlo/Seguimiento2/Problema2.png'
