NOTA 4,4



==================================
1.
5.0
BUEN TRABAJO!!
==================================
2.

3.5
- No se realizan bien los calculos debido a una asignación errada de
self.th_1 = np.radians(th_1)
self.th_2 = np.radians(th_1)

No se puede testear

==================================
3.
----------------------------------
p1
5
- Buen trabajo
----------------------------------
p2

5
- Buen trabajo

==================================
4.
5
- BUEN TRABAJO!!