built,floor,location,parsed,price,renewed,size,text,url
1987,,Ljubljana - Bežigrad,19.02.2019 ,115000.0,,43.3,"table class= main-table  tr td id= box-oglas-levo  								table class= oglas-podatki  tr td regija: td td b osrednjeslovenskab td tr tr td kraj: td td b ljubljanab td tr tr td predel: td td b bežigradb td tr tr td kraj ali naselje: td td b ljubljana - bežigradb td tr tr td posredovanje: td 										          td b prodamb td 										        tr tr td tip stanovanja: td 										          td b 1-sobnob td 										        tr tr td stanje objekta: td 										          td b rabljenob td 										        tr tr td leto izgradnje: td td b 1987b td tr tr td velikost (msup 2sup ): td td b 43.3b td tr tr td energetski razred: td 										          td b d   (60 - 105 kwhm2a)b td 										        tr tr td šifra pri prodajalcu: td td b 3316jb td tr tr td ime in priimek agenta: td td b jana terteib td tr tr td tel. številka: td td b +386 40 860 000b td tr tr td elektronski naslov: td td a href= mailto:abc@abc.si  abc@abc.sia td tr tr td št.licence: td td b 52b td tr table br br br strong dodatni opis:strong br p b bežigrad, polanškovab , 43, 3m2, enosobno stanovanje se nahaja v urejenem, nizkem bloku zgrajenem leta 1987, na mirni, zeleni  lokaciji v bližini vse infrastrukture trgovine, pošte, banke, vrtca, šole, avtobusne postaje, …in hkrati blizu zelenih, rekreativnih in pohodnih površin ( dobeno, rašica, …) stanovanje je zelo prijetno, funkcionalno in prostorno, ki nudi ugodno in kvalitetno bivanje. sestoji iz predsobe, kuhinje z jedilnico, velike sobe, kopalnice z wc-jem.p p prodajalec oz. lastnik nepremičnine pogojuje plačilo provizije posredovanja v višini 4 % + ddv na način, da kupec plača polovico omenjene obveznosti oziroma 2% + ddv od pogodbeno dogovorjene cene.p  br br br br br td 		td id= box-oglas-desno  		!--ostali_podatki-- 								td 							tr tr tr table",http://www.bolha.com/nepremicnine/stanovanja/stanovanja-ljubljana/stanovanje-1-sobno-ljubljana-mesto-bezigrad-433-m2-prodaja-1341971795.html
1976,1,,19.02.2019 ,134900.0,,47.2,"table class= main-table  tr td id= box-oglas-levo  								table class= oglas-podatki  tr td regija: td td b osrednjeslovenskab td tr tr td kraj: td td b ljubljanab td tr tr td predel: td td b bežigradb td tr tr td naslov: td td b puhova ulicab td tr tr td posredovanje: td 										          td b prodamb td 										        tr tr td tip stanovanja: td 										          td b 1-sobnob td 										        tr tr td stanje objekta: td 										          td b rabljenob td 										        tr tr td leto izgradnje: td td b 1976b td tr tr td leto zadnje adaptacije: td td b 2011b td tr tr td velikost (msup 2sup ): td td b 47,20b td tr tr td nadstropje: td 										          td b 1b td 										        tr tr td skupno št. nadstropij: td td b 4b td tr tr td energetski razred: td 										          td b d   (60 - 105 kwhm2a)b td 										        tr tr td šifra pri prodajalcu: td td b koda: p1281pub td tr table br br br strong dodatni opis:strong br  lj-bežigrad, puhova ulica, bs 3 - 47, 2 m2, 14nad., zgrajeno 1976, adaptirano 2011, (okna, kuhinja, kopalnica, radiatorji, elektro inštalacija), svetlo s prijetno energijo, br br zastekljen podaljšan balkon, spalnica predeljena v dva prostora, parkiranje za rampo, v bližini vsa potrebna infrastruktora, vpisano v zk., odličen nakup. cena: 134.900, 00 eurbr br koda: p1281pubr br br br hiša nepremičnine 1 d.o.o. – centrala ljubljanabr br za dodatno posredovanje podatkov o predmetni nepremičnini pokličite na brezplačni  tel. 080 87 89, sprejemna pisarna družbe hiša nepremičnine 1 d.o.o. in se dogovorite za sestanek z nepremičninskim posrednikom.br br pred prodajo vaše nepremičnine pokličite na brezplačni tel. 080 87 89 in se dogovorite za termin z našimi nepremičninskimi strokovnjaki, ki so vam na voljo za vsa vprašanja - posvet pred prodajo. (brezplačno)br br hvala za zaupanje, se priporočamo !br br br td 		td id= box-oglas-desno  		!--ostali_podatki-- 								td 							tr tr tr table",http://www.bolha.com/nepremicnine/stanovanja/stanovanja-ljubljana/stanovanje-osrednjeslovenska-ljubljana-bezigrad-1-sobno-472-m2-prodam-1342043972.html
1950,,Ljubljana - Šiska,19.02.2019 ,105000.0,,82.0,"table class= main-table  tr td id= box-oglas-levo  								table class= oglas-podatki  tr td regija: td td b osrednjeslovenskab td tr tr td kraj: td td b ljubljanab td tr tr td predel: td td b šiškab td tr tr td kraj ali naselje: td td b ljubljana - šiskab td tr tr td posredovanje: td 										          td b prodamb td 										        tr tr td tip stanovanja: td 										          td b 3-sobnob td 										        tr tr td stanje objekta: td 										          td b rabljenob td 										        tr tr td leto izgradnje: td td b 1950b td tr tr td leto zadnje adaptacije: td td b 2017b td tr tr td velikost (msup 2sup ): td td b 82b td tr tr td energetski razred: td 										          td b -b td 										        tr tr td šifra pri prodajalcu: td td b 3204jb td tr tr td ime in priimek agenta: td td b jana terteib td tr tr td tel. številka: td td b +386 40 860 000b td tr tr td elektronski naslov: td td a href= mailto:abc@abc.si  abc@abc.sia td tr tr td št.licence: td td b 52b td tr table br br br strong dodatni opis:strong br p b smlednik, hrašeb , 82m2 stan.površine, trisobno stanovanje v celoti obnovljeno leta 2017 se nahaja  v urejeni dvostanovanjski hiši na mirni, zeleni lokaciji in hkrati blizu vse infrastrukture, avtobusna postaja, trgovina, pošta, ..... stanovanje je izredno prijetno, svetlo, prostorno in fukcionalno, ki nudi ugodno in kvalitetno bivanje. poleg hiše je lastniški del vrta in garaža ter shrambe. stanovanje je v celoti opremljeno.p p prodajalec oz. lastnik nepremičnine pogojuje plačilo provizije posredovanja v višini 4 % + ddv na način, da kupec plača polovico omenjene obveznosti oziroma 2% + ddv od pogodbeno dogovorjene cene.p p  p  br br br br br td 		td id= box-oglas-desno  		!--ostali_podatki-- 								td 							tr tr tr table",http://www.bolha.com/nepremicnine/stanovanja/stanovanja-ljubljana/stanovanje-3-sobno-ljubljana-mesto-siska-smlednik-82-m2--1337997349.html
1998,Mansarda,Ljubljana - Moste,19.02.2019 ,119000.0,,60.1,"table class= main-table  tr td id= box-oglas-levo  								table class= oglas-podatki  tr td regija: td td b osrednjeslovenskab td tr tr td kraj: td td b ljubljanab td tr tr td predel: td td b mosteb td tr tr td kraj ali naselje: td td b ljubljana - mosteb td tr tr td posredovanje: td 										          td b prodamb td 										        tr tr td tip stanovanja: td 										          td b 2.5-sobnob td 										        tr tr td stanje objekta: td 										          td b rabljenob td 										        tr tr td leto izgradnje: td td b 1998b td tr tr td velikost (msup 2sup ): td td b 60.1b td tr tr td nadstropje: td 										          td b mansardab td 										        tr tr td energetski razred: td 										          td b d   (60 - 105 kwhm2a)b td 										        tr tr td šifra pri prodajalcu: td td b 389psab td tr tr td ime in priimek agenta: td td b alen komićb td tr tr td tel. številka: td td b +386 40 83 00 00b td tr tr td elektronski naslov: td td a href= mailto:abc@abc.si  abc@abc.sia td tr tr td št.licence: td td b 1766b td tr table br br br strong dodatni opis:strong br p v zalogu v ljubljani prodamo 2, 5-sobno stanovanje, ki se nahaja v mansardi oz. 2. nadstropju (od 2eh) 6-stanovanjskega bloka zgrajenega leta 1998. bruto površina meri 60, 1 m2 pri čemer je neto površina cca. 48 m2, balkon meri cca. 6 m2, shramba pa tudi cca. 6 m2.p p razporeditev prostorov: predsoba, kopalnica z banjo, kuhinja z jedilnico in dnevnim prostorom z izhodom na balkon, spalnica, kabinet.p p stanovanje je lepo vzdrževano in v celoti opremljeno. oprema je po dogovoru. orientacija: dnevna soba s kuhinjo na vzhod, spalnica in kabinet na jug in kopalnica na sever. ogrevanje je urejeno etažno na mestni plin (lastna peč). objekt ima svojega upravnika. parkiranje je mogoče na skupnih površinah okoli bloka.p p v oddaljenosti 300-400 metrov se nahaja praktično vsa pomembna infrastruktura: trgovina spar, lpp in železniška postaja, pošta, banka, šola, vrtec.p p stanovanje je vpisano v zk in bremen prosto. vseljivo v roku 2-3 mesecev.p p prodajalec oz. lastnik nepremičnine pogojuje plačilo provizije posredovanja v višini 4 % + ddv na način, da kupec plača polovico omenjene obveznosti oziroma 2% + ddv od pogodbeno dogovorjene cene.p  br br br br br br b opremab br ul class= avto_oglas  li balkonli li shramba v kletili ul br b priključkib br ul class= avto_oglas  li telefonli li klimali ul td 		td id= box-oglas-desno  		!--ostali_podatki-- 								td 							tr tr tr table",http://www.bolha.com/nepremicnine/stanovanja/stanovanja-ljubljana/stanovanje-25-sobno-ljubljana-mesto-moste-polje-zalog-601-m2--1338265793.html
1994,,Ljubljana-Šentvid,19.02.2019 ,115000.0,,51.0,"table class= main-table  tr td id= box-oglas-levo  								table class= oglas-podatki  tr td regija: td 		          td b ljubljanab td 		        tr tr td kraj: td 		          td b šentvidb td 		        tr tr td kraj ali naselje: td td b ljubljana-šentvidb td tr tr td naslov: td td b 1210b td tr tr td posredovanje: td 										          td b prodamb td 										        tr tr td tip stanovanja: td 										          td b 2-sobnob td 										        tr tr td stanje objekta: td 										          td b rabljenob td 										        tr tr td leto izgradnje: td td b 1994b td tr tr td velikost (msup 2sup ): td td b 51b td tr tr td vrt, terasa (msup 2sup ): td td b 31b td tr tr td energetski razred: td 										          td b e   (105 - 150 kwhm2a)b td 										        tr tr td šifra pri prodajalcu: td td b 490191071-55b td tr tr td ime in priimek agenta: td td b manja valdhuberb td tr tr td tel. številka: td td b 070 247 063b td tr tr td elektronski naslov: td td a href= mailto:manja.valdhuber@re-max.si  manja.valdhubera td tr table br br br strong dodatni opis:strong br ul class= avto_oglas  li opremljenoli li z razgledomli ul  posredujemo pri prodaji zelo simpatičnega dvosobnega stanovanja v šentvidu, ki se nahaja v pritličju sedem stanovanjske hiše. stanovanje zajema predsobo, dnevni prostor z jedilnico, kuhinjo, , spalnico in kopalnico. prostori so svetli in orientirani na južno stran stavbe.br  talne obloge so lamelni parket in keramika, stavbno pohištvo je pvc. ogrevanje je urejeno na individualno plinsko peč, tako da je strošek ogrevanja po porabi.br  mesečni obratovalni stroški so cca 150eur (upravitelj, elektrika, telekomunikacije, ogrevanje, voda, odvoz smeti, rezervni sklad).br  oprema ostane po dogovoru. k stanovanju pripada lastniško parkirno mesto pred stavbo in majhen atrij v izmeri 16m2, neposredno ob vhodu v stanovanje.br   trenutno je stanovanje oddano v najem. priporočamo kot investicijo.br  stavba ima veljavno gradbeno dovoljenje.br  lokacija je zelo lepa, malenkost dvignjena z odprtim pogledom. v neposredni bližini je pošta, trgovina merkator, avtobusna postaja.. v bližini so tudi številne sprehajalne poti in gozd za hiter pobeg v naravo. br  kupec plača del provizije v višini 2% + ddv.br  vabljeni k ogledu in k dajanju ponudb. cena ni dokončna. priporočamo vsem, ki želijo živeti le steljaj od mesta a vseeno v naravi.br  dvosobno stanovanje v pritličjubr br br br a rel= external nofollow  target= _blank  href= http:www.bolha.combsrpujozupntx2ktssovyevv5if536a_itca8recu5fadjftlwjqfm5ft4klgb5?adid=1338370502&amp;dst=external&amp;source=addetail&amp;action=tourl&amp;target=external&amp;redirectfrom=http:www.bolha.comnepremicninestanovanjastanovanja-ljubljanastanovanje-comma-osrednjeslovenska-comma-ljubljana-sentvid-comma-2-sobno-comma-51-m2-comma-period-period-period--1338370502.html&amp;ts=1550614093  več podatkov si oglejte na tej povezavi …a br br br br td 		td id= box-oglas-desno  		!--ostali_podatki-- 								td 							tr tr tr table",http://www.bolha.com/nepremicnine/stanovanja/stanovanja-ljubljana/stanovanje-comma-osrednjeslovenska-comma-ljubljana-sentvid-comma-2-sobno-comma-51-m2-comma-period-period-period--1338370502.html
1900,Mansarda,,19.02.2019 ,129500.0,,67.5,"table class= main-table  tr td id= box-oglas-levo  								table class= oglas-podatki  tr td regija: td td b osrednjeslovenskab td tr tr td kraj: td td b ljubljanab td tr tr td predel: td td b poljeb td tr tr td naslov: td td b ob zaloški cestib td tr tr td posredovanje: td 										          td b prodamb td 										        tr tr td tip stanovanja: td 										          td b 2.5-sobnob td 										        tr tr td stanje objekta: td 										          td b rabljenob td 										        tr tr td leto izgradnje: td td b 1900b td tr tr td leto zadnje adaptacije: td td b 2013b td tr tr td velikost (msup 2sup ): td td b 67,50b td tr tr td nadstropje: td 										          td b mansardab td 										        tr tr td energetski razred: td 										          td b ei v izdelavib td 										        tr tr td šifra pri prodajalcu: td td b b154b td tr table br br br strong dodatni opis:strong br  ob zaloški cesti, v bližini ac obroča prodamo urejeno dvoinpolsobno  stanovanje v skupni izmeri dela stavbe 67, 5 m2 (neto 59, 00 m2),  ki se nahaja  v m1.  nadstr. ( mansarda)  vzdrževane in delno adaptirane štiristanovanjske hiše , zgrajene leta 1900, leto zadnje adaptacije objekta 2013 (nova kritina na strehi, fasada) obsega predprostor,  kopalnico z wc-jem, dodatni wc, kuhinjo z večjo jedilnico, dnevno sobo, spalnico, kabinet in  balkon.  stanovanje je bilo delno obnovljeno v letih od 2010 do 2013, (nova okna, podi, delno keramika...) v ceni je zajeta tudi pripadajoča lastniška zaprta garaža na dvorišču in dodatno še dve zunanji parkirišči.br br ogrevanje je s centralno kurjavo na  trda goriva, oziroma lesno maso (ločeno – lastna etažna peč), ločeni števci za elektriko in vodo, priključek na internet (telemach - kabelski).  v  bližini je vsa infrastruktura:  avtobusna postaja šola, vrtec, trgovine in ostalo v bližini … zelo hiter dostop do ac. br br stroški so nizki (cca 110-120 eur mesečno)br br zk urejeno, etažirano in brez bremen!br br cena: 129.500 eurbr br koda: b154br br zaračunamo posredniško storitev v višini 4%+ddv, na način, da se provizija enakovredno deli med prodajalca in kupca (2%+2%+ddv).br br td 		td id= box-oglas-desno  		!--ostali_podatki-- 								td 							tr tr tr table",http://www.bolha.com/nepremicnine/stanovanja/stanovanja-ljubljana/stanovanje-osrednjeslovenska-ljubljana-polje-2-5-sobno-6750-m2-prodam-1339091420.html
1978,3,Dravlje,19.02.2019 ,125000.0,,45.6,"table class= main-table  tr td id= box-oglas-levo  								table class= oglas-podatki  tr td regija: td td b osrednjeslovenskab td tr tr td kraj: td td b ljubljanab td tr tr td predel: td td b šiškab td tr tr td kraj ali naselje: td td b dravljeb td tr tr td naslov: td td b kunaverjeva ulicab td tr tr td posredovanje: td 										          td b prodamb td 										        tr tr td tip stanovanja: td 										          td b 1.5-sobnob td 										        tr tr td stanje objekta: td 										          td b rabljenob td 										        tr tr td leto izgradnje: td td b 1978b td tr tr td velikost (msup 2sup ): td td b 45,60b td tr tr td nadstropje: td 										          td b 3b td 										        tr tr td skupno št. nadstropij: td td b 10b td tr tr td energetski razred: td 										          td b b2 (25 - 35 kwhm2a)b td 										        tr tr td tel. številka: td td b 051692390,030612211b td tr table br br br strong dodatni opis:strong br  prodam zelo prijetno in svetlo 1, 5 sobno stanovanje v urejenem naselju na kunaverjevi ulici v dravljah – neposredna bližina celotne infrastrukture (vrtec, osnovna šola, avtobusno postajališče, več trgovin). br stanovanje obsega predsobo, svetel, dnevno-bivalni prostor z izhodom na zastekljen balkon, kopalnico, kuhinjo in otroško sobo. okna v celotnem stanovanju ter na balkonu so bila zamenjana z novimi (satler).br prav tako stanovanju pripada lastniška klet (2, 73m2). v skupni uporabi je tudi kolesarnica, zamrežena postaja za odvoz smeti.br daljinsko ogrevanje (novejši radiatorji), vsi priključki, optika…br dostop do stavbe z brezstičnim ključem, možnost parkiranja pod garažami pred blokom. br zk stanje urejeno, brez bremen, vseljivo takoj.br br za več informacij prosim pokličite: 051692-390 oz. 030612-211br br br br br b opremab br ul class= avto_oglas  li balkonli li shramba v kletili li dvigaloli li dostopno za invalideli li vpisano v zemljiško knjigoli ul br b priključkib br ul class= avto_oglas  li toplovodli li plinovodli li domofonli li optikali ul br b okolicab br ul class= avto_oglas  li mestni prometli li poštali li bankali li vrtecli li osnovna šolali li trgovinali li avtobusna postajali li igriščeli li zdravstveni domli li železniška postajali li park, zelene površineli ul td 		td id= box-oglas-desno  		!--ostali_podatki-- 								td 							tr tr tr table",http://www.bolha.com/nepremicnine/stanovanja/stanovanja-ljubljana/stanovanje-osrednjeslovenska-ljubljana-siska-dravlje-1-5-sobno-456-m2-prodam-1339277177.html
1930,Pritličje,bližina stadiona,19.02.2019 ,109800.0,,60.0,"table class= main-table  tr td id= box-oglas-levo  								table class= oglas-podatki  tr td regija: td td b osrednjeslovenskab td tr tr td kraj: td td b ljubljanab td tr tr td predel: td td b bežigradb td tr tr td kraj ali naselje: td td b bližina stadionab td tr tr td posredovanje: td 										          td b prodamb td 										        tr tr td tip stanovanja: td 										          td b 2-sobnob td 										        tr tr td stanje objekta: td 										          td b rabljenob td 										        tr tr td leto izgradnje: td td b 1930b td tr tr td velikost (msup 2sup ): td td b 60,00b td tr tr td nadstropje: td 										          td b pritličjeb td 										        tr tr td energetski razred: td 										          td b ei v izdelavib td 										        tr tr td šifra pri prodajalcu: td td b b157b td tr table br br br strong dodatni opis:strong br br v bližini starega stadiona za bežigradom prodamo solidno vzdrževano dvosobno polkletno stanovanje , s površino etažne enote v izmeri 60, 00 m2, od tega čiste stanovanjske površine 50, 00 m2 + 10, 00 m2 shrambe v istem nivoju, katero je po potrebi zelo enostavno mogoče spremeniti v dodatno sobo, saj ima tudi okno. lokacija je odlična, blizu vse infrastrukture, ac obroča in centra mesta. stanovanje ni orientirano na ulico, ampak je obrnjeno v dvorišče in je vsled tega mirno, pa tudi dovolj svetlo, kljub temu, da je polkletno. obsega predprostor, kopalnico z wc-jem, manjšo prehodno kuhinjo, dnevni prostor z jedilnico, večjo sobo, kabinet in veliko shrambo. z manjšim posegom bi bilo možno narediti dve manši enoti (soglasje od sostanovalcev je po izjavi prodajalcev že pridobljeno) vsakokratnemu lastniku stanovanja po etažnem elaboratu pripadata dve parkirišči na skupnem zemljišču ob stavbi.br br br poslovno-stanovanjska stavba iz leta 1930 je bila v celoti obnovljena leta 2016 (fasada, streha, okna). ogrevanje je z električnimi radiatorji, možen pa je tudi priklop na mestni plinovod. vsi ostali priključki so urejeni. stroški so zmerni.br br vseljivo po dogovoru!br br zk urejeno, etažirano in brez bremen!br br br koda: b157br br zaračunamo posredniško storitev v višini 4%+ddv, na način, da se provizija enakovredno deli med prodajalca in kupca (2%+2%+ddv).br br br br td 		td id= box-oglas-desno  		!--ostali_podatki-- 								td 							tr tr tr table",http://www.bolha.com/nepremicnine/stanovanja/stanovanja-ljubljana/stanovanje-osrednjeslovenska-ljubljana-bezigrad-blizina-stadiona-2-sobno-6000-m2-prodam-1339591178.html
1912,,Polje,19.02.2019 ,134500.0,,49.6,"table class= main-table  tr td id= box-oglas-levo  								table class= oglas-podatki  tr td regija: td td b osrednjeslovenskab td tr tr td kraj: td td b ljubljanab td tr tr td predel: td td b mosteb td tr tr td kraj ali naselje: td td b poljeb td tr tr td posredovanje: td 										          td b prodamb td 										        tr tr td tip stanovanja: td 										          td b 2-sobnob td 										        tr tr td stanje objekta: td 										          td b rabljenob td 										        tr tr td leto izgradnje: td td b 1912b td tr tr td leto zadnje adaptacije: td td b 1997b td tr tr td velikost (msup 2sup ): td td b 49,60b td tr tr td energetski razred: td 										          td b d   (60 - 105 kwhm2a)b td 										        tr tr td ime in priimek agenta: td td b alexeja urbančičb td tr tr td tel. številka: td td b +386 51 681 666b td tr tr td elektronski naslov: td td a href= mailto:alexeja.urbancic@stan.si  alexeja.urbancica td tr table br br br strong dodatni opis:strong br  a vas posredujemo pri prodaji prijetnega 2 sobnega stanovanja z naslednjo razporeditvijo: predsoba, hodnik, kopalnica, dnevna soba v povezavi z kuhinjo, jedilni prostor in soba.br br bivalna površina stanovanja znaša 39, 1 m2 h kateri prištejemo še kletno shrambo v izmeri 3, 10 m2.br br parkiranje je omogočeno ob objektu, v bližini pa je celotna infrastruktura kot so trgovine, hiter dostop do obvoznice, osnovne šole, vrtci, pošta, …br br streha je bila obnovljena l. 2018, samo stanovanje je bilo v celoti prenovljeno l. 1997, okna pa l. 2016.br br stanovanje se nahaja v večstanovanjski hiši in je v postopku vzpostavljanja etažne lastnine.br br vabljeni na ogled.br br prodajalčev ponudbeni pogoj: kupec prevzame del stroška za posredovanje (2% pogodbene vrednosti + 22% ddv).br br br b opremab br ul class= avto_oglas  li shramba v kletili li vpisano v zemljiško knjigoli ul br b okolicab br ul class= avto_oglas  li mestni prometli li poštali li bankali li vrtecli li osnovna šolali li trgovinali li avtobusna postajali li park, zelene površineli ul td 		td id= box-oglas-desno  		!--ostali_podatki-- 								td 							tr tr tr table",http://www.bolha.com/nepremicnine/stanovanja/stanovanja-ljubljana/stanovanje-osrednjeslovenska-ljubljana-moste-polje-2-sobno-496-m2-prodam-1340068388.html
1938,1,Tacen,19.02.2019 ,119000.0,,55.0,"table class= main-table  tr td id= box-oglas-levo  								table class= oglas-podatki  tr td regija: td td b osrednjeslovenskab td tr tr td kraj: td td b ljubljanab td tr tr td predel: td td b šmarna gorab td tr tr td kraj ali naselje: td td b tacenb td tr tr td posredovanje: td 										          td b prodamb td 										        tr tr td tip stanovanja: td 										          td b 2.5-sobnob td 										        tr tr td stanje objekta: td 										          td b rabljenob td 										        tr tr td leto izgradnje: td td b 1938b td tr tr td leto zadnje adaptacije: td td b 2018b td tr tr td velikost (msup 2sup ): td td b 55,00b td tr tr td vrt, terasa (msup 2sup ): td td b 2,00b td tr tr td nadstropje: td 										          td b 1b td 										        tr tr td energetski razred: td 										          td b c   (35 - 60 kwhm2a)b td 										        tr tr td ime in priimek agenta: td td b svetlana pecnikb td tr tr td tel. številka: td td b 030923925b td tr tr td elektronski naslov: td td a href= mailto:svetlana.pecnik@gmail.com  svetlana.pecnika td tr table br br br strong dodatni opis:strong br  prodamo stanovanje, ker smo kupili hiso. stanovanje je renovirano in je takoj primerno za vselitev.stanovanje je v stanovanjski hisi (3stanovanja).pripada mu tudi klet 6 kvadratov. hisa bo v prihodnosti potrebna obnove fasade in strehe.stanovanje ima v uporabi podstresje, ki je  prav tako 55 kvadratov. to se uporablja za shranjevanje odvecnih stvari. stanovanje je znotranje strani izolirano .ogrevanje na peleti, zato so stroski ogrevanja nizki.pred hiso je postaja kjer vsak dan solski kombi poskrbi, da otroci varno pridejo v solo.prav tako je avtobusna postaja lpp- stevika 8 .primerno je tudi za odajanje preko bookinga, airbnb...zaradi dostopa do avtoceste 1km odaljenost. z avtom do centra je potrebno 20 min.v stanovanju so nova protivlomna vrata vovko od avgusta 2018 in komarniki zmontirani od poletja2018. etazna lastnina se ni vzpostavljenja, vendar smo v dogovoru, da postopek kmalu se zacne.hisa ima tudi uporabno dovoljenje po zakonu, kar pomeni da je stavba legalna. oprema lahko ostane v stanovanju vsa po dogovoru.vselitev 1.4. 2019br br br b opremab br ul class= avto_oglas  li balkonli li shramba v kletili li več parkirnih mestli li vpisano v zemljiško knjigoli ul br b priključkib br ul class= avto_oglas  li centralna kurjavali li telefonli li domofonli li kabelski internetli li klimali li optikali li ogrevanje na biomasoli ul br b okolicab br ul class= avto_oglas  li mestni prometli li poštali li bankali li vrtecli li osnovna šolali li trgovinali li avtobusna postajali li igriščeli li zdravstveni domli li park, zelene površineli ul td 		td id= box-oglas-desno  		!--ostali_podatki-- 								td 							tr tr tr table",http://www.bolha.com/nepremicnine/stanovanja/stanovanja-ljubljana/stanovanje-osrednjeslovenska-ljubljana-smarna-gora-tacen-2-5-sobno-55-m2-prodam-1340436236.html
1940,,,19.02.2019 ,119000.0,,120.1,"table class= main-table  tr td id= box-oglas-levo  								table class= oglas-podatki  tr td regija: td td b osrednjeslovenskab td tr tr td kraj: td td b ljubljanab td tr tr td predel: td td b vičb td tr tr td posredovanje: td 										          td b prodamb td 										        tr tr td tip stanovanja: td 										          td b 3-sobnob td 										        tr tr td stanje objekta: td 										          td b rabljenob td 										        tr tr td leto izgradnje: td td b 1940b td tr tr td velikost (msup 2sup ): td td b 120,10b td tr tr td energetski razred: td 										          td b g   (210+ kwhm2a)b td 										        tr tr td šifra pri prodajalcu: td td b ps4644521rdb td tr tr td ime in priimek agenta: td td b renata damišb td tr tr td tel. številka: td td b 080 1633b td tr tr td elektronski naslov: td td a href= mailto:info@atrium.si  info@atrium.sia td tr tr td št.licence: td td b 2923, mopb td tr table br br br strong dodatni opis:strong br  pozdravljeni,  br br predstavljamo vam stanovanje v dvostanovanjski hiši na umirjeni lokaciji vič - rudnika.br br kje: gornji rudnik.br br trisobno stanovanje v dvostanovanjski hiši je trenutno v fazi v obnove in ima zaradi dobre razporeditve prostorov  potencial, da se preuredi  v krasno stanovanje za oddajanje večim študentom. po podatkih gurs meri 120, 1 m2, uporabne površine ima 89, 6 m2.br nahaja se v pritličju in mansardnem delu dvostanovanjske hiše. v spodnjem pritličnem prostoru se nahajajo predprostor, po prenovi bo spodaj kopalnica s straniščem, še ena ločena toaleta z dodatnim straniščem, shramba, osrednji dnevni prostor v katerem se bo po prenovi nahajala centralna peč z ogrevanjem na pelete. iz dnevnega prostora je izhod v  kuhinjo, ki ima izhod na veliko pokrito teraso v zadnjem delu in ki bo prav tako renovirana in preurejena. v zgornjih mansardnih  prostorih se nahajajo tri sobe, talne obloge so laminat. br br zamenjana bodo tudi vsa okna in vrata, parkirišče posebej ni urejeno, je pa možnost parkiranja enega avtomobila ob hiši, parking bo po prenovi rahlo razširjen.br br etažirano in zemljiškoknjižno urejeno.br br ločen vhod s spodnjim stanovanjem, ki se nahaja v kleti, tako da je intimnost zagotovljena, po dogovoru s spodnjim sosedom je možen tudi odkup spodnjega kletnega dela.br br prenovljeno bo v roku kakšnega meseca, po prenovi bo nova cena stanovanja 140.000, 00 eur.br br vsa infrastruktura v bližini, lpp v bližini 100 m.br br za vse dodatne informacije smo vam z veseljem na voljo. br br vabljeni na ogled!br br pp: stroški posredovanja in prodajnega postopka se delijo na način, da kupec nosi stroške v višini 2%+ddv. br br lep pozdrav, renatabr br br br br b opremab br ul class= avto_oglas  li terasali li loggiali ul td 		td id= box-oglas-desno  		!--ostali_podatki-- 								td 							tr tr tr table",http://www.bolha.com/nepremicnine/stanovanja/stanovanja-ljubljana/stanovanje-osrednjeslovenska-ljubljana-vic-3-sobno-12010-m2-prodam-1341239327.html
1961,,Ljubljana,19.02.2019 ,133000.0,,45.3,"table class= main-table  tr td id= box-oglas-levo  								table class= oglas-podatki  tr td regija: td td b osrednjeslovenskab td tr tr td kraj: td td b ljubljanab td tr tr td predel: td td b centerb td tr tr td kraj ali naselje: td td b ljubljanab td tr tr td posredovanje: td 										          td b prodamb td 										        tr tr td tip stanovanja: td 										          td b 2-sobnob td 										        tr tr td stanje objekta: td 										          td b rabljenob td 										        tr tr td leto izgradnje: td td b 1961b td tr tr td leto zadnje adaptacije: td td b 1999b td tr tr td velikost (msup 2sup ): td td b 45.3b td tr tr td vrt, terasa (msup 2sup ): td td b 0b td tr tr td skupno št. nadstropij: td td b 4b td tr tr td energetski razred: td 										          td b d   (60 - 105 kwhm2a)b td 										        tr tr td šifra pri prodajalcu: td td b 101179-84b td tr tr td ime in priimek agenta: td td b amanda čilovićb td tr tr td tel. številka: td td b 040 700 229b td tr tr td elektronski naslov: td td a href= mailto:amanda.cilovic@c21.si  amanda.cilovica td tr tr td št.licence: td td b 02756b td tr table br br br strong dodatni opis:strong br p na odlični in frekventni lokaciji, posredujemo pri prodaji dvosobnega stanovanja v izmeri 45, 30m2.p p stanovanje s funkcionalnim tlorisom se nahaja v 1 . nadstropju urejene stavbe in obsega;  hodnik, otroško sobo, kuhinjo z jedilnico, večjo sobo z izhodom na balkon in kopalnico. stanovanju pripada še shramba v kletni etaži.p p stanovanje je bilo leta 1999 delno obnovljeno ( prenovljena kopalnica in kuhinja ) , leta 2001 so bila zamenjana okna.p p blok je vzdrževan in urejen. leta 2009 je bila obnovljena fasada in zamenjana streha.p p parkiranje za stanovalce je urejeno v okolici bloka.p p stanovanje je zemljiško knjižno urejeno, brez bremen.p p stanovanje se nahaja na mirni lokaciji v neposredni bližini vse potrebne infrastrukture ( zdravstveni dom, osnovna šola, vrtec, trgovine, tržnica, banka, lpp 1, 3, 5, 8, 22, 25, .. )p p stanovanje je potrebno osvežitve.p p  p p vabljeni k ogledu!p p  prodajalec pogojuje sklenitev prodajne pogodbe za predmetno nepremičnino z delitvijo plačila za posredovanje v višini 4% plus 22 % ddv na način, da kupec plača 12 (polovico) omenjene obveznosti t.j. znesek v višini 2%  plus 22 % ddv od dogovorjene prodajne cene.p  br br a rel= external nofollow  target= _blank  href= http:www.bolha.combsrpujozunu-wnqe1hrzaxyjyd1jc42xmqzgrz7vyvnx9pnufmpklbpckb7njnjwdjgijihqby.?adid=1341401174&amp;dst=external&amp;source=addetail&amp;action=tourl&amp;target=external&amp;redirectfrom=http:www.bolha.comnepremicninestanovanjastanovanja-ljubljanastanovanje-2-sobno-ljubljana-45-3-m2-prodamo-1341401174.html&amp;ts=1550614095  več podatkov si oglejte na tej povezavi ...a br br br br br b opremab br ul class= avto_oglas  li balkonli li vpisano v zemljiško knjigoli ul br b priključkib br ul class= avto_oglas  li toplovodli li telefonli ul td 		td id= box-oglas-desno  		!--ostali_podatki-- 								td 							tr tr tr table",http://www.bolha.com/nepremicnine/stanovanja/stanovanja-ljubljana/stanovanje-2-sobno-ljubljana-45-3-m2-prodamo-1341401174.html
1978,4,,19.02.2019 ,135000.0,,50.0,"table class= main-table  tr td id= box-oglas-levo  								table class= oglas-podatki  tr td regija: td td b osrednjeslovenskab td tr tr td kraj: td td b ljubljanab td tr tr td predel: td td b bežigradb td tr tr td posredovanje: td 										          td b prodamb td 										        tr tr td tip stanovanja: td 										          td b 1.5-sobnob td 										        tr tr td stanje objekta: td 										          td b rabljenob td 										        tr tr td leto izgradnje: td td b 1978b td tr tr td velikost (msup 2sup ): td td b 50,00b td tr tr td nadstropje: td 										          td b 4b td 										        tr tr td skupno št. nadstropij: td td b 4b td tr tr td energetski razred: td 										          td b d   (60 - 105 kwhm2a)b td 										        tr tr td ime in priimek agenta: td td b sonja b td tr tr td tel. številka: td td b 030255539b td tr table br br br strong dodatni opis:strong br  stanovanje meri: 50, 96 m2; soba 18, 48 m2, soba 7, 65 m2, hodnik 3, 22 m2, kopalnica 3, 62, kuhinja 11, 85; loža 0, 67 m2, klet 1, 10 m2, ter pravico souporabe skupnih delov in naprav ter funkcionalnega zemljišča ki pripada stanovanju.br br za ogled prosim pokličite na telefon br 030 255 539 sonjabr br br td 		td id= box-oglas-desno  		!--ostali_podatki-- 								td 							tr tr tr table",http://www.bolha.com/nepremicnine/stanovanja/stanovanja-ljubljana/stanovanje-osrednjeslovenska-ljubljana-bezigrad-1-5-sobno-50-m2-prodam-1341708959.html
1939,,,19.02.2019 ,130000.0,,52.0,"table class= main-table  tr td id= box-oglas-levo  								table class= oglas-podatki  tr td regija: td td b osrednjeslovenskab td tr tr td kraj: td td b ljubljanab td tr tr td predel: td td b šiškab td tr tr td posredovanje: td 										          td b prodamb td 										        tr tr td tip stanovanja: td 										          td b 1-sobnob td 										        tr tr td stanje objekta: td 										          td b rabljenob td 										        tr tr td leto izgradnje: td td b 1939b td tr tr td velikost (msup 2sup ): td td b 52,00b td tr tr td energetski razred: td 										          td b e   (105 - 150 kwhm2a)b td 										        tr tr td ime in priimek agenta: td td b anis naberb td tr tr td tel. številka: td td b +386 41 996 066b td tr tr td elektronski naslov: td td a href= mailto:anis.naber@stan.si  anis.naber@stan.sia td tr table br br br strong dodatni opis:strong br  v večstanovanjskem objektu v urbanem okolju posredujemo pri prodaji stanovanja dobre razporeditve.br br sestavlja ga: predprostor s katerega se vstopa v prostoren dnevno bivalni prostor.br br iz predprostora se vstopa v veliko kuhinjo z jedilnico in priročno shrambo.br br prav tako se iz predprostora vstopa v kopalnico iz katere je izhod na balkon.br br vsa infrastruktura je v neposredni bližini (pošta, banka, vrtec, šola, trgovine, lpp…).br br stanovanju pripadata še garaža ter klet.br br ogrevanje je na plinsko peč.br prodajalčev ponudbeni pogoj: kupec prevzame del stroška za posredovanje (2% pogodbene vrednosti + 22% ddv).br br v agenciji stan nepremičnine vam ponujamo brezplačen posvet pri iskanju nepremičnine, ki najbolj ustreza vašim željam in življenjskemu slogu. stopite v stik z nami in si rezervirajte prosti termin.br br br br br b opremab br ul class= avto_oglas  li balkonli li garažali li vpisano v zemljiško knjigoli ul br b okolicab br ul class= avto_oglas  li mestni prometli li poštali li bankali li vrtecli li osnovna šolali li trgovinali li avtobusna postajali li igriščeli li park, zelene površineli ul td 		td id= box-oglas-desno  		!--ostali_podatki-- 								td 							tr tr tr table",http://www.bolha.com/nepremicnine/stanovanja/stanovanja-ljubljana/stanovanje-osrednjeslovenska-ljubljana-siska-1-sobno-52-m2-prodam-1341760394.html
1965,,,19.02.2019 ,129900.0,,49.8,"table class= main-table  tr td id= box-oglas-levo  								table class= oglas-podatki  tr td regija: td td b osrednjeslovenskab td tr tr td kraj: td td b ljubljanab td tr tr td predel: td td b šiškab td tr tr td posredovanje: td 										          td b prodamb td 										        tr tr td tip stanovanja: td 										          td b 1-sobnob td 										        tr tr td stanje objekta: td 										          td b rabljenob td 										        tr tr td leto izgradnje: td td b 1965b td tr tr td velikost (msup 2sup ): td td b 49,80b td tr tr td energetski razred: td 										          td b a2 (10 - 15 kwhm2a)b td 										        tr tr td ime in priimek agenta: td td b alexeja urbančičb td tr tr td tel. številka: td td b +386 51 681 666b td tr tr td elektronski naslov: td td a href= mailto:alexeja.urbancic@stan.si  alexeja.urbancica td tr table br br br strong dodatni opis:strong br  posredujemo pri prodaji stanovanja, ki vam omogoča dobro investicijsko priložnost zaradi lokacije in izjemno nizkih stroškov.br br je izjemno prostorno, svetlo ter prijetno s sledečo razporeditvijo: hodnik, kuhinja z jedilnim prostorom, dnevna soba, ki je pregrajena z omaro sledi še kopalnica.br br zaradi uporabnega tlorisa je stanovanje možno preurediti v 2 sobno. uporabna površina znaša 47, 3 m2 h kateri prištejemo še kletno shrambo v izmeri 2, 50 m2.br br je izredno vzdrževano in ima obnovljene vodovodne inštalacije l. 2004, okna pa so bila zamenjana l. 2010.br br objekt je bil v celoti prenovljen, fasada l. 2017 in streha l. 2013. sam objekt je izredno dobro izoliran, tudi pozicija stanovanja je sredinska z zahodno lego kar pomenijo nizki obratovalni stroški.br br menim, da so naslednje prednosti odločilne za nakup tovrstnega stanovanja in sicer izjemno nizki stroški, jugo-zahodna lega, svetlo in prostorno ter na dosegu roke je celotna infrastruktura (mestni avtobus, trgovine, hiter dostop do obvoznice ipd.).br br vabljeni na ogled.br br prodajalčev ponudbeni pogoj: kupec prevzame del stroška za posredovanje (2% pogodbene vrednosti + 22% ddv).br br v agenciji stan nepremičnine vam ponujamo brezplačen posvet pri iskanju nepremičnine, ki najbolj ustreza vašim željam in življenjskem slogu. br br stopite v stik z nami in si rezervirajte prost termin. br br br br br b opremab br ul class= avto_oglas  li shramba v kletili li vpisano v zemljiško knjigoli ul br b okolicab br ul class= avto_oglas  li mestni prometli li poštali li bankali li vrtecli li osnovna šolali li trgovinali li avtobusna postajali li igriščeli ul td 		td id= box-oglas-desno  		!--ostali_podatki-- 								td 							tr tr tr table",http://www.bolha.com/nepremicnine/stanovanja/stanovanja-ljubljana/stanovanje-osrednjeslovenska-ljubljana-siska-1-sobno-4980-m2-prodam-1341645518.html
1932,1,Galjevica,19.02.2019 ,120500.0,,93.2,"table class= main-table  tr td id= box-oglas-levo  								table class= oglas-podatki  tr td regija: td td b osrednjeslovenskab td tr tr td kraj: td td b ljubljanab td tr tr td predel: td td b vičb td tr tr td kraj ali naselje: td td b galjevicab td tr tr td naslov: td td b ulica tomšičeve brigadeb td tr tr td posredovanje: td 										          td b prodamb td 										        tr tr td tip stanovanja: td 										          td b 2.5-sobnob td 										        tr tr td stanje objekta: td 										          td b rabljenob td 										        tr tr td leto izgradnje: td td b 1932b td tr tr td velikost (msup 2sup ): td td b 93,20b td tr tr td nadstropje: td 										          td b 1b td 										        tr tr td skupno št. nadstropij: td td b 1b td tr tr td energetski razred: td 										          td b ei v izdelavib td 										        tr table br br br strong dodatni opis:strong br  na galjevici v 2-stanovanjski hiši prodamo 2.5 sobno stanovanje z veliko teraso. stanovanje je v izmeri 93.20m2 bruto površine in 49.80m2 neto stanovanjske površine v 1.nadstropju s pokrito teraso v izmeri 16m2 in odkrito teraso 16.m2 (katera se lahko predela tudi v stanovanjski del). stanovanje ima vz lego, 11.4m2 shrambe v pritličju in eno lastniško parkirno mesto. v stanovanju so bila leta 2000 zamenjana nova 2-slojna pvc okna (razen balkonskih vrat in okna), v kopalnici in kuhinji menjana vsa odtočna in vodovodna inštalacija ter zamenjani podi. hiša je bila grajena leta 1932 in je bila v celoti dvakrat adaptirana, in sicer prvič leta 1975, prav tako zgornje nadstropje in kritina ter drugič leta 2000 je bila zamenjana v celoti streha in žlebovi (kritina betonske valovit plošče anhovo, izolacija 30cm), nova fasada leta 2003 (demit stiropor 10cm) ter hidroizolacija. ogrevanje je trenutno na kurilno olje s svojo etažno pečjo, voda kombinirano gretje na olje ter električni bojler. v hiši že priključek na zemeljski plin ter ktv siol. ker je stanovanje delno mansardno navajamo tudi višino stropov, najvišja višina je 2.30m, najnižja višina pa 1.80m, praktično pa je večji del stanovanja prostostoječ.br br razporeditev: lastni vhod s predprostorom in hodnikom, 3 ločene sobe, kuhinja, jedilnica ter kopalnica z manjšo kadjo in wc-jem z oknom. iz jedilnice izhod na pokrito teraso, iz pokrite terase vhod na odprti del terase. na pokriti terasi je zidan odprt kamin. stanovanje ima ločene števce za elektriko, za vodo trenutno po osebi, lahko pa se tudi ločijo števci za vodo.br br stanovanje je vseljivo takoj, trenutno vpisano v zemljiško knjigo po idealnih solastniških deležih. izdelave etažne lastnine je proti koncu postopka. v strogi bližini je vrtec, oš, zdravstveni dom, lekarna, trgovina, pošta, športni center, otroško igrišče, lpp, ... stanovanje se prodaja opremljeno v celoti z belo tehniko.br br stanovanje je vreden ogleda in nakupa.br br pogoj nakupa je, da se plačilo za posredovanje razdeli tako, da kupec prevzame 2%+ddv plačila za posredovanje od prodajne cene nepremičnine.br br br b opremab br ul class= avto_oglas  li terasali li shramba v kletili li parkirno mestoli li vpisano v zemljiško knjigoli ul br b priključkib br ul class= avto_oglas  li centralna kurjavali li telefonli li kabelski internetli li kabelska tvli li optikali ul br b okolicab br ul class= avto_oglas  li mestni prometli li poštali li bankali li vrtecli li osnovna šolali li trgovinali li avtobusna postajali li igriščeli li zdravstveni domli li železniška postajali li park, zelene površineli ul td 		td id= box-oglas-desno  		!--ostali_podatki-- 								td 							tr tr tr table",http://www.bolha.com/nepremicnine/stanovanja/stanovanja-ljubljana/stanovanje-osrednjeslovenska-ljubljana-vic-galjevica-2-5-sobno-9320-m2-prodam-1341916775.html
1964,1,,19.02.2019 ,135000.0,,56.3,"table class= main-table  tr td id= box-oglas-levo  								table class= oglas-podatki  tr td regija: td td b osrednjeslovenskab td tr tr td kraj: td td b ljubljanab td tr tr td predel: td td b šiškab td tr tr td posredovanje: td 										          td b prodamb td 										        tr tr td tip stanovanja: td 										          td b 2-sobnob td 										        tr tr td stanje objekta: td 										          td b rabljenob td 										        tr tr td leto izgradnje: td td b 1964b td tr tr td leto zadnje adaptacije: td td b 2004b td tr tr td velikost (msup 2sup ): td td b 56,30b td tr tr td nadstropje: td 										          td b 1b td 										        tr tr td skupno št. nadstropij: td td b 4b td tr tr td energetski razred: td 										          td b e   (105 - 150 kwhm2a)b td 										        tr tr td šifra pri prodajalcu: td td b ps4644822rdb td tr tr td ime in priimek agenta: td td b renata damišb td tr tr td tel. številka: td td b 080 1633b td tr tr td elektronski naslov: td td a href= mailto:info@atrium.si  info@atrium.sia td tr tr td št.licence: td td b 2923, mopb td tr table br br br strong dodatni opis:strong br  pozdravljeni,  br br v zgornji šiški na super lokaciji v neposredni bližini severne ljubljanske obvoznice predstavljamo dvosobno stanovanje v večstanovanjskem bloku, zelo primerno za mlad par, ki išče svoje prvo stanovanje ali mlado družino z otrokom.br br kje: litostroj.br br stanovanje se nahaja v 1. nadstropju od skupno 4 in ima 56, 3 neto tlorisne površine, od tega uporabne površine 47, 00 m2, shramba v kleti meri 5, 2 m2, stanovanje ima tudi 4, 5 m2 velik zastekljen balkon z drsnimi stekli. stanovanje je delno opremljeno kot na slikah in obsega ličen vhodni predprostor iz katerega vodijo vrata na desno v spalnico in kuhinjo, levo pa v dnevno sobo z zastekljenim balkonom, ki je trenutno neopremljena. naravnost se nahaja kopalnica. br br na stavbi je bila v letu 2017 menjana streha, obnovljena bo tudi fasada. v stanovanju so bila v letu 2004 zamenjana okna, notranja vrata s podboji ter talne obloge. radiatorji so opremljeni z varčevalnimi ventili in merilci. br br ogrevanje je radiatorsko na toplovod, sanitarna voda na elektriko, priključek za internet je kabelski, izjemno nizki obratovalni stroški skozi vse leto. talne obloge so kombinacija parketa v dnevni sobi in spalnici, kuhinja,  predprostor in kopalnica keramika. br br stanovanje je prazno in takoj vseljivo. prodajalci bodo do prodaje v stanovanju opravili tudi manjše lepotne popravke, kot je beljenje nekaterih sten, obdelava stropa, brušenje parketa.br br vsa potrebna infrastruktura v neposredni bližini: vrtec, šola, zelenica z otroškim igriščem, lpp na obeh straneh litostrojske ceste ter po celovški. bližina mercator trgovine, kina ter knjižnice šiška čez cesto. br br parkira se lahko vsepovsod okoli stavbe, možnost tudi mesečnega najema pakirišča na ključ. br br za vse dodatne informacije in oglede smo vam z veseljem na voljo. br br pp: kupec nosi stroške posredovanja v višini 2%+ddv. br br lep pozdrav, renatabr br br b opremab br ul class= avto_oglas  li balkonli li shramba v kletili li parkirno mestoli li več parkirnih mestli li vpisano v zemljiško knjigoli ul br b priključkib br ul class= avto_oglas  li toplovodli li kabelski internetli li kabelska tvli ul td 		td id= box-oglas-desno  		!--ostali_podatki-- 								td 							tr tr tr table",http://www.bolha.com/nepremicnine/stanovanja/stanovanja-ljubljana/stanovanje-osrednjeslovenska-ljubljana-siska-2-sobno-5630-m2-prodam-1341922268.html
1964,4,Ljubljana ,19.02.2019 ,135000.0,,52.5,"table class= main-table  tr td id= box-oglas-levo  								table class= oglas-podatki  tr td regija: td td b osrednjeslovenskab td tr tr td kraj: td td b ljubljanab td tr tr td predel: td td b centerb td tr tr td kraj ali naselje: td td b ljubljana b td tr tr td naslov: td td b ul. martina krpanab td tr tr td posredovanje: td 										          td b prodamb td 										        tr tr td tip stanovanja: td 										          td b 2-sobnob td 										        tr tr td stanje objekta: td 										          td b rabljenob td 										        tr tr td leto izgradnje: td td b 1964b td tr tr td velikost (msup 2sup ): td td b 52.5b td tr tr td nadstropje: td 										          td b 4b td 										        tr tr td skupno št. nadstropij: td td b 5b td tr tr td energetski razred: td 										          td b ei v izdelavib td 										        tr tr td šifra pri prodajalcu: td td b bb_mkb td tr tr td ime in priimek agenta: td td b borut bartolb td tr tr td tel. številka: td td b 041632 283b td tr tr td elektronski naslov: td td a href= mailto:borut@nepremicnine-plus.si  boruta td tr tr td št.licence: td td b 338b td tr table br br br strong dodatni opis:strong br p stanovanje obsega: bivalno kuhinjo, dve sobi, hodnik, kopalnico in balkon (izhod iz kuhinje). pripadata mu dve kletni shrambi. stanovanje ima zamenjana okna (pvc, 2011), ostalo je prvotno a normalno vzdrževano.p p v sobah je po tleh položen klasičen hrastov parket, v kuhinji in na hodniku laminat, v kopalnici pa keramika. ogrevanje je daljinsko, radiatorsko, vezano na mestno toplarno. za pripravo tople sanitarne vode je v kopalnici nameščen električni boljer.p p v bližini objekta je vsa osnovna urbana infrastruktura (osnovna šola, vrtec, banka, pošta, ipd.) blizu je tudi postakjališče mestnega potniškega prometa.p p  p p stanovanje se nahaja v 4. nadstropju, objekt nima dvigala. fasada na bloku je bila obnovljena in toplotno izolirana (2016), obnovljeni so tudi domofoni, potrebna pa je še obnova stopnišča.p p  p p stanovanje je takoj vseljivo, zk urejeno in orientirano proti jv.p p ponudbeni pogoj prodajalca: del plačila za posredovanje v višini 2%+ddv prevzame kupec.p  br br br br br br b opremab br ul class= avto_oglas  li balkonli ul td 		td id= box-oglas-desno  		!--ostali_podatki-- 								td 							tr tr tr table",http://www.bolha.com/nepremicnine/stanovanja/stanovanja-ljubljana/stanovanje-2-sobno-ljubljana-mesto-siska-siska-525-m2--1341943643.html
1926,1,,19.02.2019 ,121500.0,,44.0,"table class= main-table  tr td id= box-oglas-levo  								table class= oglas-podatki  tr td regija: td td b osrednjeslovenskab td tr tr td kraj: td td b ljubljanab td tr tr td predel: td td b mosteb td tr tr td posredovanje: td 										          td b prodamb td 										        tr tr td tip stanovanja: td 										          td b 2-sobnob td 										        tr tr td stanje objekta: td 										          td b rabljenob td 										        tr tr td leto izgradnje: td td b 1926b td tr tr td leto zadnje adaptacije: td td b 2006b td tr tr td velikost (msup 2sup ): td td b 44,00b td tr tr td nadstropje: td 										          td b 1b td 										        tr tr td skupno št. nadstropij: td td b 2b td tr tr td energetski razred: td 										          td b d   (60 - 105 kwhm2a)b td 										        tr tr td tel. številka: td td b 031705-449b td tr tr td elektronski naslov: td td a href= mailto:info@neptun-nepremicnine.si  infoa td tr table br br br strong dodatni opis:strong br  prenovljeno manjše dvosobno stanovanje v 1. nadstropju nižjega stanovanjskega bloka v mirni okolici na dostopni lokaciji v ulici vide pregarčeve.br br stanovanje je izjemno prijetno in svetlo, razteza se po celotni širini stavbe in je orientirano v treh smereh: s-j-v. kljub manjši kvadraturi je stanovanje prostorno zaradi uporabno zasnovanega tlorisa, ki obsega: hodnik, svetlo bivalno kuhinjo z jedilnim kotom, dnevno sobo, spalnico in kopalnico z oknom in dnevno svetlobo. v kletni etaži se nahaja prostorna shramba, ki meri 7m2. stanovanje je v letih 2006-2008 v celoti obnovljeno, zamenjane instalacije, okna in vrata, prenovljena kopalnica in kuhinja. v stanovanju so vsi priključki, internet-optika, klimatska naprava, ogrevanje je daljinsko, voda na električni bojler.br stanovanjska stavba brez dvigala je urejena in vzdrževana. leta 2006 sta bili obnovljeni streha in fasada. v stavbi je tudi kolesarnica .br lokacija je odlična, ker omogoča hiter in enostaven dostop do centra mesta ter obvoznice. v bližnji okolici se nahaja vsa potrebna infrastruktura: tržnica moste, lpp več linij, kulturni dom španski borci, univerzitetni klinični center z vsemi zdravstvenimi ustanovami.br primerno tudi kot investicija oz. za oddajanje.br ponudbeni pogoj prodajalca je , da se plačilo za opravljeno storitev posredovanja razdeli tako, da ob nakupu kupec prevzame plačilo v višini 2% od dogovorjene prodajne vrednosti.br br vabljeni k ogledu.br br br br b opremab br ul class= avto_oglas  li vpisano v zemljiško knjigoli ul td 		td id= box-oglas-desno  		!--ostali_podatki-- 								td 							tr tr tr table",http://www.bolha.com/nepremicnine/stanovanja/stanovanja-ljubljana/stanovanje-osrednjeslovenska-ljubljana-moste-2-sobno-44-m2-prodam-1341903341.html
1977,,Ljubljana - Šiska,19.02.2019 ,123000.0,,44.4,"table class= main-table  tr td id= box-oglas-levo  								table class= oglas-podatki  tr td regija: td td b osrednjeslovenskab td tr tr td kraj: td td b ljubljanab td tr tr td predel: td td b šiškab td tr tr td kraj ali naselje: td td b ljubljana - šiskab td tr tr td posredovanje: td 										          td b prodamb td 										        tr tr td tip stanovanja: td 										          td b 1-sobnob td 										        tr tr td stanje objekta: td 										          td b rabljenob td 										        tr tr td leto izgradnje: td td b 1977b td tr tr td velikost (msup 2sup ): td td b 44.4b td tr tr td energetski razred: td 										          td b c   (35 - 60 kwhm2a)b td 										        tr tr td šifra pri prodajalcu: td td b 3304jb td tr tr td ime in priimek agenta: td td b jana terteib td tr tr td tel. številka: td td b +386 40 860 000b td tr tr td elektronski naslov: td td a href= mailto:abc@abc.si  abc@abc.sia td tr tr td št.licence: td td b 52b td tr table br br br strong dodatni opis:strong br p b moste, štepanjsko naseljeb , 44m2, enosobno stanovanje se nahaja v urejeni stolpnici zgrajeni leta 1977, na mirni lokaciji v bližini vse infrastrukture: banke, pošte, trgovine, avtobusne postaje in hkrati blizu narave, zelenih, površin stran od mestnega vrveža. stanovanje je izredno lepo vzdrževano, svetlo, prostorno in funkcionalno. sestoji iz predsobe, kopalnice z wc-jem, velike bivalne kuhinje z jedilnico, sobe z izhodom na balkon. talna obloga je parket, keramika.p p prodajalec oz. lastnik nepremičnine pogojuje plačilo provizije posredovanja v višini 4 % + ddv na način, da kupec plača polovico omenjene obveznosti oziroma 2% + ddv od pogodbeno dogovorjene cene.p  br br br br br br b opremab br ul class= avto_oglas  li balkonli ul td 		td id= box-oglas-desno  		!--ostali_podatki-- 								td 							tr tr tr table",http://www.bolha.com/nepremicnine/stanovanja/stanovanja-ljubljana/stanovanje-1-sobno-ljubljana-mesto-siska-siska-444-m2--1341488567.html
1964,1,Ljubeljska ulica,19.02.2019 ,135000.0,,51.0,"table class= main-table  tr td id= box-oglas-levo  								table class= oglas-podatki  tr td regija: td td b osrednjeslovenskab td tr tr td kraj: td td b ljubljanab td tr tr td predel: td td b šiškab td tr tr td kraj ali naselje: td td b ljubeljska ulicab td tr tr td posredovanje: td 										          td b prodamb td 										        tr tr td tip stanovanja: td 										          td b 2-sobnob td 										        tr tr td stanje objekta: td 										          td b rabljenob td 										        tr tr td leto izgradnje: td td b 1964b td tr tr td leto zadnje adaptacije: td td b 2003b td tr tr td velikost (msup 2sup ): td td b 51,00b td tr tr td nadstropje: td 										          td b 1b td 										        tr tr td skupno št. nadstropij: td td b 4b td tr tr td energetski razred: td 										          td b -b td 										        tr table br br br strong dodatni opis:strong br  prodam  prijetno dvosobno stanovanje v mirnem predelu šiške. vabim, da me za več informacij pokličete in se dogovorimo za ogled. 041 849 723br br br b opremab br ul class= avto_oglas  li balkonli li shramba v kletili li parkirno mestoli ul br b priključkib br ul class= avto_oglas  li toplovodli li centralna kurjavali li kabelski internetli li kabelska tvli ul br b okolicab br ul class= avto_oglas  li mestni prometli li vrtecli li osnovna šolali li trgovinali li igriščeli li park, zelene površineli ul td 		td id= box-oglas-desno  		!--ostali_podatki-- 								td 							tr tr tr table",http://www.bolha.com/nepremicnine/stanovanja/stanovanja-ljubljana/stanovanje-osrednjeslovenska-ljubljana-siska-ljubeljska-ulica-2-sobno-51-m2-prodam-1341996644.html
1906,Mansarda,Ljubljana - Šiska,19.02.2019 ,125000.0,,53.9,"table class= main-table  tr td id= box-oglas-levo  								table class= oglas-podatki  tr td regija: td td b osrednjeslovenskab td tr tr td kraj: td td b ljubljanab td tr tr td predel: td td b šiškab td tr tr td kraj ali naselje: td td b ljubljana - šiskab td tr tr td posredovanje: td 										          td b prodamb td 										        tr tr td tip stanovanja: td 										          td b 2-sobnob td 										        tr tr td stanje objekta: td 										          td b rabljenob td 										        tr tr td leto izgradnje: td td b 1906b td tr tr td leto zadnje adaptacije: td td b 1995b td tr tr td velikost (msup 2sup ): td td b 53.9b td tr tr td nadstropje: td 										          td b mansardab td 										        tr tr td skupno št. nadstropij: td td b 2b td tr tr td energetski razred: td 										          td b -b td 										        tr tr td šifra pri prodajalcu: td td b sp598759b td tr tr td tel. številka: td td b +386(0)70 720 834b td tr table br br br strong dodatni opis:strong br p lj. šiška, 53, 9 m2, 2-sobno, zgrajeno l. 1906, adaptirano l. 1995, mansarda, prodamo. cena: 125.000, 00 eurp p osnovno o nepremičnini:  prostorno 2 sobno stanovanje na odlični lokaciji v bližini centra, tivolija, rožnika. stanovanju se nahaja v 6 stanovanjski hiši z upravnikom. stanovanju pripada kletni prostor, drvarnica na dvorišču, shramba in parkirno mesto za hišo.p p razporeditev prostorov: mansardno stanovanje obsega majhno predsobo, kopalnico, kuhinjo z jedilnico, manjšo spalnico in velik osrednji prostor.p p stanje:  stanovanje je bilo v celoti adaptirano leta 1995.p p opremljenost: po dogovoru.p p priključki: ogrevanje ck na elektriko ali trda goriva, optika.p p vsa infrastruktura v neposredni bližini,  zemljiškoknjižno urejeno.p p pogoj prodajalca je delitev provizije v skupni vrednosti 4% + ddv na kupoprodajno vrednost in sicer na način, da krije prodajalec 1 polovico in kupec 1 polovico, torej vsak 2%+ ddv. vabljeni na ogled!p p naročite energetsko izkaznico - tajnistvo@roni-nepremicnine.si, 070 720 834br br vabimo vas, da se oglasite v naših pisarnah. poskrbimo za varen nakup in celotno podporo v postopku nakupa nepremičnine. vabljeni na ogled in na našo facebook stran!p  br br br br br td 		td id= box-oglas-desno  		!--ostali_podatki-- 								td 							tr tr tr table",http://www.bolha.com/nepremicnine/stanovanja/stanovanja-ljubljana/stanovanje-2-sobno-ljubljana-mesto-siska-spodnja-siska-539--1305457643.html
1903,Mansarda,Ljubljana-Vižmarje,19.02.2019 ,133000.0,,60.0,"table class= main-table  tr td id= box-oglas-levo  								table class= oglas-podatki  tr td regija: td td b osrednjeslovenskab td tr tr td kraj: td td b ljubljanab td tr tr td predel: td td b šentvidb td tr tr td kraj ali naselje: td td b ljubljana-vižmarjeb td tr tr td posredovanje: td 										          td b prodamb td 										        tr tr td tip stanovanja: td 										          td b 3-sobnob td 										        tr tr td stanje objekta: td 										          td b rabljenob td 										        tr tr td leto izgradnje: td td b 1903b td tr tr td leto zadnje adaptacije: td td b 2006b td tr tr td velikost (msup 2sup ): td td b 60,00b td tr tr td nadstropje: td 										          td b mansardab td 										        tr tr td skupno št. nadstropij: td td b 3b td tr tr td energetski razred: td 										          td b b1 (15 - 25 kwhm2a)b td 										        tr tr td ime in priimek agenta: td td b ivanab td tr tr td tel. številka: td td b 040655-101b td tr tr td elektronski naslov: td td a href= mailto:robi.colnar@gmail.com  robi.colnara td tr table br br br strong dodatni opis:strong br  prodamo tri sobno mansardno stanovanje veliko 60 m2 v več stanovanjski hiši, s samostojno zidano garažo velikosti 16m2 in dodatnim parkirnim prostorom pred hišo.stanovanje je bilo v celoti adaptirano leta 2008: nova okna, nova vrata nova električna napeljava, nove odtočne cevi, etažna centralna, klima, optična povezava ftth. več stanovanjska hiša je oblečena v novo fasado (eko sklad), popolnoma nove vodovodne cevi in kanalizacija, novi žlebovi. stanovanje se sestoji iz hodnika, kopalnice, kuhinje z jedilnico, ter treh sob.stanovanju še pripada del podstrehe za sušenje perila.v bližini je vsa infrastruktura: šola, zdravstveni dom, knjižnica, trgovina, banka, vrtec, avtocestna povezava.vabljeni na ogled.info na tel.:ivana, 040655-101br br br b opremab br ul class= avto_oglas  li shramba v kletili li garažali li parkirno mestoli li pokrit parkirni prostorli li vpisano v zemljiško knjigoli ul br b priključkib br ul class= avto_oglas  li telefonli li klimali li optikali li toplotna črpalkali li ip televizijali ul br b okolicab br ul class= avto_oglas  li mestni prometli li poštali li bankali li vrtecli li osnovna šolali li trgovinali li avtobusna postajali li igriščeli li zdravstveni domli li park, zelene površineli ul td 		td id= box-oglas-desno  		!--ostali_podatki-- 								td 							tr tr tr table",http://www.bolha.com/nepremicnine/stanovanja/stanovanja-ljubljana/stanovanje-osrednjeslovenska-ljubljana-sentvid-ljubljana-vizmarje-3-sobno-6000-m2-prodam-1281811880.html
1960,1,Savlje,19.02.2019 ,89000.0,,49.3,"table class= main-table  tr td id= box-oglas-levo  								table class= oglas-podatki  tr td regija: td td b osrednjeslovenskab td tr tr td kraj: td td b ljubljanab td tr tr td predel: td td b bežigradb td tr tr td kraj ali naselje: td td b savljeb td tr tr td posredovanje: td 										          td b prodamb td 										        tr tr td tip stanovanja: td 										          td b 2-sobnob td 										        tr tr td stanje objekta: td 										          td b rabljenob td 										        tr tr td leto izgradnje: td td b 1960b td tr tr td leto zadnje adaptacije: td td b 1997b td tr tr td velikost (msup 2sup ): td td b 49,30b td tr tr td nadstropje: td 										          td b 1b td 										        tr tr td energetski razred: td 										          td b d   (60 - 105 kwhm2a)b td 										        tr tr td šifra pri prodajalcu: td td b 10172b td tr tr td ime in priimek agenta: td td b urošb td tr tr td tel. številka: td td b 041435-626b td tr tr td elektronski naslov: td td a href= mailto:info@mka.si  info@mka.sia td tr table br br br strong dodatni opis:strong br  posredujemo pri prodaji manjšega dvosobnega stanovanja, ki se nahaja v 4 stanovanjski hiši.br stanovanje je v prvem nadstropju - delno mansardnem delu in je veliko 39, 7m2.br obsega: hodnik, dve sobi, bivalno kuhinjo ter kopalnico. iz kuhinje je izhod na večji balkon v velikosti 9, 6m2. v leti 1997 je bilo stanovanje delno obnovljeno (kopalnica, kuhinja, okna...). streha in fasada na hiši, pa sta bili obnovljeni leta 2000.br stanovanje ostane opremljeno in ima vse priključke (ogrevanje na plin).br br spodnji del hiše je bil v osnovi zgrajen leta 1800, del v katerem se nahaja stanovanje, pa v 1960-ih. vpisano v zemljiško knjigo v idealnem deležu - lastništvo urejeno. br br ponudbeni pogoj prodajalca je, da se plačilo za posredovanje razdeli tako, da kupec prevzame del plačila v višini 2% + ddv od dogovorjene prodajne cene nepremičnine.br br vabljeni, da si ogledate preostalo ponudbo nepremičnin na naši spletni strani www.mka.si.  prav tako vas vabimo, da nas kontaktirate, za posredovanje pri prodaji ali oddaji vaše nepremičnine na info@mka.sibr br td 		td id= box-oglas-desno  		!--ostali_podatki-- 								td 							tr tr tr table",http://www.bolha.com/nepremicnine/stanovanja/stanovanja-ljubljana/stanovanje-osrednjeslovenska-ljubljana-bezigrad-savlje-2-sobno-493-m2-prodam-1320176314.html
1800,1,Savlje,19.02.2019 ,89000.0,,49.3,"table class= main-table  tr td id= box-oglas-levo  								table class= oglas-podatki  tr td regija: td td b osrednjeslovenskab td tr tr td kraj: td td b ljubljanab td tr tr td predel: td td b bežigradb td tr tr td kraj ali naselje: td td b savljeb td tr tr td posredovanje: td 										          td b prodamb td 										        tr tr td tip stanovanja: td 										          td b 2-sobnob td 										        tr tr td stanje objekta: td 										          td b rabljenob td 										        tr tr td leto izgradnje: td td b 1800b td tr tr td leto zadnje adaptacije: td td b 1997b td tr tr td velikost (msup 2sup ): td td b 49,30b td tr tr td nadstropje: td 										          td b 1b td 										        tr tr td energetski razred: td 										          td b -b td 										        tr tr td šifra pri prodajalcu: td td b g95b td tr table br br br strong dodatni opis:strong br  v večstanovanjski hiši prodamo stanovanje, ki se nahaja v prvem nadstropju.  stanovanje je delno mansardno in meri skupaj s teraso 49, 30 m2. obsega hodnik, kopalnico, kuhinjo z jedilnico, dve sobi ter veliko teraso. v letu 1997 so bila obnovljena okna, kopalnica ter kuhinja, v letu 2000 streha in fasada.br br večstanovanjska hiša z 4 stanovanji.br br stanovanje se prodaja opremljeno.br br stanovanje je vpisano v zk in prosto bremen.br br vabljeni k ogledu.br br cena: 89.000 eurbr br koda: g95br br zaračunamo posredniško storitev v višini 4%+ddv, na način, da se provizija enakovredno deli med prodajalca in kupca (2%+2%+ddv). br br br br b opremab br ul class= avto_oglas  li terasali li garažali li parkirno mestoli li vpisano v zemljiško knjigoli ul br b priključkib br ul class= avto_oglas  li plinovodli ul td 		td id= box-oglas-desno  		!--ostali_podatki-- 								td 							tr tr tr table",http://www.bolha.com/nepremicnine/stanovanja/stanovanja-ljubljana/stanovanje-osrednjeslovenska-ljubljana-bezigrad-savlje-2-sobno-4930-m2-prodam-1329934222.html
1946,Mansarda,Ljubljana - Črnuče,19.02.2019 ,119500.0,,68.0,"table class= main-table  tr td id= box-oglas-levo  								table class= oglas-podatki  tr td regija: td td b osrednjeslovenskab td tr tr td kraj: td td b ljubljanab td tr tr td predel: td td b črnučeb td tr tr td kraj ali naselje: td td b ljubljana - črnučeb td tr tr td naslov: td td b ježab td tr tr td posredovanje: td 										          td b prodamb td 										        tr tr td tip stanovanja: td 										          td b 2.5-sobnob td 										        tr tr td stanje objekta: td 										          td b rabljenob td 										        tr tr td leto izgradnje: td td b 1946b td tr tr td leto zadnje adaptacije: td td b 2010b td tr tr td velikost (msup 2sup ): td td b 68b td tr tr td nadstropje: td 										          td b mansardab td 										        tr tr td skupno št. nadstropij: td td b 1b td tr tr td energetski razred: td 										          td b f   (150 - 210 kwhm2a)b td 										        tr tr td šifra pri prodajalcu: td td b je_isb td tr tr td ime in priimek agenta: td td b nejc šinkb td tr tr td tel. številka: td td b 040792 903b td tr tr td elektronski naslov: td td a href= mailto:nejc@nepremicnine-plus.si  nejca td tr tr td št.licence: td td b 1906b td tr table br br br strong dodatni opis:strong br p style= text-align: justify;  ob zasavski cesti - nadgorica se nahaja manjše naselje ježa katero je oddaljeno cca 8 km iz centra ljubljane in ga povezuje mpp št. 8 in 21.p p style= text-align: justify;  dvoinpolsobno stanovanje se nahaja v petstanovanjskem objektu zgrajenem 1946 leta vendar je objekt v celoti obnovljen. fasada je bila obnovljena 2003 in streha 1996. ravno tako stopnišče, vhodna vrata in stopniščna okna. hiša obsega tri etaže; klet, pritličje in mansardo. p p style= text-align: justify;  dvoinpolsobno stanovnje se nahaja v mansardi v izmeri 54, 10m2 uporabne površine katera predstavlja: velika predsoba iz katere je vstop v dve sobi, kuhinjo z dnevnim prostorom in kopalnico. po tleh predsobe, obeh sob, kuhinje in priročne shrambe je položen parket, po kopalnici pa stenska in talna keramika. stanovanje je prostorno in svetlo. p p style= text-align: justify;  dodatna soba v izmeri 13, 90m2 se nahaja v pritličju in ima svoj vhod - iz stopnišča ima po tleh položen parket in je primerna za samostojno sobo za odraščajočega otroka kateri želi imeti svojo intimo ali pa za pisarno. p p style= text-align: justify;  skupna izmera stanovanja z dodatno sobo je 68, 00m2 + klet 2, 40m2 je 70, 40m2 kar predstavlja skupno površino dela stavbe.p p style= text-align: justify;  celotno stanovanje je bilo obnovljeno leta 2010, okna in vrata so lesena termopan.p p style= text-align: justify;  stanovanju pripadata določena dva parkirna prostora ob objektu.p p style= text-align: justify;  celoten objekt se ogreva ck - skupna peč na kurilno olje, ogrevanje vode je na bojler, internet telemach zmogljivost 120 mbs. stanovanje je klimatizirano.p p style= text-align: justify;  stroški za tri osebe (olje, voda, elektrika, internet..) je cca 84eur mesečno ali cca 1007eur letno.p p style= text-align: justify;  vpisano v zemljiško knjigo - etažirano, brez bremen. vseljivo v enem mesecu. stanovanje se prodaja delno opremljeno. p p style= text-align: justify;  vseljivo takoj po plačilu kupnine. p p style= text-align: justify;  v bližini se nahajajo lepe sprehajalne poti. bližina narave.p p style= text-align: justify;  ponudbeni pogoj prodajalca: plačilo za posredovanje se razdeli tako, da kupec prevzame strošek v višini 2% + ddv, obračunano od pogodbene vrednosti.p  br br br br br br b opremab br ul class= avto_oglas  li shramba v kletili li parkirno mestoli ul br b priključkib br ul class= avto_oglas  li klimali ul td 		td id= box-oglas-desno  		!--ostali_podatki-- 								td 							tr tr tr table",http://www.bolha.com/nepremicnine/stanovanja/stanovanja-ljubljana/stanovanje-v-vecstanovanjski-hisi-stanovanje-25-sobno--1333940866.html
1889,,Ljubljana,19.02.2019 ,134000.0,,46.0,"table class= main-table  tr td id= box-oglas-levo  								table class= oglas-podatki  tr td regija: td 		          td b ljubljanab td 		        tr tr td kraj: td 		          td b centerb td 		        tr tr td kraj ali naselje: td td b ljubljanab td tr tr td naslov: td td b 1000b td tr tr td posredovanje: td 										          td b prodamb td 										        tr tr td tip stanovanja: td 										          td b 2-sobnob td 										        tr tr td stanje objekta: td 										          td b rabljenob td 										        tr tr td leto izgradnje: td td b 1889b td tr tr td velikost (msup 2sup ): td td b 46b td tr tr td vrt, terasa (msup 2sup ): td td b 46b td tr tr td energetski razred: td 										          td b -b td 										        tr tr td šifra pri prodajalcu: td td b 490191064-10b td tr tr td ime in priimek agenta: td td b ingrid feldb td tr tr td tel. številka: td td b 040 453 001b td tr tr td elektronski naslov: td td a href= mailto:ingrid.feld@re-max.si  ingrid.felda td tr table br br br strong dodatni opis:strong br ul class= avto_oglas  li opremljenoli li garderobna sobali li ogrevanali ul  na prestižni lokaciji v centru mesta prodamo 1-sobno mansardno stanovanje z vzhodno lego. stanovanje se nahaja v 3. nastropju vzdrževane staromeščanske stavbe brez dvigala.br  leta 2003 so bile na novo narejene vse inštalacije, streha objekta pa je bila zamenjana pred tremi leti.br  stanovanje obsega: predsobo, kuhinjo z večjim jedilnim kotičkom, kopalnico ter spalnico, pripada mu tudi klet ter kolesarnica in sušilnica v souporabi. parkiranje je možno na notranjem dvorišču za rampo.br  prodaja se opremljeno oz. po dogovoru. možna menjava za lepo stanovanje v kosezah - z dvigalom ali v nižjem nadstropju. br  brez stroškov posredovanja za kupce!br  prijazno vabljeni na ogled!br  1-sobno ljubljana prešernovabr br br br a rel= external nofollow  target= _blank  href= http:www.bolha.combsrpujozupntx2ktssovyevv5if536a_itca8recu7sytkznjnxejrrimshxadl?adid=1334469022&amp;dst=external&amp;source=addetail&amp;action=tourl&amp;target=external&amp;redirectfrom=http:www.bolha.comnepremicninestanovanjastanovanja-ljubljanastanovanje-comma-osrednjeslovenska-comma-ljubljana-comma-2-sobno-comma-46-m2-comma-prodamo-1334469022.html&amp;ts=1550614100  več podatkov si oglejte na tej povezavi …a br br br br td 		td id= box-oglas-desno  		!--ostali_podatki-- 								td 							tr tr tr table",http://www.bolha.com/nepremicnine/stanovanja/stanovanja-ljubljana/stanovanje-comma-osrednjeslovenska-comma-ljubljana-comma-2-sobno-comma-46-m2-comma-prodamo-1334469022.html
1998,Mansarda,Ljubljana - Moste,19.02.2019 ,100000.0,,87.83,"table class= main-table  tr td id= box-oglas-levo  								table class= oglas-podatki  tr td regija: td td b osrednjeslovenskab td tr tr td kraj: td td b ljubljanab td tr tr td predel: td td b mosteb td tr tr td kraj ali naselje: td td b ljubljana - mosteb td tr tr td posredovanje: td 										          td b prodamb td 										        tr tr td tip stanovanja: td 										          td b 2.5-sobnob td 										        tr tr td stanje objekta: td 										          td b rabljenob td 										        tr tr td leto izgradnje: td td b 1998b td tr tr td leto zadnje adaptacije: td td b 2008b td tr tr td velikost (msup 2sup ): td td b 87.83b td tr tr td nadstropje: td 										          td b mansardab td 										        tr tr td energetski razred: td 										          td b d   (60 - 105 kwhm2a)b td 										        tr tr td šifra pri prodajalcu: td td b 292psab td tr tr td ime in priimek agenta: td td b alen komićb td tr tr td tel. številka: td td b +386 40 83 00 00b td tr tr td elektronski naslov: td td a href= mailto:abc@abc.si  abc@abc.sia td tr tr td št.licence: td td b 1766b td tr table br br br strong dodatni opis:strong br p v tomačevem v ljubljani prodamo investicijsko zelo zanimivo 2, 5-sobno stanovanje, ki se nahaja v mansardi večstanovanjske hiše zgrajene leta 1998. stanovanje trenutno meri dobrih 60 m2, vendar je po novem gradbenem dovoljenju prevideno in nujno (postopek legalizacije) povečanje stanovanjske površine na 87, 83 m2 z dvigom strehe in s tem povečanjem kolenčnega zidu.p p stanovanje je lepo ohranjeno, praktično povsem opremljeno, svetlo in prostorno. hiša ima od leta 2008 že novo streho. stanovanje ima svoj ločen vhod preko zunanjega stopnišča, pripadajoči 2 parkirni mesti ob hiši in pripadajočo shrambo.br br razporeditev prostorov (s površinami po predvidenem dvigu strehe): balkon pred vhodom v stanovanje (3, 25 m2), predsobahodnik z garderobo (9, 04 m2), kopalnica s tuš kabino (4, 38 m2), garderoba (8, 96 m2), kuhinja z jedilnico (12, 04 m2), dnevna soba (10, 90 m2), spalnica (13, 52 m2), kabinetotroška soba (15, 38 m2). tloris stanovanja po predvidenem dvigu strehe je priložen k oglasu.br br ogrevanje je centralno in povsem individualno za to stanovanje na elektriko (lastna peč). obratovalni stroški so relativno nizki (pozimi do max. 200 eur, poleti do max. 70 eur). prodaja se praktično v celoti opremljeno.p p vseljivo takoj. vpisano v zk z urejeno etažno lastnino.p p prodajalec oz. lastnik nepremičnine pogojuje plačilo provizije posredovanja v višini 4 % + ddv na način, da kupec plača polovico omenjene obveznosti oziroma 2% + ddv od pogodbeno dogovorjene cene.p  br br br br br br b opremab br ul class= avto_oglas  li balkonli li shramba v kletili ul br b priključkib br ul class= avto_oglas  li telefonli li klimali ul td 		td id= box-oglas-desno  		!--ostali_podatki-- 								td 							tr tr tr table",http://www.bolha.com/nepremicnine/stanovanja/stanovanja-ljubljana/stanovanje-25-sobno-ljubljana-mesto-moste-polje-moste-8783-m2--1334590342.html
1960,4,,19.02.2019 ,129000.0,,49.7,"table class= main-table  tr td id= box-oglas-levo  								table class= oglas-podatki  tr td regija: td td b osrednjeslovenskab td tr tr td kraj: td td b ljubljanab td tr tr td predel: td td b šiškab td tr tr td posredovanje: td 										          td b prodamb td 										        tr tr td tip stanovanja: td 										          td b 1.5-sobnob td 										        tr tr td stanje objekta: td 										          td b rabljenob td 										        tr tr td leto izgradnje: td td b 1960b td tr tr td leto zadnje adaptacije: td td b 2012b td tr tr td velikost (msup 2sup ): td td b 49,70b td tr tr td nadstropje: td 										          td b 4b td 										        tr tr td skupno št. nadstropij: td td b 4b td tr tr td energetski razred: td 										          td b d   (60 - 105 kwhm2a)b td 										        tr tr td ime in priimek agenta: td td b zmago hribarb td tr tr td tel. številka: td td b 041 620 691b td tr tr td elektronski naslov: td td a href= mailto:zmago.hribar@moneta-nepremicnine.si  zmago.hribara td tr table br br br strong dodatni opis:strong br  ljubljana šiška; na odlični lokaciji na šišenski cesti prodamo svetlo enoinpolsobno stanovanje v skupni izmeri 49, 7 m2. stanovanje z zelo uporabnim in funkcionalnim razporedom prostorov se nahaja v četrtem nadstropju urejenega bloka, ki je bil zgrajen leta 1960. stanovanje je obrnjeno na vzhod, na notranjo stran soseske, z večjim delom pogleda na park, kar omogoča prijetno, mirno bivalno okolje. stanovanje obsega predprostor, bivalno kuhinjo, z izhodom na zastekljen balkon, dnevni prostor, kabinet,  ki lahko služi kot otroška soba ali manjša spalnica, ter kopalnica. stanovanju v kletni etaži pripadata dva kletna prostora. v stanovanju so bila leta 2012  vgrajena nova proti vlomna vrata, vgrajena so bila nova okna v vseh sobah ter na zastekljenem balkonu, na novo pa je bila zgrajena tudi kopalnica. na bloku je bila leta 2012 zamenjana streha in narejena nova toplotnoizolacijska fasada. stanovanje ima vse potrebne priključke, v bloku je napeljana tudi optika. v bližini bloka je vsa potrebna infrastruktura. stanovanje je vredno ogleda. cena za stanovanje je 129.000, 00 eur. drugi pogoji prodaje: plačilo za posredovanje se razdeli tako, da kupec plača del stroška za posredovanje v višini 2% + ddv od prodajne cene.  br br td 		td id= box-oglas-desno  		!--ostali_podatki-- 								td 							tr tr tr table",http://www.bolha.com/nepremicnine/stanovanja/stanovanja-ljubljana/stanovanje-osrednjeslovenska-ljubljana-siska-1-5-sobno-497-m2-prodam-1341970061.html
