%YAML 1.1
%TAG !u! tag:unity3d.com,2011:
--- !u!1045 &1
EditorBuildSettings:
  m_ObjectHideFlags: 0
  serializedVersion: 2
  m_Scenes:
  - enabled: 1
    path: Assets/Scenes/Loading.unity
    guid: 23f751b0dd2b5445098981f8b47399fa
  - enabled: 1
    path: Assets/Scenes/Task1-2.unity
    guid: e9017d5f96b9f09489b4b37e1d6eb914
  - enabled: 1
    path: Assets/Scenes/Task3.unity
    guid: 9fc0d4010bbf28b4594072e72b8655ab
  m_configObjects: {}
