<svg width="24" height="24" viewBox="0 0 64 64" fill="none" xmlns="http://www.w3.org/2000/svg">
<path d="M38.207 52.254C46.4338 52.254 53.103 45.5642 53.103 37.312C53.103 29.0598 46.4338 22.37 38.207 22.37C29.9801 22.37 23.311 29.0598 23.311 37.312C23.311 45.5642 29.9801 52.254 38.207 52.254Z" fill="#EC4A4B"/>
<path d="M58.837 16.122C58.852 16.05 58.88 14.546 58.88 14.546C58.88 13.942 58.393 13.452 57.79 13.452H52.954C52.431 13.452 52.012 13.832 51.909 14.33L50.226 8.649C49.971 8.081 48.721 7.159 47.971 6.951C45.681 6.316 41.942 6 38.206 6C34.468 6 30.729 6.316 28.438 6.951C27.689 7.159 26.438 8.081 26.184 8.649L24.084 15.737H22.229V14.464C22.2295 13.9223 22.0149 13.4026 21.6324 13.0191C21.2498 12.6357 20.7307 12.4198 20.189 12.419H11.136C10.8678 12.4193 10.6023 12.4724 10.3546 12.5753C10.107 12.6783 9.88204 12.829 9.69267 13.0189C9.50331 13.2088 9.35323 13.4342 9.25102 13.6822C9.14881 13.9301 9.09647 14.1958 9.097 14.464V15.737H7.1C4.284 15.737 2 18.028 2 20.852V49.242C2 52.065 4.283 54.356 7.1 54.356H26.519C29.9523 56.7341 34.0306 58.0056 38.207 58C42.546 58 46.571 56.653 49.894 54.356H56.9C59.716 54.356 62 52.065 62 49.242V20.852C62.0003 19.839 61.6998 18.8488 61.1368 18.0067C60.5737 17.1646 59.7733 16.5087 58.837 16.122V16.122ZM38.207 56.119C27.867 56.119 19.456 47.683 19.456 37.312C19.456 26.941 27.867 18.504 38.207 18.504C48.545 18.504 56.956 26.941 56.956 37.312C56.956 47.683 48.545 56.119 38.207 56.119Z" fill="#EC4A4B"/>
</svg>
