<svg width="24" height="24" viewBox="0 0 100 100" fill="none" xmlns="http://www.w3.org/2000/svg">
<path d="M19.53 28.49C18.7765 28.4922 18.0401 28.7153 17.4122 29.1318C16.7842 29.5482 16.2922 30.1397 15.997 30.833C6.70597 31.364 -0.0290288 32.257 -2.87778e-05 32.955C0.0269712 33.648 6.71197 33.952 15.928 33.679C16.248 34.541 16.864 35.259 17.666 35.706H16.17V38.448H14.34C14.2251 38.4479 14.1114 38.4704 14.0052 38.5142C13.899 38.5581 13.8026 38.6225 13.7213 38.7036C13.64 38.7848 13.5756 38.8812 13.5316 38.9873C13.4876 39.0934 13.465 39.2071 13.465 39.322V41.276C13.465 41.759 13.856 42.15 14.339 42.15H26.655C29.758 42.88 30.105 43.993 32.429 46.03C32.049 48.143 31.489 50.45 31.051 52.444V69.417C31.051 69.972 31.2714 70.5042 31.6639 70.8966C32.0563 71.289 32.5885 71.5095 33.1435 71.5095C33.6984 71.5095 34.2307 71.289 34.6231 70.8966C35.0155 70.5042 35.236 69.972 35.236 69.417V61.21C35.188 54.31 36.302 51.52 40.141 46.179L41.106 45.731C41.106 49.877 43.972 50.126 48.014 51.051H44.978C44.054 51.051 43.304 51.801 43.304 52.726V62.726C43.304 63.65 44.054 64.4 44.978 64.4H55.022C55.946 64.4 56.696 63.65 56.696 62.726V52.726C56.696 51.801 55.946 51.052 55.022 51.052H51.989C56.03 50.124 58.894 49.876 58.894 45.731L59.859 46.179C64.716 51.205 64.764 54.626 64.764 61.209V69.416C64.764 69.971 64.9844 70.5032 65.3768 70.8956C65.7693 71.288 66.3015 71.5085 66.8565 71.5085C67.4114 71.5085 67.9437 71.288 68.3361 70.8956C68.7285 70.5032 68.949 69.971 68.949 69.416V52.444C68.436 50.253 67.887 47.957 67.369 45.682C69.568 43.527 70.47 43.042 73.325 42.15H85.661C85.8928 42.15 86.1151 42.0579 86.279 41.894C86.4429 41.7301 86.535 41.5078 86.535 41.276V39.322C86.535 39.0902 86.4429 38.8679 86.279 38.704C86.1151 38.5401 85.8928 38.448 85.661 38.448H83.83V35.706H82.334C83.1364 35.2591 83.7528 34.5403 84.072 33.679C93.288 33.952 99.973 33.648 100 32.955C100.029 32.257 93.294 31.365 84.003 30.833C83.7181 30.1644 83.2499 29.59 82.6525 29.1762C82.055 28.7624 81.3527 28.5261 80.6266 28.4945C79.9006 28.4629 79.1804 28.6374 78.5492 28.9978C77.9181 29.3581 77.4018 29.8897 77.06 30.531C67.753 30.248 60.957 30.549 60.918 31.247C60.889 31.94 67.533 32.827 76.745 33.359C76.8802 33.8528 77.1124 34.3147 77.4282 34.7176C77.7439 35.1206 78.1369 35.4566 78.584 35.706H77.088V38.448C67.654 38.426 60.352 33.685 50 33.49C39.997 33.702 31.62 38.448 22.912 38.448V35.706H21.416C21.8631 35.4566 22.256 35.1206 22.5718 34.7176C22.8875 34.3147 23.1198 33.8528 23.255 33.359C32.467 32.827 39.111 31.939 39.082 31.247C39.043 30.549 32.247 30.247 22.94 30.531C22.6106 29.9132 22.1191 29.3968 21.5183 29.0373C20.9175 28.6779 20.2301 28.489 19.53 28.491V28.49ZM50 53.503C52.347 53.503 54.276 55.432 54.276 57.779C54.276 60.126 52.347 62.056 50 62.056C47.653 62.056 45.722 60.126 45.722 57.779C45.722 55.432 47.652 53.503 50 53.503ZM50 56.013C49.01 56.013 48.233 56.789 48.233 57.779C48.233 58.769 49.01 59.545 50 59.545C50.99 59.545 51.765 58.769 51.765 57.779C51.765 56.789 50.99 56.013 50 56.013Z" fill="#EC4A4B"/>
</svg>
