ID;fiscalcode;firstname;lastname;groupId;email;username;password;type
1;BNCPPP08D07L331B;Pippo;Bianchi;M2A;pippo.bianchi@mestre.network;pippo.bianchi;Az-123456;studente
2;VRDPRN05R25D612T;Paperino;Verdi;S1B;pap68@hotmail.com;paperino.verdi;Az-654321;studente
3;DRSPLT83M15H620X;Pluto;De Rossi;;;pluto.derossi;Az-135236;docente
4;RSSMRA05T09E715E;Mario;Rossi;S3A;m.rossi@libero.it;mario.rossi;Az-098765;studente
5;GLLLNU80D47L219K;Luana;Gallo;;luana.gallo@mestre.network;luana.gallo;Az-567890;docente
6;LTRGGI84B24L407B;Gigi;La Trottola;;;gigi.latrottola;Az-086975;docente
7;DLVGFR06H15H620X;Gianfranco;Di Livio;S3A;gianfranco.dilivio@mestre.network;gianfranco.dilivio;Az-649032;studente
8;FRRBBR06E71L736V;Barbara;Ferrari;S1B;;barbara.ferrari;Az-092653;studente
9;RSSTLL77P20G224U;Tullio;Russo;;tullio@gmail.com;tullio.russo;Az-167290;docente
10;CTALNI70S68C957H;Lina;Cata;;;lina.cata;Az-120965;docente