%YAML 1.1
%TAG !u! tag:unity3d.com,2011:
--- !u!1045 &1
EditorBuildSettings:
  m_ObjectHideFlags: 0
  serializedVersion: 2
  m_Scenes:
  - enabled: 1
    path: Assets/Scenes/SC_DEBUT.unity
    guid: b5732db221ee0f44f81283edde7e9cc2
  - enabled: 1
    path: Assets/Scenes/NEW SCENE/Sc_Transition.unity
    guid: e0606b4f7ddea2045b7b03374e1655a4
  - enabled: 1
    path: Assets/Scenes/NEW SCENE/Sc_Menu2.unity
    guid: 1fa56b231dcf5524c9c54b0cb9019c63
  - enabled: 1
    path: Assets/Scenes/NEW SCENE/Sc_Neon.unity
    guid: 43ed05d48f877734db2b6e9ce2069b82
  - enabled: 1
    path: Assets/Scenes/NEW SCENE/Sc_Ice.unity
    guid: b58a3d06d345fca45a3af73f76b90834
  - enabled: 1
    path: Assets/Scenes/Sc_Automne.unity
    guid: 00d9f478979c853439fffc7b55889e88
  - enabled: 1
    path: Assets/Scenes/Sc_Vegetation.unity
    guid: 70016f600389e4542bd2014155fc6c0e
  - enabled: 1
    path: Assets/Scenes/NEW SCENE/Sc_fin.unity
    guid: ecbb127d3c3701041b27b297b2449949
  m_configObjects: {}
