%YAML 1.1
%TAG !u! tag:unity3d.com,2011:
--- !u!1 &474305561040822096
GameObject:
  m_ObjectHideFlags: 0
  m_CorrespondingSourceObject: {fileID: 0}
  m_PrefabInstance: {fileID: 0}
  m_PrefabAsset: {fileID: 0}
  serializedVersion: 6
  m_Component:
  - component: {fileID: 1012539553772454603}
  - component: {fileID: 2993766068223330846}
  m_Layer: 0
  m_Name: Bricks 1
  m_TagString: Untagged
  m_Icon: {fileID: 0}
  m_NavMeshLayer: 0
  m_StaticEditorFlags: 0
  m_IsActive: 1
--- !u!4 &1012539553772454603
Transform:
  m_ObjectHideFlags: 0
  m_CorrespondingSourceObject: {fileID: 0}
  m_PrefabInstance: {fileID: 0}
  m_PrefabAsset: {fileID: 0}
  m_GameObject: {fileID: 474305561040822096}
  m_LocalRotation: {x: 0, y: 0, z: 0, w: 1}
  m_LocalPosition: {x: 0, y: 0, z: 0}
  m_LocalScale: {x: 1, y: 1, z: 1}
  m_Children:
  - {fileID: 1427317118865320403}
  m_Father: {fileID: 0}
  m_RootOrder: 0
  m_LocalEulerAnglesHint: {x: 0, y: 0, z: 0}
--- !u!65 &2993766068223330846
BoxCollider:
  m_ObjectHideFlags: 0
  m_CorrespondingSourceObject: {fileID: 0}
  m_PrefabInstance: {fileID: 0}
  m_PrefabAsset: {fileID: 0}
  m_GameObject: {fileID: 474305561040822096}
  m_Material: {fileID: 0}
  m_IsTrigger: 0
  m_Enabled: 1
  serializedVersion: 2
  m_Size: {x: 2, y: 1, z: 1}
  m_Center: {x: 0, y: 0, z: 0}
--- !u!1001 &1460397895591153208
PrefabInstance:
  m_ObjectHideFlags: 0
  serializedVersion: 2
  m_Modification:
    m_TransformParent: {fileID: 1012539553772454603}
    m_Modifications:
    - target: {fileID: -8679921383154817045, guid: 3425ac3ad2ccccf45b3f55df7fadf602,
        type: 3}
      propertyPath: m_LocalPosition.x
      value: 0
      objectReference: {fileID: 0}
    - target: {fileID: -8679921383154817045, guid: 3425ac3ad2ccccf45b3f55df7fadf602,
        type: 3}
      propertyPath: m_LocalPosition.y
      value: 0
      objectReference: {fileID: 0}
    - target: {fileID: -8679921383154817045, guid: 3425ac3ad2ccccf45b3f55df7fadf602,
        type: 3}
      propertyPath: m_LocalPosition.z
      value: 0
      objectReference: {fileID: 0}
    - target: {fileID: -8679921383154817045, guid: 3425ac3ad2ccccf45b3f55df7fadf602,
        type: 3}
      propertyPath: m_LocalRotation.x
      value: 0
      objectReference: {fileID: 0}
    - target: {fileID: -8679921383154817045, guid: 3425ac3ad2ccccf45b3f55df7fadf602,
        type: 3}
      propertyPath: m_LocalRotation.y
      value: -0.7071068
      objectReference: {fileID: 0}
    - target: {fileID: -8679921383154817045, guid: 3425ac3ad2ccccf45b3f55df7fadf602,
        type: 3}
      propertyPath: m_LocalRotation.z
      value: 0
      objectReference: {fileID: 0}
    - target: {fileID: -8679921383154817045, guid: 3425ac3ad2ccccf45b3f55df7fadf602,
        type: 3}
      propertyPath: m_LocalRotation.w
      value: 0.7071068
      objectReference: {fileID: 0}
    - target: {fileID: -8679921383154817045, guid: 3425ac3ad2ccccf45b3f55df7fadf602,
        type: 3}
      propertyPath: m_RootOrder
      value: 0
      objectReference: {fileID: 0}
    - target: {fileID: -8679921383154817045, guid: 3425ac3ad2ccccf45b3f55df7fadf602,
        type: 3}
      propertyPath: m_LocalEulerAnglesHint.x
      value: 0
      objectReference: {fileID: 0}
    - target: {fileID: -8679921383154817045, guid: 3425ac3ad2ccccf45b3f55df7fadf602,
        type: 3}
      propertyPath: m_LocalEulerAnglesHint.y
      value: -90
      objectReference: {fileID: 0}
    - target: {fileID: -8679921383154817045, guid: 3425ac3ad2ccccf45b3f55df7fadf602,
        type: 3}
      propertyPath: m_LocalEulerAnglesHint.z
      value: 0
      objectReference: {fileID: 0}
    - target: {fileID: -8679921383154817045, guid: 3425ac3ad2ccccf45b3f55df7fadf602,
        type: 3}
      propertyPath: m_LocalScale.x
      value: 27
      objectReference: {fileID: 0}
    - target: {fileID: -8679921383154817045, guid: 3425ac3ad2ccccf45b3f55df7fadf602,
        type: 3}
      propertyPath: m_LocalScale.y
      value: 31
      objectReference: {fileID: 0}
    - target: {fileID: -8679921383154817045, guid: 3425ac3ad2ccccf45b3f55df7fadf602,
        type: 3}
      propertyPath: m_LocalScale.z
      value: 27
      objectReference: {fileID: 0}
    - target: {fileID: -7511558181221131132, guid: 3425ac3ad2ccccf45b3f55df7fadf602,
        type: 3}
      propertyPath: m_Materials.Array.data[0]
      value: 
      objectReference: {fileID: 2100000, guid: b5c7c4dbc5b429846b39768cd1cdf563, type: 2}
    - target: {fileID: 919132149155446097, guid: 3425ac3ad2ccccf45b3f55df7fadf602,
        type: 3}
      propertyPath: m_Name
      value: Brique_Automne
      objectReference: {fileID: 0}
    m_RemovedComponents: []
  m_SourcePrefab: {fileID: 100100000, guid: 3425ac3ad2ccccf45b3f55df7fadf602, type: 3}
--- !u!4 &1427317118865320403 stripped
Transform:
  m_CorrespondingSourceObject: {fileID: -8679921383154817045, guid: 3425ac3ad2ccccf45b3f55df7fadf602,
    type: 3}
  m_PrefabInstance: {fileID: 1460397895591153208}
  m_PrefabAsset: {fileID: 0}
