%YAML 1.1
%TAG !u! tag:unity3d.com,2011:
--- !u!1001 &798812245934283418
PrefabInstance:
  m_ObjectHideFlags: 0
  serializedVersion: 2
  m_Modification:
    m_TransformParent: {fileID: 0}
    m_Modifications:
    - target: {fileID: 352380445727978083, guid: 9affc00d90f84a345b8ba9fb0484cb43,
        type: 3}
      propertyPath: m_LocalPosition.x
      value: 0
      objectReference: {fileID: 0}
    - target: {fileID: 352380445727978083, guid: 9affc00d90f84a345b8ba9fb0484cb43,
        type: 3}
      propertyPath: m_LocalPosition.y
      value: -0.01
      objectReference: {fileID: 0}
    - target: {fileID: 352380445727978083, guid: 9affc00d90f84a345b8ba9fb0484cb43,
        type: 3}
      propertyPath: m_LocalPosition.z
      value: -1.89
      objectReference: {fileID: 0}
    - target: {fileID: 352380445727978083, guid: 9affc00d90f84a345b8ba9fb0484cb43,
        type: 3}
      propertyPath: m_LocalRotation.x
      value: -0.5
      objectReference: {fileID: 0}
    - target: {fileID: 352380445727978083, guid: 9affc00d90f84a345b8ba9fb0484cb43,
        type: 3}
      propertyPath: m_LocalRotation.y
      value: 0
      objectReference: {fileID: 0}
    - target: {fileID: 352380445727978083, guid: 9affc00d90f84a345b8ba9fb0484cb43,
        type: 3}
      propertyPath: m_LocalRotation.z
      value: 0
      objectReference: {fileID: 0}
    - target: {fileID: 352380445727978083, guid: 9affc00d90f84a345b8ba9fb0484cb43,
        type: 3}
      propertyPath: m_LocalRotation.w
      value: 0.8660254
      objectReference: {fileID: 0}
    - target: {fileID: 352380445727978083, guid: 9affc00d90f84a345b8ba9fb0484cb43,
        type: 3}
      propertyPath: m_RootOrder
      value: 0
      objectReference: {fileID: 0}
    - target: {fileID: 352380445727978083, guid: 9affc00d90f84a345b8ba9fb0484cb43,
        type: 3}
      propertyPath: m_LocalEulerAnglesHint.x
      value: -60
      objectReference: {fileID: 0}
    - target: {fileID: 352380445727978083, guid: 9affc00d90f84a345b8ba9fb0484cb43,
        type: 3}
      propertyPath: m_LocalEulerAnglesHint.y
      value: 0
      objectReference: {fileID: 0}
    - target: {fileID: 352380445727978083, guid: 9affc00d90f84a345b8ba9fb0484cb43,
        type: 3}
      propertyPath: m_LocalEulerAnglesHint.z
      value: 0
      objectReference: {fileID: 0}
    - target: {fileID: 2320851493700523948, guid: 9affc00d90f84a345b8ba9fb0484cb43,
        type: 3}
      propertyPath: m_RenderMode
      value: 0
      objectReference: {fileID: 0}
    - target: {fileID: 2320851493700523948, guid: 9affc00d90f84a345b8ba9fb0484cb43,
        type: 3}
      propertyPath: m_Materials.Array.data[0]
      value: 
      objectReference: {fileID: 2100000, guid: c092b6ab5ae055f46a0d0434161e61e8, type: 2}
    - target: {fileID: 2320851493700523948, guid: 9affc00d90f84a345b8ba9fb0484cb43,
        type: 3}
      propertyPath: m_NormalDirection
      value: 0
      objectReference: {fileID: 0}
    - target: {fileID: 2320851493700523948, guid: 9affc00d90f84a345b8ba9fb0484cb43,
        type: 3}
      propertyPath: m_Mesh
      value: 
      objectReference: {fileID: 7383792095373788928, guid: d2c1e0a9d68da51428d50a52126d1150,
        type: 3}
    - target: {fileID: 3600989833533335479, guid: 9affc00d90f84a345b8ba9fb0484cb43,
        type: 3}
      propertyPath: EmissionModule.m_Bursts.Array.size
      value: 1
      objectReference: {fileID: 0}
    - target: {fileID: 3600989833533335479, guid: 9affc00d90f84a345b8ba9fb0484cb43,
        type: 3}
      propertyPath: EmissionModule.m_Bursts.Array.data[0].countCurve.maxCurve.m_Curve.Array.size
      value: 2
      objectReference: {fileID: 0}
    - target: {fileID: 3600989833533335479, guid: 9affc00d90f84a345b8ba9fb0484cb43,
        type: 3}
      propertyPath: EmissionModule.m_Bursts.Array.data[0].countCurve.minCurve.m_Curve.Array.size
      value: 2
      objectReference: {fileID: 0}
    - target: {fileID: 3600989833533335479, guid: 9affc00d90f84a345b8ba9fb0484cb43,
        type: 3}
      propertyPath: ColorModule.enabled
      value: 1
      objectReference: {fileID: 0}
    - target: {fileID: 3600989833533335479, guid: 9affc00d90f84a345b8ba9fb0484cb43,
        type: 3}
      propertyPath: InitialModule.rotation3D
      value: 0
      objectReference: {fileID: 0}
    - target: {fileID: 3600989833533335479, guid: 9affc00d90f84a345b8ba9fb0484cb43,
        type: 3}
      propertyPath: ColorModule.gradient.maxGradient.key0.r
      value: 1
      objectReference: {fileID: 0}
    - target: {fileID: 3600989833533335479, guid: 9affc00d90f84a345b8ba9fb0484cb43,
        type: 3}
      propertyPath: ColorModule.gradient.maxGradient.key0.g
      value: 1
      objectReference: {fileID: 0}
    - target: {fileID: 3600989833533335479, guid: 9affc00d90f84a345b8ba9fb0484cb43,
        type: 3}
      propertyPath: ColorModule.gradient.maxGradient.key0.b
      value: 1
      objectReference: {fileID: 0}
    - target: {fileID: 3600989833533335479, guid: 9affc00d90f84a345b8ba9fb0484cb43,
        type: 3}
      propertyPath: ColorModule.gradient.maxGradient.ctime0
      value: 0
      objectReference: {fileID: 0}
    - target: {fileID: 3600989833533335479, guid: 9affc00d90f84a345b8ba9fb0484cb43,
        type: 3}
      propertyPath: ColorModule.gradient.maxGradient.key2.r
      value: 1
      objectReference: {fileID: 0}
    - target: {fileID: 3600989833533335479, guid: 9affc00d90f84a345b8ba9fb0484cb43,
        type: 3}
      propertyPath: ColorModule.gradient.maxGradient.key2.g
      value: 1
      objectReference: {fileID: 0}
    - target: {fileID: 3600989833533335479, guid: 9affc00d90f84a345b8ba9fb0484cb43,
        type: 3}
      propertyPath: ColorModule.gradient.maxGradient.key2.b
      value: 1
      objectReference: {fileID: 0}
    - target: {fileID: 3600989833533335479, guid: 9affc00d90f84a345b8ba9fb0484cb43,
        type: 3}
      propertyPath: ColorModule.gradient.maxGradient.ctime1
      value: 32382
      objectReference: {fileID: 0}
    - target: {fileID: 3600989833533335479, guid: 9affc00d90f84a345b8ba9fb0484cb43,
        type: 3}
      propertyPath: ColorModule.gradient.maxGradient.ctime2
      value: 45489
      objectReference: {fileID: 0}
    - target: {fileID: 3600989833533335479, guid: 9affc00d90f84a345b8ba9fb0484cb43,
        type: 3}
      propertyPath: ColorModule.gradient.maxGradient.m_NumColorKeys
      value: 3
      objectReference: {fileID: 0}
    - target: {fileID: 3600989833533335479, guid: 9affc00d90f84a345b8ba9fb0484cb43,
        type: 3}
      propertyPath: ColorModule.gradient.maxGradient.atime0
      value: 19661
      objectReference: {fileID: 0}
    - target: {fileID: 3600989833533335479, guid: 9affc00d90f84a345b8ba9fb0484cb43,
        type: 3}
      propertyPath: InitialModule.startLifetime.minScalar
      value: 0.2
      objectReference: {fileID: 0}
    - target: {fileID: 3600989833533335479, guid: 9affc00d90f84a345b8ba9fb0484cb43,
        type: 3}
      propertyPath: InitialModule.startLifetime.scalar
      value: 0.5
      objectReference: {fileID: 0}
    - target: {fileID: 3600989833533335479, guid: 9affc00d90f84a345b8ba9fb0484cb43,
        type: 3}
      propertyPath: EmissionModule.m_Bursts.Array.data[0].countCurve.minScalar
      value: 6
      objectReference: {fileID: 0}
    - target: {fileID: 3600989833533335479, guid: 9affc00d90f84a345b8ba9fb0484cb43,
        type: 3}
      propertyPath: EmissionModule.m_Bursts.Array.data[0].countCurve.scalar
      value: 12
      objectReference: {fileID: 0}
    - target: {fileID: 3600989833533335479, guid: 9affc00d90f84a345b8ba9fb0484cb43,
        type: 3}
      propertyPath: InitialModule.startSpeed.minScalar
      value: 14
      objectReference: {fileID: 0}
    - target: {fileID: 3600989833533335479, guid: 9affc00d90f84a345b8ba9fb0484cb43,
        type: 3}
      propertyPath: ColorModule.gradient.maxGradient.key1.a
      value: 0
      objectReference: {fileID: 0}
    - target: {fileID: 3600989833533335479, guid: 9affc00d90f84a345b8ba9fb0484cb43,
        type: 3}
      propertyPath: ColorModule.gradient.maxGradient.atime1
      value: 46453
      objectReference: {fileID: 0}
    - target: {fileID: 3600989833533335479, guid: 9affc00d90f84a345b8ba9fb0484cb43,
        type: 3}
      propertyPath: InitialModule.startRotationX.scalar
      value: 0
      objectReference: {fileID: 0}
    - target: {fileID: 3600989833533335479, guid: 9affc00d90f84a345b8ba9fb0484cb43,
        type: 3}
      propertyPath: InitialModule.startRotationX.minScalar
      value: 6.283185
      objectReference: {fileID: 0}
    - target: {fileID: 3600989833533335479, guid: 9affc00d90f84a345b8ba9fb0484cb43,
        type: 3}
      propertyPath: InitialModule.startRotationY.scalar
      value: 0
      objectReference: {fileID: 0}
    - target: {fileID: 3600989833533335479, guid: 9affc00d90f84a345b8ba9fb0484cb43,
        type: 3}
      propertyPath: InitialModule.startRotationY.minScalar
      value: 6.283185
      objectReference: {fileID: 0}
    - target: {fileID: 3600989833533335479, guid: 9affc00d90f84a345b8ba9fb0484cb43,
        type: 3}
      propertyPath: InitialModule.startRotation.scalar
      value: 0
      objectReference: {fileID: 0}
    - target: {fileID: 3600989833533335479, guid: 9affc00d90f84a345b8ba9fb0484cb43,
        type: 3}
      propertyPath: InitialModule.startRotation.minScalar
      value: 6.283185
      objectReference: {fileID: 0}
    - target: {fileID: 3600989833533335479, guid: 9affc00d90f84a345b8ba9fb0484cb43,
        type: 3}
      propertyPath: InitialModule.gravityModifier.scalar
      value: 4
      objectReference: {fileID: 0}
    - target: {fileID: 3600989833533335479, guid: 9affc00d90f84a345b8ba9fb0484cb43,
        type: 3}
      propertyPath: RotationModule.curve.minMaxState
      value: 3
      objectReference: {fileID: 0}
    - target: {fileID: 3600989833533335479, guid: 9affc00d90f84a345b8ba9fb0484cb43,
        type: 3}
      propertyPath: RotationModule.x.minMaxState
      value: 3
      objectReference: {fileID: 0}
    - target: {fileID: 3600989833533335479, guid: 9affc00d90f84a345b8ba9fb0484cb43,
        type: 3}
      propertyPath: RotationModule.y.minMaxState
      value: 3
      objectReference: {fileID: 0}
    - target: {fileID: 3600989833533335479, guid: 9affc00d90f84a345b8ba9fb0484cb43,
        type: 3}
      propertyPath: RotationModule.curve.minScalar
      value: 6.283185
      objectReference: {fileID: 0}
    - target: {fileID: 3600989833533335479, guid: 9affc00d90f84a345b8ba9fb0484cb43,
        type: 3}
      propertyPath: RotationModule.curve.scalar
      value: 12.56637
      objectReference: {fileID: 0}
    - target: {fileID: 3600989833533335479, guid: 9affc00d90f84a345b8ba9fb0484cb43,
        type: 3}
      propertyPath: lengthInSec
      value: 0.75
      objectReference: {fileID: 0}
    - target: {fileID: 3600989833533335479, guid: 9affc00d90f84a345b8ba9fb0484cb43,
        type: 3}
      propertyPath: EmissionModule.m_BurstCount
      value: 1
      objectReference: {fileID: 0}
    - target: {fileID: 3600989833533335479, guid: 9affc00d90f84a345b8ba9fb0484cb43,
        type: 3}
      propertyPath: EmissionModule.m_Bursts.Array.data[0].countCurve.maxCurve.m_Curve.Array.data[0].value
      value: 1
      objectReference: {fileID: 0}
    - target: {fileID: 3600989833533335479, guid: 9affc00d90f84a345b8ba9fb0484cb43,
        type: 3}
      propertyPath: EmissionModule.m_Bursts.Array.data[0].countCurve.maxCurve.m_Curve.Array.data[1].time
      value: 1
      objectReference: {fileID: 0}
    - target: {fileID: 3600989833533335479, guid: 9affc00d90f84a345b8ba9fb0484cb43,
        type: 3}
      propertyPath: EmissionModule.m_Bursts.Array.data[0].countCurve.maxCurve.m_Curve.Array.data[1].value
      value: 1
      objectReference: {fileID: 0}
    - target: {fileID: 3600989833533335479, guid: 9affc00d90f84a345b8ba9fb0484cb43,
        type: 3}
      propertyPath: EmissionModule.m_Bursts.Array.data[0].countCurve.maxCurve.m_PreInfinity
      value: 2
      objectReference: {fileID: 0}
    - target: {fileID: 3600989833533335479, guid: 9affc00d90f84a345b8ba9fb0484cb43,
        type: 3}
      propertyPath: EmissionModule.m_Bursts.Array.data[0].countCurve.maxCurve.m_PostInfinity
      value: 2
      objectReference: {fileID: 0}
    - target: {fileID: 3600989833533335479, guid: 9affc00d90f84a345b8ba9fb0484cb43,
        type: 3}
      propertyPath: EmissionModule.m_Bursts.Array.data[0].countCurve.maxCurve.m_RotationOrder
      value: 4
      objectReference: {fileID: 0}
    - target: {fileID: 3600989833533335479, guid: 9affc00d90f84a345b8ba9fb0484cb43,
        type: 3}
      propertyPath: EmissionModule.m_Bursts.Array.data[0].countCurve.minCurve.m_Curve.Array.data[0].value
      value: 1
      objectReference: {fileID: 0}
    - target: {fileID: 3600989833533335479, guid: 9affc00d90f84a345b8ba9fb0484cb43,
        type: 3}
      propertyPath: EmissionModule.m_Bursts.Array.data[0].countCurve.minCurve.m_Curve.Array.data[1].time
      value: 1
      objectReference: {fileID: 0}
    - target: {fileID: 3600989833533335479, guid: 9affc00d90f84a345b8ba9fb0484cb43,
        type: 3}
      propertyPath: EmissionModule.m_Bursts.Array.data[0].countCurve.minCurve.m_Curve.Array.data[1].value
      value: 1
      objectReference: {fileID: 0}
    - target: {fileID: 3600989833533335479, guid: 9affc00d90f84a345b8ba9fb0484cb43,
        type: 3}
      propertyPath: EmissionModule.m_Bursts.Array.data[0].countCurve.minCurve.m_PreInfinity
      value: 2
      objectReference: {fileID: 0}
    - target: {fileID: 3600989833533335479, guid: 9affc00d90f84a345b8ba9fb0484cb43,
        type: 3}
      propertyPath: EmissionModule.m_Bursts.Array.data[0].countCurve.minCurve.m_PostInfinity
      value: 2
      objectReference: {fileID: 0}
    - target: {fileID: 3600989833533335479, guid: 9affc00d90f84a345b8ba9fb0484cb43,
        type: 3}
      propertyPath: EmissionModule.m_Bursts.Array.data[0].countCurve.minCurve.m_RotationOrder
      value: 4
      objectReference: {fileID: 0}
    - target: {fileID: 3600989833533335479, guid: 9affc00d90f84a345b8ba9fb0484cb43,
        type: 3}
      propertyPath: EmissionModule.m_Bursts.Array.data[0].cycleCount
      value: 1
      objectReference: {fileID: 0}
    - target: {fileID: 3600989833533335479, guid: 9affc00d90f84a345b8ba9fb0484cb43,
        type: 3}
      propertyPath: EmissionModule.m_Bursts.Array.data[0].repeatInterval
      value: 0.01
      objectReference: {fileID: 0}
    - target: {fileID: 3600989833533335479, guid: 9affc00d90f84a345b8ba9fb0484cb43,
        type: 3}
      propertyPath: EmissionModule.m_Bursts.Array.data[0].probability
      value: 1
      objectReference: {fileID: 0}
    - target: {fileID: 3600989833533335479, guid: 9affc00d90f84a345b8ba9fb0484cb43,
        type: 3}
      propertyPath: EmissionModule.rateOverTime.scalar
      value: 0
      objectReference: {fileID: 0}
    - target: {fileID: 3600989833533335479, guid: 9affc00d90f84a345b8ba9fb0484cb43,
        type: 3}
      propertyPath: ShapeModule.angle
      value: 7.18
      objectReference: {fileID: 0}
    - target: {fileID: 3600989833533335479, guid: 9affc00d90f84a345b8ba9fb0484cb43,
        type: 3}
      propertyPath: ShapeModule.radius.value
      value: 0.14
      objectReference: {fileID: 0}
    - target: {fileID: 3600989833533335479, guid: 9affc00d90f84a345b8ba9fb0484cb43,
        type: 3}
      propertyPath: EmissionModule.m_Bursts.Array.data[0].countCurve.minMaxState
      value: 3
      objectReference: {fileID: 0}
    - target: {fileID: 3600989833533335479, guid: 9affc00d90f84a345b8ba9fb0484cb43,
        type: 3}
      propertyPath: looping
      value: 0
      objectReference: {fileID: 0}
    - target: {fileID: 3600989833533335479, guid: 9affc00d90f84a345b8ba9fb0484cb43,
        type: 3}
      propertyPath: InitialModule.startSpeed.scalar
      value: 8
      objectReference: {fileID: 0}
    - target: {fileID: 3600989833533335479, guid: 9affc00d90f84a345b8ba9fb0484cb43,
        type: 3}
      propertyPath: EmissionModule.m_Bursts.Array.data[0].countCurve.maxCurve.m_Curve.Array.data[0].inWeight
      value: 0.33333334
      objectReference: {fileID: 0}
    - target: {fileID: 3600989833533335479, guid: 9affc00d90f84a345b8ba9fb0484cb43,
        type: 3}
      propertyPath: EmissionModule.m_Bursts.Array.data[0].countCurve.maxCurve.m_Curve.Array.data[0].outWeight
      value: 0.33333334
      objectReference: {fileID: 0}
    - target: {fileID: 3600989833533335479, guid: 9affc00d90f84a345b8ba9fb0484cb43,
        type: 3}
      propertyPath: EmissionModule.m_Bursts.Array.data[0].countCurve.maxCurve.m_Curve.Array.data[1].inWeight
      value: 0.33333334
      objectReference: {fileID: 0}
    - target: {fileID: 3600989833533335479, guid: 9affc00d90f84a345b8ba9fb0484cb43,
        type: 3}
      propertyPath: EmissionModule.m_Bursts.Array.data[0].countCurve.maxCurve.m_Curve.Array.data[1].outWeight
      value: 0.33333334
      objectReference: {fileID: 0}
    - target: {fileID: 3600989833533335479, guid: 9affc00d90f84a345b8ba9fb0484cb43,
        type: 3}
      propertyPath: EmissionModule.m_Bursts.Array.data[0].countCurve.minCurve.m_Curve.Array.data[0].inWeight
      value: 0.33333334
      objectReference: {fileID: 0}
    - target: {fileID: 3600989833533335479, guid: 9affc00d90f84a345b8ba9fb0484cb43,
        type: 3}
      propertyPath: EmissionModule.m_Bursts.Array.data[0].countCurve.minCurve.m_Curve.Array.data[0].outWeight
      value: 0.33333334
      objectReference: {fileID: 0}
    - target: {fileID: 3600989833533335479, guid: 9affc00d90f84a345b8ba9fb0484cb43,
        type: 3}
      propertyPath: EmissionModule.m_Bursts.Array.data[0].countCurve.minCurve.m_Curve.Array.data[1].inWeight
      value: 0.33333334
      objectReference: {fileID: 0}
    - target: {fileID: 3600989833533335479, guid: 9affc00d90f84a345b8ba9fb0484cb43,
        type: 3}
      propertyPath: EmissionModule.m_Bursts.Array.data[0].countCurve.minCurve.m_Curve.Array.data[1].outWeight
      value: 0.33333334
      objectReference: {fileID: 0}
    - target: {fileID: 3600989833533335479, guid: 9affc00d90f84a345b8ba9fb0484cb43,
        type: 3}
      propertyPath: InitialModule.startRotation.minMaxState
      value: 3
      objectReference: {fileID: 0}
    - target: {fileID: 3600989833533335479, guid: 9affc00d90f84a345b8ba9fb0484cb43,
        type: 3}
      propertyPath: InitialModule.startRotationX.minMaxState
      value: 3
      objectReference: {fileID: 0}
    - target: {fileID: 3600989833533335479, guid: 9affc00d90f84a345b8ba9fb0484cb43,
        type: 3}
      propertyPath: InitialModule.startRotationY.minMaxState
      value: 3
      objectReference: {fileID: 0}
    - target: {fileID: 4742749570134581155, guid: 9affc00d90f84a345b8ba9fb0484cb43,
        type: 3}
      propertyPath: m_Name
      value: ChangeDirection_Poussiere
      objectReference: {fileID: 0}
    m_RemovedComponents: []
  m_SourcePrefab: {fileID: 100100000, guid: 9affc00d90f84a345b8ba9fb0484cb43, type: 3}
