%YAML 1.1
%TAG !u! tag:unity3d.com,2011:
--- !u!114 &-8674526628068425814
MonoBehaviour:
  m_ObjectHideFlags: 3
  m_CorrespondingSourceObject: {fileID: 0}
  m_PrefabInstance: {fileID: 0}
  m_PrefabAsset: {fileID: 0}
  m_GameObject: {fileID: 0}
  m_Enabled: 1
  m_EditorHideFlags: 0
  m_Script: {fileID: 11500000, guid: 2d08ce26990eb1a4a9177b860541e702, type: 3}
  m_Name: Exposure
  m_EditorClassIdentifier: 
  active: 1
  m_AdvancedMode: 0
  mode:
    m_OverrideState: 1
    m_Value: 2
  meteringMode:
    m_OverrideState: 1
    m_Value: 2
  luminanceSource:
    m_OverrideState: 0
    m_Value: 0
  fixedExposure:
    m_OverrideState: 1
    m_Value: 0
  compensation:
    m_OverrideState: 0
    m_Value: 9.06
  limitMin:
    m_OverrideState: 0
    m_Value: -10
  limitMax:
    m_OverrideState: 0
    m_Value: 20
  curveMap:
    m_OverrideState: 1
    m_Value:
      serializedVersion: 2
      m_Curve:
      - serializedVersion: 3
        time: -11.090908
        value: -2.2877502
        inSlope: 0
        outSlope: 0
        tangentMode: 0
        weightedMode: 0
        inWeight: 0
        outWeight: 0
      - serializedVersion: 3
        time: 4.5822115
        value: 2.9750123
        inSlope: 0.080413036
        outSlope: 0.080413036
        tangentMode: 0
        weightedMode: 0
        inWeight: 0.33333334
        outWeight: 0.15999343
      - serializedVersion: 3
        time: 20.401733
        value: -0.08860588
        inSlope: 0.023776293
        outSlope: 0.023776293
        tangentMode: 0
        weightedMode: 0
        inWeight: 0.16092119
        outWeight: 0
      m_PreInfinity: 2
      m_PostInfinity: 2
      m_RotationOrder: 4
  adaptationMode:
    m_OverrideState: 0
    m_Value: 1
  adaptationSpeedDarkToLight:
    m_OverrideState: 0
    m_Value: 3
    min: 0.001
  adaptationSpeedLightToDark:
    m_OverrideState: 0
    m_Value: 1
    min: 0.001
--- !u!114 &-8187209098573726910
MonoBehaviour:
  m_ObjectHideFlags: 3
  m_CorrespondingSourceObject: {fileID: 0}
  m_PrefabInstance: {fileID: 0}
  m_PrefabAsset: {fileID: 0}
  m_GameObject: {fileID: 0}
  m_Enabled: 1
  m_EditorHideFlags: 0
  m_Script: {fileID: 11500000, guid: 0775cbb206825d541bf6c0297ee524ca, type: 3}
  m_Name: SplitToning
  m_EditorClassIdentifier: 
  active: 0
  m_AdvancedMode: 0
  shadows:
    m_OverrideState: 1
    m_Value: {r: 0.26415092, g: 0.26415092, b: 0.26415092, a: 1}
    hdr: 0
    showAlpha: 0
    showEyeDropper: 1
  highlights:
    m_OverrideState: 1
    m_Value: {r: 0, g: 0.9522028, b: 1, a: 1}
    hdr: 0
    showAlpha: 0
    showEyeDropper: 1
  balance:
    m_OverrideState: 1
    m_Value: 15.6
    min: -100
    max: 100
--- !u!114 &-8023592310341621427
MonoBehaviour:
  m_ObjectHideFlags: 3
  m_CorrespondingSourceObject: {fileID: 0}
  m_PrefabInstance: {fileID: 0}
  m_PrefabAsset: {fileID: 0}
  m_GameObject: {fileID: 0}
  m_Enabled: 1
  m_EditorHideFlags: 0
  m_Script: {fileID: 11500000, guid: da5ab44aadfb1804db5fd470983ac1b8, type: 3}
  m_Name: LiftGammaGain
  m_EditorClassIdentifier: 
  active: 0
  m_AdvancedMode: 0
  lift:
    m_OverrideState: 1
    m_Value: {x: 1, y: 0.54872394, z: 0, w: 0}
  gamma:
    m_OverrideState: 1
    m_Value: {x: 0.19524491, y: 0.6636408, z: 1, w: 0}
  gain:
    m_OverrideState: 1
    m_Value: {x: 0.6120552, y: 0.7875593, z: 1, w: 0}
--- !u!114 &-6589800862434312749
MonoBehaviour:
  m_ObjectHideFlags: 3
  m_CorrespondingSourceObject: {fileID: 0}
  m_PrefabInstance: {fileID: 0}
  m_PrefabAsset: {fileID: 0}
  m_GameObject: {fileID: 0}
  m_Enabled: 1
  m_EditorHideFlags: 0
  m_Script: {fileID: 11500000, guid: 4b8bcdf71d7fafa419fca1ed162f5fc9, type: 3}
  m_Name: ColorAdjustments
  m_EditorClassIdentifier: 
  active: 0
  m_AdvancedMode: 0
  postExposure:
    m_OverrideState: 0
    m_Value: 0
  contrast:
    m_OverrideState: 0
    m_Value: -2
    min: -100
    max: 100
  colorFilter:
    m_OverrideState: 0
    m_Value: {r: 0.7783019, g: 1, b: 1, a: 1}
    hdr: 1
    showAlpha: 0
    showEyeDropper: 1
  hueShift:
    m_OverrideState: 0
    m_Value: 0
    min: -180
    max: 180
  saturation:
    m_OverrideState: 0
    m_Value: 51
    min: -100
    max: 100
--- !u!114 &-1235084028938332123
MonoBehaviour:
  m_ObjectHideFlags: 3
  m_CorrespondingSourceObject: {fileID: 0}
  m_PrefabInstance: {fileID: 0}
  m_PrefabAsset: {fileID: 0}
  m_GameObject: {fileID: 0}
  m_Enabled: 1
  m_EditorHideFlags: 0
  m_Script: {fileID: 11500000, guid: 6b24b200358312b4fa1004e2431c2f1f, type: 3}
  m_Name: ShadowsMidtonesHighlights
  m_EditorClassIdentifier: 
  active: 0
  m_AdvancedMode: 0
  shadows:
    m_OverrideState: 1
    m_Value: {x: 0.011121213, y: 0.9257808, z: 1, w: 0.0735043}
  midtones:
    m_OverrideState: 0
    m_Value: {x: 0.82010835, y: 1, z: 0.87870586, w: 0}
  highlights:
    m_OverrideState: 1
    m_Value: {x: 0.936342, y: 1, z: 0, w: 0}
  shadowsStart:
    m_OverrideState: 1
    m_Value: 0
    min: 0
  shadowsEnd:
    m_OverrideState: 1
    m_Value: 1.35
    min: 0
  highlightsStart:
    m_OverrideState: 1
    m_Value: 1
    min: 0
  highlightsEnd:
    m_OverrideState: 1
    m_Value: 17.6
    min: 0
--- !u!114 &11400000
MonoBehaviour:
  m_ObjectHideFlags: 0
  m_CorrespondingSourceObject: {fileID: 0}
  m_PrefabInstance: {fileID: 0}
  m_PrefabAsset: {fileID: 0}
  m_GameObject: {fileID: 0}
  m_Enabled: 1
  m_EditorHideFlags: 0
  m_Script: {fileID: 11500000, guid: d7fd9488000d3734a9e00ee676215985, type: 3}
  m_Name: Box Volume Profile
  m_EditorClassIdentifier: 
  components:
  - {fileID: 9009489706555736749}
  - {fileID: -8674526628068425814}
  - {fileID: 6348883662734977792}
  - {fileID: -1235084028938332123}
  - {fileID: -8187209098573726910}
  - {fileID: -8023592310341621427}
  - {fileID: -6589800862434312749}
  - {fileID: 2820160559821821312}
--- !u!114 &2820160559821821312
MonoBehaviour:
  m_ObjectHideFlags: 3
  m_CorrespondingSourceObject: {fileID: 0}
  m_PrefabInstance: {fileID: 0}
  m_PrefabAsset: {fileID: 0}
  m_GameObject: {fileID: 0}
  m_Enabled: 1
  m_EditorHideFlags: 0
  m_Script: {fileID: 11500000, guid: 24f077503be6ae942a1e1245dbd53ea9, type: 3}
  m_Name: Bloom
  m_EditorClassIdentifier: 
  active: 0
  m_AdvancedMode: 0
  quality:
    m_OverrideState: 1
    m_Value: 2
  threshold:
    m_OverrideState: 1
    m_Value: 0.8
    min: 0
  intensity:
    m_OverrideState: 1
    m_Value: 1
    min: 0
    max: 1
  scatter:
    m_OverrideState: 0
    m_Value: 0.7
    min: 0
    max: 1
  tint:
    m_OverrideState: 0
    m_Value: {r: 1, g: 1, b: 1, a: 1}
    hdr: 0
    showAlpha: 0
    showEyeDropper: 1
  dirtTexture:
    m_OverrideState: 0
    m_Value: {fileID: 0}
  dirtIntensity:
    m_OverrideState: 0
    m_Value: 0
    min: 0
  anamorphic:
    m_OverrideState: 0
    m_Value: 1
  m_Resolution:
    m_OverrideState: 0
    m_Value: 2
  m_HighQualityFiltering:
    m_OverrideState: 0
    m_Value: 1
--- !u!114 &6348883662734977792
MonoBehaviour:
  m_ObjectHideFlags: 3
  m_CorrespondingSourceObject: {fileID: 0}
  m_PrefabInstance: {fileID: 0}
  m_PrefabAsset: {fileID: 0}
  m_GameObject: {fileID: 0}
  m_Enabled: 1
  m_EditorHideFlags: 0
  m_Script: {fileID: 11500000, guid: a7649d9368d3a5c4ab8ad01a63e04962, type: 3}
  m_Name: ChannelMixer
  m_EditorClassIdentifier: 
  active: 0
  m_AdvancedMode: 0
  redOutRedIn:
    m_OverrideState: 1
    m_Value: 64.94
    min: -200
    max: 200
  redOutGreenIn:
    m_OverrideState: 0
    m_Value: -200
    min: -200
    max: 200
  redOutBlueIn:
    m_OverrideState: 1
    m_Value: -102
    min: -200
    max: 200
  greenOutRedIn:
    m_OverrideState: 0
    m_Value: 200
    min: -200
    max: 200
  greenOutGreenIn:
    m_OverrideState: 0
    m_Value: 200
    min: -200
    max: 200
  greenOutBlueIn:
    m_OverrideState: 0
    m_Value: 200
    min: -200
    max: 200
  blueOutRedIn:
    m_OverrideState: 0
    m_Value: 200
    min: -200
    max: 200
  blueOutGreenIn:
    m_OverrideState: 0
    m_Value: 200
    min: -200
    max: 200
  blueOutBlueIn:
    m_OverrideState: 0
    m_Value: 200
    min: -200
    max: 200
  m_SelectedChannel: 0
--- !u!114 &9009489706555736749
MonoBehaviour:
  m_ObjectHideFlags: 3
  m_CorrespondingSourceObject: {fileID: 0}
  m_PrefabInstance: {fileID: 0}
  m_PrefabAsset: {fileID: 0}
  m_GameObject: {fileID: 0}
  m_Enabled: 1
  m_EditorHideFlags: 0
  m_Script: {fileID: 11500000, guid: 9008a067f4d626c4d8bc4bc48f04bb89, type: 3}
  m_Name: AmbientOcclusion
  m_EditorClassIdentifier: 
  active: 0
  m_AdvancedMode: 0
  quality:
    m_OverrideState: 1
    m_Value: 2
  rayTracing:
    m_OverrideState: 0
    m_Value: 0
  intensity:
    m_OverrideState: 1
    m_Value: 0
    min: 0
    max: 4
  directLightingStrength:
    m_OverrideState: 1
    m_Value: 0.671
    min: 0
    max: 1
  radius:
    m_OverrideState: 1
    m_Value: 3.06
    min: 0.25
    max: 5
  temporalAccumulation:
    m_OverrideState: 1
    m_Value: 1
  ghostingReduction:
    m_OverrideState: 1
    m_Value: 0.648
    min: 0
    max: 1
  blurSharpness:
    m_OverrideState: 0
    m_Value: 0.1
    min: 0
    max: 1
  layerMask:
    m_OverrideState: 0
    m_Value:
      serializedVersion: 2
      m_Bits: 4294967295
  rayLength:
    m_OverrideState: 0
    m_Value: 0.5
    min: 0
    max: 50
  sampleCount:
    m_OverrideState: 0
    m_Value: 4
    min: 1
    max: 64
  denoise:
    m_OverrideState: 0
    m_Value: 0
  denoiserRadius:
    m_OverrideState: 0
    m_Value: 0.5
    min: 0.001
    max: 1
  m_StepCount:
    m_OverrideState: 0
    m_Value: 6
    min: 2
    max: 32
  m_FullResolution:
    m_OverrideState: 0
    m_Value: 0
  m_MaximumRadiusInPixels:
    m_OverrideState: 0
    m_Value: 40
    min: 16
    max: 256
  m_BilateralUpsample:
    m_OverrideState: 0
    m_Value: 1
  m_DirectionCount:
    m_OverrideState: 0
    m_Value: 2
    min: 1
    max: 6
