%YAML 1.1
%TAG !u! tag:unity3d.com,2011:
--- !u!114 &11400000
MonoBehaviour:
  m_ObjectHideFlags: 0
  m_CorrespondingSourceObject: {fileID: 0}
  m_PrefabInstance: {fileID: 0}
  m_PrefabAsset: {fileID: 0}
  m_GameObject: {fileID: 0}
  m_Enabled: 1
  m_EditorHideFlags: 0
  m_Script: {fileID: 11500000, guid: 3a12c28be4b3e0c4383a252d0fd0b3c4, type: 3}
  m_Name: SniperInfo
  m_EditorClassIdentifier: 
  moveSpeed: 8
  reactivity: 10
  cooldown: 0.2
