%YAML 1.1
%TAG !u! tag:unity3d.com,2011:
--- !u!21 &2100000
Material:
  serializedVersion: 6
  m_ObjectHideFlags: 0
  m_CorrespondingSourceObject: {fileID: 0}
  m_PrefabInstance: {fileID: 0}
  m_PrefabAsset: {fileID: 0}
  m_Name: Shader Graphs_portailv5
  m_Shader: {fileID: -6465566751694194690, guid: a00211d9b38d6274ebf98707faedc2a5,
    type: 3}
  m_ShaderKeywords: 
  m_LightmapFlags: 4
  m_EnableInstancingVariants: 0
  m_DoubleSidedGI: 0
  m_CustomRenderQueue: -1
  stringTagMap:
    MotionVector: User
  disabledShaderPasses:
  - MOTIONVECTORS
  m_SavedProperties:
    serializedVersion: 3
    m_TexEnvs:
    - Texture2D_3088F752:
        m_Texture: {fileID: 2800000, guid: 0574515ac8699df47ac05947476a7811, type: 3}
        m_Scale: {x: 1, y: 1}
        m_Offset: {x: 0, y: 0}
    - Texture2D_BCF2FFC1:
        m_Texture: {fileID: 10300, guid: 0000000000000000f000000000000000, type: 0}
        m_Scale: {x: 1, y: 1}
        m_Offset: {x: 0, y: 0}
    m_Floats:
    - Vector1_21019C6F: 0.03
    - Vector1_696F0C69: 2.5
    - Vector1_97CC589A: 5
    - Vector1_A676174: 50
    - Vector1_A8F24310: 2.5
    - Vector1_AB71B5E8: 6.5
    - Vector1_BCF2714F: 25
    - Vector1_BD6B8A9: 25
    - Vector1_D55A1C: -0.323
    - Vector1_F169959A: 0.25
    m_Colors:
    - Color_B2821115: {r: 0, g: 220.26176, b: 50.74093, a: 0}
    - Color_BC4748D2: {r: 1024, g: 594.3216, b: 0, a: 0}
    - Color_BED61423: {r: 0, g: 469.8353, b: 766.9961, a: 0}
    - Vector2_3BE2744: {r: 0.25, g: 0.25, b: 0, a: 0}
