1st Time Line

Jump 1 : Frame 10 - 60
Jump 2 : Frame 420 - 445
Jump 3 : Frame 448 - 469
Jump 4 : Frame 472 - 493

Fall : Frame 60 - 120
Land : Frame 120 - 140
Idle 1 Loop  : 160 - 240
Idle 2 Right Loop : 245 - 325
Idle 2 Left Loop : 330 - 410

 2sd Time Line

Run Loop (faster) : Frame 15 -89 (15-68)
Taking Damage 1 Right : Frame 100 - 118
Taking Damage 2 Right : Frame 118 - 136
Taking Damage 1 Left : Frame 136 - 154
Taking Damage 2 Left : Frame 154 - 172

3rd Time Line

Run scared loop : 25 - 73
