{
  "env_info": {
    "env_id": "LiftCube-v0",
    "max_episode_steps": 200,
    "env_kwargs": {
      "obs_mode": "state",
      "reward_mode": "dense",
      "control_mode": "pd_ee_delta_pose"
    }
  },
  "commit_info": null,
  "episodes": [
    {
      "episode_id": 0,
      "episode_seed": 4282876139,
      "reset_kwargs": {},
      "control_mode": "pd_ee_delta_pose",
      "elapsed_steps": 200,
      "info": {
        "elapsed_steps": 200,
        "is_obj_placed": false,
        "is_robot_static": true,
        "success": false,
        "TimeLimit.truncated": true,
        "is_success": false,
        "terminal_observation": [
          1.154884696006775,
          1.7164394855499268,
          -0.7451971769332886,
          -2.8620805740356445,
          0.5921037793159485,
          3.7525360584259033,
          1.243146300315857,
          0.006585238967090845,
          0.00659201480448246,
          -0.006565526593476534,
          0.0016905441880226135,
          0.0006640341598540545,
          0.0023263746406883,
          0.006719179451465607,
          0.014337395317852497,
          -0.01395866647362709,
          0.00025881806504912674,
          0.00019378599245101213,
          -0.6150000095367432,
          8.731149137020111e-11,
          0.0,
          1.0000001192092896,
          0.0,
          0.0,
          0.0,
          -0.31700390577316284,
          -0.2848811745643616,
          0.08923932909965515,
          -0.602216899394989,
          -0.7697490453720093,
          -0.03151875361800194,
          -0.20935066044330597,
          -0.2862994074821472,
          -0.24341073632240295,
          0.019999617710709572,
          -0.14464588463306427,
          0.14457988739013672,
          0.6922033429145813,
          -0.6921190619468689,
          0.030704498291015625,
          0.04147043824195862,
          -0.06923971325159073
        ]
      }
    },
    {
      "episode_id": 1,
      "episode_seed": 3093770124,
      "reset_kwargs": {},
      "control_mode": "pd_ee_delta_pose",
      "elapsed_steps": 200,
      "info": {
        "elapsed_steps": 200,
        "is_obj_placed": true,
        "is_robot_static": false,
        "success": false,
        "TimeLimit.truncated": true,
        "is_success": false,
        "terminal_observation": [
          2.8389320373535156,
          1.0804569721221924,
          -1.8869422674179077,
          -3.048983573913574,
          -0.33534473180770874,
          3.1624996662139893,
          0.2973945438861847,
          0.019940674304962158,
          0.020545843988656998,
          0.6694838404655457,
          0.16622748970985413,
          -0.5889536738395691,
          -0.23633086681365967,
          -0.026535028591752052,
          -0.5004202723503113,
          -0.22451594471931458,
          0.00048432114999741316,
          -0.0007331531960517168,
          -0.6150000095367432,
          8.731149137020111e-11,
          0.0,
          1.0000001192092896,
          0.0,
          0.0,
          0.0,
          -0.2781020998954773,
          0.20968687534332275,
          0.26988905668258667,
          -0.4707908630371094,
          -0.5140463709831238,
          -0.6761944890022278,
          -0.2384815663099289,
          -0.29269886016845703,
          0.19690141081809998,
          0.28250959515571594,
          -0.0011636667186394334,
          -0.5230791568756104,
          0.28733497858047485,
          0.8023874163627625,
          -0.014596760272979736,
          -0.012785464525222778,
          0.012620538473129272
        ]
      }
    },
    {
      "episode_id": 2,
      "episode_seed": 4005303368,
      "reset_kwargs": {},
      "control_mode": "pd_ee_delta_pose",
      "elapsed_steps": 200,
      "info": {
        "elapsed_steps": 200,
        "is_obj_placed": true,
        "is_robot_static": false,
        "success": false,
        "TimeLimit.truncated": true,
        "is_success": false,
        "terminal_observation": [
          2.789053201675415,
          1.0676124095916748,
          -1.8911911249160767,
          -3.022395133972168,
          0.04378538951277733,
          3.1454780101776123,
          0.20741532742977142,
          0.020167818292975426,
          0.019647276028990746,
          1.0453683137893677,
          0.3566293716430664,
          0.659826934337616,
          -0.5954329371452332,
          0.43774181604385376,
          -0.6244093179702759,
          0.9570617079734802,
          6.410879723262042e-05,
          -0.00022161341621540487,
          -0.6150000095367432,
          8.731149137020111e-11,
          0.0,
          1.0000001192092896,
          0.0,
          0.0,
          0.0,
          -0.25338634848594666,
          0.19246810674667358,
          0.30316129326820374,
          -0.43563371896743774,
          -0.6212820410728455,
          -0.5799025297164917,
          -0.2965553402900696,
          -0.2659813165664673,
          0.18821384012699127,
          0.31028735637664795,
          -0.4887915551662445,
          -0.17455197870731354,
          0.5352669358253479,
          0.6664111018180847,
          -0.01259496808052063,
          -0.004254266619682312,
          0.007126063108444214
        ]
      }
    },
    {
      "episode_id": 3,
      "episode_seed": 491263,
      "reset_kwargs": {},
      "control_mode": "pd_ee_delta_pose",
      "elapsed_steps": 200,
      "info": {
        "elapsed_steps": 200,
        "is_obj_placed": false,
        "is_robot_static": true,
        "success": false,
        "TimeLimit.truncated": true,
        "is_success": false,
        "terminal_observation": [
          0.26398971676826477,
          0.7264437079429626,
          -1.4798479080200195,
          -1.4851874113082886,
          -1.4597371816635132,
          3.689484119415283,
          -0.2903885543346405,
          0.03984367474913597,
          0.03984367474913597,
          -4.4246033326089673e-07,
          -1.9100509234704077e-05,
          -1.893999069579877e-05,
          1.5323890693252906e-05,
          2.1969440240354743e-06,
          -1.0738449418568052e-07,
          5.77879291085992e-08,
          9.058294381247833e-07,
          9.202804562846723e-07,
          -0.6150000095367432,
          8.731149137020111e-11,
          0.0,
          1.0000001192092896,
          0.0,
          0.0,
          0.0,
          0.0012134425342082977,
          -0.4243641495704651,
          0.5220152735710144,
          -0.5504014492034912,
          -0.26576918363571167,
          -0.7598068714141846,
          0.22162701189517975,
          -0.2908148765563965,
          0.22997333109378815,
          0.019999973475933075,
          0.2494419664144516,
          -0.24944189190864563,
          -0.6616485714912415,
          0.6616484522819519,
          -0.2920283079147339,
          0.654337465763092,
          -0.5020152926445007
        ]
      }
    },
    {
      "episode_id": 4,
      "episode_seed": 550290313,
      "reset_kwargs": {},
      "control_mode": "pd_ee_delta_pose",
      "elapsed_steps": 158,
      "info": {
        "elapsed_steps": 158,
        "is_obj_placed": true,
        "is_robot_static": true,
        "success": true,
        "is_success": true,
        "terminal_observation": [
          2.88496732711792,
          0.8280757665634155,
          -1.8793683052062988,
          -3.0443599224090576,
          -0.39101019501686096,
          3.144138813018799,
          0.3011583387851715,
          0.01767592877149582,
          0.01811232976615429,
          0.13596928119659424,
          0.07941682636737823,
          -0.133323535323143,
          -0.03593041002750397,
          0.17584072053432465,
          -0.10312894731760025,
          0.044349897652864456,
          0.0068576703779399395,
          0.00798134133219719,
          -0.6150000095367432,
          8.731149137020111e-11,
          0.0,
          1.0000001192092896,
          0.0,
          0.0,
          0.0,
          -0.31479156017303467,
          0.23102742433547974,
          0.20183295011520386,
          -0.3706647753715515,
          -0.5200179815292358,
          -0.7451662421226501,
          -0.19213590025901794,
          -0.3217913806438446,
          0.21026508510112762,
          0.22109127044677734,
          0.5040085911750793,
          -0.46666252613067627,
          -0.03925373777747154,
          0.725713849067688,
          -0.0069998204708099365,
          -0.020762339234352112,
          0.019258320331573486
        ]
      }
    },
    {
      "episode_id": 5,
      "episode_seed": 1298508491,
      "reset_kwargs": {},
      "control_mode": "pd_ee_delta_pose",
      "elapsed_steps": 200,
      "info": {
        "elapsed_steps": 200,
        "is_obj_placed": true,
        "is_robot_static": false,
        "success": false,
        "TimeLimit.truncated": true,
        "is_success": false,
        "terminal_observation": [
          2.8245694637298584,
          1.0569651126861572,
          -1.752119779586792,
          -3.065093517303467,
          0.22936442494392395,
          3.074483633041382,
          0.2210138440132141,
          0.028516408056020737,
          0.026218093931674957,
          0.8616430163383484,
          1.0199100971221924,
          -1.3999431133270264,
          -0.04061375558376312,
          0.11584912240505219,
          -1.2983609437942505,
          -0.5592520236968994,
          0.00034320427221246064,
          -0.0015329228481277823,
          -0.6150000095367432,
          8.731149137020111e-11,
          0.0,
          1.0000001192092896,
          0.0,
          0.0,
          0.0,
          -0.27431461215019226,
          0.17712794244289398,
          0.2588132917881012,
          0.4220361113548279,
          0.6584810614585876,
          0.5637134313583374,
          0.2655472755432129,
          -0.2851625680923462,
          0.18257202208042145,
          0.2668165862560272,
          -0.6863175630569458,
          -0.06664236634969711,
          0.5109518766403198,
          0.5132789611816406,
          -0.01084795594215393,
          0.005444079637527466,
          0.008003294467926025
        ]
      }
    },
    {
      "episode_id": 6,
      "episode_seed": 4290846341,
      "reset_kwargs": {},
      "control_mode": "pd_ee_delta_pose",
      "elapsed_steps": 200,
      "info": {
        "elapsed_steps": 200,
        "is_obj_placed": true,
        "is_robot_static": false,
        "success": false,
        "TimeLimit.truncated": true,
        "is_success": false,
        "terminal_observation": [
          2.8224451541900635,
          1.0126864910125732,
          -1.8043369054794312,
          -3.0442562103271484,
          -0.18020370602607727,
          3.116631507873535,
          0.5227036476135254,
          0.020092828199267387,
          0.020814215764403343,
          0.8634059429168701,
          0.3741939663887024,
          -1.039436936378479,
          -0.23547080159187317,
          0.003234763629734516,
          -0.7718956470489502,
          -0.4448360204696655,
          0.001796896569430828,
          -0.0020169124472886324,
          -0.6150000095367432,
          8.731149137020111e-11,
          0.0,
          1.0000001192092896,
          0.0,
          0.0,
          0.0,
          -0.28234079480171204,
          0.20473289489746094,
          0.24172444641590118,
          0.4131433963775635,
          0.6358968019485474,
          0.5922340154647827,
          0.2724090814590454,
          -0.2911169230937958,
          0.2031303346157074,
          0.24656212329864502,
          -0.5011542439460754,
          -0.17807191610336304,
          0.4907371997833252,
          0.6901534795761108,
          -0.00877612829208374,
          -0.00160256028175354,
          0.0048376768827438354
        ]
      }
    },
    {
      "episode_id": 7,
      "episode_seed": 630311759,
      "reset_kwargs": {},
      "control_mode": "pd_ee_delta_pose",
      "elapsed_steps": 200,
      "info": {
        "elapsed_steps": 200,
        "is_obj_placed": false,
        "is_robot_static": false,
        "success": false,
        "TimeLimit.truncated": true,
        "is_success": false,
        "terminal_observation": [
          2.7364230155944824,
          1.0112528800964355,
          -1.587464451789856,
          -3.0657970905303955,
          -0.1512545645236969,
          3.20548152923584,
          0.6724136471748352,
          0.02210133522748947,
          0.0223425030708313,
          1.4123666286468506,
          -0.2484593689441681,
          0.985933780670166,
          -0.19742028415203094,
          0.3400900661945343,
          -0.6225641965866089,
          0.9714150428771973,
          -0.002567812567576766,
          0.0022712484933435917,
          -0.6150000095367432,
          8.731149137020111e-11,
          0.0,
          1.0000001192092896,
          0.0,
          0.0,
          0.0,
          -0.2979511022567749,
          0.20060580968856812,
          0.18810956180095673,
          -0.40340209007263184,
          -0.6431801915168762,
          -0.5935037732124329,
          -0.2670944631099701,
          -0.3069525957107544,
          0.20732316374778748,
          0.19241413474082947,
          -0.8498745560646057,
          0.2428300678730011,
          0.4676840305328369,
          -0.004295515827834606,
          -0.009001493453979492,
          0.00671735405921936,
          0.004304572939872742
        ]
      }
    },
    {
      "episode_id": 8,
      "episode_seed": 1013994432,
      "reset_kwargs": {},
      "control_mode": "pd_ee_delta_pose",
      "elapsed_steps": 200,
      "info": {
        "elapsed_steps": 200,
        "is_obj_placed": false,
        "is_robot_static": true,
        "success": false,
        "TimeLimit.truncated": true,
        "is_success": false,
        "terminal_observation": [
          2.725747585296631,
          1.5476435422897339,
          -0.8590275645256042,
          -2.9867632389068604,
          0.1775324046611786,
          3.752528429031372,
          1.0787898302078247,
          1.1469703622424277e-06,
          0.0,
          -0.007330991327762604,
          -0.0029052328318357468,
          0.001289293635636568,
          0.0014330383855849504,
          0.013618934899568558,
          0.015769826248288155,
          -0.03631358593702316,
          -1.1586167602217756e-05,
          -1.3997528185427655e-06,
          -0.6150000095367432,
          8.731149137020111e-11,
          0.0,
          1.0000001192092896,
          0.0,
          0.0,
          0.0,
          -0.35033118724823,
          0.2629489004611969,
          0.07502654939889908,
          -0.35269778966903687,
          -0.4769967198371887,
          -0.6825506687164307,
          -0.4268525242805481,
          -0.32883650064468384,
          0.336171418428421,
          0.01999995857477188,
          0.29117169976234436,
          1.826362705514839e-08,
          -3.496711542538833e-08,
          -0.956670880317688,
          0.021494686603546143,
          0.07322251796722412,
          -0.0550265908241272
        ]
      }
    },
    {
      "episode_id": 9,
      "episode_seed": 396591248,
      "reset_kwargs": {},
      "control_mode": "pd_ee_delta_pose",
      "elapsed_steps": 200,
      "info": {
        "elapsed_steps": 200,
        "is_obj_placed": false,
        "is_robot_static": false,
        "success": false,
        "TimeLimit.truncated": true,
        "is_success": false,
        "terminal_observation": [
          2.805511474609375,
          1.001624345779419,
          -1.550070881843567,
          -3.06571626663208,
          -0.12942522764205933,
          3.1533005237579346,
          0.762712299823761,
          0.02045135572552681,
          0.020732194185256958,
          0.8918636441230774,
          -0.2947523593902588,
          0.6971549391746521,
          -0.11849761009216309,
          0.32930585741996765,
          -0.6012697219848633,
          0.8606743812561035,
          -0.0023122960701584816,
          0.0022087108809500933,
          -0.6150000095367432,
          8.731149137020111e-11,
          0.0,
          1.0000001192092896,
          0.0,
          0.0,
          0.0,
          -0.3167056143283844,
          0.21238508820533752,
          0.176423579454422,
          -0.3929809331893921,
          -0.6551485061645508,
          -0.5836232900619507,
          -0.2751914858818054,
          -0.32890716195106506,
          0.2292097806930542,
          0.18311066925525665,
          -0.6203374862670898,
          -0.2668886184692383,
          0.39608365297317505,
          0.6221491694450378,
          -0.012201547622680664,
          0.016824692487716675,
          0.006687089800834656
        ]
      }
    }
  ]
}