{
  "env_info": {
    "env_id": "StackCube-v2",
    "max_episode_steps": 200,
    "env_kwargs": {
      "obs_mode": "state",
      "reward_mode": "dense",
      "control_mode": "pd_ee_delta_pose"
    }
  },
  "commit_info": null,
  "episodes": [
    {
      "episode_id": 0,
      "episode_seed": 4282876139,
      "reset_kwargs": {},
      "control_mode": "pd_ee_delta_pose",
      "elapsed_steps": 200,
      "info": {
        "elapsed_steps": 200,
        "is_cubaA_grasped": false,
        "is_cubeA_on_cubeB": false,
        "is_cubeA_static": true,
        "success": false,
        "TimeLimit.truncated": true,
        "is_success": false,
        "terminal_observation": [
          0.0038037244230508804,
          0.9491201639175415,
          -0.14714977145195007,
          -1.483554482460022,
          -0.07810911536216736,
          2.5481176376342773,
          0.8599193692207336,
          0.031519774347543716,
          0.03151977062225342,
          6.571166011326568e-08,
          -3.9628794183954597e-05,
          -2.867422608687775e-06,
          2.0960860638297163e-05,
          6.339633387142385e-07,
          2.64687264461827e-06,
          -9.134737410931848e-11,
          2.3285024326469284e-06,
          2.315184929102543e-06,
          -0.6150000095367432,
          8.731149137020111e-11,
          0.0,
          1.0000001192092896,
          0.0,
          0.0,
          0.0,
          0.11007381975650787,
          -0.10105735808610916,
          0.019855357706546783,
          0.083476223051548,
          0.9938748478889465,
          -0.04345366358757019,
          0.057933248579502106,
          0.2143808901309967,
          -0.11343570798635483,
          0.019999973475933075,
          -0.40843355655670166,
          -9.313106374975177e-08,
          -4.492174454640008e-08,
          0.9127880930900574,
          0.05182741954922676,
          -0.15310318768024445,
          0.019999997690320015,
          -0.003055088920518756,
          -1.9863270495079632e-07,
          9.114609511584604e-09,
          0.9999954104423523,
          0.10430707037448883,
          -0.012378349900245667,
          0.0001446157693862915,
          -0.05824640020728111,
          -0.052045829594135284,
          0.0001446399837732315,
          -0.16255347430706024,
          -0.03966747969388962,
          2.421438694000244e-08
        ]
      }
    },
    {
      "episode_id": 1,
      "episode_seed": 3093770124,
      "reset_kwargs": {},
      "control_mode": "pd_ee_delta_pose",
      "elapsed_steps": 200,
      "info": {
        "elapsed_steps": 200,
        "is_cubaA_grasped": false,
        "is_cubeA_on_cubeB": false,
        "is_cubeA_static": true,
        "success": false,
        "TimeLimit.truncated": true,
        "is_success": false,
        "terminal_observation": [
          -0.33487072587013245,
          0.9476234316825867,
          -0.21513330936431885,
          -1.4689841270446777,
          0.13486571609973907,
          2.392348527908325,
          0.9026980400085449,
          0.015915609896183014,
          0.015915608033537865,
          -6.241705818865739e-08,
          -3.948072480852716e-05,
          -3.700677552842535e-06,
          2.092149225063622e-05,
          5.25887458024954e-07,
          2.4870712422853103e-06,
          2.996614512085216e-09,
          2.7376675006962614e-06,
          2.730455207711202e-06,
          -0.6150000095367432,
          8.731149137020111e-11,
          0.0,
          1.0000001192092896,
          0.0,
          0.0,
          0.0,
          -0.0010304776951670647,
          -0.3556908369064331,
          0.016545578837394714,
          0.04041754826903343,
          0.9420795440673828,
          -0.33281588554382324,
          -0.009287882596254349,
          0.05579682067036629,
          -0.390262633562088,
          0.019999997690320015,
          -1.2243101821240998e-07,
          -0.655559241771698,
          -0.7551438212394714,
          9.746521101305916e-08,
          -0.03134237974882126,
          0.02544296346604824,
          0.020000003278255463,
          -0.8637457489967346,
          -3.3254330844556534e-08,
          -8.44778682562719e-08,
          0.5039278864860535,
          0.056827299296855927,
          -0.03457179665565491,
          0.0034544188529253006,
          -0.03031190112233162,
          0.3811337947845459,
          0.0034544244408607483,
          -0.08713920414447784,
          0.4157055914402008,
          5.587935447692871e-09
        ]
      }
    },
    {
      "episode_id": 2,
      "episode_seed": 4005303368,
      "reset_kwargs": {},
      "control_mode": "pd_ee_delta_pose",
      "elapsed_steps": 200,
      "info": {
        "elapsed_steps": 200,
        "is_cubaA_grasped": true,
        "is_cubeA_on_cubeB": false,
        "is_cubeA_static": true,
        "success": false,
        "TimeLimit.truncated": true,
        "is_success": false,
        "terminal_observation": [
          2.89729642868042,
          1.1005604267120361,
          -0.557328462600708,
          -3.0172431468963623,
          1.3953603506088257,
          2.848331928253174,
          2.8446621894836426,
          0.02675367146730423,
          0.029576728120446205,
          -0.000740195217076689,
          -0.0022018924355506897,
          0.005552256945520639,
          -0.002880678279325366,
          0.00042420014506205916,
          0.0070315464399755,
          0.020506303757429123,
          0.0009316231589764357,
          -0.000725546560715884,
          -0.6150000095367432,
          8.731149137020111e-11,
          0.0,
          1.0000001192092896,
          0.0,
          0.0,
          0.0,
          -0.42309385538101196,
          0.10543954372406006,
          0.03254011645913124,
          -0.04347508028149605,
          0.7382538914680481,
          -0.5144723653793335,
          0.4340614974498749,
          -0.4290994107723236,
          0.10834173858165741,
          0.04090890288352966,
          0.9175729155540466,
          -0.03783221170306206,
          -0.364237904548645,
          -0.15478843450546265,
          0.08316564559936523,
          -0.12738832831382751,
          0.01999998837709427,
          -0.8172774910926819,
          -5.594976926204254e-08,
          -2.7115435230484763e-08,
          0.5762442946434021,
          -0.0060055553913116455,
          0.002902194857597351,
          0.008368786424398422,
          0.5062595009803772,
          -0.23282787203788757,
          -0.012540128082036972,
          0.5122650861740112,
          -0.23573006689548492,
          -0.020908914506435394
        ]
      }
    },
    {
      "episode_id": 3,
      "episode_seed": 491263,
      "reset_kwargs": {},
      "control_mode": "pd_ee_delta_pose",
      "elapsed_steps": 200,
      "info": {
        "elapsed_steps": 200,
        "is_cubaA_grasped": true,
        "is_cubeA_on_cubeB": false,
        "is_cubeA_static": false,
        "success": false,
        "TimeLimit.truncated": true,
        "is_success": false,
        "terminal_observation": [
          0.3059755861759186,
          0.7180167436599731,
          0.18008124828338623,
          -2.607872486114502,
          2.590348720550537,
          3.7525198459625244,
          1.9941688776016235,
          0.012946251779794693,
          0.0276318546384573,
          -0.01004413515329361,
          0.00408664345741272,
          -0.0007204642752185464,
          0.005825468339025974,
          0.010488872416317463,
          0.008768539875745773,
          0.0007731074001640081,
          0.0008886996074579656,
          -0.0008386030094698071,
          -0.6150000095367432,
          8.731149137020111e-11,
          0.0,
          1.0000001192092896,
          0.0,
          0.0,
          0.0,
          -0.4972776770591736,
          -0.016361180692911148,
          0.025356262922286987,
          -0.23468488454818726,
          0.06681066751480103,
          0.9333308935165405,
          -0.26334938406944275,
          -0.5067480802536011,
          -0.018388479948043823,
          0.03724181652069092,
          0.008890043944120407,
          0.11752800643444061,
          0.2545916438102722,
          0.9598391652107239,
          0.024148015305399895,
          0.13166359066963196,
          0.019999995827674866,
          -0.3938865661621094,
          -6.980415179214106e-08,
          -2.0191203375929945e-08,
          0.9191591739654541,
          -0.00947040319442749,
          -0.002027299255132675,
          0.01188555359840393,
          0.5214256644248962,
          0.1480247676372528,
          -0.005356267094612122,
          0.5308960676193237,
          0.15005207061767578,
          -0.017241820693016052
        ]
      }
    },
    {
      "episode_id": 4,
      "episode_seed": 550290313,
      "reset_kwargs": {},
      "control_mode": "pd_ee_delta_pose",
      "elapsed_steps": 200,
      "info": {
        "elapsed_steps": 200,
        "is_cubaA_grasped": true,
        "is_cubeA_on_cubeB": false,
        "is_cubeA_static": true,
        "success": false,
        "TimeLimit.truncated": true,
        "is_success": false,
        "terminal_observation": [
          2.8973002433776855,
          1.4131444692611694,
          -0.5155801177024841,
          -2.963684558868408,
          1.2927659749984741,
          2.397372245788574,
          2.8972904682159424,
          0.02194271609187126,
          0.02170320227742195,
          -0.0005980058922432363,
          0.001510893926024437,
          0.004072950221598148,
          0.0013744027819484472,
          0.0018609410617500544,
          0.0005953509244136512,
          0.00012846833851654083,
          -4.430747503647581e-05,
          -0.00045013168710283935,
          -0.6150000095367432,
          8.731149137020111e-11,
          0.0,
          1.0000001192092896,
          0.0,
          0.0,
          0.0,
          -0.3884797692298889,
          0.0027752183377742767,
          0.04183877259492874,
          0.1187363937497139,
          0.6229917407035828,
          -0.5542578101158142,
          0.5390559434890747,
          -0.39456096291542053,
          0.01228326465934515,
          0.04461999982595444,
          -0.15429550409317017,
          -0.22749577462673187,
          0.3553275465965271,
          0.8934097290039062,
          0.06966190040111542,
          -0.04690799117088318,
          0.019999995827674866,
          -0.017483480274677277,
          -4.8010736719561464e-08,
          9.544008250372826e-09,
          0.9998471736907959,
          -0.006081193685531616,
          0.009508046321570873,
          0.002781227231025696,
          0.4581416845321655,
          -0.049683209508657455,
          -0.021838776767253876,
          0.46422284841537476,
          -0.0591912567615509,
          -0.02462000399827957
        ]
      }
    },
    {
      "episode_id": 5,
      "episode_seed": 1298508491,
      "reset_kwargs": {},
      "control_mode": "pd_ee_delta_pose",
      "elapsed_steps": 200,
      "info": {
        "elapsed_steps": 200,
        "is_cubaA_grasped": false,
        "is_cubeA_on_cubeB": false,
        "is_cubeA_static": true,
        "success": false,
        "TimeLimit.truncated": true,
        "is_success": false,
        "terminal_observation": [
          -0.05158602073788643,
          0.8370006680488586,
          -0.011714235879480839,
          -1.457306146621704,
          -0.011051062494516373,
          2.2456045150756836,
          0.6968746781349182,
          0.03220509737730026,
          0.03220509737730026,
          4.374651041416655e-08,
          -3.9268910768441856e-05,
          2.1923756321484689e-07,
          2.2193667973624542e-05,
          2.89336185232969e-07,
          2.3969298581505427e-06,
          2.6605913028276973e-09,
          5.6710082390054595e-06,
          5.666980086971307e-06,
          -0.6150000095367432,
          8.731149137020111e-11,
          0.0,
          1.0000001192092896,
          0.0,
          0.0,
          0.0,
          0.0935508981347084,
          -0.04560394585132599,
          0.07658713310956955,
          0.006754531525075436,
          0.9995048642158508,
          0.017991065979003906,
          -0.024914193898439407,
          0.11308204382658005,
          -0.1345004439353943,
          0.01999998837709427,
          -0.5307066440582275,
          -7.008169689015631e-08,
          -5.496779209579472e-08,
          0.8475555777549744,
          0.11900928616523743,
          -0.20999222993850708,
          0.01999998465180397,
          0.5707142949104309,
          -1.568558616327209e-08,
          2.6424741506048122e-08,
          0.821148693561554,
          0.019531145691871643,
          -0.0888964980840683,
          -0.05658714473247528,
          0.025458388030529022,
          -0.1643882840871811,
          -0.05658714845776558,
          0.005927242338657379,
          -0.07549178600311279,
          -3.725290298461914e-09
        ]
      }
    },
    {
      "episode_id": 6,
      "episode_seed": 4290846341,
      "reset_kwargs": {},
      "control_mode": "pd_ee_delta_pose",
      "elapsed_steps": 200,
      "info": {
        "elapsed_steps": 200,
        "is_cubaA_grasped": true,
        "is_cubeA_on_cubeB": false,
        "is_cubeA_static": true,
        "success": false,
        "TimeLimit.truncated": true,
        "is_success": false,
        "terminal_observation": [
          -0.1928851455450058,
          0.7714241147041321,
          0.09930956363677979,
          -2.577669620513916,
          2.8644964694976807,
          3.752580404281616,
          1.692723035812378,
          0.0031932219862937927,
          0.03939764201641083,
          -0.001138762105256319,
          0.011658892966806889,
          0.005467194132506847,
          -0.0034218383952975273,
          0.01827860251069069,
          -0.01412142626941204,
          0.03144819289445877,
          -0.004146861378103495,
          0.0003001747827511281,
          -0.6150000095367432,
          8.731149137020111e-11,
          0.0,
          1.0000001192092896,
          0.0,
          0.0,
          0.0,
          -0.5441154837608337,
          -0.040454160422086716,
          0.02550327405333519,
          -0.35988643765449524,
          0.31801992654800415,
          0.8650161623954773,
          -0.14523161947727203,
          -0.5456884503364563,
          -0.05236247181892395,
          0.04147324711084366,
          0.8581683039665222,
          -0.17815718054771423,
          0.2522986829280853,
          0.41006410121917725,
          -0.08931970596313477,
          0.04885026812553406,
          0.02000001072883606,
          -0.8858601450920105,
          -1.703284269183314e-08,
          -6.083859460659369e-08,
          0.4639523923397064,
          -0.0015729665756225586,
          -0.011908311396837234,
          0.01596997305750847,
          0.454795777797699,
          0.08930443227291107,
          -0.00550326332449913,
          0.45636874437332153,
          0.10121273994445801,
          -0.0214732363820076
        ]
      }
    },
    {
      "episode_id": 7,
      "episode_seed": 630311759,
      "reset_kwargs": {},
      "control_mode": "pd_ee_delta_pose",
      "elapsed_steps": 200,
      "info": {
        "elapsed_steps": 200,
        "is_cubaA_grasped": true,
        "is_cubeA_on_cubeB": false,
        "is_cubeA_static": true,
        "success": false,
        "TimeLimit.truncated": true,
        "is_success": false,
        "terminal_observation": [
          0.32247623801231384,
          0.710114061832428,
          0.07862906903028488,
          -2.773522138595581,
          2.084428548812866,
          3.7525100708007812,
          2.4303102493286133,
          0.020540717989206314,
          0.020171482115983963,
          -0.0005591078661382198,
          0.001968612428754568,
          0.0014382791705429554,
          0.001312118605710566,
          0.0033695746678858995,
          0.00147803605068475,
          0.004345776047557592,
          -2.771724757621996e-05,
          -0.00045322137884795666,
          -0.6150000095367432,
          8.731149137020111e-11,
          0.0,
          1.0000001192092896,
          0.0,
          0.0,
          0.0,
          -0.4764551520347595,
          -0.10922002792358398,
          0.03828490898013115,
          -0.16132795810699463,
          0.0425717867910862,
          0.9216919541358948,
          -0.3502070903778076,
          -0.46854090690612793,
          -0.1029309332370758,
          0.04421684518456459,
          0.9329893589019775,
          -0.35808977484703064,
          0.009660662151873112,
          0.03477306663990021,
          -0.00953600276261568,
          -0.13760632276535034,
          0.020000005140900612,
          0.9998501539230347,
          5.10077580173629e-09,
          1.2383750913613767e-07,
          0.017316296696662903,
          0.007914245128631592,
          0.006289094686508179,
          0.005931936204433441,
          0.4669191539287567,
          -0.028386294841766357,
          -0.018284903839230537,
          0.4590049088001251,
          -0.034675389528274536,
          -0.02421684004366398
        ]
      }
    },
    {
      "episode_id": 8,
      "episode_seed": 1013994432,
      "reset_kwargs": {},
      "control_mode": "pd_ee_delta_pose",
      "elapsed_steps": 200,
      "info": {
        "elapsed_steps": 200,
        "is_cubaA_grasped": true,
        "is_cubeA_on_cubeB": false,
        "is_cubeA_static": true,
        "success": false,
        "TimeLimit.truncated": true,
        "is_success": false,
        "terminal_observation": [
          -0.2381548285484314,
          0.7403205037117004,
          0.13310375809669495,
          -2.5374486446380615,
          2.8859918117523193,
          3.7526023387908936,
          1.7391479015350342,
          0.007439692970365286,
          0.03642166405916214,
          -0.005281963851302862,
          0.009414366446435452,
          0.006366898771375418,
          -0.0036472920328378677,
          -0.006977243348956108,
          -0.013702236115932465,
          0.02582607977092266,
          0.003395950188860297,
          0.0003275747876614332,
          -0.6150000095367432,
          8.731149137020111e-11,
          0.0,
          1.0000001192092896,
          0.0,
          0.0,
          0.0,
          -0.5152223706245422,
          -0.03511733189225197,
          0.020929615944623947,
          -0.32953619956970215,
          0.36125534772872925,
          0.8625708818435669,
          -0.12989234924316406,
          -0.5043395161628723,
          -0.05241833254694939,
          0.03134128823876381,
          0.5551292896270752,
          -0.2489432394504547,
          0.009767690673470497,
          -0.7935763001441956,
          -0.08785175532102585,
          -0.018385104835033417,
          0.020000018179416656,
          -0.7056870460510254,
          -0.04478682950139046,
          0.7056870460510254,
          -0.044786810874938965,
          0.010882854461669922,
          -0.017301000654697418,
          0.010411672294139862,
          0.4273706078529358,
          0.01673222705721855,
          -0.0009295977652072906,
          0.41648775339126587,
          0.03403322771191597,
          -0.011341270059347153
        ]
      }
    },
    {
      "episode_id": 9,
      "episode_seed": 396591248,
      "reset_kwargs": {},
      "control_mode": "pd_ee_delta_pose",
      "elapsed_steps": 200,
      "info": {
        "elapsed_steps": 200,
        "is_cubaA_grasped": false,
        "is_cubeA_on_cubeB": false,
        "is_cubeA_static": true,
        "success": false,
        "TimeLimit.truncated": true,
        "is_success": false,
        "terminal_observation": [
          0.6172139644622803,
          0.7853910326957703,
          0.2749996781349182,
          -1.8502919673919678,
          2.89139723777771,
          3.7527074813842773,
          1.61021089553833,
          5.9763682656921446e-05,
          0.03999999910593033,
          -0.0009122330811806023,
          0.0029582777060568333,
          -0.005217665806412697,
          0.004313682671636343,
          0.09155239164829254,
          -0.001028772909194231,
          -0.07627455145120621,
          -0.0005861929967068136,
          0.08259183168411255,
          -0.6150000095367432,
          8.731149137020111e-11,
          0.0,
          1.0000001192092896,
          0.0,
          0.0,
          0.0,
          -0.3221984803676605,
          0.33125606179237366,
          0.010286346077919006,
          -0.04311760887503624,
          -0.1034993827342987,
          0.9936865568161011,
          -0.003975138068199158,
          -0.301685631275177,
          0.3135761320590973,
          0.02004312351346016,
          0.620131254196167,
          -0.0006403547595255077,
          -0.0009314633789472282,
          0.7844973206520081,
          -0.005105913151055574,
          -0.02435794286429882,
          0.019999995827674866,
          -0.9676948189735413,
          -1.2802034987657862e-08,
          6.971724531013024e-09,
          0.2521244287490845,
          0.02051284909248352,
          -0.017679929733276367,
          0.009756777435541153,
          0.31709256768226624,
          -0.3556140065193176,
          0.00971364974975586,
          0.2965797185897827,
          -0.33793407678604126,
          -4.312768578529358e-05
        ]
      }
    }
  ]
}