{
  "env_info": {
    "env_id": "StackCube-v2",
    "max_episode_steps": 200,
    "env_kwargs": {
      "obs_mode": "state",
      "reward_mode": "dense",
      "control_mode": "pd_ee_delta_pose"
    }
  },
  "commit_info": null,
  "episodes": [
    {
      "episode_id": 0,
      "episode_seed": 4282876139,
      "reset_kwargs": {},
      "control_mode": "pd_ee_delta_pose",
      "elapsed_steps": 200,
      "info": {
        "elapsed_steps": 200,
        "is_cubaA_grasped": true,
        "is_cubeA_on_cubeB": false,
        "is_cubeA_static": false,
        "success": false,
        "TimeLimit.truncated": true,
        "is_success": false,
        "terminal_observation": [
          -0.3363519012928009,
          1.0561518669128418,
          -0.21434439718723297,
          -1.2808911800384521,
          0.1931542307138443,
          2.3893585205078125,
          1.1764525175094604,
          0.02078894153237343,
          0.02081483043730259,
          1.686546966084279e-05,
          3.5923403629567474e-06,
          1.2146608241891954e-05,
          -6.249990838114172e-05,
          1.4085347174841445e-05,
          2.2757594706490636e-05,
          -1.7414520698366687e-05,
          -2.0076713553862646e-06,
          -0.0004230363992974162,
          -0.6150000095367432,
          8.731149137020111e-11,
          0.0,
          1.0000001192092896,
          0.0,
          0.0,
          0.0,
          0.04603545740246773,
          -0.36270013451576233,
          0.015650048851966858,
          0.025709938257932663,
          0.8850314617156982,
          -0.4633810520172119,
          0.036557916551828384,
          0.05693519115447998,
          -0.3765532672405243,
          0.021718256175518036,
          -0.3157825171947479,
          0.04055028781294823,
          0.010489564388990402,
          0.9479067325592041,
          0.010218736715614796,
          -0.10810545086860657,
          0.019999995827674866,
          -0.4553743004798889,
          -6.401815966228241e-08,
          -6.27010123821492e-08,
          0.8903000950813293,
          0.010899733752012253,
          -0.013853132724761963,
          0.006068207323551178,
          -0.03581672161817551,
          0.25459468364715576,
          0.004349946975708008,
          -0.04671645537018776,
          0.2684478163719177,
          -0.0017182603478431702
        ]
      }
    }
  ]
}