{
    "urls": [
        ["image.i.SB10083.cont.taylor.0.restored.conv.fits",
        "https://url.to/data"],

        ["image.i.SB10083.cont.taylor.1.restored.conv.fits",
         "http://url.to/data"],

        ["image.i.SB10635.cont.taylor.0.restored.conv.fits",
         "/absolute/path/to/staged_data"],
         
        ["image.i.SB10635.cont.taylor.1.restored.conv.fits",
         " "],

	["weights.i.SB10083.cont.taylor.0.fits",
	 " "],
	
        ["weights.i.SB10083.cont.taylor.1.fits",
         " "],

        ["weights.i.SB10635.cont.taylor.0.fits",
         " "],

        ["weights.i.SB10635.cont.taylor.1.fits",
         " "]	
    ]
}
