module nationalCode

go 1.15

require (
	github.com/alecthomas/template v0.0.0-20190718012654-fb15b899a751
	github.com/cpuguy83/go-md2man/v2 v2.0.0 // indirect
	github.com/gin-gonic/gin v1.6.3
	github.com/go-openapi/spec v0.20.0 // indirect
	github.com/go-playground/validator/v10 v10.4.1 // indirect
	github.com/golang/protobuf v1.4.3 // indirect
	github.com/json-iterator/go v1.1.10 // indirect
	github.com/leodido/go-urn v1.2.1 // indirect
	github.com/modern-go/concurrent v0.0.0-20180306012644-bacd9c7ef1dd // indirect
	github.com/modern-go/reflect2 v1.0.1 // indirect
	github.com/russross/blackfriday/v2 v2.1.0 // indirect
	github.com/swaggo/gin-swagger v1.3.0
	github.com/swaggo/swag v1.7.0
	github.com/ugorji/go v1.2.2 // indirect
	golang.org/x/crypto v0.0.0-20201221181555-eec23a3978ad // indirect
	golang.org/x/net v0.0.0-20201224014010-6772e930b67b // indirect
	golang.org/x/sys v0.0.0-20201231184435-2d18734c6014 // indirect
	golang.org/x/tools v0.0.0-20201230224404-63754364767c // indirect
	google.golang.org/protobuf v1.25.0 // indirect
	gopkg.in/yaml.v2 v2.4.0 // indirect
)
