{
  "ipcMode": null,
  "executionRoleArn": "arn:aws:iam::922032444791:role/ItoChatNotifierContainerServiceTaskExecutionRole",
  "containerDefinitions": [
    {
      "name": "ito-chat-example-notifier-task",
      "image": "<IMAGE1_NAME>",
      "essential": true,
      "portMappings": [
        {
          "protocol": "tcp",
          "hostPort": 8080,
          "containerPort": 8080
        }
      ],
      "logConfiguration": {
        "logDriver": "awslogs",
        "options": {
          "awslogs-group": "ito-ecs-fargate/chat-example-notifier",
          "awslogs-region": "ap-northeast-1",
          "awslogs-stream-prefix": "backend"
        }
      },
      "secrets": [
        {
          "name": "NABLARCH_LETTUCE_SIMPLE_URI",
          "valueFrom": "/Ito/Epona/App/Config/nablarch_lettuce_simple_url"
        }
      ]
    }
  ],
  "compatibilities": [
    "FARGATE"
  ],
  "family": "ito-chat-example-notifier-task",
  "requiresCompatibilities": [
    "FARGATE"
  ],
  "networkMode": "awsvpc",
  "cpu": "512",
  "memory": "1024"
}
