AAA478577576
AA1426566505
AA2420505490
AA3422491497
AA4441528531
AA5462555557
AA6500607604
AA7517628621
NSA472600586
NS1         
NS2418533502
NS3425525515
NS4441554544
NS5458577567
NS6489628612
NS7506649629
ENA470718624
EN1         
EN2431677566
EN3426656553
EN4439686584
EN5452704603
EN6481732641
EN7499742655
SSA480539565
SS1         
SS2413449466
SS3415450481
SS4439489518
SS5464521548
SS6505573596
SS7525589612
HAA536548583
HA1         
HA2472471497
HA3468468504
HA4485496535
HA5514525562
HA6558573606
HA7576586621
EDA432496522
ED1         
ED2         
ED3396437461
ED4409464490
ED5421482509
ED6449520547
ED7466538562
BUA454568552
BU1         
BU2         
BU3409483480
BU4426522517
BU5444553539
BU6480618591
BU7502638610
OTA457523544
OT1         
OT2401447458
OT3408446472
OT4423482507
OT5445509531
OT6485561577
OT7501572590
