Designator,Footprint,Mid X,Mid Y,Ref X,Ref Y,Pad X,Pad Y,Layer,Rotation,Comment
,,,,,,,,,,
BUSS_RES1,DIYSMD17(COMBINED),100.1mm,5.0mm,100.1mm,5.0mm,100.1mm,5.0mm,T,0,DIYSMD17(COMBINED)
C1,EIA3216,152.3mm,31.8mm,152.3mm,31.8mm,152.3mm,31.8mm,T,270,10uF
CON1,BOX_HEADER,153.0mm,62.3mm,153.0mm,62.3mm,153.0mm,62.3mm,T,90,BOX_HEADER
CON2,DIY_SMT_DUALROW_4,14.4mm,91.9mm,14.4mm,91.9mm,14.4mm,91.9mm,T,0,DIY_SMT_DUALROW_04
CON3,DIY_SMT_DUALROW_4,127.4mm,96.6mm,127.4mm,96.6mm,127.4mm,96.6mm,T,270,DIY_SMT_DUALROW_04
CON4,DIY_SMT_02,143.0mm,94.8mm,143.0mm,94.8mm,143.0mm,94.8mm,T,270,DIY_SMT_02
CON5,DIY_SMT_02,153.0mm,23.7mm,153.0mm,23.7mm,153.0mm,23.7mm,T,270,DIY_SMT_02
CON6,DIY_SMT_02,153.0mm,12.7mm,153.0mm,12.7mm,153.0mm,12.7mm,T,270,DIY_SMT_02
D1,LED-0603,3.8mm,58.0mm,3.8mm,58.0mm,3.8mm,58.0mm,B,90,
D2,LED-0603,30.3mm,58.0mm,30.3mm,58.0mm,30.3mm,58.0mm,B,90,
D3,LED-0603,31.8mm,83.0mm,31.8mm,83.0mm,31.8mm,83.0mm,B,90,
D4,LED-0603,58.3mm,83.0mm,58.3mm,83.0mm,58.3mm,83.0mm,B,90,
D5,LED-0603,31.8mm,33.0mm,31.8mm,33.0mm,31.8mm,33.0mm,B,90,
D6,LED-0603,58.3mm,33.0mm,58.3mm,33.0mm,58.3mm,33.0mm,B,90,
D7,LED-0603,59.8mm,58.0mm,59.8mm,58.0mm,59.8mm,58.0mm,B,90,
D8,LED-0603,86.3mm,58.0mm,86.3mm,58.0mm,86.3mm,58.0mm,B,90,
D9,LED-0603,87.8mm,83.0mm,87.8mm,83.0mm,87.8mm,83.0mm,B,90,
D10,LED-0603,114.3mm,83.0mm,114.3mm,83.0mm,114.3mm,83.0mm,B,90,
D11,LED-0603,87.8mm,33.0mm,87.8mm,33.0mm,87.8mm,33.0mm,B,90,
D12,LED-0603,114.8mm,33.0mm,114.8mm,33.0mm,114.8mm,33.0mm,B,90,
D13,LED-0603,115.8mm,58.0mm,115.8mm,58.0mm,115.8mm,58.0mm,B,90,
D14,LED-0603,142.3mm,58.0mm,142.3mm,58.0mm,142.3mm,58.0mm,B,90,
D15,LED-1206,73.0mm,3.8mm,73.0mm,3.8mm,73.0mm,3.8mm,B,0,
D16,LED-0603,17.0mm,71.3mm,17.0mm,71.3mm,17.0mm,71.3mm,B,0,
D17,LED-0603,17.0mm,44.8mm,17.0mm,44.8mm,17.0mm,44.8mm,B,0,
D18,LED-0603,45.0mm,96.3mm,45.0mm,96.3mm,45.0mm,96.3mm,B,0,
D19,LED-0603,45.0mm,69.8mm,45.0mm,69.8mm,45.0mm,69.8mm,B,0,
D20,LED-0603,45.0mm,46.3mm,45.0mm,46.3mm,45.0mm,46.3mm,B,0,
D21,LED-0603,45.0mm,19.8mm,45.0mm,19.8mm,45.0mm,19.8mm,B,0,
D22,LED-0603,73.0mm,71.3mm,73.0mm,71.3mm,73.0mm,71.3mm,B,0,
D23,LED-0603,73.0mm,44.8mm,73.0mm,44.8mm,73.0mm,44.8mm,B,0,
D24,LED-0603,101.0mm,96.3mm,101.0mm,96.3mm,101.0mm,96.3mm,B,0,
D25,LED-0603,101.0mm,69.8mm,101.0mm,69.8mm,101.0mm,69.8mm,B,0,
D26,LED-0603,101.0mm,46.3mm,101.0mm,46.3mm,101.0mm,46.3mm,B,0,
D27,LED-0603,101.0mm,19.8mm,101.0mm,19.8mm,101.0mm,19.8mm,B,0,
D28,LED-0603,129.0mm,71.3mm,129.0mm,71.3mm,129.0mm,71.3mm,B,0,
D29,LED-0603,129.0mm,44.8mm,129.0mm,44.8mm,129.0mm,44.8mm,B,0,
D30,LED-0805,76.1mm,94.8mm,76.1mm,94.8mm,76.1mm,94.8mm,T,180,
D31,LED-0805,66.4mm,94.8mm,66.4mm,94.8mm,66.4mm,94.8mm,T,180,
IR1,SFH4050N,4.9mm,54.8mm,4.9mm,54.8mm,4.9mm,54.8mm,T,285,SFH4045NSFH4050N_SMD
IR2,SFH4050N,4.9mm,61.2mm,4.9mm,61.2mm,4.9mm,61.2mm,T,255,SFH4045NSFH4050N_SMD
IR3,SFH4050N,32.9mm,79.8mm,32.9mm,79.8mm,32.9mm,79.8mm,T,285,SFH4045NSFH4050N_SMD
IR4,SFH4050N,32.9mm,86.2mm,32.9mm,86.2mm,32.9mm,86.2mm,T,255,SFH4045NSFH4050N_SMD
IR5,SFH4050N,32.9mm,29.8mm,32.9mm,29.8mm,32.9mm,29.8mm,T,285,SFH4045NSFH4050N_SMD
IR6,SFH4050N,32.9mm,36.2mm,32.9mm,36.2mm,32.9mm,36.2mm,T,255,SFH4045NSFH4050N_SMD
IR7,SFH4050N,60.9mm,54.8mm,60.9mm,54.8mm,60.9mm,54.8mm,T,285,SFH4045NSFH4050N_SMD
IR8,SFH4050N,60.9mm,61.2mm,60.9mm,61.2mm,60.9mm,61.2mm,T,255,SFH4045NSFH4050N_SMD
IR9,SFH4050N,88.9mm,79.8mm,88.9mm,79.8mm,88.9mm,79.8mm,T,285,SFH4045NSFH4050N_SMD
IR10,SFH4050N,88.9mm,86.2mm,88.9mm,86.2mm,88.9mm,86.2mm,T,255,SFH4045NSFH4050N_SMD
IR11,SFH4050N,88.9mm,29.8mm,88.9mm,29.8mm,88.9mm,29.8mm,T,285,SFH4045NSFH4050N_SMD
IR12,SFH4050N,88.9mm,36.2mm,88.9mm,36.2mm,88.9mm,36.2mm,T,255,SFH4045NSFH4050N_SMD
IR13,SFH4050N,116.9mm,54.8mm,116.9mm,54.8mm,116.9mm,54.8mm,T,285,SFH4045NSFH4050N_SMD
IR14,SFH4050N,116.9mm,61.2mm,116.9mm,61.2mm,116.9mm,61.2mm,T,255,SFH4045NSFH4050N_SMD
IR15,SFH4050N,60.0mm,14.5mm,60.0mm,14.5mm,60.0mm,14.5mm,T,285,SFH4045NSFH4050N_SMD
IR16,SFH4050N,60.0mm,21.5mm,60.0mm,21.5mm,60.0mm,21.5mm,T,255,SFH4045NSFH4050N_SMD
IR17,LED-0805,155.1mm,90.1mm,155.1mm,90.1mm,155.1mm,90.1mm,B,180,
IR18,LED-0805,155.1mm,86.1mm,155.1mm,86.1mm,155.1mm,86.1mm,B,180,
PT1,PT12-21B/TR8,29.1mm,61.2mm,29.1mm,61.2mm,29.1mm,61.2mm,T,105,PT12-21B/TR8
PT2,PT12-21B/TR8,29.1mm,54.8mm,29.1mm,54.8mm,29.1mm,54.8mm,T,75,PT12-21B/TR8
PT3,PT12-21B/TR8,57.1mm,86.2mm,57.1mm,86.2mm,57.1mm,86.2mm,T,105,PT12-21B/TR8
PT4,PT12-21B/TR8,57.1mm,79.8mm,57.1mm,79.8mm,57.1mm,79.8mm,T,75,PT12-21B/TR8
PT5,PT12-21B/TR8,57.1mm,36.2mm,57.1mm,36.2mm,57.1mm,36.2mm,T,105,PT12-21B/TR8
PT6,PT12-21B/TR8,57.1mm,29.8mm,57.1mm,29.8mm,57.1mm,29.8mm,T,75,PT12-21B/TR8
PT7,PT12-21B/TR8,85.1mm,61.2mm,85.1mm,61.2mm,85.1mm,61.2mm,T,105,PT12-21B/TR8
PT8,PT12-21B/TR8,85.1mm,54.8mm,85.1mm,54.8mm,85.1mm,54.8mm,T,75,PT12-21B/TR8
PT9,PT12-21B/TR8,113.1mm,86.2mm,113.1mm,86.2mm,113.1mm,86.2mm,T,105,PT12-21B/TR8
PT10,PT12-21B/TR8,113.1mm,79.8mm,113.1mm,79.8mm,113.1mm,79.8mm,T,75,PT12-21B/TR8
PT11,PT12-21B/TR8,113.1mm,36.2mm,113.1mm,36.2mm,113.1mm,36.2mm,T,105,PT12-21B/TR8
PT12,PT12-21B/TR8,113.1mm,29.8mm,113.1mm,29.8mm,113.1mm,29.8mm,T,75,PT12-21B/TR8
PT13,PT12-21B/TR8,141.1mm,61.2mm,141.1mm,61.2mm,141.1mm,61.2mm,T,105,PT12-21B/TR8
PT14,PT12-21B/TR8,141.1mm,54.8mm,141.1mm,54.8mm,141.1mm,54.8mm,T,75,PT12-21B/TR8
PT15,PT12-21B/TR8,86.0mm,21.5mm,86.0mm,21.5mm,86.0mm,21.5mm,T,105,PT12-21B/TR8
PT16,PT12-21B/TR8,86.0mm,14.5mm,86.0mm,14.5mm,86.0mm,14.5mm,T,75,PT12-21B/TR8
Q1,SOT-23,14.5mm,37.0mm,14.5mm,37.0mm,14.5mm,37.0mm,T,180,
Q2,SOT-23,48.5mm,61.7mm,48.5mm,61.7mm,48.5mm,61.7mm,T,180,
Q3,SOT-23,31.4mm,20.1mm,31.4mm,20.1mm,31.4mm,20.1mm,T,180,
Q4,SOT-23,95.2mm,56.0mm,95.2mm,56.0mm,95.2mm,56.0mm,T,90,
Q5,SOT-23,76.7mm,84.2mm,76.7mm,84.2mm,76.7mm,84.2mm,T,180,
Q6,SOT-23,114.7mm,18.3mm,114.7mm,18.3mm,114.7mm,18.3mm,T,180,
Q7,SOT-23,134.8mm,77.1mm,134.8mm,77.1mm,134.8mm,77.1mm,T,180,
Q8,SOT-23,58.7mm,3.8mm,58.7mm,3.8mm,58.7mm,3.8mm,T,180,
Q9,SOT-23,10.9mm,38.9mm,10.9mm,38.9mm,10.9mm,38.9mm,T,0,
Q10,SOT-23,44.6mm,59.4mm,44.6mm,59.4mm,44.6mm,59.4mm,T,0,
Q11,SOT-23,27.6mm,20.8mm,27.6mm,20.8mm,27.6mm,20.8mm,T,0,
Q12,SOT-23,97.0mm,59.8mm,97.0mm,59.8mm,97.0mm,59.8mm,T,270,
Q13,SOT-23,72.1mm,85.4mm,72.1mm,85.4mm,72.1mm,85.4mm,T,0,
Q14,SOT-23,109.5mm,19.3mm,109.5mm,19.3mm,109.5mm,19.3mm,T,0,
Q15,SOT-23,130.6mm,76.1mm,130.6mm,76.1mm,130.6mm,76.1mm,T,0,
Q16,SOT-23,22.5mm,79.8mm,22.5mm,79.8mm,22.5mm,79.8mm,T,0,
Q17,SOT-23,9.0mm,73.3mm,9.0mm,73.3mm,9.0mm,73.3mm,T,0,
Q18,SOT-23,9.0mm,80.8mm,9.0mm,80.8mm,9.0mm,80.8mm,T,0,
Q19,SOT-23,9.2mm,88.5mm,9.2mm,88.5mm,9.2mm,88.5mm,T,0,
R1,R0603,13.8mm,33.2mm,13.8mm,33.2mm,13.8mm,33.2mm,B,90,150R
R2,R0603,13.8mm,33.2mm,13.8mm,33.2mm,13.8mm,33.2mm,T,270,150R
R3,R0603,49.2mm,57.5mm,49.2mm,57.5mm,49.2mm,57.5mm,B,270,150R
R4,R0603,49.2mm,57.5mm,49.2mm,57.5mm,49.2mm,57.5mm,T,90,150R
R5,R0603,32.2mm,15.9mm,32.2mm,15.9mm,32.2mm,15.9mm,B,270,150R
R6,R0603,32.2mm,15.9mm,32.2mm,15.9mm,32.2mm,15.9mm,T,90,150R
R7,R0603,92.3mm,57.7mm,92.3mm,57.7mm,92.3mm,57.7mm,B,180,150R
R8,R0603,92.3mm,57.7mm,92.3mm,57.7mm,92.3mm,57.7mm,T,180,150R
R9,R0603,75.9mm,80.3mm,75.9mm,80.3mm,75.9mm,80.3mm,B,90,150R
R10,R0603,75.9mm,80.3mm,75.9mm,80.3mm,75.9mm,80.3mm,T,270,150R
R11,R0603,115.6mm,14.1mm,115.6mm,14.1mm,115.6mm,14.1mm,B,270,150R
R12,R0603,115.6mm,14.1mm,115.6mm,14.1mm,115.6mm,14.1mm,T,90,150R
R13,R0603,137.1mm,72.8mm,137.1mm,72.8mm,137.1mm,72.8mm,B,270,150R
R14,R0603,137.1mm,72.8mm,137.1mm,72.8mm,137.1mm,72.8mm,T,90,150R
R15,R0603,66.7mm,2.8mm,66.7mm,2.8mm,66.7mm,2.8mm,B,270,150R
R16,R0603,7.0mm,40.7mm,7.0mm,40.7mm,7.0mm,40.7mm,T,270,51R
R17,R0603,7.0mm,40.7mm,7.0mm,40.7mm,7.0mm,40.7mm,B,90,51R
R18,R0603,44.2mm,63.7mm,44.2mm,63.7mm,44.2mm,63.7mm,T,270,51R
R19,R0603,44.2mm,63.7mm,44.2mm,63.7mm,44.2mm,63.7mm,B,90,51R
R20,R0603,28.7mm,24.1mm,28.7mm,24.1mm,28.7mm,24.1mm,T,180,51R
R21,R0603,28.7mm,24.1mm,28.7mm,24.1mm,28.7mm,24.1mm,B,180,51R
R22,R0603,101.5mm,61.0mm,101.5mm,61.0mm,101.5mm,61.0mm,T,180,51R
R23,R0603,101.5mm,61.0mm,101.5mm,61.0mm,101.5mm,61.0mm,B,180,51R
R24,R0603,68.4mm,87.6mm,68.4mm,87.6mm,68.4mm,87.6mm,T,270,51R
R25,R0603,68.4mm,87.6mm,68.4mm,87.6mm,68.4mm,87.6mm,B,90,51R
R26,R0603,106.9mm,14.1mm,106.9mm,14.1mm,106.9mm,14.1mm,T,0,51R
R27,R0603,106.9mm,14.1mm,106.9mm,14.1mm,106.9mm,14.1mm,B,0,51R
R28,R0603,129.9mm,79.9mm,129.9mm,79.9mm,129.9mm,79.9mm,T,270,51R
R29,R0603,129.9mm,79.9mm,129.9mm,79.9mm,129.9mm,79.9mm,B,90,51R
R30,R0603,133.0mm,26.7mm,133.0mm,26.7mm,133.0mm,26.7mm,T,0,56.2R
R31,R0603,133.0mm,26.7mm,133.0mm,26.7mm,133.0mm,26.7mm,B,0,56.2R
R32,R0603,133.0mm,21.7mm,133.0mm,21.7mm,133.0mm,21.7mm,T,0,56.2R
R33,R0603,133.0mm,21.7mm,133.0mm,21.7mm,133.0mm,21.7mm,B,0,56.2R
R34,R0603,133.0mm,17.1mm,133.0mm,17.1mm,133.0mm,17.1mm,T,0,56.2R
R35,R0603,133.0mm,17.1mm,133.0mm,17.1mm,133.0mm,17.1mm,B,0,56.2R
R36,R0603,133.0mm,12.4mm,133.0mm,12.4mm,133.0mm,12.4mm,T,0,56.2R
R37,R0603,133.0mm,12.4mm,133.0mm,12.4mm,133.0mm,12.4mm,B,0,56.2R
R38,R0603,138.1mm,26.8mm,138.1mm,26.8mm,138.1mm,26.8mm,T,0,56.2R
R39,R0603,138.1mm,26.8mm,138.1mm,26.8mm,138.1mm,26.8mm,B,0,56.2R
R40,R0603,138.1mm,21.7mm,138.1mm,21.7mm,138.1mm,21.7mm,T,0,56.2R
R41,R0603,138.1mm,21.7mm,138.1mm,21.7mm,138.1mm,21.7mm,B,0,56.2R
R42,R0603,138.0mm,17.1mm,138.0mm,17.1mm,138.0mm,17.1mm,T,0,56.2R
R43,R0603,138.0mm,17.1mm,138.0mm,17.1mm,138.0mm,17.1mm,B,0,56.2R
R44,R0603,138.1mm,12.4mm,138.1mm,12.4mm,138.1mm,12.4mm,T,0,56.2R
R45,R0603,138.1mm,12.4mm,138.1mm,12.4mm,138.1mm,12.4mm,B,0,56.2R
R46,R0402,23.1mm,5.0mm,23.1mm,5.0mm,23.1mm,5.0mm,T,180,470R
R47,R0402,29.0mm,5.0mm,29.0mm,5.0mm,29.0mm,5.0mm,T,0,470R
R48,R0402,34.9mm,5.0mm,34.9mm,5.0mm,34.9mm,5.0mm,T,0,470R
R49,R0402,41.0mm,5.0mm,41.0mm,5.0mm,41.0mm,5.0mm,T,0,470R
R50,R0402,22.9mm,10.5mm,22.9mm,10.5mm,22.9mm,10.5mm,T,0,470R
R51,R0402,28.7mm,10.7mm,28.7mm,10.7mm,28.7mm,10.7mm,T,0,470R
R52,R0402,34.9mm,10.7mm,34.9mm,10.7mm,34.9mm,10.7mm,T,0,470R
R53,R0402,41.0mm,10.7mm,41.0mm,10.7mm,41.0mm,10.7mm,T,0,470R
R54,R0805,18.0mm,37.2mm,18.0mm,37.2mm,18.0mm,37.2mm,T,180,22R
R55,R0805,52.0mm,61.8mm,52.0mm,61.8mm,52.0mm,61.8mm,T,180,22R
R56,R0805,34.9mm,20.3mm,34.9mm,20.3mm,34.9mm,20.3mm,T,180,22R
R57,R0805,95.9mm,52.0mm,95.9mm,52.0mm,95.9mm,52.0mm,T,90,22R
R58,R0805,80.1mm,84.5mm,80.1mm,84.5mm,80.1mm,84.5mm,T,180,22R
R59,R0805,118.3mm,18.4mm,118.3mm,18.4mm,118.3mm,18.4mm,T,180,22R
R60,R0805,138.4mm,77.2mm,138.4mm,77.2mm,138.4mm,77.2mm,T,180,22R
R61,R0805,59.0mm,8.0mm,59.0mm,8.0mm,59.0mm,8.0mm,T,90,22R
R62,R0805,7.6mm,36.8mm,7.6mm,36.8mm,7.6mm,36.8mm,T,180,22R
R63,R0805,41.1mm,59.4mm,41.1mm,59.4mm,41.1mm,59.4mm,T,0,22R
R64,R0805,23.9mm,20.6mm,23.9mm,20.6mm,23.9mm,20.6mm,T,0,22R
R65,R0805,97.8mm,64.2mm,97.8mm,64.2mm,97.8mm,64.2mm,T,270,22R
R66,R0805,68.7mm,84.7mm,68.7mm,84.7mm,68.7mm,84.7mm,T,180,22R
R67,R0805,110.3mm,15.0mm,110.3mm,15.0mm,110.3mm,15.0mm,T,90,22R
R68,R0805,126.4mm,76.1mm,126.4mm,76.1mm,126.4mm,76.1mm,T,0,22R
R69,R0805,24.2mm,76.2mm,24.2mm,76.2mm,24.2mm,76.2mm,T,270,22R
R70,R0805,5.4mm,73.4mm,5.4mm,73.4mm,5.4mm,73.4mm,T,0,22R
R71,R0805,5.3mm,80.7mm,5.3mm,80.7mm,5.3mm,80.7mm,T,0,22R
R72,R0805,5.4mm,88.3mm,5.4mm,88.3mm,5.4mm,88.3mm,T,0,22R
R73,R0805,80.1mm,94.8mm,80.1mm,94.8mm,80.1mm,94.8mm,T,270,4.7K
R74,R0805,70.4mm,94.8mm,70.4mm,94.8mm,70.4mm,94.8mm,T,90,2.2K
R75,R0805,151.4mm,90.1mm,151.4mm,90.1mm,151.4mm,90.1mm,B,270,1.5K
R76,R0805,151.4mm,86.1mm,151.4mm,86.1mm,151.4mm,86.1mm,B,270,1.5K
PWR_1,MICRO-USB,159.9mm,31.8mm,159.9mm,31.8mm,159.9mm,31.8mm,T,90,MICRO-USB