"Designator","Footprint","Mid X","Mid Y","Ref X","Ref Y","Pad X","Pad Y","Layer","Rotation","Comment"
""
"BUSS_RES1","DIYSMD17(COMBINED)","100.1mm","5.0mm","100.1mm","5.0mm","100.1mm","5.0mm","T","0.0","DIYSMD17(COMBINED)"
"C1","EIA3216","141.9mm","57.3mm","141.9mm","57.3mm","141.9mm","57.3mm","T","270.0","10uF"
"CON1","BOX_HEADER","132.0mm","77.7mm","132.0mm","77.7mm","132.0mm","77.7mm","T","270.0","BOX_HEADER"
"CON2","DIY_SMT_DUALROW_4","14.4mm","91.9mm","14.4mm","91.9mm","14.4mm","91.9mm","T","0.0","DIY_SMT_DUALROW_04"
"CON3","DIY_SMT_DUALROW_4","59.4mm","91.9mm","59.4mm","91.9mm","59.4mm","91.9mm","T","0.0","DIY_SMT_DUALROW_04"
"CON4","DIY_SMT_02","144.0mm","69.3mm","144.0mm","69.3mm","144.0mm","69.3mm","T","270.0","DIY_SMT_02"
"CON5","DIY_SMT_02","144.0mm","25.7mm","144.0mm","25.7mm","144.0mm","25.7mm","T","270.0","DIY_SMT_02"
"CON6","DIY_SMT_02","144.0mm","14.7mm","144.0mm","14.7mm","144.0mm","14.7mm","T","270.0","DIY_SMT_02"
"D1","LED-0603","3.3mm","40.0mm","3.3mm","40.0mm","3.3mm","40.0mm","B","90.0",""
"D2","LED-0603","22.8mm","40.0mm","22.8mm","40.0mm","22.8mm","40.0mm","B","90.0",""
"D3","LED-0603","32.5mm","55.0mm","32.5mm","55.0mm","32.5mm","55.0mm","B","90.0",""
"D4","LED-0603","51.8mm","55.0mm","51.8mm","55.0mm","51.8mm","55.0mm","B","90.0",""
"D5","LED-0603","32.3mm","25.0mm","32.3mm","25.0mm","32.3mm","25.0mm","B","90.0",""
"D6","LED-0603","51.8mm","25.0mm","51.8mm","25.0mm","51.8mm","25.0mm","B","90.0",""
"D7","LED-0603","61.3mm","40.0mm","61.3mm","40.0mm","61.3mm","40.0mm","B","90.0",""
"D8","LED-0603","80.8mm","40.0mm","80.8mm","40.0mm","80.8mm","40.0mm","B","90.0",""
"D9","LED-0603","90.3mm","55.0mm","90.3mm","55.0mm","90.3mm","55.0mm","B","90.0",""
"D10","LED-0603","109.8mm","55.0mm","109.8mm","55.0mm","109.8mm","55.0mm","B","90.0",""
"D11","LED-0603","90.3mm","25.0mm","90.3mm","25.0mm","90.3mm","25.0mm","B","90.0",""
"D12","LED-0603","109.8mm","25.0mm","109.8mm","25.0mm","109.8mm","25.0mm","B","90.0",""
"D13","LED-0603","119.3mm","40.0mm","119.3mm","40.0mm","119.3mm","40.0mm","B","90.0",""
"D14","LED-0603","138.8mm","40.0mm","138.8mm","40.0mm","138.8mm","40.0mm","B","90.0",""
"D15","LED-1206","71.0mm","4.8mm","71.0mm","4.8mm","71.0mm","4.8mm","B","0.0",""
"D16","LED-0603","13.0mm","49.8mm","13.0mm","49.8mm","13.0mm","49.8mm","B","0.0",""
"D17","LED-0603","13.0mm","30.3mm","13.0mm","30.3mm","13.0mm","30.3mm","B","0.0",""
"D18","LED-0603","42.0mm","64.8mm","42.0mm","64.8mm","42.0mm","64.8mm","B","0.0",""
"D19","LED-0603","42.0mm","45.3mm","42.0mm","45.3mm","42.0mm","45.3mm","B","0.0",""
"D20","LED-0603","42.0mm","34.8mm","42.0mm","34.8mm","42.0mm","34.8mm","B","0.0",""
"D21","LED-0603","42.0mm","15.3mm","42.0mm","15.3mm","42.0mm","15.3mm","B","0.0",""
"D22","LED-0603","71.0mm","49.8mm","71.0mm","49.8mm","71.0mm","49.8mm","B","0.0",""
"D23","LED-0603","71.0mm","30.3mm","71.0mm","30.3mm","71.0mm","30.3mm","B","0.0",""
"D24","LED-0603","100.0mm","64.8mm","100.0mm","64.8mm","100.0mm","64.8mm","B","0.0",""
"D25","LED-0603","100.0mm","45.3mm","100.0mm","45.3mm","100.0mm","45.3mm","B","0.0",""
"D26","LED-0603","100.0mm","34.8mm","100.0mm","34.8mm","100.0mm","34.8mm","B","0.0",""
"D27","LED-0603","100.0mm","15.3mm","100.0mm","15.3mm","100.0mm","15.3mm","B","0.0",""
"D28","LED-0603","129.0mm","49.8mm","129.0mm","49.8mm","129.0mm","49.8mm","B","0.0",""
"D29","LED-0603","129.0mm","30.3mm","129.0mm","30.3mm","129.0mm","30.3mm","B","0.0",""
"D30","LED-0805","50.6mm","94.3mm","50.6mm","94.3mm","50.6mm","94.3mm","T","180.0",""
"D31","LED-0805","40.9mm","94.3mm","40.9mm","94.3mm","40.9mm","94.3mm","T","180.0",""
"IR1","SFH4050N","4.3mm","37.7mm","4.3mm","37.7mm","4.3mm","37.7mm","T","285.0","SFH4045NSFH4050N_SMD"
"IR2","SFH4050N","4.3mm","42.3mm","4.3mm","42.3mm","4.3mm","42.3mm","T","255.0","SFH4045NSFH4050N_SMD"
"IR3","SFH4050N","33.3mm","52.7mm","33.3mm","52.7mm","33.3mm","52.7mm","T","285.0","SFH4045NSFH4050N_SMD"
"IR4","SFH4050N","33.3mm","57.3mm","33.3mm","57.3mm","33.3mm","57.3mm","T","255.0","SFH4045NSFH4050N_SMD"
"IR5","SFH4050N","33.3mm","22.7mm","33.3mm","22.7mm","33.3mm","22.7mm","T","285.0","SFH4045NSFH4050N_SMD"
"IR6","SFH4050N","33.3mm","27.3mm","33.3mm","27.3mm","33.3mm","27.3mm","T","255.0","SFH4045NSFH4050N_SMD"
"IR7","SFH4050N","62.3mm","37.7mm","62.3mm","37.7mm","62.3mm","37.7mm","T","285.0","SFH4045NSFH4050N_SMD"
"IR8","SFH4050N","62.3mm","42.3mm","62.3mm","42.3mm","62.3mm","42.3mm","T","255.0","SFH4045NSFH4050N_SMD"
"IR9","SFH4050N","91.3mm","52.7mm","91.3mm","52.7mm","91.3mm","52.7mm","T","285.0","SFH4045NSFH4050N_SMD"
"IR10","SFH4050N","91.3mm","57.3mm","91.3mm","57.3mm","91.3mm","57.3mm","T","255.0","SFH4045NSFH4050N_SMD"
"IR11","SFH4050N","91.3mm","22.7mm","91.3mm","22.7mm","91.3mm","22.7mm","T","285.0","SFH4045NSFH4050N_SMD"
"IR12","SFH4050N","91.3mm","27.3mm","91.3mm","27.3mm","91.3mm","27.3mm","T","255.0","SFH4045NSFH4050N_SMD"
"IR13","SFH4050N","120.3mm","37.7mm","120.3mm","37.7mm","120.3mm","37.7mm","T","285.0","SFH4045NSFH4050N_SMD"
"IR14","SFH4050N","120.3mm","42.3mm","120.3mm","42.3mm","120.3mm","42.3mm","T","255.0","SFH4045NSFH4050N_SMD"
"IR15","SFH4050N","59.9mm","14.0mm","59.9mm","14.0mm","59.9mm","14.0mm","T","285.0","SFH4045NSFH4050N_SMD"
"IR16","SFH4050N","59.9mm","20.0mm","59.9mm","20.0mm","59.9mm","20.0mm","T","255.0","SFH4045NSFH4050N_SMD"
"IR17","LED-0805","146.1mm","87.6mm","146.1mm","87.6mm","146.1mm","87.6mm","B","180.0",""
"IR18","LED-0805","146.1mm","82.1mm","146.1mm","82.1mm","146.1mm","82.1mm","B","180.0",""
"PT1","PT12-21B/TR8","21.7mm","42.3mm","21.7mm","42.3mm","21.7mm","42.3mm","T","105.0","PT12-21B/TR8"
"PT2","PT12-21B/TR8","21.7mm","37.7mm","21.7mm","37.7mm","21.7mm","37.7mm","T","75.0","PT12-21B/TR8"
"PT3","PT12-21B/TR8","50.7mm","57.3mm","50.7mm","57.3mm","50.7mm","57.3mm","T","105.0","PT12-21B/TR8"
"PT4","PT12-21B/TR8","50.7mm","52.7mm","50.7mm","52.7mm","50.7mm","52.7mm","T","75.0","PT12-21B/TR8"
"PT5","PT12-21B/TR8","50.7mm","27.3mm","50.7mm","27.3mm","50.7mm","27.3mm","T","105.0","PT12-21B/TR8"
"PT6","PT12-21B/TR8","50.7mm","22.7mm","50.7mm","22.7mm","50.7mm","22.7mm","T","75.0","PT12-21B/TR8"
"PT7","PT12-21B/TR8","79.7mm","42.3mm","79.7mm","42.3mm","79.7mm","42.3mm","T","105.0","PT12-21B/TR8"
"PT8","PT12-21B/TR8","79.7mm","37.7mm","79.7mm","37.7mm","79.7mm","37.7mm","T","75.0","PT12-21B/TR8"
"PT9","PT12-21B/TR8","108.7mm","57.3mm","108.7mm","57.3mm","108.7mm","57.3mm","T","105.0","PT12-21B/TR8"
"PT10","PT12-21B/TR8","108.7mm","52.7mm","108.7mm","52.7mm","108.7mm","52.7mm","T","75.0","PT12-21B/TR8"
"PT11","PT12-21B/TR8","108.7mm","27.3mm","108.7mm","27.3mm","108.7mm","27.3mm","T","105.0","PT12-21B/TR8"
"PT12","PT12-21B/TR8","108.7mm","22.7mm","108.7mm","22.7mm","108.7mm","22.7mm","T","75.0","PT12-21B/TR8"
"PT13","PT12-21B/TR8","137.7mm","42.3mm","137.7mm","42.3mm","137.7mm","42.3mm","T","105.0","PT12-21B/TR8"
"PT14","PT12-21B/TR8","137.7mm","37.7mm","137.7mm","37.7mm","137.7mm","37.7mm","T","75.0","PT12-21B/TR8"
"PT15","PT12-21B/TR8","82.1mm","20.0mm","82.1mm","20.0mm","82.1mm","20.0mm","T","105.0","PT12-21B/TR8"
"PT16","PT12-21B/TR8","82.1mm","14.0mm","82.1mm","14.0mm","82.1mm","14.0mm","T","75.0","PT12-21B/TR8"
"PWR_1","MICRO-USB","150.0mm","57.2mm","150.0mm","57.2mm","150.0mm","57.2mm","T","90.0","MICRO-USB"
"Q1","SOT-23","109.0mm","96.0mm","109.0mm","96.0mm","109.0mm","96.0mm","T","180.0",""
"Q2","SOT-23","109.0mm","88.2mm","109.0mm","88.2mm","109.0mm","88.2mm","T","180.0",""
"Q3","SOT-23","108.9mm","80.1mm","108.9mm","80.1mm","108.9mm","80.1mm","T","180.0",""
"Q4","SOT-23","109.0mm","70.7mm","109.0mm","70.7mm","109.0mm","70.7mm","T","180.0",""
"Q5","SOT-23","99.7mm","96.2mm","99.7mm","96.2mm","99.7mm","96.2mm","T","180.0",""
"Q6","SOT-23","99.7mm","88.3mm","99.7mm","88.3mm","99.7mm","88.3mm","T","180.0",""
"Q7","SOT-23","99.8mm","80.6mm","99.8mm","80.6mm","99.8mm","80.6mm","T","180.0",""
"Q8","SOT-23","99.7mm","71.3mm","99.7mm","71.3mm","99.7mm","71.3mm","T","180.0",""
"Q9","SOT-23","90.6mm","96.1mm","90.6mm","96.1mm","90.6mm","96.1mm","T","180.0",""
"Q10","SOT-23","90.4mm","88.1mm","90.4mm","88.1mm","90.4mm","88.1mm","T","180.0",""
"Q11","SOT-23","90.4mm","80.2mm","90.4mm","80.2mm","90.4mm","80.2mm","T","180.0",""
"Q12","SOT-23","90.3mm","71.0mm","90.3mm","71.0mm","90.3mm","71.0mm","T","180.0",""
"Q13","SOT-23","81.4mm","96.1mm","81.4mm","96.1mm","81.4mm","96.1mm","T","180.0",""
"Q14","SOT-23","81.5mm","88.7mm","81.5mm","88.7mm","81.5mm","88.7mm","T","180.0",""
"Q15","SOT-23","81.4mm","80.9mm","81.4mm","80.9mm","81.4mm","80.9mm","T","180.0",""
"Q16","SOT-23","81.5mm","71.7mm","81.5mm","71.7mm","81.5mm","71.7mm","T","180.0",""
"Q17","SOT-23","72.5mm","96.2mm","72.5mm","96.2mm","72.5mm","96.2mm","T","180.0",""
"Q18","SOT-23","72.5mm","88.7mm","72.5mm","88.7mm","72.5mm","88.7mm","T","180.0",""
"Q19","SOT-23","72.3mm","81.0mm","72.3mm","81.0mm","72.3mm","81.0mm","T","180.0",""
"R1","R0603","73.3mm","67.2mm","73.3mm","67.2mm","73.3mm","67.2mm","B","90.0","150R"
"R2","R0603","73.3mm","67.2mm","73.3mm","67.2mm","73.3mm","67.2mm","T","270.0","150R"
"R3","R0603","73.3mm","64.5mm","73.3mm","64.5mm","73.3mm","64.5mm","B","90.0","150R"
"R4","R0603","73.3mm","64.5mm","73.3mm","64.5mm","73.3mm","64.5mm","T","270.0","150R"
"R5","R0603","73.3mm","60.1mm","73.3mm","60.1mm","73.3mm","60.1mm","B","90.0","150R"
"R6","R0603","73.3mm","60.1mm","73.3mm","60.1mm","73.3mm","60.1mm","T","270.0","150R"
"R7","R0603","73.3mm","54.8mm","73.3mm","54.8mm","73.3mm","54.8mm","B","90.0","150R"
"R8","R0603","73.3mm","54.8mm","73.3mm","54.8mm","73.3mm","54.8mm","T","270.0","150R"
"R9","R0603","64.6mm","53.7mm","64.6mm","53.7mm","64.6mm","53.7mm","B","270.0","150R"
"R10","R0603","64.6mm","53.7mm","64.6mm","53.7mm","64.6mm","53.7mm","T","90.0","150R"
"R11","R0603","64.6mm","59.1mm","64.6mm","59.1mm","64.6mm","59.1mm","B","270.0","150R"
"R12","R0603","64.6mm","59.1mm","64.6mm","59.1mm","64.6mm","59.1mm","T","90.0","150R"
"R13","R0603","64.6mm","64.3mm","64.6mm","64.3mm","64.6mm","64.3mm","B","270.0","150R"
"R14","R0603","64.6mm","64.3mm","64.6mm","64.3mm","64.6mm","64.3mm","T","90.0","150R"
"R15","R0603","64.7mm","68.3mm","64.7mm","68.3mm","64.7mm","68.3mm","B","270.0","150R"
"R16","R0603","28.0mm","72.8mm","28.0mm","72.8mm","28.0mm","72.8mm","T","90.0","51R"
"R17","R0603","28.0mm","72.8mm","28.0mm","72.8mm","28.0mm","72.8mm","B","270.0","51R"
"R18","R0603","33.3mm","72.8mm","33.3mm","72.8mm","33.3mm","72.8mm","T","90.0","51R"
"R19","R0603","33.3mm","72.8mm","33.3mm","72.8mm","33.3mm","72.8mm","B","270.0","51R"
"R20","R0603","41.1mm","72.8mm","41.1mm","72.8mm","41.1mm","72.8mm","T","90.0","51R"
"R21","R0603","41.1mm","72.8mm","41.1mm","72.8mm","41.1mm","72.8mm","B","270.0","51R"
"R22","R0603","49.0mm","72.5mm","49.0mm","72.5mm","49.0mm","72.5mm","T","90.0","51R"
"R23","R0603","49.0mm","72.5mm","49.0mm","72.5mm","49.0mm","72.5mm","B","270.0","51R"
"R24","R0603","33.1mm","79.9mm","33.1mm","79.9mm","33.1mm","79.9mm","T","90.0","51R"
"R25","R0603","33.1mm","79.9mm","33.1mm","79.9mm","33.1mm","79.9mm","B","270.0","51R"
"R26","R0603","40.9mm","79.9mm","40.9mm","79.9mm","40.9mm","79.9mm","T","90.0","51R"
"R27","R0603","40.9mm","79.9mm","40.9mm","79.9mm","40.9mm","79.9mm","B","270.0","51R"
"R28","R0603","48.6mm","79.6mm","48.6mm","79.6mm","48.6mm","79.6mm","T","90.0","51R"
"R29","R0603","48.6mm","79.6mm","48.6mm","79.6mm","48.6mm","79.6mm","B","270.0","51R"
"R30","R0603","6.5mm","86.2mm","6.5mm","86.2mm","6.5mm","86.2mm","T","0.0","56.2R"
"R31","R0603","6.5mm","86.2mm","6.5mm","86.2mm","6.5mm","86.2mm","B","0.0","56.2R"
"R32","R0603","6.5mm","77.2mm","6.5mm","77.2mm","6.5mm","77.2mm","T","0.0","56.2R"
"R33","R0603","6.5mm","77.2mm","6.5mm","77.2mm","6.5mm","77.2mm","B","0.0","56.2R"
"R34","R0603","6.5mm","69.6mm","6.5mm","69.6mm","6.5mm","69.6mm","T","0.0","56.2R"
"R35","R0603","6.5mm","69.6mm","6.5mm","69.6mm","6.5mm","69.6mm","B","0.0","56.2R"
"R36","R0603","6.5mm","61.9mm","6.5mm","61.9mm","6.5mm","61.9mm","T","0.0","56.2R"
"R37","R0603","6.5mm","61.9mm","6.5mm","61.9mm","6.5mm","61.9mm","B","0.0","56.2R"
"R38","R0603","11.6mm","86.3mm","11.6mm","86.3mm","11.6mm","86.3mm","T","0.0","56.2R"
"R39","R0603","11.6mm","86.3mm","11.6mm","86.3mm","11.6mm","86.3mm","B","0.0","56.2R"
"R40","R0603","11.6mm","77.2mm","11.6mm","77.2mm","11.6mm","77.2mm","T","0.0","56.2R"
"R41","R0603","11.6mm","77.2mm","11.6mm","77.2mm","11.6mm","77.2mm","B","0.0","56.2R"
"R42","R0603","11.5mm","69.6mm","11.5mm","69.6mm","11.5mm","69.6mm","T","0.0","56.2R"
"R43","R0603","11.5mm","69.6mm","11.5mm","69.6mm","11.5mm","69.6mm","B","0.0","56.2R"
"R44","R0603","11.6mm","61.9mm","11.6mm","61.9mm","11.6mm","61.9mm","T","0.0","56.2R"
"R45","R0603","11.6mm","61.9mm","11.6mm","61.9mm","11.6mm","61.9mm","B","0.0","56.2R"
"R46","R0402","19.1mm","5.5mm","19.1mm","5.5mm","19.1mm","5.5mm","T","180.0","470R"
"R47","R0402","25.0mm","5.5mm","25.0mm","5.5mm","25.0mm","5.5mm","T","0.0","470R"
"R48","R0402","30.9mm","5.5mm","30.9mm","5.5mm","30.9mm","5.5mm","T","0.0","470R"
"R49","R0402","37.0mm","5.5mm","37.0mm","5.5mm","37.0mm","5.5mm","T","0.0","470R"
"R50","R0402","43.4mm","5.5mm","43.4mm","5.5mm","43.4mm","5.5mm","T","0.0","470R"
"R51","R0402","20.7mm","10.7mm","20.7mm","10.7mm","20.7mm","10.7mm","T","0.0","470R"
"R52","R0402","26.9mm","10.7mm","26.9mm","10.7mm","26.9mm","10.7mm","T","0.0","470R"
"R53","R0402","33.0mm","10.7mm","33.0mm","10.7mm","33.0mm","10.7mm","T","0.0","470R"
"R54","R0805","112.5mm","96.2mm","112.5mm","96.2mm","112.5mm","96.2mm","T","180.0","22R"
"R55","R0805","112.5mm","88.3mm","112.5mm","88.3mm","112.5mm","88.3mm","T","180.0","22R"
"R56","R0805","112.4mm","80.3mm","112.4mm","80.3mm","112.4mm","80.3mm","T","180.0","22R"
"R57","R0805","112.5mm","70.9mm","112.5mm","70.9mm","112.5mm","70.9mm","T","180.0","22R"
"R58","R0805","103.1mm","96.5mm","103.1mm","96.5mm","103.1mm","96.5mm","T","180.0","22R"
"R59","R0805","103.3mm","88.4mm","103.3mm","88.4mm","103.3mm","88.4mm","T","180.0","22R"
"R60","R0805","103.4mm","80.7mm","103.4mm","80.7mm","103.4mm","80.7mm","T","180.0","22R"
"R61","R0805","103.5mm","71.5mm","103.5mm","71.5mm","103.5mm","71.5mm","T","180.0","22R"
"R62","R0805","94.1mm","96.3mm","94.1mm","96.3mm","94.1mm","96.3mm","T","180.0","22R"
"R63","R0805","93.9mm","88.1mm","93.9mm","88.1mm","93.9mm","88.1mm","T","180.0","22R"
"R64","R0805","94.1mm","80.4mm","94.1mm","80.4mm","94.1mm","80.4mm","T","180.0","22R"
"R65","R0805","94.2mm","71.2mm","94.2mm","71.2mm","94.2mm","71.2mm","T","180.0","22R"
"R66","R0805","85.2mm","96.2mm","85.2mm","96.2mm","85.2mm","96.2mm","T","180.0","22R"
"R67","R0805","85.0mm","88.8mm","85.0mm","88.8mm","85.0mm","88.8mm","T","180.0","22R"
"R68","R0805","85.1mm","80.9mm","85.1mm","80.9mm","85.1mm","80.9mm","T","180.0","22R"
"R69","R0805","85.2mm","71.3mm","85.2mm","71.3mm","85.2mm","71.3mm","T","180.0","22R"
"R70","R0805","76.1mm","96.1mm","76.1mm","96.1mm","76.1mm","96.1mm","T","180.0","22R"
"R71","R0805","76.2mm","88.8mm","76.2mm","88.8mm","76.2mm","88.8mm","T","180.0","22R"
"R72","R0805","76.1mm","81.2mm","76.1mm","81.2mm","76.1mm","81.2mm","T","180.0","22R"
"R73","R0805","54.6mm","94.3mm","54.6mm","94.3mm","54.6mm","94.3mm","T","270.0","4.7K"
"R74","R0805","44.9mm","94.3mm","44.9mm","94.3mm","44.9mm","94.3mm","T","90.0","2.2K"
"R75","R0805","142.4mm","87.6mm","142.4mm","87.6mm","142.4mm","87.6mm","B","270.0","1.5K"
"R76","R0805","142.4mm","82.1mm","142.4mm","82.1mm","142.4mm","82.1mm","B","270.0","1.5K"
