{
	"info": {
		"_postman_id": "64c24670-8e5d-4420-ae3f-aa488cd6040a",
		"name": "project_pet_world",
		"schema": "https://schema.getpostman.com/json/collection/v2.1.0/collection.json",
		"_exporter_id": "29395282"
	},
	"item": [
		{
			"name": "login_with_correct_params",
			"event": [
				{
					"listen": "test",
					"script": {
						"exec": [
							"pm.test(\"Status code is 200\", function () {\r",
							"    pm.response.to.have.status(200);\r",
							"});\r",
							"\r",
							"var params=pm.request.url.query.all()\r",
							"console.log(params);\r",
							"pm.test(\"Query parameter username is processed correctly\", function () {\r",
							"    pm.expect(pm.request.url.query.has('username')).to.be.true;\r",
							"});\r",
							"pm.test(\"Query parameter password is processed correctly\", function () {\r",
							"    pm.expect(pm.request.url.query.has('password')).to.be.true;\r",
							"});\r",
							""
						],
						"type": "text/javascript"
					}
				}
			],
			"request": {
				"method": "GET",
				"header": [],
				"url": {
					"raw": "https://petstore.swagger.io/v2/user/login?username=user1234&password=1234",
					"protocol": "https",
					"host": [
						"petstore",
						"swagger",
						"io"
					],
					"path": [
						"v2",
						"user",
						"login"
					],
					"query": [
						{
							"key": "username",
							"value": "user1234"
						},
						{
							"key": "password",
							"value": "1234"
						}
					]
				}
			},
			"response": []
		},
		{
			"name": "create_user",
			"event": [
				{
					"listen": "prerequest",
					"script": {
						"exec": [
							"var id =pm.variables.replaceIn(\"{{$randomInt}}\")\r",
							"pm.collectionVariables.set(\"collection_id\",id)\r",
							"\r",
							"var username =pm.variables.replaceIn(\"{{$randomUserName}}\")\r",
							"pm.collectionVariables.set(\"collection_username\",username)\r",
							"\r",
							"var firstName =pm.variables.replaceIn(\"{{$randomFirstName}}\")\r",
							"pm.collectionVariables.set(\"collection_firstName\",firstName)\r",
							"\r",
							"var lastName =pm.variables.replaceIn(\"{{$randomLastName}}\")\r",
							"pm.collectionVariables.set(\"collection_lastName\",lastName)\r",
							"\r",
							"var email =pm.variables.replaceIn(\"{{$randomEmail}}\")\r",
							"pm.collectionVariables.set(\"collection_email\",email)\r",
							"\r",
							"var password =pm.variables.replaceIn(\"{{$randomPassword}}\")\r",
							"pm.collectionVariables.set(\"collection_password\",password)\r",
							"\r",
							"var phone =pm.variables.replaceIn(\"{{$randomPhoneNumber}}\")\r",
							"pm.collectionVariables.set(\"collection_phone\",phone)\r",
							"\r",
							""
						],
						"type": "text/javascript"
					}
				},
				{
					"listen": "test",
					"script": {
						"exec": [
							"pm.test(\"Status code is 200\", function () {\r",
							"    pm.response.to.have.status(200);\r",
							"});\r",
							"var res_msg = pm.response.json().message;\r",
							"pm.test(\"User creation is successful\", function () {\r",
							"    pm.expect(res_msg).to.not.null;\r",
							"});"
						],
						"type": "text/javascript"
					}
				}
			],
			"request": {
				"method": "POST",
				"header": [
					{
						"key": "accept",
						"value": "application/json"
					},
					{
						"key": "Content-Type",
						"value": "application/json"
					}
				],
				"body": {
					"mode": "raw",
					"raw": "{\r\n  \"id\":\"{{collection_id}}\",\r\n  \"username\":\"{{collection_username}}\" ,\r\n  \"firstName\":\"{{collection_firstName}}\",\r\n  \"lastName\": \"{{collection_lastName}}\",\r\n  \"email\": \"{{collection_email}}\",\r\n  \"phone\": \"{{collection_phone}}\"\r\n\r\n}"
				},
				"url": {
					"raw": "https://petstore.swagger.io/v2/user",
					"protocol": "https",
					"host": [
						"petstore",
						"swagger",
						"io"
					],
					"path": [
						"v2",
						"user"
					]
				}
			},
			"response": []
		},
		{
			"name": "New Request",
			"request": {
				"method": "GET",
				"header": [],
				"url": {
					"raw": "https://petstore.swagger.io/v2/user/{{collection_firstName}}",
					"protocol": "https",
					"host": [
						"petstore",
						"swagger",
						"io"
					],
					"path": [
						"v2",
						"user",
						"{{collection_firstName}}"
					]
				}
			},
			"response": []
		}
	],
	"event": [
		{
			"listen": "prerequest",
			"script": {
				"type": "text/javascript",
				"exec": [
					""
				]
			}
		},
		{
			"listen": "test",
			"script": {
				"type": "text/javascript",
				"exec": [
					""
				]
			}
		}
	],
	"variable": [
		{
			"key": "collection_id",
			"value": "",
			"type": "string"
		},
		{
			"key": "collection_username",
			"value": "",
			"type": "string"
		},
		{
			"key": "collection_firstName",
			"value": "",
			"type": "string"
		},
		{
			"key": "collection_lastName",
			"value": "",
			"type": "string"
		},
		{
			"key": "collection_email",
			"value": "",
			"type": "string"
		},
		{
			"key": "collection_phone",
			"value": "",
			"type": "string"
		},
		{
			"key": "collection_firsttName",
			"value": ""
		},
		{
			"key": "collection_password",
			"value": ""
		}
	]
}