{
	"info": {
		"_postman_id": "67a77507-022a-4ee7-984d-939f2882e21b",
		"name": "project_gorest",
		"schema": "https://schema.getpostman.com/json/collection/v2.1.0/collection.json",
		"_exporter_id": "29395282"
	},
	"item": [
		{
			"name": "users_data_validation",
			"event": [
				{
					"listen": "test",
					"script": {
						"exec": [
							"var start=pm.collectionVariables.get(\"count_start\");\r",
							"console.log(\"start point:\"+start);\r",
							"var end=pm.collectionVariables.get(\"count_end\");\r",
							"console.log(\"end point:\"+end);\r",
							"var exp_code=pm.response.code;\r",
							"console.log(exp_code);\r",
							"for(i=start;i<end;i++)\r",
							"{\r",
							"    if (exp_code != 200)\r",
							"    {\r",
							"        if (start<eval(end-1))\r",
							"        {\r",
							"        pm.collectionVariables.set(\"count_start\",eval(start+1));\r",
							"        postman.setNextRequest(\"users_data_validation\");\r",
							"        }\r",
							"        else\r",
							"        {\r",
							"        postman.setNextRequest(null);\r",
							"        pm.collectionVariables.set(\"count_start\",0);\r",
							"        //validate status code\r",
							"        pm.test(\"validate status code:200\", function(){\r",
							"            pm.response.to.have.status(200);\r",
							"        });\r",
							"        }\r",
							"    }\r",
							"  else\r",
							"  {  \r",
							"      \r",
							"//status code \r",
							"pm.test(\"validate status code 200 ok\" , function(){\r",
							"    pm.response.to.have.status(200);\r",
							"});\r",
							"\r",
							"\r",
							"// //fectching response body\r",
							"var responseBody= pm.response.json();\r",
							"var dataArray= responseBody;\r",
							"var count=Object.keys(dataArray).length;\r",
							"console.log(count);\r",
							"//fetching response body parameters\r",
							"for(i=0; i<count; i++)\r",
							"{\r",
							"   \r",
							"\r",
							"    var res_id=dataArray[i].id;\r",
							"    var res_name=dataArray[i].name;\r",
							"    var res_email=dataArray[i].email;\r",
							"    var res_gender=dataArray[i].gender;\r",
							"     var res_status=dataArray[i].status;\r",
							"\r",
							"    //validatation \r",
							"\r",
							"    pm.test(\"validate id\" +i,function(){\r",
							"        pm.expect(res_id).to.not.null;\r",
							"    });\r",
							"    pm.test(\"validate name\" +i, function(){\r",
							"        pm.expect(res_name).to.not.null;\r",
							"    });\r",
							"     pm.test(\"validate email\" +i, function(){\r",
							"        pm.expect(res_email).to.not.null;\r",
							"    });\r",
							"    pm.test(\"validate gender\"+i, function(){\r",
							"        pm.expect(res_gender).to.not.null;\r",
							"    });\r",
							"    pm.test(\"validate status\"+i, function(){\r",
							"        pm.expect(res_status).to.not.null;\r",
							"    });\r",
							"\r",
							"    \r",
							"}\r",
							"}\r",
							"console.log(\"request successfull!\") ;\r",
							"  break;\r",
							"  }\r",
							""
						],
						"type": "text/javascript"
					}
				}
			],
			"request": {
				"method": "GET",
				"header": [],
				"url": {
					"raw": "https://gorest.co.in/public/v2/users",
					"protocol": "https",
					"host": [
						"gorest",
						"co",
						"in"
					],
					"path": [
						"public",
						"v2",
						"users"
					]
				}
			},
			"response": []
		}
	],
	"event": [
		{
			"listen": "prerequest",
			"script": {
				"type": "text/javascript",
				"exec": [
					""
				]
			}
		},
		{
			"listen": "test",
			"script": {
				"type": "text/javascript",
				"exec": [
					""
				]
			}
		}
	],
	"variable": [
		{
			"key": "count_start",
			"value": "0",
			"type": "string"
		},
		{
			"key": "count_end",
			"value": "5",
			"type": "string"
		}
	]
}