{
  "https://opensource-demo.orangehrmlive.com/web/index.php/auth/logout" : {
    "transaction" : "https://opensource-demo.orangehrmlive.com/web/index.php/auth/logout",
    "sampleCount" : 1,
    "errorCount" : 0,
    "errorPct" : 0.0,
    "meanResTime" : 1117.0,
    "medianResTime" : 1117.0,
    "minResTime" : 1117.0,
    "maxResTime" : 1117.0,
    "pct1ResTime" : 1117.0,
    "pct2ResTime" : 1117.0,
    "pct3ResTime" : 1117.0,
    "throughput" : 0.8952551477170994,
    "receivedKBytesPerSec" : 9.57153648164727,
    "sentKBytesPerSec" : 3.9744432632050133
  },
  "https://opensource-demo.orangehrmlive.com/web/index.php/api/v2/dashboard/employees/time-at-work?timezoneOffset=5.5&currentDate=2023-01-20&currentTime=18:09" : {
    "transaction" : "https://opensource-demo.orangehrmlive.com/web/index.php/api/v2/dashboard/employees/time-at-work?timezoneOffset=5.5&currentDate=2023-01-20&currentTime=18:09",
    "sampleCount" : 1,
    "errorCount" : 1,
    "errorPct" : 100.0,
    "meanResTime" : 319.0,
    "medianResTime" : 319.0,
    "minResTime" : 319.0,
    "maxResTime" : 319.0,
    "pct1ResTime" : 319.0,
    "pct2ResTime" : 319.0,
    "pct3ResTime" : 319.0,
    "throughput" : 3.134796238244514,
    "receivedKBytesPerSec" : 1.004114420062696,
    "sentKBytesPerSec" : 1.8306720219435737
  },
  "https://opensource-demo.orangehrmlive.com/web/index.php/auth/validate-0" : {
    "transaction" : "https://opensource-demo.orangehrmlive.com/web/index.php/auth/validate-0",
    "sampleCount" : 1,
    "errorCount" : 0,
    "errorPct" : 0.0,
    "meanResTime" : 1513.0,
    "medianResTime" : 1513.0,
    "minResTime" : 1513.0,
    "maxResTime" : 1513.0,
    "pct1ResTime" : 1513.0,
    "pct2ResTime" : 1513.0,
    "pct3ResTime" : 1513.0,
    "throughput" : 0.6609385327164573,
    "receivedKBytesPerSec" : 1.1366335508922671,
    "sentKBytesPerSec" : 0.49118576503635164
  },
  "https://opensource-demo.orangehrmlive.com/web/index.php/auth/validate-1" : {
    "transaction" : "https://opensource-demo.orangehrmlive.com/web/index.php/auth/validate-1",
    "sampleCount" : 1,
    "errorCount" : 0,
    "errorPct" : 0.0,
    "meanResTime" : 351.0,
    "medianResTime" : 351.0,
    "minResTime" : 351.0,
    "maxResTime" : 351.0,
    "pct1ResTime" : 351.0,
    "pct2ResTime" : 351.0,
    "pct3ResTime" : 351.0,
    "throughput" : 2.849002849002849,
    "receivedKBytesPerSec" : 12.422654024216525,
    "sentKBytesPerSec" : 1.74167556980057
  },
  "https://opensource-demo.orangehrmlive.com/web/index.php/auth/validate-2" : {
    "transaction" : "https://opensource-demo.orangehrmlive.com/web/index.php/auth/validate-2",
    "sampleCount" : 1,
    "errorCount" : 0,
    "errorPct" : 0.0,
    "meanResTime" : 814.0,
    "medianResTime" : 814.0,
    "minResTime" : 814.0,
    "maxResTime" : 814.0,
    "pct1ResTime" : 814.0,
    "pct2ResTime" : 814.0,
    "pct3ResTime" : 814.0,
    "throughput" : 1.2285012285012284,
    "receivedKBytesPerSec" : 2.008311578624079,
    "sentKBytesPerSec" : 0.763014434889435
  },
  "https://opensource-demo.orangehrmlive.com/web/index.php/api/v2/dashboard/employees/subunit" : {
    "transaction" : "https://opensource-demo.orangehrmlive.com/web/index.php/api/v2/dashboard/employees/subunit",
    "sampleCount" : 1,
    "errorCount" : 1,
    "errorPct" : 100.0,
    "meanResTime" : 318.0,
    "medianResTime" : 318.0,
    "minResTime" : 318.0,
    "maxResTime" : 318.0,
    "pct1ResTime" : 318.0,
    "pct2ResTime" : 318.0,
    "pct3ResTime" : 318.0,
    "throughput" : 3.1446540880503147,
    "receivedKBytesPerSec" : 1.0072720125786163,
    "sentKBytesPerSec" : 1.6306751179245282
  },
  "https://opensource-demo.orangehrmlive.com/web/index.php/auth/validate" : {
    "transaction" : "https://opensource-demo.orangehrmlive.com/web/index.php/auth/validate",
    "sampleCount" : 1,
    "errorCount" : 0,
    "errorPct" : 0.0,
    "meanResTime" : 6176.0,
    "medianResTime" : 6176.0,
    "minResTime" : 6176.0,
    "maxResTime" : 6176.0,
    "pct1ResTime" : 6176.0,
    "pct2ResTime" : 6176.0,
    "pct3ResTime" : 6176.0,
    "throughput" : 0.16191709844559585,
    "receivedKBytesPerSec" : 681.9990879513439,
    "sentKBytesPerSec" : 0.7246738888439119
  },
  "https://opensource-demo.orangehrmlive.com/web/index.php/auth/validate-3" : {
    "transaction" : "https://opensource-demo.orangehrmlive.com/web/index.php/auth/validate-3",
    "sampleCount" : 1,
    "errorCount" : 0,
    "errorPct" : 0.0,
    "meanResTime" : 2442.0,
    "medianResTime" : 2442.0,
    "minResTime" : 2442.0,
    "maxResTime" : 2442.0,
    "pct1ResTime" : 2442.0,
    "pct2ResTime" : 2442.0,
    "pct3ResTime" : 2442.0,
    "throughput" : 0.4095004095004095,
    "receivedKBytesPerSec" : 225.07446189086812,
    "sentKBytesPerSec" : 0.25833717239967235
  },
  "https://opensource-demo.orangehrmlive.com/web/index.php/auth/validate-4" : {
    "transaction" : "https://opensource-demo.orangehrmlive.com/web/index.php/auth/validate-4",
    "sampleCount" : 1,
    "errorCount" : 0,
    "errorPct" : 0.0,
    "meanResTime" : 1499.0,
    "medianResTime" : 1499.0,
    "minResTime" : 1499.0,
    "maxResTime" : 1499.0,
    "pct1ResTime" : 1499.0,
    "pct2ResTime" : 1499.0,
    "pct3ResTime" : 1499.0,
    "throughput" : 0.66711140760507,
    "receivedKBytesPerSec" : 434.24066565210137,
    "sentKBytesPerSec" : 0.41433872581721143
  },
  "https://opensource-demo.orangehrmlive.com/web/index.php/auth/validate-5" : {
    "transaction" : "https://opensource-demo.orangehrmlive.com/web/index.php/auth/validate-5",
    "sampleCount" : 1,
    "errorCount" : 0,
    "errorPct" : 0.0,
    "meanResTime" : 3960.0,
    "medianResTime" : 3960.0,
    "minResTime" : 3960.0,
    "maxResTime" : 3960.0,
    "pct1ResTime" : 3960.0,
    "pct2ResTime" : 3960.0,
    "pct3ResTime" : 3960.0,
    "throughput" : 0.25252525252525254,
    "receivedKBytesPerSec" : 387.1712732796717,
    "sentKBytesPerSec" : 0.15881470959595959
  },
  "https://opensource-demo.orangehrmlive.com/web/index.php/auth/validate-6" : {
    "transaction" : "https://opensource-demo.orangehrmlive.com/web/index.php/auth/validate-6",
    "sampleCount" : 1,
    "errorCount" : 0,
    "errorPct" : 0.0,
    "meanResTime" : 4266.0,
    "medianResTime" : 4266.0,
    "minResTime" : 4266.0,
    "maxResTime" : 4266.0,
    "pct1ResTime" : 4266.0,
    "pct2ResTime" : 4266.0,
    "pct3ResTime" : 4266.0,
    "throughput" : 0.23441162681669012,
    "receivedKBytesPerSec" : 344.71511661978434,
    "sentKBytesPerSec" : 0.14513376113455229
  },
  "https://opensource-demo.orangehrmlive.com/web/index.php/api/v2/buzz/feed?limit=5&offset=0&sortOrder=DESC&sortField=share.createdAtUtc" : {
    "transaction" : "https://opensource-demo.orangehrmlive.com/web/index.php/api/v2/buzz/feed?limit=5&offset=0&sortOrder=DESC&sortField=share.createdAtUtc",
    "sampleCount" : 1,
    "errorCount" : 1,
    "errorPct" : 100.0,
    "meanResTime" : 331.0,
    "medianResTime" : 331.0,
    "minResTime" : 331.0,
    "maxResTime" : 331.0,
    "pct1ResTime" : 331.0,
    "pct2ResTime" : 331.0,
    "pct3ResTime" : 331.0,
    "throughput" : 3.0211480362537766,
    "receivedKBytesPerSec" : 0.9677114803625377,
    "sentKBytesPerSec" : 1.510574018126888
  },
  "https://opensource-demo.orangehrmlive.com/web/index.php/core/i18n/messages" : {
    "transaction" : "https://opensource-demo.orangehrmlive.com/web/index.php/core/i18n/messages",
    "sampleCount" : 2,
    "errorCount" : 2,
    "errorPct" : 100.0,
    "meanResTime" : 318.0,
    "medianResTime" : 318.0,
    "minResTime" : 313.0,
    "maxResTime" : 323.0,
    "pct1ResTime" : 323.0,
    "pct2ResTime" : 323.0,
    "pct3ResTime" : 323.0,
    "throughput" : 0.09455817691834902,
    "receivedKBytesPerSec" : 0.09714375206846013,
    "sentKBytesPerSec" : 0.04894124391281736
  },
  "Test" : {
    "transaction" : "Test",
    "sampleCount" : 1,
    "errorCount" : 1,
    "errorPct" : 100.0,
    "meanResTime" : 11192.0,
    "medianResTime" : 11192.0,
    "minResTime" : 11192.0,
    "maxResTime" : 11192.0,
    "pct1ResTime" : 11192.0,
    "pct2ResTime" : 11192.0,
    "pct3ResTime" : 11192.0,
    "throughput" : 0.08934953538241601,
    "receivedKBytesPerSec" : 378.63802688304145,
    "sentKBytesPerSec" : 1.5319431569424589
  },
  "https://opensource-demo.orangehrmlive.com/web/index.php/api/v2/dashboard/employees/locations" : {
    "transaction" : "https://opensource-demo.orangehrmlive.com/web/index.php/api/v2/dashboard/employees/locations",
    "sampleCount" : 1,
    "errorCount" : 1,
    "errorPct" : 100.0,
    "meanResTime" : 318.0,
    "medianResTime" : 318.0,
    "minResTime" : 318.0,
    "maxResTime" : 318.0,
    "pct1ResTime" : 318.0,
    "pct2ResTime" : 318.0,
    "pct3ResTime" : 318.0,
    "throughput" : 3.1446540880503147,
    "receivedKBytesPerSec" : 1.0072720125786163,
    "sentKBytesPerSec" : 1.6368170204402515
  },
  "https://opensource-demo.orangehrmlive.com/web/index.php/events/push" : {
    "transaction" : "https://opensource-demo.orangehrmlive.com/web/index.php/events/push",
    "sampleCount" : 1,
    "errorCount" : 0,
    "errorPct" : 0.0,
    "meanResTime" : 899.0,
    "medianResTime" : 899.0,
    "minResTime" : 899.0,
    "maxResTime" : 899.0,
    "pct1ResTime" : 899.0,
    "pct2ResTime" : 899.0,
    "pct3ResTime" : 899.0,
    "throughput" : 1.1123470522803114,
    "receivedKBytesPerSec" : 11.904503267519466,
    "sentKBytesPerSec" : 3.8964735122358176
  },
  "https://opensource-demo.orangehrmlive.com/web/index.php/events/push-5" : {
    "transaction" : "https://opensource-demo.orangehrmlive.com/web/index.php/events/push-5",
    "sampleCount" : 1,
    "errorCount" : 0,
    "errorPct" : 0.0,
    "meanResTime" : 234.0,
    "medianResTime" : 234.0,
    "minResTime" : 234.0,
    "maxResTime" : 234.0,
    "pct1ResTime" : 234.0,
    "pct2ResTime" : 234.0,
    "pct3ResTime" : 234.0,
    "throughput" : 4.273504273504274,
    "receivedKBytesPerSec" : 4.148303952991453,
    "sentKBytesPerSec" : 2.232739049145299
  },
  "https://opensource-demo.orangehrmlive.com/web/index.php/events/push-4" : {
    "transaction" : "https://opensource-demo.orangehrmlive.com/web/index.php/events/push-4",
    "sampleCount" : 1,
    "errorCount" : 0,
    "errorPct" : 0.0,
    "meanResTime" : 234.0,
    "medianResTime" : 234.0,
    "minResTime" : 234.0,
    "maxResTime" : 234.0,
    "pct1ResTime" : 234.0,
    "pct2ResTime" : 234.0,
    "pct3ResTime" : 234.0,
    "throughput" : 4.273504273504274,
    "receivedKBytesPerSec" : 4.144130608974359,
    "sentKBytesPerSec" : 2.1951789529914527
  },
  "https://opensource-demo.orangehrmlive.com/web/index.php/api/v2/dashboard/employees/action-summary" : {
    "transaction" : "https://opensource-demo.orangehrmlive.com/web/index.php/api/v2/dashboard/employees/action-summary",
    "sampleCount" : 1,
    "errorCount" : 1,
    "errorPct" : 100.0,
    "meanResTime" : 317.0,
    "medianResTime" : 317.0,
    "minResTime" : 317.0,
    "maxResTime" : 317.0,
    "pct1ResTime" : 317.0,
    "pct2ResTime" : 317.0,
    "pct3ResTime" : 317.0,
    "throughput" : 3.1545741324921135,
    "receivedKBytesPerSec" : 1.01044952681388,
    "sentKBytesPerSec" : 1.6573836750788644
  },
  "https://opensource-demo.orangehrmlive.com/web/index.php/events/push-6" : {
    "transaction" : "https://opensource-demo.orangehrmlive.com/web/index.php/events/push-6",
    "sampleCount" : 1,
    "errorCount" : 0,
    "errorPct" : 0.0,
    "meanResTime" : 234.0,
    "medianResTime" : 234.0,
    "minResTime" : 234.0,
    "maxResTime" : 234.0,
    "pct1ResTime" : 234.0,
    "pct2ResTime" : 234.0,
    "pct3ResTime" : 234.0,
    "throughput" : 4.273504273504274,
    "receivedKBytesPerSec" : 4.148303952991453,
    "sentKBytesPerSec" : 2.191005608974359
  },
  "https://opensource-demo.orangehrmlive.com/web/index.php/api/v2/dashboard/shortcuts" : {
    "transaction" : "https://opensource-demo.orangehrmlive.com/web/index.php/api/v2/dashboard/shortcuts",
    "sampleCount" : 1,
    "errorCount" : 1,
    "errorPct" : 100.0,
    "meanResTime" : 330.0,
    "medianResTime" : 330.0,
    "minResTime" : 330.0,
    "maxResTime" : 330.0,
    "pct1ResTime" : 330.0,
    "pct2ResTime" : 330.0,
    "pct3ResTime" : 330.0,
    "throughput" : 3.0303030303030303,
    "receivedKBytesPerSec" : 0.9706439393939393,
    "sentKBytesPerSec" : 1.5477035984848484
  },
  "https://opensource-demo.orangehrmlive.com/web/index.php/events/push-1" : {
    "transaction" : "https://opensource-demo.orangehrmlive.com/web/index.php/events/push-1",
    "sampleCount" : 1,
    "errorCount" : 0,
    "errorPct" : 0.0,
    "meanResTime" : 343.0,
    "medianResTime" : 343.0,
    "minResTime" : 343.0,
    "maxResTime" : 343.0,
    "pct1ResTime" : 343.0,
    "pct2ResTime" : 343.0,
    "pct3ResTime" : 343.0,
    "throughput" : 2.9154518950437316,
    "receivedKBytesPerSec" : 12.342269497084548,
    "sentKBytesPerSec" : 1.2185677842565596
  },
  "https://opensource-demo.orangehrmlive.com/web/index.php/events/push-0" : {
    "transaction" : "https://opensource-demo.orangehrmlive.com/web/index.php/events/push-0",
    "sampleCount" : 1,
    "errorCount" : 0,
    "errorPct" : 0.0,
    "meanResTime" : 316.0,
    "medianResTime" : 316.0,
    "minResTime" : 316.0,
    "maxResTime" : 316.0,
    "pct1ResTime" : 316.0,
    "pct2ResTime" : 316.0,
    "pct3ResTime" : 316.0,
    "throughput" : 3.1645569620253164,
    "receivedKBytesPerSec" : 5.126953125,
    "sentKBytesPerSec" : 1.585368868670886
  },
  "https://opensource-demo.orangehrmlive.com/web/index.php/events/push-3" : {
    "transaction" : "https://opensource-demo.orangehrmlive.com/web/index.php/events/push-3",
    "sampleCount" : 1,
    "errorCount" : 0,
    "errorPct" : 0.0,
    "meanResTime" : 234.0,
    "medianResTime" : 234.0,
    "minResTime" : 234.0,
    "maxResTime" : 234.0,
    "pct1ResTime" : 234.0,
    "pct2ResTime" : 234.0,
    "pct3ResTime" : 234.0,
    "throughput" : 4.273504273504274,
    "receivedKBytesPerSec" : 4.144130608974359,
    "sentKBytesPerSec" : 2.236912393162393
  },
  "https://opensource-demo.orangehrmlive.com/web/index.php/events/push-2" : {
    "transaction" : "https://opensource-demo.orangehrmlive.com/web/index.php/events/push-2",
    "sampleCount" : 1,
    "errorCount" : 0,
    "errorPct" : 0.0,
    "meanResTime" : 234.0,
    "medianResTime" : 234.0,
    "minResTime" : 234.0,
    "maxResTime" : 234.0,
    "pct1ResTime" : 234.0,
    "pct2ResTime" : 234.0,
    "pct3ResTime" : 234.0,
    "throughput" : 4.273504273504274,
    "receivedKBytesPerSec" : 4.13578392094017,
    "sentKBytesPerSec" : 2.186832264957265
  },
  "https://opensource-demo.orangehrmlive.com/web/index.php/auth/logout-1" : {
    "transaction" : "https://opensource-demo.orangehrmlive.com/web/index.php/auth/logout-1",
    "sampleCount" : 1,
    "errorCount" : 0,
    "errorPct" : 0.0,
    "meanResTime" : 361.0,
    "medianResTime" : 361.0,
    "minResTime" : 361.0,
    "maxResTime" : 361.0,
    "pct1ResTime" : 361.0,
    "pct2ResTime" : 361.0,
    "pct3ResTime" : 361.0,
    "throughput" : 2.770083102493075,
    "receivedKBytesPerSec" : 11.697108725761773,
    "sentKBytesPerSec" : 1.5608769044321331
  },
  "https://opensource-demo.orangehrmlive.com/web/index.php/auth/logout-2" : {
    "transaction" : "https://opensource-demo.orangehrmlive.com/web/index.php/auth/logout-2",
    "sampleCount" : 1,
    "errorCount" : 0,
    "errorPct" : 0.0,
    "meanResTime" : 248.0,
    "medianResTime" : 248.0,
    "minResTime" : 248.0,
    "maxResTime" : 248.0,
    "pct1ResTime" : 248.0,
    "pct2ResTime" : 248.0,
    "pct3ResTime" : 248.0,
    "throughput" : 4.032258064516129,
    "receivedKBytesPerSec" : 3.902312247983871,
    "sentKBytesPerSec" : 2.6501071068548385
  },
  "https://opensource-demo.orangehrmlive.com/web/index.php/auth/logout-0" : {
    "transaction" : "https://opensource-demo.orangehrmlive.com/web/index.php/auth/logout-0",
    "sampleCount" : 1,
    "errorCount" : 0,
    "errorPct" : 0.0,
    "meanResTime" : 503.0,
    "medianResTime" : 503.0,
    "minResTime" : 503.0,
    "maxResTime" : 503.0,
    "pct1ResTime" : 503.0,
    "pct2ResTime" : 503.0,
    "pct3ResTime" : 503.0,
    "throughput" : 1.9880715705765406,
    "receivedKBytesPerSec" : 3.220908921471173,
    "sentKBytesPerSec" : 1.1221732107355864
  },
  "https://opensource-demo.orangehrmlive.com/web/index.php/auth/logout-5" : {
    "transaction" : "https://opensource-demo.orangehrmlive.com/web/index.php/auth/logout-5",
    "sampleCount" : 1,
    "errorCount" : 0,
    "errorPct" : 0.0,
    "meanResTime" : 248.0,
    "medianResTime" : 248.0,
    "minResTime" : 248.0,
    "maxResTime" : 248.0,
    "pct1ResTime" : 248.0,
    "pct2ResTime" : 248.0,
    "pct3ResTime" : 248.0,
    "throughput" : 4.032258064516129,
    "receivedKBytesPerSec" : 3.914125504032258,
    "sentKBytesPerSec" : 2.693422379032258
  },
  "https://opensource-demo.orangehrmlive.com/web/index.php/auth/logout-6" : {
    "transaction" : "https://opensource-demo.orangehrmlive.com/web/index.php/auth/logout-6",
    "sampleCount" : 1,
    "errorCount" : 0,
    "errorPct" : 0.0,
    "meanResTime" : 248.0,
    "medianResTime" : 248.0,
    "minResTime" : 248.0,
    "maxResTime" : 248.0,
    "pct1ResTime" : 248.0,
    "pct2ResTime" : 248.0,
    "pct3ResTime" : 248.0,
    "throughput" : 4.032258064516129,
    "receivedKBytesPerSec" : 3.914125504032258,
    "sentKBytesPerSec" : 2.654044858870968
  },
  "https://opensource-demo.orangehrmlive.com/web/index.php/auth/logout-3" : {
    "transaction" : "https://opensource-demo.orangehrmlive.com/web/index.php/auth/logout-3",
    "sampleCount" : 1,
    "errorCount" : 0,
    "errorPct" : 0.0,
    "meanResTime" : 248.0,
    "medianResTime" : 248.0,
    "minResTime" : 248.0,
    "maxResTime" : 248.0,
    "pct1ResTime" : 248.0,
    "pct2ResTime" : 248.0,
    "pct3ResTime" : 248.0,
    "throughput" : 4.032258064516129,
    "receivedKBytesPerSec" : 3.910187752016129,
    "sentKBytesPerSec" : 2.697360131048387
  },
  "Total" : {
    "transaction" : "Total",
    "sampleCount" : 33,
    "errorCount" : 9,
    "errorPct" : 27.272728,
    "meanResTime" : 908.1818181818181,
    "medianResTime" : 323.0,
    "minResTime" : 234.0,
    "maxResTime" : 6176.0,
    "pct1ResTime" : 3352.800000000002,
    "pct2ResTime" : 4838.9999999999945,
    "pct3ResTime" : 6176.0,
    "throughput" : 1.2074201456221874,
    "receivedKBytesPerSec" : 309.94609486480556,
    "sentKBytesPerSec" : 1.081682944733087
  },
  "https://opensource-demo.orangehrmlive.com/web/index.php/auth/logout-4" : {
    "transaction" : "https://opensource-demo.orangehrmlive.com/web/index.php/auth/logout-4",
    "sampleCount" : 1,
    "errorCount" : 0,
    "errorPct" : 0.0,
    "meanResTime" : 248.0,
    "medianResTime" : 248.0,
    "minResTime" : 248.0,
    "maxResTime" : 248.0,
    "pct1ResTime" : 248.0,
    "pct2ResTime" : 248.0,
    "pct3ResTime" : 248.0,
    "throughput" : 4.032258064516129,
    "receivedKBytesPerSec" : 3.910187752016129,
    "sentKBytesPerSec" : 2.657982610887097
  },
  "https://opensource-demo.orangehrmlive.com/web/index.php/api/v2/dashboard/employees/leaves?date=2023-01-20" : {
    "transaction" : "https://opensource-demo.orangehrmlive.com/web/index.php/api/v2/dashboard/employees/leaves?date=2023-01-20",
    "sampleCount" : 1,
    "errorCount" : 1,
    "errorPct" : 100.0,
    "meanResTime" : 431.0,
    "medianResTime" : 431.0,
    "minResTime" : 431.0,
    "maxResTime" : 431.0,
    "pct1ResTime" : 431.0,
    "pct2ResTime" : 431.0,
    "pct3ResTime" : 431.0,
    "throughput" : 2.320185614849188,
    "receivedKBytesPerSec" : 0.7431844547563805,
    "sentKBytesPerSec" : 1.2371302204176333
  }
}