<svg width="25" height="25" viewBox="0 0 25 25" fill="none" xmlns="http://www.w3.org/2000/svg">
<path d="M12.8188 6.08008C9.28442 6.08008 6.41882 8.94568 6.41882 12.4801C6.41882 13.6807 6.75607 14.8001 7.33132 15.7603L6.47611 18.8801L9.66257 18.0436C10.5945 18.5734 11.6703 18.8801 12.8188 18.8801C16.3532 18.8801 19.2188 16.0145 19.2188 12.4801C19.2188 8.94568 16.3532 6.08008 12.8188 6.08008ZM10.6282 9.49466C10.7322 9.49466 10.8391 9.49403 10.9313 9.49883C11.0455 9.50149 11.1697 9.50985 11.2886 9.77279C11.4299 10.0853 11.7377 10.8694 11.7772 10.9488C11.8166 11.0283 11.8446 11.1219 11.7897 11.2259C11.7374 11.3326 11.7102 11.3971 11.6334 11.4915C11.5539 11.5833 11.4669 11.6972 11.3949 11.7665C11.3154 11.846 11.2333 11.9331 11.3251 12.0915C11.4168 12.2499 11.7354 12.7692 12.2063 13.1884C12.8117 13.7292 13.3224 13.8954 13.4813 13.9749C13.6403 14.0543 13.7323 14.042 13.824 13.9353C13.9184 13.8313 14.2205 13.4744 14.3272 13.3155C14.4312 13.1566 14.5373 13.1841 14.6813 13.2363C14.8275 13.2886 15.6068 13.6725 15.7657 13.752C15.9246 13.8314 16.0288 13.8708 16.0688 13.9353C16.1099 14.002 16.1099 14.3193 15.9782 14.6895C15.8465 15.0591 15.1996 15.4165 14.9094 15.4415C14.6166 15.4687 14.3434 15.5731 13.0063 15.0467C11.3935 14.4115 10.3764 12.7597 10.2969 12.653C10.2175 12.549 9.65111 11.7942 9.65111 11.0155C9.65111 10.2342 10.0608 9.85151 10.2042 9.69258C10.3504 9.53364 10.5215 9.49466 10.6282 9.49466Z" fill="white"/>
</svg>
