<svg width="25" height="24" viewBox="0 0 25 24" fill="none" xmlns="http://www.w3.org/2000/svg">
<g clip-path="url(#clip0_182_469)">
<path d="M12.029 24.029C18.6645 24.029 24.0435 18.6499 24.0435 12.0145C24.0435 5.37908 18.6645 0 12.029 0C5.39361 0 0.0145264 5.37908 0.0145264 12.0145C0.0145264 18.6499 5.39361 24.029 12.029 24.029Z" fill="#303030"/>
<path d="M15.0763 5.42578H9.24317C7.26977 5.42578 5.64462 7.02191 5.64462 9.02433V14.8575C5.64462 16.8309 7.24075 18.456 9.24317 18.456H15.0763C17.0497 18.456 18.6749 16.8599 18.6749 14.8575V9.02433C18.6749 7.02191 17.0787 5.42578 15.0763 5.42578ZM17.6301 14.8575C17.6301 16.2795 16.4983 17.4113 15.0763 17.4113H9.27219C7.85018 17.4113 6.71838 16.2795 6.71838 14.8575V9.05335C6.71838 7.63134 7.85018 6.49954 9.27219 6.49954H15.0763C16.4983 6.49954 17.6301 7.63134 17.6301 9.05335V14.8575Z" fill="#F47E2F"/>
<path d="M12.1744 8.50195C10.2881 8.50195 8.75001 10.04 8.75001 11.9264C8.72099 13.8417 10.2591 15.3798 12.1744 15.3798C14.0608 15.3798 15.5989 13.8417 15.5989 11.9554C15.5989 10.04 14.0608 8.50195 12.1744 8.50195ZM12.1744 14.161C10.9266 14.161 9.93985 13.1452 9.93985 11.9264C9.93985 10.6785 10.9556 9.6918 12.1744 9.6918C13.4223 9.6918 14.409 10.7075 14.409 11.9264C14.409 13.1743 13.3933 14.161 12.1744 14.161Z" fill="#F47E2F"/>
<path d="M16.4694 8.38707C16.4694 8.82238 16.1211 9.17063 15.6858 9.17063C15.2505 9.17063 14.9023 8.82238 14.9023 8.38707C14.9023 7.95176 15.2505 7.60352 15.6858 7.60352C16.1502 7.63254 16.4694 7.95176 16.4694 8.38707Z" fill="#F47E2F"/>
</g>
<defs>
<clipPath id="clip0_182_469">
<rect width="24" height="24" fill="white" transform="translate(0.0145264)"/>
</clipPath>
</defs>
</svg>
