<svg width="25" height="25" viewBox="0 0 25 25" fill="none" xmlns="http://www.w3.org/2000/svg">
<path d="M12.3347 24.3279C18.9701 24.3279 24.3492 18.9488 24.3492 12.3133C24.3492 5.67791 18.9701 0.298828 12.3347 0.298828C5.69927 0.298828 0.32019 5.67791 0.32019 12.3133C0.32019 18.9488 5.69927 24.3279 12.3347 24.3279Z" fill="#121212"/>
<path d="M18.3419 12.6323V16.8113H15.9332V12.9225C15.9332 11.9358 15.5849 11.2684 14.7143 11.2684C14.0468 11.2684 13.6405 11.7327 13.4664 12.168C13.4084 12.3131 13.3793 12.5453 13.3793 12.7484V16.8113H10.9706C10.9706 16.8113 10.9997 10.2236 10.9706 9.52713H13.3793V10.5719C13.3793 10.5719 13.3793 10.6009 13.3503 10.6009H13.3793V10.5719C13.6986 10.0785 14.279 9.38203 15.5559 9.38203C17.152 9.35301 18.3419 10.3977 18.3419 12.6323ZM7.16895 16.8113H9.60667V9.52713H7.19797V16.8113H7.16895ZM9.66471 7.06038C9.66471 7.75688 9.11332 8.30827 8.41683 8.30827C7.72034 8.30827 7.16895 7.75688 7.16895 7.06038C7.16895 6.36389 7.72034 5.8125 8.41683 5.8125C9.11332 5.8125 9.66471 6.36389 9.66471 7.06038Z" fill="white"/>
</svg>
